5G (tietoliikennejärjestelmät)
type: Tieteen termipankin käsite
type: Concept
definition: Uusimpia langattomia viestintästandardeja edustavat viidennen sukupolven tietoliikenneverkot mahdollistavat paljon nopeamman, erittäin luotettavan ja erittäin pienen viiveen mobiiliviestinnän.
in scheme: Tieteen termipankin CER-ontologia
preferred label: 5G in communication system @en
top concept of: Tieteen termipankin CER-ontologia

hajautettu tarvepohjainen verkko
type: Tieteen termipankin käsite
type: Concept
definition: Langattoman mobiiliverkon solmukohtien (tai reitittimien) muodostama tilapäinen, dynaamisesti muodostettu verkko, jolla ei ole keskitettyä hallintaa verkkoinfrastruktuurissa.
in scheme: Tieteen termipankin CER-ontologia
preferred label: ad hoc network @en
top concept of: Tieteen termipankin CER-ontologia

toimijapohjainen mallinnus
type: Tieteen termipankin käsite
type: Concept
definition: Tietokonemallinnus, jossa järjestelmän yksittäiset toimijat eli agentit ja niiden välinen vuorovaikutus määritellään. Toimijapohjainen malli iteroidaan aikavaiheittain ja toimijoiden ominaisuudet päivittyvät eri vaiheissa.
in scheme: Tieteen termipankin CER-ontologia
preferred label: agent based modeling @en
top concept of: Tieteen termipankin CER-ontologia

kokoaja
type: Tieteen termipankin käsite
type: Concept
definition: Toimija, usein yritys, joka yhdistää ja koordinoi useiden toimijoiden (esimerkiksi asiakkaiden) kysynnän tai tarjonnan.
in scheme: Tieteen termipankin CER-ontologia
preferred label: aggregator @en
top concept of: Tieteen termipankin CER-ontologia

albedo
type: Tieteen termipankin käsite
type: Concept
definition: Kappaleesta heijastuneen säteilyn suhde (%) saapuvaan säteilyyn.
in scheme: Tieteen termipankin CER-ontologia
top concept of: Tieteen termipankin CER-ontologia

algoritmi
type: Tieteen termipankin käsite
type: Concept
definition: (mat., tietotekn.) sarja täsmällisesti määriteltyjä käskyjä tai toimenpiteitä jonkin tehtävän suorittamiseksi
in scheme: Tieteen termipankin CER-ontologia
preferred label: algorithm @en
top concept of: Tieteen termipankin CER-ontologia

vaihtoehtoenergia
type: Tieteen termipankin käsite
type: Concept
definition: Energia joka ei kuluta luonnonvaroja loppuun eikä vaikuta ympäristöön haitallisesti. Tämä tapahtuu eritoten välttämällä fossiillisten polttoaineiden, myös ydinvoiman, käyttöä. Synonyymi: Uusiutuva energia.
in scheme: Tieteen termipankin CER-ontologia
preferred label: alternative energy @en
top concept of: Tieteen termipankin CER-ontologia

liitännäispalvelut
type: Tieteen termipankin käsite
type: Concept
definition: Oheis- eli liitännäispalvelut tukevat yhteenliitettyjen sähkönsiirtoverkkojen ja niiden osien luotettavaa toimintaa.
in scheme: Tieteen termipankin CER-ontologia
preferred label: Ancillary services @en
top concept of: Tieteen termipankin CER-ontologia

ilmakehän rajakerros
type: Tieteen termipankin käsite
type: Concept
definition: Troposfäärin alin, maanpintaan kosketuksessa oleva kerros.
in scheme: Tieteen termipankin CER-ontologia
preferred label: atmospheric boundary layer @en
top concept of: Tieteen termipankin CER-ontologia

ilmanpaine
type: Tieteen termipankin käsite
type: Concept
definition: Ilmakehän aiheuttama paine kaikilla Maan pinnoilla. Normaali ilmakehän paine on 1013 hektopascalia.
in scheme: Tieteen termipankin CER-ontologia
preferred label: atmospheric pressure @en
top concept of: Tieteen termipankin CER-ontologia

ilman lämpötila
type: Tieteen termipankin käsite
type: Concept
definition: Mitattu lämpötila Maan ilmakehän eri korkeuksissa. Lämpötilaan vaikuttavat monet tekijät kuten auringonsäteilyn määrä, ilmankosteus ja korkeus Maan pinnasta.
in scheme: Tieteen termipankin CER-ontologia
preferred label: atmospheric temperature @en
top concept of: Tieteen termipankin CER-ontologia

rintamasuunta (kulma)
type: Tieteen termipankin käsite
type: Concept
definition: Aurinkopaneelin suuntaus suhteessa ilmansuuntiin.
in scheme: Tieteen termipankin CER-ontologia
preferred label: azimuth angle @en
top concept of: Tieteen termipankin CER-ontologia

säätösähkö
type: Tieteen termipankin käsite
type: Concept
alternative label: balancing reserves @en
alternative label: reservivoima
in scheme: Tieteen termipankin CER-ontologia
preferred label: balancing power @en
top concept of: Tieteen termipankin CER-ontologia

tukiasema
type: Tieteen termipankin käsite
type: Concept
definition: Kiinteästi asennettu laite joka lähettää ja vastaanottaa radiosignaaleja mobiililaitteista.
in scheme: Tieteen termipankin CER-ontologia
preferred label: base-station @en
top concept of: Tieteen termipankin CER-ontologia

sähkökatko
type: Tieteen termipankin käsite
type: Concept
definition: Sähkövirran täydellinen katkeaminen, joka johtuu äkillisestä ja odottamattomasta viasta sähköjärjestelmässä.
in scheme: Tieteen termipankin CER-ontologia
preferred label: black-out @en
top concept of: Tieteen termipankin CER-ontologia

rajakerros
type: Tieteen termipankin käsite
type: Concept
in scheme: Tieteen termipankin CER-ontologia
preferred label: boundary layer @en
top concept of: Tieteen termipankin CER-ontologia

välimuistiyhteistyö
type: Tieteen termipankin käsite
type: Concept
definition: Useat tietoverkon tietokoneet ja palvelimet jakavat ja hallinnoivat välimuistitietoja vähentääkseen verkkoliikenteen kustannuksia ja hyödyntääkseen kokonaisvälimuistikapasiteettia.
in scheme: Tieteen termipankin CER-ontologia
preferred label: cache cooperation @en
top concept of: Tieteen termipankin CER-ontologia

välimuistiverkko
type: Tieteen termipankin käsite
type: Concept
definition: Tietoverkko, joka yhdistää välimuistipalvelimia ja mahdollistaa välimuistitiedon jakamisen.
in scheme: Tieteen termipankin CER-ontologia
preferred label: cache network @en
top concept of: Tieteen termipankin CER-ontologia

kapasiteetti-investoinnit
type: Tieteen termipankin käsite
type: Concept
definition: Tuotantokyvyn kasvattamiseen käytetyt varat.
in scheme: Tieteen termipankin CER-ontologia
preferred label: capacity investments @en
top concept of: Tieteen termipankin CER-ontologia

hiilidioksidi
type: Tieteen termipankin käsite
type: Concept
definition: Väritön ja hajuton kaasu, jota vapautuu ilmakehään orgaanisen aineen palamisen tuloksena, ja jota kasvit käyttävät fotosynteesiin.
in scheme: Tieteen termipankin CER-ontologia
preferred label: carbon dioxide @en
top concept of: Tieteen termipankin CER-ontologia

hiilipäästöt
type: Tieteen termipankin käsite
type: Concept
definition: Ilmakehään vapautuvat, ihmisten tuottamat hiilipäästöt.
in scheme: Tieteen termipankin CER-ontologia
preferred label: carbon emissions @en
top concept of: Tieteen termipankin CER-ontologia

paloittelu
type: Tieteen termipankin käsite
type: Concept
definition: Pilkkomista pienempiin osiin.
in scheme: Tieteen termipankin CER-ontologia
preferred label: chunking @en
top concept of: Tieteen termipankin CER-ontologia

ilmastoennuste
type: Tieteen termipankin käsite
type: Concept
definition: Ilmaston ennuste tietylle alueelle jonkin tulevan ajanjakson aikana. Käytetään myös termiä ilmaston muutosennuste.
in scheme: Tieteen termipankin CER-ontologia
preferred label: climate prediction @en
top concept of: Tieteen termipankin CER-ontologia

klimatologia
type: Tieteen termipankin käsite
type: Concept
definition: Ilmastoa ja sen vaihtelua tutkiva tiede.
in scheme: Tieteen termipankin CER-ontologia
preferred label: climatology @en
top concept of: Tieteen termipankin CER-ontologia

pilvi
type: Tieteen termipankin käsite
type: Concept
definition: Pisaroiksi tai jääkiteiksi tiivistynyttä vesihöyryä.
in scheme: Tieteen termipankin CER-ontologia
preferred label: cloud @en
top concept of: Tieteen termipankin CER-ontologia

rannikkoalue
type: Tieteen termipankin käsite
type: Concept
definition: Rantaviivan molemminpuolinen, muutaman kilometrin leveä alue, jossa esiintyy paikallisia ilmavirtauksia, esimerkiksi meri- ja maatuulia.
in scheme: Tieteen termipankin CER-ontologia
preferred label: coastal zone @en
top concept of: Tieteen termipankin CER-ontologia

kognitiivinen verkko
type: Tieteen termipankin käsite
type: Concept
definition: Verkko, joka pystyy havainnoimaan verkon tilaa, ja päättelemään, suunnittelemaan ja toimimaan havainnoimansa verkon tilan perustella, sekä oppimaan toimintansa seurauksista parantaakseen anneettujen tavoitteiden saavuttamista.
in scheme: Tieteen termipankin CER-ontologia
preferred label: cognitive network @en
top concept of: Tieteen termipankin CER-ontologia

kilpailu
type: Tieteen termipankin käsite
type: Concept
definition: Yleisesti: tilanne, jossa osanottajat pyrkivät saavuttamaan parhaan mahdollisen tuloksen tarkoin määrätyssä toiminnassa. Taloustiede: taistelu markkinaosuuksista ja voitosta kilpailijoita vastaan.
in scheme: Tieteen termipankin CER-ontologia
preferred label: competition @en
top concept of: Tieteen termipankin CER-ontologia

kompleksinen verkko
type: Tieteen termipankin käsite
type: Concept
definition: Monimutkaisen järjestelmän esittäminen verkostona, jossa solmukohdat kuvaavat yksittäisiä olioita, ja yhteydet vuorovaikutusta näiden olioiden välillä.
in scheme: Tieteen termipankin CER-ontologia
preferred label: complex network @en
top concept of: Tieteen termipankin CER-ontologia

kompleksinen järjestelmä
type: Tieteen termipankin käsite
type: Concept
alternative label: monimutkainen järjestelmä
definition: Itsenäisistä, keskenään vuorovaikutuksessa olevista osista koostuva järjestelmä, joka palautesilmukoiden kautta tuottaa orastavaa (emergenttiä) käyttäytymistä.
in scheme: Tieteen termipankin CER-ontologia
preferred label: complex system @en
top concept of: Tieteen termipankin CER-ontologia

kompleksisuus
type: Tieteen termipankin käsite
type: Concept
alternative label: monimutkaisuus
definition: Kompleksisuus kuvaa tilaa, joka ei ole täysin deterministinen, mutta ei myöskään täysin satunnainen. Kompleksisuus ilmenee järjestelmän dynaamisuuden ja eri osien välisen vuorovaikutuksen seurauksena, ja sitä luonnehtii kyky muuttua ja sopeutua järjestelmä sisäisiin ja ulkoisiin tekijöihin. Termiä käytetään useilla tieteenaloilla teoreettisesta fysiikasta yhteiskuntatieteisiin ja ekologiaan. Kompleksisuutta tutkitaan esimerkiksi toimijapohjaisten mallien avulla.
in scheme: Tieteen termipankin CER-ontologia
preferred label: complexity @en
top concept of: Tieteen termipankin CER-ontologia

laskennallinen vaativuus
type: Tieteen termipankin käsite
type: Concept
definition: (tietotekniikka) Algoritmin suorittamiseen tarvittavat resurssit.
in scheme: Tieteen termipankin CER-ontologia
preferred label: computational complexity @en
top concept of: Tieteen termipankin CER-ontologia

ihmiskäsitys
type: Tieteen termipankin käsite
type: Concept
definition: Käsitys siitä mitä ihmisyys on.
in scheme: Tieteen termipankin CER-ontologia
preferred label: concept of human being @en
top concept of: Tieteen termipankin CER-ontologia

kulutustieto
type: Tieteen termipankin käsite
type: Concept
definition: Tietoja ja tilastoja resurssien, hyödykkeiden tai palveluiden käytöstä.
in scheme: Tieteen termipankin CER-ontologia
preferred label: consumption data @en
top concept of: Tieteen termipankin CER-ontologia

sisältökeskeinen verkko
type: Tieteen termipankin käsite
type: Concept
definition: Tietoliikenneverkko jossa sisältöä voidaan suoraan reitittää ja linkittää, ja tieto tunnistetaan sisällön nimen, ei IP-osoitteen perusteella. Tietokeskeisten verkkojen erityistapaus, brändi, joka alkaa yleistyä yleiskäsitteenä.
in scheme: Tieteen termipankin CER-ontologia
preferred label: content-centric network @en
top concept of: Tieteen termipankin CER-ontologia

sisällönjako
type: Tieteen termipankin käsite
type: Concept
definition: Sisällön levittäminen suurelle asiakasjoukolle.
in scheme: Tieteen termipankin CER-ontologia
preferred label: content distribution @en
top concept of: Tieteen termipankin CER-ontologia

sisällönjakoverkko
type: Tieteen termipankin käsite
type: Concept
definition: Verkkojärjestelmä, jolla voidaan tehokkaasti jakaa (webin) sisältöä suurelle joukolle käyttäjiä.
in scheme: Tieteen termipankin CER-ontologia
preferred label: content distribution network @en
top concept of: Tieteen termipankin CER-ontologia

Kustannus-hyötyanalyysi
type: Tieteen termipankin käsite
type: Concept
definition: Menetelmä päätöksenalaisen asian kustannusten ja hyötyjen systemaattiseen arviointiin
in scheme: Tieteen termipankin CER-ontologia
preferred label: Cost-benefit analysis @en
top concept of: Tieteen termipankin CER-ontologia

kustannustehokkuus
type: Tieteen termipankin käsite
type: Concept
definition: Maksimaalinen tuotos käytettyihin resursseihin nähden.
in scheme: Tieteen termipankin CER-ontologia
preferred label: cost efficiency @en
top concept of: Tieteen termipankin CER-ontologia

kriittinen ajattelu
type: Tieteen termipankin käsite
type: Concept
definition: Aiempia ennakkokäsityksiä kyseenalaistava ajattelu.
in scheme: Tieteen termipankin CER-ontologia
preferred label: critical thinking @en
top concept of: Tieteen termipankin CER-ontologia

kyberfysikaalinen järjestelmä
type: Tieteen termipankin käsite
type: Concept
definition: Tietotekniikan ja fyysisten prosessien yhdistelmä.
in scheme: Tieteen termipankin CER-ontologia
preferred label: cyber-physical system @en
top concept of: Tieteen termipankin CER-ontologia

kyberturvallisuus
type: Tieteen termipankin käsite
type: Concept
definition: Tietoverkoissa tapahtuvalta kyberrikollisuudelta suojautuminen ja siihen tehdyt toimenpiteet.
in scheme: Tieteen termipankin CER-ontologia
preferred label: cyber security @en
top concept of: Tieteen termipankin CER-ontologia

data-assimilaatio
type: Tieteen termipankin käsite
type: Concept
definition: Monenlaisen (havainto)tiedon yhdistäminen yhdeksi ja yhdenmukaiseksi fyysisen järjestelmän, kuten ilmakehän, kuvaukseksi. Tieto voi olla kerätty eri paikoissa, eri aikoina ja eri erilaisilla ajanjaksoilla.
in scheme: Tieteen termipankin CER-ontologia
preferred label: data assimilation @en
top concept of: Tieteen termipankin CER-ontologia

kysyntävaste
type: Tieteen termipankin käsite
type: Concept
alternative label: kysyntäjousto
alternative label: sähkön kysynnän jousto
definition: Sähkön kuluttajien reagoiminen sähkönhinnan ja –saatavuuden vaihteluun muuttamalla kulutuskäyttäytymistään.
in scheme: Tieteen termipankin CER-ontologia
preferred label: demand response @en
top concept of: Tieteen termipankin CER-ontologia

hajasäteily
type: Tieteen termipankin käsite
type: Concept
broader: auringonsäteily
definition: Yleensä vaakatasoiselle pinnalle osuva, ilmakehästä siroutuva säteily, joka tule yllä olevan ilmakehän kerroksen kaikista suunnista (poislukien suora säteily).
in scheme: Tieteen termipankin CER-ontologia
preferred label: diffuse radiation @en

hajautettu tietokonejärjestelmä
type: Tieteen termipankin käsite
type: Concept
definition: Järjestelmä, joka koostuu itsenäisistä, keskenään kommunikoivista ja toimintojaan koordinoivista osista.
in scheme: Tieteen termipankin CER-ontologia
preferred label: distributed computer system @en
top concept of: Tieteen termipankin CER-ontologia

hajautettu tuotanto
type: Tieteen termipankin käsite
type: Concept
definition: Sähkön tuottamista hajautetusti keskitetyn sähköntuotannon sijaan.
in scheme: Tieteen termipankin CER-ontologia
preferred label: distributed generation @en
top concept of: Tieteen termipankin CER-ontologia

jakelu
type: Tieteen termipankin käsite
type: Concept
definition: Sähköä siirretään kantaverkosta ja voimalaitoksista jakeluverkkoa pitkin sähkön käyttäjille.
in scheme: Tieteen termipankin CER-ontologia
preferred label: distribution @en
top concept of: Tieteen termipankin CER-ontologia

vuorokausisykli
type: Tieteen termipankin käsite
type: Concept
definition: Vuorokausisykli tarkoittaa 24 tunnin ajanjaksona, yleensä joka päivä toistuvaa tapahtumakaavaa.
in scheme: Tieteen termipankin CER-ontologia
preferred label: diurnal cycle @en
top concept of: Tieteen termipankin CER-ontologia

doppler säätutka
type: Tieteen termipankin käsite
type: Concept
definition: Säätutka joka ilmaisee liikkuuko ilma (ja siten myös sää) tutkan suuntaan vai siitä pois päin.
in scheme: Tieteen termipankin CER-ontologia
preferred label: doppler radar @en
top concept of: Tieteen termipankin CER-ontologia

tehokkuussäästöt
type: Tieteen termipankin käsite
type: Concept
definition: Tehokkuuden lisäämisen seurauksena saadut (taloudelliset) säästöt.
in scheme: Tieteen termipankin CER-ontologia
preferred label: efficiency savings @en
top concept of: Tieteen termipankin CER-ontologia

sähköverkon analysointi
type: Tieteen termipankin käsite
type: Concept
definition: Sähköverkon osien toiminnan ja sähkön virtauksen selvittäminen sähköverkossa.
in scheme: Tieteen termipankin CER-ontologia
preferred label: electric network analysis @en
top concept of: Tieteen termipankin CER-ontologia

sähköverkon topologia
type: Tieteen termipankin käsite
type: Concept
definition: Teoreettinen malli sähköverkon osien järjestyksestä.
in scheme: Tieteen termipankin CER-ontologia
preferred label: electric network topology @en
top concept of: Tieteen termipankin CER-ontologia

sähköyhtiö
type: Tieteen termipankin käsite
type: Concept
definition: Yritys tai muu toimija joka osallistuu sähkömarkkinoihin tuottamalla ja /tai myymällä sähköä kuluttajille.
in scheme: Tieteen termipankin CER-ontologia
preferred label: electric utility @en
top concept of: Tieteen termipankin CER-ontologia

sähkö
type: Tieteen termipankin käsite
type: Concept
definition: 1. perustavanlaatuinen energiamuoto mikä koostuu vastakkaisesti varautuneista elektroneista ja protoneista, ja tuottaa valoa, lämpöä, magneettivoimaa ja kemiallisia muutoksia. 2. energian virta. 3. yleinen varausten lepo- ja liikeilmiö.
in scheme: Tieteen termipankin CER-ontologia
preferred label: electricity @en
top concept of: Tieteen termipankin CER-ontologia

sähkön kysyntä
type: Tieteen termipankin käsite
type: Concept
definition: Sähkön kulutuksen/käytön määrä.
in scheme: Tieteen termipankin CER-ontologia
preferred label: electricity demand @en
top concept of: Tieteen termipankin CER-ontologia

sähkön jakelu
type: Tieteen termipankin käsite
type: Concept
definition: matalajännitteisen sähkön siirto kuluttajille
in scheme: Tieteen termipankin CER-ontologia
preferred label: electricity distribution @en
top concept of: Tieteen termipankin CER-ontologia

sähkön jakeluteollisuus
type: Tieteen termipankin käsite
type: Concept
definition: valtion omistamat ja/tai yksityiset toimijat, jotka vastaavat sähkön toimituksesta sähkön tuottajalta kuluttajalle
in scheme: Tieteen termipankin CER-ontologia
preferred label: electricity distribution industry @en
top concept of: Tieteen termipankin CER-ontologia

sähkön tuotanto
type: Tieteen termipankin käsite
type: Concept
definition: Prosessi jossa muusta energiamuodosta tuotetaan sähköenergiaa.
in scheme: Tieteen termipankin CER-ontologia
preferred label: electricity generation @en
top concept of: Tieteen termipankin CER-ontologia

sähköteollisuus
type: Tieteen termipankin käsite
type: Concept
definition: Kaikki sähköalan toimijat, mukaan lukien sähkön tuottajat, siirtämisestä vastaavat, sekä sähköön liittyvien palvelujen tarjoajat.
in scheme: Tieteen termipankin CER-ontologia
preferred label: electricity industry @en
top concept of: Tieteen termipankin CER-ontologia

sähkön tarjonta
type: Tieteen termipankin käsite
type: Concept
definition: Käyttöä varten tuotettu sähkö. Tarjontaa voidaan tarkastella sähköntuottajan tai sähkön käyttäjän näkökulmasta.
in scheme: Tieteen termipankin CER-ontologia
preferred label: electricity supply @en
top concept of: Tieteen termipankin CER-ontologia

orastava käyttäytyminen
type: Tieteen termipankin käsite
type: Concept
definition: Kokonaisuus tuottaa toimintoja tai ominaisuuksia mitä ei voi johtaa sen osista.
in scheme: Tieteen termipankin CER-ontologia
preferred label: emerging behavior @en
top concept of: Tieteen termipankin CER-ontologia

päästökauppa
type: Tieteen termipankin käsite
type: Concept
definition: Päästöyksiköillä käytävää kansainvälistä kauppaa.
in scheme: Tieteen termipankin CER-ontologia
preferred label: emission permit trade @en
top concept of: Tieteen termipankin CER-ontologia

päästöoikeudet
type: Tieteen termipankin käsite
type: Concept
definition: Ympäristölupa haitallisten päästöjen laskemiseen ilmaan, vesiin tai maaperään. Yksi päästölupa vastaa yhtä tonnia hiilidioksidia.
in scheme: Tieteen termipankin CER-ontologia
preferred label: emission permits @en
top concept of: Tieteen termipankin CER-ontologia

energiakäyttäytyminen
type: Tieteen termipankin käsite
type: Concept
definition: kuluttajien energiankulutustavat ja teknologian käyttö
in scheme: Tieteen termipankin CER-ontologia
preferred label: energy behaviour @en
top concept of: Tieteen termipankin CER-ontologia

energiatehokkuus
type: Tieteen termipankin käsite
type: Concept
definition: Energian kulutuksen ja saadun hyödyn suhde.
in scheme: Tieteen termipankin CER-ontologia
preferred label: energy efficiency @en
top concept of: Tieteen termipankin CER-ontologia

energiapolitiikka
type: Tieteen termipankin käsite
type: Concept
definition: Energiapolitiikka on valtion energian käyttöä ja tuotantoa koskevaa päätöksentekoa ja päätösten toimeenpanoa. Lainsäädännöllä, verotuksella ja tuilla pyritään turvaamaan energian saantia ja ohjataan energian hallintaa, tuotantoa, jakelua ja kulututusta.
in scheme: Tieteen termipankin CER-ontologia
preferred label: energy policy @en
top concept of: Tieteen termipankin CER-ontologia

energiavarasto
type: Tieteen termipankin käsite
type: Concept
definition: Ylimääräisen energian kerääminen ja säilyttäminen tulevaa käyttöä varten.
in scheme: Tieteen termipankin CER-ontologia
preferred label: energy storage @en
top concept of: Tieteen termipankin CER-ontologia

entropia
type: Tieteen termipankin käsite
type: Concept
definition: Epäjärjestyksen määrä systeemissä.
in scheme: Tieteen termipankin CER-ontologia
preferred label: entropy @en
top concept of: Tieteen termipankin CER-ontologia

syöttötariffi
type: Tieteen termipankin käsite
type: Concept
definition: Sähkön yksikköhinta, jonka hyväksynnän saanut uusiutuvan energian tuottaja saa tietylle uusiutuvan energian resurssille laskettujen kustannusten mukaan.
in scheme: Tieteen termipankin CER-ontologia
preferred label: feed-in tariff @en
top concept of: Tieteen termipankin CER-ontologia

kiinteä hinta
type: Tieteen termipankin käsite
type: Concept
definition: Muuttumaton, pysyvä hinta.
in scheme: Tieteen termipankin CER-ontologia
preferred label: fixed price @en
top concept of: Tieteen termipankin CER-ontologia

ennusteen todentaminen
type: Tieteen termipankin käsite
type: Concept
definition: Mikä tahansa menetelmä todentaa ennustettu sää vertaamalla sitä ennustetun ajanjakson havainnoituun säähän.
in scheme: Tieteen termipankin CER-ontologia
preferred label: forecast verification @en
top concept of: Tieteen termipankin CER-ontologia

kokonaissäteily
type: Tieteen termipankin käsite
type: Concept
alternative label: globaali säteily
definition: Säteily (yleensä vaakatasossa olevalle pinnalle osuva), joka on sirottunut ilmakehässä, ja saapuu kaikista pallonpuoliskon suunnista (poislukien suora säteily).
in scheme: Tieteen termipankin CER-ontologia
preferred label: global radiation @en
top concept of: Tieteen termipankin CER-ontologia

ahne reititys
type: Tieteen termipankin käsite
type: Concept
definition: Tietoverkossa tiedon välitystapa, jossa verkon yksi osa lähettää datapaketin läheiselle, lähimpänä määränpäätä olevalle verkon tietokoneelle.
in scheme: Tieteen termipankin CER-ontologia
preferred label: greedy routing @en
top concept of: Tieteen termipankin CER-ontologia

hilapisteet
type: Tieteen termipankin käsite
type: Concept
definition: Joukko erillisiä pisteitä, joilla kuvataan ilmakehän rakenne. Hilapisteissä eri ilmakehän muuttujia voidaan analysoida tai ennustaa.
in scheme: Tieteen termipankin CER-ontologia
preferred label: grid points @en
top concept of: Tieteen termipankin CER-ontologia

puuskakerroin
type: Tieteen termipankin käsite
type: Concept
definition: Tuulen huippunopeuden (tietyn kestoinen) suhde keskimääräiseen tuulen nopeuteen (tietyn ajanjakson keskiarvo).
in scheme: Tieteen termipankin CER-ontologia
preferred label: gust factor @en
top concept of: Tieteen termipankin CER-ontologia

terveyskäyttäytyminen
type: Tieteen termipankin käsite
type: Concept
definition: Yksilön käyttäytyminen ja valinnat, jotka vaikuttavat hänen terveyteensä.
in scheme: Tieteen termipankin CER-ontologia
preferred label: health behaviour @en
top concept of: Tieteen termipankin CER-ontologia

terveystieto
type: Tieteen termipankin käsite
type: Concept
definition: Terveystieto kattaa informaation terveenä pysymiseksi, sairauksien ehkäisemiseksi ja hallitsemiseksi sekä muiden terveyttä ja terveydenhoitoa koskevien päätösten tekemiseksi.
in scheme: Tieteen termipankin CER-ontologia
preferred label: health information @en
top concept of: Tieteen termipankin CER-ontologia

lämmitysjärjestelmä
type: Tieteen termipankin käsite
type: Concept
in scheme: Tieteen termipankin CER-ontologia
preferred label: heating system @en
top concept of: Tieteen termipankin CER-ontologia

hermeneuttinen kehä
type: Tieteen termipankin käsite
type: Concept
definition: Katso Filosofia: hermeneuttinen kehä
in scheme: Tieteen termipankin CER-ontologia
preferred label: hermeneutic circle @en
top concept of: Tieteen termipankin CER-ontologia

heterogeenisyys
type: Tieteen termipankin käsite
type: Concept
definition: Epäyhtenäisyys, vaihtelevuus.
in scheme: Tieteen termipankin CER-ontologia
preferred label: heterogeneity @en
top concept of: Tieteen termipankin CER-ontologia

vaakasuuntainen erotuskyky
type: Tieteen termipankin käsite
type: Concept
definition: Vaakatasoinen etäisyys kahden vierekkäisen hilapisteen välillä tietyllä alalla.
in scheme: Tieteen termipankin CER-ontologia
preferred label: horizontal resolution @en
top concept of: Tieteen termipankin CER-ontologia

vesivoima
type: Tieteen termipankin käsite
type: Concept
broader: uusiutuvat energialähteet
definition: Veden virtausliikkeen voimasta turbiineilla tuotettu uusiutuva energialähde.
in scheme: Tieteen termipankin CER-ontologia
preferred label: hydroelectric power @en

verkkovälimuisti
type: Tieteen termipankin käsite
type: Concept
definition: Tietoverkon välimuistien hyödyntämistä tiedonsiirron nopeuttamiseksi.
in scheme: Tieteen termipankin CER-ontologia
preferred label: in-network caching @en
top concept of: Tieteen termipankin CER-ontologia

aineeton pääoma
type: Tieteen termipankin käsite
type: Concept
broader: tieto
definition: organisaation voimavara
in scheme: Tieteen termipankin CER-ontologia
preferred label: intellectual capital @en

vuorovaikutus
type: Tieteen termipankin käsite
type: Concept
definition: Kahden tai useamman olion välistä molemminpuolista keskustelua tai sanatonta viestintää.
in scheme: Tieteen termipankin CER-ontologia
preferred label: interaction @en
top concept of: Tieteen termipankin CER-ontologia

tieteidenvälinen tutkimus
type: Tieteen termipankin käsite
type: Concept
definition: Usean tieteenalan yhteinen tutkimus.
in scheme: Tieteen termipankin CER-ontologia
preferred label: interdisciplinary research @en
top concept of: Tieteen termipankin CER-ontologia

ihmisten väliset suhteet
type: Tieteen termipankin käsite
type: Concept
definition: Kahden tai useamman ihmisen välinen suhde.
in scheme: Tieteen termipankin CER-ontologia
preferred label: interpersonal relationship @en
top concept of: Tieteen termipankin CER-ontologia

tiedon luominen
type: Tieteen termipankin käsite
type: Concept
definition: Jatkuva vuorovaikutusprosessi, jossa vastaanotetaan uutta informaatiota, jota omaksutaan tiedoksi ja jonka tuloksena luodaan uutta tietoa.
in scheme: Tieteen termipankin CER-ontologia
preferred label: knowledge creation @en
top concept of: Tieteen termipankin CER-ontologia

tietoprosessi
type: Tieteen termipankin käsite
type: Concept
broader: tieto
definition: Sarja tietämiseen tähtääviä toimintoja.
in scheme: Tieteen termipankin CER-ontologia
preferred label: knowledge process @en

load
type: Tieteen termipankin käsite
type: Concept
alternative label: kuormitus,kuorma @en
definition: Sähköä käyttävä yksikkö, vastakohta tehon lähteelle
in scheme: Tieteen termipankin CER-ontologia
top concept of: Tieteen termipankin CER-ontologia

markkinoille pääsy
type: Tieteen termipankin käsite
type: Concept
definition: Mahdollisuus / kyky aloittaa tuotteiden ja palvelujen myynti uudella markkina-alueella.
in scheme: Tieteen termipankin CER-ontologia
preferred label: market access @en
top concept of: Tieteen termipankin CER-ontologia

markkinaehdot
type: Tieteen termipankin käsite
type: Concept
definition: Uuden markkinan piirteet ja olosuhteet, esimerkiksi kilpailutilanne ja markkinan kasvuaste.
in scheme: Tieteen termipankin CER-ontologia
preferred label: market conditions @en
top concept of: Tieteen termipankin CER-ontologia

mesoskaala
type: Tieteen termipankin käsite
type: Concept
is characteristics of: mesoskaalan meteorologia
is characteristics of: Clean Energy Research:mesoscale models
definition: Dimensions of an atmospheric layer which ranges from a few kilometres to some hundreds of kilometres horizontally..
in scheme: Tieteen termipankin CER-ontologia
preferred label: mesoscale @en
top concept of: Tieteen termipankin CER-ontologia

mesoskaalan ilmakehämalli
type: Tieteen termipankin käsite
type: Concept
has part of: mesoskaalan meteorologia
definition: Mesoskaalan ilmakehän ilmiöitä simuloiva malli.
in scheme: Tieteen termipankin CER-ontologia
preferred label: mesoscale model @en
top concept of: Tieteen termipankin CER-ontologia

pientuotanto
type: Tieteen termipankin käsite
type: Concept
definition: Sähkön tuotantoa pienessä mittakaavassa.
in scheme: Tieteen termipankin CER-ontologia
preferred label: micro-generation @en
top concept of: Tieteen termipankin CER-ontologia

mikroverkko
type: Tieteen termipankin käsite
type: Concept
broader: tehoverkko
definition: Hajautettuja energiantuotantolähteitä käyttävä ja niiden tuottamaa sähköä siirtävä sähkönjakelujärjestelmä, jota käytetään valvotulla, koordinoidulla tavalla joko kytkettynä päävirtaverkkoon tai siitä erillään.
in scheme: Tieteen termipankin CER-ontologia
preferred label: micro-grid @en

mobiilisisältö
type: Tieteen termipankin käsite
type: Concept
definition: Mobiililaitteilla käytettävä sisältö.
in scheme: Tieteen termipankin CER-ontologia
preferred label: mobile content @en
top concept of: Tieteen termipankin CER-ontologia

liikkuvuusmalli
type: Tieteen termipankin käsite
type: Concept
definition: Matemaattinen malli joka kuvaa käyttäjien liikkumista oikeassa maailmassa.
in scheme: Tieteen termipankin CER-ontologia
preferred label: mobility model @en
top concept of: Tieteen termipankin CER-ontologia

liikkuvuustuki
type: Tieteen termipankin käsite
type: Concept
definition: Mobiiliyhteyden ylläpitäminen mobiiliverkon ja mobiililaitteiden välillä laitteiden sijainnin muuttuessa.
in scheme: Tieteen termipankin CER-ontologia
preferred label: mobility support @en
top concept of: Tieteen termipankin CER-ontologia

verkkoanomalia
type: Tieteen termipankin käsite
type: Concept
definition: Poikkeama tietoverkon oletetusta toiminnasta.
in scheme: Tieteen termipankin CER-ontologia
preferred label: network anomaly @en
top concept of: Tieteen termipankin CER-ontologia

verkon koko
type: Tieteen termipankin käsite
type: Concept
definition: Verkon solmukohtien määrä ja/tai kapasiteetti.
in scheme: Tieteen termipankin CER-ontologia
preferred label: network size @en
top concept of: Tieteen termipankin CER-ontologia

verkon topologia
type: Tieteen termipankin käsite
type: Concept
definition: Malli tietoverkon osista ja niiden välisistä yhteyksistä.
in scheme: Tieteen termipankin CER-ontologia
preferred label: network topology @en
top concept of: Tieteen termipankin CER-ontologia

Uusiutumattomat energialähteet
type: Tieteen termipankin käsite
type: Concept
broader: energiaresurssit
definition: Energiavarat, jotka mitä ilmeisimmin kuluvat tulevaisuudessa loppuun eli fossiiliset energiamuodot: kivihiili, maakaasu ja öljy. Ydinvoimakin voidaan lukea uusiutumattomiin, jos sen raaka-aineena ajatellaan nykyisin käytettävää uraania.
in scheme: Tieteen termipankin CER-ontologia
preferred label: Non-renewable energy (re)sources @en

pohjoismainen sähkömarkkina
type: Tieteen termipankin käsite
type: Concept
broader: energiamarkkinat
definition: Pohjoismainen sähkömarkkina on ensimmäinen kansainvälinen sähkömarkkina-alue. Se muodostuu neljästä pohjoismaasta: Ruotsi, Suomi, Norja ja Tanska, sekä Viro, joka liittyi vuonna 2010.
in scheme: Tieteen termipankin CER-ontologia
preferred label: nordic power markets @en

ydinvoima
type: Tieteen termipankin käsite
type: Concept
definition: Ydinfissio- tai fuusioreaktiossa vapautuvasta lämpöenergiasta tuotettu sähkö.
in scheme: Tieteen termipankin CER-ontologia
preferred label: nuclear power @en
top concept of: Tieteen termipankin CER-ontologia

numeerinen mallintaminen
type: Tieteen termipankin käsite
type: Concept
definition: Numeerinen mallintaminen eli tietokonesimulointi on monimutkaisten ilmiöiden tutkimusta tietokoneavusteisen laskentamallin avulla.
in scheme: Tieteen termipankin CER-ontologia
preferred label: numerical modeling @en
top concept of: Tieteen termipankin CER-ontologia

numeerinen säänennustus
type: Tieteen termipankin käsite
type: Concept
definition: Globaali säämallinnus, jossa ratkaistaan koko ilmakehän kiertoliike. Rajoitetun alueen säämallinnus, jossa ratkaistaan ilmakehän käyttäytyminen rajallisella alueella ja paremmalla erotuskyvyllä kuin globaaleissa säämalleissa.
in scheme: Tieteen termipankin CER-ontologia
preferred label: numerical weather prediction @en
top concept of: Tieteen termipankin CER-ontologia

toimintakustannukset
type: Tieteen termipankin käsite
type: Concept
definition: Yrityksen perustoiminnan, kuten hallinnon ja ylläpidon kustannukset.
in scheme: Tieteen termipankin CER-ontologia
preferred label: operating costs @en
top concept of: Tieteen termipankin CER-ontologia

optimaalinen toisintamisstrategia
type: Tieteen termipankin käsite
type: Concept
definition: Valitun metriikan mukaan optimaalinen strategia luoda kopioita sisällöstä verkon solmuille.
in scheme: Tieteen termipankin CER-ontologia
preferred label: optimal replication strategy @en
top concept of: Tieteen termipankin CER-ontologia

päällysverkko
type: Tieteen termipankin käsite
type: Concept
definition: Jonkin toisen verkon päälle rakennettu verkko.
in scheme: Tieteen termipankin CER-ontologia
preferred label: overlay network @en
top concept of: Tieteen termipankin CER-ontologia

parametrisointimenetelmä
type: Tieteen termipankin käsite
type: Concept
definition: Fyysisten ominaisuuksien esittäminen dynaamisessa mallissa suhteessa yksinkertaistettuihin (ei todellisiin) parametreihin.
in scheme: Tieteen termipankin CER-ontologia
preferred label: Parameterization method @en
top concept of: Tieteen termipankin CER-ontologia

huippukysyntä
type: Tieteen termipankin käsite
type: Concept
definition: Maksimaalinen kysyntä tietyn ajanjakson sisällä.
in scheme: Tieteen termipankin CER-ontologia
preferred label: peak demand @en
top concept of: Tieteen termipankin CER-ontologia

vertaisverkko
type: Tieteen termipankin käsite
type: Concept
definition: Tietoverkko, jossa ei ole hierarkkista jakoa palvelimien ja työasemien välillä. Kaikki verkon solmut ovat tasavertaisia ja voivat jakaa omia resurssejaan muiden käyttöön.
in scheme: Tieteen termipankin CER-ontologia
preferred label: peer-to-peer network @en
top concept of: Tieteen termipankin CER-ontologia

suorituskykyanalyysi
type: Tieteen termipankin käsite
type: Concept
definition: Suorituskykyanalyysi mittaa tietojärjestelmän tai verkon toimintakapasiteettia ja toimivuutta.
in scheme: Tieteen termipankin CER-ontologia
preferred label: performance analysis @en
top concept of: Tieteen termipankin CER-ontologia

suorituskykymalli
type: Tieteen termipankin käsite
type: Concept
definition: Abstrakti malli järjestelmästä joka kuvaa käyttöasteen sekä suorituskyvyn välistä suhdetta.
in scheme: Tieteen termipankin CER-ontologia
preferred label: performance model @en
top concept of: Tieteen termipankin CER-ontologia

alustayhteistoiminnallisuus
type: Tieteen termipankin käsite
type: Concept
definition: Alustayhteistoiminnallisuus on yhteisomistuksessa oleva, demokraattisesti hallittu yritys, joka käyttää jotain tiettyä protokollaa, verkkosivustoa tai mobiilisovellusta mahdollistaakseen tavaroiden ja palveluiden myynnin.
in scheme: Tieteen termipankin CER-ontologia
preferred label: platform cooperativism @en
top concept of: Tieteen termipankin CER-ontologia

tehovuo
type: Tieteen termipankin käsite
type: Concept
alternative label: sähkövuo
definition: Energian kulku siirtoverkon kautta.
in scheme: Tieteen termipankin CER-ontologia
preferred label: power flow @en
top concept of: Tieteen termipankin CER-ontologia

tehojärjestelmä
type: Tieteen termipankin käsite
type: Concept
alternative label: sähköjärjestelmä
definition: (Sähkö)energian syöttämiseen, siirtoon ja käyttöön tarkoitettu (sähköisten) osien muodostama järjestelmä.
in scheme: Tieteen termipankin CER-ontologia
preferred label: power system @en
top concept of: Tieteen termipankin CER-ontologia

hintadynamiikka
type: Tieteen termipankin käsite
type: Concept
definition: hinnan muutokset ja siihen vaikuttaneet tekijät
in scheme: Tieteen termipankin CER-ontologia
preferred label: price dynamics @en
top concept of: Tieteen termipankin CER-ontologia

prosumer
type: Tieteen termipankin käsite
type: Concept
definition: henkilö, joka toimii sekä kuluttaa että tuottaa energiaa
in scheme: Tieteen termipankin CER-ontologia
top concept of: Tieteen termipankin CER-ontologia

osallistava tiedeviestintä
type: Tieteen termipankin käsite
type: Concept
definition: Tutkijoiden ja yleisön keskinäistä ja molemminpuolista vuorovaikutusta.
in scheme: Tieteen termipankin CER-ontologia
preferred label: public engagement with science @en
top concept of: Tieteen termipankin CER-ontologia

palvelunlaatu
type: Tieteen termipankin käsite
type: Concept
alternative label: quality of service @en
definition: (Sähkö)verkon yleinen suorituskyky, erityisesti verkon käyttäjien näkökulmasta.
in scheme: Tieteen termipankin CER-ontologia
preferred label: QoS @en
top concept of: Tieteen termipankin CER-ontologia

säätutkahavainnot
type: Tieteen termipankin käsite
type: Concept
definition: Säätutkan metereologisista havainnoista koodaama ja lähettämä raportti.
in scheme: Tieteen termipankin CER-ontologia
preferred label: radar observations @en
top concept of: Tieteen termipankin CER-ontologia

tutkasäteensuuntainen tuulikomponentti
type: Tieteen termipankin käsite
type: Concept
definition: Tutkan mittaussäteen sädevektorin suuntaisessa pisteessa oleva tuulen komponentti..
in scheme: Tieteen termipankin CER-ontologia
preferred label: Radar radial wind @en
top concept of: Tieteen termipankin CER-ontologia

säteilyn kulku
type: Tieteen termipankin käsite
type: Concept
definition: Säteilyn läpäisy sirottavan, absorboivan ja/tai heijastavan materiaalin läpi fysiikan ja matematiikan termeillä kuvattuna.
in scheme: Tieteen termipankin CER-ontologia
preferred label: radiative transfer @en
top concept of: Tieteen termipankin CER-ontologia

radioluotain
type: Tieteen termipankin käsite
type: Concept
broader: meteorologinen mittalaite
definition: Sääpalloon liitetty laite, joka noustessaan noin 30 000 metriin lähettää ilmanpainetta, -kosteutta, lämpötilaa ja tuulia koskevia mittaustietoja.
in scheme: Tieteen termipankin CER-ontologia
preferred label: radiosonde @en

reaaliaikainen hinnoittelu
type: Tieteen termipankin käsite
type: Concept
alternative label: real time pricing @en
in scheme: Tieteen termipankin CER-ontologia
preferred label: real time price @en
top concept of: Tieteen termipankin CER-ontologia

sääntely
type: Tieteen termipankin käsite
type: Concept
definition: Sääntely tarkoittaa vapaiden markkinoiden rajoittamista, yleensä kyse on yleisen edun kannalta merkittävistä asioista, kuten ympäristö ja sähkömarkkinat.
in scheme: Tieteen termipankin CER-ontologia
preferred label: regulation @en
top concept of: Tieteen termipankin CER-ontologia

uusiutuvan energian yhdistäminen
type: Tieteen termipankin käsite
type: Concept
definition: Sähköjärjestelmän uudelleenmuodostaminen niin, että siihen otetaan mukaan hajautetut ja epäsäännöllisesti energiaa tuottavat lähteet, esimerkiksi aurinko- ja tuulienergia.
in scheme: Tieteen termipankin CER-ontologia
preferred label: renewable energy integration @en
top concept of: Tieteen termipankin CER-ontologia

uusiutuvan energian ohjauskeinot
type: Tieteen termipankin käsite
type: Concept
in scheme: Tieteen termipankin CER-ontologia
preferred label: renewable energy policy instruments @en
top concept of: Tieteen termipankin CER-ontologia

jäännöskuormitus
type: Tieteen termipankin käsite
type: Concept
definition: Sähkön kysyntä miinus sähköntuotantoyksikköjen, joita ei voida operaattorin toimesta poistaa verkosta, sekä uusiutuvan energiatuotannon osuus.
in scheme: Tieteen termipankin CER-ontologia
preferred label: residual load @en
top concept of: Tieteen termipankin CER-ontologia

vikasietoisuus
type: Tieteen termipankin käsite
type: Concept
definition: Järjestelmän kyky toipua ja jatkaa toimintaa ympäristössä tapahtuneen muutoksen jälkeen.
in scheme: Tieteen termipankin CER-ontologia
preferred label: resilience @en
top concept of: Tieteen termipankin CER-ontologia

erotuskyky
type: Tieteen termipankin käsite
type: Concept
in scheme: Tieteen termipankin CER-ontologia
preferred label: resolution @en
top concept of: Tieteen termipankin CER-ontologia

toimintavarmuus
type: Tieteen termipankin käsite
type: Concept
definition: Tietokonejärjestelmän kyky toimia huolimatta viheellisestä suorituksesta tai virheistä datassa.
in scheme: Tieteen termipankin CER-ontologia
preferred label: robustness (control systems) @en
top concept of: Tieteen termipankin CER-ontologia

satelliitti
type: Tieteen termipankin käsite
type: Concept
definition: aurinkokunnan taivaankappaletta kiertävä toinen kappale.
in scheme: Tieteen termipankin CER-ontologia
preferred label: satellite @en
top concept of: Tieteen termipankin CER-ontologia

skaalautuva algoritmi
type: Tieteen termipankin käsite
type: Concept
definition: Algoritmi, joka toimii samalla tavalla käsiteltävän datan määrän tai monimutkaisuuden kasvaessa.
in scheme: Tieteen termipankin CER-ontologia
preferred label: scalable algorithm @en
top concept of: Tieteen termipankin CER-ontologia

merituuli
type: Tieteen termipankin käsite
type: Concept
definition: Mereltä mantereelle puhaltava rannikkotuuli, joka syntyy kylmän merenpinnan ja läheisen maan lämpötilaerosta.
in scheme: Tieteen termipankin CER-ontologia
preferred label: sea breeze @en
top concept of: Tieteen termipankin CER-ontologia

hakukone
type: Tieteen termipankin käsite
type: Concept
definition: Hakukone on Internetissä olevan tiedon etsimisen työväline.
in scheme: Tieteen termipankin CER-ontologia
preferred label: search engine @en
top concept of: Tieteen termipankin CER-ontologia

Huoltovarmuus/Toimitusvarmuus
type: Tieteen termipankin käsite
type: Concept
definition: Kuinka luotettavasti tuotteita tai palveluja on saatavissa. Tuotteen tai palvelun yleinen toimitusvarmuus, joka on relevantti etenkin yhteiskunnan toimivuuden kannalta tärkeiden toimintojen osalta poikkeustilanteissakin.
in scheme: Tieteen termipankin CER-ontologia
preferred label: Security of supply @en
top concept of: Tieteen termipankin CER-ontologia

anturiverkko
type: Tieteen termipankin käsite
type: Concept
definition: yhteen liitettyjen ja yhteistyössä ympäristöään havainnoivien ja ohjaavien antureiden (sensoreiden) verkko, joka mahdollistaa ihmisten, teknologian ja ympäröivän tilan välisen vuorovaikutuksen
in scheme: Tieteen termipankin CER-ontologia
preferred label: sensor network @en
top concept of: Tieteen termipankin CER-ontologia

palvelin
type: Tieteen termipankin käsite
type: Concept
definition: Tietokone, joka tarjoaa määriteltyjä palveluita verkon muille tietokoneille.
in scheme: Tieteen termipankin CER-ontologia
preferred label: server @en
top concept of: Tieteen termipankin CER-ontologia

lyhytaaltosäteily
type: Tieteen termipankin käsite
type: Concept
broader: auringonsäteily
definition: Meteorologiassa lyhytaaltosäteilyllä tarkoitetaan elektromagneettista säteilyä, jonka aallonpituus on <4.0 μm. Termillä erotetaan auringonsäteily (lyhytaaltosäteily) pitkäaaltoisesta lämpösäteilystä (aallonpituus > 4.0 μm).
in scheme: Tieteen termipankin CER-ontologia
preferred label: shortwave radiation @en

simulaatio
type: Tieteen termipankin käsite
type: Concept
definition: Malli tai menetelmä, jolla jäljennetään todellisen tilanteen tai ilmiön toiminta.
in scheme: Tieteen termipankin CER-ontologia
preferred label: simulation @en
top concept of: Tieteen termipankin CER-ontologia

älysähköverkko
type: Tieteen termipankin käsite
type: Concept
broader: tehoverkko
definition: Älysähköverkolla tarkoitetaan sähköverkkoa, joka tieto- ja viestintäteknologiaa hyödyntämällä voi havaita muutoksia sähkön tuotannossa ja käytössä, ja tarjota joustavaa sähkönsiirtoa.
in scheme: Tieteen termipankin CER-ontologia
preferred label: smart grid @en

älykoti
type: Tieteen termipankin käsite
type: Concept
alternative label: älytalo
definition: Koti, jossa on antureita, kodinkoneita ja laitteita yhdistävä, asukkaille heidän tarpeitansa vastaavia palvelua tarjoava tietoverkko. Tietoverkkoa laitteineen voidaan valvoa, käyttää tai ohjata etäältä.
in scheme: Tieteen termipankin CER-ontologia
preferred label: smart home @en
top concept of: Tieteen termipankin CER-ontologia

älymittari
type: Tieteen termipankin käsite
type: Concept
alternative label: etäluettava sähkömittari
alternative label: älykäs sähkömittari
definition: Sähköinen laite joka tallentaa ja välittää energian kulutustietoja ja vastaanottaa hallintaviestejä.
in scheme: Tieteen termipankin CER-ontologia
preferred label: smart meter @en
top concept of: Tieteen termipankin CER-ontologia

sosio-tekninen järjestelmä
type: Tieteen termipankin käsite
type: Concept
in scheme: Tieteen termipankin CER-ontologia
preferred label: social-technical system @en
top concept of: Tieteen termipankin CER-ontologia

aurinkotuotanto
type: Tieteen termipankin käsite
type: Concept
in scheme: Tieteen termipankin CER-ontologia
preferred label: solar generation @en
top concept of: Tieteen termipankin CER-ontologia

aurinkopaneeli
type: Tieteen termipankin käsite
type: Concept
broader: valosähköinen aurinkokennotekniikka
definition: Laite, jolla auringon säteily muunnetaan sähköenergiaksi valosähköisen ilmiön avulla.
in scheme: Tieteen termipankin CER-ontologia
preferred label: solar panel @en

spektrin jakaminen
type: Tieteen termipankin käsite
type: Concept
in scheme: Tieteen termipankin CER-ontologia
preferred label: spectrum sharing @en
top concept of: Tieteen termipankin CER-ontologia

stokastinen raja-analyysi
type: Tieteen termipankin käsite
type: Concept
definition: Taloudellisen mallintamisen menetelmä, jonka lähtökohtana stokastisia tuotannon raja malleja.
in scheme: Tieteen termipankin CER-ontologia
preferred label: stochastic frontier analysis @en
top concept of: Tieteen termipankin CER-ontologia

satunnaismalli
type: Tieteen termipankin käsite
type: Concept
in scheme: Tieteen termipankin CER-ontologia
preferred label: stochastic model @en
top concept of: Tieteen termipankin CER-ontologia

strateginen kumppanuus
type: Tieteen termipankin käsite
type: Concept
definition: Yhteistä toimintaa ja toimintoja yhteisesti jaettujen päämäärien saavuttamiseksi.
in scheme: Tieteen termipankin CER-ontologia
preferred label: strategic partnership @en
top concept of: Tieteen termipankin CER-ontologia

säteilyvuo pinnassa
type: Tieteen termipankin käsite
type: Concept
definition: Sähkömagneettisen säteilyenergian vuo pinta-ala ja aika-yksikköä kohti.
in scheme: Tieteen termipankin CER-ontologia
preferred label: surface radiative flux @en
top concept of: Tieteen termipankin CER-ontologia

kestävyyden tiede
type: Tieteen termipankin käsite
type: Concept
definition: Kestävän kehityksen mukaista muutosta ja sen tavoitteita tukevaa tutkimusta. Kestävän kehityksen tavoitteena on tyydyttää ihmisten perustarpeet säilyttäen samalla maan elämää tukevat järjestelmät.
in scheme: Tieteen termipankin CER-ontologia
preferred label: sustainability science @en
top concept of: Tieteen termipankin CER-ontologia

ajastus
type: Tieteen termipankin käsite
type: Concept
alternative label: synkronointi
definition: Kahden tai useamman järjestelmän elementin saattaminen sellaiseen tilaan että ne yhdenmukaistetaan jonkin asetetun mitan mukaan.
in scheme: Tieteen termipankin CER-ontologia
preferred label: synchronization @en
top concept of: Tieteen termipankin CER-ontologia

ajallinen erotuskyky
type: Tieteen termipankin käsite
type: Concept
in scheme: Tieteen termipankin CER-ontologia
preferred label: temporal resolution @en
top concept of: Tieteen termipankin CER-ontologia

kallistuskulma
type: Tieteen termipankin käsite
type: Concept
definition: Määrittää aurinkopaneelin kallistusasteen suhteessa vaakatasoon.
in scheme: Tieteen termipankin CER-ontologia
preferred label: tilt angle @en
top concept of: Tieteen termipankin CER-ontologia

topologia
type: Tieteen termipankin käsite
type: Concept
definition: Jonkin asian spatiaalinen muoto.
in scheme: Tieteen termipankin CER-ontologia
preferred label: topology @en
top concept of: Tieteen termipankin CER-ontologia

sähkön siirto
type: Tieteen termipankin käsite
type: Concept
definition: Sähköenergian siirto korkeajännitteisten kantaverkkojen kautta voimalaitoksista kulutuskeskuksiin jakelua varten.
in scheme: Tieteen termipankin CER-ontologia
preferred label: transmission @en
top concept of: Tieteen termipankin CER-ontologia

siirtohinta
type: Tieteen termipankin käsite
type: Concept
definition: Siirtopalvelun hinta muodostuu sähkön siirrosta, sähkön kulutuksen mittauksesta ja taseselvityksestä.
in scheme: Tieteen termipankin CER-ontologia
preferred label: transmission price @en
top concept of: Tieteen termipankin CER-ontologia

siirtojärjestelmä
type: Tieteen termipankin käsite
type: Concept
in scheme: Tieteen termipankin CER-ontologia
preferred label: transmission system @en
top concept of: Tieteen termipankin CER-ontologia

virtuaalivoimala
type: Tieteen termipankin käsite
type: Concept
alternative label: virtual power plant @en
alternative label: virtuaalinen (näennäinen) tuottaja
definition: Energianhallintajärjestelmä, joka kokoaa yhteen hajautetun sähköntuotannon ja kulutuksen.
in scheme: Tieteen termipankin CER-ontologia
preferred label: virtual utility @en
top concept of: Tieteen termipankin CER-ontologia

sään ennustaminen
type: Tieteen termipankin käsite
type: Concept
in scheme: Tieteen termipankin CER-ontologia
preferred label: weather forecasting @en
top concept of: Tieteen termipankin CER-ontologia

säätutka
type: Tieteen termipankin käsite
type: Concept
definition: Tutka jota käytetään sään tutkimuksessa.
in scheme: Tieteen termipankin CER-ontologia
preferred label: weather radar @en
top concept of: Tieteen termipankin CER-ontologia

www-pohjainen palvelu
type: Tieteen termipankin käsite
type: Concept
definition: Webin kautta käytettävä palvelu.
in scheme: Tieteen termipankin CER-ontologia
preferred label: web-based service @en
top concept of: Tieteen termipankin CER-ontologia

weibull-jakauma
type: Tieteen termipankin käsite
type: Concept
definition: Tilastollinen jakauma, jota käytetään usein tuulienergiasovelluksissa kuvaamaan tuulen nopeuden jakaumaa (nopeusluokkien frekvenssijakaumaa). Webull-jakauma on jatkuva todennäköisyysjakauma, joka tarvittaessa 'säätyy' symmetrialtaan vinoksi, on helppo käsittellä laskennallisesti, ja jonka parametrit (Weibullin tapauksessa a,b,c) on laskettavissa empiirisestä aineistosta.
in scheme: Tieteen termipankin CER-ontologia
preferred label: weibull distribution @en
top concept of: Tieteen termipankin CER-ontologia

hyvinvointi
type: Tieteen termipankin käsite
type: Concept
definition: Vauraus, varakkuus, rikkaus; hyvä terveydentila; hyvä, harmoninen olo.
in scheme: Tieteen termipankin CER-ontologia
preferred label: welfare @en
top concept of: Tieteen termipankin CER-ontologia

tuuliatlas
type: Tieteen termipankin käsite
type: Concept
in scheme: Tieteen termipankin CER-ontologia
preferred label: wind atlas @en
top concept of: Tieteen termipankin CER-ontologia

tuuli-ilmasto
type: Tieteen termipankin käsite
type: Concept
in scheme: Tieteen termipankin CER-ontologia
preferred label: wind climate @en
top concept of: Tieteen termipankin CER-ontologia

tuuliaineisto
type: Tieteen termipankin käsite
type: Concept
definition: Mittausaineisto tuulen ominaisuuksista (nopeus, suunta, variaatio) tietyn ajanjakson aikana.
in scheme: Tieteen termipankin CER-ontologia
preferred label: wind data @en
top concept of: Tieteen termipankin CER-ontologia

tuulen suunta
type: Tieteen termipankin käsite
type: Concept
in scheme: Tieteen termipankin CER-ontologia
preferred label: wind direction @en
top concept of: Tieteen termipankin CER-ontologia

tuulikartta
type: Tieteen termipankin käsite
type: Concept
alternative label: tuulikenttä
definition: Kolmiulotteinen tilakuvio joka näyttää tuulet tietyssä paikassa ja tiettynä ajankohtana.
in scheme: Tieteen termipankin CER-ontologia
preferred label: wind field @en
top concept of: Tieteen termipankin CER-ontologia

tuuliennuste
type: Tieteen termipankin käsite
type: Concept
definition: Säähavaintoihin ja säämalleihin perustuva arvio tuulen suunnasta ja voimakkuudesta lähiajalle tai useita vuorokausia eteenpäin.
in scheme: Tieteen termipankin CER-ontologia
preferred label: wind forecasts @en
top concept of: Tieteen termipankin CER-ontologia

tuulituotanto
type: Tieteen termipankin käsite
type: Concept
in scheme: Tieteen termipankin CER-ontologia
preferred label: wind generation @en
top concept of: Tieteen termipankin CER-ontologia

tuulenpuuska
type: Tieteen termipankin käsite
type: Concept
broader: pinnanläheinen suihkuvirtaus
definition: Äkillinen lyhytaikainen tuulen nopeuden voimistuminen.
in scheme: Tieteen termipankin CER-ontologia
preferred label: wind gust @en

tuulienergian resurssikartoitus
type: Tieteen termipankin käsite
type: Concept
definition: Tuuliolosuhteiden kartoitus tuulivoimatuotannon kannalta.
in scheme: Tieteen termipankin CER-ontologia
preferred label: wind resource mapping @en
top concept of: Tieteen termipankin CER-ontologia

tuulen nopeus
type: Tieteen termipankin käsite
type: Concept
definition: Keskimääräinen nopeus, jolla tuuli puhaltaa tietyssä paikassa.
in scheme: Tieteen termipankin CER-ontologia
preferred label: wind speed @en
top concept of: Tieteen termipankin CER-ontologia

tietoliikennekanava
type: Tieteen termipankin käsite
type: Concept
has part of: tietoliikenneverkko
has part of: tietoliikennejärjestelmä
definition: Väylä sähköisten tai sähkömagneettisten signaalien välittämiseen.
in scheme: Tieteen termipankin CER-ontologia
preferred label: communication channel @en
top concept of: Tieteen termipankin CER-ontologia

tietoliikennejärjestelmä
type: Tieteen termipankin käsite
type: Concept
is part of: tietoliikennekanava
is part of: tietoliikenneverkko
definition: Yhteenliitettyjen ja yhdessä toimivien laitteiden tai muiden komponenttien, kuten tietoliikenneverkkojen, siirtoverkkojen, välitysasemien ja päätelaitteiden kokonaisuus.
in scheme: Tieteen termipankin CER-ontologia
preferred label: communications system @en
top concept of: Tieteen termipankin CER-ontologia

suora normaalisäteily
type: Tieteen termipankin käsite
type: Concept
broader: suora säteily
broader: auringonsäteily
definition: aurinkoon nähden kohtisuoralle pinnalle saapuva suora säteily
in scheme: Tieteen termipankin CER-ontologia
preferred label: direct normal irradiance @en

suora säteily
type: Tieteen termipankin käsite
type: Concept
broader: auringonsäteily
definition: Auringon suora säteily
in scheme: Tieteen termipankin CER-ontologia
narrower: suora normaalisäteily
preferred label: direct radiation @en

energiamarkkinat
type: Tieteen termipankin käsite
type: Concept
is part of: sähkön hinnat
definition: energian ostamiseen ja myyntiin keskittynyt hyödykemarkkina, jonka keskeinen osa on sähköllä käytävä kauppa
in scheme: Tieteen termipankin CER-ontologia
narrower: pohjoismainen sähkömarkkina
preferred label: energy markets @en
top concept of: Tieteen termipankin CER-ontologia

energiasää
type: Tieteen termipankin käsite
type: Concept
broader: energiasääennuste
definition: Energiatuotantoon, kuten aurinko- ja tuulivoimaan, vaikuttuvat sääolot.
in scheme: Tieteen termipankin CER-ontologia
narrower: energiasääennuste
preferred label: energy weather @en

energiasääennuste
type: Tieteen termipankin käsite
type: Concept
broader: energiasää
definition: sääennusteeseen perustuva aurinko- ja tuulivoimaennuste, joka kertoo auringonpaisteen ja tuulen kilowattitunneiksi muunnettuina esimerkiksi seuraavan 24 tunnin aikana
in scheme: Tieteen termipankin CER-ontologia
narrower: energiasää
preferred label: energy weather forecast @en

tietokeskeinen verkko
type: Tieteen termipankin käsite
type: Concept
definition: Sisällön jakamiseen rakennettu tietoverkko.
in scheme: Tieteen termipankin CER-ontologia
narrower: Clean Energy Research:content-centric networks
preferred label: information centric network @en
top concept of: Tieteen termipankin CER-ontologia

meteorologinen mittalaite
type: Tieteen termipankin käsite
type: Concept
definition: laitteet, joita käytetään ilmakehän tilan havainnointiin ja analysointiin, tai prosessien suorittamiseen ilmakehässä tiettynä ajankohtana
in scheme: Tieteen termipankin CER-ontologia
narrower: radioluotain
preferred label: meteorological instrument @en
top concept of: Tieteen termipankin CER-ontologia

meteorologia
type: Tieteen termipankin käsite
type: Concept
definition: Ilmakehän ja siinä esiintyvien ilmiöiden tutkimus.
in scheme: Tieteen termipankin CER-ontologia
narrower: pinnanläheinen suihkuvirtaus
preferred label: meteorology @en
top concept of: Tieteen termipankin CER-ontologia

aurinkovoima
type: Tieteen termipankin käsite
type: Concept
broader: uusiutuvat energialähteet
broader: vaihteleva uusiutuva energia
definition: Sähköksi muutettua auringonvaloa.
in scheme: Tieteen termipankin CER-ontologia
preferred label: photo voltaic power @en

valosähköinen aurinkokennotekniikka
type: Tieteen termipankin käsite
type: Concept
definition: Aurinkokennotekniikka, jolla auringonvalo muunnetaan sähköksi valosähköisen ilmiön avulla.
in scheme: Tieteen termipankin CER-ontologia
narrower: aurinkopaneeli
preferred label: photovoltaics @en
top concept of: Tieteen termipankin CER-ontologia

aurinkoenergia
type: Tieteen termipankin käsite
type: Concept
broader: uusiutuvat energialähteet
broader: vaihteleva uusiutuva energia
definition: Electromagnetic energy transmitted from the sun (solar radiation), either directly using photovoltaics (PV), or indirectly using concentrated solar power.
in scheme: Tieteen termipankin CER-ontologia
preferred label: solar energy @en

tariffirakenne
type: Tieteen termipankin käsite
type: Concept
is characteristics of: sähkön hinnat
definition: Tariffirakenne näyttää miten kuluttajan maksama sähkönhinta muodostuu.
in scheme: Tieteen termipankin CER-ontologia
preferred label: tariff structure @en
top concept of: Tieteen termipankin CER-ontologia

tuuli
type: Tieteen termipankin käsite
type: Concept
definition: Horisontaalista ilmakehän liikettä, mikä aiheutuu ilmanpaineen paineen vaihteluista.
in scheme: Tieteen termipankin CER-ontologia
narrower: pinnanläheinen suihkuvirtaus
preferred label: wind @en
top concept of: Tieteen termipankin CER-ontologia

tuulivoiman tuotanto
type: Tieteen termipankin käsite
type: Concept
in scheme: Tieteen termipankin CER-ontologia
narrower: tuuliturbiini
preferred label: wind power production @en
top concept of: Tieteen termipankin CER-ontologia

tuuliturbiini
type: Tieteen termipankin käsite
type: Concept
broader: tuulivoima
broader: tuulivoiman tuotanto
definition: mekaaninen laite joka muuttaa tuulen energian sähköksi tai mekaaniseksi energiaksi
in scheme: Tieteen termipankin CER-ontologia
preferred label: wind turbine @en

tietoliikenneverkko
type: Tieteen termipankin käsite
type: Concept
definition: Joukko sähköisiä (pääte)laitteita yhdistettynä verkostoksi, joka mahdollistaa niiden välisen tiedonsiirron.
in scheme: Tieteen termipankin CER-ontologia
preferred label: communication network @en
top concept of: Tieteen termipankin CER-ontologia

sähkön hinnat
type: Tieteen termipankin käsite
type: Concept
is characteristics of: tariffirakenne
definition: sähkön kustannus ostajalle
in scheme: Tieteen termipankin CER-ontologia
preferred label: electricity prices @en
top concept of: Tieteen termipankin CER-ontologia

energiaresurssit
type: Tieteen termipankin käsite
type: Concept
definition: lähde, jota ihmiset voivat hyödyntää energiansaantiin
in scheme: Tieteen termipankin CER-ontologia
narrower: Uusiutumattomat energialähteet
narrower: uusiutuvat energialähteet
preferred label: energy resources @en
top concept of: Tieteen termipankin CER-ontologia

tieto
type: Tieteen termipankin käsite
type: Concept
definition: Perusteltu, tosi uskomus. Ymmärretty ja sisäistetty informaatio.
in scheme: Tieteen termipankin CER-ontologia
narrower: aineeton pääoma
narrower: tietoprosessi
preferred label: knowledge @en
top concept of: Tieteen termipankin CER-ontologia

pinnanläheinen suihkuvirtaus
type: Tieteen termipankin käsite
type: Concept
broader: meteorologia
broader: tuuli
definition: Ilmakehän alimmissa kerroksissa nopeasti liikkuva ilmakaistale.
in scheme: Tieteen termipankin CER-ontologia
narrower: tuulenpuuska
preferred label: low level jet @en

tehoverkko
type: Tieteen termipankin käsite
type: Concept
alternative label: sähköverkko
definition: Verkko, jota pitkin sähkö kulkee tuottajilta asiakkaille.
in scheme: Tieteen termipankin CER-ontologia
narrower: mikroverkko
narrower: älysähköverkko
preferred label: power grid @en
top concept of: Tieteen termipankin CER-ontologia

tuulivoima
type: Tieteen termipankin käsite
type: Concept
alternative label: wind energy @en
broader: uusiutuvat energialähteet
broader: vaihteleva uusiutuva energia
definition: Liikkuvan ilman tuottamaa energiaa, josta tuotetaan sähköä turbiinien avulla.
in scheme: Tieteen termipankin CER-ontologia
narrower: tuuliturbiini
preferred label: wind power @en

mesoskaalan meteorologia
type: Tieteen termipankin käsite
type: Concept
definition: Mesoskaalan sääilmiöiden tutkimus.
in scheme: Tieteen termipankin CER-ontologia
narrower: Clean Energy Research:mesoscale models
preferred label: mesoscale meteorology @en
top concept of: Tieteen termipankin CER-ontologia

vaihteleva uusiutuva energia
type: Tieteen termipankin käsite
type: Concept
broader: uusiutuvat energialähteet
definition: uusiutuvan energian lähde, josta saatavan energian määrä ei ole sen vaihtelevan luonteen vuoksi kontrolloitavissa.
in scheme: Tieteen termipankin CER-ontologia
narrower: aurinkovoima
narrower: aurinkoenergia
narrower: tuulivoima
preferred label: variable renewable energy @en

auringonsäteily
type: Tieteen termipankin käsite
type: Concept
definition: Auringon säteilemä sähkömagneettinen säteily.
in scheme: Tieteen termipankin CER-ontologia
narrower: hajasäteily
narrower: suora normaalisäteily
narrower: suora säteily
narrower: lyhytaaltosäteily
preferred label: solar radiation @en
top concept of: Tieteen termipankin CER-ontologia

uusiutuvat energialähteet
type: Tieteen termipankin käsite
type: Concept
broader: energiaresurssit
definition: Energiavarat, jotka käytöstä riippumatta tai ainakin kestävästi käytettynä uusiutuvat eivätkä vähene: esim. auringon säteilyenergia, tuulen liike-energia, mannerten vesien ja vuoroveden potentiaali- ja liike-energia sekä biomassan kemiallinen energia.
in scheme: Tieteen termipankin CER-ontologia
narrower: vesivoima
narrower: aurinkovoima
narrower: aurinkoenergia
narrower: vaihteleva uusiutuva energia
narrower: tuulivoima
preferred label: renewable energy (re)sources @en

Tieteen termipankin käsite
type: Class
comment: CER-käsite.
subclass of: Class
subclass of: Concept
note: CER-käsite.

Tieteen termipankin CER-ontologia
type: ConceptScheme
creator: BCDC Energy project @en
creator: National Library of Finland @en
creator: BCDC Energia -hankkeen toimituskunta
creator: Kansalliskirjasto
creator: Nationalbiblioteket i Finland @sv
description: The Clean Energy Research (CER) ontology includes concepts of low carbon energy research. CER ontology has been implemented by ontologizing the Terminology of Clean Energy in the Helsinki Term Bank for Arts and Sciences, the so-called CER terminology (http://tieteentermipankki.fi/wiki/Clean_Energy_Research). CER ontology is a pilot experiment on the ontologizing a terminology of the Term Bank. The multidisciplinary CER terminology is compiled from the key concepts used in the BCDC Energy research project in 2017-2018. BCDC Energia is a research consortium funded by the Academy of Finland's Strategic Research Council (STN) for 2015-2020. Research on the production and use of clean energy in the BCDC Energy project involves economics, meteorology, computer science, information studies and wireless communications. The concepts have been collected from consortium researchers' publications, and other key publications on clean energy research. There are 207 terms at the end of 2018. They are defined in Finnish and English. The editorial board of the BCDC Energy project is responsible for the content of CER terminology and ontology (http://www.bcdcenergia.fi/). @en
description: Puhtaan energian tutkimus (Clean Energy Research, CER) -ontologia sisältää vähähiilisen energian tutkimuksen käsitteitä. CER-ontologia on toteutettu ontologisoimalla Tieteen Termipankin Puhtaan energian termistö eli niin kutsuttu CER-termistö. CER-ontologia on pilottikokeilu Tieteen Termipankin termistöjen ontologisoimiseksi. Monitieteinen CER-termistö on koottu BCDC Energia -tutkimushankkeessa käytetyistä keskeisistä käsitteistä vuosina 2017-2018. BCDC Energia on Suomen Akatemian Strategisen tutkimuksen vastuualueen (STN) rahoittama konsortiohanke vuosille 2015-2020. BCDC Energian -hankkeen puhtaan energian tuotannon ja käytön tutkimuksessa ovat mukana taloustiede, ilmatiede, tietojenkäsittelytiede, informaatiotutkimus ja langaton viestintä. Käsitteet on kerätty konsortion tutkijoiden julkaisuista sekä muista keskeisistä puhtaan energian tutkimuksen julkaisuista. Vuoden 2018 lopussa termejä on 207. Ne on määritelty sekä suomeksi että englanniksi. BCDC Energia -hankkeen toimituskunta vastaa CER-terminologian ja -ontologian sisällöstä.
publisher: National Library of Finland @en
publisher: Kansalliskirjasto
publisher: Nationalbiblioteket i Finland @sv
title: Clean Energy Research ontology of The Bank of Finnish Terminology in Art and Sciences @en
language: eng
language: fin
license: http://creativecommons.org/licenses/by/3.0/
has top concept: 5G (tietoliikennejärjestelmät)
has top concept: hajautettu tarvepohjainen verkko
has top concept: toimijapohjainen mallinnus
has top concept: kokoaja
has top concept: albedo
has top concept: algoritmi
has top concept: vaihtoehtoenergia
has top concept: liitännäispalvelut
has top concept: ilmakehän rajakerros
has top concept: ilmanpaine
has top concept: ilman lämpötila
has top concept: rintamasuunta (kulma)
has top concept: säätösähkö
has top concept: tukiasema
has top concept: sähkökatko
has top concept: rajakerros
has top concept: välimuistiyhteistyö
has top concept: välimuistiverkko
has top concept: kapasiteetti-investoinnit
has top concept: hiilidioksidi
has top concept: hiilipäästöt
has top concept: paloittelu
has top concept: ilmastoennuste
has top concept: klimatologia
has top concept: pilvi
has top concept: rannikkoalue
has top concept: kognitiivinen verkko
has top concept: tietoliikennekanava
has top concept: tietoliikenneverkko
has top concept: tietoliikennejärjestelmä
has top concept: kilpailu
has top concept: kompleksinen verkko
has top concept: kompleksinen järjestelmä
has top concept: kompleksisuus
has top concept: laskennallinen vaativuus
has top concept: ihmiskäsitys
has top concept: kulutustieto
has top concept: sisältökeskeinen verkko
has top concept: sisällönjako
has top concept: sisällönjakoverkko
has top concept: Kustannus-hyötyanalyysi
has top concept: kustannustehokkuus
has top concept: kriittinen ajattelu
has top concept: kyberfysikaalinen järjestelmä
has top concept: kyberturvallisuus
has top concept: data-assimilaatio
has top concept: kysyntävaste
has top concept: hajautettu tietokonejärjestelmä
has top concept: hajautettu tuotanto
has top concept: jakelu
has top concept: vuorokausisykli
has top concept: doppler säätutka
has top concept: tehokkuussäästöt
has top concept: sähköverkon analysointi
has top concept: sähköverkon topologia
has top concept: sähköyhtiö
has top concept: sähkö
has top concept: sähkön kysyntä
has top concept: sähkön jakelu
has top concept: sähkön jakeluteollisuus
has top concept: sähkön tuotanto
has top concept: sähköteollisuus
has top concept: sähkön hinnat
has top concept: sähkön tarjonta