URN:NBN:fi:au:hklj:009
alternative label: Ensyklopedian historia (009)
alternative label: Encyklopedins historia (009) @sv

URN:NBN:fi:au:hklj:022.4081
alternative label: ISAN-järjestelmä (022.4081)
alternative label: ISCI-järjestelmä (022.4081)
alternative label: ISIL-järjestelmä (022.4081)
alternative label: ISNI-järjestelmä (022.4081)
alternative label: ISRC-järjestelmä (022.4081)
alternative label: ISTC-järjestelmä (022.4081)
alternative label: ISWC-järjestelmä (022.4081)
alternative label: ISAN-systemet (022.4081) @sv
alternative label: ISCI-systemet (022.4081) @sv
alternative label: ISIL-systemet (022.4081) @sv
alternative label: ISNI-systemet (022.4081) @sv
alternative label: ISRC-systemet (022.4081) @sv
alternative label: ISTC-systemet (022.4081) @sv
alternative label: ISWC-systemet (022.4081) @sv

URN:NBN:fi:au:hklj:025.52
alternative label: Laajennettu kirjastotoiminta, musiikkiesitykset (025.52)
alternative label: Utvidgad biblioteksverksamhet, musikframföranden (025.52) @sv

URN:NBN:fi:au:hklj:061.09
alternative label: Järjestöhistoriikit (061.09)
alternative label: Yhdistyshistoriikit (061.09)
alternative label: Organisationshistoriker (061.09) @sv

URN:NBN:fi:au:hklj:1.7
alternative label: Aarnikotkat, sadut (1.7)
alternative label: Antologiat, sadut (1.7)
alternative label: Eläinkertomukset, sadut (1.7)
alternative label: Eläinsadut, sadut (1.7)
alternative label: Faabelit, sadut (1.7)
alternative label: Feeniks-lintu, sadut (1.7)
alternative label: Feniks, sadut (1.7)
alternative label: Griipit, sadut (1.7)
alternative label: Haltiat, sadut (1.7)
alternative label: Haltijat, sadut (1.7)
alternative label: Ihmesadut, sadut (1.7)
alternative label: Jättiläiset, sadut (1.7)
alternative label: Kansansadut, sadut (1.7)
alternative label: Kansantarinat, sadut (1.7)
alternative label: Keijukaiset, sadut (1.7)
alternative label: Keijut, sadut (1.7)
alternative label: Kentaurit, sadut (1.7)
alternative label: Legendat, sadut (1.7)
alternative label: Lohikäärmeet, sadut (1.7)
alternative label: Novellisadut (1.7)
alternative label: Peikot, sadut (1.7)
alternative label: Pilasadut, sadut (1.7)
alternative label: Prinsessat, sadut (1.7)
alternative label: Prinssit, sadut (1.7)
alternative label: Pyhimystarinat, sadut (1.7)
alternative label: Sadut, lastenkirjallisuus (1.7)
alternative label: Satuelokuvat, näytelmäelokuvat (1.7)
alternative label: Satuhahmot, sadut (1.7)
alternative label: Satuolennot, sadut (1.7)
alternative label: Saturomaanit, kaunokirjallisuus, sadut (1.7)
alternative label: Taruolennot, sadut (1.7)
alternative label: Vedenhaltijat , sadut (1.7)
alternative label: Yksisarviset, sadut (1.7)
alternative label: Alfer, sagor (1.7) @sv
alternative label: Antologier, sagor (1.7) @sv
alternative label: Centaurer, sagor (1.7) @sv
alternative label: Djurberättelser, sagor (1.7) @sv
alternative label: Djursagor, sagor (1.7) @sv
alternative label: Drakar, sagoväsen, sagor (1.7) @sv
alternative label: Enhörningar, sagor (1.7) @sv
alternative label: Fabler, sagor (1.7) @sv
alternative label: Fenix, sagor (1.7) @sv
alternative label: Folksagor, sagor (1.7) @sv
alternative label: Folksägner, sagor (1.7) @sv
alternative label: Fågeln Fenix, sagor (1.7) @sv
alternative label: Gripar, aarnikotkat, sagor (1.7) @sv
alternative label: Gripar, griipit, sagor (1.7) @sv
alternative label: Helgonlegender, sagor (1.7) @sv
alternative label: Jättar, sagor (1.7) @sv
alternative label: Legender, sagor (1.7) @sv
alternative label: Novellsagor (1.7) @sv
alternative label: Prinsar, sagor (1.7) @sv
alternative label: Prinsessor, sagor (1.7) @sv
alternative label: Rådare, haltiat, sagor (1.7) @sv
alternative label: Rådare, haltijat, sagor (1.7) @sv
alternative label: Sagodjur, sagor (1.7) @sv
alternative label: Sagofilmer, spelfilmer (1.7) @sv
alternative label: Sagor, skönlitteratur, barnlitteratur (1.7) @sv
alternative label: Sagoromaner, skönlitteratur, sagor (1.7) @sv
alternative label: Sagoväsen, satuolennot, sagor (1.7) @sv
alternative label: Sagoväsen. taruolennot, sagor (1.7) @sv
alternative label: Skämtsagor, sagor (1.7) @sv
alternative label: Troll, sagor (1.7) @sv
alternative label: Undersagor, sagor (1.7) @sv
alternative label: Vattenandar, sagor (1.7) @sv
alternative label: Älvor, sagor (1.7) @sv

URN:NBN:fi:au:hklj:123.32
alternative label: Kaveruus, ihmissuhteiden psykologia (123.32)
alternative label: Kiitollisuus, ihmissuhteiden psykologia (123.32)

URN:NBN:fi:au:hklj:152.2
alternative label: Yleistäminen, tiede (152.2)
alternative label: Generalisering, vetenskap (152.2) @sv

URN:NBN:fi:au:hklj:180.081
alternative label: Koulutusluokitukset (180.081)
alternative label: Utbildningsklassificeringar (180.081) @sv

URN:NBN:fi:au:hklj:180.6
alternative label: Puolisisarukset, koti- ja perhekasvatus (180.6)
alternative label: Sisaret, koti- ja perhekasvatus (180.6)
alternative label: Sisarpuolet, koti- ja perhekasvatus (180.6)
alternative label: Sisarukset, koti- ja perhekasvatus (180.6)
alternative label: Sisaruus, koti- ja perhekasvatus (180.6)
alternative label: Siskot, koti- ja perhekasvatus (180.6)
alternative label: Velipuolet, koti- ja perhekasvatus (180.6)
alternative label: Veljet, koti- ja perhekasvatus (180.6)
alternative label: Bröder, hem- och familjefostran (180.6) @sv
alternative label: Halvbröder, hem- och familjefostran (180.6) @sv
alternative label: Halvsyskon, hem- och familjefostran (180.6) @sv
alternative label: Halvsystrar, hem- och familjefostran (180.6) @sv
alternative label: Styvbröder, hem- och familjefostran (180.6) @sv
alternative label: Styvsystrar, hem- och familjefostran (180.6) @sv
alternative label: Syskon, hem- och familjefostran (180.6) @sv
alternative label: Syskonskap, hem- och familjefostran (180.6) @sv
alternative label: Systrar, hem- och familjefostran (180.6) @sv

URN:NBN:fi:au:hklj:181.5
alternative label: IB (181.5)
alternative label: IB-tutkinto (181.5)
alternative label: IB-examen (181.5) @sv

URN:NBN:fi:au:hklj:181.85
alternative label: Utvecklingsstörda, skolor för utvecklingsstörda (181.85) @sv
alternative label: Utvecklingsstörda, undervisning av utvecklingsstörda (181.85) @sv

URN:NBN:fi:au:hklj:181.909
alternative label: Kasvatuslaitokset, historia (181.909)
alternative label: Uppfostringsanstalter, histria (181.909) @sv

URN:NBN:fi:au:hklj:183.09
alternative label: Koulumuseot (183.09)
alternative label: Skolmuseer (183.09) @sv

URN:NBN:fi:au:hklj:184.209
alternative label: Helsingin yliopisto, historia (184.209)
alternative label: Helsingfors universitet, historia (184.209) @sv

URN:NBN:fi:au:hklj:184.309
alternative label: Turun yliopisto, historia (184.309)

URN:NBN:fi:au:hklj:184.409
alternative label: Åbo Akademi, historia (184.409)

URN:NBN:fi:au:hklj:184.509
alternative label: Jyväskylän yliopisto, historia (184.509)
alternative label: Kasvatusopillinen korkeakoulu, historia (184.509)
alternative label: Jyväskylä universitet, historia (184.509) @sv
alternative label: Pedagogiska högskolan, historia (184.509) @sv

URN:NBN:fi:au:hklj:184.809
alternative label: Joensuun korkeakoulu, historia (184.809)
alternative label: Joensuun yliopisto, historia (184.809)
alternative label: Lapin korkeakoulu, historia (184.809)
alternative label: Joensuu högskola, historia (184.809) @sv
alternative label: Joensuu universitet, historia (184.809) @sv
alternative label: Lapplands högskola, historia (184.809) @sv

URN:NBN:fi:au:hklj:200.05
alternative label: Uskonnolliset lehdet, uskonnot (200.05)
alternative label: Religiösa tidningar, religionerna (200.05) @sv

URN:NBN:fi:au:hklj:204.109
alternative label: Veljeskunnat, teosofiset, historia (204.109)
alternative label: Brödraskap, teosofiska, historia (204.109) @sv

URN:NBN:fi:au:hklj:204.309
alternative label: Veljeskunnat, vapaamuurarit, historia (204.309)
alternative label: Brödraskap, frimurare, historia (204.309) @sv

URN:NBN:fi:au:hklj:250.09
alternative label: Lukkarintoimi, historia (250.09)
alternative label: Klockarbefattning, historia (250.09) @sv

URN:NBN:fi:au:hklj:254.09
alternative label: Seurakuntahistoriat, ev.-lut. kirkko (254.09)
alternative label: Församlingshistoriker, ev.luth. kyrkan (254.09) @sv

URN:NBN:fi:au:hklj:255.09
alternative label: Veljeskunnat, ev.-lut., historia (255.09)
alternative label: Brödraskap, ev.luth., historia (255.09) @sv

URN:NBN:fi:au:hklj:295
alternative label: Pluto, mytologia (295)
alternative label: Pluto, mytologi (295) @sv

URN:NBN:fi:au:hklj:300.1
alternative label: Visiot, teknologinen futurologia (300.1)
alternative label: Visioner, teknologisk futurologi (300.1) @sv

URN:NBN:fi:au:hklj:311.081
alternative label: Alueluokitukset, tilastostandardit (311.081)
alternative label: Ammattiluokitukset, tilastostandardit (311.081)
alternative label: Ammattinimikkeet, tilastostandardit (311.081)
alternative label: Ammattiryhmät, tilastostandardit (311.081)
alternative label: Luokitukset, tilastotiede (311.081)
alternative label: Tilastoluokitukset (311.081)
alternative label: Tilastostandardit (311.081)
alternative label: Toimialaluokitukset (311.081)
alternative label: Branschindelningar (311.081) @sv
alternative label: Klassificeringar, statistik (311.081) @sv
alternative label: Regionala indelningar, statistiska standarder (311.081) @sv
alternative label: Statistiska klassifikationer (311.081) @sv
alternative label: Statistiska standarder (311.081) @sv
alternative label: Yrkesbeteckningar, statistiska standarder (311.081) @sv
alternative label: Yrkesgrupper, statistiska standarder (311.081) @sv
alternative label: Yrkesklassificeringar, statistiska standarder (311.081) @sv

URN:NBN:fi:au:hklj:312.05
alternative label: Tilastolliset kausijulkaisut, väestötilastolliset (312.05)
alternative label: Statistiska periodika, befolkningsstatistiska (312.05) @sv

URN:NBN:fi:au:hklj:314.05
alternative label: Tilastolliset kausijulkaisut, kansainväliset (314.05)
alternative label: YK, tilastolliset vuosikirjat (314.05)
alternative label: Yhdistyneet Kansakunnat, tilastolliset vuosikirjat (314.05)
alternative label: FN, statistiska årsböcker (314.05) @sv
alternative label: Förenta Nationerna, statistiska årsböcker (314.05) @sv
alternative label: Statistiska periodika, internationella (314.05) @sv

URN:NBN:fi:au:hklj:315.05
alternative label: Tilastolliset kausijulkaisut, Suomen (315.05)
alternative label: Statistiska periodika, i Finland (315.05) @sv

URN:NBN:fi:au:hklj:316.05
alternative label: Tilastolliset kausijulkaisut, muiden maiden (316.05)
alternative label: Statistiska periodika, i övriga länder (316.05) @sv

URN:NBN:fi:au:hklj:322.2
alternative label: Kameraövervakning, lagstiftning (322.2) @sv

URN:NBN:fi:au:hklj:324.09
alternative label: Agitaattorit, puoluehistoriat, muut maat (324.09)
alternative label: Järjestöhistoriikit, puolueet, muut maat (324.09)
alternative label: Keskustapuolueet, muut maat, historia (324.09)
alternative label: Kommunistipuolueet, muut maat, historia (324.09)
alternative label: Kommunistiset puolueet, muut maat, historia (324.09)
alternative label: Kristillis-demokraattiset puolueet, muut maat, historia (324.09)
alternative label: Kristillisdemokraattiset puolueet, muut maat, historia (324.09)
alternative label: Poliittinen historia, puoluehistoriat, muut maat (324.09)
alternative label: Poliittiset puolueet, historia, muut maat (324.09)
alternative label: Porvarilliset puolueet, muut maat, historia (324.09)
alternative label: Puolueet, muut maat, historia (324.09)
alternative label: Sosiaalidemokraattiset puolueet, muut maat, historia (324.09)
alternative label: Sosialidemokraattiset puolueet, muut maat, historia (324.09)
alternative label: Sosialistiset puolueet, muut maat, historia (324.09)
alternative label: Työväenpuolueet, historia (324.09)
alternative label: Uskonnolliset puolueet , muut maat, historia (324.09)
alternative label: Uskontopuolueet , muut maat, historia (324.09)
alternative label: Vasemmistopuolueet, historia (324.09)
alternative label: Vihreä liike, historia (324.09)
alternative label: Agitatorer, partihistoriker, övriga länder (324.09) @sv
alternative label: Arbetarpartier, historia (324.09) @sv
alternative label: Borgerliga partier, övriga länder, historia (324.09) @sv
alternative label: Centerpartier, övriga länder, historia (324.09) @sv
alternative label: Gröna rörelsen, historia (324.09) @sv
alternative label: Kommunistiska partier, övriga länder, historia (324.09) @sv
alternative label: Kommunistpartier, övriga länder, historia (324.09) @sv
alternative label: Krist-demokratiska partier, övriga länder, historia (324.09) @sv
alternative label: Kristdemokratiska partier, övriga länder, historia (324.09) @sv
alternative label: Organisationshistoriker, partier, övriga länder (324.09) @sv
alternative label: Partier, övriga länder, historia (324.09) @sv
alternative label: Politisk historia, partihistoriker, övriga länder (324.09) @sv
alternative label: Politiska partier, historia, övriga länder (324.09) @sv
alternative label: Religiösa partier, övriga länder, historia (324.09) @sv
alternative label: Socialdemokratiska partier, övriga länder, historia (324.09) @sv
alternative label: Socialistiska partier, övriga länder, historia (324.09) @sv
alternative label: Vänsterpartier, historia (324.09) @sv

URN:NBN:fi:au:hklj:325.03
alternative label: Diplomaattiedustus, hakuteokset, muiden maiden edustajat Suomessa (325.03)
alternative label: Diplomatrepresentation, uppslagsverk, övriga länders representanter i Finland (325.03) @sv

URN:NBN:fi:au:hklj:325.09
alternative label: Agentit, tiedustelupalvelut, historia (325.09)
alternative label: Agentit, vakoilu, historia (325.09)
alternative label: CIA, historia (325.09)
alternative label: KGB, historia (325.09)
alternative label: Kaksoisagentit, tiedustelupalvelut, historia (325.09)
alternative label: Kaksoisagentit, vakoilu, historia (325.09)
alternative label: Kollaboraattorit, historia, muut maat (325.09 +)
alternative label: Maanalainen toiminta, vakoilu, historia (325.09)
alternative label: Maanpetos, vakoilu, historia, muut maat (325.09)
alternative label: Poliittinen vakoilu, historia (325.09)
alternative label: Sotilaalliset järjestöt, historia (325.09)
alternative label: Sotilasliitot, historia (325.09)
alternative label: Vakoilu, vakoilu, historia (325.09)
alternative label: Valtioliitot, valtioliitot, historia, muut maat (325.09)
alternative label: Valtiopetos, vakoilu, historia, muut maat (325.09)
alternative label: Valtiorikokset, vakoilu, historia, muut maat (325.09)
alternative label: Valtiosopimukset, valtiosopimukset, historia, muut maat (325.09)
alternative label: Valtiovierailut, historia, muut maat (325.09)
alternative label: Varsovan liitto, historia (325.09)
alternative label: Agenter, spionage, historia (325.09) @sv
alternative label: Agenter, underrättelsetjänster, historia (325.09) @sv
alternative label: Dubbelagenter, spionage, historia (325.09) @sv
alternative label: Dubbelagenter, underrättelsetjänster, historia (325.09) @sv
alternative label: Högförräderi, spionage, historia, övriga länder (325.09) @sv
alternative label: Kollaboratörer, historia, övriga länder (325.09 +) @sv
alternative label: Landsförräderi, spionage, historia, övriga länder (325.09) @sv
alternative label: Militärallianser, historia (325.09) @sv
alternative label: Militärorganisationer, historia (325.09) @sv
alternative label: Politiskt spionage, historia (325.09) @sv
alternative label: Spionage, spionage, historia (325.09) @sv
alternative label: Statsbesök, historia, övriga länder (325.09) @sv
alternative label: Statsförbrytelser, spionage, historia, övriga länder (325.09) @sv
alternative label: Statsförbund, statsförbund, historia, övriga länder (325.09) @sv
alternative label: Statsfördrag, underrättelsetjänster, historia, övriga länder (325.09) @sv
alternative label: Underjordisk verksamhet, spionage, historia (325.09) @sv
alternative label: Warszawapakten, historia (325.09) @sv

URN:NBN:fi:au:hklj:325.103
alternative label: Diplomaattiedustus, hakuteokset, Suomen edustajat muissa maissa (325.103)
alternative label: Diplomatrepresentation, uppslagsverk, Finlands representanter i övriga länder (325.103) @sv

URN:NBN:fi:au:hklj:325.109
alternative label: Agentit, vakoilu, historia, Suomi (325.109)
alternative label: Kaksoisagentit, vakoilu, historia, Suomi (325.109)
alternative label: Kollaboraattorit, historia, Suomi (325.109 +)
alternative label: Maanalainen toiminta, vakoilu, historia, Suomi (325.109)
alternative label: Maanpetos, vakoilu, historia, Suomi (325.109)
alternative label: Moskovan rauha, rauhansopimusten historia (325.109)
alternative label: Pariisin rauha, rauhansopimusten historia (325.109)
alternative label: Poliittinen vakoilu, historia, Suomi (325.109)
alternative label: Valtioliitot, valtioliitot, historia, Suomi (325.109)
alternative label: Valtiopetos, vakoilu, historia, Suomi (325.109)
alternative label: Valtiorikokset, vakoilu, historia Suomi (325.109)
alternative label: Valtiosopimukset, valtiosopimukset, historia, Suomi (325.109)
alternative label: Valtiovierailut, historia, Suomi (325.109)
alternative label: Vasemmistopuolueet, historia, Suomi (325.109)
alternative label: Vihreä liike, historia, Suomi (325.109)
alternative label: Agenter, spionage, historia, Finland (325.109) @sv
alternative label: Dubbelagenter, spionage, historia, Finland (325.109) @sv
alternative label: Gröna rörelsen, historia, Finland (325.109) @sv
alternative label: Högförräderi, spionage, historia, Finland (325.109) @sv
alternative label: Kollaboratörer, historia, Finland (325.109 +) @sv
alternative label: Landsförräderi, spionage, historia, Finland (325.109) @sv
alternative label: Moskvafreden, fredsavtalens historia (325.109) @sv
alternative label: Parisfreden, fredsavtalens historia (325.109) @sv
alternative label: Politiskt spionage, historia, Finland (325.109) @sv
alternative label: Statsbesök, historia, Finland (325.109) @sv
alternative label: Statsförbrytelser, spionage, historia, Finland (325.109) @sv
alternative label: Statsförbund, statsförbund, historia, Finland (325.109) @sv
alternative label: Statsfördrag, statsfördrag, historia, Finland (325.109) @sv
alternative label: Underjordisk verksamhet, spionage, historia, Finland (325.109) @sv
alternative label: Vänsterpartier, historia, Finland (325.109) @sv

URN:NBN:fi:au:hklj:325.6
alternative label: Ydinkoekielto (325.6)
alternative label: Provstopp (325.6) @sv

URN:NBN:fi:au:hklj:326.509
alternative label: Pasifismi, historia (326.509)
alternative label: Pasifistit, pasifismi, historia (326.509)
alternative label: Pacifism, historia (326.509) @sv
alternative label: Pacifister, pacifism, historia (326.509) @sv

URN:NBN:fi:au:hklj:327.05
alternative label: Valtiokalenterit, Suomi (327.05)
alternative label: Statskalendrar, Finland (327.05) @sv

URN:NBN:fi:au:hklj:327.6
alternative label: Informaatio, tietoliikennetekniikka (327.6 +)
alternative label: Information, telekommunikationsteknik (327.6 +) @sv

URN:NBN:fi:au:hklj:328.05
alternative label: Valtiokalenterit, muut maat (328.05)
alternative label: Statskalendrar, övriga länder (328.05) @sv

URN:NBN:fi:au:hklj:332.2309
alternative label: Manttaali, vero-oikeuden historia (332.2309)
alternative label: Mantal, skatterättens historia (332.2309) @sv

URN:NBN:fi:au:hklj:332.509
alternative label: Käräjät, historia (332.509)
alternative label: Ting, domstol, historia (332.509) @sv

URN:NBN:fi:au:hklj:332.909
alternative label: Pako, vangit, historia (332.909)
alternative label: Vanginvartijat, vankilat, historia (332.909)
alternative label: Vangit, vankilat, historia (332.909)
alternative label: Vankilat, historia (332.909)
alternative label: Flykt, fångar, historia (332.909) @sv
alternative label: Fängelser, historia (332.909) @sv
alternative label: Fångar, fängelser, historia (332.909) @sv
alternative label: Fångvaktare, fängelser, historia (332.909) @sv

URN:NBN:fi:au:hklj:333.22
alternative label: Abortti, lainsäädäntö (333.22)
alternative label: Abort, lagstiftning (333.22) @sv

URN:NBN:fi:au:hklj:333.23
alternative label: Lahjavero (333.23)
alternative label: Lahjoitukset, lahjavero (333.23)
alternative label: Donationer, gåvoskatt (333.23) @sv
alternative label: Gåvoskatt (333.23) @sv

URN:NBN:fi:au:hklj:334.309
alternative label: Isojako, maaoikeuden historia (334.309)
alternative label: Maanlait, lainsäädäntö, historia (334.309)
alternative label: Landslagar, juridik, historia (334.309) @sv
alternative label: Storskifte, jordrättens historia (334.309) @sv

URN:NBN:fi:au:hklj:340.09
alternative label: Virkamerkit, hallinto, historia (340.09)
alternative label: Virkapuvut, hallinto, historia (340.09)
alternative label: Tjänstedräkter, förvaltning, historia (340.09) @sv
alternative label: Tjänstetecken, förvaltning, historia (340.09) @sv

URN:NBN:fi:au:hklj:343.09
alternative label: Palokunnat, historia (343.09)
alternative label: Vapaapalokunnat, historia (343.09)
alternative label: Brandkårer, historia (343.09) @sv
alternative label: Frivilliga brandkårer, historia (343.09) @sv

URN:NBN:fi:au:hklj:344.09
alternative label: Ratsupoliisi, historia (344.09)
alternative label: Salainen poliisi, historia (344.09)
alternative label: Santarmit, poliisitoimi, historia (344.09)
alternative label: Scotland Yard, historia (344.09)
alternative label: Valpo, historia (344.09)
alternative label: Valtiollinen poliisi, historia (344.09)
alternative label: Gendarmer, polisväsen, historia (344.09) @sv
alternative label: Hemliga polisen, historia (344.09) @sv
alternative label: Ridande polis, historia (344.09) @sv
alternative label: Statspolisen, historia (344.09) @sv

URN:NBN:fi:au:hklj:345.03
alternative label: Verokalenterit, kunnalliset (345.03)
alternative label: Veroluettelot, kunnalliset (345.03)
alternative label: Skattekalendrar, kommunala (345.03) @sv
alternative label: Skattelängder, kommunala (345.03) @sv

URN:NBN:fi:au:hklj:345.05
alternative label: Kunnan talousarviot (345.05)
alternative label: Kuntasuunnitelmat (345.05)
alternative label: Kommunens budgetar (345.05) @sv
alternative label: Kommunplaner (345.05) @sv

URN:NBN:fi:au:hklj:345.09
alternative label: Pitäjänkokoukset, historia (345.09)
alternative label: Sockenstämmor, historia (345.09) @sv

URN:NBN:fi:au:hklj:345.1103
alternative label: Verokalenterit, kunnalliset, pääkaupunkiseutu (345.1103)
alternative label: Veroluettelot, kunnalliset, pääkaupunkiseutu (345.1103)
alternative label: Skattekalendrar, kommunala, huvudstadsregionen (345.1103) @sv
alternative label: Skattelängder, kommunala, huvudstadsregionen (345.1103) @sv

URN:NBN:fi:au:hklj:347.09
alternative label: Lääninhallinto, historia (347.09)
alternative label: Läänit, lääninhallinto, historia (347.09)
alternative label: Län, länsförvaltning, historia (347.09) @sv
alternative label: Länsförvaltning, historia (347.09) @sv

URN:NBN:fi:au:hklj:352.109
alternative label: Huutolaiset, yhteiskunnan rakenne, historia (352.109)
alternative label: Huutolaislapset, yhteiskunnan rakenne (352.109)
alternative label: Katuympäristö, kaupunkikulttuuri, historia (352.109)
alternative label: Kaupungistuminen, kaupungistuminen, historia (352.109)
alternative label: Kaupunkiarkeologia, kaupunkien sosiaalihistoria (352.109)
alternative label: Kaupunkikulttuuri, historia (352.109)
alternative label: Kerrostaloalueet, kaupunkihistoria (352.109)
alternative label: Kerrostalot, kaupunkihistoria (352.109)
alternative label: Keskiluokkaistuminen, historia (352.109)
alternative label: Lampuodit, historia (352.109)
alternative label: Loisväki, historia (352.109)
alternative label: Maatalousyhteiskunta, historia (352.109)
alternative label: Mikrohistoria, kaupunkihistoria (352.109)
alternative label: Mikrohistoria, maaseudun historia (352.109)
alternative label: Muonamiehet, historia (352.109)
alternative label: Muuttoliike, maassamuutto, historia (352.109)
alternative label: Mäkitupalaiset, yhteiskuntaluokat, historia (352.109)
alternative label: Palkolliset, maaseudun sosiaalihistoria (352.109)
alternative label: Porvaristo, kaupunkihistoria (352.109)
alternative label: Porvarit, kaupunkihistoria (352.109)
alternative label: Ruodut, maaseudun historia (352.109)
alternative label: Ruotujakolaitos, maaseudun historia (352.109)
alternative label: Ruotutorpat, maaseudun historia (352.109)
alternative label: Slummit, historia (352.109)
alternative label: Slummiutuminen, historia (352.109)
alternative label: Sosiaalihistoria, kaupunkihistoria (352.109)
alternative label: Sotilastorpat, maaseudun historia (352.109)
alternative label: Suurkaupungit, kaupunkihistoria (352.109)
alternative label: Talolliset, historia (352.109)
alternative label: Talonpoikaissääty, historia (352.109)
alternative label: Talonpojat, historia (352.109)
alternative label: Tapulikaupungit, kaupunkihistoria (352.109)
alternative label: Tehdasyhdyskunnat, kaupunkihistoria (352.109)
alternative label: Teollisuusyhdyskunnat, kaupunkihistoria (352.109)
alternative label: Tilalliset, historia (352.109)
alternative label: Tilaton väestö, historia (352.109)
alternative label: Tilattomat, historia (352.109)
alternative label: Torpat, maaseudun historia (352.109)
alternative label: Torpparit, maaseudun historia (352.109)
alternative label: Urbaaninen antropologia, kaupunkihistoria (352.109)
alternative label: Urbanisaatio, kaupungistuminen, historia (352.109)
alternative label: Vapaakaupungit, kaupunkihistoria (352.109)
alternative label: Vapaasatamat, kaupunkihistoria (352.109)
alternative label: Agrarsamhälle, historia (352.109) @sv
alternative label: Backstugusittare, samhällsklasser, historia (352.109) @sv
alternative label: Bondeståndet, historia (352.109) @sv
alternative label: Borgare, stadshistoria (352.109) @sv
alternative label: Borgerskapet, stadshistoria (352.109) @sv
alternative label: Bönder, historia (352.109) @sv
alternative label: Fabrikssamhällen, stadshistoria (352.109) @sv
alternative label: Flervåningshus, stadshistoria (352.109) @sv
alternative label: Flyttningsrörelse, migration, historia (352.109) @sv
alternative label: Frihamnar, stadshistoria (352.109) @sv
alternative label: Fristäder, stadshistoria (352.109) @sv
alternative label: Förslumning, historia (352.109) @sv
alternative label: Gatumiljö, tadskultur, historia (352.109) @sv
alternative label: Gentrifiering, historia (352.109) @sv
alternative label: Gårdsägare, historia (352.109) @sv
alternative label: Hemmansägare, historia (352.109) @sv
alternative label: Höghusområden, stadshistoria (352.109) @sv
alternative label: Indelningsverket, landsbygdens historia (352.109) @sv
alternative label: Industrisamhällen, stadshistoria (352.109 +) @sv
alternative label: Inhysingar, historia (352.109) @sv
alternative label: Landbönder, historia (352.109) @sv
alternative label: Legohjon, landsbygdens socialhistoria (352.109) @sv
alternative label: Mikrohistoria, landsbygdens historia (352.109) @sv
alternative label: Mikrohistoria, stadshistoria (352.109) @sv
alternative label: Obesutten befolkning, historia (352.109) @sv
alternative label: Rotar, landsbygdens historia (352.109) @sv
alternative label: Rotehjon, samhällsstruktur (352.109) @sv
alternative label: Rotetorp, landsbygdens historia (352.109) @sv
alternative label: Slumområden, historia (352.109) @sv
alternative label: Socialhistoria, stadshistoria (352.109) @sv
alternative label: Sockenbarn, samhällstruktur (352.109) @sv
alternative label: Soldattorp, landsbygdens historia (352.109) @sv
alternative label: Stadsarkeologi, städernas socialhistoria (352.109) @sv
alternative label: Stadskultur, historia (352.109) @sv
alternative label: Stapelstäder, stadshistoria (352.109) @sv
alternative label: Statare, historia (352.109) @sv
alternative label: Storstäder, stadshistoria (352.109) @sv

URN:NBN:fi:au:hklj:353.109
alternative label: Työn historia (353.109)
alternative label: Arbetets historia (353.109) @sv

URN:NBN:fi:au:hklj:357.109
alternative label: Beatnikit, osakulttuurit, historia (357.109)
alternative label: Beatniker, delkulturer, historia (357.109) @sv

URN:NBN:fi:au:hklj:359.09
alternative label: Alkoholirikokset, rikollisuus, historia (359.09)
alternative label: Arvoesineet, omaisuusrikokset, historia (359.09)
alternative label: Attentaatit, historia (359.09)
alternative label: Bioterrorismi, historia (359.09)
alternative label: Gangsterit, rikollisuus, historia (359.09)
alternative label: Huijarit, rikollisuus, historia (359.09)
alternative label: Huliganismi, rikollisuus, historia (359.09)
alternative label: Huumausaineen käyttörikokset, rikollisuus, historia (359.09)
alternative label: Huumausainerikokset, rikollisuus, historia (359.09)
alternative label: Huumerikokset, rikollisuus, historia (359.09)
alternative label: Häjyt, historia (359.09)
alternative label: Ihmisryöstöt, rikollisuus, historia (359.09)
alternative label: Ilmaliikenne, lentokonekaappaukset, historia (359.09)
alternative label: Itsemurhaiskut, historia (359.09)
alternative label: Joukkomurha, rikollisuuden historia (359.09)
alternative label: Joukkomurha, terrorismi, historia (359.09)
alternative label: Joukkotuho, joukkomurha, historia (359.09)
alternative label: Joukkotuho, terrorismi, historia (359.09)
alternative label: Järjestäytynyt rikollisuus, historia (359.09)
alternative label: Kaappaukset, rikollisuus, historia (359.09)
alternative label: Karkaaminen, vangit, historia (359.09)
alternative label: Kidnappaukset, rikollisuus, historia (359.09)
alternative label: Korruptio, historia (359.09)
alternative label: Lapsenmurha, rikollisuus, historia (359.09)
alternative label: Lento-onnettomuudet, terrorismi, historia (359.09)
alternative label: Lentokonekaappaukset, rikollisuus, historia (359.09)
alternative label: Lunnaat, rikollisuus, historia (359.09)
alternative label: Mafia, historia (359.09)
alternative label: Murha, rikollisuus, historia (359.09)
alternative label: Murhaajat, rikollisuus, historia (359.09)
alternative label: Musta pörssi, talousrikollisuus, historia (359.09)
alternative label: Nuoret rikoksentekijät, rikollisuus, historia (359.09)
alternative label: Nuorisorikollisuus, historia (359.09)
alternative label: Onnettomuudet, terrorismin historia (359.09)
alternative label: Pankkiryöstöt, rikollisuus, historia (359.09)
alternative label: Panttivangit, terrorismi, historia (359.09)
alternative label: Poliittinen väkivalta, historia (359.09)
alternative label: Poliittiset rikokset, historia (359.09)
alternative label: Puukkojunkkarit, historia (359.09)
alternative label: Raiskaus, rikollisuus, historia (359.09)
alternative label: Rikokset, rikollisuus, historia (359.09)
alternative label: Rikolliset, rikollisuus, historia (359.09)
alternative label: Rikollisuus, historia (359.09)
alternative label: Ryöstö, rikollisuus, historia (359.09)
alternative label: Räjähdykset, terrorismi, historia (359.09)
alternative label: Räjähdysonnettomuudet, terrorismi, historia (359.09)
alternative label: Salakuljettajat, rikollisuus, historia (359.09)
alternative label: Salakuljetus, rikollisuus, historia (359.09)
alternative label: Sarjamurhaajat, rikollisuus, historia (359.09)
alternative label: Selvittämättömät rikokset, rikollisuus, historia (359.09)
alternative label: Sieppaukset, rikollisuus, historia (359.09)
alternative label: Siveellisyysrikokset, rikollisuus, historia (359.09)
alternative label: Talousrikokset, rikollisuus, historia (359.09)
alternative label: Terrori-iskut, rikollisuus, historia (359.09)
alternative label: Terrorismi, rikollisuus, historia (359.09)
alternative label: Terrorismi-iskut, rikollisuus, historia (359.09)
alternative label: Terroristi-iskut, rikollisuus, historia (359.09)
alternative label: Terroristit, rikollisuus, historia (359.09)
alternative label: Varkaat, rikollisuus, historia (359.09)
alternative label: Veljeskunnat, mafia, historia (359.09)
alternative label: Verikosto, rikollisuus, historia (359.09)
alternative label: Viinanpoltto, alkoholirikollisuus, historia (359.09)
alternative label: Väkisinmakaaminen, rikollisuus, historia (359.09)
alternative label: Väkivalta, historia (359.09)
alternative label: Väkivalta, rikollisuus, historia (359.09)
alternative label: Väkivaltarikokset, rikollisuus, historia (359.09)
alternative label: Väärennökset, rikollisuus, historia (359.09)
alternative label: Yakuza, järjestäytynyt rikollisuus, historia (359.09)
alternative label: Alkoholbrott, brottslighet, historia (359.09) @sv
alternative label: Attentat, historia (359.09) @sv
alternative label: Bankrån, brottslighet, historia (359.09) @sv
alternative label: Barnamord, brottslighet, historia (359.09) @sv
alternative label: Bioterrorism, historia (359.09) @sv
alternative label: Blodshämnd, brottslighet, historia (359.09) @sv
alternative label: Brott, juridik, brottslighet, historia (359.09) @sv
alternative label: Brottslighet, historia (359.09) @sv
alternative label: Brottslingar, brottslighet, historia (359.09) @sv
alternative label: Brännvinsbränning, alkoholbrottslighet, historia (359.09) @sv
alternative label: Brödraskap, maffia, historia (359.09) @sv
alternative label: Ekonomisk brottslighet, brottslighet, historia (359.09) @sv

URN:NBN:fi:au:hklj:360.05
alternative label: Talouslehdet (360.05)
alternative label: Ekonomitidningar (360.05) @sv

URN:NBN:fi:au:hklj:362.09
alternative label: Suomen Pankki, historia (362.09)
alternative label: Finlands Bank, historia (362.09) @sv

URN:NBN:fi:au:hklj:363.103
alternative label: Veroluettelot (363.103)
alternative label: Skattelängder (363.103) @sv

URN:NBN:fi:au:hklj:363.109
alternative label: Kruununviljat, historia (363.109)
alternative label: Kruununvoudit, verotuksen historia (363.109)
alternative label: Maavero, historia (363.109)
alternative label: Manttaali, verotuksen historia (363.109)
alternative label: Suostuntavero, historia (363.109)
alternative label: Verohinnat, historia (363.109)
alternative label: Verohintataksa, historia (363.109)
alternative label: Veronkanto, historia (363.109)
alternative label: Veroparselit, historia (363.109)
alternative label: Verovilja, historia (363.109)
alternative label: Bevillning, historia (363.109) @sv
alternative label: Jordskatt, historia (363.109) @sv
alternative label: Kronofogdar, beskattningens historia (363.109) @sv
alternative label: Kronospannmål, historia (363.109) @sv
alternative label: Mantal, beskattningens historia (363.109) @sv
alternative label: Markegångar, historia (363.109) @sv
alternative label: Markegångstaxa, historia (363.109) @sv
alternative label: Skattepersedlar, historia (363.109) @sv
alternative label: Skattespannmål, historia (363.109) @sv
alternative label: Skatteuppbörd, historia (363.109) @sv

URN:NBN:fi:au:hklj:364.09
alternative label: Osuuskassat, historia (364.09)
alternative label: Andelskassor, historia (364.09) @sv

URN:NBN:fi:au:hklj:367.209
alternative label: CMEA, historia (367.209)
alternative label: COMECON, historia (367.209)
alternative label: EEC, historia (367.209)
alternative label: EFTA, historia (367.209)
alternative label: Komekon, historia (367.209)
alternative label: NORDEK, historia (367.209)
alternative label: SEV, historia (367.209)
alternative label: Tapulikaupungit, tullipolitiikan historia (367.209)
alternative label: Stapelstäder, tullpolitikens historia (367.209) @sv

URN:NBN:fi:au:hklj:368.203
alternative label: Hinnastot (368.203)
alternative label: Hintaluettelot (368.203)
alternative label: Katalogit (368.203)
alternative label: Myyntiluettelot (368.203)
alternative label: Försäljningskataloger (368.203) @sv
alternative label: Prislistor (368.203) @sv

URN:NBN:fi:au:hklj:368.3083
alternative label: Valtion työntekijät , palkkataulukot (368.3083)
alternative label: Valtion virkamiehet, palkkataulukot (368.3083)
alternative label: Viranhaltijat, palkkataulukot (368.3083)
alternative label: Virat, palkkataulukot (368.3083)
alternative label: Virkamiehet, palkkataulukot (368.3083)
alternative label: Statstjänstemän, lönetabeller (368.3083) @sv
alternative label: Tjänsteinnehavare, lönetabeller (368.3083) @sv
alternative label: Tjänstemän, lönetabeller (368.3083) @sv
alternative label: Tjänster, befattningar, lönetabeller (368.3083) @sv

URN:NBN:fi:au:hklj:368.409
alternative label: Katovuodet, pulakaudet, historia (368.409)
alternative label: Lamakausi, historia (368.409)
alternative label: Nälkävuodet, pulakaudet, historia (368.409)
alternative label: Pula-ajat, historia (368.409)
alternative label: Säännöstely, pula-aika, historia (368.409)
alternative label: Depressionsperiod, ekonomisk, historia (368.409) @sv
alternative label: Hungerår, kristider, historia (368.409) @sv
alternative label: Kristider, historia (368.409) @sv
alternative label: Nödår, kristider, historia (368.409) @sv
alternative label: Ransonering, kristid, historia (368.409) @sv

URN:NBN:fi:au:hklj:370.03
alternative label: Toiminimet, yrityshakemistot (370.03)
alternative label: Firmanamn, företagsregister (370.03) @sv

URN:NBN:fi:au:hklj:371.1109
alternative label: Päivätyöt, työaika, työolot, historia (371.1109)
alternative label: Taksvärkki, työaika, työolot, historia (371.1109)
alternative label: Dagsarbete, arbetstid, arbetsförhållanden, historia (371.1109) @sv
alternative label: Dagsverken, arbetstid, arbetsförhållanden (371.1109) @sv

URN:NBN:fi:au:hklj:371.203
alternative label: Manttaaliluettelot (371.203)
alternative label: Mantalslängder (371.203) @sv

URN:NBN:fi:au:hklj:371.509
alternative label: Huutolaislapset, lastenhuollon historia (371.509)
alternative label: Sockenbarn, barnomsorgens historia (371.509) @sv

URN:NBN:fi:au:hklj:371.5209
alternative label: Lastenseimet, historia (371.5209)
alternative label: Lastentarhat, historia (371.5209)
alternative label: Päivähoito, historia (371.5209)
alternative label: Barnkrubbor, historia (371.5209) @sv
alternative label: Barnträdgårdar, historia (371.5209) @sv
alternative label: Dagvård, historia (371.5209) @sv

URN:NBN:fi:au:hklj:371.7109
alternative label: Kieltolait, historia (371.7109)
alternative label: Förbudslagar, historia (371.7109) @sv

URN:NBN:fi:au:hklj:371.91
alternative label: Kanadansuomalaiset (371.91)
alternative label: Kanadafinländare (371.91) @sv

URN:NBN:fi:au:hklj:371.9109
alternative label: Kanadansuomalaiset, historia (371.9109)
alternative label: Kanadafinländare, historia (371.9109) @sv

URN:NBN:fi:au:hklj:372.109
alternative label: Maanvuokra, maapolitiikka, historia (372.109)
alternative label: Maanvuokraus, maapolitiikka, historia (372.109)
alternative label: Arrende, jordpolitik, historia (372.109) @sv
alternative label: Arrendering, jordpolitik, historia (372.109) @sv

URN:NBN:fi:au:hklj:373.09
alternative label: Huoltoapu, sosiaaliturvan historia (373.09)
alternative label: Irtolaiset, irtolaishuolto, historia (373.09)
alternative label: Vaivaistalot, historia (373.09)
alternative label: Vanhainkodit, historia (373.09)
alternative label: Fattighus, historia (373.09) @sv
alternative label: Lösdrivare, lösdrivarvård, historia (373.09) @sv
alternative label: Socialhjälp, socialskyddets historia (373.09) @sv
alternative label: Ålderdomshem, historia (373.09) @sv

URN:NBN:fi:au:hklj:374.109
alternative label: Bolsevismi, bolsevismin historia (374.109)
alternative label: Eurokommunismi, historia (374.109)
alternative label: Internationaalit, kommunismin historia (374.109)
alternative label: Internationaalit, sosialismin historia (374.109)
alternative label: Jälkikommunismi, ideologi, historia (374.109)
alternative label: Jälkisosialismi, ideologia, historia (374.109)
alternative label: Kolhoosit, kommunismin historia (374.109)
alternative label: Kommunismi, ideologia, historia (374.109)
alternative label: Marksilaisuus, poliittiset ideologiat, historia (374.109)
alternative label: Marksismi, poliittiset ideologiat, historia (374.109)
alternative label: Marksismi-leninismi, poliittiset ideologiat, historia (374.109)
alternative label: Marxismi, poliittiset ideologiat, historia (374.109)
alternative label: Marxismi-leninismi, poliittiset ideologiat, historia (374.109)
alternative label: Postkommunismi, ideologia, historia (374.109)
alternative label: Sosiaalidemokratia, historia (374.109)
alternative label: Sosialismi, historia (374.109)
alternative label: Stalinismi, kommunismin historia (374.109)
alternative label: Bolsjevism, bolsjevismens historia (374.109) @sv
alternative label: Eurokommunism, historia (374.109) @sv
alternative label: Internationaler, kommunismens historia (374.109) @sv
alternative label: Internationaler, socialismens historia (374.109) @sv
alternative label: Kolhoser, kommunismens historia (374.109) @sv
alternative label: Kommunism, ideologi, historia (374.109) @sv
alternative label: Marksism, politiska ideologier, historia (374.109) @sv
alternative label: Marksism-leninism, politiska ideologier, historia (374.109) @sv
alternative label: Marxism, politiska ideologier, historia (374.109) @sv
alternative label: Marxism-leninism, politiska ideologier, historia (374.109) @sv
alternative label: Postkommunism, ideologi, historia (374.109) @sv
alternative label: Postsocialism, ideologi, historia (374.109) @sv
alternative label: Senare kommunism, ideologi, historia (374.109) @sv
alternative label: Socialdemokrati, historia (374.109) @sv
alternative label: Socialism, historia (374.109) @sv
alternative label: Stalinism, kommunismens historia (374.109) @sv

URN:NBN:fi:au:hklj:374.809
alternative label: Fasismi, ideologia, historia (374.809)
alternative label: Fasistit, fasismi, historia (374.809)
alternative label: Kansallissosialismi, ideologia, historia (374.809)
alternative label: Kansallissosialistit, kansallissosialismi, historia (374.809)
alternative label: Natsismi, ideologia, historia (374.809)
alternative label: Natsit, kansallissosialismi, historia (374.809)
alternative label: Neofasismi, ideologia, historia (374.809)
alternative label: Uusfasismi, ideologi, historia (374.809)
alternative label: Uusnatsismi, ideologia, historia (374.809)
alternative label: Fascism, ideologi, historia (374.809) @sv
alternative label: Fascister, fascism, historia (374.809) @sv
alternative label: Nationalsocialism, ideologi, historia (374.809) @sv
alternative label: Nationalsocialister, nationalsocialism, historia (374.809) @sv
alternative label: Nazism, ideologi, historia (374.809) @sv
alternative label: Nazister, nationalsocialism, historia (374.809) @sv
alternative label: Neofacism, ideologi, historia (374.809) @sv
alternative label: Nyfascism, ideologi, historia (374.809) @sv
alternative label: Nynazism, ideologi, historia (374.809) @sv

URN:NBN:fi:au:hklj:374.909
alternative label: Anarkismi, ideologia, historia (374.909)
alternative label: Anarkistit, anarkismi, historia (374.909)
alternative label: Nihilismi, historia (374.909)
alternative label: Nuorsuomalaisuus, historia (374.909)
alternative label: Panslavismi, historia (374.909)
alternative label: Slavofiilit, historia (374.909)
alternative label: Vanhasuomalaisuus, historia (374.909)
alternative label: Anarkism, ideologi, historia (374.909) @sv
alternative label: Anarkister, anarkism, historia (374.909) @sv
alternative label: Gammalfinskhet, historia (374.909) @sv
alternative label: Nihilism, historia (374.909) @sv
alternative label: Panslavism, historia (374.909) @sv
alternative label: Slavofiler, historia (374.909) @sv
alternative label: Ungfinskhet, historia (374.909) @sv

URN:NBN:fi:au:hklj:377.03
alternative label: Jäsenilmoitukset (377.03)
alternative label: Jäsenluettelot (377.03)
alternative label: Medlemsanmälningar (377.03) @sv
alternative label: Medlemsförteckningar (377.03) @sv

URN:NBN:fi:au:hklj:377.205
alternative label: Ammattiyhdistyslehdet (377.205)
alternative label: Fackföreningstidningar (377.205) @sv

URN:NBN:fi:au:hklj:377.409
alternative label: Köyhäinapu, hyväntekeväisyyden historia (377.409)
alternative label: Köyhäinhoito, hyväntekeväisyyden historia (377.409)
alternative label: Vaivaishoito, hyväntekeväisyyden historia (377.409)
alternative label: Fattighjälp, välgörenhetens historia (377.409) @sv
alternative label: Fattigvård, välgörenhetens historia (377.409) @sv
alternative label: Vård av fattiga, välgörenhetens historia (377.409) @sv

URN:NBN:fi:au:hklj:379.105
alternative label: Häälehdet (379.105)
alternative label: Bröllopstidningar (379.105) @sv

URN:NBN:fi:au:hklj:384.09
alternative label: Radiohistoria, joukkoviestintä (384.09)
alternative label: Radiohistoria, masskommunikation (384.09) @sv

URN:NBN:fi:au:hklj:384.1203
alternative label: Yhteystiedot, sähköpostiosoitteet (384.1203)
alternative label: Kontaktinformation, e-postadresser (384.1203) @sv

URN:NBN:fi:au:hklj:384.4109
alternative label: Radiohistoria, tiedotusvälineet (384.4109)
alternative label: Radiohistoria, massmedia (384.4109) @sv

URN:NBN:fi:au:hklj:384.4209
alternative label: Kuvausryhmät, television historia (384.4209)
alternative label: Ttelevisiohistoria, joukkotiedotus (384.4209)
alternative label: Ttelevisiohistoria, tiedotusvälineet (384.4209)
alternative label: Filmteam, televisionens historia (384.4209) @sv
alternative label: Tv-historia, masskommunikation (384.4209) @sv
alternative label: Tv-historia, massmedia (384.4209) @sv

URN:NBN:fi:au:hklj:386.103
alternative label: Aikataulut, vesiliikenne (386.103)
alternative label: Laivaliikenne, aikataulut (386.103)
alternative label: Fartygstrafik, tidtabeller (386.103) @sv
alternative label: Tidtabeller, sjötrafik (386.103) @sv

URN:NBN:fi:au:hklj:386.3
alternative label: Deprivaatio, köyhyys (386.3)
alternative label: Deprivation, fattigdom (386.3) @sv

URN:NBN:fi:au:hklj:390.05
alternative label: Maanpuolustuslehdet (390.05)
alternative label: Sotilaslehdet (390.05)
alternative label: Försvarstidningar (390.05) @sv
alternative label: Militärtidningar (390.05) @sv
alternative label: Soldattidningar (390.05) @sv

URN:NBN:fi:au:hklj:392.09
alternative label: Samurait, sotataito, historia (392.09)
alternative label: Samurajer, krigskonst, historia (392.09) @sv

URN:NBN:fi:au:hklj:409.03
alternative label: Maat, hakuteokset (409.03)
alternative label: Paikannimet, aluemaantiede, hakemistot (409.03)
alternative label: Valtiot, maantiede, hakuteokset (409.03)
alternative label: Länder, uppslagsverk (409.03) @sv
alternative label: Ortnamn, regionalgeografi, register (409.03) @sv
alternative label: Stater, geografi, uppslagsverk (409.03) @sv

URN:NBN:fi:au:hklj:412.084
alternative label: Hakukartat, Suomi (412.084)
alternative label: Ilmakuvakartat, Suomi (412.084)
alternative label: Maastokartat, Suomi (412.084)
alternative label: Matkailukartat, Suomi (412.084)
alternative label: Suomi, kartat (412.084)
alternative label: Topografiset kartat, Suomi (412.084)
alternative label: Finland, kartor (412.084) @sv
alternative label: Flygbildskartor, Finland (412.084) @sv
alternative label: Indexkartor, Finland (412.084) @sv
alternative label: Terrängkartor, Finland (412.084) @sv
alternative label: Topografiska kartor, Finland (412.084) @sv
alternative label: Turistkartor, Finland (412.084) @sv

URN:NBN:fi:au:hklj:412.088
alternative label: Skärgårdsbor, geografi, svendkbygderna (412.088) @sv

URN:NBN:fi:au:hklj:414.2
alternative label: Saksan liittotasavalta (414.2)
alternative label: Saksan liittotasavalta, maantiede, matkat (414.2)
alternative label: Förbundsrepubliken Tyskland (414.2) @sv
alternative label: Förbundsrepubliken Tyskland, geografi, resor (414.2) @sv

URN:NBN:fi:au:hklj:475.476
alternative label: Kodintekstiilit, kansatiede, eri kansat (475.476 +)
alternative label: Liinavaatteet, kansatiede, eri kansat (475.476 +)
alternative label: Pyyheliinat, kansatiede, eri kansat (475.476 +)
alternative label: Pyyhkeet, kansatiede, eri kansat (475.476 +)
alternative label: Handdukar, etnologi, olika folk (475.476 +) @sv
alternative label: Hemtextilier, etnologi, olika folk (475.476 +) @sv
alternative label: Linne, etnologi, olika folk (475.476 +) @sv

URN:NBN:fi:au:hklj:492.09
alternative label: Katastrofit, luonnonkatastrofit, historia (492.09)
alternative label: Luonnononnettomuudet, historia (492.09)
alternative label: Onnettomuudet, luonnononnettomuuksien historia (492.09)
alternative label: Suuronnettomuudet, luonnononnettomuudet, historia (492.09)
alternative label: Katastrofer, naturkatastrofer, historia (492.09) @sv
alternative label: Naturkatastrofer, historia (492.09) @sv
alternative label: Olyckor, naturkatastrofernas historia (492.09) @sv
alternative label: Storolyckor, naturkatastrofer, historia (492.09) @sv

URN:NBN:fi:au:hklj:508.609
alternative label: Ympäristöhistoria (508.609)
alternative label: Miljöhistoria (508.609) @sv

URN:NBN:fi:au:hklj:515.083
alternative label: Trigonometria, taulukot (515.083)
alternative label: Trigonometri, tabeller (515.083) @sv

URN:NBN:fi:au:hklj:520.03
alternative label: Tähtiluettelot (520.03)
alternative label: Stjärnkataloger (520.03) @sv

URN:NBN:fi:au:hklj:522.09
alternative label: Viikonpäivät, ajanlasku, historia (522.09)

URN:NBN:fi:au:hklj:522.2
alternative label: Koukut, koneen osat (522.2)
alternative label: Krokar, maskindelar (522.2) @sv

URN:NBN:fi:au:hklj:548
alternative label: Dispersiot, kemianteollisuus (548)
alternative label: Geelit, kemianteollisuus (548)
alternative label: Nesteytys, kemianteollisuus (548)
alternative label: Vaahdot, kemianteollisuus (548)
alternative label: Dispersioner, kemisk industri (548) @sv
alternative label: Geler, kemisk industri (548) @sv
alternative label: Kondensation, kemisk industri (548) @sv
alternative label: Skum, kemisk industri (548) @sv

URN:NBN:fi:au:hklj:579.1
alternative label: Vaihtelu, mikrobisystematiikka (579.1)
alternative label: Variation, mikrobsystematik (579.1) @sv

URN:NBN:fi:au:hklj:580.62
alternative label: Yhteismetsät, metsien suojelu (580.62)
alternative label: Samfällda skogar, skogsskydd (580.62) @sv

URN:NBN:fi:au:hklj:587.92
alternative label: Hamppu, kasvitiede (587.92)
alternative label: Rastaat (587.92)
alternative label: Hampa, botanik (587.92) @sv
alternative label: Trastar (587.92) @sv

URN:NBN:fi:au:hklj:590.96
alternative label: Heitteille jätetyt eläimet, eläinsuojelu (590.96)
alternative label: Löytöeläimet, eläinsuojelu (590.96)
alternative label: Upphittade djur, djurskydd (590.96) @sv
alternative label: Övergivna djur, djurskydd (590.96) @sv

URN:NBN:fi:au:hklj:597.4
alternative label: Puuvartiset kasvit, kasvitiede (597.4)
alternative label: Siitepöly (597.4)
alternative label: Pollen (597.4) @sv
alternative label: Vedväxter, botanik (597.4) @sv

URN:NBN:fi:au:hklj:610.09
alternative label: Lääketieteen historia (610.09)
alternative label: Medicinens historia (610.09) @sv

URN:NBN:fi:au:hklj:610.7109
alternative label: Palsamointi, lääketieteen historia (610.7109)
alternative label: Sairaalat, historia (610.7109)
alternative label: Balsamering, läkekonstens historia (610.7109) @sv
alternative label: Sjukhus, historia (610.7109) @sv

URN:NBN:fi:au:hklj:610.7303
alternative label: Lääkäriluettelot (610.7303)
alternative label: Lääkärit, lääkäriluettelot (610.7303)
alternative label: Läkare, läkarförteckningar (610.7303) @sv
alternative label: Läkarförteckningar (610.7303) @sv

URN:NBN:fi:au:hklj:613.32
alternative label: Sokeri, diabetes (613.32)
alternative label: Socker, diabetes (613.32) @sv

URN:NBN:fi:au:hklj:615.1103
alternative label: Apteekit, luettelot (615.1103)
alternative label: Apotek, kataloger (615.1103) @sv

URN:NBN:fi:au:hklj:617.509
alternative label: Isorokko, historia (617.509)
alternative label: Lepra, historia (617.509)
alternative label: Rutto, historia (617.509)
alternative label: Spitaali, historia (617.509)
alternative label: Pest, historia (617.509) @sv
alternative label: Smittkoppor, historia (617.509) @sv
alternative label: Spetälska, historia (617.509) @sv

URN:NBN:fi:au:hklj:620.05
alternative label: Tekniikkalehdet (620.05)
alternative label: Tekniktidningar (620.05) @sv

URN:NBN:fi:au:hklj:624.309
alternative label: Aunessilta, museosillat (624.309)
alternative label: Museosillat (624.309)
alternative label: Aunessilta, museibroar (624.309) @sv
alternative label: Museibroar (624.309) @sv

URN:NBN:fi:au:hklj:624.705
alternative label: Moottoripyörälehdet (624.705)
alternative label: MC-tidningar (624.705) @sv
alternative label: Motorcykeltidningar (624.705) @sv

URN:NBN:fi:au:hklj:624.805
alternative label: Autolehdet (624.805)
alternative label: Autolehdet, autoala, lehdet (624.805)
alternative label: Biltidningar (624.805) @sv
alternative label: Biltidningar, bilbranschen, tidningar (624.805) @sv

URN:NBN:fi:au:hklj:624.809
alternative label: Automuseot (624.809)
alternative label: Autot, historia (624.809)
alternative label: Museoautot (624.809)
alternative label: Vanhat autot (624.809)
alternative label: Veteraaniautot (624.809)
alternative label: Bilar, historia (624.809) @sv
alternative label: Bilmuseer (624.809) @sv
alternative label: Gamla bilar (624.809) @sv
alternative label: Museibilar (624.809) @sv

URN:NBN:fi:au:hklj:625.7103
alternative label: Kauppa-alukset, hakuteokset (625.7103)
alternative label: Kauppalaivasto, laivat, hakuteokset (625.7103)
alternative label: Kauppalaivat, hakuteokset (625.7103)
alternative label: Laivat, hakuteokset (625.7103)
alternative label: Fartyg, uppslagsverk (625.7103) @sv
alternative label: Handelsbåtar, uppslagsverk (625.7103) @sv
alternative label: Handelsfartyg, uppslagsverk (625.7103) @sv
alternative label: Handelsflotta, fartyg, uppslagsverk (625.7103) @sv

URN:NBN:fi:au:hklj:625.7205
alternative label: Venelehdet (625.7205)
alternative label: Båttidningar (625.7205) @sv

URN:NBN:fi:au:hklj:625.7309
alternative label: Sukellusveneet, historia (625.7309)
alternative label: Vesikulkuneuvot, sukellusveneet, historia (625.7309)
alternative label: Ydinsukellusveneet, historia (625.7309)
alternative label: Atomubåtar, historia (625.7309) @sv
alternative label: Farkoster, ubåtar, historia (625.7309) @sv
alternative label: Ubåtar, historia (625.7309) @sv

URN:NBN:fi:au:hklj:626.2
alternative label: Lentotekniikka, lentokonetekniikka (626.2)
alternative label: Lentäminen, lentokonetekniikka (626.2)
alternative label: Flygning, flygplansteknik (626.2) @sv
alternative label: Flygteknik, flygplansteknik (626.2) @sv

URN:NBN:fi:au:hklj:626.303
alternative label: Lentokoneet, hakuteokset (626.303)
alternative label: Museolentokoneet, hakuteokset (626.303)
alternative label: Flygplan, uppslagsverk (626.303) @sv
alternative label: Museiflygplan, uppslagsverk (626.303) @sv

URN:NBN:fi:au:hklj:626.309
alternative label: Ilmailumuseot (626.309)
alternative label: Lentokoneet, historia (626.309)
alternative label: Matkustajakoneet, historia (626.309)
alternative label: Museolentokoneet, historia (626.309)
alternative label: Siviililentokoneet, historia (626.309)
alternative label: Sotilasilmailu, sotilaslentokoneet, historia (626.309)
alternative label: Sotilaslentokoneet, historia (626.309)
alternative label: Suihkukoneet, historia (626.309)
alternative label: Vesitasot, historia (626.309)
alternative label: Civila flygplan, historia (626.309) @sv
alternative label: Flygmuseer (626.309) @sv
alternative label: Flygplan, historia (626.309) @sv
alternative label: Jetplan, historia (626.309) @sv
alternative label: Militärflyg, militärflygplan, historia (626.309) @sv
alternative label: Militärflygplan, historia (626.309) @sv
alternative label: Museiflygplan, historia (626.309) @sv
alternative label: Passagerarplan, historia (626.309) @sv
alternative label: Sjöflygplan, historia (626.309) @sv

URN:NBN:fi:au:hklj:626.509
alternative label: Helikopterit, historia (626.509)
alternative label: Ilmalaivat, historia (626.509)
alternative label: Sotilashelikopterit, historia (626.509)
alternative label: Sotilasilmailu, sotilashelikopterit, historia (626.509)
alternative label: Helikoptrar, historia (626.509) @sv
alternative label: Luftfartyg, historia (626.509) @sv
alternative label: Militärflyg, militärhelikoptrar, historia (626.509) @sv
alternative label: Militärhelikoptrar, historia (626.509) @sv

URN:NBN:fi:au:hklj:627.7109
alternative label: Laivasto, laivojen historia (627.7109)
alternative label: Flotta, skeppens historia (627.7109) @sv

URN:NBN:fi:au:hklj:627.7309
alternative label: Reikäkorttikoneet, historia (627.7309)
alternative label: Hålkortsmaskiner, historia (627.7309) @sv

URN:NBN:fi:au:hklj:627.753103
alternative label: CD-soittimet, tuoteluettelot (627.753103)
alternative label: CD-spelare, produktkataloger (627.753103) @sv

URN:NBN:fi:au:hklj:628.1
alternative label: Lähetystekniikka, televisiotekniikka (628.1)
alternative label: Suoratoisto, tiedonsiirtolaitteet, televisiolaitteet (628.1)
alternative label: Tiedonsiirtolaitteet, televisiolaitteet (628.1)
alternative label: Tietoliikennelaitteet, televisiolaitteet (628.1)
alternative label: Tietoliikennetekniikka, televisiotekniikka (628.1)
alternative label: Vastaanottimet, televisiot (628.1)
alternative label: Viestimet, televisiotekniikka (628.1)
alternative label: Viestintätekniikka, televisiotekniikka (628.1)
alternative label: Viestintäteknologia, televisiotekniikka (628.1)
alternative label: Kommunikationsteknik, TV-teknik (628.1) @sv
alternative label: Kommunikationsteknologi, TV-teknik (628.1) @sv
alternative label: Medier, masskommunikation, TV-teknik (628.1) @sv
alternative label: Mottagare, televisionsapparater (628.1) @sv
alternative label: Streaming, telekommunikationsanordningar, TV-apparater (628.1) @sv
alternative label: Sändningsteknik, TV-teknik (628.1) @sv
alternative label: Telekommunikationsanordningar, TV-apparater (628.1) @sv
alternative label: Telekommunikationsteknik, TV-teknik (628.1) @sv
alternative label: Telekommunikationsutrustning, TV-apparater (628.1) @sv

URN:NBN:fi:au:hklj:629
alternative label: Turvallisuus, säteilyturvallisuus (629)
alternative label: Säkerhet, trygghet, strålsäkerhet (629) @sv

URN:NBN:fi:au:hklj:631.09
alternative label: Rautaruukit, teollisuuden historia (631.09)
alternative label: Ruukit, teollisuuden historia (631.09)
alternative label: Bruk, industrier, industrins historia (631.09) @sv
alternative label: Järnbruk, industrins historia (631.09) @sv

URN:NBN:fi:au:hklj:631.2
alternative label: Kovuus, kiinteän aineen rakenne (631.2)
alternative label: Hårdhet, fasta ämnens struktur (631.2) @sv

URN:NBN:fi:au:hklj:634.09
alternative label: Paanut, puuteollisuus, historia (634.09)
alternative label: Takspån, träindustri, historia (634.09) @sv

URN:NBN:fi:au:hklj:636.09
alternative label: Paperin historia (636.09)
alternative label: Tervakauppa, historia (636.09)
alternative label: Papprets historia (636.09) @sv
alternative label: Tjärhandel, historia (636.09) @sv

URN:NBN:fi:au:hklj:641
alternative label: Metallblandningar, metallurgi (641) @sv

URN:NBN:fi:au:hklj:642
alternative label: Kipsilevyt, kipsiteollisuus (642)
alternative label: Kipsiteollisuus (642)
alternative label: Sementtiteollisuus (642)
alternative label: Cementindustri (642) @sv
alternative label: Gipsindustri (642) @sv
alternative label: Gipsskivor, gipsindustri (642) @sv

URN:NBN:fi:au:hklj:643.09
alternative label: Keraaminen teollisuus, historia (643.09)
alternative label: Keramiikkateollisuus, historia (643.09)
alternative label: Lasiteollisuus, historia (643.09)
alternative label: Saviteollisuus, historia (643.09)
alternative label: Glasindustri, historia (643.09) @sv
alternative label: Keramikindustri, historia (643.09) @sv
alternative label: Keramisk industri, historia (643.09) @sv
alternative label: Lergodsindustri, historia (643.09) @sv

URN:NBN:fi:au:hklj:646.09
alternative label: Kaivosonnettomuudet, historia (646.09)
alternative label: Kaivostyöntekijät, kaivostyö, historia (646.09)
alternative label: Gruvarbetare, gruvarbete, historia (646.09) @sv
alternative label: Gruvolyckor, historia (646.09) @sv

URN:NBN:fi:au:hklj:648.1
alternative label: Ilotulitusvälineet, teollisuus ja kauppa (648.1)
alternative label: Pyrotekniikka (648.1)
alternative label: Fyrverkeripjäser, industri och handel (648.1) @sv
alternative label: Pyroteknik (648.1) @sv

URN:NBN:fi:au:hklj:649.9103
alternative label: Tuoteluettelot, elintarviketeollisuus (649.9103)
alternative label: Produktkataloger, livsmedelsindustri (649.9103) @sv

URN:NBN:fi:au:hklj:649.9109
alternative label: Juomateollisuus, historia (649.9109)
alternative label: Kahviteollisuus, historia (649.9109)
alternative label: Kruununpolttimot, historia (649.9109)
alternative label: Olutteollisuus, historia (649.9109)
alternative label: Dryckesvaruindustri, historia (649.9109) @sv
alternative label: Kaffeindustri, historia (649.9109) @sv
alternative label: Kronobrännerier, historia (649.9109) @sv
alternative label: Ölindustri, historia (649.9109) @sv

URN:NBN:fi:au:hklj:651.05
alternative label: Maatalouslehdet (651.05)
alternative label: Lantbrukstidningar (651.05) @sv

URN:NBN:fi:au:hklj:651.09
alternative label: Kolhoosit, maatalouden historia (651.09)
alternative label: Kruununmakasiinit, historia (651.09)
alternative label: Maatalous, historia (651.09)
alternative label: Piiat, maatalouden historia (651.09)
alternative label: Rengit, maatalouden historia (651.09)
alternative label: Uudisraivaus, maatalouden historia (651.09)
alternative label: Uudistilat, maatalouden historia (651.09)
alternative label: Drängar, lantbrukets historia (651.09) @sv
alternative label: Kolhoser, lantbrukets historia (651.09) @sv
alternative label: Kronomagasin, historia (651.09) @sv
alternative label: Lantbruk, historia (651.09) @sv
alternative label: Nybyggarhemman, lantbrukets historia (651.09) @sv
alternative label: Nyröjning, lantbrukets historia (651.09) @sv
alternative label: Pigor, lantbrukets historia (651.09) @sv

URN:NBN:fi:au:hklj:652.09
alternative label: Katovuodet, maanviljely, historia (652.09)
alternative label: Maanviljelyskulttuurit, maanviljelyksen historia (652.09)
alternative label: Nälkävuodet, maanviljely, historia (652.09)
alternative label: Pellonraivaus, maanviljely, historia (652.09)
alternative label: Tuli, kaskeaminen, historia (652.09)
alternative label: Työhevoset, maanviljelystyöt, historia (652.09)
alternative label: Arbetshästar, jordbruksarbeten, historia (652.09) @sv
alternative label: Eld, svedjebränning, historia (652.09) @sv
alternative label: Hungerår, jordbruk, historia (652.09) @sv
alternative label: Jordbrukskulturer, jordbrukets historia (652.09) @sv
alternative label: Nödår, jordbruk, historia (652.09) @sv
alternative label: Åkerröjning, jordbruk, historia (652.09) @sv

URN:NBN:fi:au:hklj:654.109
alternative label: Työhevoset, työhevosten historia (654.109)
alternative label: Arbetshästar, arbetshästarnas historia (654.109) @sv

URN:NBN:fi:au:hklj:657.05
alternative label: Metsälehdet (657.05)
alternative label: Skogstidningar (657.05) @sv

URN:NBN:fi:au:hklj:657.09
alternative label: Jätkäperinne, metsänhoito, historia (657.09)
alternative label: Jätkät, metsänhoito, historia (657.09)
alternative label: Kämpät, metsätyöt, historia (657.09)
alternative label: Metsäkämpät, metsätyöt, historia (657.09)
alternative label: Tukinuitto, historia (657.09)
alternative label: Tukkikämpät, metsätyöt, historia (657.09)
alternative label: Tukkilaiset, metsätyöt, historia (657.09)
alternative label: Työhevoset, metsätyöt, historia (657.09)
alternative label: Uitto, historia (657.09)
alternative label: Arbetshästar, skogsarbeten, historia (657.09) @sv
alternative label: Baracker, skogsarbeten, historia (657.09) @sv
alternative label: Flottning, historia (657.09) @sv
alternative label: Folktradition, skogshuggare, skogsvård, historia (657.09) @sv
alternative label: Skogsarbetarbaracker, skogsarbeten, historia (657.09) @sv
alternative label: Skogshuggare, skogsvård, historia (657.09) @sv
alternative label: Timmerflottare, skogsarbeten, historia (657.09) @sv
alternative label: Timmerflottning, historia (657.09) @sv
alternative label: Timmerkojor, skogsarbeten, historia (657.09) @sv

URN:NBN:fi:au:hklj:658.109
alternative label: Tapporahat, metsästys, historia (658.109)
alternative label: Skottpengar, jakt, historia (658.109) @sv

URN:NBN:fi:au:hklj:658.209
alternative label: Valaanpyynti, historia (658.209)
alternative label: Valfångst, historia (658.209) @sv

URN:NBN:fi:au:hklj:660.09
alternative label: Pyramidit, rakennustekniikan historia (660.09)
alternative label: Rakennushistoria, rakennustekniikan historia (660.09)
alternative label: Byggnadshistoria, byggnadsteknikens historia (660.09) @sv
alternative label: Pyramider, byggnadsteknikens historia (660.09) @sv

URN:NBN:fi:au:hklj:671.31
alternative label: Terveysriskit, karsinogeenit (671.31)
alternative label: Terveysvaarat, karsinogeenit (671.31)
alternative label: Hälsofaror, karcinogener (671.31) @sv
alternative label: Hälsorisker, karcinogener (671.31) @sv

URN:NBN:fi:au:hklj:671.32
alternative label: Glykemisk belastning, diabetes (671.32) @sv
alternative label: Glykemiskt index, diabetes (671.32) @sv

URN:NBN:fi:au:hklj:671.8
alternative label: Äidinmaito, maitorauhasten fysiologia (671.8)
alternative label: Modersmjölk, mjölkkörtlarnas fysiologi (671.8) @sv
alternative label: Ultraljudsforskning, fosterforskning (671.8) @sv

URN:NBN:fi:au:hklj:672.03
alternative label: Tuoteluettelot (672.03)
alternative label: Tuoteluettelot, tavaraoppi (672.03)
alternative label: Produktkataloger (672.03) @sv
alternative label: Produktkataloger, varukunskap (672.03) @sv

URN:NBN:fi:au:hklj:674.05
alternative label: Toimintakertomukset, yritysten (674.05)
alternative label: Toimintasuunnitelmat, yritysten (674.05)
alternative label: Vuosikatsaukset, yritysten (674.05)
alternative label: Verksamhetsberättelser, företagens (674.05) @sv
alternative label: Verksamhetsplaner, företagens (674.05) @sv
alternative label: Årsöversikter, företagens (674.05) @sv

URN:NBN:fi:au:hklj:674.09
alternative label: Yrityshistoriikit (674.09)
alternative label: Företagshistoriker (674.09) @sv

URN:NBN:fi:au:hklj:674.205
alternative label: Budjetointi, yritykset, budjetit (674.205)
alternative label: Budgetering, företag, budgetar (674.205) @sv

URN:NBN:fi:au:hklj:675.709
alternative label: Kruunuvarastot, historia (675.709)
alternative label: Kronolager, historia (675.709) @sv

URN:NBN:fi:au:hklj:675.805
alternative label: Markkinointilehdet, markkinointi (675.805)
alternative label: Marknadsföringstidningar, marknadsföring (675.805) @sv

URN:NBN:fi:au:hklj:676.105
alternative label: Markkinointilehdet, mainonta (676.105)
alternative label: Marknadsföringstidningar, reklam (676.105) @sv

URN:NBN:fi:au:hklj:677.2
alternative label: Lentoturvallisuus, lentotaito (677.2)
alternative label: Flygsäkerhet, flygkunnighet (677.2) @sv

URN:NBN:fi:au:hklj:678.09
alternative label: Luotsiasemat, historia (678.09)
alternative label: Luotsilaitos, historia (678.09)
alternative label: Majakat, majakkalaitos, historia (678.09)
alternative label: Majakkalaitos, historia (678.09)
alternative label: Fyrar, fyrväsen, historia (678.09) @sv
alternative label: Fyrväsen, historia (678.09) @sv
alternative label: Lotsstationer, historia (678.09) @sv
alternative label: Lotsväsen, historia (678.09) @sv

URN:NBN:fi:au:hklj:679.03
alternative label: Ravintolaluettelot, ravintolatalous (679.03)
alternative label: Restaurangförteckningar, restaurangekonomi (679.03) @sv

URN:NBN:fi:au:hklj:680.5
alternative label: Sidonäringar, lantbrukets företagsekonomi (680.5) @sv

URN:NBN:fi:au:hklj:685
alternative label: Vaaratilanteet, tulvat (685)
alternative label: Faromoment, översvämningar (685) @sv

URN:NBN:fi:au:hklj:690.09
alternative label: Martat, historia (690.09)
alternative label: Marthor, historia (690.09) @sv

URN:NBN:fi:au:hklj:691.91
alternative label: Sampikalat, elintarviketeollisuus (691.91)
alternative label: Siitake, elintarviketeollisuus (691.91)
alternative label: Shiitake, livsmedelsindustri (691.91) @sv
alternative label: Störfiskar, livsmedelsindustri (691.91) @sv

URN:NBN:fi:au:hklj:694.91
alternative label: Jokirapu, elintarviketeollisuus (694.91)
alternative label: Rapu, elintarviketeollisuus (694.91)
alternative label: Sillikalat, elintarviketeollisuus (694.91)
alternative label: Sitrushedelmät, elintarviketeollisuus (694.91)
alternative label: Sitruuna, elintarviketeollisuus (694.91)
alternative label: Citron, livsmedelsindustri (694.91) @sv
alternative label: Citrusfrukter, livsmedelsindustri (694.91) @sv
alternative label: Flodkräfta, livsmedelsindustri (694.91) @sv
alternative label: Kräfta, djurart, livsmedelsindustri (694.91) @sv
alternative label: Sillfiskar, livsmedelsindustri (694.91) @sv

URN:NBN:fi:au:hklj:695.05
alternative label: Sisustuslehdet, kodinsisustus (695.05)
alternative label: Inredningstidningar, heminredning (695.05) @sv

URN:NBN:fi:au:hklj:697.61
alternative label: Mehiläisvaha, eläintiede (697.61)
alternative label: Bivax, zoologi (697.61) @sv

URN:NBN:fi:au:hklj:7.95
alternative label: Katalaanin kieli, kaunokirjallisuus (7.95)
alternative label: Katalanska, skönlitteratur (7.95) @sv

URN:NBN:fi:au:hklj:727.7
alternative label: Tiedontuotanto (727.7 +)
alternative label: Informationsproduktion (727.7 +) @sv

URN:NBN:fi:au:hklj:728.05
alternative label: Sisustuslehdet, julkiset tilat (728.05)
alternative label: Sisustuslehdet, sisustustaide (728.05)
alternative label: Inredningstidningar, inredningskonst (728.05) @sv
alternative label: Inredningstidningar, offentliga utrymmen (728.05) @sv

URN:NBN:fi:au:hklj:740.02
alternative label: Muinaisajan ihmiset, luolamaalaukset (740.02)
alternative label: Forntidens människor, grottmålningar (740.02) @sv

URN:NBN:fi:au:hklj:756.05
alternative label: Valokuvauslehdet (756.05 +)
alternative label: Fototidningar (756.05 +) @sv

URN:NBN:fi:au:hklj:762.03
alternative label: Hopeasepät, elämäkerralliset hakuteokset (762.03)
alternative label: Korutaiteilijat, elämäkerralliset hakuteokset (762.03)
alternative label: Sepät, hopea- ja kultasepät, hakuteokset (762.03)
alternative label: Silversmeder, biografiska uppslagsverk (762.03) @sv
alternative label: Smeder, silver- och guldsmeder, uppslagsverk (762.03) @sv
alternative label: Smyckekonstnärer, biografiska uppslagsverk (762.03) @sv

URN:NBN:fi:au:hklj:765.103
alternative label: Keraamikot, elämäkerralliset hakuteokset (765.103)
alternative label: Keramiikkataiteilijat, elämäkerralliset hakuteokset (765.103)
alternative label: Keramiker, biografiska uppslagsverk (765.103) @sv
alternative label: Keramikkonstnärer, biografiska uppslagsverk (765.103) @sv

URN:NBN:fi:au:hklj:774.1
alternative label: Bunraku (774.1)

URN:NBN:fi:au:hklj:777.05
alternative label: Elokuvalehdet (777.05)
alternative label: Filmtidskrifter (777.05) @sv

URN:NBN:fi:au:hklj:779.1
alternative label: Esiintymistaito, varietee (779.1)
alternative label: Förmåga att uppträda, varieté (779.1) @sv

URN:NBN:fi:au:hklj:780.03
alternative label: Konserttioppaat (780.03)
alternative label: Musiikin hakuteokset (780.03)
alternative label: Musiikkisanastot (780.03)
alternative label: Konsertguider (780.03) @sv
alternative label: Musikaliska uppslagsverk (780.03) @sv
alternative label: Musiklexikon (780.03) @sv

URN:NBN:fi:au:hklj:780.05
alternative label: Musiikkilehdet (780.05)
alternative label: Musiktidskrifter (780.05) @sv

URN:NBN:fi:au:hklj:780.609
alternative label: Konserttisalit, musiikin historia (780.609)
alternative label: Konserttitalot, musiikin historia (780.609)
alternative label: Konserthus, musikhistoria (780.609) @sv
alternative label: Konsertsalar, musikhistoria (780.609) @sv

URN:NBN:fi:au:hklj:782.703
alternative label: Kapellimestarit, elämäkerralliset hakuteokset (782.703)
alternative label: Musiikinjohtajat, elämäkerralliset hakuteokset (782.703)
alternative label: Dirigenter, biografiska uppslagsverk (782.703) @sv
alternative label: Kapellmästare, biografiska uppslagsverk (782.703) @sv

URN:NBN:fi:au:hklj:789.902
alternative label: Atonaalisuus, musiikin historia (789.902)
alternative label: Atonalitet, musikhistoria (789.902) @sv

URN:NBN:fi:au:hklj:790.083
alternative label: Ennätykset, urheilun tulos- ja tilastokirjat (790.083)
alternative label: Rekord, idrottens resultat- och statistikböcker (790.083) @sv

URN:NBN:fi:au:hklj:790.903
alternative label: Matrikkelit, urheilijat (790.903)
alternative label: Nimikirjat, urheilijat (790.903)
alternative label: Matriklar, matrikkelit, idrottare (790.903) @sv
alternative label: Matriklar, nimikirjat, idrottare (790.903) @sv

URN:NBN:fi:au:hklj:791.05
alternative label: Liikuntalehdet (791.05)
alternative label: Urheilulehdet (791.05)
alternative label: Motionstidningar (791.05) @sv
alternative label: Sporttidningar (791.05) @sv

URN:NBN:fi:au:hklj:791.09
alternative label: Järjestöhistoriikit, urheilujärjestöt (791.09)
alternative label: Organisationshistoriker, idrottsorganisationer (791.09) @sv

URN:NBN:fi:au:hklj:791.8105
alternative label: Autolehdet, autourheilulehdet (791.8105)
alternative label: Biltidningar, bilsporttidningar (791.8105) @sv

URN:NBN:fi:au:hklj:791.8109
alternative label: Autoilijat, autourheilijat (791.8109)
alternative label: Autoilijat, henkilöhistoria, urheilu (791.8109)
alternative label: Bilister, personhistoria, sport (791.8109) @sv
alternative label: Bilister, tävlingsförare (791.8109) @sv

URN:NBN:fi:au:hklj:792.09
alternative label: Voimistelijat, elämäkerrat ja muistelmat (792.09)
alternative label: Gymnaster, biografier och memoarer (792.09) @sv

URN:NBN:fi:au:hklj:796.09
alternative label: Maalivahdit, historia ja henkilöhistoria (796.09)
alternative label: Målvakter, historia och personhistoria (796.09) @sv

URN:NBN:fi:au:hklj:796.109
alternative label: Maalivahdit, jalkapallo, historia ja henkilöhistoria (796.109)
alternative label: Maalivahdit, jääkiekko, historia ja henkilöhistoria (796.109)
alternative label: Målvakter, fotboll, historia och personhistoria (796.109) @sv
alternative label: Målvakter, ishockey, historia och personhistoria (796.109) @sv

URN:NBN:fi:au:hklj:796.309
alternative label: Maalivahdit, muut palloilulajit, historia ja henkilöhistoria (796.309)
alternative label: Målvakter, andra bollgrenar, historia och personhistoria (796.309) @sv

URN:NBN:fi:au:hklj:797.109
alternative label: Legot, historia (797.109)
alternative label: Nallet, leikkikalujen historia (797.109)
alternative label: Nuket, historia (797.109)
alternative label: Pehmolelut, leikkikalujen historia (797.109)
alternative label: Teddykarhut, leikkikalujen historia (797.109)
alternative label: Tinasotilaat, historia (797.109)
alternative label: Dockor, historia (797.109) @sv
alternative label: Legor, historia (797.109) @sv
alternative label: Mjuka dockor, leksakernas historia (797.109) @sv
alternative label: Nallar, leksakernas historia (797.109) @sv
alternative label: Teddybjörnar, leksakernas historia (797.109) @sv
alternative label: Tennsoldater, historia (797.109) @sv

URN:NBN:fi:au:hklj:798.05
alternative label: Harrastelehdet (798.05)
alternative label: Hobbytidningar (798.05) @sv

URN:NBN:fi:au:hklj:798.205
alternative label: Pelilehdet (798.205)
alternative label: Speltidningar (798.205) @sv

URN:NBN:fi:au:hklj:798.405
alternative label: Ristikkolehdet (798.405)
alternative label: Korsordstidningar (798.405) @sv

URN:NBN:fi:au:hklj:799.09
alternative label: Tanssilavat, kulttuurihistoria (799.09)
alternative label: Tanssipaikat, kulttuurihistoria (799.09)
alternative label: Dansbanor, kulturhistoria (799.09) @sv
alternative label: Dansställen, kulturhistoria (799.09) @sv

URN:NBN:fi:au:hklj:799.109
alternative label: Eläintenkesyttäjät, elämäkerrat ja muistelmat (799.109)
alternative label: Esiintyjät, sirkustaiteilijat (799.109)
alternative label: Esiintyjät, varieteetaiteilijat (799.109)
alternative label: Esittäjät, sirkustaiteilijat (799.109)
alternative label: Fakiirit, elämäkerrat ja muistelmat (799.109)
alternative label: Imitaattorit , elämäkerrat ja muistelmat (799.109)
alternative label: Imitoijat, elämäkerrat ja muistelmat (799.109)
alternative label: Jonglöörit, elämäkerrat ja muistelmat (799.109)
alternative label: Kahlekuninkaat, elämäkerrat ja muistelmat (799.109)
alternative label: Klovnit, elämäkerrat ja muistelmat (799.109)
alternative label: Sirkukset, historia (799.109)
alternative label: Sirkus, historia (799.109)
alternative label: Sirkustaiteilijat, elämäkerrat ja muistelmat (799.109)
alternative label: Taikurit, elämäkerrat ja muistelmat (799.109)
alternative label: Trapetsitaiteilijat, elämäkerrat ja muistelmat (799.109)
alternative label: Trapetsitaiteilijat, sirkus, historia (799.109)
alternative label: Tulennielijät, elämäkerrat ja muistelmat (799.109)
alternative label: Tulennielijät, sirkus, historia (799.109)
alternative label: Cirkus, historia (799.109) @sv
alternative label: Cirkusar, historia (799.109) @sv
alternative label: Cirkuskonstnärer, biografier och memoarer (799.109) @sv
alternative label: Clowner, biografier och memoarer (799.109) @sv
alternative label: Djurtämjare, biografier och memoarer (799.109) @sv
alternative label: Eldslukare, biografier och memoarer (799.109) @sv
alternative label: Eldslukare, cirkus, historia (799.109) @sv
alternative label: Fakirer, biografier och memoarer (799.109) @sv
alternative label: Imitatorer, biografier och memoarer (799.109) @sv
alternative label: Jonglörer, biografier och memoarer (799.109) @sv
alternative label: Trapetskonstnärer, biografier och memoarer (799.109) @sv
alternative label: Trapetskonstnärer, cirkus, historia (799.109) @sv
alternative label: Trollkonstnärer, biografier och memoarer (799.109) @sv
alternative label: Uppträdande, esiintyjät, cirkuskonstnärer (799.109) @sv
alternative label: Uppträdande, esiintyjät, varietékonstnärer (799.109) @sv
alternative label: Uppträdande, esittäjät, cirkuskonstnärer (799.109) @sv
alternative label: Utbrytarkungar, biografier och memoarer (799.109) @sv

URN:NBN:fi:au:hklj:8.93
alternative label: Bulgarian kieli, kaunokirjallisuus (8.93)
alternative label: Bulgariska, skönlitteratur (8.93) @sv

URN:NBN:fi:au:hklj:8.96
alternative label: Sloveenin kieli, kaunokirjallisuus (8.96)
alternative label: Slovenska, skönlitteratur (8.96) @sv

URN:NBN:fi:au:hklj:8.99
alternative label: Valkovenäjän kieli, kaunokirjallisuus (8.99)
alternative label: Vitryska, skönlitteratur (8.99) @sv

URN:NBN:fi:au:hklj:803
alternative label: Fiktiiviset henkilöt, kirjallisuus, hakuteokset (803)
alternative label: Kuvitteelliset henkilöt, kirjallisuus, hakuteokset (803)
alternative label: Kääntäjät, elämäkerralliset hakuteokset, kaunokirjallisuuden kääntäjät (803)
alternative label: Fiktiva personer, litteratur, uppslagsverk (803) @sv
alternative label: Uppdiktade personer, litteratur, uppslagsverk (803) @sv
alternative label: Översättare, biografiska uppslagsverk, översättare av skönlitteratur (803) @sv

URN:NBN:fi:au:hklj:805.103
alternative label: Lastenkirjailijat, hakuteokset (805.103)
alternative label: Nuortenkirjailijat, hakuteokset (805.103)
alternative label: Barnboksförfattare, uppslagsverk (805.103) @sv
alternative label: Ungdomsförfattare, uppslagsverk (805.103) @sv

URN:NBN:fi:au:hklj:806
alternative label: Kiosklitteratur, litteraturforskning, finska (806 +) @sv

URN:NBN:fi:au:hklj:816.103
alternative label: Lastenkirjailijat, hakuteokset, suomi (816.103)
alternative label: Nuortenkirjailijat, hakuteokset, suomi (816.103)
alternative label: Barnboksförfattare, uppslagsverk, Finland (816.103) @sv
alternative label: Ungdomsförfattare, uppslagsverk, Finland (816.103) @sv

URN:NBN:fi:au:hklj:844.5
alternative label: Modukset, suomen kieli (844.5)
alternative label: Predikatiivi, suomen kieli (844.5)
alternative label: Predikativ, finska (844.5) @sv

URN:NBN:fi:au:hklj:850.084
alternative label: Murrekartat, kielitiede (850.084)
alternative label: Dialektkartor, lingvistik (850.084) @sv

URN:NBN:fi:au:hklj:850.703
alternative label: Kääntäjät, elämäkerralliset hakuteokset, tulkit ja kielenkääntäjät (850.703)
alternative label: Översättare, biografiska uppslagsverk, tolkar och översättare (850.703) @sv

URN:NBN:fi:au:hklj:857.03
alternative label: Etunimisanakirjat (857.03)
alternative label: Etymologiset sanakirjat (857.03)
alternative label: Henkilönnimet, sanakirjat (857.03)
alternative label: Merkkipäivät, nimipäivät (857.03)
alternative label: Nimenanto, nimisanakirjat (857.03)
alternative label: Nimet, nimisanakirjat (857.03)
alternative label: Nimipäiväsanakirjat (857.03)
alternative label: Nimistö, nimisanakirjat (857.03)
alternative label: Bemärkelsedagar, namnsdagar (857.03) @sv
alternative label: Etymologiska ordböcker (857.03) @sv
alternative label: Förnamnslexikon (857.03) @sv
alternative label: Namn, namnordböcker (857.03) @sv
alternative label: Namnbestånd, namnordböcker (857.03) @sv
alternative label: Namngivning, namnordböcker (857.03) @sv
alternative label: Namnsdagslexikon (857.03) @sv
alternative label: Personnamn, ordböcker (857.03) @sv

URN:NBN:fi:au:hklj:884.03
alternative label: Suomen kieli, sanakirjat, kaksikieliset (884.03)
alternative label: Finska, ordböcker, tvåspråkiga (884.03) @sv

URN:NBN:fi:au:hklj:884.6084
alternative label: Murrekartat, suomen kieli (884.6084)
alternative label: Dialektkartor, finska (884.6084) @sv

URN:NBN:fi:au:hklj:9.73
alternative label: Thain kieli, kaunokirjallisuus (9.73)
alternative label: Thailändska, skönlitteratur (9.73) @sv

URN:NBN:fi:au:hklj:9.75
alternative label: Khmerin kieli, kaunokirjallisuus (9.75)
alternative label: Khmeriska, skönlitteratur (9.75) @sv

URN:NBN:fi:au:hklj:9.9763
alternative label: Kannadan kieli (9.9763)
alternative label: Kannadan kieli, kaunokirjallisuus (9.9763)
alternative label: Kannada (9.9763) @sv
alternative label: Kannada, skönlitteratur (9.9763) @sv

URN:NBN:fi:au:hklj:911.603
alternative label: Kansallisliput, hakuteokset (911.603)
alternative label: Liput, hakuteokset (911.603)
alternative label: Vaakunat, aakkoselliset luettelot (911.603)
alternative label: Valtakuntien liput, aakkoselliset hakuteokset (911.603)
alternative label: Flaggor, uppslagsverk (911.603) @sv
alternative label: Nationalflaggor, uppslagsverk (911.603) @sv
alternative label: Nationsflaggor, alfabetiska uppslagsverk (911.603) @sv
alternative label: Vapen, heraldik, alfabetiska förteckningar (911.603) @sv

URN:NBN:fi:au:hklj:911.803
alternative label: Ansiomerkit, luettelot (911.803)
alternative label: Kunniamerkit, luettelot (911.803)
alternative label: Ordnar, förteckningar (911.803) @sv
alternative label: Utmärkelsetecken, förteckningar (911.803) @sv

URN:NBN:fi:au:hklj:004.09
alternative label: Kirjankustantajat, kustannusliikkeet, historia (004.09)
alternative label: Käsipaino, kirjapainotaito, historia (004.09)
alternative label: Bokförläggare, förlag, historia (004.09) @sv
alternative label: Handtryck, boktryck, boktryckarkonst, historia (004.09) @sv
related: Kirjoituksen historia. Paleografia. Epigrafia

URN:NBN:fi:au:hklj:006.09
alternative label: Kirjansidonta, historia (006.09)
alternative label: Kirjansidonta, kirjansidontataide, historia (006.09)
alternative label: Bokbinderi, bokbindarkonst, historia (006.09) @sv
alternative label: Bokbinderi, historia (006.09) @sv
related: Kirjan historia

URN:NBN:fi:au:hklj:1.2
alternative label: Antologiat, runot (1.2)
alternative label: Balladit, runot (1.2)
alternative label: Carmen figuratum, kaunokirjallisuus (1.2)
alternative label: Eeppiset runot, runot (1.2)
alternative label: Elegiat (1.2)
alternative label: Elegiat, runot (1.2)
alternative label: Eläinrunot, runot (1.2)
alternative label: Epigrammit (1.2)
alternative label: Faabelit, runot (1.2)
alternative label: Fabliaut, runot, kaunokirjallisuus (1.2)
alternative label: Haikut (1.2)
alternative label: Hakukonerunous, lyriikka (1.2)
alternative label: Hautakirjoitukset, runot (1.2)
alternative label: Intohimo, rakkausrunot (1.2)
alternative label: Iskelmälyriikka, ilman nuotteja (1.2)
alternative label: Iskelmäsanoitukset, ilman nuotteja (1.2)
alternative label: Kertomarunot, runot (1.2)
alternative label: Kirkkorunous, hengelliset runot (1.2)
alternative label: Kuvarunot, kaunokirjallisuus (1.2)
alternative label: Kuviorunot, kaunokirjallisuus (1.2)
alternative label: Lastenlorut, runot (1.2)
alternative label: Lastenrunot (1.2)
alternative label: Laululyriikka (1.2)
alternative label: Limerikit, runot (1.2)
alternative label: Lorut, runot (1.2)
alternative label: Lyriikka, kaunokirjallisuus (1.2)
alternative label: Messiadit, runot (1.2)
alternative label: Muistorunot, runot (1.2)
alternative label: Oodit, runot (1.2)
alternative label: Proosarunot, runot (1.2)
alternative label: Rakkausrunot (1.2)
alternative label: Ritarirunous, runot (1.2)
alternative label: Rocklyriikka, runot (1.2)
alternative label: Romanssit, runot (1.2)
alternative label: Runonlausunta, runonlausuntaesitysten taltioinnit (1.2)
alternative label: Runot, kaunokirjallisuus (1.2)
alternative label: Sanoitukset, runot (1.2)
alternative label: Sonetit, runot (1.2)
alternative label: Tankat, runot (1.2)
alternative label: Tilapäisrunot, runot (1.2)
alternative label: Uskonnolliset runot, runot (1.2)
alternative label: Värssyt, kaunokirjallisuus (1.2)
alternative label: Antologier, dikter (1.2) @sv
alternative label: Ballader, dikter (1.2) @sv
alternative label: Barnlyrik (1.2) @sv
alternative label: Barnramsor, dikter (1.2) @sv
alternative label: Berättande dikter, dikter (1.2) @sv
alternative label: Carmen figuratum, skönlitteratur (1.2) @sv
alternative label: Deklamation, recitationsföreställningars upptagningar (1.2) @sv
alternative label: Dikter, skönlitteratur (1.2) @sv
alternative label: Djurdikter, dikter (1.2) @sv
alternative label: Elegier (1.2) @sv
alternative label: Elegier, dikter (1.2) @sv
alternative label: Epigram (1.2) @sv
alternative label: Episka dikter, dikter (1.2) @sv
alternative label: Fabler, dikter (1.2) @sv
alternative label: Fabliau, dikter, skönlitteratur (1.2) @sv
alternative label: Figurativa dikter, skönlitteratur (1.2) @sv
alternative label: Figurdikter, skönlitteratur (1.2) @sv
alternative label: Gravskrifter, dikter (1.2) @sv
alternative label: Haikudikter (1.2) @sv
alternative label: Kyrkopoesi, andliga dikter (1.2) @sv
alternative label: Kärleksdikter (1.2) @sv
alternative label: Limerickar, dikter (1.2) @sv
alternative label: Lyrik, skönlitteratur (1.2) @sv
alternative label: Messiader, dikter (1.2) @sv
alternative label: Minnesverser, dikter (1.2) @sv
alternative label: Oden, dikter (1.2) @sv
alternative label: Passion, kärleksdikter (1.2) @sv
alternative label: Prosadikter, dikter (1.2) @sv
alternative label: Ramsor, dikter (1.2) @sv
alternative label: Religiös lyrik, dikter (1.2) @sv
alternative label: Riddardiktning, dikter (1.2) @sv
alternative label: Rocklyrik, dikter (1.2) @sv
alternative label: Romanser, dikter (1.2) @sv
alternative label: Schlagerlyrik, utan noter (1.2) @sv
alternative label: Schlagertexter, utan noter (1.2) @sv
alternative label: Sonetter, dikter (1.2) @sv
alternative label: Sånglyrik (1.2) @sv
related: URN:NBN:fi:au:hklj:1.79

URN:NBN:fi:au:hklj:1.5
alternative label: Kansankertomukset, murrekirjallisuus (1.5)
alternative label: Meänkieli, kaunokirjallisuus, murrekirjallisuus (1.5)
alternative label: Murrekirjallisuus, kaunokirjallinen (1.5)
alternative label: Pakinat, murrekirjallisuus (1.5)
alternative label: Slangi, murrekirjallisuus, kaunokirjallinen (1.5)
alternative label: Dialektlitteratur, skönlitterär (1.5) @sv
alternative label: Folkliga berättelser, dialektlitteratur (1.5) @sv
alternative label: Kåserier, dialektlitteratur (1.5) @sv
alternative label: Slang, dialektlitteratur, skönlitterär (1.5) @sv
alternative label: Tornedalsfinska, skönlitteratur, dialektlitteratur (1.5) @sv
related: Suomen kielen murteet

URN:NBN:fi:au:hklj:171.03
alternative label: Aforismit, aakkoselliset kokoelmat (171.03)
alternative label: Ajatelmat, aakkoselliset kokoelmat (171.03)
alternative label: Iskulauseet, aakkoselliset kokoelmat (171.03)
alternative label: Lentävät lauseet, aakkoselliset kokoelmat (171.03)
alternative label: Mietelauseet, aakkoselliset kokoelmat (171.03)
alternative label: Mietelmät, aakkoselliset kokoelmat (171.03)
alternative label: Siivekkäät sanat, aakkoselliset kokoelmat (171.03)
alternative label: Sitaatit, aakkoselliset kokoelmat (171.03)
alternative label: Slogaanit, aakkoselliset kokoelmat (171.03)
alternative label: Sloganit, aakkoselliset kokoelmat (171.03)
alternative label: Aforismer, alfabetiska samlingar (171.03) @sv
alternative label: Bevingade citat, alfabetiska samlingar (171.03) @sv
alternative label: Bevingade ord, alfabetiska samlingar (171.03) @sv
alternative label: Citat, alfabetiska samlingar (171.03) @sv
alternative label: Maximer, alfabetiska samlingar (171.03) @sv
alternative label: Sentenser, alfabetiska samlingar (171.03) @sv
alternative label: Slagord, alfabetiska samlingar (171.03) @sv
alternative label: Slogan, alfabetiska samlingar (171.03) @sv
alternative label: Sloganer, alfabetiska samlingar (171.03) @sv
alternative label: Tänkespråk, alfabetiska samlingar (171.03) @sv
related: Mietelausekokoelmat. Sitaattikokoelmat

URN:NBN:fi:au:hklj:183.109
alternative label: Kiertokoulu, historia (183.109)
alternative label: Kinkerit, historia (183.109)
alternative label: Pedagogiot, historia (183.109)
alternative label: Triviaalikoulut, historia (183.109)
alternative label: Valmistava koulu, historia (183.109)
alternative label: Ambulerande skola, historia (183.109) @sv
alternative label: Förberedande skola, historia (183.109) @sv
alternative label: Läsförhör, historia (183.109) @sv
alternative label: Pedagogier, historia (183.109) @sv
alternative label: Trivialskolor, historia (183.109) @sv
related: Historialliset koulumuodot

URN:NBN:fi:au:hklj:183.409
alternative label: Kansakoulu, historia (183.409)
alternative label: Kansalaiskoulu, historia (183.409)
alternative label: Kyläkoulut, perus- ja kansakoulujen historia (183.409)
alternative label: Yhtenäiskoulut, historia (183.409)
alternative label: Byskolor, grund- och folkskolornas historia (183.409) @sv
alternative label: Enhetsskolor, historia (183.409) @sv
alternative label: Folkskolan, historia (183.409) @sv
alternative label: Medborgarskolan, historia (183.409) @sv
related: Peruskoulut

URN:NBN:fi:au:hklj:183.809
alternative label: Summerhill, koulu, historia (183.809)
alternative label: Summerhill, skola, historia (183.809) @sv
related: Erikoiskoulut. Kokeilukoulut

URN:NBN:fi:au:hklj:183.909
alternative label: Poikakoulut, muiden maiden koulut, historia (183.909)
alternative label: Pojkskolor, övriga länders skolor, historia (183.909) @sv
related: Muiden maiden koululaitokset

URN:NBN:fi:au:hklj:2.8
alternative label: Tanskan kieli, kaunokirjallisuus (2.8 +)
alternative label: Danska, skönlitteratur (2.8 +) @sv
related: Tanskankielisen kirjallisuuden historia ja tutkimus

URN:NBN:fi:au:hklj:2.9
alternative label: Norjan kieli, kaunokirjallisuus (2.9 +)
alternative label: Norska, skönlitteratur (2.9 +) @sv
related: Norjankielisen kirjallisuuden historia ja tutkimus

URN:NBN:fi:au:hklj:2.98
alternative label: Islannin kieli, kaunokirjallisuus (2.98)
alternative label: Isländska, skönlitteratur (2.98) @sv
related: Islanninkielisen kirjallisuuden historia ja tutkimus

URN:NBN:fi:au:hklj:2.99
alternative label: Fäärin kieli, kaunokirjallisuus (2.99)
alternative label: Färöiska, skönlitteratur (2.99) @sv
related: Tanskankielisen kirjallisuuden historia ja tutkimus

URN:NBN:fi:au:hklj:221.09
alternative label: Kumranin kirjoitukset (221.09)
alternative label: Kuolleenmeren kirjoitukset (221.09)
alternative label: Kuolleenmeren löydöt, raamatunhistoria (221.09)
alternative label: Qumran, raamatunhistoria (221.09)
alternative label: Qumranin kirjoitukset (221.09)
alternative label: Dödahavsfynd, biblisk historia (221.09) @sv
alternative label: Dödahavsrullarna (221.09) @sv
alternative label: Qumran, bibelhistoria (221.09) @sv
alternative label: Qumranhandskrifterna (221.09) @sv
alternative label: Qumranskrifterna (221.09) @sv
related: Vanha Testamentti

URN:NBN:fi:au:hklj:230.09
alternative label: Dogmihistoria, kristinusko (230.09)
alternative label: Dogmhistoria, kristendom (230.09) @sv
related: KRISTILLINEN DOGMATIIKKA

URN:NBN:fi:au:hklj:261.09
alternative label: Kirkkohistoria, itämaiset kirkot (261.09)
alternative label: Koptilainen kirkko, historia (261.09)
alternative label: Koptiska kyrkan, historia (261.09) @sv
alternative label: Kyrkohistoria, österländska kyrkor (261.09) @sv
related: Itämaiset kirkot

URN:NBN:fi:au:hklj:262.09
alternative label: Aneet, katolinen kirkko, historia (262.09)
alternative label: Benediktiinit, munkkijärjestöt, historia (262.09)
alternative label: Birgittalaiset, nunnajärjestöt, historia (262.09)
alternative label: Dominikaanit, munkkijärjestöt, historia (262.09)
alternative label: Esireformatoriset liikkeet, katolisen kirkon historia (262.09)
alternative label: Fransiskaanit, munkkijärjestöt, historia (262.09)
alternative label: Hagiografia, pyhimykset, katolinen kirkko (262.09)
alternative label: Hussilaiset, katolisen kirkon historia (262.09)
alternative label: Inkvisitio, katolisen kirkon historia (262.09)
alternative label: Kardinaalit, katolinen kirkko, historia (262.09)
alternative label: Kartusiaanit, munkkijärjestöt, historia (262.09)
alternative label: Kerjäläismunkistot, katolinen kirkko, historia (262.09)
alternative label: Kerjäläisveljeskunnat, katolinen kirkko, historia (262.09)
alternative label: Kerjäläisveljestöt, katolinen kirkko, historia (262.09)
alternative label: Kirkkohistoria, roomalaiskatolinen kirkko (262.09)
alternative label: Luostarilaitos, katolinen, historia (262.09)
alternative label: Luostarit, katoliset, historia (262.09)
alternative label: Marttyyrit, katolisen kirkon historia (262.09)
alternative label: Monte Cassinon luostari, luostarit, katoliset, historia (262.09)
alternative label: Munkkijärjestöt, katoliset, historia (262.09)
alternative label: Mystikot, katolinen kirkko, historia (262.09)
alternative label: Nunnajärjestöt, katoliset, historia (262.09)
alternative label: Paavit, katolinen kirkko, historia (262.09)
alternative label: Paavius, roomalaiskatolinen kirkko, historia (262.09)
alternative label: Pannaanjulistaminen, historia (262.09)
alternative label: Patriarkat, katolinen kirkko, historia (262.09)
alternative label: Pyhimykset, katoliset, historia (262.09)
alternative label: Pyhät henkilöt, katoliset, historia (262.09)
alternative label: Ristiretket, katolisen kirkon historia (262.09)
alternative label: Roomalaiskatolinen kirkko, historia (262.09)
alternative label: Sääntökunnat, katolinen kirkko, historia (262.09)
alternative label: Vastauskonpuhdistus, katolisen kirkon historia (262.09)
alternative label: Vatikaani, katolinen kirkko, historia (262.09)
alternative label: Veljeskunnat, katoliset, historia (262.09)
alternative label: Avlat, katolska kyrkan, historia (262.09) @sv
alternative label: Bannlysning, historia (262.09) @sv
alternative label: Benediktiner, munkordnar, historia (262.09) @sv
alternative label: Birgittiner, nunneordnar, historia (262.09) @sv
alternative label: Brödraskap, munkordnar, historia (262.09) @sv
alternative label: Dominikaner, munkordnar, historia (262.09) @sv
alternative label: Franciskaner, munkordnar, historia (262.09) @sv
alternative label: Förreformatoriska rörelser, katolska kyrkans historia (262.09) @sv
alternative label: Hagiografi, helgonen, den katolska kyrkan (262.09) @sv
alternative label: Helgon, katolska, historia (262.09) @sv
alternative label: Heliga personer, katolska, historia (262.09) @sv
alternative label: Hussiter, katolska kyrkans historia (262.09) @sv
alternative label: Inkvisitionen, katolska kyrkans historia (262.09) @sv
alternative label: Kardinaler, katolska kyrkan, historia (262.09) @sv
alternative label: Kartusianer, munkordnar, historia (262.09) @sv
alternative label: Kloster, romersk-katolska, historia (262.09) @sv
alternative label: Klosterväsen, romersk-katolskt, historia (262.09) @sv
alternative label: Korståg, katolska kyrkans historia (262.09) @sv
alternative label: Kyrkohistoria, romersk-katolska kyrkan (262.09) @sv
alternative label: Martyrer, katolska kyrkans historia (262.09) @sv
alternative label: Monte Cassino, kloster, romersk-katolska, historia (262.09) @sv
alternative label: Motreformationen, katolska kyrkans historia (262.09) @sv
alternative label: Munkordnar, romersk-katolska, historia (262.09) @sv
alternative label: Mystiker, romersk-katolska kyrkan, historia (262.09) @sv
alternative label: Nunneordnar, katolska, historia (262.09) @sv
alternative label: Patriarker, katolska kyrkan, historia (262.09) @sv
alternative label: Påvar, katolska kyrkan, historia (262.09) @sv
alternative label: Påvedöme, romersk-katolska kyrkan, historia (262.09) @sv
alternative label: Religiösa orden, katolska kyrkan, historia (262.09) @sv
alternative label: Romersk-katolska kyrkan, historia (262.09) @sv
alternative label: Tiggarmunkar, katolska kyrkan, historia (262.09) @sv
alternative label: Tiggarmunkordnar, katolska kyrkan, historia (262.09) @sv
alternative label: Tiggarorden, katolska kyrkan, historia (262.09) @sv
alternative label: Vatikanen, katolska kyrkan, historia (262.09) @sv
related: Roomalaiskatolinen kirkko

URN:NBN:fi:au:hklj:263.09
alternative label: Hagiografia, pyhimykset, ortodoksinen kirkko (263.09)
alternative label: Ikonoklasmi, ortodoksisuus, historia (263.09)
alternative label: Kerjäläismunkistot, ortodoksinen kirkko, historia (263.09)
alternative label: Kerjäläisveljeskunnat, ortodoksinen kirkko, historia (263.09)
alternative label: Kerjäläisveljestöt, ortodoksinen kirkko, historia (263.09)
alternative label: Kirkkohistoria, ortodoksinen kirkko (263.09)
alternative label: Kreikkalaiskatolinen kirkko, historia (263.09)
alternative label: Kuvainraasto, ortodoksisuus, historia (263.09)
alternative label: Luostarilaitos, ortodoksinen, historia (263.09)
alternative label: Luostarit, ortodoksiset, historia (263.09)
alternative label: Munkkijärjestöt, ortodoksiset, historia (263.09)
alternative label: Mystikot, ortodoksinen kirkko, historia (263.09)
alternative label: Nunnajärjestöt, ortodoksiset, historia (263.09)
alternative label: Ortodoksinen kirkko, historia (263.09)
alternative label: Patriarkat, ortodoksinen kirkko, historia (263.09)
alternative label: Pyhimykset, ortodoksiset, historia (263.09)
alternative label: Pyhät henkilöt, ortodoksiset, historia (263.09)
alternative label: Pyhät, ortodoksiset, historia (263.09)
alternative label: Veljeskunnat, ortodoksiset, historia (263.09)
alternative label: Bildstormning, ortodoxi, historia (263.09) @sv
alternative label: Brödraskap, ortodoxa, historia (263.09) @sv
alternative label: Grekisk-katolska kyrkan, historia (263.09) @sv
alternative label: Hagiografi, helgonen, den ortodoxa kyrkan (263.09) @sv
alternative label: Helgon, ortodoxa, historia (263.09) @sv
alternative label: Heliga personer, ortodoxa, historia (263.09) @sv
alternative label: Ikonoklasm, ortodoxi, historia (263.09) @sv
alternative label: Kloster, ortodoxa, historia (263.09) @sv
alternative label: Klosterväsen, ortodoxt, historia (263.09) @sv
alternative label: Kyrkohistoria, ortodoxa kyrkan (263.09) @sv
alternative label: Munkordnar, ortodoxa, historia (263.09) @sv
alternative label: Mystiker, ortodoxa kyrkan, historia (263.09) @sv
alternative label: Nunneordnar, ortodoxa, historia (263.09) @sv
alternative label: Ortodoxa kyrkan, historia (263.09) @sv
alternative label: Patriarker, ortodoxa kyrkan, historia (263.09) @sv
alternative label: Tiggarmunkar, ortodoxa kyrkan, historia (263.09) @sv
alternative label: Tiggarmunkordnar, ortodoxa kyrkan, historia (263.09) @sv
alternative label: Tiggarorden, ortodoxa kyrkan, historia (263.09) @sv
related: Ortodoksinen kirkko

URN:NBN:fi:au:hklj:265.09
alternative label: Hugenotit, protestantit, historia (265.09)
alternative label: Kirkkohistoria, protestanttiset kirkot (265.09)
alternative label: Hugenotter, protestanter, historia (265.09) @sv
alternative label: Kyrkohistoria, protestantiska kyrkor (265.09) @sv
related: Protestanttiset kirkot ja yhteisöt

URN:NBN:fi:au:hklj:269.09
alternative label: Kirkkohistoria, muut kirkot ja yhteisöt (269.09)
alternative label: Kyrkohistoria, övriga kyrkor och samfund (269.09) @sv
related: Muut kristillisperäiset yhteisöt

URN:NBN:fi:au:hklj:3.8
alternative label: Flaamin kieli, kaunokirjallisuus (3.8)
alternative label: Hollannin kieli, kaunokirjallisuus (3.8)
alternative label: Flamländska, skönlitteratur (3.8) @sv
alternative label: Holländska, skönlitteratur (3.8) @sv
related: Hollanninkielisen kirjallisuuden historia ja tutkimus

URN:NBN:fi:au:hklj:3.89
alternative label: Afrikaansin kieli, kaunokirjallisuus (3.89)
alternative label: Afrikaans, skönlitteratur (3.89) @sv
related: Hollanninkielisen kirjallisuuden historia ja tutkimus

URN:NBN:fi:au:hklj:3.9
alternative label: Jiddisin kieli, kaunokirjallisuus (3.9)
alternative label: Jiddisch, skönlitteratur (3.9) @sv
related: Saksankielisen kirjallisuuden historia ja tutkimus

URN:NBN:fi:au:hklj:312.109
alternative label: Historiallinen demografia (312.109)
alternative label: Historiallinen väestötiede (312.109)
alternative label: Väestöhistoria (312.109)
alternative label: Historisk demografi (312.109) @sv
related: Väestötiede. Väestöpolitiikka

URN:NBN:fi:au:hklj:320.09
alternative label: Politiikan historia (320.09)
alternative label: Politikens historia (320.09) @sv
related: URN:NBN:fi:au:hklj:320

URN:NBN:fi:au:hklj:321.09
alternative label: Demokratia, valtiojärjestelmät, historia (321.09)
alternative label: Demokratisoituminen, valtiojärjestelmät, historia (321.09)
alternative label: Diktaattorit, diktatuurin historia (321.09)
alternative label: Diktatuuri, diktatuurin historia (321.09)
alternative label: Itsevaltius, itsevaltiuden historia (321.09)
alternative label: Kansallisvaltio, kansallisvaltion historia (321.09)
alternative label: Kansallisvaltiot, kansallisvaltion historia (321.09)
alternative label: Monarkia, valtiomuotojen historia (321.09)
alternative label: Sotilasdiktatuuri, sotilasdiktatuurit, historia (321.09)
alternative label: Sotilashallinto, historia (321.09)
alternative label: Sotilashallitukset, sotilashallit. historia (321.09)
alternative label: Yksinvalta, valtiomuotojen historia (321.09)
alternative label: Autokrati, autokratins historia (321.09) @sv
alternative label: Demokrati, statssystem, historia (321.09) @sv
alternative label: Demokratisering, statssystem, historia (321.09) @sv
alternative label: Diktatorer, diktaturens historia (321.09) @sv
alternative label: Diktatur, diktaturens historia (321.09) @sv
alternative label: Envälde, statsskickens historia (321.09) @sv
alternative label: Militärdiktatur, militärdiktaturer, historia (321.09) @sv
alternative label: Militärförvaltning , historia (321.09) @sv
alternative label: Militärregeringar, militärreg. historia (321.09) @sv
alternative label: Monarki, statsskickens historia (321.09) @sv
alternative label: Nationalstat, nationalstatens historia (321.09) @sv
alternative label: Nationalstater, nationalstatens historia (321.09) @sv
related: Valtiofilosofia. Valtiomuodot

URN:NBN:fi:au:hklj:323.09
alternative label: Keskitysleirit, historia (323.09)
alternative label: Siirtoleirit, vankileirit, historia (323.09)
alternative label: Vankileirit, historia (323.09)
alternative label: Fångläger, historia (323.09) @sv
alternative label: Interneringsläger, fångläger, historia (323.09) @sv
alternative label: Koncentrationsläger, historia (323.09) @sv
related: URN:NBN:fi:au:hklj:323

URN:NBN:fi:au:hklj:323.109
alternative label: Aboriginaalit, Australia, rotukysymykset, historia (323.109)
alternative label: Afroamerikkalaiset, rotukysymykset, historia (323.109)
alternative label: Apartheid, aparteheidin historia (323.109)
alternative label: Etelä-Afrikan tasavalta, apartheidin historia (323.109)
alternative label: Ghetot, juutalaisten historia (323.109)
alternative label: Monikulttuurinen avioliitto, rotukysymys, historia (323.109)
alternative label: Mustat muslimit, historia (323.109)
alternative label: Mustat pantterit, historia (323.109)
alternative label: Rasismi, apartheid, historia (323.109)
alternative label: Rasismi, rasismi, historia (323.109)
alternative label: Rotuerottelu, rotuerottelun historia (323.109)
alternative label: Rotuhygienia, historia (323.109)
alternative label: Rotusorto, rotusorron historia (323.109)
alternative label: Rotusyrjintä, rotusyrjinnän historia (323.109)
alternative label: Seka-avioliitto, rotukysymys, historia (323.109)
alternative label: Vankileirit, juutalaisvainot (323.109)
alternative label: Värilliset, apartheid, historia (323.109)
alternative label: Värilliset, rotujen asema, historia (323.109)
alternative label: Aboriginer, Australien, rasfrågor, historia (323.109) @sv
alternative label: Afroamerikaner, rasfrågor, historia (323.109) @sv
alternative label: Apartheid, apartheids historia (323.109) @sv
alternative label: Blandäktenskap, rasfrågan, historia (323.109) @sv
alternative label: Färgade, apartheid, historia (323.109) @sv
alternative label: Färgade, rasernas ställning, historia (323.109) @sv
alternative label: Fångläger, judeförföljelser (323.109) @sv
alternative label: Ghetton, judarnas historia (323.109) @sv
alternative label: Mångkulturellt äktenskap, rasfrågan, historia (323.109) @sv
alternative label: Rasdiskriminering, rasdiskrimineringens historia (323.109) @sv
alternative label: Rasförtryck, rasförtryckets historia (323.109) @sv
alternative label: Rashygien, historia (323.109) @sv
alternative label: Rasism, apartheid, historia (323.109) @sv
alternative label: Rasism, rasism, historia (323.109) @sv
alternative label: Rassegregation, rassegregationens historia (323.109) @sv
alternative label: Svarta muslimer, historia (323.109) @sv
alternative label: Svarta pantrar, historia (323.109) @sv
alternative label: Sydafrikanska republiken, apartheids historia (323.109) @sv
related: Rotujen asema. Rotusyrjintä

URN:NBN:fi:au:hklj:323.309
alternative label: Poliittiset vainot, historia (323.309)
alternative label: Politiska förföljelser, historia (323.309) @sv
related: Poliittiset ja aatteelliset vähemmistöt

URN:NBN:fi:au:hklj:323.909
alternative label: Ihmiskauppa, orjuus, historia (323.909)
alternative label: Orjakauppa, orjuus, historia (323.909)
alternative label: Orjat, orjuus, historia (323.909)
alternative label: Orjayhteiskunnat, historia, orjuus, historia (323.909)
alternative label: Orjuus, historia (323.909)
alternative label: Vapautuneet orjat, orjuus, historia (323.909)
alternative label: Värilliset, orjuus, historia (323.909)
alternative label: Frigivna slavar, slaveri, historia (323.909) @sv
alternative label: Färgade, slaveri, historia (323.909) @sv
alternative label: Människohandel, slaveri, historia (323.909) @sv
alternative label: Slavar, slaveri, historia (323.909) @sv
alternative label: Slaveri, historia (323.909) @sv
alternative label: Slavhandel, slaveri, historia (323.909) @sv
alternative label: Slavsamhällen, historia, slaveri, historia (323.909) @sv
related: Orjuus

URN:NBN:fi:au:hklj:324.109
alternative label: Agitaattorit, puoluehistoriat, Suomi (324.109)
alternative label: DEVA, historia (324.109)
alternative label: Demokraattinen vaihtoehto, historia (324.109)
alternative label: IKL, historia (324.109)
alternative label: Järjestöhistoriikit, puolueet, Suomi (324.109)
alternative label: Kansallinen Kokoomus, historia (324.109)
alternative label: Keskustapuolue, Suomi, historia (324.109)
alternative label: Kokoomuspuolue, historia (324.109)
alternative label: Kommunistinen puolue, Suomi, historia (324.109)
alternative label: Kommunistipuolueet, Suomi, historia (324.109)
alternative label: Kommunistiset puolueet, Suomi, historia (324.109)
alternative label: Kristillinen liitto, historia (324.109)
alternative label: Kristillis-demokraattiset puolueet, Suomi, historia (324.109)
alternative label: Kristillisdemokraattiset puolueet, Suomi, historia (324.109)
alternative label: Lapuanliike, historia (324.109)
alternative label: Liberaalinen kansanpuolue, historia (324.109)
alternative label: Maalaisliitto, historia (324.109)
alternative label: Nuorsuomalainen puolue, historia (324.109)
alternative label: Perustuslaillinen oikeistopuolue, historia (324.109)
alternative label: Poliittinen historia, puoluehistoriat, Suomi (324.109)
alternative label: Poliittiset puolueet, historia, Suomi (324.109)
alternative label: Porvarilliset puolueet, Suomi, historia (324.109)
alternative label: Puolueet, Suomi, historia (324.109)
alternative label: Ruotsalainen kansanpuolue, historia (324.109)
alternative label: Sosiaalidemokraattiset puolueet, Suomi, historia (324.109)
alternative label: Sosialidemokraattiset puolueet, Suomi, historia (324.109)
alternative label: Sosialistinen työväenpuolue, historia (324.109)
alternative label: Sosialistiset puolueet, Suomi, historia (324.109)
alternative label: Suomen Kansan Demokraattinen Liitto, historia (324.109)
alternative label: Suomen Kommunistinen Puolue, historia (324.109)
alternative label: Suomen Kristillinen Liitto, historia (324.109)
alternative label: Suomen Maaseudun Puolue, historia (324.109)
alternative label: Suomen Sosiaalidemokraattinen Puolue, historia (324.109)
alternative label: Svenska Folkpartiet, historia (324.109)
alternative label: Työväenpuolueet, Suomi, historia (324.109)
alternative label: Uskonnolliset puolueet , Suomi, historia (324.109)
alternative label: Uskontopuolueet , Suomi, historia (324.109)
alternative label: Vanhasuomalainen puolue, historia (324.109)
alternative label: Vasemmistoliitto, historia (324.109)
alternative label: Vihreä liitto, historia (324.109)
alternative label: Ympäristöliikkeet, Vihreä liitto, historia (324.109)
alternative label: Agitatorer, partihistoriker, Finland (324.109) @sv
alternative label: Agrarförbundet, historia (324.109) @sv
alternative label: Arbetarpartier, Finland, historia (324.109) @sv
alternative label: Borgerliga partier, Finland, historia (324.109) @sv
alternative label: Centerpartiet, Finland, historia (324.109) @sv
alternative label: Demokratiska förbundet för Finlands folk, historia (324.109) @sv
alternative label: Demokratiskt alternativ, historia (324.109) @sv
alternative label: Finlands Kommunistiska Parti, historia (324.109) @sv
alternative label: Finlands Kristliga förbund, historia (324.109) @sv
alternative label: Finlands Socialdemokratiska Parti, historia (324.109) @sv
alternative label: Finska landsbygdspartiet, historia (324.109) @sv
alternative label: Gammalfinska partiet, historia (324.109) @sv
alternative label: Gröna förbundet, historia (324.109) @sv
alternative label: Kommunistiska partier, Finland, historia (324.109) @sv
alternative label: Kommunistiska partiet, Finland, historia (324.109) @sv
alternative label: Kommunistpartier, Finland, historia (324.109) @sv
alternative label: Konstitutionella högerpartiet, historia (324.109) @sv
alternative label: Krist-demokratiska partier, Finland, historia (324.109) @sv
alternative label: Kristdemokratiska partier, Finland, historia (324.109) @sv
alternative label: Kristliga förbundet, historia (324.109) @sv
alternative label: Lapporörelsen, historia (324.109) @sv
alternative label: Liberala folkpartiet, historia (324.109) @sv
alternative label: Miljörörelser, Gröna förbundet, historia (324.109) @sv
alternative label: Nationella Samlingspartiet, historia (324.109) @sv
alternative label: Organisationshistoriker, partier, Finland (324.109) @sv
alternative label: Partier, Finland, historia (324.109) @sv
alternative label: Politisk historia, partihistoriker, Finland (324.109) @sv
alternative label: Politiska partier, historia, Finland (324.109) @sv
alternative label: Religiösa partier, Finland, historia (324.109) @sv
alternative label: Samlingspartiet, historia (324.109) @sv
alternative label: Socialdemokratiska partier, Finland, historia (324.109) @sv
alternative label: Socialistiska arbetarpartiet, historia (324.109) @sv
alternative label: Socialistiska partier, Finland, historia (324.109) @sv
alternative label: Svenska Folkpartiet, Ruotsalainen kansanpuolue, historia (324.109) @sv
alternative label: Svenska Folkpartiet, Svenska folkpartiet, historia (324.109) @sv
alternative label: Ungfinska partiet, historia (324.109) @sv
alternative label: Vänsterförbundet, historia (324.109) @sv
related: Suomi

URN:NBN:fi:au:hklj:326.409
alternative label: Kansainliitto, historia (326.409)
alternative label: YK, alajärjestöt, historia (326.409)
alternative label: YK, historia (326.409)
alternative label: YK, rauhanturvajoukot, historia (326.409)
alternative label: Yhdistyneet Kansakunnat, alajärjestöt, historia (326.409)
alternative label: Yhdistyneet Kansakunnat, historia (326.409)
alternative label: Yhdistyneet Kansakunnat, rauhanturvajoukot, historia (326.409)
alternative label: FN, fredsbevarande trupper, historia (326.409) @sv
alternative label: FN, historia (326.409) @sv
alternative label: FN, underorganisationer, historia (326.409) @sv
alternative label: Förenta Nationerna, fredsbevarande trupper, historia (326.409) @sv
alternative label: Förenta Nationerna, historia (326.409) @sv
alternative label: Förenta Nationerna, underorganisationer, historia (326.409) @sv
alternative label: Nationernas förbund, historia (326.409) @sv
related: Yhdistyneet Kansakunnat

URN:NBN:fi:au:hklj:327.09
alternative label: Eduskunta, Suomen eduskunta, historia (327.09)
alternative label: Eduskuntavaalit, historia (327.09)
alternative label: Maapäivät, valtiojärjestelmät, Suomi, historia (327.09)
alternative label: Senaatit, Suomi, historia (327.09)
alternative label: Säätyjen edustajat, valtiojärjestelmät, Suomi, historia (327.09)
alternative label: Säätyvaltiopäivät, valtiojärjestelmät, Suomi, historia (327.09)
alternative label: Talonpoikaissääty, valtiopäivät, historia (327.09)
alternative label: Talonpojat, valtiopäivät, historia (327.09)
alternative label: Toimitusministeristöt, Suomen valtiojärjestelmä, historia (327.09)
alternative label: Valtiohistoria, valtiojärjestelmät, Suomi (327.09)
alternative label: Bondeståndet, riksdag, historia (327.09) @sv
alternative label: Bönder, riksdag, historia (327.09) @sv
alternative label: Lantdag, statssystem, Finland, historia (327.09) @sv
alternative label: Riksdagen, Finlands riksdag, historia (327.09) @sv
alternative label: Riksdagsval, historia (327.09) @sv
alternative label: Senater, Finland, historia (327.09) @sv
alternative label: Ständernas representer, statssystem, Finland, historia (327.09) @sv
alternative label: Ståndsriksdag, statssystem, Finland, historia (327.09) @sv
related: Suomen valtiojärjestelmä

URN:NBN:fi:au:hklj:328.09
alternative label: Senaatit, muut maat, historia (328.09)
alternative label: Säätyjen edustajat, valtiojärjestelmät, muut maat, historia (328.09)
alternative label: Säätyvaltiopäivät, valtiojärjestelmät, muut maat, historia (328.09)
alternative label: Valtiohistoria, valtiojärjestelmät, muut maat (328.09)
alternative label: Senater, övriga länder, historia (328.09) @sv
alternative label: Ständernas representer, statssystem, övriga länder, historia (328.09) @sv
alternative label: Ståndsriksdag, statssystem, övriga länder. historia (328.09) @sv
related: Muiden maiden valtiojärjestelmät

URN:NBN:fi:au:hklj:332.505
alternative label: Korkein oikeus, vuosikirjat (332.505)
alternative label: Ratkaisut, korkein oikeus (332.505)
alternative label: Högsta domstolen, årsböcker (332.505) @sv
alternative label: Lösningar, problem, högsta domstolen (332.505) @sv
related: Prosessioikeus. Oikeushallinto

URN:NBN:fi:au:hklj:337.05
alternative label: Säädöskokoelmat, Suomi ja EU (337.05)
alternative label: Författningssamlingar, Finland och EU (337.05) @sv
related: Suomen ja Euroopan Unionin laki- ja asetuskokoelmat

URN:NBN:fi:au:hklj:363.05
alternative label: Budjetit, valtiontalous (363.05)
alternative label: Budjetointi, valtio, budjetit (363.05)
alternative label: Hallituksen esitykset, valtion talousarviot (363.05)
alternative label: Kestävyysvaje, valtion talousarviot (363.05)
alternative label: Suunnittelu, budjetit, valtion (363.05)
alternative label: Talousarviot, valtiontalous (363.05)
alternative label: Tulo- ja menoarviot, valtiontalous (363.05)
alternative label: Valtion talousarviot (363.05)
alternative label: Valtion tulo- ja menoarviot (363.05)
alternative label: Vuorovaikutteinen suunnittelu, budjetit, valtion (363.05)
alternative label: Yhteissuunnittelu, budjetit, valtion (363.05)
alternative label: Yhteisöllinen suunnittelu, budjetit, valtion (363.05)
alternative label: Budgeter, budjetit, statsfinanser (363.05) @sv
alternative label: Budgeter, talousarviot, statsfinanser (363.05) @sv
alternative label: Budgeter, tulo- ja menoarviot, statsfinanser (363.05) @sv
alternative label: Budgetering, staten, budgetar (363.05) @sv
alternative label: Gemensam planering, budgetar, staten (363.05) @sv
alternative label: Hållbarhetsunderskott, statsbudgeter (363.05) @sv
alternative label: Interaktiv planering, budgetar, staten (363.05) @sv
alternative label: Planering, budgetar, staten (363.05) @sv
alternative label: Regeringspropositioner, statsbudgeter (363.05) @sv
alternative label: Samplanering, budgetar, staten (363.05) @sv
alternative label: Statens budgeter (363.05) @sv
alternative label: Statsbudgeter (363.05) @sv
related: URN:NBN:fi:au:hklj:363

URN:NBN:fi:au:hklj:371.09
alternative label: Huutolaiset, sosiaalipolitiikan historia (371.09)
alternative label: Köyhäinapu, sosiaalipolitiikan historia (371.09)
alternative label: Köyhäinhoito, sosiaalipolitiikan historia (371.09)
alternative label: Sosiaalihistoria, sosiaalipolitiikan historia (371.09)
alternative label: Vaivaishoito, sosiaalipolitiikan historia (371.09)
alternative label: Fattighjälp, socialpolitikens historia (371.09) @sv
alternative label: Fattigvård, socialpolitikens historia (371.09) @sv
alternative label: Rotehjon, socialpolitikens historia (371.09) @sv
alternative label: Socialhistoria, socialpolitikens historia (371.09) @sv
alternative label: Vård av fattiga, socialpolitikens historia (371.09) @sv
related: URN:NBN:fi:au:hklj:371

URN:NBN:fi:au:hklj:371.209
alternative label: Asutushistoria (371.209)
alternative label: Asutuspolitiikka, historia (371.209)
alternative label: Asutusrakenne, asutushistoria (371.209)
alternative label: Asutustilat, asutushistoria (371.209)
alternative label: Halkominen, maapolitiikka, historia (371.209)
alternative label: Isojako, maapolitiikan historia (371.209)
alternative label: Jakolaitos, maapolitiikka, historia (371.209)
alternative label: Jakotoimitus, maapolitiikka, historia (371.209)
alternative label: Kruununmaat, historia (371.209)
alternative label: Kruununtilat, maanjaon historia (371.209)
alternative label: Kuninkaankartanot, maanjaon historia (371.209)
alternative label: Lahjoitusmaat, historia (371.209)
alternative label: Latokartanot, maanjaon historia (371.209)
alternative label: Lohkominen, maapolitiikka, historia (371.209)
alternative label: Loisväki, maapolitiikka, historia (371.209)
alternative label: Maanjako, historia (371.209)
alternative label: Maanomistajat, maapolitiikka, historia (371.209)
alternative label: Maanomistus, maapolitiikka, historia (371.209)
alternative label: Maapolitiikka, historia (371.209)
alternative label: Maareformi, historia (371.209)
alternative label: Manttaali, maaomistuksen historia (371.209)
alternative label: Puustellit, historia (371.209)
alternative label: Ratsutilat, maanjaon historia (371.209)
alternative label: Reduktio, maapolitiikan historia (371.209)
alternative label: Ruodut, maapolitikan historia (371.209)
alternative label: Ruotujakolaitos, maapolitiikan historia (371.209)
alternative label: Ruotutorpat, maanjaon historia (371.209)
alternative label: Rusthollit, maanjaon historia (371.209)
alternative label: Rälssitilat, maapolitiikan historia (371.209)
alternative label: Sarkajako, maanjaon historia (371.209)
alternative label: Sotilastorpat, maanjaon historia (371.209)
alternative label: Säteritilat, maapolitiikan historia (371.209)
alternative label: Talolliset, maapolitiikka, historia (371.209)
alternative label: Tilakoko, maapolitiikka, historia (371.209)
alternative label: Tilalliset, maapolitiikka, historia (371.209)
alternative label: Tilaton väestö, maapolitiikka, historia (371.209)
alternative label: Tilattomat, maapolitiikka, historia (371.209)
alternative label: Tilukset, maapolitiikan historia (371.209)
alternative label: Torpat, torpparilaitos (371.209)
alternative label: Torpparilaitos (371.209)
alternative label: Torpparit, torpparilaitos (371.209)
alternative label: Uudisasukkaat, asutuspolitiikan historia (371.209)
alternative label: Uudisasutus, asutuspolitiikan historia (371.209)
alternative label: Uudisraivaus, asutuspolitiikan historia (371.209)
alternative label: Uudistilat, asutuspolitiikan historia (371.209)
alternative label: Uusjako, maanjako, historia (371.209)
alternative label: Yksityismaat, maanomistus, maapolitiikka, historia (371.209)
alternative label: Bebyggelsens struktur, kolonisationshistoria (371.209) @sv
alternative label: Boställen, historia (371.209) @sv
alternative label: Donationsjord, historia (371.209) @sv
alternative label: Frälsehemman, jordpolitikens historia (371.209) @sv
alternative label: Gårdsägare, jordpolitik, historia (371.209) @sv
alternative label: Hemmansstorlek, jordpolitik, historia (371.209) @sv
alternative label: Hemmansägare, jordpolitik, historia (371.209) @sv
alternative label: Indelningsverket, jordpolitikens historia (371.209) @sv
alternative label: Indelningsväsen, jordpolitik, historia (371.209) @sv
alternative label: Inhysingar, markpolitik, historia (371.209) @sv
alternative label: Jorddelning, historia (371.209) @sv
alternative label: Jordinnehav, markpolitik, historia (371.209) @sv
alternative label: Jordreform, historia (371.209) @sv
alternative label: Jordägare, markpolitik, historia (371.209) @sv
alternative label: Klyvning, markpolitik, historia (371.209) @sv
alternative label: Kolonisationshistoria (371.209) @sv
alternative label: Kolonisationslägenheter, kolonisationshistoria (371.209) @sv
alternative label: Kolonisationspolitik, historia (371.209) @sv
alternative label: Kronogods, jorddelningens historia (371.209) @sv
alternative label: Kronojord, historia (371.209) @sv
alternative label: Kungsgårdar, jorddelningens historia (371.209) @sv
alternative label: Kungsladugårdar, jorddelningens historia (371.209) @sv
alternative label: Mantal, jordägandets historia (371.209) @sv
alternative label: Markpolitik, historia (371.209) @sv
alternative label: Nybyggare, kolonisationspolitikens historia (371.209) @sv
alternative label: Nybyggarhemman, kolonisationspolitikens historia (371.209) @sv
alternative label: Nybyggarsamhälle, kolonisationspolitikens historia (371.209) @sv
alternative label: Nyröjning, kolonisationspolitikens historia (371.209) @sv
alternative label: Nyskifte, jorddelning, historia (371.209) @sv
alternative label: Obesutten befolkning, jordpolitik, historia (371.209) @sv
alternative label: Privat mark, jordinnehav, markpolitik, historia (371.209) @sv
alternative label: Reduktion, jordpolitikens historia (371.209) @sv
related: Maapolitiikka

URN:NBN:fi:au:hklj:377.109
alternative label: Internationaalit, työväenliikkeen historia (377.109)
alternative label: Työväenkulttuuri, työväenliike, historia (377.109)
alternative label: Työväenliike, historia (377.109)
alternative label: Työväenperinne, työväenliike, historia (377.109)
alternative label: Työväentalot, työväenliike, historia (377.109)
alternative label: Työväenyhdistykset, historia (377.109)
alternative label: Arbetarföreningar, historia (377.109) @sv
alternative label: Arbetarkultur, arbetarrörelsen, historia (377.109) @sv
alternative label: Arbetarrörelsen, historia (377.109) @sv
alternative label: Arbetartradition, arbetarrörelsen, historia (377.109) @sv
alternative label: Folkets hus, arbetarrörelsen, historia (377.109) @sv
alternative label: Internationaler, arbetarrörelsens historia (377.109) @sv
related: Työväenliike

URN:NBN:fi:au:hklj:377.209
alternative label: Ammatilliset keskusjärjestöt, historia (377.209)
alternative label: Ammattialajärjestöt, historia (377.209)
alternative label: Ammattijärjestöt, historia (377.209)
alternative label: Ammattiliitot, historia (377.209)
alternative label: Ammattiyhdistykset, historia (377.209)
alternative label: Järjestöhistoriikit, työmarkkinajärjestöt (377.209)
alternative label: Lakot, historia (377.209)
alternative label: Toimihenkilöyhdistykset, historia (377.209)
alternative label: Työntekijäjärjestöt, historia (377.209)
alternative label: Valtakunnansovittelijat, työtaistelut, historia (377.209)
alternative label: Yleislakot, historia (377.209)
alternative label: Arbetstagarorganisationer, historia (377.209) @sv
alternative label: Branschorganisationer, historia (377.209) @sv
alternative label: Fackförbund, historia (377.209) @sv
alternative label: Fackföreningar, historia (377.209) @sv
alternative label: Fackliga centralorganisationer, historia (377.209) @sv
alternative label: Fackorganisationer, historia (377.209) @sv
alternative label: Generalstrejker, historia (377.209) @sv
alternative label: Organisationshistoriker, arbetsmarknadsorganisationer (377.209) @sv
alternative label: Riksförlikningsmän, arbetskonflikter, historia (377.209) @sv
alternative label: Strejker, historia (377.209) @sv
alternative label: Tjänstemannaföreningar, historia (377.209) @sv
related: Työmarkkinajärjestöt

URN:NBN:fi:au:hklj:377.709
alternative label: Järjestöhistoriikit, nuorisoseuratoiminta (377.709)
alternative label: Organisationshistoriker, ungdomsföreningar (377.709) @sv
related: Nuorisoseuratoiminta

URN:NBN:fi:au:hklj:377.809
alternative label: Järjestöhistoriikit, partioliike (377.809)
alternative label: Organisationshistoriker, scoutrörelsen (377.809) @sv
related: Partioliike

URN:NBN:fi:au:hklj:380.03
alternative label: Aikataulut (380.03)
alternative label: Tidtabeller (380.03) @sv
related: URN:NBN:fi:au:hklj:380

URN:NBN:fi:au:hklj:384.103
alternative label: Postinumeroluettelot (384.103)
alternative label: Postiosoitteet, osoitehakemistot (384.103)
alternative label: Postitoimipaikat, luettelot (384.103)
alternative label: Postadresser, adressregister (384.103) @sv
alternative label: Postanstalter, kataloger (384.103) @sv
alternative label: Postnummerkataloger (384.103) @sv
related: Posti

URN:NBN:fi:au:hklj:384.109
alternative label: Postihistoria (384.109)
alternative label: Posthistoria (384.109) @sv
related: Posti

URN:NBN:fi:au:hklj:384.1103
alternative label: Yhteystiedot, osoitehakemistot (384.1103)
alternative label: Kontaktinformation, adressregister (384.1103) @sv
related: Elämäkerralliset hakuteokset

URN:NBN:fi:au:hklj:385.03
alternative label: Aikataulut, maaliikenne (385.03)
alternative label: Bussiliikenne, maaliikenne, aikataulut (385.03)
alternative label: Linja-autoaikataulut (385.03)
alternative label: Linja-autoliikenne, maaliikenne, aikataulut (385.03)
alternative label: Busstidtabeller (385.03) @sv
alternative label: Busstrafik, landtrafik, tidtabeller (385.03) @sv
alternative label: Linjebiltrafik, landtrafik, tidtabeller (385.03) @sv
alternative label: Tidtabeller, landtrafik (385.03) @sv
related: Maaliikenne

URN:NBN:fi:au:hklj:385.09
alternative label: Auto-onnettomuudet, liikenteen historia (385.09)
alternative label: Junaliikenne, historia (385.09)
alternative label: Karavaanit, maaliikenteen historia (385.09)
alternative label: Liikennekuolemat, maaliikenteen historia (385.09)
alternative label: Liikenneonnettomuudet, maaliikenteen historia (385.09)
alternative label: Museotiet, maaliikenne, historia (385.09)
alternative label: Onnettomuudet, liikenneonnettomuuksien historia (385.09)
alternative label: Rautatieliikenne, historia (385.09)
alternative label: Valtionrautatiet, historia (385.09)
alternative label: Bilolyckor, trafikhistoria (385.09) @sv
alternative label: Järnvägstrafik, historia (385.09) @sv
alternative label: Karavaner, landtrafikens historia (385.09) @sv
alternative label: Museivägar, landtrafik, historia (385.09) @sv
alternative label: Olyckor, trafikolyckornas historia (385.09) @sv
alternative label: Statens Järnvägar, historia (385.09) @sv
alternative label: Trafikdödade, landtrafikens historia (385.09) @sv
alternative label: Trafikolyckor, landtrafikens historia (385.09) @sv
alternative label: Tågtrafik, historia (385.09) @sv
related: Maaliikenne

URN:NBN:fi:au:hklj:386.203
alternative label: Aikataulut, lentoliikenne (386.203)
alternative label: Lentoliikenne, aikataulut (386.203)
alternative label: Flygtrafik, tidtabeller (386.203) @sv
alternative label: Tidtabeller, flygtrafik (386.203) @sv
related: Ilmaliikenne. Ilmailu

URN:NBN:fi:au:hklj:386.209
alternative label: Helikopterit, lentoliikenteen historia (386.209)
alternative label: Ilmailu, historia (386.209)
alternative label: Ilmaliikenne, historia (386.209)
alternative label: Joukkotuho, lento-onnettomuudet, historia (386.209)
alternative label: Katastrofit, lento-onnettomuudet, historia (386.209)
alternative label: Lento-onnettomuudet, historia (386.209)
alternative label: Lentoliikenne, historia (386.209)
alternative label: Mustat laatikot, lento-onnettomuudet, historia (386.209)
alternative label: Onnettomuudet, lento-onnettomuuksien historia (386.209)
alternative label: Siviili-ilmailu, historia (386.209)
alternative label: Suuronnettomuudet, lento-onnettomuudet, historia (386.209)
alternative label: Civilflyg, historia (386.209) @sv
alternative label: Flygolyckor, historia (386.209) @sv
alternative label: Flygtrafik, historia (386.209) @sv
alternative label: Helikoptrar, flygtrafikens historia (386.209) @sv
alternative label: Katastrofer, flygolyckor, historia (386.209) @sv
alternative label: Luftfart, historia (386.209) @sv
alternative label: Lufttrafik, historia (386.209) @sv
alternative label: Massförstörelse, flygolyckor, historia (386.209) @sv
alternative label: Olyckor, flygolyckornas historia (386.209) @sv
alternative label: Storolyckor, flygolyckor, historia (386.209) @sv
alternative label: Svarta lådor, flygolyckor, historia (386.209) @sv
related: Ilmaliikenne. Ilmailu

URN:NBN:fi:au:hklj:387.03
alternative label: Aikataulut, paikallisliikenne (387.03)
alternative label: Tidtabeller, lokaltrafik (387.03) @sv
related: Paikallisliikenne

URN:NBN:fi:au:hklj:387.09
alternative label: Auto-onnettomuudet, paikallisliikenteen historia (387.09)
alternative label: Bilolyckor, lokaltrafikens historia (387.09) @sv
related: Paikallisliikenne

URN:NBN:fi:au:hklj:387.1103
alternative label: Aikataulut, paikallisliikenne, pääkaupunkiseutu (387.1103)
alternative label: Tidtabeller, lokaltrafik, huvudstadsregionen (387.1103) @sv
related: Helsinki. Pääkaupunkiseutu

URN:NBN:fi:au:hklj:390.09
alternative label: Sotatiede, historia (390.09)
alternative label: Krigsvetenskap, historia (390.09) @sv
related: URN:NBN:fi:au:hklj:390

URN:NBN:fi:au:hklj:394.09
alternative label: Etniset puhdistukset, sotarikokset, historia (394.09)
alternative label: Evakot, siirtoväen historia (394.09)
alternative label: Hirtto, sotarikokset, historia (394.09)
alternative label: Hirttäminen, sotarikokset, historia (394.09)
alternative label: Joukkomurha, sotarikokset, historia (394.09)
alternative label: Joukkotuho, sotarikokset, historia (394.09)
alternative label: Joukkotuhonta, sotarikokset, historia (394.09)
alternative label: Jälleenrakennus, historia (394.09)
alternative label: Jälleenrakentaminen, historia (394.09)
alternative label: Kansanhuolto, historia (394.09)
alternative label: Kansanmurha, sotarikokset, historia (394.09)
alternative label: Karkaaminen, sotavangit, historia (394.09)
alternative label: Keskitysleirit, sotavankeus, historia (394.09)
alternative label: Kivittäminen, sotarikokset, historia (394.09)
alternative label: Kivitys, sotarikokset, historia (394.09)
alternative label: Korvaukset, sotakorvaukset, historia (394.09)
alternative label: Korvikkeet, historia (394.09)
alternative label: Kotirintama, historia (394.09)
alternative label: Maahanmuuttajat, siirtoväki, historia (394.09)
alternative label: Maahanmuuttajat, sotapakolaisuus, historia (394.09)
alternative label: Maanpako, sotapakolaisuus, historia (394.09)
alternative label: Mestaus, sotarikokset, historia (394.09)
alternative label: Pakkosiirrot, sotien vaikutukset, historia (394.09)
alternative label: Pakkotyö, sotavankeus, historia (394.09)
alternative label: Pako, sotavangit, historia (394.09)
alternative label: Pakolaiset, sotapakolaisuus, historia (394.09)
alternative label: Pakolaisuus, evakot, historia (394.09)
alternative label: Panttivangit, sotarikokset, historia (394.09)
alternative label: Pommitukset, historia (394.09)
alternative label: Rikos ihmisyyttä vastaan, sotarikokset, historia (394.09)
alternative label: Rintamakarkuruus, historia (394.09)
alternative label: Siirtolaiset, siirtoväki, historia (394.09)
alternative label: Siirtolaiset, sotapakolaisuus, historia (394.09)
alternative label: Siirtoseurakunnat, sotien vaikutukset siviiliväestöön (394.09)
alternative label: Siirtoväki, historia (394.09)
alternative label: Siviiliväestö, asema sodassa, historia (394.09)
alternative label: Sota-aika, siviiliväestön asema, historia (394.09)
alternative label: Sotainvalidijärjestöt, historia (394.09)
alternative label: Sotakorvaukset, sotakorvausten historia (394.09)
alternative label: Sotalapset, sotalapset, historia (394.09)
alternative label: Sotalesket, sotalesket, historia (394.09)
alternative label: Sotaorvot, sotalapset, historia (394.09)
alternative label: Sotapakolaiset, sotalapset, historia (394.09)
alternative label: Sotarikokset, sotarikokset, historia (394.09)
alternative label: Sotarikolliset , sotarikokset, historia (394.09)
alternative label: Sotasyyllisyys, historia (394.09)
alternative label: Sotatila, siviiliväestön asema, historia (394.09)
alternative label: Sotavahingot, historia (394.09)
alternative label: Sotavangit, historia (394.09)
alternative label: Sotien yhteiskunnalliset vaikutukset, sotien vaikutusten historia (394.09)
alternative label: Sotilaskarkuruus, historia (394.09)
alternative label: Sotilasrikokset, historia (394.09)
alternative label: Säännöstely, sota-aika, historia (394.09)
alternative label: Teloitus, sotarikokset, historia (394.09)
alternative label: Vankileirit, sotavankeus, historia (394.09)
alternative label: Väestönsiirrot, sotien vaikutukset, historia (394.09)
alternative label: Väestösiirrot, sotien vaikutukset, historia (394.09)
alternative label: Ydinsota, siviiliväestön asema, historia (394.09)
alternative label: Avrättning, krigsförbrytelser, historia (394.09) @sv
alternative label: Befolkningsomflyttningar, krigens verkningar, historia (394.09) @sv
alternative label: Bombningar, historia (394.09) @sv
alternative label: Brott mot mänskligheten, krigsförbrytelser, historia (394.09) @sv
alternative label: Civilbefolkning, ställning under krig, historia (394.09) @sv
alternative label: Desertering, historia (394.09) @sv
alternative label: Ersättningar, krigsskadestånd, historia (394.09) @sv
alternative label: Etniska rensningar, krigsförbrytelser, historia (394.09) @sv
alternative label: Evakuerad befolkning, evakuerades historia (394.09) @sv
alternative label: Fanflykt, historia (394.09) @sv
alternative label: Flykt, krigsfångar, historia (394.09) @sv
alternative label: Flyktingar, krigsflyktingskap, historia (394.09) @sv
alternative label: Flyktingskap, evakuerad befolkning, historia (394.09) @sv
alternative label: Folkförsörjningen, historia (394.09) @sv
alternative label: Folkmord, krigsförbrytelser, historia (394.09) @sv
alternative label: Fångläger, krigsförbrytelser, historia (394.09) @sv
alternative label: Förflyttad befolkning, historia (394.09) @sv
alternative label: Förflyttade församlingar, krigens verkningar på civilbefolkningen (394.09) @sv
alternative label: Genocid, krigsförbrytelser, historia (394.09) @sv
alternative label: Gisslan, krigsförbrytelser, historia (394.09) @sv
alternative label: Halshuggning, krigsförbrytelser, historia (394.09) @sv
related: Sotien yhteiskunnalliset vaikutukset

URN:NBN:fi:au:hklj:398.09
alternative label: Divisioonat , muiden maiden armeijat (398.09)
alternative label: Joukko-osastot, muut maat, historia (398.09)
alternative label: Joukkueet, muut maat, historia (398.09)
alternative label: Kasarmit, muut maat, historia (398.09)
alternative label: Kenttätykistö, muut maat, historia (398.09)
alternative label: Kertausharjoitukset, muut maat, historia (398.09)
alternative label: Komppaniat, muiden maiden armeijat (398.09)
alternative label: Kotiutus, sotilaat, muiden maiden armeijat, historia (398.09)
alternative label: Liikekannallepano, muut maat, historia (398.09)
alternative label: Maanpuolustusjärjestöt, muut maat, historia (398.09)
alternative label: Maavoimat, muut maat, historia (398.09)
alternative label: Merivoimat, muut maat, historia (398.09)
alternative label: Mobilisaatio, muiden maiden armeijat, historia (398.09)
alternative label: Moottoroidut joukot, muut maat, historia (398.09)
alternative label: Muukalaislegioona, Ranskan armeija, historia (398.09)
alternative label: Palkka-armeijat, historia (398.09)
alternative label: Prikaatit, muut maat, historia (398.09)
alternative label: Puna-armeija, historia (398.09)
alternative label: Puolustusvoimat, muut maat, historia (398.09)
alternative label: Rakuunat, muiden maiden armeijat, historia (398.09)
alternative label: Ratsuväki, muut maat, historia (398.09)
alternative label: Ruodut, historia, Ruotsi (398.09)
alternative label: Ruotuarmeijat, historia, Ruotsi (398.09)
alternative label: Ruotujakolaitos, historia, Ruotsi (398.09)
alternative label: Ruotusotilaat, historia, Ruotsi (398.09)
alternative label: Rykmentit, muiden maiden armeijat (398.09)
alternative label: Santarmit, muiden maiden armeijat, historia (398.09)
alternative label: Sotaväenotto, muiden maiden armeijat, historia (398.09)
alternative label: Sotilasilmailu, ilmavoimat, historia, muut maat (398.09)
alternative label: Vapaaehtoinen maanpuolustustyö, muut maat, historia (398.09)
alternative label: Varuskunnat, muut maat, historia (398.09)
alternative label: Viihdytystoiminta, muuiden maiden armeijat, historia (398.09)
alternative label: Väenotto, muiden maiden armeijat, historia (398.09)
alternative label: Brigader, övriga länder, historia (398.09) @sv
alternative label: Divisioner, övriga länders arméer (398.09) @sv
alternative label: Dragoner, övriga länders arméer, historia (398.09) @sv
alternative label: Frivilligt försvarsarbete, övriga länder, historia (398.09) @sv
alternative label: Främlingslegionen, franska armén, historia (398.09) @sv
alternative label: Fältartilleri, övriga länder, historia (398.09) @sv
alternative label: Fältartister, övriga länders arméer, historia (398.09) @sv
alternative label: Försvarsmakten, övriga länder, historia (398.09) @sv
alternative label: Försvarsorganisationer, övriga länder, historia (398.09) @sv
alternative label: Garnisoner, övriga länder, historia (398.09) @sv
alternative label: Hemförlovning, soldater, övriga länders arméer, historia (398.09) @sv
alternative label: Indelningsverket, historia, Sverige (398.09) @sv
alternative label: Indelta arméer, historia, Sverige (398.09) @sv
alternative label: Kaserner, övriga länder, historia (398.09) @sv
alternative label: Kavalleri, övriga länder, historia (398.09) @sv
alternative label: Kompanier, övriga länders arméer (398.09) @sv
alternative label: Landstridskrafter, övriga länder, historia (398.09) @sv
alternative label: Legotrupper, historia (398.09) @sv
alternative label: Marinen, övriga länder, historia (398.09) @sv
alternative label: Militärflyg, flygvapnet, historia, andra länder (398.09) @sv
alternative label: Mobilisation, övriga länders arméer, historia (398.09) @sv
alternative label: Mobilisering, övriga länders arméer, historia (398.09) @sv
alternative label: Motoriserade trupper, övriga länder, historia (398.09) @sv
alternative label: Plutoner, övriga länder, historia (398.09) @sv
alternative label: Regementen, övriga länders arméer (398.09) @sv
alternative label: Repetitionsövningar, övriga länder, historia (398.09) @sv
alternative label: Rotar, historia, Sverige (398.09) @sv
alternative label: Rotesoldater, historia, Sverige (398.09) @sv
alternative label: Röda armén, historia (398.09) @sv
alternative label: Truppförband, övriga länder, historia (398.09) @sv
alternative label: Utskrivning av krigsfolk, övriga länders arméer, historia (398.09) @sv
alternative label: Utskrivning av soldater, övriga länders arméer, historia (398.09) @sv
related: Muiden maiden puolustusvoimat

URN:NBN:fi:au:hklj:461.03
alternative label: Campingalueluettelot (461.03)
alternative label: Hostellit, retkeilymajaluettelot (461.03)
alternative label: Hotelliluettelot (461.03)
alternative label: Hotellit, hotelliluettelot (461.03)
alternative label: Kesäkodit, lomakotiluettelot (461.03)
alternative label: Kylpylähotellit, hotelliluettelot (461.03)
alternative label: Leirintäalueet, leirintäalueluettelot (461.03)
alternative label: Lepokodit, lomakotiluettelot (461.03)
alternative label: Lomakodit, lomakotiluettelot (461.03)
alternative label: Lomakylät, lomakyläluettelot (461.03)
alternative label: Matkustajakodit, matkustajakotiluettelot (461.03)
alternative label: Motelliluettelot (461.03)
alternative label: Motellit, motelliluettelot (461.03)
alternative label: Museot, museo-oppaat, aakkoselliset (461.03)
alternative label: Ravintolaluettelot, matkaoppaat (461.03)
alternative label: Retkeily, leirintäalueluettelot (461.03)
alternative label: Retkeilymajat, retkeilymajaluettelot (461.03)
alternative label: Telttailu, leirintäalueluettelot (461.03)
alternative label: Ulkoilumajat, ulkoilumajaluettelot (461.03)
alternative label: Badhotell, hotellkataloger (461.03) @sv
alternative label: Campingområden, campingområden, kataloger (461.03) @sv
alternative label: Campingområden, förteckningar (461.03) @sv
alternative label: Friluftsstugor, friluftsstugor, kataloger (461.03) @sv
alternative label: Hotell, hotellkataloger (461.03) @sv
alternative label: Hotellkataloger (461.03) @sv
alternative label: Motell, motellförteckningar (461.03) @sv
alternative label: Motellförteckningar (461.03) @sv
alternative label: Museer, museiguider, alfabetiska (461.03) @sv
alternative label: Resandehem, resandehem (461.03) @sv
alternative label: Restaurangförteckningar, resehandböcker (461.03) @sv
alternative label: Semesterhem, kataloger över semesterhem (461.03) @sv
alternative label: Sommarhem, semesterhemskataloger (461.03) @sv
alternative label: Strövtåg, förteckningar över campingplatser (461.03) @sv
alternative label: Stugbyar, stugbyförteckningar (461.03) @sv
alternative label: Turisthärbärgen, vandrarhem, kataloger (461.03) @sv
alternative label: Tältning, förteckningar över campingplatser (461.03) @sv
alternative label: Vandrarhem, vandrarhem, kataloger (461.03) @sv
alternative label: Vilohem, kataloger över semesterhem (461.03) @sv
related: Yleiset matkaoppaat

URN:NBN:fi:au:hklj:520.09
alternative label: Arkeoastronomia, astronomia, historia (520.09)
alternative label: Astronomia, historia (520.09)
alternative label: Pallotähtitiede, tähtitiede, historia. (520.09)
alternative label: Tähtitiede, historia (520.09)
alternative label: Arkeoastronomi, astronomi, historia (520.09) @sv
alternative label: Astronomi, historia (520.09) @sv
alternative label: Sfärisk astronomii, stellarastronomi, historia (520.09) @sv
alternative label: Stellarastronomi, historia (520.09) @sv
related: TÄHTITIEDE

URN:NBN:fi:au:hklj:529.09
alternative label: Avaruuslennot, historia (529.09)
alternative label: Avaruusmatkat, historia (529.09)
alternative label: Kuu, kuulennot, historia (529.09)
alternative label: Kuulennot, historia (529.09)
alternative label: Kuumatkat, historia (529.09)
alternative label: Kuututkimus, kuulennot, historia (529.09)
alternative label: Miehitetyt avaruuslennot, historia (529.09)
alternative label: Bemannade rymdfärder, historia (529.09) @sv
alternative label: Månen, månflygningar, historia (529.09) @sv
alternative label: Månflygningar, historia (529.09) @sv
alternative label: Månforskning, månflygningar, historia (529.09) @sv
alternative label: Månfärder, historia (529.09) @sv
alternative label: Rymdflygningar, historia (529.09) @sv
alternative label: Rymdfärder, historia (529.09) @sv
related: Avaruustutkimus. Avaruuslennot. Avaruusteknologia

URN:NBN:fi:au:hklj:613.1083
alternative label: Kaloritaulukot (613.1083)
alternative label: Ruoka-aineiden kalorimäärät, kaloritaulukot (613.1083)
alternative label: Ruoka-ainetaulukot (613.1083)
alternative label: Födoämnenas kalorier, kaloritabeller (613.1083) @sv
alternative label: Födoämnestabeller (613.1083) @sv
alternative label: Kaloritabeller (613.1083) @sv
related: URN:NBN:fi:au:hklj:613.1

URN:NBN:fi:au:hklj:624.209
alternative label: Kadut, kadut, historia (624.209)
alternative label: Liikenneyhteydet, tiet, historia (624.209)
alternative label: Maantiet, historia (624.209)
alternative label: Museotiet (624.209)
alternative label: Museotiet, tienrakennus, historia (624.209)
alternative label: Museotiet, tiet, historia (624.209)
alternative label: Soratiet, tiet, historia (624.209)
alternative label: Tiet, tiet, historia (624.209)
alternative label: Gator, gator, historia (624.209) @sv
alternative label: Grusvägar, vägar, historia (624.209) @sv
alternative label: Landsvägar, historia (624.209) @sv
alternative label: Museivägar (624.209) @sv
alternative label: Museivägar, vägar, historia (624.209) @sv
alternative label: Museivägar, vägbyggnad, historia (624.209) @sv
alternative label: Trafikförbindelser, vägar, historia (624.209) @sv
alternative label: Vägar, vägar, historia (624.209) @sv
related: Tiet. Kadut. Tienrakennus. Kadunrakennus

URN:NBN:fi:au:hklj:624.409
alternative label: Idän pikajuna, junat, historia (624.409)
alternative label: Junanvaunut, historia (624.409)
alternative label: Junat, kulkuvälineet, historia (624.409)
alternative label: Junavaunut, historia (624.409)
alternative label: Museojunat, kulkuvälineet, historia (624.409)
alternative label: Museorautatiet, rautatiet, historia (624.409)
alternative label: Museoveturit, kulkuvälineet, historia (624.409)
alternative label: Rautatievaunut, historia (624.409)
alternative label: Veturit, kulkuvälineet, historia (624.409)
alternative label: Lok, färdmedel, historia (624.409) @sv
alternative label: Museijärnvägar, järnvägar, historia (624.409) @sv
alternative label: Museilok, färdmedel, historia (624.409) @sv
alternative label: Museitåg, färdmedel, historia (624.409) @sv
alternative label: Orientexpressen, tåg, historia (624.409) @sv
alternative label: Tåg, färdmedel, historia (624.409) @sv
alternative label: Tågvagnar , historia (624.409) @sv
related: Raideliikenneväylät. Junat. Raitiovaunut. Metro

URN:NBN:fi:au:hklj:624.709
alternative label: Moottoripyörämuseot (624.709)
alternative label: Mopomerkit, moottoripyörien ja mopedien historia (624.709)
alternative label: Mopedmärken, motorcykelns och mopedens historia (624.709) @sv
alternative label: Motorcykelmuseer (624.709) @sv
related: Moottoripyörät. Mopedit

URN:NBN:fi:au:hklj:625.709
alternative label: Vesikulkuneuvot, historia (625.709)
alternative label: Farkoster, historia (625.709) @sv
related: Vesikulkuneuvot

URN:NBN:fi:au:hklj:625.7109
alternative label: Höyrylaivat, laivojen historia (625.7109)
alternative label: Jaalat, laivojen historia (625.7109)
alternative label: Jäänmurtajat, jäänmurtajien historia (625.7109)
alternative label: Kauppa-alukset, laivojen historia (625.7109)
alternative label: Kauppalaivasto, laivat, historia (625.7109)
alternative label: Kauppalaivat, laivojen historia (625.7109)
alternative label: Koululaivat, laivat, historia (625.7109)
alternative label: Laivalöydöt (625.7109)
alternative label: Laivat, historia (625.7109)
alternative label: Lentotukialukset, historia (625.7109)
alternative label: Matkustajalaivat, historia (625.7109)
alternative label: Meriarkeologia, laivojen historia (625.7109)
alternative label: Miinalaivat, laivojen historia (625.7109)
alternative label: Purjelaivat, historia (625.7109)
alternative label: Puulaivat, historia (625.7109)
alternative label: Saaristolaivasto, laivojen historia (625.7109)
alternative label: Siipirataslaivat, historia (625.7109)
alternative label: Sisävesilaivat, historia (625.7109)
alternative label: Sota-alukset, laivojen historia (625.7109)
alternative label: Sotalaivasto, laivojen historia (625.7109)
alternative label: Sotalaivat, laivojen historia (625.7109)
alternative label: Säiliöalukset, laivat, historia (625.7109)
alternative label: Säiliölaivat, laivat, historia (625.7109)
alternative label: Tankkerit, laivat, historia (625.7109)
alternative label: Tankkilaivat, laivat, historia (625.7109)
alternative label: Vesikulkuneuvot, laivat, historia (625.7109)
alternative label: Viikinkilaivat, historia (625.7109)
alternative label: Ydinkäyttöiset laivat, historia (625.7109)
alternative label: Öljylaivat, laivat, historia (625.7109)
alternative label: Öljytankkerit, laivat, historia (625.7109)
alternative label: Farkoster, skepp, historia (625.7109) @sv
alternative label: Fartyg, historia (625.7109) @sv
alternative label: Handelsbåtar, skeppens historia (625.7109) @sv
alternative label: Handelsfartyg, skeppens historia (625.7109) @sv
alternative label: Handelsflotta, fartyg, historia (625.7109) @sv
alternative label: Hangarfartyg, historia (625.7109) @sv
alternative label: Hjulångare, historia (625.7109) @sv
alternative label: Insjöbåtar, historia (625.7109) @sv
alternative label: Isbrytare, isbrytarnas historia (625.7109) @sv
alternative label: Krigsfartyg, skeppens historia (625.7109) @sv
alternative label: Krigsflotta, skeppens historia (625.7109) @sv
alternative label: Kärnenergidrivna fartyg, historia (625.7109) @sv
alternative label: Marinarkeologi, skeppens historia (625.7109) @sv
alternative label: Minfartyg, skeppens historia (625.7109) @sv
alternative label: Oljefartyg, fartyg, historia (625.7109) @sv
alternative label: Oljetankfartyg, fartyg, historia (625.7109) @sv
alternative label: Passagerarfartyg, historia (625.7109) @sv
alternative label: Segelfartyg, historia (625.7109) @sv
alternative label: Skeppsfynd (625.7109) @sv
alternative label: Skolskepp, fartyg, historia (625.7109) @sv
alternative label: Skutor, skeppens historia (625.7109) @sv
alternative label: Skärgårdsflottan, skeppens historia (625.7109) @sv
alternative label: Tankbåtar, fartyg, historia (625.7109) @sv
alternative label: Tankfartyg, fartyg, historia (625.7109) @sv
alternative label: Tankrar, fartyg, historia (625.7109) @sv
alternative label: Tankskepp, fartyg, historia (625.7109) @sv
alternative label: Träfartyg, historia (625.7109) @sv
alternative label: Vikingaskepp, historia (625.7109) @sv
alternative label: Ångbåtar, skeppens historia (625.7109) @sv
alternative label: Örlogsfartyg, skeppens historia (625.7109) @sv
related: Laivat. Laivanrakennus

URN:NBN:fi:au:hklj:625.7209
alternative label: Museoveneet, veneet, historia (625.7209)
alternative label: Puuveneet, historia (625.7209)
alternative label: Ruuhet, veneet, historia (625.7209)
alternative label: Talonpoikaisveneet, puuveneet, historia (625.7209)
alternative label: Veneet, veneet, historia (625.7209)
alternative label: Vesikulkuneuvot, veneet, historia (625.7209)
alternative label: Allmogebåtar, träbåtar, historia (625.7209) @sv
alternative label: Båtar, båtar, historia (625.7209) @sv
alternative label: Ekor, båtar, historia (625.7209) @sv
alternative label: Farkoster, båtar, historia (625.7209) @sv
alternative label: Museibåtar, båtar, historia (625.7209) @sv
alternative label: Träbåtar, historia (625.7209) @sv
related: URN:NBN:fi:au:hklj:625.72

URN:NBN:fi:au:hklj:634.03
alternative label: Tuoteluettelot, huonekaluteollisuus (634.03)
alternative label: Produktkataloger, möbelindustri (634.03) @sv
related: Huonekalutaide

URN:NBN:fi:au:hklj:667.09
alternative label: Rintamamiestalot , historia (667.09)
alternative label: Tyyppitalot , historia (667.09)
alternative label: Frontmannahus, historia (667.09) @sv
related: Talonrakennus

URN:NBN:fi:au:hklj:670.03
alternative label: Elinkeinonharjoittajat, yrityshakemistot (670.03)
alternative label: Julkiset osakeyhtiöt, yrityshakemistot (670.03)
alternative label: Osakeyhtiöt, yrityshakemistot (670.03)
alternative label: Osakkuusyhtiöt, yrityshakemistot (670.03)
alternative label: Osoitehakemistot, yrityshakemistot (670.03)
alternative label: Osoitteistot, yrityshakemistot (670.03)
alternative label: Pörssiyhtiöt, yrityshakemistot (670.03)
alternative label: Toimialat, yrityshakemistot (670.03)
alternative label: Työnantajat, yrityshakemistot (670.03)
alternative label: Adresskartotek, företagsregister (670.03) @sv
alternative label: Adressregister, företagsregister (670.03) @sv
alternative label: Aktiebolag, företagsregister (670.03) @sv
alternative label: Arbetsgivare, företagsregister (670.03) @sv
alternative label: Branscher, företagsregister (670.03) @sv
alternative label: Börsbolag, företagsregister (670.03) @sv
alternative label: Intressebolag, företagsregister (670.03) @sv
alternative label: Näringsidkare, företagsregister (670.03) @sv
alternative label: Publika aktiebolag, företagsregister (670.03) @sv
related: LIIKETALOUS. KAUPPA. MARKKINOINTI. LIIKENNEOPETUS

URN:NBN:fi:au:hklj:679.09
alternative label: Etniset ravintolat, historia (679.09)
alternative label: Kestikievarit, historia (679.09)
alternative label: Majatalot, historia (679.09)
alternative label: Ravintolakulttuuri, historia (679.09)
alternative label: Ravintolalaitos, historia (679.09)
alternative label: Ravintolat, historia (679.09)
alternative label: Etniska restauranger, historia (679.09) @sv
alternative label: Gästgiverier, historia (679.09) @sv
alternative label: Restauranger, historia (679.09) @sv
alternative label: Restaurangkultur, historia (679.09) @sv
alternative label: Restaurangväsen, historia (679.09) @sv
alternative label: Värdshus, historia (679.09) @sv
related: Hotelli- ja ravintolatalous

URN:NBN:fi:au:hklj:680.09
alternative label: Ammattikuntalaitos, historia (680.09)
alternative label: Ammattikuntasäännöt, historia (680.09)
alternative label: Ammattiperinne, ammattikuntalaitos, historia (680.09)
alternative label: Killat, historia (680.09)
alternative label: Gillen, historia (680.09) @sv
alternative label: Skråordningar, historia (680.09) @sv
alternative label: Skråväsen, historia (680.09) @sv
alternative label: Yrkestradition, skråväsen, historia (680.09) @sv
related: HIENOMEKANIIKKA. KÄSI- JA KOTITEOLLISUUS

URN:NBN:fi:au:hklj:690.209
alternative label: Piiat, kotitalouden historia (690.209)
alternative label: Pigor, hushållets historia (690.209) @sv
related: Kotitalous. Kodinhoito

URN:NBN:fi:au:hklj:691.309
alternative label: Kaakao, kulttuurihistoria (691.309)
alternative label: Kaakaojauhe, kulttuurihistoria (691.309)
alternative label: Kahvi, kulttuurihistoria (691.309)
alternative label: Kaffe, kulturhistoria (691.309) @sv
alternative label: Kakao, kulturhistoria (691.309) @sv
alternative label: Kakaopulver, kulturhistoria (691.309) @sv
related: URN:NBN:fi:au:hklj:649.91

URN:NBN:fi:au:hklj:7.91
alternative label: Romanian kieli, kaunokirjallisuus (7.91)
alternative label: Romaniankielinen kirjallisuus, kaunokirjallisuus (7.91)
alternative label: Rumänsk litteratur, skönlitteratur (7.91) @sv
alternative label: Rumänska, skönlitteratur (7.91) @sv
related: ROMAANISTEN, SLAAVILAISTEN JA BALTTILAISTEN KIELTEN KIRJALLISUUDEN HISTORIA JA TUTKIMUS

URN:NBN:fi:au:hklj:752.03
alternative label: Puhelukortit, luettelot (752.03)
alternative label: Telefonkort, kataloger (752.03) @sv
related: Käyttögrafiikka

URN:NBN:fi:au:hklj:791.03
alternative label: Henkilöhakemistot, urheilijat (791.03)
related: Elämäkerralliset hakuteokset

URN:NBN:fi:au:hklj:791.083
alternative label: Cup-kilpailut, tulokset ja tilastot (791.083)
alternative label: Liikuntatapahtumat, tulokset ja tilastot (791.083)
alternative label: Maailman cup-kilpailut, tulokset ja tilastot (791.083)
alternative label: Maailmancup, tulokset ja tilastot (791.083)
alternative label: Ottelut, tulokset ja tilastot (791.083)
alternative label: Rankinglistat, urheilu, tulokset ja tilastot (791.083)
alternative label: Sarjaottelut, tulokset ja tilastot (791.083)
alternative label: Sarjapelit, tulokset ja tilastot (791.083)
alternative label: Turnaukset, tulokset ja tilastot (791.083)
alternative label: Urheilukilpailut, tulokset ja tilastot (791.083)
alternative label: Urheiluliigat, tulokset ja tilastot (791.083)
alternative label: Urheilutapahtumat, tulokset ja tilastot (791.083)
alternative label: Urheilutulokset (791.083)
alternative label: Cup-tävlingar, resultat och statistik (791.083) @sv
alternative label: Idrottsevenemang, resultat och statistik (791.083) @sv
alternative label: Idrottsresultat (791.083) @sv
alternative label: Idrottstävlingar, resultat och statistik (791.083) @sv
alternative label: Matcher, resultat och statistik (791.083) @sv
alternative label: Motionsevenemang, resultat och statistik (791.083) @sv
alternative label: Rankinglistor, idrott, resultat och statistik (791.083) @sv
alternative label: Seriematcher, resultat och statistik (791.083) @sv
alternative label: Seriespel, resultat och statistik (791.083) @sv
alternative label: Sportligor, resultat och statistik (791.083) @sv
alternative label: Turneringar, resultat och statistik (791.083) @sv
alternative label: Världscup, resultat och statistik (791.083) @sv
related: Liikunta. Urheilu

URN:NBN:fi:au:hklj:791.109
alternative label: Yleisurheilu, historia (791.109)
alternative label: Friidrott, historia (791.109) @sv
related: Yleisurheilu

URN:NBN:fi:au:hklj:791.209
alternative label: Sukeltajat, elämäkerrat ja muistelmat (791.209)
alternative label: Uimahallit, urheilu, historia (791.209)
alternative label: Dykare, biografier och memoarer (791.209) @sv
alternative label: Simhallar, idrott, historia (791.209) @sv
related: Uinti. Sukellus

URN:NBN:fi:au:hklj:791.309
alternative label: Velodromit, pyöräily, historia (791.309)
alternative label: Velodromer, cykling, historia (791.309) @sv
related: Pyöräily

URN:NBN:fi:au:hklj:791.709
alternative label: Ratsastuskentät, ratsastus, historia (791.709)
alternative label: Ridbanor, ridning, historia (791.709) @sv
related: Hevosurheilu. Ratsastus

URN:NBN:fi:au:hklj:798.103
alternative label: Filatelia, postimerkkiluettelot (798.103)
alternative label: Merkit, postimerkkiluettelot (798.103)
alternative label: Postimerkkiluettelot (798.103)
alternative label: Filateli, frimärkskataloger (798.103) @sv
alternative label: Frimärkskataloger (798.103) @sv
alternative label: Tecken, frimärkskataloger (798.103) @sv
related: Postimerkkeily

URN:NBN:fi:au:hklj:798.403
alternative label: Kuvaristikot, ristikkosanakirjat (798.403)
alternative label: Ristisanatehtävät, ristikkosanakirjat (798.403)
alternative label: Sanaristikot, ristikkosanakirjat (798.403)
alternative label: Bildkryss, korsordslexikon (798.403) @sv
alternative label: Korsord, korsordslexikon (798.403) @sv
alternative label: Korsordsgåtor, korsordslexikon (798.403) @sv
related: Tietokilpailut

URN:NBN:fi:au:hklj:8
alternative label: Slaavilaiset kielet, kaunokirjallisuus (8 +)
alternative label: Venäjän kieli, kaunokirjallisuus (8 +)
alternative label: Ryska, skönlitteratur (8 +) @sv
alternative label: Slaviska språk, skönlitteratur (8 +) @sv
related: Venäjänkielisen kirjallisuuden historia ja tutkimus

URN:NBN:fi:au:hklj:8.91
alternative label: Tsekin kieli, kaunokirjallisuus (8.91)
alternative label: Tjeckiska, skönlitteratur (8.91) @sv
related: Slaavilaisten kielten kirjallisuuden historia ja tutkimus

URN:NBN:fi:au:hklj:8.92
alternative label: Slovakin kieli, kaunokirjallisuus (8.92)
alternative label: Slovakiska, skönlitteratur (8.92) @sv
related: Slaavilaisten kielten kirjallisuuden historia ja tutkimus

URN:NBN:fi:au:hklj:8.94
alternative label: Kroatoserbian kieli, serbiankielinen kaunokirjallisuus (8.94)
alternative label: Serbian kieli, kaunokirjallisuus (8.94)
alternative label: Serbokroaatin kieli, serbiankielinen kaunokirjallisuus (8.94)
alternative label: Kroatoserbiska, serbisk skönlitteratur (8.94) @sv
alternative label: Serbiska, skönlitteratur (8.94) @sv
alternative label: Serbokroatiska, serbisk skönlitteratur (8.94) @sv
related: Slaavilaisten kielten kirjallisuuden historia ja tutkimus

URN:NBN:fi:au:hklj:8.95
alternative label: Kroaatin kieli, kaunokirjallisuus (8.95)
alternative label: Kroatoserbian kieli, kroaatinkielinen kaunokirjallisuus (8.95)
alternative label: Serbokroaatin kieli, kroaatinkielinen kaunokirjallisuus (8.95)
alternative label: Kroatiska, skönlitteratur (8.95) @sv
alternative label: Kroatoserbiska, kroatisk skönlitteratur (8.95) @sv
alternative label: Serbokroatiska, kroatisk skönlitteratur (8.95) @sv
related: Slaavilaisten kielten kirjallisuuden historia ja tutkimus

URN:NBN:fi:au:hklj:8.97
alternative label: Bosnian kieli, kaunokirjallisuus (8.97)
alternative label: Kroatoserbian kieli, bosniankielinen kaunokirjallisuus (8.97)
alternative label: Serbokroaatin kieli, bosniankielinen kaunokirjallisuus (8.97)
alternative label: Bosniska, skönlitteratur (8.97) @sv
alternative label: Kroatoserbiska, bosnisk skönlitteratur (8.97) @sv
alternative label: Serbokroatiska, bosnisk skönlitteratur (8.97) @sv
related: Slaavilaisten kielten kirjallisuuden historia ja tutkimus

URN:NBN:fi:au:hklj:9
alternative label: Afroaasialaiset kielet, kaunokirjallisuus (9 +)
alternative label: Friisin kieli, kaunokirjallisuus (9)
alternative label: Tataarin kieli, kaunokirjallisuus (9)
alternative label: Afroasiatiska språk, skönlitteratur (9 +) @sv
alternative label: Frisiska, skönlitteratur (9) @sv
alternative label: Tatariska, skönlitteratur (9) @sv
related: URN:NBN:fi:au:hklj:9.4

URN:NBN:fi:au:hklj:9.1
alternative label: Balttilaiset kielet, kaunokirjallisuus (9.1 +)
alternative label: Baltiska språk, skönlitteratur (9.1 +) @sv
related: Balttilaisten kielten kirjallisuuden historia ja tutkimus

URN:NBN:fi:au:hklj:9.11
alternative label: Latvian kieli, kaunokirjallisuus (9.11)
alternative label: Lettiska, skönlitteratur (9.11) @sv
related: Balttilaisten kielten kirjallisuuden historia ja tutkimus

URN:NBN:fi:au:hklj:9.12
alternative label: Liettuan kieli, kaunokirjallisuus (9.12)
alternative label: Litauiska, skönlitteratur (9.12) @sv
related: Balttilaisten kielten kirjallisuuden historia ja tutkimus

URN:NBN:fi:au:hklj:9.21
alternative label: Kreikan kieli, nykykreikka, kaunokirjall. (9.21)
alternative label: Nykykreikan kieli, kaunokirjallisuus (9.21)
alternative label: Grekiska, nygrekiska, skönlitt. (9.21) @sv
alternative label: Nygrekiska, skönlitteratur (9.21) @sv
related: Nykykreikankielisen kirjallisuuden historia ja tutkimus

URN:NBN:fi:au:hklj:9.51
alternative label: Arabian kieli, kaunokirjallisuus (9.51)
alternative label: Arabiska, skönlitteratur (9.51) @sv
related: Arabiankielisen kirjallisuuden historia ja tutkimus

URN:NBN:fi:au:hklj:9.52
alternative label: Heprean kieli, kaunokirjallisuus (9.52)
alternative label: Ivritin kieli, kaunokirjallisuus (9.52)
alternative label: Hebreiska, skönlitteratur (9.52) @sv
alternative label: Ivrit, skönlitteratur (9.52) @sv
related: Hepreankielisen kirjallisuuden historia ja tutkimus

URN:NBN:fi:au:hklj:9.53
alternative label: Amharan kieli, kaunokirjallisuus (9.53)
alternative label: Amhara-språket, skönlitteratur (9.53) @sv
related: Seemiläisten kielten kirjallisuuden historia ja tutkimus

URN:NBN:fi:au:hklj:9.54
alternative label: Tigrinjan kieli, kaunokirjallisuus (9.54)
alternative label: Tigrinja, språk, skönlitteratur (9.54) @sv
related: Seemiläisten kielten kirjallisuuden historia ja tutkimus

URN:NBN:fi:au:hklj:9.61
alternative label: Farsin kieli, kaunokirjallisuus (9.61)
alternative label: Persian kieli, kaunokirjallisuus (9.61)
alternative label: Farsi, skönlitteratur (9.61) @sv
alternative label: Persiska, skönlitteratur (9.61) @sv
related: Iranilaisten kielten kirjallisuuden historia ja tutkimus

URN:NBN:fi:au:hklj:9.612
alternative label: Darin kieli, kaunokirjallisuus (9.612)
alternative label: Dari, skönlitteratur (9.612) @sv
related: Iranilaisten kielten kirjallisuuden historia ja tutkimus

URN:NBN:fi:au:hklj:9.62
alternative label: Kurdin kieli, kaunokirjallisuus (9.62)
alternative label: Kurdiska, skönlitteratur (9.62) @sv
related: Iranilaisten kielten kirjallisuuden historia ja tutkimus

URN:NBN:fi:au:hklj:9.63
alternative label: Bengalin kieli, kaunokirjallisuus (9.63)
alternative label: Bengali, skönlitteratur (9.63) @sv
related: Intialaisten kielten kirjallisuuden historia ja tutkimus

URN:NBN:fi:au:hklj:9.64
alternative label: Gudzaratin kieli, kaunokirjallisuus (9.64)
alternative label: Gujarati, skönlitteratur (9.64) @sv
related: Intialaisten kielten kirjallisuuden historia ja tutkimus

URN:NBN:fi:au:hklj:9.65
alternative label: Hindin kieli, kaunokirjallisuus (9.65)
alternative label: Hindi, skönlitteratur (9.65) @sv
related: Intialaisten kielten kirjallisuuden historia ja tutkimus

URN:NBN:fi:au:hklj:9.66
alternative label: Pandzabin kieli, kaunokirjallisuus (9.66)
alternative label: Panjabi, skönlitteratur (9.66) @sv
related: Intialaisten kielten kirjallisuuden historia ja tutkimus

URN:NBN:fi:au:hklj:9.67
alternative label: Afgaanin kieli, kaunokirjallisuus (9.67)
alternative label: Paston kieli, kaunokirjallisuus (9.67)
alternative label: Afghanska, skönlitteratur (9.67) @sv
alternative label: Pashto, skönlitteratur (9.67) @sv
related: Iranilaisten kielten kirjallisuuden historia ja tutkimus

URN:NBN:fi:au:hklj:9.68
alternative label: Romanikieli, kaunokirjallisuus (9.68)
alternative label: Romanikielinen kirjallisuus, kaunokirjallisuus (9.68)
alternative label: Romaninkielinen kirjallisuus, kaunokirjallisuus (9.68)
alternative label: Litteratur på romani, skönlitteratur (9.68) @sv
alternative label: Romani, skönlitteratur (9.68) @sv
alternative label: Romsk litteratur, skönlitteratur (9.68) @sv
related: Intialaisten kielten kirjallisuuden historia ja tutkimus

URN:NBN:fi:au:hklj:9.69
alternative label: Urdun kieli, kaunokirjallisuus (9.69)
alternative label: Urdu, skönlitteratur (9.69) @sv
related: Intialaisten kielten kirjallisuuden historia ja tutkimus

URN:NBN:fi:au:hklj:9.71
alternative label: Kiinan kieli, kaunokirjallisuus (9.71)
alternative label: Kinesiska, skönlitteratur (9.71) @sv
related: Kiinankielisen kirjallisuuden historia ja tutkimus

URN:NBN:fi:au:hklj:9.72
alternative label: Annamin kieli, kaunokirjallisuus (9.72)
alternative label: Vietnamin kieli, kaunokirjallisuus (9.72)
alternative label: Annamitiska, skönlitteratur (9.72) @sv
alternative label: Vietnamesiska, skönlitteratur (9.72) @sv
related: Muiden kielten kirjallisuuden historia ja tutkimus

URN:NBN:fi:au:hklj:9.74
alternative label: Burman kieli, kaunokirjallisuus (9.74)
alternative label: Burmesiska, skönlitteratur (9.74) @sv
related: Muiden kielten kirjallisuuden historia ja tutkimus

URN:NBN:fi:au:hklj:9.8
alternative label: Japanin kieli, kaunokirjallisuus (9.8)
alternative label: Japanska, skönlitteratur (9.8) @sv
related: Japaninkielisen kirjallisuuden historia ja tutkimus

URN:NBN:fi:au:hklj:9.9
alternative label: Armenian kieli, kaunokirjallisuus (9.9)
alternative label: Baskin kieli, kaunokirjallisuus (9.9)
alternative label: Eskimokielet, kaunokirjallisuus (9.9)
alternative label: Euskeran kieli, kaunokirjallisuus (9.9)
alternative label: Intiaanikielet, kaunokirjallisuus (9.9)
alternative label: Inuiittikielet, kaunokirjallisuus (9.9)
alternative label: Armeniska, skönlitteratur (9.9) @sv
alternative label: Baskiska, skönlitteratur (9.9) @sv
alternative label: Eskimåspråk, skönlitteratur (9.9) @sv
alternative label: Euskera, skönlitteratur (9.9) @sv
alternative label: Indianspråk, skönlitteratur (9.9) @sv
alternative label: Inuitiska språk, skönlitteratur (9.9) @sv
related: URN:NBN:fi:au:hklj:2.89

URN:NBN:fi:au:hklj:9.92
alternative label: Albanian kieli, kaunokirjallisuus (9.92)
alternative label: Albanska, skönlitteratur (9.92) @sv
related: Muiden kielten kirjallisuuden historia ja tutkimus

URN:NBN:fi:au:hklj:9.93
alternative label: Bretonin kieli, kaunokirjallisuus (9.93)
alternative label: Gaelin kieli, kaunokirjallisuus (9.93)
alternative label: Iirin kieli, kaunokirjallisuus (9.93)
alternative label: Kelttiläiset kielet, kaunokirjallisuus (9.93)
alternative label: Kymrin kieli, kaunokirjallisuus (9.93)
alternative label: Manxin kieli, kaunokirjallisuus (9.93)
alternative label: Walesin kieli, kaunokirjallisuus (9.93)
alternative label: Bretonska, skönlitteratur (9.93) @sv
alternative label: Iriska, skönlitteratur (9.93) @sv
alternative label: Keltiska språk, skönlitteratur (9.93) @sv
alternative label: Kymriska, skönlitteratur (9.93) @sv
alternative label: Manx, skönlitteratur (9.93) @sv
alternative label: Skotsk Gaeliska, skönlitteratur (9.93) @sv
alternative label: Walesiska, skönlitteratur (9.93) @sv
related: Kelttiläisten kielten kirjallisuuden historia ja tutkimus

URN:NBN:fi:au:hklj:9.95
alternative label: Georgian kieli, kaunokirjallisuus (9.95)
alternative label: Georgiska, skönlitteratur (9.95) @sv
related: Muiden kielten kirjallisuuden historia ja tutkimus

URN:NBN:fi:au:hklj:9.971
alternative label: Korean kieli, kaunokirjallisuus (9.971)
alternative label: Koreanska, skönlitteratur (9.971) @sv
related: Muiden kielten kirjallisuuden historia ja tutkimus

URN:NBN:fi:au:hklj:9.973
alternative label: Azerin kieli, kaunokirjallisuus (9.973)
alternative label: Azerbajdzjanska, skönlitteratur (9.973) @sv
related: Turkkilaisten kielten kirjallisuuden historia ja tutkimus

URN:NBN:fi:au:hklj:9.974
alternative label: Nepalin kieli, kaunokirjallisuus (9.974)
alternative label: Nepalesiska, skönlitteratur (9.974) @sv
related: Intialaisten kielten kirjallisuuden historia ja tutkimus

URN:NBN:fi:au:hklj:9.976
alternative label: Dravidakielet, kaunokirjallisuus (9.976 +)
alternative label: Dravidiska språk, skönlitteratur (9.976 +) @sv
related: Muiden kielten kirjallisuuden historia ja tutkimus

URN:NBN:fi:au:hklj:9.9761
alternative label: Malajalamin kieli, kaunokirjallisuus (9.9761)
alternative label: Malayalam, skönlitteratur (9.9761) @sv
related: Muiden kielten kirjallisuuden historia ja tutkimus

URN:NBN:fi:au:hklj:9.9762
alternative label: Tamilin kieli, kaunokirjallisuus (9.9762)
alternative label: Tamiliska, skönlitteratur (9.9762) @sv
related: Muiden kielten kirjallisuuden historia ja tutkimus

URN:NBN:fi:au:hklj:9.9765
alternative label: Telugun kieli (9.9765)
alternative label: Telugun kieli, kaunokirjallisuus (9.9765)
alternative label: Telugu (9.9765) @sv
alternative label: Telugu, skönlitteratur (9.9765) @sv
related: Muiden kielten kirjallisuuden historia ja tutkimus

URN:NBN:fi:au:hklj:9.978
alternative label: Austronesialaiset kielet, kaunokirjallisuus (9.978 +)
alternative label: Malaijilais-polynesialaiset kielet, kaunokirjallisuus (9.978 +)
alternative label: Austronesiska språk, skönlitteratur (9.978 +) @sv
alternative label: Malajisk-polynesiska språk, skönlitteratur (9.978 +) @sv
related: Muiden kielten kirjallisuuden historia ja tutkimus

URN:NBN:fi:au:hklj:9.9781
alternative label: Tagalogin kieli, kaunokirjallisuus (9.9781)
alternative label: Tagalog, skönlitteratur (9.9781) @sv
related: Muiden kielten kirjallisuuden historia ja tutkimus

URN:NBN:fi:au:hklj:9.9783
alternative label: Indonesian kieli, kaunokirjallisuus (9.9783)
alternative label: Indonesiska, skönlitteratur (9.9783) @sv
related: Muiden kielten kirjallisuuden historia ja tutkimus

URN:NBN:fi:au:hklj:9.98
alternative label: Afrikka, alkuperäiskielet, kaunokirjallísuus (9.98 +)
alternative label: Akanin kieli, kaunokirjallisuus (9.98)
alternative label: Haamilaiset kielet, kaunokirjallisuus (9.98 +)
alternative label: Afrika, ursprungsspråk, skönlitteratur (9.98 +) @sv
alternative label: Akan, skönlitteratur (9.98) @sv
alternative label: Hamitiska språk, skönlitteratur (9.98 +) @sv
related: Muiden kielten kirjallisuuden historia ja tutkimus

URN:NBN:fi:au:hklj:9.981
alternative label: Somalin kieli, kaunokirjallisuus (9.981)
alternative label: Somaliska, skönlitteratur (9.981) @sv
related: Muiden kielten kirjallisuuden historia ja tutkimus

URN:NBN:fi:au:hklj:9.984
alternative label: Suahilin kieli, kaunokirjallisuus (9.984)
alternative label: Swahilin kieli, kaunokirjallisuus (9.984)
alternative label: Suahili, skönlitteratur (9.984) @sv
alternative label: Swahili, skönlitteratur (9.984) @sv
related: Muiden kielten kirjallisuuden historia ja tutkimus

URN:NBN:fi:au:hklj:9.986
alternative label: Lingalan kieli, kaunokirjallisuus (9.986)
alternative label: Lingala, skönlitteratur (9.986) @sv
related: Muiden kielten kirjallisuuden historia ja tutkimus

URN:NBN:fi:au:hklj:9.99
alternative label: Keinotekoiset kielet, kaunokirjallisuus (9.99)
alternative label: Konstruoidut kielet, kaunokirjallisuus (9.99)
alternative label: Artificiella språk, skönlitteratur (9.99) @sv
alternative label: Konstruerade språk, skönlitteratur (9.99) @sv
related: Muiden kielten kirjallisuuden historia ja tutkimus

URN:NBN:fi:au:hklj:9.991
alternative label: Esperanto, kaunokirjallisuus (9.991)
alternative label: Esperanto, skönlitteratur (9.991) @sv
related: Muiden kielten kirjallisuuden historia ja tutkimus

URN:NBN:fi:au:hklj:911.503
alternative label: Metallirahat, numismatiikka, luettelot (911.503)
alternative label: Rahaluettelot (911.503)
alternative label: Rahat, luettelot (911.503)
alternative label: Metallmynt, numismatik, kataloger (911.503) @sv
alternative label: Mynt, kataloger (911.503) @sv
alternative label: Mynt- och sedelkataloger (911.503) @sv
related: Rahatiede

URN:NBN:fi:au:hklj:991.03
alternative label: Luokanopettajat, elämäkerralliset hakuteokset (991.03)
alternative label: Klasslärare, biografiska uppslagsverk (991.03) @sv
related: Filosofit. Psykologit. Kasvatustieteiden edustajat

URN:NBN:fi:au:hklj:992.03
alternative label: Kardinaalit, elämäkerralliset hakuteokset (992.03)
alternative label: Paavit, elämäkerralliset hakuteokset (992.03)
alternative label: Kardinaler, biografiska uppslagsverk (992.03) @sv
alternative label: Påvar, biografiska uppslagsverk (992.03) @sv
related: URN:NBN:fi:au:hklj:992

URN:NBN:fi:au:hklj:993.03
alternative label: Kaupanvahvistajat, elämäkerralliset hakuteokset (993.03)
alternative label: Konkistadorit, elämäkerralliset hakuteokset (993.03)
alternative label: Conquistadorer, biografiska uppslagsverk (993.03) @sv
alternative label: Köpvittnen, biografiska uppslagsverk (993.03) @sv
related: Yhteiskuntaelämän, joukkotiedotuksen, liikenteen ja maanpuolustuksen edustajat

URN:NBN:fi:au:hklj:993.103
alternative label: Eduskunnan oikeusasiamiehet, elämäkerralliset hakuteokset (993.103)
alternative label: Eduskunnan puhemiehet, elämäkerralliset hakuteokset (993.103)
alternative label: Riksdagens justitieombudsmän, biografiska uppslagsverk (993.103) @sv
alternative label: Riksdagens talmän, biografiska uppslagsverk (993.103) @sv
related: Suomi

URN:NBN:fi:au:hklj:995.03
alternative label: Astronautit, elämäkerralliset hakuteokset (995.03)
alternative label: Avaruuslentäjät, elämäkerralliset hakuteokset (995.03)
alternative label: Kosmonautit, elämäkerralliset hakuteokset (995.03)
alternative label: Astronauter, biografiska uppslagsverk (995.03) @sv
alternative label: Kosmonauter, biografiska uppslagsverk (995.03) @sv
alternative label: Rymdfarare, biografiska uppslagsverk (995.03) @sv
related: Luonnontieteilijät. Matemaatikot

URN:NBN:fi:au:hklj:996.03
alternative label: Muurarit, elämäkerralliset hakuteokset (996.03)
alternative label: Murare, biografiska uppslagsverk (996.03) @sv
related: Lääketieteen, tuotantoelämän, tekniikan, kaupan ja talous-elämän edustajat

Sanakirjat. Hakuteokset (Muotoluokka)
type: Class
type: Concept
type: FormClass
subclass of: Muotoluokat
broader: Muotoluokat
in scheme: URN:NBN:fi:au:hklj:
notation: 03
preferred label: Dictionaries. Reference books (Form tag) @en
preferred label: Ordböcker. Uppslagsböcker (Formtillägg) @sv
scope note: Aakkosellisesti, kronologisesti tai systemaattisesti järjestetyt hakuteokset ja sanakirjat - myös muut kuin kirjanmuotoiset Tietosanakirjat. Hakemistot - Voittaa muotoluokat: 05, 081, 09 - Häviää muotoluokille: 083, 084 Ei käytetä luokissa: 010-018 - Käytä luokkia: 010-018 Ei käytetä luokissa: 030-038 - Käytä luokkia: 030-038 Ei käytetä luokassa: 210 - Käytä luokkaa: 213 Ei käytetä luokassa: 780.15 - Käytä luokkaa: 780.15 Ei käytetä luokassa: 853 - Käytä luokkaa: 853 Ei käytetä luokassa: 872.3 - Käytä luokkaa: 872.3 Ei käytetä luokassa: 874.3 - Käytä luokkaa: 874.3 Ei käytetä luokassa: 875.3 - Käytä luokkaa: 875.3 Ei käytetä luokassa: 884.3 - Käytä luokkaa: 884.3 Ei käytetä luokissa: 1-9+ - Käytä luokkia: 1-9+
scope note: Alfabetiskt, kronologiskt eller systematiskt indelade ordböcker eller uppslagsböcker - också i annan form än bokform Uppslagsverk. Register - Exkluderar formtilläggen: 05, 081, 09 - Exkluderas av formtilläggen: 083, 084 Används inte i klasser: 010-018 - Använd: 010-018 Används inte i klasser: 030-038 - Använd: 030-038 Används inte i klass: 210 - Använd: 213 Används inte i klass: 780.15 - Använd: 780.15 Används inte i klass: 853 - Använd: 853 Används inte i klass: 872.3 - Använd: 872.3 Används inte i klass: 874.3 - Använd: 874.3 Används inte i klass: 875.3 - Använd: 875.3 Används inte i klass: 884.3 - Använd: 884.3 Används inte i klasser: 1-9+ - Använd: 1-9+ @sv

Kausijulkaisut (Muotoluokka)
type: Class
type: Concept
type: FormClass
subclass of: Muotoluokat
broader: Muotoluokat
in scheme: URN:NBN:fi:au:hklj:
notation: 05
preferred label: Serial publications (Form tag) @en
preferred label: Seriella publikationer (Formtillägg) @sv
scope note: Säännöllisesti tai epäsäännöllisesti toistuvasti ilmestyvät, periaatteessa päättymättömät julkaisut, jotka on luetteloitu kausijulkaisun yhteisnimekkeelle. Aikakauslehdet. Sanomalehdet. Yksittäiset numerot. Vuosikerrat. Sarjat. Sarjan nimekkeelle luetteloidut teokset. Vuosikirjat. Vuosikertomukset. Kalenterit. Almanakat - Voittaa muotoluokat: 09 - Häviää muotoluokille: 03, 081, 083, 084 Ei käytetä luokissa: 050-058 - Käytä luokkia: 050-058 Ei käytetä luokissa: 070-078 - Käytä luokkia: 070-078 Ei käytetä luokassa: 210 - Käytä luokkaa: 215 Ei käytetä luokissa: 1-9+ - Käytä luokkia: 1-9+
scope note: I princip kontinuerligt utkommande publikationer som ges ut regelbundet eller oregelbundet och som har katalogiserats enligt den seriella publikationens samlingstitel Tidskrifter. Dagstidningar. Enskilda nummer. Årgångar. Serier. Serier katalogiserade enligt seriens titel. Årsböcker. Årsberättelser. Kalendrar. Almanackor - Exkluderar formtillägget: 09 - Exkluderas av formtilläggen: 03, 081, 083, 084 Används inte i klasser: 050-058 - Använd: 050-058 Används inte i klasser: 070-078 - Använd: 070-078 Används inte i klass: 210 - Använd: 215 Används inte i klasser: 1-9+ - Använd: 1-9+ @sv

Standardit. Normit (Muotoluokka)
type: Class
type: Concept
type: FormClass
subclass of: Muotoluokat
broader: Muotoluokat
in scheme: URN:NBN:fi:au:hklj:
notation: 081
preferred label: Standards. Norms (Form tag) @en
preferred label: Standarder. Normer (Formtillägg) @sv
scope note: - Voittaa muotoluokat: 05, 09 - Häviää muotoluokille: 03, 083, 084 Ei käytetä luokassa: 600.2 - Käytä luokkaa: 600.2 Ei käytetä luokissa: 1-9+ - Käytä luokkia: 1-9+
scope note: - Exkluderar formtilläggen: 05, 09 - Exkluderas av formtilläggen: 03, 083, 084 Används inte i klass: 600.2 - Använd: 600.2 Används inte i klasser: 1-9+ - Använd: 1-9+ @sv

Taulukot. Tilastot (Muotoluokka)
type: Class
type: Concept
type: FormClass
subclass of: Muotoluokat
broader: Muotoluokat
in scheme: URN:NBN:fi:au:hklj:
notation: 083
preferred label: Tables. Statistics (Form tag) @en
preferred label: Tabeller. Statistik (Formtillägg) @sv
scope note: Taulukoksi tai tilastoksi katsotaan teos, josta vähintään puolet on taulukkoja tai tilastoja. - Voittaa muotoluokat: 03, 05, 081, 09 - Häviää muotoluokalle: 084 Ei käytetä luokissa: 310-316 - Käytä luokkia: 310-316 Ei käytetä luokassa: 510 - Käytä luokkaa: 510.1 (luokissa 510.88-519 saa käyttää) Ei käytetä luokissa: 1-9+ - Käytä luokkia: 1-9+
scope note: Ett verk där minst hälften utgörs av tabeller eller statistik betraktas som en tabell- eller statistikpublikation - Exkluderar formtilläggen: 03, 05, 081, 09 - Exkluderas av formtillägget: 084 Används inte i klasser: 310-316 - Använd: 310-316 Används inte i klass: 510 - Använd: 510.1 (tillåtet i klasser 510.88-519) Används inte i klasser: 1-9+ - Använd: 1-9+ @sv

Kartat. Kartastot (Muotoluokka)
type: Class
type: Concept
type: FormClass
subclass of: Muotoluokat
broader: Muotoluokat
in scheme: URN:NBN:fi:au:hklj:
notation: 084
preferred label: Maps. Map books (Form tag) @en
preferred label: Kartor. Kartböcker (Formtillägg) @sv
scope note: Karttalehdet. Taitettavat kartat. Seinäkartat. Pallokartat. Mikromuotoiset kartat. Digitaaliset kartat. Kirjanmuotoiset kartat ja kartastot. Teemakartat. Merikortit. Ilmakuvakartat. Kartaksi katsotaan myös kirja, jonka sivuista vähintään puolet on karttasivuja. - Voittaa muotoluokat: 03, 05, 081, 083, 09 - Häviää muotoluokille: - Ei käytetä luokassa: 210 - Käytä luokkaa: 218.4 Ei käytetä luokassa: 404 - Käytä luokkaa: 404 Ei käytetä luokassa: 914 - Käytä luokkaa: 914 Ei käytetä luokissa: 1-9+ - Käytä luokkia: 1-9+
scope note: Kartblad. Hopvikbara kartor. Väggkartor. Jordglober. Kartor i mikroformat. Digitala kartor. Kartor och kartverk i bokform. Tematiska kartor. Sjökort. Flygbildskartor. Som karta räknas också en bok där minst hälften av sidorna. är kartblad - Exkluderar formtilläggen: 03, 05, 081, 083, 09 - Exkluderas av formtilläggen: - Används inte i klass: 210 - Använd: 218.4 Används inte i klass: 404 - Använd: 404 Används inte i klass: 914 - Använd: 914 Används inte i klasser: 1.9+ - Använd: 1-9+ @sv

Historia (Muotoluokka)
type: Class
type: Concept
type: FormClass
subclass of: Muotoluokat
broader: Muotoluokat
in scheme: URN:NBN:fi:au:hklj:
notation: 09
preferred label: Maps. Map books (Form tag) @en
preferred label: Historia (Formtillägg) @sv
scope note: - Voittaa muotoluokat: - - Häviää muotoluokille: 03, 05, 081, 083, 084 Ei käytetä luokissa: 029-029.1 - Käytä luokkia: 029-029.1 Ei käytetä luokissa: 030-038 - Käytä luokkaa: 003 Ei käytetä luokissa: 140-148 - Käytä luokkaa: 148 Ei käytetä luokassa: 150 - Käytä luokkaa: 159 (luokissa 151-152 saa käyttää) Ei käytetä luokassa: 180 - Käytä luokkaa: 189 (luokissa 180.1-188+ saa käyttää) Ei käytetä luokassa: 210 - Käytä luokkaa: 219 Ei käytetä luokassa: 250 - Käytä luokkia: 270-279+ (luokissa 251-259 saa käyttää) Ei käytetä luokassa: 339 - Käytä luokkaa: 339 Ei käytetä luokassa: 369 - Käytä luokkaa: 369 Ei käytetä luokissa: 399-399.1- Käytä luokkia: 399-399.1 Ei käytetä luokassa: 469 - Käytä luokkaa: 469 Ei käytetä luokassa: 509 - Käytä luokkaa: 509 Ei käytetä luokassa: 670.9 - Käytä luokkaa: 670.9 Ei käytetä luokassa: 675 - Käytä luokkaa: 670.9 (luokissa 675.2-675.8 saa käyttää) Ei käytetä luokissa: 709-789+ - Käytä luokkia: 709-789+ Ei käytetä luokissa: 790-791 - Käytä luokkaa: 790.9+ (luokissa 791.1-799 saa käyttää) Ei käytetä luokissa: 809-849 - Käytä luokkia: 809-849 Ei käytetä luokassa: 872.9 - Käytä luokkaa: 872.9 Ei käytetä luokassa: 884.9 - Käytä luokkaa: 884.9 Ei käytetä luokissa: 909-999+ - Käytä luokkia: 909-999+ Ei käytetä luokissa: 1-9+ - Käytä luokkia: 1-9+
scope note: - Exkluderar formtilläggen: - - Exkluderas av formtilläggen: 03, 05, 081, 083, 084 Används inte i klasser: 029-029.1 - Använd: 029-029.1 Används inte i klasser: 030-038 - Använd: 003 Används inte i klasser: 140-148 - Använd: 148 Används inte i klass: 150 - Använd: 159 (tillåtet i klasser 151-152) Används inte i klass: 180 - Använd: 189 (tillåtet i klasser 180.1-188+) Används inte i klass: 210 - Använd: 219 Används inte i klass: 250 - Använd: 270-279+ (tillåtet i klasser 251-259) Används inte i klass: 339 - Använd: 339 Används inte i klass: 369 - Använd: 369 Används inte i klasser: 399-399.1 - Använd: 399-399.1 Används inte i klass: 469 - Använd: 469 Används inte i klass: 509 - Använd: 509 Används inte i klass: 670.9 - Använd: 670.9 Används inte i klass: 675 - Använd: 670.9 (tillåtet i klasser 675.2-675.8) Används inte i klasser: 709-789+ - Använd: 709-789+ Används inte i klasser: 790-791 - Använd: 790.9+ (tillåtet i klasserna 791.1-799) Används inte i klasser: 809-849 - Använd: 809-849 Används inte i klass: 872.9 - Använd: 872.9 Används inte i klass: 884.9 - Använd: 884.9 Används inte i klasser: 909-999+ - Använd: 909-999+ Används inte i klasser: 1-9+ - Använd: 1-9+ @sv

URN:NBN:fi:au:hklj:005.09
alternative label: Inkunaabelit (005.09)
alternative label: Kirjapainot, historia (005.09)
alternative label: Kirjapainotaito, historia (005.09)
alternative label: Boktryckarkonst, historia (005.09) @sv
alternative label: Boktryckerier, historia (005.09) @sv
alternative label: Inkunabler (005.09) @sv
related: Kirjan historia
related: Kirjapainotaito. Graafinen teollisuus

Suomenkieliset
type: Class
type: Concept
subclass of: YLEISET TIETOSANAKIRJAT
broader: YLEISET TIETOSANAKIRJAT
in scheme: URN:NBN:fi:au:hklj:
notation: 031
preferred label: Finnish @en
preferred label: Finska @sv

Ruotsinkieliset
type: Class
type: Concept
subclass of: YLEISET TIETOSANAKIRJAT
broader: YLEISET TIETOSANAKIRJAT
in scheme: URN:NBN:fi:au:hklj:
notation: 032
preferred label: Swedish @en
preferred label: Svenska @sv

Saksankieliset
type: Class
type: Concept
subclass of: YLEISET TIETOSANAKIRJAT
broader: YLEISET TIETOSANAKIRJAT
in scheme: URN:NBN:fi:au:hklj:
notation: 033
preferred label: German @en
preferred label: Tyska @sv

Englanninkieliset
type: Class
type: Concept
subclass of: YLEISET TIETOSANAKIRJAT
broader: YLEISET TIETOSANAKIRJAT
in scheme: URN:NBN:fi:au:hklj:
notation: 034
preferred label: English @en
preferred label: Engelska @sv

Ranskankieliset
type: Class
type: Concept
subclass of: YLEISET TIETOSANAKIRJAT
broader: YLEISET TIETOSANAKIRJAT
in scheme: URN:NBN:fi:au:hklj:
notation: 035
preferred label: French @en
preferred label: Franska @sv

Italiankieliset
type: Class
type: Concept
subclass of: YLEISET TIETOSANAKIRJAT
broader: YLEISET TIETOSANAKIRJAT
in scheme: URN:NBN:fi:au:hklj:
notation: 036
preferred label: Italian @en
preferred label: Italienska @sv

Espanjankieliset
type: Class
type: Concept
subclass of: YLEISET TIETOSANAKIRJAT
broader: YLEISET TIETOSANAKIRJAT
in scheme: URN:NBN:fi:au:hklj:
notation: 037
preferred label: Spanish @en
preferred label: Spanska @sv

Venäjänkieliset
type: Class
type: Concept
subclass of: YLEISET TIETOSANAKIRJAT
broader: YLEISET TIETOSANAKIRJAT
in scheme: URN:NBN:fi:au:hklj:
notation: 038
preferred label: Russian @en
preferred label: Ryska @sv

Suomi
type: Class
type: Concept
subclass of: YLEISET KOKOOMATEOKSET
broader: YLEISET KOKOOMATEOKSET
in scheme: URN:NBN:fi:au:hklj:
notation: 041
preferred label: Finland @en

URN:NBN:fi:au:hklj:1.8
alternative label: Viron kieli, kaunokirjallisuus (1.8 +)
alternative label: Estniska, skönlitteratur (1.8 +) @sv
related: URN:NBN:fi:au:hklj:1.9
related: Vironkielisen kirjallisuuden historia ja tutkimus

URN:NBN:fi:au:hklj:1.91
alternative label: Karjalan kieli, kaunokirjallisuus (1.91)
alternative label: Lyydin kieli, kaunokirjallisuus (1.91)
alternative label: Karelska, skönlitteratur (1.91) @sv
alternative label: Lydiska, skönlitteratur (1.91) @sv
related: URN:NBN:fi:au:hklj:1.9
related: SUOMALAIS-UGRILAISTEN KIELTEN KIRJALLISUUDEN HISTORIA JA TUTKIMUS

URN:NBN:fi:au:hklj:1.94
alternative label: Unkarin kieli, kaunokirjallisuus (1.94 +)
alternative label: Ungerska, skönlitteratur (1.94 +) @sv
related: URN:NBN:fi:au:hklj:1.9
related: Unkarinkielisen kirjallisuuden historia ja tutkimus

URN:NBN:fi:au:hklj:1.98
alternative label: Koltan kieli, kaunokirjallisuus (1.98)
alternative label: Lapin kieli, kaunokirjallisuus (1.98)
alternative label: Saamen kieli, kaunokirjallisuus (1.98)
alternative label: Lapska, skönlitteratur (1.98) @sv
alternative label: Samiska, skönlitteratur (1.98) @sv
alternative label: Skoltsamiska, skönlitteratur (1.98) @sv
related: URN:NBN:fi:au:hklj:1.9
related: Saamenkielisen kirjallisuuden historia ja tutkimus

URN:NBN:fi:au:hklj:183.503
alternative label: Lyseot, matrikkelit (183.503)
alternative label: Lyceer, matriklar (183.503) @sv
related: URN:NBN:fi:au:hklj:183.5
related: URN:NBN:fi:au:hklj:183.7

URN:NBN:fi:au:hklj:183.509
alternative label: Alkeiskoulut, historia (183.509)
alternative label: Keskikoulu, oppikoulu, historia (183.509)
alternative label: Lukio, historia (183.509)
alternative label: Lyseot, historia (183.509)
alternative label: Poikakoulut, historia (183.509)
alternative label: Yhteiskoulut, historia (183.509)
alternative label: Elementarskolor, historia (183.509) @sv
alternative label: Gymnasiet, historia (183.509) @sv
alternative label: Lyceer, historia (183.509) @sv
alternative label: Mellanskolan, läroverk, historia (183.509) @sv
alternative label: Pojkskolor, historia (183.509) @sv
alternative label: Samskolor, historia (183.509) @sv
related: URN:NBN:fi:au:hklj:183.5
related: URN:NBN:fi:au:hklj:183.7

URN:NBN:fi:au:hklj:2.89
alternative label: Grönlannin kieli, kaunokirjallisuus (2.89)
alternative label: Grönländska, skönlitteratur (2.89) @sv
related: Muiden kielten kirjallisuuden historia ja tutkimus
related: URN:NBN:fi:au:hklj:9.9

URN:NBN:fi:au:hklj:3
alternative label: Saksan kieli, kaunokirjallisuus (3 +)
alternative label: Tyska, skönlitteratur (3 +) @sv
related: Saksankielisen kirjallisuuden historia ja tutkimus
related: Saksan kieli

Opinnot
type: Class
type: Concept
subclass of: URN:NBN:fi:au:hklj:300
broader: URN:NBN:fi:au:hklj:300
in scheme: URN:NBN:fi:au:hklj:
notation: 307
preferred label: Studies. Educational institutions @en
preferred label: Studier @sv
scope note: Yhteiskuntaa tai yhteiskuntatieteitä koskevat opinnot yleensä Eri yhteiskuntatieteitä koskevat opinnot alan mukaisessa luokassa
scope note: Studier i samhället eller samhällsvetenskaperna i allmänhet Studier i olika samhällsvetenskaper klassificeras enligt område @sv

Standardit
type: Class
type: Concept
subclass of: Kokoomateokset
broader: Kokoomateokset
in scheme: URN:NBN:fi:au:hklj:
notation: 308.1
preferred label: Standards @en
preferred label: Standarder @sv
scope note: Yhteiskuntaa tai yhteiskuntatieteitä koskevat yleiset tai sekasisältöiset standardit ja standardikokoelmat Eri yhteiskuntatieteitä koskevat standardit ja standardikokoelmat alan mukaisessa luokassa
scope note: Standarder eller samlingar av standarder med allmänt eller blandat innehåll som handlar om samhället eller samhällsvetenskaperna Standarder eller samlingar med standarder som handlar om olika samhällsvetenskaper klassificeras enligt område @sv

Tilastot. Taulukot
type: Class
type: Concept
subclass of: Kokoomateokset
broader: Kokoomateokset
in scheme: URN:NBN:fi:au:hklj:
notation: 308.3
preferred label: Statistics. Tables @en
preferred label: Statistik. Tabeller @sv
scope note: Yhteiskuntaa tai yhteiskuntatieteitä koskevat yleiset tai sekasisältöiset tilastot ja taulukot Eri yhteiskuntatieteitä koskevat tilastot ja taulukot alan mukaisessa luokassa
scope note: Statistik och tabeller med allmänt eller blandat innehåll som handlar om samhället eller samhällsvetenskaperna Statistik och tabeller som handlar om olika samhällsvetenskaper klassificeras enligt område @sv

Kartat
type: Class
type: Concept
subclass of: Kokoomateokset
broader: Kokoomateokset
in scheme: URN:NBN:fi:au:hklj:
notation: 308.4
preferred label: Maps @en
preferred label: Kartor @sv
scope note: Yhteiskuntaa tai yhteiskuntatieteitä koskevat yleiset tai sekasisältöiset kartat ja kartastot Eri yhteiskuntatieteitä koskevat kartat ja kartastot alan mukaisessa luokassa
scope note: Kartor och kartböcker med allmänt eller blandat innehåll som handlar om samhället eller samhällsvetenskaperna Kartor och kartböcker som handlar om olika samhällsvetenskaper klassificeras enligt område @sv

URN:NBN:fi:au:hklj:323.209
alternative label: Antisemitismi, historia (323.209)
alternative label: Joukkomurha, juutalaisvainot, historia (323.209)
alternative label: Joukkotuho, juutalaisvainot, historia (323.209)
alternative label: Joukkotuhonta, juutalaisvainot, historia (323.209)
alternative label: Juutalaiset, antisemitismi, historia (323.209)
alternative label: Juutalaiset, historia (323.209)
alternative label: Juutalaiset, historia, juutalaisvainot (323.209)
alternative label: Juutalaisvainot, historia (323.209)
alternative label: Kansanmurha, juutalaisvainot, historia (323.209)
alternative label: Keskitysleirit, juutalaisvainot (323.209)
alternative label: Kristalliyö, juutalaisvainot, historia (323.209)
alternative label: Pogromit, historia (323.209)
alternative label: Rasismi, antisemitismi, historia (323.209)
alternative label: Rikos ihmisyyttä vastaan, juutalaisvainojen historia (323.209)
alternative label: Sefardijuutalaiset, historia (323.209)
alternative label: Sefardijuutalaiset, historia, juutalaisvainot (323.209)
alternative label: Uskonvainot, juutalaisvainot, historia (323.209)
alternative label: Vainot, juutalaisvainot, historia (323.209)
alternative label: Antisemitism, historia (323.209) @sv
alternative label: Brott mot mänskligheten, judeförföljelsernas historia (323.209) @sv
alternative label: Folkmord, judeförföljelser, historia (323.209) @sv
alternative label: Förföljelser, judeförföljelser, historia (323.209) @sv
alternative label: Genocid, judeförföljelser, historia (323.209) @sv
alternative label: Judar, antisemitism, historia (323.209) @sv
alternative label: Judar, historia (323.209) @sv
alternative label: Judar, historia, judeförföljelser (323.209) @sv
alternative label: Judeförföljelser, historia (323.209) @sv
alternative label: Koncentrationsläger, judeförföljelser (323.209) @sv
alternative label: Kristallnatten, judeförföljelser, historia (323.209) @sv
alternative label: Massförstörelse, judeförföljelser, historia (323.209) @sv
alternative label: Massmord, judeförföljelser, historia (323.209) @sv
alternative label: Pogromer, historia (323.209) @sv
alternative label: Rasism, antisemitism, historia (323.209) @sv
alternative label: Religiösa förföljelser, judeförföljelser, historia (323.209) @sv
alternative label: Sefardijudar, historia (323.209) @sv
alternative label: Sefardijudar, historia, judeförföljelser (323.209) @sv
related: Juutalaisten asema. Antisemitismi
related: Israelin ja Palestiinan historia

URN:NBN:fi:au:hklj:332.205
alternative label: Korkein hallinto-oikeus, vuosikirjat (332.205)
alternative label: Ratkaisut, hallinto-oikeus (332.205)
alternative label: Högsta förvaltningsdomstolen, årsböcker (332.205) @sv
alternative label: Lösningar, problem, förvaltningsdomstol (332.205) @sv
related: URN:NBN:fi:au:hklj:332.2
related: Prosessioikeus. Oikeushallinto

URN:NBN:fi:au:hklj:359.083
alternative label: Rikollisuustilastot (359.083)
alternative label: Brottsstatistik (359.083) @sv
related: Rikosoikeus
related: Vankeinhoito. Vankilat

URN:NBN:fi:au:hklj:360.09
alternative label: Fysiokratia, taloustieteen historia (360.09)
alternative label: Fysiokrati, ekonomins historia (360.09) @sv
related: URN:NBN:fi:au:hklj:360
related: Talousmaantiede. Taloushistoria

URN:NBN:fi:au:hklj:371.909
alternative label: Amerikanruotsalaiset, historia (371.909)
alternative label: Amerikansuomalaiset, historia (371.909)
alternative label: Argentiinansuomalaiset, ulkosuomalaiset, historia (371.909)
alternative label: Australiansuomalaiset, historia (371.909)
alternative label: Emigrantit, siirtolaisuuden historia (371.909)
alternative label: Kulttuurikosketukset, siirtolaisuus, historia (371.909)
alternative label: Kulttuurivaikutukset, siirtolaisuus, historia (371.909)
alternative label: Laiton maahanmuutto, maahanmuutto, historia (371.909)
alternative label: Loikkarit, maahanmuutto, historia (371.909)
alternative label: Maahanmuutto, siirtolaisuus, historia (371.909)
alternative label: Maastamuutto, siirtolaisuus, historia (371.909)
alternative label: Muuttoliike, siirtolaisuus, historia (371.909)
alternative label: Norjansuomalaiset, siirtolaisuus, historia (371.909)
alternative label: Ruotsinsuomalaiset, historia (371.909)
alternative label: Siirtokunnat, siirtolaisuus, historia (371.909)
alternative label: Siirtolaisuus, historia (371.909)
alternative label: Ulkosuomalaiset, historia (371.909)
alternative label: Uudisasukkaat, siirtolaisuuden historia (371.909)
alternative label: Uudisasutus, siirtolaisuuden historia (371.909)
alternative label: Amerikafinländare, historia (371.909) @sv
alternative label: Amerikasvenskar, historia (371.909) @sv
alternative label: Australienfinländare, historia (371.909) @sv
alternative label: Avhoppare, invandring, historia (371.909) @sv
alternative label: Emigranter, Emigrationens historia (371.909) @sv
alternative label: Emigration, historia (371.909) @sv
alternative label: Finländare i Argentina, utlandsfinländare, historia (371.909) @sv
alternative label: Flyttningsrörelse, emigration, historia (371.909) @sv
alternative label: Illegal invandring, invandring, historia (371.909) @sv
alternative label: Invandring, emigration, historia (371.909) @sv
alternative label: Kolonier, siirtokunnat, utvandring, historia (371.909) @sv
alternative label: Kulturkontakter, emigration, historia (371.909) @sv
alternative label: Kulturpåverkan, emigration, historia (371.909) @sv
alternative label: Norgefinnar, utvandring, historia (371.909) @sv
alternative label: Nybyggare, emigrationens historia (371.909) @sv
alternative label: Nybyggarsamhälle, emigrationens historia (371.909) @sv
alternative label: Sverigefinländare, historia (371.909) @sv
alternative label: Utlandsfinländare, historia (371.909) @sv
alternative label: Utvandring, emigration, historia (371.909) @sv
related: Siirtolaisuus
related: Amerikan historia

URN:NBN:fi:au:hklj:375.09
alternative label: Gender-tutkimus, naisen ja miehen asema, historia (375.09)
alternative label: Haaremit, naisen asema, historia (375.09)
alternative label: Matriarkaalisuus, naisen asema, historia (375.09)
alternative label: Matriarkaatti, naisen asema, historia (375.09)
alternative label: Miehen asema, historia (375.09)
alternative label: Mieskulttuuri, historia (375.09)
alternative label: Mieskuva, historia (375.09)
alternative label: Miesliikkeet, historia (375.09)
alternative label: Miestutkimus, miehen asema, historia (375.09)
alternative label: Naimattomuus, naisen asema, historia (375.09)
alternative label: Naisasiajärjestöt, historia (375.09)
alternative label: Naisasialiikkeet, historia (375.09)
alternative label: Naisen asema, historia (375.09)
alternative label: Naiset, historia (375.09)
alternative label: Naishistoria (375.09)
alternative label: Naisjärjestöt, historia (375.09)
alternative label: Naiskulttuuri, historia (375.09)
alternative label: Naiskuva, historia (375.09)
alternative label: Naiskäsitys, historia (375.09)
alternative label: Naisliikkeet, historia (375.09)
alternative label: Naistutkimus, naisen asema, historia (375.09)
alternative label: Painostusryhmät, nais- ja miesliikkeet, historia (375.09)
alternative label: Patriarkaalisuus, sukupuolten asema, historia (375.09)
alternative label: Patriarkaatti, sukupuolten asema, historia (375.09)
alternative label: Suffragetit, naisliikkeen historia (375.09)
alternative label: Sukupuolitutkimus, naisen ja miehen asema, historia (375.09)
alternative label: Genderforskning, kvinnans och mannens ställning, historia (375.09) @sv
alternative label: Harem, kvinnans ställning, historia (375.09) @sv
alternative label: Kvinnans ställning, historia (375.09) @sv
alternative label: Kvinnobilden, historia (375.09) @sv
alternative label: Kvinnoforskning, kvinnans ställning, historia (375.09) @sv
alternative label: Kvinnohistoria (375.09) @sv
alternative label: Kvinnokultur, historia (375.09) @sv
alternative label: Kvinnoorganisationer, historia (375.09) @sv
alternative label: Kvinnor, historia (375.09) @sv
alternative label: Kvinnorörelser, historia (375.09) @sv
alternative label: Kvinnosaksorganisationer, historia (375.09) @sv
alternative label: Kvinnosaksrörelser, historia (375.09) @sv
alternative label: Kvinnouppfattning, historia (375.09) @sv
alternative label: Könsforskning, kvinnans och mannens ställning, historia (375.09) @sv
alternative label: Mannens ställning, historia (375.09) @sv
alternative label: Mansbilden, historia (375.09) @sv
alternative label: Mansforskning, mannens ställning, historia (375.09 +) @sv
alternative label: Manskultur, historia (375.09) @sv
alternative label: Mansrörelser, historia (375.09) @sv
alternative label: Matriarkalitet, kvinnans ställning, historia (375.09) @sv
alternative label: Matriarkat, kvinnans ställning, historia (375.09) @sv
alternative label: Ogift stånd, kvinnans ställning, historia (375.09) @sv
alternative label: Patriarkalitet, könens ställning, historia (375.09) @sv
alternative label: Patriarkat, könens ställning, historia (375.09) @sv
alternative label: Påtryckningsgrupper, kvinno- och mansrörelser, historia (375.09) @sv
alternative label: Suffragetter, kvinnorörelsens historia (375.09) @sv
related: Naisen ja miehen asema yhteiskunnassa
related: URN:NBN:fi:au:hklj:919

URN:NBN:fi:au:hklj:386.109
alternative label: Haaksirikot, merenkulun historia (386.109)
alternative label: Haverit, merenkulku, historia (386.109)
alternative label: Hylyt (386.109)
alternative label: Höyrylaivat, vesiliikenteen historia (386.109)
alternative label: Jaalat, vesiliikenteen historia (386.109)
alternative label: Jokilaivat, vesiliikenne, historia (386.109)
alternative label: Joukkotuho, haaksirikot, historia (386.109)
alternative label: Järviliikenne, historia (386.109)
alternative label: Jäänmurtajat, merenkulun historia (386.109)
alternative label: Kanavaliikenne, historia (386.109)
alternative label: Kapinat, merenkulun historia (386.109)
alternative label: Karilleajo , merenkulun historia (386.109)
alternative label: Katastrofit, haaksirikot, historia (386.109)
alternative label: Kauppa-alukset, merenkulun historia (386.109)
alternative label: Kauppalaivasto, merenkulku, historia (386.109)
alternative label: Kauppalaivat, merenkulun historia (386.109)
alternative label: Kauppamerenkulku, historia (386.109)
alternative label: Koululaivat, merenkulun historia (386.109)
alternative label: Laivaliikenne, historia (386.109)
alternative label: Laivaonnettomuudet, merenkulun historia (386.109)
alternative label: Laivasto, merenkulun historia (386.109)
alternative label: Laivat, vesiliikenne, historia (386.109)
alternative label: Laivaväylät, vesiliikenne, historia (386.109)
alternative label: Lauttaliikenne, historia (386.109)
alternative label: Lokikirjat, merenkulun historia (386.109)
alternative label: Merenkulkijat, merenkulun historia (386.109)
alternative label: Merenkulku, historia (386.109)
alternative label: Merenkävijät, merenkulun historia (386.109)
alternative label: Meret, merenkulku, historia (386.109)
alternative label: Meriarkeologia, haaksirikot (386.109)
alternative label: Merikirjallisuus, merenkulun historia (386.109)
alternative label: Merikuljetus, meriliikenteen historia (386.109)
alternative label: Meriliikenne, historia (386.109)
alternative label: Merimatkat, merenkulun historia (386.109)
alternative label: Merionnettomuudet, merenkulun historia (386.109)
alternative label: Merirosvot, merenkulun historia (386.109)
alternative label: Meritiet, historia (386.109)
alternative label: Meriturmat, merenkulun historia (386.109)
alternative label: Merivahingot, merenkulku, historia (386.109)
alternative label: Meriväylät, historia (386.109)
alternative label: Onnettomuudet, haaksirikkojen historia (386.109)
alternative label: Purjehdus, merenkulun historia (386.109)
alternative label: Rannikkoliikenne, historia (386.109)
alternative label: Saaristolaivasto, merenkulun historia (386.109)
alternative label: Saaristoliikenne, historia (386.109)
alternative label: Satamakaupungit, vesiliikenteen historia (386.109)
alternative label: Satamat, vesiliikenteen historia (386.109)
alternative label: Sisävesiliikenne, historia (386.109)
alternative label: Sisävesiväylät, vesiliikenteen historia (386.109)
alternative label: Siviilimerenkulku, historia (386.109)
alternative label: Suuronnettomuudet, haaksirikot, historia (386.109)
alternative label: Talonpoikaispurjehdus, historia (386.109)
alternative label: Talvimerenkulku, historia (386.109)
alternative label: Valtameret, merenkulku, historia (386.109)
alternative label: Valtameriliikenne, historia (386.109)
alternative label: Vapaasatamat, merenkulun historia (386.109)
alternative label: Varustamot, laivanvarustus, historia (386.109)
alternative label: Vesikuljetus, vesiliikenne, historia (386.109)
alternative label: Vesiliikenne, historia (386.109)
alternative label: Vesireitit, vesiliikenne, historia (386.109)
alternative label: Vesitiekuljetus, vesiliikenteen historia (386.109)
alternative label: Vesitiet, vesiliikenne, historia (386.109)
alternative label: Vesiväylät, vesiliikenne, historia (386.109)
alternative label: Bondeseglation, historia (386.109) @sv
alternative label: Civil sjöfart, historia (386.109) @sv
alternative label: Farleder, sjötrafik, historia (386.109) @sv
alternative label: Fartyg, sjötrafik, historia (386.109) @sv
alternative label: Fartygsleder, sjötrafik, historia (386.109) @sv
alternative label: Fartygsolyckor, merenkulun historia (386.109) @sv
alternative label: Fartygsolyckor, sjöfartens historia (386.109) @sv
alternative label: Fartygstrafik, historia (386.109) @sv
alternative label: Flodbåtar, sjötrafik, historia (386.109) @sv
alternative label: Flotta, sjöfartens historia (386.109) @sv
alternative label: Frihamnar, sjöfartens historia (386.109) @sv
alternative label: Färjtrafik, historia (386.109) @sv
alternative label: Grundstötning, sjöfartens historia (386.109) @sv
alternative label: Hamnar, sjötrafikens historia (386.109) @sv
alternative label: Hamnstäder, sjötrafikens historia (386.109) @sv
related: Uinti. Sukellus
related: Yleinen arkeologia

URN:NBN:fi:au:hklj:397.09
alternative label: Divisioonat , Suomen armeija, historia (397.09)
alternative label: Joukko-osastot, Suomen armeija, historia (397.09)
alternative label: Joukkueet, Suomen armeija, historia (397.09)
alternative label: Jääkärit, Suomen armeija, joukko-osastot, historia (397.09)
alternative label: Kasarmit, Suomen armeija, historia (397.09)
alternative label: Kenttätykistö, Suomen armeija, historia (397.09)
alternative label: Kertausharjoitukset, Suomen armeija, historia (397.09)
alternative label: Komppaniat, Suomen armeija, historia (397.09)
alternative label: Kotiutus, sotilaat, Suomen armeija, historia (397.09)
alternative label: Liikekannallepano, Suomen armeija, historia (397.09)
alternative label: Lotat, lottajärjestö, historia (397.09)
alternative label: Lotta Svärd -järjestö, historia (397.09)
alternative label: Maanpuolustusjärjestöt, Suomi, historia (397.09)
alternative label: Maavoimat, Suomi, historia (397.09)
alternative label: Merivoimat, Suomi, historia (397.09)
alternative label: Mobilisaatio, Suomen armeija, historia (397.09)
alternative label: Moottoroidut joukot, Suomi, historia (397.09)
alternative label: Pikkulotat, lottajärjestö, historia (397.09)
alternative label: Prikaatit, Suomen armeija, historia (397.09)
alternative label: Puolustusvoimat, Suomi, historia (397.09)
alternative label: Rakuunat, Suomen armeija, historia (397.09)
alternative label: Ratsuväki, Suomen armeija, historia (397.09)
alternative label: Ruodut, historia, Suomi (397.09)
alternative label: Ruotuarmeijat, historia, Suomi (397.09)
alternative label: Ruotujakolaitos, historia, Suomi (397.09)
alternative label: Ruotusotilaat, historia, Suomi (397.09)
alternative label: Rykmentit, Suomen armeija, historia (397.09)
alternative label: Sotaväenotto, Suomen armeija, historia (397.09)
alternative label: Sotilasilmailu, ilmavoimat, historia, Suomi (397.09)
alternative label: Suojeluskunnat, historia (397.09)
alternative label: Suomen armeija, historia (397.09)
alternative label: Vapaaehtoinen maanpuolustustyö, Suomen armeija, historia (397.09)
alternative label: Varuskunnat, Suomen armeija, historia (397.09)
alternative label: Viihdytystoiminta, Suomen armeija, historia (397.09)
alternative label: Väenotto, Suomen armeija, historia (397.09)
alternative label: Brigader, Finlands armé, historia (397.09) @sv
alternative label: Divisioner, Finlands armé, historia (397.09) @sv
alternative label: Dragoner, Finlands armé, historia (397.09) @sv
alternative label: Finlands armé, historia (397.09) @sv
alternative label: Frivilligt försvarsarbete, Finlands armé, historia (397.09) @sv
alternative label: Fältartilleri, Finlands armé, historia (397.09) @sv
alternative label: Fältartister, Finlands armé, historia (397.09) @sv
alternative label: Försvarsmakten, Finland, historia (397.09) @sv
alternative label: Försvarsorganisationer, Finland, historia (397.09) @sv
alternative label: Garnisoner, Finlands armé, historia (397.09) @sv
alternative label: Hemförlovning, soldater, Finlands armé, historia (397.09) @sv
alternative label: Indelningsverket, historia, Finland (397.09) @sv
alternative label: Indelta arméer, historia, Finland (397.09) @sv
alternative label: Jägare, armén, Finlands armé, truppförband, historia (397.09) @sv
alternative label: Kaserner, Finlands armé, historia (397.09) @sv
alternative label: Kavalleri, Finlands armé, historia (397.09) @sv
alternative label: Kompanier, Finlands armé, historia (397.09) @sv
alternative label: Landstridskrafter, Finland, historia (397.09) @sv
alternative label: Lotta Svärd-organisationen, historia (397.09) @sv
alternative label: Lottor, lottaorganisationen, historia (397.09) @sv
alternative label: Marinen, Finland, historia (397.09) @sv
alternative label: Militärflyg, flygvapnet, historia, Finland (397.09) @sv
alternative label: Mobilisation, Finlands armé, historia (397.09) @sv
alternative label: Mobilisering, Finlands armé, historia (397.09) @sv
alternative label: Motoriserade trupper, Finland, historia (397.09) @sv
alternative label: Plutoner, Finlands armé, historia (397.09) @sv
alternative label: Regementen, Finlands armé, historia (397.09) @sv
alternative label: Repetitionsövningar, Finlands armé, historia (397.09) @sv
alternative label: Rotar, historia, Finland (397.09) @sv
alternative label: Rotesoldater, historia, Finland (397.09) @sv
alternative label: Skyddskårer, historia (397.09) @sv
alternative label: Smålottor, lottaorganisationen, historia (397.09) @sv
alternative label: Truppförband, Finlands armé, historia (397.09) @sv
alternative label: Utskrivning av krigsfolk, Finlands armé, historia (397.09) @sv
alternative label: Utskrivning av soldater, Finlands armé, historia (397.09) @sv
related: Suomen puolustusvoimat
related: Suomi

Filosofia. Teoria. Tutkimusmenetelmät
type: Class
type: Concept
subclass of: URN:NBN:fi:au:hklj:400
broader: URN:NBN:fi:au:hklj:400
in scheme: URN:NBN:fi:au:hklj:
notation: 401
preferred label: Philosophy. Theory. Research methods @en
preferred label: Filosofi. Teori. Forskningsmetoder @sv
scope note: Maantieteen yleinen filosofia, teoria ja tutkimusmenetelmät Eri maantieteen alojen filosofia, teoria ja tutkimusmenetelmät alan mukaisessa luokassa
scope note: Geografins allmänna filosofi, teori och forskningsmetoder Olika filosofier, teorier och forskningsmetoder inom geografi klassificeras enligt ämnesområde @sv

Tilastot. Taulukot
type: Class
type: Concept
subclass of: Kokoomateokset
broader: Kokoomateokset
in scheme: URN:NBN:fi:au:hklj:
notation: 408.3
preferred label: Statistics. Tables @en
preferred label: Statistik. Tabeller @sv
scope note: Maantiedettä tai maantietoa koskevat yleiset tai sekasisältöiset tilastot ja taulukot Eri maantieteen aloja tai eri maantieteellisiä alueita koskevat tilastot ja taulukot alan mukaisessa luokassa
scope note: Statistik och tabeller med allmänt eller blandat innehåll som rör geografi Statistik och tabeller som rör olika ämnesområden inom geografi eller olika geografiska områden klassificeras enligt ämnesområde @sv

URN:NBN:fi:au:hklj:487.084
alternative label: Sääkartat (487.084)
alternative label: Väderkartor (487.084) @sv
related: Maailmankartat. Maailmankartastot
related: Meteorologia. Klimatologia

URN:NBN:fi:au:hklj:5
alternative label: Amerikka, ranskankielinen kaunokirjallisuus (5 +)
alternative label: Pohjois-Amerikka, ranskankielinen kaunokirjallisuus (5 +)
alternative label: Ranskan kieli, kaunokirjallisuus (5 +)
alternative label: Amerika, fransk skönlitteratur (5 +) @sv
alternative label: Franska, skönlitteratur (5 +) @sv
alternative label: Nordamerika, fransk skönlitteratur (5 +) @sv
related: URN:NBN:fi:au:hklj:7.9
related: Ranskankielisen kirjallisuuden historia ja tutkimus

Standardit
type: Class
type: Concept
subclass of: Kokoomateokset
broader: Kokoomateokset
in scheme: URN:NBN:fi:au:hklj:
notation: 508.1
preferred label: Standards @en
preferred label: Standarder @sv
scope note: Luonnontieteitä koskevat yleiset tai sekasisältöiset standardit ja standardikokoelmat Eri luonnontieteen aloja koskevat standardit ja standardikokoelmat alan mukaisessa luokassa
scope note: Standarder eller samlingar av standarder med allmänt eller blandat innehåll som hänför sig till naturvetenskaperna Standarder eller samlingar med standarder som handlar om olika naturvetenskaper klassificeras enligt område @sv

Tilastot. Taulukot
type: Class
type: Concept
subclass of: Kokoomateokset
broader: Kokoomateokset
in scheme: URN:NBN:fi:au:hklj:
notation: 508.3
preferred label: Statistics. Tables @en
preferred label: Statistik. Tabeller @sv
scope note: Luontoa tai luonnontieteitä koskevat yleiset tai sekasisältöiset tilastot ja taulukot Eri luonnontieteen aloja koskevat tilastot ja taulukot alan mukaisessa luokassa
scope note: Statistik och tabeller med allmänt eller blandat innehåll som hänför sig till naturen eller naturvetenskaperna Statistik och tabeller som hänför sig till olika områden inom naturvetenskaperna klassificeras enligt område @sv

Kartat
type: Class
type: Concept
subclass of: Kokoomateokset
broader: Kokoomateokset
in scheme: URN:NBN:fi:au:hklj:
notation: 508.4
preferred label: Maps @en
preferred label: Kartor @sv
scope note: Luontoa tai luonnontieteitä koskevat yleiset tai sekasisältöiset kartat ja kartastot Eri luonnontieteen aloja koskevat kartat ja kartastot alan mukaisessa luokassa
scope note: Kartor och kartböcker med allmänt eller blandat innehåll som hänför sig till naturen eller naturvetenskaperna Kartor och kartböcker som hänför sig till olika områden inom naturvetenskaperna klassificeras enligt område @sv

Joukko-oppi
type: Class
type: Concept
subclass of: MATEMATIIKKA
alternative label: Epäjatkuvuus, joukko-oppi (511)
alternative label: Jatkuvuus, joukko-oppi (511)
alternative label: Joukko-oppi (511)
alternative label: Kontinuum, joukko-oppi (511)
alternative label: Matematiikka, joukko-oppi (511)
alternative label: Transfiniittiset luvut (511)
alternative label: Diskontinuitet, mängdlära (511) @sv
alternative label: Kontinuitet, mängdlära (511) @sv
alternative label: Kontinuum, mängdlära (511) @sv
alternative label: Matematik, mängdlära (511) @sv
alternative label: Matematik, talteori (511) @sv
alternative label: Mängdlära (511) @sv
alternative label: Transfinita tal (511) @sv
broader: MATEMATIIKKA
in scheme: URN:NBN:fi:au:hklj:
notation: 511
preferred label: Set theory @en
preferred label: Mängdlära @sv

Algebra
type: Class
type: Concept
subclass of: MATEMATIIKKA
alternative label: Abstrakti algebra (513)
alternative label: Algebra (513)
alternative label: Boolen algebra (513)
alternative label: Determinantit (513)
alternative label: Differenssialgebra (513)
alternative label: Differentiaalialgebra (513)
alternative label: Epäyhtälöt, algebra (513)
alternative label: Funktionaaliyhtälöt (513)
alternative label: Hadamardin matriisit (513)
alternative label: Hilat, algebra (513)
alternative label: Homologinen algebra (513)
alternative label: Jacobin determinantit (513)
alternative label: Jacobin matriisit (513)
alternative label: Lineaarialgebra (513)
alternative label: Matematiikka, algebra (513)
alternative label: Matriisilaskenta (513)
alternative label: Matriisit (513)
alternative label: Multilineaarialgebra (513)
alternative label: Polynomit (513)
alternative label: Potenssit (513)
alternative label: Ryhmäteoria, algebra (513)
alternative label: Tensorilaskenta (513)
alternative label: Transitiivisuus, algebra (513)
alternative label: Vektorianalyysi (513)
alternative label: Vektorit (513)
alternative label: Yhtälöt, algebra (513)
alternative label: Abstrakt algebra (513) @sv
alternative label: Boolesk algebra (513) @sv
alternative label: Determinanter (513) @sv
alternative label: Differensalgebra (513) @sv
alternative label: Differentialalgebra (513) @sv
alternative label: Ekvationer, algebra (513) @sv
alternative label: Funktionalekvationer (513) @sv
alternative label: Funktionalmatriser (513) @sv
alternative label: Gitter, algebra (513) @sv
alternative label: Gruppteori, algebra (513) @sv
alternative label: Hadamardmatriser (513) @sv
alternative label: Homologisk algebra (513) @sv
alternative label: Jacobian (513) @sv
alternative label: Jacobideterminanter (513) @sv
alternative label: Jacobimatriser (513) @sv
alternative label: Linjär algebra (513) @sv
alternative label: Matematik, algebra (513) @sv
alternative label: Matriser (513) @sv
alternative label: Matrisräkning (513) @sv
alternative label: Multilinearalgebra (513) @sv
alternative label: Olikheter, matematik (513) @sv
alternative label: Polynom (513) @sv
alternative label: Potenser (513) @sv
alternative label: Tensorkalkyl (513) @sv
alternative label: Transitivitet, albebra (513) @sv
alternative label: Vektoranalys (513) @sv
alternative label: Vektorer (513) @sv
broader: MATEMATIIKKA
in scheme: URN:NBN:fi:au:hklj:
notation: 513
scope note: Yleinen algebra. Teoreettinen algebra Boolen algebra. Differentiaali- ja differenssialgebra. Lineaari- ja multilineaarialgebra. Matriisilaskenta. Vektorilaskenta. Determinanttiteoria. Homologinen algebra. Ryhmäteoria
scope note: Allmän algebra. Teoretisk algebra Boolesk algebra. Differential- och differensalgebra. Lineär- och multilineär algebra. Matriskalkyl. Vektoranalys. Determinantteori. Homologisk algebra. Gruppteori @sv

Geometria
type: Class
type: Concept
subclass of: MATEMATIIKKA
alternative label: 3-ulotteisuus, avaruusgeometria (514)
alternative label: Affiinit geometriat (514)
alternative label: Algebrallinen topologia (514)
alternative label: Algebroiden geometriat (514)
alternative label: Alkeisgeometria (514)
alternative label: Analyyttinen geometria (514)
alternative label: Asymmetria, geometria (514)
alternative label: Asymptootti (514)
alternative label: Avaruusgeometria (514)
alternative label: Deskriptiivinen geometria (514)
alternative label: Differentiaaligeometria (514)
alternative label: Dimensio, geometria (514)
alternative label: Dimensioteoria (514)
alternative label: Ellipsit, geometria (514)
alternative label: Epäeuklidinen geometria (514)
alternative label: Epäsymmetria, geometria (514)
alternative label: Euklidinen geometria (514)
alternative label: Fraktaaligeometria (514)
alternative label: Fraktaalit (514)
alternative label: Geometria (514)
alternative label: Hyperbelit (514)
alternative label: Hyperboliset funktiot (514)
alternative label: Kolmiulotteisuus, avaruusgeometria (514)
alternative label: Kombinatorinen topologia (514)
alternative label: Kultainen leikkaus, geometria (514)
alternative label: Kuvaanto-oppi, geometria (514)
alternative label: Matematiikka, geometria (514)
alternative label: Monistot, topologia, matematiikka (514)
alternative label: Muodot, geometria (514)
alternative label: Muoto, geometria (514)
alternative label: Paraabelit (514)
alternative label: Perspektiivi, geometria (514)
alternative label: Pinta-ala, geometria (514)
alternative label: Polttopisteet (514)
alternative label: Polygonometria (514)
alternative label: Projektiivinen geometria (514)
alternative label: Projektio, geometria (514)
alternative label: Sectio aurea, geometria (514)
alternative label: Stereometria (514)
alternative label: Symmetria, geometria (514)
alternative label: Tila, geometria (514)
alternative label: Tilavuus, geometria (514)
alternative label: Topologia, matematiikka (514)
alternative label: Ulottuvuus, geometria (514)
alternative label: 3-dimensionalitet, rymdgeometri (514) @sv
alternative label: Affina geometrier (514) @sv
alternative label: Algebraisk topologi (514) @sv
alternative label: Algebrornas geometrier (514) @sv
alternative label: Analytisk geometri (514) @sv
alternative label: Area, geometri (514) @sv
alternative label: Asymmetri, geometri (514) @sv
alternative label: Asymptot (514) @sv
alternative label: Brännpunkter (514) @sv
alternative label: Deskriptiv geometri (514) @sv
alternative label: Differentialgeometri (514) @sv
alternative label: Dimension, dimensio, geometri (514) @sv
alternative label: Dimension, ulottuvuus, geometri (514) @sv
alternative label: Dimensionsteori (514) @sv
alternative label: Elementär geometri (514) @sv
alternative label: Ellipser, geometri (514) @sv
alternative label: Euklidisk geometri (514) @sv
alternative label: Form, geometri (514) @sv
alternative label: Former, geometri (514) @sv
alternative label: Fraktaler (514) @sv
alternative label: Fraktalgeometri (514) @sv
alternative label: Geometri (514) @sv
alternative label: Gyllene snittet, geometri (514) @sv
alternative label: Hyperbler (514) @sv
alternative label: Hyperboliska funktioner (514) @sv
alternative label: Icke-euklidisk geometri (514) @sv
alternative label: Kombinatorisk topologi (514) @sv
alternative label: Matematik, geometri (514) @sv
broader: MATEMATIIKKA
in scheme: URN:NBN:fi:au:hklj:
notation: 514
scope note: Yleinen geometria. Alkeisgeometria Euklidinen, epäeuklidinen ja analyyttinen geometria Polygonometria. Avaruusgeometria. Affiinit ja projektiiviset geometriat. Algebroiden geometriat. Deskriptiivinen geometria. Differentiaaligeometria. Topologia. Fraktaalit. Fraktaaligeometria
scope note: Allmän geometri. Elementär geometri Euklidisk, icke-euklidisk och analytisk geometri Polygonometri. Rymdgeometri. Affina och projektiva geometrier. Algebraiska geometrier. Deskriptiv geometri. Differentialgeometri. Topologi. Fraktaler. Fraktalgeometri @sv

Trigonometria
type: Class
type: Concept
subclass of: MATEMATIIKKA
alternative label: Arkusfunktiot, trigonometria (515)
alternative label: Matematiikka, trigonometria (515)
alternative label: Pallotrigonometria (515)
alternative label: Trigonometria (515)
alternative label: Trigonometriset funktiot (515)
alternative label: Arcusfunktioner, trigonometri (515) @sv
alternative label: Matematik, trigonometri (515) @sv
alternative label: Sfärisk trigonometri (515) @sv
alternative label: Trigonometri (515) @sv
alternative label: Trigonometriska funktioner (515) @sv
broader: MATEMATIIKKA
in scheme: URN:NBN:fi:au:hklj:
notation: 515
preferred label: Trigonometry @en
preferred label: Trigonometri @sv

Analyysi
type: Class
type: Concept
subclass of: MATEMATIIKKA
alternative label: Analyysi, matematiikka (516)
alternative label: Analyyttiset funktiot (516)
alternative label: Derivoiminen (516)
alternative label: Differenssiyhtälöt (516)
alternative label: Differentiaalilaskenta (516)
alternative label: Differentiaaliyhtälöt (516)
alternative label: Eksponenttifunktiot (516)
alternative label: Elementtimenetelmä (516)
alternative label: Fourier'n sarjat (516)
alternative label: Funktioanalyysi (516)
alternative label: Funktionaalianalyysi (516)
alternative label: Funktiot (516)
alternative label: Funktioteoria (516)
alternative label: Harmoninen analyysi (516)
alternative label: Hilbertin avaruudet, funktionaalianalyysi (516)
alternative label: Integraalilaskenta (516)
alternative label: Integraaliyhtälöt (516)
alternative label: Interpolointi (516)
alternative label: Inversio-ongelmat (516)
alternative label: Jatkuvuus, funktiot (516)
alternative label: Kompleksifunktiot (516)
alternative label: Limes, matemaattinen analyysi (516)
alternative label: Matemaattinen analyysi (516)
alternative label: Matemaattiset sarjat (516)
alternative label: Metriset avaruudet (516)
alternative label: Nevanlinnan teoria, funktiot (516)
alternative label: Normiavaruudet, funktioanalyysi (516)
alternative label: Ominaisarvot (516)
alternative label: Operaattorilaskenta (516)
alternative label: Operaattorit, matematiikka (516)
alternative label: Osittaisdifferentiaaliyhtälöt (516)
alternative label: Raja-arvo, limes (516)
alternative label: Rationaalifunktiot (516)
alternative label: Sarjat, matemaattiset sarjat (516)
alternative label: Sarjateoria (516)
alternative label: Tiheysfunktionaaliteoria (516)
alternative label: Variaatiolaskenta (516)
alternative label: Analys, matematik (516) @sv
alternative label: Analytiska funktioner (516) @sv
alternative label: Derivering (516) @sv
alternative label: Differensekvationer (516) @sv
alternative label: Differentialekvationer (516) @sv
alternative label: Differentialkalkyl (516) @sv
alternative label: Egenvärden (516) @sv
alternative label: Elementmetoden (516) @sv
alternative label: Exponentialfunktioner (516) @sv
alternative label: Fourierserier (516) @sv
alternative label: Funktionalanalys (516) @sv
alternative label: Funktioner (516) @sv
alternative label: Funktionsanalys (516) @sv
alternative label: Funktionsteori (516) @sv
alternative label: Gränsvärde, limes (516) @sv
alternative label: Harmonisk analys (516) @sv
alternative label: Hilbertrum, funktionalanalys (516) @sv
alternative label: Integralekvationer (516) @sv
alternative label: Integralkalkyl (516) @sv
alternative label: Interpolation (516) @sv
alternative label: Inversa problem (516) @sv
alternative label: Komplexa funktioner (516) @sv
alternative label: Kontinuitet, funktioner (516) @sv
alternative label: Limes, matematisk analys (516) @sv
alternative label: Matematisk analys (516) @sv
alternative label: Matematiska serier (516) @sv
alternative label: Metriska rum (516) @sv
alternative label: Nevanlinnateorin, funktioner (516) @sv
alternative label: Normerade rum, funktionsanalys (516) @sv
alternative label: Operatorkalkyl (516) @sv
alternative label: Operatörer, matematik (516) @sv
alternative label: Partiella differentialekvationer (516) @sv
alternative label: Rationella funktioner (516) @sv
alternative label: Serier, matematiska serier (516) @sv
alternative label: Serieteori (516) @sv
broader: MATEMATIIKKA
in scheme: URN:NBN:fi:au:hklj:
notation: 516
scope note: Differentiaalilaskenta. Integraalilaskenta Differentiaali- ja integraaliyhtälöt. Integraalimuunnokset Operaattoriteoria. Operaattorilaskenta. Variaatiolaskenta Funktiot. Funktioteoria. Funktioanalyysi Matemaattiset sarjat. Matemaattinen säätöteoria
scope note: Differentialkalkyl. Integralkalkyl Differential- och integralekvationer. Integraltransformationer Operatorteori. Operatorkalkyl. Variationskalkyl Funktioner. Funktionsteori. Funktionsanalys Matematiska serier. Matematisk reglerteori @sv

URN:NBN:fi:au:hklj:522.309
alternative label: Ajanlasku, ajanlaskun historia (522.309)
alternative label: Tideräkning, tideräkningens historia (522.309) @sv
alternative label: Veckodagar, tideräkningens historia (522.309) @sv
related: YLEISET KAUSIJULKAISUT
related: Ajanlasku

URN:NBN:fi:au:hklj:6
alternative label: Italian kieli, kaunokirjallisuus (6 +)
alternative label: Italienska, skönlitteratur (6 +) @sv
related: URN:NBN:fi:au:hklj:7.9
related: Italiankielisen kirjallisuuden historia ja tutkimus

Oppikirjat. Harjoituskirjat. Tehtäväkokoelmat
type: Class
type: Concept
subclass of: SOVELLETUT TIETEET
broader: SOVELLETUT TIETEET
in scheme: URN:NBN:fi:au:hklj:
notation: 602
preferred label: Textbooks. Exercise books. Collections of examination exercises @en
preferred label: Läroböcker. Övningsböcker. Samlingar av provuppgifter @sv
scope note: Sovellettuja tieteitä koskevat yleiset oppikirjat, harjoituskirjat ja tehtäväkokoelmat Eri sovellettujen tieteiden oppikirjat, harjoituskirjat ja tehtäväkokoelmat alan mukaisessa luokassa
scope note: Allmänna läroböcker, övningsböcker och samlingar av provuppgifter som rör tillämpad vetenskap Läroböcker, övningsböcker och samlingar av provuppgifter som rör olika tillämpade vetenskaper klassificeras enligt område @sv

Tilastot. Taulukot
type: Class
type: Concept
subclass of: Kokoomateokset
broader: Kokoomateokset
in scheme: URN:NBN:fi:au:hklj:
notation: 608.3
preferred label: Statistics. Tables @en
preferred label: Statistik. Tabeller @sv
scope note: Sovellettuja tieteitä koskevat yleiset tai sekasisältöiset tilastot ja taulukot Eri sovellettuja tieteitä koskevat tilastot ja taulukot alan mukaisessa luokassa
scope note: Statistik och tabeller med allmänt eller blandat innehåll som rör tillämpad vetenskap Statistik och tabeller som rör olika tillämpade vetenskaper klassificeras enligt område @sv

Kartat
type: Class
type: Concept
subclass of: Kokoomateokset
broader: Kokoomateokset
in scheme: URN:NBN:fi:au:hklj:
notation: 608.4
preferred label: Maps @en
preferred label: Kartor @sv
scope note: Sovellettuja tieteitä koskevat yleiset tai sekasisältöiset kartat ja kartastot Eri sovellettuja tieteitä koskevat kartat ja kartastot alan mukaisessa luokassa
scope note: Kartor och kartböcker med allmänt eller blandat innehåll som rör tillämpad vetenskap Kartor och kartböcker som rör olika tillämpade vetenskaper klassificeras enligt område @sv

URN:NBN:fi:au:hklj:670.09
alternative label: Liikekeskukset, kaupan historia (670.09)
alternative label: Vähittäiskauppa, kaupan historia (670.09)
alternative label: Affärscentra, handelns historia (670.09) @sv
alternative label: Detaljhandel, handelns historia (670.09) @sv
related: LIIKETALOUS. KAUPPA. MARKKINOINTI. LIIKENNEOPETUS
related: Kaupan historia

URN:NBN:fi:au:hklj:7.8
alternative label: Amerikka, portugalinkielinen kaunokirjallisuus (7.8)
alternative label: Etelä-Amerikka, port. kaunokirjallisuus (7.8)
alternative label: Portugalin kieli, kaunokirjallisuus (7.8)
alternative label: Amerika, portugisisk skönlitteratur (7.8) @sv
alternative label: Portugisiska, skönlitteratur (7.8) @sv
alternative label: Sydamerika, portugisisk skönlitteratur (7.8) @sv
related: URN:NBN:fi:au:hklj:7.9
related: Portugalinkielisen kirjallisuuden historia ja tutkimus

URN:NBN:fi:au:hklj:8.8
alternative label: Puolan kieli, kaunokirjallisuus (8.8)
alternative label: Polska, skönlitteratur (8.8) @sv
related: URN:NBN:fi:au:hklj:8.9
related: Slaavilaisten kielten kirjallisuuden historia ja tutkimus

URN:NBN:fi:au:hklj:8.98
alternative label: Ukrainan kieli, kaunokirjallisuus (8.98)
alternative label: Ukrainska, skönlitteratur (8.98) @sv
related: URN:NBN:fi:au:hklj:8.9
related: Slaavilaisten kielten kirjallisuuden historia ja tutkimus

Historia
type: Class
type: Concept
subclass of: URN:NBN:fi:au:hklj:800
alternative label: Kirjallisuudentutkimus, historia (800.09)
alternative label: Kirjallisuustiede, historia (800.09)
alternative label: Litteraturforskning, historia (800.09) @sv
alternative label: Litteraturvetenskap, historia (800.09) @sv
broader: URN:NBN:fi:au:hklj:800
in scheme: URN:NBN:fi:au:hklj:
notation: 800.09
preferred label: History @en
scope note: Kirjallisuudentutkimuksen historia ja suuntaukset yleensä Jos teos koskee tiettyä kirjallisuustyyppiä tai aihepiiriä, tietyn kielen tai tietyn aikakauden kirjallisuutta, on etusija järjestyksessä: kirjallisuustyyppi tai aihepiiri, kieli, aikakausi
scope note: Litteraturforskningens historia och riktningar i allmänhet Om verket representerar en bestämd genre eller ett bestämt temaområde inom litteraturen eller om det hänför sig till litteraturen på ett bestämt språk eller under en bestämd tidsperiod, är prioritetsordningen följande: litterär genre eller temaområde, språk, tidsperiod @sv

Muinaisintialaiset kielet
type: Class
type: Concept
subclass of: Indoiraaniset kielet
alternative label: Indoarjalaiset kielet, muinaisintialaiset kielet (861.1)
alternative label: Intialaiset kielet, muinaisintialaiset kielet (861.1)
alternative label: Palin kieli (861.1)
alternative label: Prakritin kieli (861.1)
alternative label: Sanskriitin kieli (861.1)
alternative label: Sanskriitin kieli, kielitiede (861.1)
alternative label: Indariska språk, fornindiska språk (861.1) @sv
alternative label: Indiska språk, fornindiska språk (861.1) @sv
alternative label: Pali (861.1) @sv
alternative label: Prakrit (861.1) @sv
alternative label: Sanskrit (861.1) @sv
alternative label: Sanskrit, lingvistik (861.1) @sv
broader: Indoiraaniset kielet
in scheme: URN:NBN:fi:au:hklj:
notation: 861.1
preferred label: Current Indian languages @en
preferred label: Fornindiska språk @sv
scope note: Sanskritin kieli
scope note: Sanskrit @sv

Nykyintialaiset kielet
type: Class
type: Concept
subclass of: Indoiraaniset kielet
alternative label: Bengalin kieli (861.3)
alternative label: Bengalin kieli, kielitiede (861.3)
alternative label: Biharin kieli (861.3)
alternative label: Gudzaratin kieli (861.3)
alternative label: Gudzaratin kieli, kielitiede (861.3)
alternative label: Hindin kieli (861.3)
alternative label: Hindin kieli, kielitiede (861.3)
alternative label: Indoarjalaiset kielet, nykyintialaiset kielet (861.3)
alternative label: Intialaiset kielet, nykyintialaiset kielet (861.3)
alternative label: Kasmirin kieli (861.3)
alternative label: Marathin kieli (861.3)
alternative label: Nepalin kieli (861.3)
alternative label: Nepalin kieli, kielitiede (861.3)
alternative label: Orijan kieli (861.3)
alternative label: Pandzabin kieli (861.3)
alternative label: Pandzabin kieli, kielitiede (861.3)
alternative label: Rajasthanin kieli (861.3)
alternative label: Romanikieli (861.3)
alternative label: Romanikieli, kielitiede (861.3)
alternative label: Sindhin kieli (861.3)
alternative label: Sindhin kieli, kielitiede (861.3)
alternative label: Singhalin kieli (861.3)
alternative label: Urdun kieli (861.3)
alternative label: Urdun kieli, kielitiede (861.3)
alternative label: Bengali (861.3) @sv
alternative label: Bengali, lingvistik (861.3) @sv
alternative label: Bihar (861.3) @sv
alternative label: Gujarati (861.3) @sv
alternative label: Gujarati, lingvistik (861.3) @sv
alternative label: Hindi (861.3) @sv
alternative label: Hindi, lingvistik (861.3) @sv
alternative label: Indariska språk, moderna indiska språk (861.3) @sv
alternative label: Indiska språk, moderna indiska språk (861.3) @sv
alternative label: Kashmiriska (861.3) @sv
alternative label: Marathi, språket (861.3) @sv
alternative label: Nepalesiska (861.3) @sv
alternative label: Nepalesiska, lingvistik (861.3) @sv
alternative label: Oriya-språket (861.3) @sv
alternative label: Panjabi (861.3) @sv
alternative label: Panjabi, lingvistik (861.3) @sv
alternative label: Rajasthani (861.3) @sv
alternative label: Romani (861.3) @sv
alternative label: Romani, lingvistik (861.3) @sv
alternative label: Sindhi (861.3) @sv
alternative label: Sindhi, lingvistik (861.3) @sv
alternative label: Singalesiska (861.3) @sv
alternative label: Urdu (861.3) @sv
alternative label: Urdu, lingvistik (861.3) @sv
broader: Indoiraaniset kielet
in scheme: URN:NBN:fi:au:hklj:
notation: 861.3
preferred label: Iranian languages @en
preferred label: Levande indiska språk @sv
scope note: Assamin, bengalin, biharin, gudzaratin, hindin, kasmirin, marathin, nepalin, orijan, pandzabin, rajasthanin, sindhin, singalin ja urdun kielet Mustalaiskieli eli romani
scope note: Assamesiska, bengali, bihari, gujarati, hindi, kashmiri, marathi, nepalesiska, oriya, panjabi, rajasthani, sindhi, singalesiska och urdu Romani (zigenarspråk) @sv

Nykykreikan kieli
type: Class
type: Concept
subclass of: Kreikan kieli
alternative label: Kreikan kieli, nykykreikka (862.1)
alternative label: Nykykreikan kieli (862.1)
alternative label: Nykykreikan kieli, kielitiede (862.1)
alternative label: Grekiska, nygrekiska (862.1) @sv
alternative label: Nygrekiska (862.1) @sv
alternative label: Nygrekiska, lingvistik (862.1) @sv
broader: Kreikan kieli
in scheme: URN:NBN:fi:au:hklj:
notation: 862.1
preferred label: Modern Greek @en
preferred label: Modern grekiska @sv

Latinan kieli
type: Class
type: Concept
subclass of: URN:NBN:fi:au:hklj:860
alternative label: Indoeurooppalaiset kielet, eri indoeurooppalaiset kielet (861 ... 879 +)
alternative label: Keskiajan latina (863)
alternative label: Kirkkolatina (863)
alternative label: Kirkkolatina, kielitiede (863)
alternative label: Klassiset kielet, latina (863)
alternative label: Latinan kieli (863)
alternative label: Latinan kieli, kielitiede (863)
alternative label: Latinan kieli, uusi aika (863)
alternative label: Latinan kieli, uusi aika, kielitiede (863)
alternative label: Nykylatina (863)
alternative label: Nykylatina, kielitiede (863)
alternative label: Uudenajan latina (863)
alternative label: Uudenajan latina, kielitiede (863)
alternative label: Uuslatina (863)
alternative label: Uuslatina, kielitiede (863)
alternative label: Ylioppilastehtävät, latinan kieli (863)
alternative label: Indoeuropeiska språk, olika indoeuropeiska språk (861 ... 879 +) @sv
alternative label: Klassiska språk, latin (863) @sv
alternative label: Kyrkolatin (863) @sv
alternative label: Kyrkolatin, lingvistik (863) @sv
alternative label: Latin (863) @sv
alternative label: Latin, lingvistik (863) @sv
alternative label: Latin, nya tiden (863) @sv
alternative label: Latin, nya tiden, lingvistik (863) @sv
alternative label: Medeltida latin (863) @sv
alternative label: Studentuppgifter, latin (863) @sv
broader: URN:NBN:fi:au:hklj:860
in scheme: URN:NBN:fi:au:hklj:
notation: 863
preferred label: Latin @en

Galegon, katalaanin, ladinon, oksitaanin, retoromaanin ja sardin kieli
type: Class
type: Concept
subclass of: URN:NBN:fi:au:hklj:860
alternative label: Dalmatian kieli (864)
alternative label: Galegon kieli (864)
alternative label: Galegon kieli , kielitiede (864)
alternative label: Galician kieli (864)
alternative label: Galician kieli, kielitiede (864)
alternative label: Indoeurooppalaiset kielet, eri indoeurooppalaiset kielet (861 ... 879 +)
alternative label: Katalaanin kieli (864)
alternative label: Katalaanin kieli, kielitiede (864)
alternative label: Ladinon kieli (864)
alternative label: Oksitaanin kieli (864)
alternative label: Oksitaanin kieli, kielitiede (864)
alternative label: Provensaalin kieli (864)
alternative label: Retoromaanin kieli (864)
alternative label: Retoromaanin kieli, kielitiede (864)
alternative label: Romaaniset kielet, eri kielet (864 ... 869)
alternative label: Sardin kieli (864)
alternative label: Sardin kieli, kielitiede (864)
alternative label: Dalmatiska (864) @sv
alternative label: Galego (864) @sv
alternative label: Galego, lingvistik (864) @sv
alternative label: Galiciska (864) @sv
alternative label: Galiciska, lingvistik (864) @sv
alternative label: Indoeuropeiska språk, olika indoeuropeiska språk (861 ... 879 +) @sv
alternative label: Katalanska (864) @sv
alternative label: Katalanska, lingvistik (864) @sv
alternative label: Ladino (864) @sv
alternative label: Occitanska (864) @sv
alternative label: Occitanska, lingvistik (864) @sv
alternative label: Provensalska (864) @sv
alternative label: Retoromanska (864) @sv
alternative label: Retoromanska, lingvistik (864) @sv
alternative label: Romanska språk, olika språk (864 ... 869) @sv
alternative label: Sardiska (864) @sv
alternative label: Sardiska, lingvistik (864) @sv
broader: URN:NBN:fi:au:hklj:860
in scheme: URN:NBN:fi:au:hklj:
notation: 864
preferred label: Catalan, Galego, Ladino Provençal, Rhaeto-Romanic and Sardinian @en
preferred label: Galego, katalanska, ladino, occitanska, rätoromanska och sardiska @sv

Italian kieli
type: Class
type: Concept
subclass of: URN:NBN:fi:au:hklj:860
alternative label: Indoeurooppalaiset kielet, eri indoeurooppalaiset kielet (861 ... 879 +)
alternative label: Italian kieli (865)
alternative label: Italian kieli, kielitiede (865)
alternative label: Kielikurssit, italian kieli (865)
alternative label: Kuullun ymmärtäminen, italian kieli (865)
alternative label: Kuullunymmärtäminen, italian kieli (865)
alternative label: Luetun ymmärtäminen, italian kieli (865)
alternative label: Romaaniset kielet, eri kielet (864 ... 869)
alternative label: Hörförståelse, italienska (865) @sv
alternative label: Indoeuropeiska språk, olika indoeuropeiska språk (861 ... 879 +) @sv
alternative label: Italienska (865) @sv
alternative label: Italienska, lingvistik (865) @sv
alternative label: Läsförståelse, italienska (865) @sv
alternative label: Romanska språk, olika språk (864 ... 869) @sv
alternative label: Språkkurser, italienska (865) @sv
broader: URN:NBN:fi:au:hklj:860
in scheme: URN:NBN:fi:au:hklj:
notation: 865
preferred label: Italyn @en
preferred label: Italienska @sv

Ranskan kieli
type: Class
type: Concept
subclass of: URN:NBN:fi:au:hklj:860
alternative label: Indoeurooppalaiset kielet, eri indoeurooppalaiset kielet (861 ... 879 +)
alternative label: Kanadanranska (866)
alternative label: Kielikurssit, ranskan kieli (866)
alternative label: Kuullun ymmärtäminen, ranskan kieli (866)
alternative label: Kuullunymmärtäminen, ranskan kieli (866)
alternative label: Luetun ymmärtäminen, ranskan kieli (866)
alternative label: Ranskan kieli (866)
alternative label: Ranskan kieli, kielitiede (866)
alternative label: Romaaniset kielet, eri kielet (864 ... 869)
alternative label: Ylioppilastehtävät, ranskan kieli (866)
alternative label: Franska (866) @sv
alternative label: Franska, lingvistik (866) @sv
alternative label: Hörförståelse, franska (866) @sv
alternative label: Indoeuropeiska språk, olika indoeuropeiska språk (861 ... 879 +) @sv
alternative label: Kanadensisk franska (866) @sv
alternative label: Läsförståelse, franska (866) @sv
alternative label: Romanska språk, olika språk (864 ... 869) @sv
alternative label: Språkkurser, franska (866) @sv
alternative label: Studentuppgifter, franska (866) @sv
broader: URN:NBN:fi:au:hklj:860
in scheme: URN:NBN:fi:au:hklj:
notation: 866
preferred label: French @en
preferred label: Franska @sv

Espanjan kieli
type: Class
type: Concept
subclass of: URN:NBN:fi:au:hklj:860
alternative label: Amerikanespanja (867)
alternative label: Espanjan kieli (867)
alternative label: Espanjan kieli, kielitiede (867)
alternative label: Indoeurooppalaiset kielet, eri indoeurooppalaiset kielet (861 ... 879 +)
alternative label: Kielikurssit, espanjan kieli (867)
alternative label: Kuullun ymmärtäminen, espanjan kieli (867)
alternative label: Kuullunymmärtäminen, espanjan kieli (867)
alternative label: Luetun ymmärtäminen, espanjan kieli (867)
alternative label: Romaaniset kielet, eri kielet (864 ... 869)
alternative label: Ylioppilastehtävät, espanjan kieli (867)
alternative label: Amerikansk spanska (867) @sv
alternative label: Hörförståelse, spanska (867) @sv
alternative label: Indoeuropeiska språk, olika indoeuropeiska språk (861 ... 879 +) @sv
alternative label: Läsförståelse, spanska (867) @sv
alternative label: Romanska språk, olika språk (864 ... 869) @sv
alternative label: Spanska (867) @sv
alternative label: Spanska, lingvistik (867) @sv
alternative label: Språkkurser, spanska (867) @sv
alternative label: Studentuppgifter, spanska (867) @sv
broader: URN:NBN:fi:au:hklj:860
in scheme: URN:NBN:fi:au:hklj:
notation: 867
preferred label: Spanish @en
preferred label: Spanska @sv

Portugalin kieli
type: Class
type: Concept
subclass of: URN:NBN:fi:au:hklj:860
alternative label: Amerikanportugali (868)
alternative label: Indoeurooppalaiset kielet, eri indoeurooppalaiset kielet (861 ... 879 +)
alternative label: Portugalin kieli (868)
alternative label: Portugalin kieli, kielitiede (868)
alternative label: Romaaniset kielet, eri kielet (864 ... 869)
alternative label: Amerikansk portugisiska (868) @sv
alternative label: Indoeuropeiska språk, olika indoeuropeiska språk (861 ... 879 +) @sv
alternative label: Portugisiska (868) @sv
alternative label: Portugisiska, lingvistik (868) @sv
alternative label: Romanska språk, olika språk (864 ... 869) @sv
broader: URN:NBN:fi:au:hklj:860
in scheme: URN:NBN:fi:au:hklj:
notation: 868
preferred label: Portuguese @en
preferred label: Portugisiska @sv

URN:NBN:fi:au:hklj:872.03
alternative label: Riikinruotsi, sanakirjat, kaksikieliset (872.03)
alternative label: Ruotsin kieli, sanakirjat, kaksikieliset (872.03)
alternative label: Ruotsin ruotsi, sanakirjat, kaksikieliset (872.03)
alternative label: Ruotsinruotsi, sanakirjat, kaksikieliset (872.03)
alternative label: Rikssvenska, ordböcker, tvåspråkiga (872.03) @sv
alternative label: Svenska, ordböcker, tvåspråkiga (872.03) @sv
alternative label: Sverigesvenska, ordböcker, tvåspråkiga (872.03) @sv
related: Ruotsin kieli
related: Ruotsin kielen yksikieliset sanakirjat

URN:NBN:fi:au:hklj:874.03
alternative label: Saksan kieli, sanakirjat (874.03)
alternative label: Tyska, ordböcker (874.03) @sv
related: Saksan kieli
related: Saksan kielen yksikieliset sanakirjat

URN:NBN:fi:au:hklj:875.03
alternative label: Englannin kieli, sanakirjat (875.03)
alternative label: Engelska, ordböcker (875.03) @sv
related: Englannin kieli
related: Englannin kielen yksikieliset sanakirjat

Suomalais-ugrilaiset kielet
type: Class
type: Concept
subclass of: URALILAISET KIELET. ALTAILAISET KIELET
alternative label: Suomalais-ugrilaiset kielet (881 ... 887 +)
alternative label: Suomalais-ugrilaiset kielet, kielitiede (881 ... 887 +)
alternative label: Finsk-ugriska språk (881 ... 887 +) @sv
alternative label: Finsk-ugriska språk, lingvistik (881 ... 887 +) @sv
broader: URALILAISET KIELET. ALTAILAISET KIELET
in scheme: URN:NBN:fi:au:hklj:
notation: 881
preferred label: Finno-Ugric languages @en
preferred label: Finsk-ugriska språk @sv
scope note: Yleisteokset suomalais-ugrilaisista kielistä
scope note: Allmänna verk om finsk-ugriska språk @sv

Volgansuomalaiset kielet. Permiläiset kielet
type: Class
type: Concept
subclass of: URALILAISET KIELET. ALTAILAISET KIELET
alternative label: Ersän kieli (882)
alternative label: Ersän kieli, kielitiede (882)
alternative label: Komin kieli (882)
alternative label: Marin kieli (882)
alternative label: Marin kieli, kielitiede (882)
alternative label: Moksan kieli (882)
alternative label: Mordvan kieli (882)
alternative label: Mordvan kieli, kielitiede (882)
alternative label: Permiläiset kielet (882)
alternative label: Permiläiset kielet, kielitiede (882)
alternative label: Suomalais-ugrilaiset kielet (881 ... 887 +)
alternative label: Suomalais-ugrilaiset kielet, kielitiede (881 ... 887 +)
alternative label: Syrjäänin kieli (882)
alternative label: Syrjäänin kieli, kielitiede (882)
alternative label: Tseremissin kieli (882)
alternative label: Tseremissin kieli, kielitiede (882)
alternative label: Udmurtin kieli (882)
alternative label: Udmurtin kieli, kielitiede (882)
alternative label: Volgalaiset kielet (882)
alternative label: Volgalaiset kielet, kielitiede (882)
alternative label: Votjakin kieli (882)
alternative label: Votjakin kieli, kielitiede (882)
alternative label: Erzamordvinska (882) @sv
alternative label: Erzamordvinska, lingvistik (882) @sv
alternative label: Finsk-ugriska språk (881 ... 887 +) @sv
alternative label: Finsk-ugriska språk, lingvistik (881 ... 887 +) @sv
alternative label: Komi (882) @sv
alternative label: Mari (882) @sv
alternative label: Mari, lingvistik (882) @sv
alternative label: Moksha-språket (882) @sv
alternative label: Mordvinska (882) @sv
alternative label: Mordvinska, lingvistik (882) @sv
alternative label: Permiska språk (882) @sv
alternative label: Permiska språk, lingvistik (882) @sv
alternative label: Syrjänska (882) @sv
alternative label: Syrjänska, lingvistik (882) @sv
alternative label: Tjeremissiska (882) @sv
alternative label: Tjeremissiska, lingvistik (882) @sv
alternative label: Udmurtiska (882) @sv
alternative label: Udmurtiska, lingvistik (882) @sv
alternative label: Volgafinska språk (882) @sv
alternative label: Volgafinska språk, lingvistik (882) @sv
alternative label: Votjakiska (882) @sv
alternative label: Votjakiska, lingvistik (882) @sv
broader: URALILAISET KIELET. ALTAILAISET KIELET
in scheme: URN:NBN:fi:au:hklj:
notation: 882
preferred label: Volga-Finnish languages. Permian languages @en
preferred label: Volgafinska språk. Permiska språk @sv
scope note: Mordvan, syrjäänin (komin), tseremissin (marin) ja votjakin (udmurtin) kieli
scope note: Mordvinska, syrjänska (komi), tjeremissiska (mari) och udmurtiska (votjakiska) @sv

URN:NBN:fi:au:hklj:884.09
alternative label: Suomen kielen tutkimuksen historia (884.09)
alternative label: Finska språkforskningen historia (884.09) @sv
related: Suomen kieli
related: Suomen kielen historia

URN:NBN:fi:au:hklj:884.203
alternative label: Etunimisanakirjat, suomen kieli (884.203)
alternative label: Etymologiset sanakirjat, suomen kieli (884.203)
alternative label: Henkilönnimet, suomen kieli (884.203)
alternative label: Merkkipäivät, nimipäiväkirjat, suomi (884.203)
alternative label: Nimenanto, nimisanakirjat, suomen kieli (884.203)
alternative label: Nimet, nimisanakirjat, suomen kieli (884.203)
alternative label: Nimipäiväsanakirjat, suomen kieli (884.203)
alternative label: Nimistö, nimisanakirjat, suomi (884.203)
alternative label: Suomen kieli, etymologiset sanakirjat (884.203)
alternative label: Suomen kieli, nimisanakirjat (884.203)
alternative label: Syntymäpäivät, syntymäpäiväsanakirjat, suomi (884.203)
alternative label: Bemärkelsedagar, namnsdagsböcker, finska (884.203) @sv
alternative label: Etymologiska ordböcker, finska (884.203) @sv
alternative label: Finska, etymologiska ordböcker (884.203) @sv
alternative label: Finska, namnordböcker (884.203) @sv
alternative label: Födelsedagar, födelsedagsordböcker, finska (884.203) @sv
alternative label: Förnamnslexikon, finska (884.203) @sv
alternative label: Namn, namnordböcker, finska (884.203) @sv
alternative label: Namnbestånd, namnordböcker, finska (884.203) @sv
alternative label: Namngivning, namnordböcker, finska (884.203) @sv
alternative label: Namnsdagslexikon, finska (884.203) @sv
alternative label: Personnamn, finska (884.203) @sv
related: Suomen kielen etymologia ja onomastiikka
related: Suomen kielen yksikieliset sanakirjat

URN:NBN:fi:au:hklj:884.603
alternative label: Murresanakirjat, suomen kieli (884.603)
alternative label: Slangisanakirjat, suomen kieli (884.603)
alternative label: Suomen kieli, murresanakirjat (884.603)
alternative label: Dialektlexikon, finska (884.603) @sv
alternative label: Finska, dialektordböcker (884.603) @sv
alternative label: Slangordböcker, finska (884.603) @sv
related: Suomen kielen yksikieliset sanakirjat
related: Suomen kielen murteet

Saamen kieli
type: Class
type: Concept
subclass of: URALILAISET KIELET. ALTAILAISET KIELET
alternative label: Eteläsaame, saamen kieli (886)
alternative label: Kantasaame (886)
alternative label: Koltan kieli (886)
alternative label: Koltan kieli, kielitiede (886)
alternative label: Lapin kieli (886)
alternative label: Lapin kieli, kielitiede (886)
alternative label: Saamen kieli (886)
alternative label: Saamen kieli, kielitiede (886)
alternative label: Suomalais-ugrilaiset kielet (881 ... 887 +)
alternative label: Suomalais-ugrilaiset kielet, kielitiede (881 ... 887 +)
alternative label: Finsk-ugriska språk (881 ... 887 +) @sv
alternative label: Finsk-ugriska språk, lingvistik (881 ... 887 +) @sv
alternative label: Lapska (886) @sv
alternative label: Lapska, lingvistik (886) @sv
alternative label: Samiska (886) @sv
alternative label: Samiska, lingvistik (886) @sv
alternative label: Skoltsamiska (886) @sv
alternative label: Skoltsamiska, lingvistik (886) @sv
alternative label: Sydsamiska, samiska (886) @sv
alternative label: Ursamiska (886) @sv
broader: URALILAISET KIELET. ALTAILAISET KIELET
in scheme: URN:NBN:fi:au:hklj:
notation: 886
preferred label: Sami @en
preferred label: Samiska @sv

Unkarin kieli
type: Class
type: Concept
subclass of: Ugrilaiset kielet
alternative label: Unkarin kieli (887.3)
alternative label: Unkarin kieli, kielitiede (887.3)
alternative label: Ungerska (887.3) @sv
alternative label: Ungerska, lingvistik (887.3) @sv
broader: Ugrilaiset kielet
in scheme: URN:NBN:fi:au:hklj:
notation: 887.3
preferred label: Hungarian @en
preferred label: Ungerska @sv

Heprean kieli
type: Class
type: Concept
subclass of: Seemiläiset kielet
alternative label: Heprean kieli (891.11)
alternative label: Heprean kieli, kielitiede (891.11)
alternative label: Ivritin kieli (891.11)
alternative label: Ivritin kieli, kielitiede (891.11)
alternative label: Hebreiska (891.11) @sv
alternative label: Hebreiska, lingvistik (891.11) @sv
alternative label: Ivrit (891.11) @sv
alternative label: Ivrit, lingvistik (891.11) @sv
broader: Seemiläiset kielet
in scheme: URN:NBN:fi:au:hklj:
notation: 891.11
preferred label: Hebrew @en
preferred label: Hebreiska @sv

Arabian kieli
type: Class
type: Concept
subclass of: Seemiläiset kielet
alternative label: Arabian kieli (891.12)
alternative label: Arabian kieli, kielitiede (891.12)
alternative label: Arabistiikka, arabian kieli (891.12)
alternative label: Arabistiikka, kielitiede (891.12)
alternative label: Arabiska (891.12) @sv
alternative label: Arabiska, lingvistik (891.12) @sv
alternative label: Arabistik, arabiska (891.12) @sv
alternative label: Arabistik, lingvistik (891.12) @sv
broader: Seemiläiset kielet
in scheme: URN:NBN:fi:au:hklj:
notation: 891.12
preferred label: Arabic @en
preferred label: Arabiska @sv

Haamilaiset kielet
type: Class
type: Concept
subclass of: Seemiläiset kielet. Haamilaiset kielet
alternative label: Belutsin kieli (891.2)
alternative label: Berberikielet (891.2)
alternative label: Egyptin kieli, muinaisajan (891.2)
alternative label: Haamilaiset kielet (891.2)
alternative label: Haamilaiset kielet, kielitiede (891.2)
alternative label: Hausan kieli (891.2)
alternative label: Koptin kieli (891.2)
alternative label: Kuusilaiset kielet (891.2)
alternative label: Somalin kieli (891.2)
alternative label: Somalin kieli, kielitiede (891.2)
alternative label: Beluchi (891.2) @sv
alternative label: Berberspråk (891.2) @sv
alternative label: Egyptiska, fornegyptiska (891.2) @sv
alternative label: Hamitiska språk (891.2) @sv
alternative label: Hamitiska språk, lingvistik (891.2) @sv
alternative label: Haussa (891.2) @sv
alternative label: Koptiska (891.2) @sv
alternative label: Kushitiska språk (891.2) @sv
alternative label: Somaliska (891.2) @sv
alternative label: Somaliska, lingvistik (891.2) @sv
broader: Seemiläiset kielet. Haamilaiset kielet
in scheme: URN:NBN:fi:au:hklj:
notation: 891.2
preferred label: Hamitic languages @en
preferred label: Hamitiska språk @sv
scope note: Berberikielet. Kuusilaiset kielet. Hausan kieli. Somalin kieli
scope note: Berberspråk. Kushitiska språk. Hausa. Somaliska @sv

Afrikan kielet
type: Class
type: Concept
subclass of: MUUT KIELET
alternative label: Afrikka, alkuperäiskielet (898)
alternative label: Akanin kieli (898)
alternative label: Akanin kieli, kielitiede (898)
alternative label: Bantukielet (898)
alternative label: Busmannikielet (898)
alternative label: Hottentottikielet (898)
alternative label: Khoisankielet (898)
alternative label: Lingalan kieli (898)
alternative label: Lingalan kieli, kielitiede (898)
alternative label: Negroafrikkalaiset kielet (898)
alternative label: Nubialaiset kielet (898)
alternative label: Paleoafrikkalaiset kielet (898)
alternative label: Suahilin kieli (898)
alternative label: Suahilin kieli, kielitiede (898)
alternative label: Sudanilaiset kielet (898)
alternative label: Swahilin kieli (898)
alternative label: Swahilin kieli, kielitiede (898)
alternative label: Afrika, ursprungsspråk (898) @sv
alternative label: Akan (898) @sv
alternative label: Akan, lingvistik (898) @sv
alternative label: Bantuspråk (898) @sv
alternative label: Bushmanspråk (898) @sv
alternative label: Hottentottspråk (898) @sv
alternative label: Khoisanspråk (898) @sv
alternative label: Lingala (898) @sv
alternative label: Lingala, lingvistik (898) @sv
alternative label: Negroafrikanska språk (898) @sv
alternative label: Nubiska språk (898) @sv
alternative label: Paleoafrikanska språk (898) @sv
alternative label: Suahili (898) @sv
alternative label: Suahili, lingvistik (898) @sv
alternative label: Sudanesiska språk (898) @sv
alternative label: Swahili (898) @sv
alternative label: Swahili, lingvistik (898) @sv
broader: MUUT KIELET
in scheme: URN:NBN:fi:au:hklj:
notation: 898
preferred label: African languages @en
preferred label: Afrikanska språk @sv
scope note: Saharan, Etiopian ja Somalian eteläpuolella puhutut afrikkalaiset kielet Khoisankielet. Sudanilaiset kielet. Bantukielet. Busmannikielet. Hottentottikielet. Swahilin kieli. Lingalan kieli
scope note: Afrikanska språk som talas söder om Sahara, Etiopien och Somalia Sudanska språk. Xhosaspråk. Bantuspråk. Bushmanspråk. Hottentottspråk. Swahili. Lingala @sv

URN:NBN:fi:au:hklj:9.2
alternative label: Klassillinen kreikka, kaunokirjallisuus (9.2)
alternative label: Klassinen kreikka, kaunokirjallisuus (9.2)
alternative label: Kreikan kieli, muinaiskreikka, kaunokirjall. (9.2)
alternative label: Muinaiskreikan kieli, kaunokirjallisuus (9.2)
alternative label: Muinaiskreikka, kaunokirjallisuus (9.2)
alternative label: Grekiska, forngrekiska, skönlitt. (9.2) @sv
alternative label: Klassisk grekiska, skönlitteratur (9.2) @sv
related: Kreikankielisen kirjallisuuden historia ja tutkimus
related: Nykykreikankielisen kirjallisuuden historia ja tutkimus

URN:NBN:fi:au:hklj:9.3
alternative label: Latinan kieli, kaunokirjallisuus (9.3)
alternative label: Latinan kieli, uusi aika, kaunokirjallisuus (9.3)
alternative label: Nykylatina, kaunokirjallisuus (9.3)
alternative label: Uudenajan latina, kaunokirjallisuus (9.3)
alternative label: Uuslatina, kaunokirjallisuus (9.3)
alternative label: Latin, nya tiden, skönlitteratur (9.3) @sv
alternative label: Latin, skönlitteratur (9.3) @sv
related: URN:NBN:fi:au:hklj:7.9
related: Latinankielisen kirjallisuuden historia ja tutkimus

URN:NBN:fi:au:hklj:9.7
alternative label: Austroaasialaiset kielet, kaunokirjallisuus (9.7 +)
alternative label: Tiibetiläis-burmalaiset kielet, kaunokirjallisuus (9.7 +)
alternative label: Austroasiatiska språk, skönlitteratur (9.7 +) @sv
alternative label: Tibeto-burmanska språk, skönlitteratur (9.7 +) @sv
related: Kiinankielisen kirjallisuuden historia ja tutkimus
related: Muiden kielten kirjallisuuden historia ja tutkimus

URN:NBN:fi:au:hklj:9.97
alternative label: Mongolin kieli, kaunokirjallisuus (9.97)
alternative label: Mongoliska, skönlitteratur (9.97) @sv
related: Muiden kielten kirjallisuuden historia ja tutkimus
related: URN:NBN:fi:au:hklj:9.4

URN:NBN:fi:au:hklj:900.09
alternative label: Historia, historiankirjoituksen historia (900.09)
alternative label: Historiankirjoitus, historiankirjoituksen (900.09)
alternative label: Historiatieteet, historiankirjoituksen historia (900.09)
alternative label: Vaihtoehtohistoria, historiankirjoituksen historia (900.09)
alternative label: Vaihtoehtoinen historia, historiankirjoituksen historia (900.09)
alternative label: Alternativ historia, historieskrivningens historia (900.09) @sv
alternative label: Historia, historieskrivningens historia (900.09) @sv
alternative label: Historieskrivning, historieskrivningens (900.09) @sv
alternative label: Historiska vetenskaper, historieskrivningens historia (900.09) @sv
related: URN:NBN:fi:au:hklj:900
related: Historian tutkimusmenetelmät

Suomenkieliset runot (Kaunoluokka)
type: Class
type: Concept
type: FormClass
subclass of: SUOMENKIELINEN KAUNOKIRJALLISUUS (Kaunoluokka)
broader: SUOMENKIELINEN KAUNOKIRJALLISUUS (Kaunoluokka)
in scheme: URN:NBN:fi:au:hklj:
notation: 1.2
preferred label: Poetry (Fiction class) @en
preferred label: Dikter på finska (Skönklass) @sv
scope note: Runot. Proosarunot. Runokokoelmat. Runoantologiat
scope note: Dikter. Prosadikter. Diktsamlingar. Diktantologier @sv

Suomenkieliset näytelmät ja kuunnelmat (Kaunoluokka)
type: Class
type: Concept
type: FormClass
subclass of: SUOMENKIELINEN KAUNOKIRJALLISUUS (Kaunoluokka)
broader: SUOMENKIELINEN KAUNOKIRJALLISUUS (Kaunoluokka)
in scheme: URN:NBN:fi:au:hklj:
notation: 1.3
preferred label: Drama. Radio drama (Fiction class) @en
preferred label: Drama och hörspel på finska (Skönklass) @sv
scope note: Näytelmät. Kuunnelmat Kuunnelmatekstit. Kuunnelmaäänitteet Näytelmätekstit. Näytelmäesitysten videotallenteet
scope note: Drama. Hörspel Hörspelstexter. Ljudupptagningar av hörspel Dramatexter. Videoinspelningar av teaterföreställningar @sv

Suomenkieliset romaanit, novellit ja näytelmäelokuvat (Kaunoluokka)
type: Class
type: Concept
type: FormClass
subclass of: SUOMENKIELINEN KAUNOKIRJALLISUUS (Kaunoluokka)
broader: SUOMENKIELINEN KAUNOKIRJALLISUUS (Kaunoluokka)
in scheme: URN:NBN:fi:au:hklj:
notation: 1.4
preferred label: Novels. Short stories. Feature films (Fiction class) @en
preferred label: Romaner, noveller och spelfilmer på finska (Skönklass) @sv
scope note: Romaanit. Novellit. Näytelmäelokuvat Ääneen luetut romaanit ja novellit Kaskut, vitsit, pakinat sekä muu kaunokirjallinen proosa Näytelmäelokuvien videotallenteet
scope note: Romaner. Noveller. Spelfilmer Inlästa romaner och noveller Samlingar av anekdoter, vitsar och kåserier samt annan skönlitterär prosa Videoinspelningar av spelfilmer @sv

Suomenkieliset sarjakuvat ja animaatioelokuvat (Kaunoluokka)
type: Class
type: Concept
type: FormClass
subclass of: Suomenkieliset kuvakirjat (Kaunoluokka)
broader: Suomenkieliset kuvakirjat (Kaunoluokka)
in scheme: URN:NBN:fi:au:hklj:
notation: 1.791
preferred label: Comics. Animated films (Fiction class) @en
preferred label: Tecknade serier och animationsfilmer på finska (Skönklass) @sv
scope note: Fiktiiviset sarjakuvat Fiktiiviset piirretyt, animaatio- ja nukke-elokuvat
scope note: Fiktiva tecknade serier Fiktiva tecknade filmer, animationsfilmer och dockfilmer @sv

Vironkieliset runot (Kaunoluokka)
type: Class
type: Concept
type: FormClass
subclass of: Vironkielinen kaunokirjallisuus (Kaunoluokka)
broader: Vironkielinen kaunokirjallisuus (Kaunoluokka)
in scheme: URN:NBN:fi:au:hklj:
notation: 1.82
preferred label: Poetry (Fiction class) @en
preferred label: Dikter på estniska (Skönklass) @sv
scope note: Runot. Proosarunot. Runokokoelmat. Runoantologiat
scope note: Dikter. Prosadikter. Diktsamlingar. Diktantologier @sv

Vironkieliset näytelmät ja kuunnelmat (Kaunoluokka)
type: Class
type: Concept
type: FormClass
subclass of: Vironkielinen kaunokirjallisuus (Kaunoluokka)
broader: Vironkielinen kaunokirjallisuus (Kaunoluokka)
in scheme: URN:NBN:fi:au:hklj:
notation: 1.83
preferred label: Drama. Radio drama (Fiction class) @en
preferred label: Drama och hörspel på estniska (Skönklass) @sv
scope note: Näytelmät. Kuunnelmat Kuunnelmatekstit. Kuunnelmaäänitteet Näytelmätekstit. Näytelmäesitysten videotallenteet
scope note: Drama. Hörspel Hörspelstexter. Ljudupptagningar av hörspel Dramatexter. Videoinspelningar av teaterföreställningar @sv

Vironkieliset romaanit, novellit ja näytelmäelokuvat (Kaunoluokka)
type: Class
type: Concept
type: FormClass
subclass of: Vironkielinen kaunokirjallisuus (Kaunoluokka)
broader: Vironkielinen kaunokirjallisuus (Kaunoluokka)
in scheme: URN:NBN:fi:au:hklj:
notation: 1.84
preferred label: Novels. Short stories. Feature films (Fiction class) @en
preferred label: Romaner, noveller och spelfilmer på estniska (Skönklass) @sv
scope note: Romaanit. Novellit. Näytelmäelokuvat Ääneen luetut romaanit ja novellit Kaskut, vitsit ja pakinat sekä muu kaunokirjallinen proosa Näytelmäelokuvien videotallenteet
scope note: Romaner. Noveller. Spelfilmer Inlästa romaner och noveller Samlingar av anekdoter, vitsar och kåserier samt annan skönlitterär prosa Videoinspelningar av spelfilmer @sv

Unkarinkieliset runot (Kaunoluokka)
type: Class
type: Concept
type: FormClass
subclass of: Unkarinkielinen kaunokirjallisuus (Kaunoluokka)
broader: Unkarinkielinen kaunokirjallisuus (Kaunoluokka)
in scheme: URN:NBN:fi:au:hklj:
notation: 1.942
preferred label: Poetry (Fiction class) @en
preferred label: Dikter på ungerska (Skönklass) @sv
scope note: Runot. Proosarunot. Runokokoelmat. Runoantologiat
scope note: Dikter. Prosadikter. Diktsamlingar. Diktantologier @sv

Unkarinkieliset näytelmät ja kuunnelmat (Kaunoluokka)
type: Class
type: Concept
type: FormClass
subclass of: Unkarinkielinen kaunokirjallisuus (Kaunoluokka)
broader: Unkarinkielinen kaunokirjallisuus (Kaunoluokka)
in scheme: URN:NBN:fi:au:hklj:
notation: 1.943
preferred label: Drama. Radio drama (Fiction class) @en
preferred label: Drama och hörspel på ungerska (Skönklass) @sv
scope note: Näytelmät. Kuunnelmat Kuunnelmatekstit. Kuunnelmaäänitteet Näytelmätekstit. Näytelmäesitysten videotallenteet
scope note: Drama. Hörspel Hörspelstexter. Ljudupptagningar av hörspel Dramatexter. Videoinspelningar av teaterföreställningar @sv

Unkarinkieliset romaanit, novellit ja näytelmäelokuvat (Kaunoluokka)
type: Class
type: Concept
type: FormClass
subclass of: Unkarinkielinen kaunokirjallisuus (Kaunoluokka)
broader: Unkarinkielinen kaunokirjallisuus (Kaunoluokka)
in scheme: URN:NBN:fi:au:hklj:
notation: 1.944
preferred label: Novels. Short stories. Feature films (Fiction class) @en
preferred label: Romaner, noveller och spelfilmer på ungerska (Skönklass) @sv
scope note: Romaanit. Novellit. Näytelmäelokuvat Ääneen luetut romaanit ja novellit Kaskut, vitsit ja pakinat sekä muu kaunokirjallinen proosa Näytelmäelokuvien videotallenteet
scope note: Romaner. Noveller. Spelfilmer Inlästa romaner och noveller Samlingar av anekdoter, vitsar och kåserier samt annan skönlitterär prosa Videoinspelningar av spelfilmer @sv

Ruotsinkieliset runot (Kaunoluokka)
type: Class
type: Concept
type: FormClass
subclass of: RUOTSINKIELINEN KAUNOKIRJALLISUUS (Kaunoluokka)
broader: RUOTSINKIELINEN KAUNOKIRJALLISUUS (Kaunoluokka)
in scheme: URN:NBN:fi:au:hklj:
notation: 2.2
preferred label: Poetry (Fiction class) @en
preferred label: Dikter på svenska (Skönklass) @sv
scope note: Runot. Proosarunot. Runokokoelmat. Runoantologiat
scope note: Dikter. Prosadikter. Diktsamlingar. Diktantologier @sv

Ruotsinkieliset näytelmät ja kuunnelmat (Kaunoluokka)
type: Class
type: Concept
type: FormClass
subclass of: RUOTSINKIELINEN KAUNOKIRJALLISUUS (Kaunoluokka)
broader: RUOTSINKIELINEN KAUNOKIRJALLISUUS (Kaunoluokka)
in scheme: URN:NBN:fi:au:hklj:
notation: 2.3
preferred label: Drama. Radio drama (Fiction class) @en
preferred label: Drama och hörspel på svenska (Skönklass) @sv
scope note: Näytelmät. Kuunnelmat Kuunnelmatekstit. Kuunnelmaäänitteet Näytelmätekstit. Näytelmäesitysten videotallenteet
scope note: Drama. Hörspel Hörspelstexter. Ljudupptagningar av hörspel Dramatexter. Videoinspelningar av teaterföreställningar @sv

Ruotsinkieliset romaanit, novellit ja näytelmäelokuvat (Kaunoluokka)
type: Class
type: Concept
type: FormClass
subclass of: RUOTSINKIELINEN KAUNOKIRJALLISUUS (Kaunoluokka)
broader: RUOTSINKIELINEN KAUNOKIRJALLISUUS (Kaunoluokka)
in scheme: URN:NBN:fi:au:hklj:
notation: 2.4
preferred label: Novels. Short stories. Feature films (Fiction class) @en
preferred label: Romaner, noveller och spelfilmer på svenska (Skönklass) @sv
scope note: Romaanit. Novellit. Näytelmäelokuvat Ääneen luetut romaanit ja novellit Kaskut, vitsit ja pakinat sekä muu kaunokirjallinen proosa Näytelmäelokuvien videotallenteet
scope note: Romaner. Noveller. Spelfilmer Inlästa romaner och noveller Samlingar av anekdoter, vitsar och kåserier samt annan skönlitterär prosa Videoinspelningar av spelfilmer @sv

Ruotsinkieliset sarjakuvat ja animaatioelokuvat (Kaunoluokka)
type: Class
type: Concept
type: FormClass
subclass of: Ruotsinkieliset kuvakirjat (Kaunoluokka)
broader: Ruotsinkieliset kuvakirjat (Kaunoluokka)
in scheme: URN:NBN:fi:au:hklj:
notation: 2.791
preferred label: Comics. Animated films (Fiction class) @en
preferred label: Tecknade serier och animationsfilmer på svenska (Skönklass) @sv
scope note: Fiktiiviset sarjakuvat Fiktiiviset piirretyt, animaatio- ja nukke-elokuvat
scope note: Fiktiva tecknade serier Fiktiva tecknade filmer, animationsfilmer och dockfilmer @sv

Tanskankieliset runot (Kaunoluokka)
type: Class
type: Concept
type: FormClass
subclass of: Tanskankielinen kaunokirjallisuus (Kaunoluokka)
broader: Tanskankielinen kaunokirjallisuus (Kaunoluokka)
in scheme: URN:NBN:fi:au:hklj:
notation: 2.82
preferred label: Poetry (Fiction class) @en
preferred label: Dikter på danska (Skönklass) @sv
scope note: Runot. Proosarunot. Runokokoelmat. Runoantologiat
scope note: Dikter. Prosadikter. Diktsamlingar. Diktantologier @sv

Tanskankieliset näytelmät ja kuunnelmat (Kaunoluokka)
type: Class
type: Concept
type: FormClass
subclass of: Tanskankielinen kaunokirjallisuus (Kaunoluokka)
broader: Tanskankielinen kaunokirjallisuus (Kaunoluokka)
in scheme: URN:NBN:fi:au:hklj:
notation: 2.83
preferred label: Drama. Radio drama (Fiction class) @en
preferred label: Drama och hörspel på danska (Skönklass) @sv
scope note: Näytelmät. Kuunnelmat Kuunnelmatekstit. Kuunnelmaäänitteet Näytelmätekstit. Näytelmäesitysten videotallenteet
scope note: Drama. Hörspel Hörspelstexter. Ljudupptagningar av hörspel Dramatexter. Videoinspelningar av teaterföreställningar @sv

Tanskankieliset romaanit, novellit ja näytelmäelokuvat (Kaunoluokka)
type: Class
type: Concept
type: FormClass
subclass of: Tanskankielinen kaunokirjallisuus (Kaunoluokka)
broader: Tanskankielinen kaunokirjallisuus (Kaunoluokka)
in scheme: URN:NBN:fi:au:hklj:
notation: 2.84
preferred label: Novels. Short stories. Feature films (Fiction class) @en
preferred label: Romaner, noveller och spelfilmer på danska (Skönklass) @sv
scope note: Romaanit. Novellit. Näytelmäelokuvat Ääneen luetut romaanit ja novellit Kaskut, vitsit ja pakinat sekä muu kaunokirjallinen proosa Näytelmäelokuvien videotallenteet
scope note: Romaner. Noveller. Spelfilmer Inlästa romaner och noveller Samlingar av anekdoter, vitsar och kåserier samt annan skönlitterär prosa Videoinspelningar av spelfilmer @sv

Tanskankieliset sarjakuvat ja animaatioelokuvat (Kaunoluokka)
type: Class
type: Concept
type: FormClass
subclass of: Tanskankieliset kuvakirjat (Kaunoluokka)
broader: Tanskankieliset kuvakirjat (Kaunoluokka)
in scheme: URN:NBN:fi:au:hklj:
notation: 2.8791
preferred label: Comics. Animated films (Fiction class) @en
preferred label: Tecknade serier och animationsfilmer på danska (Skönklass) @sv
scope note: Fiktiiviset sarjakuvat Fiktiiviset piirretyt, animaatio- ja nukke-elokuvat
scope note: Fiktiva tecknade serier Fiktiva tecknade filmer, animationsfilmer och dockfilmer @sv

Norjankieliset runot (Kaunoluokka)
type: Class
type: Concept
type: FormClass
subclass of: Norjankielinen kaunokirjallisuus (Kaunoluokka)
broader: Norjankielinen kaunokirjallisuus (Kaunoluokka)
in scheme: URN:NBN:fi:au:hklj:
notation: 2.92
preferred label: Poetry (Fiction class) @en
preferred label: Dikter på norska (Skönklass) @sv
scope note: Runot. Proosarunot. Runokokoelmat. Runoantologiat
scope note: Dikter. Prosadikter. Diktsamlingar. Diktantologier @sv

Norjankieliset näytelmät ja kuunnelmat (Kaunoluokka)
type: Class
type: Concept
type: FormClass
subclass of: Norjankielinen kaunokirjallisuus (Kaunoluokka)
broader: Norjankielinen kaunokirjallisuus (Kaunoluokka)
in scheme: URN:NBN:fi:au:hklj:
notation: 2.93
preferred label: Drama. Radio drama (Fiction class) @en
preferred label: Drama och hörspel på norska (Skönklass) @sv
scope note: Näytelmät. Kuunnelmat Kuunnelmatekstit. Kuunnelmaäänitteet Näytelmätekstit. Näytelmäesitysten videotallenteet
scope note: Drama. Hörspel Hörspelstexter. Ljudupptagningar av hörspel Dramatexter. Videoinspelningar av teaterföreställningar @sv

Norjankieliset romaanit, novellit ja näytelmäelokuvat (Kaunoluokka)
type: Class
type: Concept
type: FormClass
subclass of: Norjankielinen kaunokirjallisuus (Kaunoluokka)
broader: Norjankielinen kaunokirjallisuus (Kaunoluokka)
in scheme: URN:NBN:fi:au:hklj:
notation: 2.94
preferred label: Novels. Short stories. Feature films (Fiction class) @en
preferred label: Romaner, noveller och spelfilmer på norska (Skönklass) @sv
scope note: Romaanit. Novellit. Näytelmäelokuvat Ääneen luetut romaanit ja novellit Kaskut, vitsit ja pakinat sekä muu kaunokirjallinen proosa Näytelmäelokuvien videotallenteet
scope note: Romaner. Noveller. Spelfilmer Inlästa romaner och noveller Samlingar av anekdoter, vitsar och kåserier samt annan skönlitterär prosa Videoinspelningar av spelfilmer @sv

Norjankieliset sarjakuvat ja animaatioelokuvat (Kaunoluokka)
type: Class
type: Concept
type: FormClass
subclass of: Norjankieliset kuvakirjat (Kaunoluokka)
broader: Norjankieliset kuvakirjat (Kaunoluokka)
in scheme: URN:NBN:fi:au:hklj:
notation: 2.9791
preferred label: Comics. Animated films (Fiction class) @en
preferred label: Tecknade serier och animationsfilmer på norska (Skönklass) @sv
scope note: Fiktiiviset sarjakuvat Fiktiiviset piirretyt, animaatio- ja nukke-elokuvat
scope note: Fiktiva tecknade serier Fiktiva tecknade filmer, animationsfilmer och dockfilmer @sv

Saksankieliset runot (Kaunoluokka)
type: Class
type: Concept
type: FormClass
subclass of: SAKSANKIELINEN KAUNOKIRJALLISUUS (Kaunoluokka)
broader: SAKSANKIELINEN KAUNOKIRJALLISUUS (Kaunoluokka)
in scheme: URN:NBN:fi:au:hklj:
notation: 3.2
preferred label: Poetry (Fiction class) @en
preferred label: Dikter på tyska (Skönklass) @sv
scope note: Runot. Proosarunot. Runokokoelmat. Runoantologiat
scope note: Dikter. Prosadikter. Diktsamlingar. Diktantologier @sv

Saksankieliset näytelmät ja kuunnelmat (Kaunoluokka)
type: Class
type: Concept
type: FormClass
subclass of: SAKSANKIELINEN KAUNOKIRJALLISUUS (Kaunoluokka)
broader: SAKSANKIELINEN KAUNOKIRJALLISUUS (Kaunoluokka)
in scheme: URN:NBN:fi:au:hklj:
notation: 3.3
preferred label: Drama. Radio drama (Fiction class) @en
preferred label: Drama och hörspel på tyska (Skönklass) @sv
scope note: Näytelmät. Kuunnelmat Kuunnelmatekstit. Kuunnelmaäänitteet Näytelmätekstit. Näytelmäesitysten videotallenteet
scope note: Drama. Hörspel Hörspelstexter. Ljudupptagningar av hörspel Dramatexter. Videoinspelningar av teaterföreställningar @sv

Saksankieliset romaanit, novellit ja näytelmäelokuvat (Kaunoluokka)
type: Class
type: Concept
type: FormClass
subclass of: SAKSANKIELINEN KAUNOKIRJALLISUUS (Kaunoluokka)
broader: SAKSANKIELINEN KAUNOKIRJALLISUUS (Kaunoluokka)
in scheme: URN:NBN:fi:au:hklj:
notation: 3.4
preferred label: Novels. Short stories. Feature films (Fiction class) @en
preferred label: Romaner, noveller och spelfilmer på tyska (Skönklass) @sv
scope note: Romaanit. Novellit. Näytelmäelokuvat Ääneen luetut romaanit ja novellit Kaskut, vitsit ja pakinat sekä muu kaunokirjallinen proosa Näytelmäelokuvien videotallenteet
scope note: Romaner. Noveller. Spelfilmer Inlästa romaner och noveller Samlingar av anekdoter, vitsar och kåserier samt annan skönlitterär prosa Videoinspelningar av spelfilmer @sv

Saksankieliset sarjakuvat ja animaatioelokuvat (Kaunoluokka)
type: Class
type: Concept
type: FormClass
subclass of: Saksankieliset kuvakirjat (Kaunoluokka)
broader: Saksankieliset kuvakirjat (Kaunoluokka)
in scheme: URN:NBN:fi:au:hklj:
notation: 3.791
preferred label: Comics. Animated films (Fiction class) @en
preferred label: Tecknade serier och animationsfilmer på tyska (Skönklass) @sv
scope note: Fiktiiviset sarjakuvat Fiktiiviset piirretyt, animaatio- ja nukke-elokuvat
scope note: Fiktiva tecknade serier Fiktiva tecknade filmer, animationsfilmer och dockfilmer @sv

Englanninkieliset runot (Kaunoluokka)
type: Class
type: Concept
type: FormClass
subclass of: ENGLANNINKIELINEN KAUNOKIRJALLISUUS (Kaunoluokka)
broader: ENGLANNINKIELINEN KAUNOKIRJALLISUUS (Kaunoluokka)
in scheme: URN:NBN:fi:au:hklj:
notation: 4.2
preferred label: Poetry (Fiction class) @en
preferred label: Dikter på engelska (Skönklass) @sv
scope note: Runot. Proosarunot. Runokokoelmat. Runoantologiat
scope note: Dikter. Prosadikter. Diktsamlingar. Diktantologier @sv

Englanninkieliset näytelmät ja kuunnelmat (Kaunoluokka)
type: Class
type: Concept
type: FormClass
subclass of: ENGLANNINKIELINEN KAUNOKIRJALLISUUS (Kaunoluokka)
broader: ENGLANNINKIELINEN KAUNOKIRJALLISUUS (Kaunoluokka)
in scheme: URN:NBN:fi:au:hklj:
notation: 4.3
preferred label: Drama. Radio drama (Fiction class) @en
preferred label: Drama och hörspel på engelska (Skönklass) @sv
scope note: Näytelmät. Kuunnelmat Kuunnelmatekstit. Kuunnelmaäänitteet Näytelmätekstit. Näytelmäesitysten videotallenteet
scope note: Drama. Hörspel Hörspelstexter. Ljudupptagningar av hörspel Dramatexter. Videoinspelningar av teaterföreställningar @sv

Englanninkieliset romaanit, novellit ja näytelmäelokuvat (Kaunoluokka)
type: Class
type: Concept
type: FormClass
subclass of: ENGLANNINKIELINEN KAUNOKIRJALLISUUS (Kaunoluokka)
broader: ENGLANNINKIELINEN KAUNOKIRJALLISUUS (Kaunoluokka)
in scheme: URN:NBN:fi:au:hklj:
notation: 4.4
preferred label: Novels. Short stories. Feature films (Fiction class) @en
preferred label: Romaner, noveller och spelfilmer på engelska (Skönklass) @sv
scope note: Romaanit. Novellit. Näytelmäelokuvat Ääneen luetut romaanit ja novellit Kaskut, vitsit ja pakinat sekä muu kaunokirjallinen proosa Näytelmäelokuvien videotallenteet
scope note: Romaner. Noveller. Spelfilmer Inlästa romaner och noveller Samlingar av anekdoter, vitsar och kåserier samt annan skönlitterär prosa Videoinspelningar av spelfilmer @sv

Englanninkieliset sarjakuvat ja animaatioelokuvat (Kaunoluokka)
type: Class
type: Concept
type: FormClass
subclass of: Englanninkieliset kuvakirjat (Kaunoluokka)
broader: Englanninkieliset kuvakirjat (Kaunoluokka)
in scheme: URN:NBN:fi:au:hklj:
notation: 4.791
preferred label: Comics. Animated films (Fiction class) @en
preferred label: Tecknade serier och animationsfilmer på engelska (Skönklass) @sv
scope note: Fiktiiviset sarjakuvat Fiktiiviset piirretyt, animaatio- ja nukke-elokuvat
scope note: Fiktiva tecknade serier Fiktiva tecknade filmer, animationsfilmer och dockfilmer @sv

Ranskankieliset runot (Kaunoluokka)
type: Class
type: Concept
type: FormClass
subclass of: RANSKANKIELINEN KAUNOKIRJALLISUUS (Kaunoluokka)
broader: RANSKANKIELINEN KAUNOKIRJALLISUUS (Kaunoluokka)
in scheme: URN:NBN:fi:au:hklj:
notation: 5.2
preferred label: Poetry (Fiction class) @en
preferred label: Dikter på franska (Skönklass) @sv
scope note: Runot. Proosarunot. Runokokoelmat. Runoantologiat
scope note: Dikter. Prosadikter. Diktsamlingar. Diktantologier @sv

Ranskankieliset näytelmät ja kuunnelmat (Kaunoluokka)
type: Class
type: Concept
type: FormClass
subclass of: RANSKANKIELINEN KAUNOKIRJALLISUUS (Kaunoluokka)
broader: RANSKANKIELINEN KAUNOKIRJALLISUUS (Kaunoluokka)
in scheme: URN:NBN:fi:au:hklj:
notation: 5.3
preferred label: Drama. Radio drama (Fiction class) @en
preferred label: Drama och hörspel på franska (Skönklass) @sv
scope note: Näytelmät. Kuunnelmat Kuunnelmatekstit. Kuunnelmaäänitteet Näytelmätekstit. Näytelmäesitysten videotallenteet
scope note: Drama. Hörspel Hörspelstexter. Ljudupptagningar av hörspel Dramatexter. Videoinspelningar av teaterföreställningar @sv

Ranskankieliset romaanit, novellit ja näytelmäelokuvat (Kaunoluokka)
type: Class
type: Concept
type: FormClass
subclass of: RANSKANKIELINEN KAUNOKIRJALLISUUS (Kaunoluokka)
broader: RANSKANKIELINEN KAUNOKIRJALLISUUS (Kaunoluokka)
in scheme: URN:NBN:fi:au:hklj:
notation: 5.4
preferred label: Novels. Short stories. Feature films (Fiction class) @en
preferred label: Romaner, noveller och spelfilmer på franska (Skönklass) @sv
scope note: Romaanit. Novellit. Näytelmäelokuvat Ääneen luetut romaanit ja novellit Kaskut, vitsit ja pakinat sekä muu kaunokirjallinen proosa Näytelmäelokuvien videotallenteet
scope note: Romaner. Noveller. Spelfilmer Inlästa romaner och noveller Samlingar av anekdoter, vitsar och kåserier samt annan skönlitterär prosa Videoinspelningar av spelfilmer @sv

Ranskankieliset sarjakuvat ja animaatioelokuvat (Kaunoluokka)
type: Class
type: Concept
type: FormClass
subclass of: Ranskankieliset kuvakirjat (Kaunoluokka)
broader: Ranskankieliset kuvakirjat (Kaunoluokka)
in scheme: URN:NBN:fi:au:hklj:
notation: 5.791
preferred label: Comics. Animated films (Fiction class) @en
preferred label: Tecknade serier och animationsfilmer på franska (Skönklass) @sv
scope note: Fiktiiviset sarjakuvat Fiktiiviset piirretyt, animaatio- ja nukke-elokuvat
scope note: Fiktiva tecknade serier Fiktiva tecknade filmer, animationsfilmer och dockfilmer @sv

Italiankieliset runot (Kaunoluokka)
type: Class
type: Concept
type: FormClass
subclass of: ITALIANKIELINEN KAUNOKIRJALLISUUS (Kaunoluokka)
broader: ITALIANKIELINEN KAUNOKIRJALLISUUS (Kaunoluokka)
in scheme: URN:NBN:fi:au:hklj:
notation: 6.2
preferred label: Poetry (Fiction class) @en
preferred label: Dikter på italienska (Skönklass) @sv
scope note: Runot. Proosarunot. Runokokoelmat. Runoantologiat
scope note: Dikter. Prosadikter. Diktsamlingar. Diktantologier @sv

Italiankieliset näytelmät ja kuunnelmat (Kaunoluokka)
type: Class
type: Concept
type: FormClass
subclass of: ITALIANKIELINEN KAUNOKIRJALLISUUS (Kaunoluokka)
broader: ITALIANKIELINEN KAUNOKIRJALLISUUS (Kaunoluokka)
in scheme: URN:NBN:fi:au:hklj:
notation: 6.3
preferred label: Drama. Radio drama (Fiction class) @en
preferred label: Drama och hörspel på italienska (Skönklass) @sv
scope note: Näytelmät. Kuunnelmat Kuunnelmatekstit. Kuunnelmaäänitteet Näytelmätekstit. Näytelmäesitysten videotallenteet
scope note: Drama. Hörspel Hörspelstexter. Ljudupptagningar av hörspel Dramatexter. Videoinspelningar av teaterföreställningar @sv

Italiankieliset romaanit, novellit ja näytelmäelokuvat (Kaunoluokka)
type: Class
type: Concept
type: FormClass
subclass of: ITALIANKIELINEN KAUNOKIRJALLISUUS (Kaunoluokka)
broader: ITALIANKIELINEN KAUNOKIRJALLISUUS (Kaunoluokka)
in scheme: URN:NBN:fi:au:hklj:
notation: 6.4
preferred label: Novels. Short stories. Feature films (Fiction class) @en
preferred label: Romaner, noveller och spelfilmer på italienska (Skönklass) @sv
scope note: Romaanit. Novellit. Näytelmäelokuvat Ääneen luetut romaanit ja novellit Kaskut, vitsit ja pakinat sekä muu kaunokirjallinen proosa Näytelmäelokuvien videotallenteet
scope note: Romaner. Noveller. Spelfilmer Inlästa romaner och noveller Samlingar av anekdoter, vitsar och kåserier samt annan skönlitterär prosa Videoinspelningar av spelfilmer @sv

Italiankieliset sarjakuvat ja animaatioelokuvat (Kaunoluokka)
type: Class
type: Concept
type: FormClass
subclass of: Italiankieliset kuvakirjat (Kaunoluokka)
broader: Italiankieliset kuvakirjat (Kaunoluokka)
in scheme: URN:NBN:fi:au:hklj:
notation: 6.791
preferred label: Comics. Animated films (Fiction class) @en
preferred label: Tecknade serier och animationsfilmer på italienska (Skönklass) @sv
scope note: Fiktiiviset sarjakuvat Fiktiiviset piirretyt, animaatio- ja nukke-elokuvat
scope note: Fiktiva tecknade serier Fiktiva tecknade filmer, animationsfilmer och dockfilmer @sv

Espanjankieliset runot (Kaunoluokka)
type: Class
type: Concept
type: FormClass
subclass of: ESPANJANKIELINEN KAUNOKIRJALLISUUS (Kaunoluokka)
broader: ESPANJANKIELINEN KAUNOKIRJALLISUUS (Kaunoluokka)
in scheme: URN:NBN:fi:au:hklj:
notation: 7.2
preferred label: Poetry (Fiction class) @en
preferred label: Dikter på spanska (Skönklass) @sv
scope note: Runot. Proosarunot. Runokokoelmat. Runoantologiat
scope note: Dikter. Prosadikter. Diktsamlingar. Diktantologier @sv

Espanjankieliset näytelmät ja kuunnelmat (Kaunoluokka)
type: Class
type: Concept
type: FormClass
subclass of: ESPANJANKIELINEN KAUNOKIRJALLISUUS (Kaunoluokka)
broader: ESPANJANKIELINEN KAUNOKIRJALLISUUS (Kaunoluokka)
in scheme: URN:NBN:fi:au:hklj:
notation: 7.3
preferred label: Drama. Radio drama (Fiction class) @en
preferred label: Drama och hörspel på spanska (Skönklass) @sv
scope note: Näytelmät. Kuunnelmat Kuunnelmatekstit. Kuunnelmaäänitteet Näytelmätekstit. Näytelmäesitysten videotallenteet
scope note: Drama. Hörspel Hörspelstexter. Ljudupptagningar av hörspel Dramatexter. Videoinspelningar av teaterföreställningar @sv

Espanjankieliset romaanit, novellit ja näytelmäelokuvat (Kaunoluokka)
type: Class
type: Concept
type: FormClass
subclass of: ESPANJANKIELINEN KAUNOKIRJALLISUUS (Kaunoluokka)
broader: ESPANJANKIELINEN KAUNOKIRJALLISUUS (Kaunoluokka)
in scheme: URN:NBN:fi:au:hklj:
notation: 7.4
preferred label: Novels. Short stories. Feature films (Fiction class) @en
preferred label: Romaner, noveller och spelfilmer på spanska (Skönklass) @sv
scope note: Romaanit. Novellit. Näytelmäelokuvat Ääneen luetut romaanit ja novellit Kaskut, vitsit ja pakinat sekä muu kaunokirjallinen proosa Näytelmäelokuvien videotallenteet
scope note: Romaner. Noveller. Spelfilmer Inlästa romaner och noveller Samlingar av anekdoter, vitsar och kåserier samt annan skönlitterär prosa Videoinspelningar av spelfilmer @sv

Espanjankieliset sarjakuvat ja animaatioelokuvat (Kaunoluokka)
type: Class
type: Concept
type: FormClass
subclass of: Espanjankieliset kuvakirjat (Kaunoluokka)
broader: Espanjankieliset kuvakirjat (Kaunoluokka)
in scheme: URN:NBN:fi:au:hklj:
notation: 7.791
preferred label: Comics. Animated films (Fiction class) @en
preferred label: Tecknade serier och animationsfilmer på spanska (Skönklass) @sv
scope note: Fiktiiviset sarjakuvat Fiktiiviset piirretyt, animaatio- ja nukke-elokuvat
scope note: Fiktiva tecknade serier Fiktiva tecknade filmer, animationsfilmer och dockfilmer @sv

Venäjänkieliset runot (Kaunoluokka)
type: Class
type: Concept
type: FormClass
subclass of: VENÄJÄNKIELINEN KAUNOKIRJALLISUUS (Kaunoluokka)
broader: VENÄJÄNKIELINEN KAUNOKIRJALLISUUS (Kaunoluokka)
in scheme: URN:NBN:fi:au:hklj:
notation: 8.2
preferred label: Poetry (Fiction class) @en
preferred label: Dikter på ryska (Skönklass) @sv
scope note: Runot. Proosarunot. Runokokoelmat. Runoantologiat
scope note: Dikter. Prosadikter. Diktsamlingar. Diktantologier @sv

Venäjänkieliset näytelmät ja kuunnelmat (Kaunoluokka)
type: Class
type: Concept
type: FormClass
subclass of: VENÄJÄNKIELINEN KAUNOKIRJALLISUUS (Kaunoluokka)
broader: VENÄJÄNKIELINEN KAUNOKIRJALLISUUS (Kaunoluokka)
in scheme: URN:NBN:fi:au:hklj:
notation: 8.3
preferred label: Drama. Radio drama (Fiction class) @en
preferred label: Drama och hörspel på ryska (Skönklass) @sv
scope note: Näytelmät. Kuunnelmat Kuunnelmatekstit. Kuunnelmaäänitteet Näytelmätekstit. Näytelmäesitysten videotallenteet
scope note: Drama. Hörspel Hörspelstexter. Ljudupptagningar av hörspel Dramatexter. Videoinspelningar av teaterföreställningar @sv

Venäjänkieliset romaanit, novellit ja näytelmäelokuvat (Kaunoluokka)
type: Class
type: Concept
type: FormClass
subclass of: VENÄJÄNKIELINEN KAUNOKIRJALLISUUS (Kaunoluokka)
broader: VENÄJÄNKIELINEN KAUNOKIRJALLISUUS (Kaunoluokka)
in scheme: URN:NBN:fi:au:hklj:
notation: 8.4
preferred label: Novels. Short stories. Feature films (Fiction class) @en
preferred label: Romaner, noveller och spelfilmer på ryska (Skönklass) @sv
scope note: Romaanit. Novellit. Näytelmäelokuvat Ääneen luetut romaanit ja novellit Kaskut, vitsit ja pakinat sekä muu kaunokirjallinen proosa Näytelmäelokuvien videotallenteet
scope note: Romaner. Noveller. Spelfilmer Inlästa romaner och noveller Samlingar av anekdoter, vitsar och kåserier samt annan skönlitterär prosa Videoinspelningar av spelfilmer @sv

Venäjänkieliset sarjakuvat ja animaatioelokuvat (Kaunoluokka)
type: Class
type: Concept
type: FormClass
subclass of: Venäjänkieliset kuvakirjat (Kaunoluokka)
broader: Venäjänkieliset kuvakirjat (Kaunoluokka)
in scheme: URN:NBN:fi:au:hklj:
notation: 8.791
preferred label: Comics. Animated films (Fiction class) @en
preferred label: Tecknade serier och animationsfilmer på ryska (Skönklass) @sv
scope note: Fiktiiviset sarjakuvat Fiktiiviset piirretyt, animaatio- ja nukke-elokuvat
scope note: Fiktiva tecknade serier Fiktiva tecknade filmer, animationsfilmer och dockfilmer @sv

Anonyymi- ja pseudonyymiluettelot
type: Class
type: Concept
subclass of: URN:NBN:fi:au:hklj:010
alternative label: Anonyymiluettelot (010.1)
alternative label: Nimimerkit (010.1)
alternative label: Nimimerkkiluettelot (010.1)
alternative label: Pseudonyymit (010.1)
alternative label: Salanimet (010.1)
alternative label: Taiteilijanimet, pseudonyymiluettelot (010.1)
alternative label: Anonymförteckningar (010.1) @sv
alternative label: Konstnärsnamn, pseudonymförteckningar (010.1) @sv
alternative label: Pseudonymer (010.1) @sv
alternative label: Signaturer (010.1) @sv
alternative label: Signaturförteckningar (010.1) @sv
alternative label: Täcknamn (010.1) @sv
broader: URN:NBN:fi:au:hklj:010
in scheme: URN:NBN:fi:au:hklj:
notation: 010.1
preferred label: Anonymous and pseudonymous lists @en
preferred label: Anonym- och pseudonymförteckningar @sv
related: Paikallisbibliografiat. Henkilöbibliografiat
scope note: Anonyymi- ja pseudonyymiluettelot henkilöiden toimialasta riippumatta Salanimet. Nimimerkit
scope note: Anonym- och pseudonymförteckningar oavsett personernas verksamhetsområde Täcknamn. Signaturer @sv

Suomessa ilmestyvät ruotsinkieliset
type: Class
type: Concept
subclass of: Suomenkieliset
broader: Suomenkieliset
in scheme: URN:NBN:fi:au:hklj:
notation: 071.1
preferred label: Finnish-Swedish @en
preferred label: Finlandssvenska @sv
related: URN:NBN:fi:au:hklj:384

Suomessa ilmestyvät vieraskieliset
type: Class
type: Concept
subclass of: Suomenkieliset
broader: Suomenkieliset
in scheme: URN:NBN:fi:au:hklj:
notation: 071.2
preferred label: Foreign-language newspapers published in Finland @en
preferred label: Tidningar utgivna på främmande språk i Finland @sv
related: URN:NBN:fi:au:hklj:384

Ruotsinkieliset
type: Class
type: Concept
subclass of: SANOMALEHDET
broader: SANOMALEHDET
in scheme: URN:NBN:fi:au:hklj:
notation: 072
preferred label: Swedish @en
preferred label: Svenska @sv
related: URN:NBN:fi:au:hklj:384

Saksankieliset
type: Class
type: Concept
subclass of: SANOMALEHDET
broader: SANOMALEHDET
in scheme: URN:NBN:fi:au:hklj:
notation: 073
preferred label: German @en
preferred label: Tyska @sv
related: URN:NBN:fi:au:hklj:384

Amerikan englanninkieliset
type: Class
type: Concept
subclass of: Englanninkieliset
broader: Englanninkieliset
in scheme: URN:NBN:fi:au:hklj:
notation: 074.1
preferred label: American @en
preferred label: Amerikanska @sv
related: URN:NBN:fi:au:hklj:384

Ranskankieliset
type: Class
type: Concept
subclass of: SANOMALEHDET
broader: SANOMALEHDET
in scheme: URN:NBN:fi:au:hklj:
notation: 075
preferred label: French @en
preferred label: Franska @sv
related: URN:NBN:fi:au:hklj:384

Italiankieliset
type: Class
type: Concept
subclass of: SANOMALEHDET
broader: SANOMALEHDET
in scheme: URN:NBN:fi:au:hklj:
notation: 076
preferred label: Italian @en
preferred label: Italienska @sv
related: URN:NBN:fi:au:hklj:384

Espanjankieliset
type: Class
type: Concept
subclass of: SANOMALEHDET
broader: SANOMALEHDET
in scheme: URN:NBN:fi:au:hklj:
notation: 077
preferred label: Spanish @en
preferred label: Spanska @sv
related: URN:NBN:fi:au:hklj:384

Venäjänkieliset
type: Class
type: Concept
subclass of: SANOMALEHDET
broader: SANOMALEHDET
in scheme: URN:NBN:fi:au:hklj:
notation: 078
preferred label: Russian @en
preferred label: Ryska @sv
related: URN:NBN:fi:au:hklj:384

URN:NBN:fi:au:hklj:1.79
alternative label: Elokuvat, piirretyt elokuvat (1.79)
alternative label: Elokuvatallenteet, piirretyt elokuvat (1.79)
alternative label: Eläinkertomukset, kuvakirjat (1.79)
alternative label: Eläinrunot, kuvakirjat (1.79)
alternative label: Eläinsadut, kuvakirjat (1.79)
alternative label: Ensikirjat, kuvakirjat (1.79)
alternative label: Faabelit, kuvakirjat (1.79)
alternative label: Haltiat, kuvakirjat (1.79)
alternative label: Haltijat, kuvakirjat (1.79)
alternative label: Huumori, kuvalliset vitsit (1.79)
alternative label: Jättiläiset, kuvakirjat (1.79)
alternative label: Kansansadut, kuvakirjat (1.79)
alternative label: Kansantarinat, kuvakirjat (1.79)
alternative label: Karikatyyrit, kuvalliset vitsit (1.79)
alternative label: Kaskut, kuvitetut kaskut (1.79)
alternative label: Katselukirjat, kuvakirjat (1.79)
alternative label: Keijukaiset, kuvakirjat (1.79)
alternative label: Keijut, kuvakirjat (1.79)
alternative label: Klassikot, piirretyt elokuvat (1.79)
alternative label: Koskettelukirjat, kaunokirjallisuus (1.79)
alternative label: Kuvakirjat (1.79)
alternative label: Kuvat, kuvakirjat (1.79)
alternative label: Kuvateokset, kuvakirjat (1.79)
alternative label: Lastenrunot, kuvakirjamuotoiset (1.79)
alternative label: Legendat, kuvakirjat (1.79)
alternative label: Lyhytelokuvat, piirretyt elokuvat (1.79)
alternative label: Musta huumori, kuvalliset vitsit (1.79)
alternative label: Pastissit, piirretyt elokuvat (1.79)
alternative label: Peikot, kuvakirjat (1.79)
alternative label: Piirrokset, kuvakirjat (1.79)
alternative label: Piirrokset, kuvalliset vitsit (1.79)
alternative label: Piirustukset, kuvakirjat (1.79)
alternative label: Piirustukset, kuvalliset vitsit (1.79)
alternative label: Pilakuvat, kuvalliset vitsit (1.79)
alternative label: Pilapiirrokset, kuvalliset vitsit (1.79)
alternative label: Prinsessat, kuvakirjat (1.79)
alternative label: Prinssit, kuvakirjat (1.79)
alternative label: Puuhakirjat, kaunokirjallisuus (1.79)
alternative label: Pyhimystarinat, kuvakirjat (1.79)
alternative label: Runokuvakirjat (1.79)
alternative label: Vedenhaltijat , kuvakirjat (1.79)
alternative label: Videoelokuvat, piirretyt elokuvat (1.79)
alternative label: Videofilmit, piirretyt elokuvat (1.79)
alternative label: Vitsit, kuvalliset vitsikirjat (1.79)
alternative label: Värityskirjat (1.79)
alternative label: Alfer, bilderböcker (1.79) @sv
alternative label: Anekdoter, anekdoter med illustration (1.79) @sv
alternative label: Barnlyrik, i bilderboksform (1.79) @sv
alternative label: Bilder, bilderböcker (1.79) @sv
alternative label: Bilderböcker (1.79) @sv
alternative label: Bildverk, bilderböcker (1.79) @sv
alternative label: Diktbilderböcker (1.79) @sv
alternative label: Djurberättelser, bilderböcker (1.79) @sv
alternative label: Djurdikter, bilderböcker (1.79) @sv
alternative label: Djursagor, bilderböcker (1.79) @sv
alternative label: Fabler, bilderböcker (1.79) @sv
alternative label: Filmer, filmkonst, tecknade filmer (1.79) @sv
alternative label: Filminspelningar, tecknade filmer (1.79) @sv
alternative label: Folksagor, bilderböcker (1.79) @sv
alternative label: Folksägner, bilderböcker (1.79) @sv
alternative label: Helgonlegender, bilderböcker (1.79) @sv
alternative label: Humor, illustrerade vitsar (1.79) @sv
alternative label: Jättar, bilderböcker (1.79) @sv
alternative label: Karikatyrer, illustrarade vitsar (1.79) @sv
alternative label: Klassiker, tecknade filmer (1.79) @sv
alternative label: Kortfilmer, tecknade filmer (1.79) @sv
alternative label: Legender, bilderböcker (1.79) @sv
alternative label: Målarböcker (1.79) @sv
alternative label: Pastischer, tecknade filmer (1.79) @sv
alternative label: Pekböcker, bilderböcker (1.79) @sv
alternative label: Prinsar, bilderböcker (1.79) @sv
alternative label: Prinsessor, bilderböcker (1.79) @sv
alternative label: Pysselböcker, skönlitteratur (1.79) @sv
alternative label: Ritningar, bilderböcker (1.79) @sv
alternative label: Ritningar, illustrerade vitsar (1.79) @sv
alternative label: Ritningar, seriebilder (1.79) @sv
alternative label: Rådare, haltiat, bilderböcker (1.79) @sv
related: URN:NBN:fi:au:hklj:1.2
related: URN:NBN:fi:au:hklj:1.4
related: Pilapiirrokset. Karikatyyrit

URN:NBN:fi:au:hklj:1.791
alternative label: Animaatioelokuvat, fiktiiviset (1.791)
alternative label: Anime-elokuvat, fiktiiviset (1.791)
alternative label: Anime-sarjat, fiktiiviset (1.791)
alternative label: Animet, fiktiiviset (1.791)
alternative label: Kauhusarjakuvat, kaunokirjallisuus (1.791)
alternative label: Kuvakasetit, piirretyt elokuvat (1.791)
alternative label: Kuvalevyt, piirretyt elokuvat (1.791)
alternative label: Lastenelokuvat, piirretyt elokuvat (1.791)
alternative label: Mangasarjakuvat, kaunokirjallisuus (1.791)
alternative label: Mangat, kaunokirjallisuus (1.791)
alternative label: Novellisarjakuvat (1.791)
alternative label: Nukke-elokuvat (1.791)
alternative label: Piirretyt elokuvat, fiktiiviset (1.791)
alternative label: Piirrokset, sarjakuvat (1.791)
alternative label: Piirustukset, sarjakuvat (1.791)
alternative label: Sarjakuvahahmot, kaunokirjallisuus (1.791)
alternative label: Sarjakuvalehdet, kaunokirjallisuus (1.791)
alternative label: Sarjakuvat, kaunokirjallisuus (1.791)
alternative label: Strippisarjakuvat, kaunokirjallisuus (1.791)
alternative label: Videoelokuva, piirretyt elokuvat (1.791)
alternative label: Videokasetit, piirretyt elokuvat (1.791)
alternative label: Videolevyt, piirretyt elokuvat (1.791)
alternative label: Videotallenteet, piirretyt elokuvat (1.791)
alternative label: Animationsfilmer, fiktiva (1.791) @sv
alternative label: Anime, fiktiva (1.791) @sv
alternative label: Anime-filmer, fiktiva (1.791) @sv
alternative label: Anime-serier, fiktiva (1.791) @sv
alternative label: Barnfilmer, tecknade filmer (1.791) @sv
alternative label: Bildkassetter, tecknade filmer (1.791) @sv
alternative label: Bildskivor, tecknade filmer (1.791) @sv
alternative label: Dockfilmer (1.791) @sv
alternative label: Grafiska noveller (1.791) @sv
alternative label: Manga, skönlitteratur (1.791) @sv
alternative label: Mangaserier, skönlitteratur (1.791) @sv
alternative label: Seriebilder, skönlitteratur (1.791) @sv
alternative label: Seriefigurer, skönlitteratur (1.791) @sv
alternative label: Seriestrippar, skönlitteratur (1.791) @sv
alternative label: Serietidningar, skönlitteratur (1.791) @sv
alternative label: Skräckserier, skönlitteratur (1.791) @sv
alternative label: Tecknade filmer, fiktiva (1.791) @sv
alternative label: Tecknade serier, skönlitteratur (1.791) @sv
alternative label: Videofilm, tecknade filmer (1.791) @sv
alternative label: Videoinspelningar, tecknade filmer (1.791) @sv
alternative label: Videokassetter, tecknade filmer (1.791) @sv
alternative label: Videoskivor, teckande filmer (1.791) @sv
related: URN:NBN:fi:au:hklj:749.1
related: Piirustuksen materiaalit ja tekniikka
related: Elokuva. Elokuvataide

Sanakirjat. Hakuteokset
type: Class
type: Concept
subclass of: URN:NBN:fi:au:hklj:100
broader: URN:NBN:fi:au:hklj:100
in scheme: URN:NBN:fi:au:hklj:
notation: 103
preferred label: Dictionaries. Reference works @en
preferred label: Ordböcker. Uppslagsböcker @sv
scope note: Filosofian yleiset sanakirjat ja hakuteokset Filosofian erikoisalojen sanakirjat ja hakuteokset alan mukaisessa luokassa
scope note: Allmänna ordböcker och uppslagsböcker i filosofi Ordböcker och uppslagsböcker i specialområden inom filosofin klassificeras enligt område @sv

Behaviorismi
type: Class
type: Concept
subclass of: Psykologian suunnat
alternative label: Behaviorismi (123.3)
alternative label: Käyttäytymisen psykologia, sosiaalipsykologia (123.3)
alternative label: Ykseys, sosiaalipsykologia (123.3 +)
alternative label: Behaviorism (123.3) @sv
alternative label: Beteendepsykologi, socialpsykologi (123.3) @sv
alternative label: Enhet, socialpsykologi (123.3 +) @sv
broader: Psykologian suunnat
in scheme: URN:NBN:fi:au:hklj:
notation: 123.3
preferred label: Behaviourism @en
preferred label: Behaviorism @sv
related: Muita psykologian aloja
scope note: Tässä behavioristisen psykologian yleisteokset Tiettyä psykologian erikoisalaa tai -kysymystä koskeva behavioristinen tutkimus alan mukaisessa luokassa
scope note: Hit allmänna verk som rör behavioristisk psykologi Verk om behavioristisk forskning som rör psykologiska specialområden eller specialfrågor klassificeras enligt område @sv

URN:NBN:fi:au:hklj:2
alternative label: Pohjoisgermaaniset kielet, kaunokirjallisuus (2 +)
alternative label: Pohjoismaiset kielet, kaunokirjallisuus (2 +)
alternative label: Riikinruotsi, kaunokirjallisuus (2 +)
alternative label: Ruotsin kieli, kaunokirjallisuus (2 +)
alternative label: Ruotsin ruotsi, kaunokirjallisuus (2 +)
alternative label: Ruotsinruotsi, kaunokirjallisuus (2 +)
alternative label: Skandinaaviset kielet, kaunokirjallisuus (2 +)
alternative label: Suomenruotsalainen kirjallisuus, kaunokirjallisuus (2 +)
alternative label: Finlandssvensk litteratur, skönlitteratur (2 +) @sv
alternative label: Nordgermanska språk, skönlitteratur (2 +) @sv
alternative label: Nordiska språk, skönlitteratur (2 +) @sv
alternative label: Rikssvenska, skönlitteratur (2 +) @sv
alternative label: Skandinaviska språk, skönlitteratur (2 +) @sv
alternative label: Svenska, skönlitteratur (2 +) @sv
alternative label: Sverigesvenska, skönlitteratur (2 +) @sv
related: Ruotsinkielisen kirjallisuuden historia ja tutkimus
related: Suomenruotsalaisen kirjallisuuden historia ja tutkimus
related: Ruotsin kieli

Opinnot
type: Class
type: Concept
subclass of: URN:NBN:fi:au:hklj:210
broader: URN:NBN:fi:au:hklj:210
in scheme: URN:NBN:fi:au:hklj:
notation: 217
preferred label: Studies. Educational institutions @en
preferred label: Studier @sv
related: URN:NBN:fi:au:hklj:209
scope note: Yleiset kristinuskoa tai kristillistä teologiaa koskevat opinnot Kristinuskon tai kristillisen teologian erikoisaloja koskevat opinnot alan mukaisessa luokassa
scope note: Allmänna studier i kristendom och kristen teologi Studier som rör specialområden i kristendom eller kristen teologi klassificeras enligt område @sv

Kartat
type: Class
type: Concept
subclass of: Kokoomateokset
alternative label: Uskontomaantiede, kristinuskoa koskevat kartat (218.4)
alternative label: Religionsgeografi, kartor över kristendom (218.4) @sv
broader: Kokoomateokset
in scheme: URN:NBN:fi:au:hklj:
notation: 218.4
preferred label: Maps @en
preferred label: Kartor @sv
related: URN:NBN:fi:au:hklj:209.084
scope note: Yleiset kristinuskoa tai kristillistä teologiaa koskevat kartat ja kartastot Kristinuskon tai kristillisen teologian erikoisaloja koskevat kartat ja kartastot alan mukaisessa luokassa
scope note: Allmänna kartor eller kartböcker som rör kristendom eller kristen teologi Kartor eller kartböcker som rör specialområden inom kristendom eller kristen teologi klassificeras enligt område @sv

Apostolien teot. Apostoliset kirjeet
type: Class
type: Concept
subclass of: RAAMATTU. RAAMATUNTUTKIMUS
alternative label: Apostolien teot (227)
alternative label: Apostoliset kirjeet (227)
alternative label: Apostolit (225 ... 228)
alternative label: Heprealaiskirje (227)
alternative label: Katoliset kirjeet (227)
alternative label: Opetuslapset (225 ... 228)
alternative label: Paavali, Raamatun henkilöt (227)
alternative label: Paavalin kirjeet (227)
alternative label: Pietari, Pietarin kirjeet (227)
alternative label: Raamattu, apostolien teot ja kirjeet (227)
alternative label: Uusi Testamentti, apostolien teot (227)
alternative label: Uusi Testamentti, apostoliset kirjeet (227)
alternative label: Apostlagärningarna (227) @sv
alternative label: Apostlar (225 ... 228) @sv
alternative label: Apostoliska breven (227) @sv
alternative label: Bibeln, apostlagärningarna och apostoliska breven (227) @sv
alternative label: Hebreerbrevet (227) @sv
alternative label: Katolska breven (227) @sv
alternative label: Lärjungar (225 ... 228) @sv
alternative label: Nya Testamentet, apostlagärningarna (227) @sv
alternative label: Nya Testamentet, apostoliska breven (227) @sv
alternative label: Pauli brev (227) @sv
alternative label: Paulus, bibliska personer (227) @sv
alternative label: Petrus, Petri brev (227) @sv
broader: RAAMATTU. RAAMATUNTUTKIMUS
in scheme: URN:NBN:fi:au:hklj:
notation: 227
preferred label: Acts of the Apostles. Apostolic letters @en
preferred label: Apostlagärningarna. Apostlabreven @sv
scope note: Paavalin kirjeet. Heprealaskirje. Katoliset kirjeet
scope note: Paulus brev. Hebréerbrevet. De katolska breven @sv

Filosofia. Teoria. Tutkimusmenetelmät
type: Class
type: Concept
subclass of: URN:NBN:fi:au:hklj:300
alternative label: Case-tutkimus, yhteiskuntatieteiden metodit (301)
alternative label: Faktorianalyysi, yhteiskuntatieteet (301)
alternative label: Lomaketutkimus, yhteiskuntatieteet (301)
alternative label: Monimuuttujamenetelmät, yhteiskuntatieteet (301)
alternative label: Regressioanalyysi, yhteiskuntatieteet (301)
alternative label: Survey-tutkimus, yhteiskuntatieteet (301)
alternative label: Tapaustutkimus, yhteiskuntatieteiden metodit (301)
alternative label: Verkostot, yhteiskuntatieteet (301)
alternative label: Case-forskning, samhällsvetenskapernas metoder (301) @sv
alternative label: Faktoranalys, samhällsvetenskaper (301) @sv
alternative label: Fallstudie, samhällsvetenskapernas metoder (301) @sv
alternative label: Multivariata metoder, samhällsvetenskaper (301) @sv
alternative label: Nätverk, samhällsvetenskaper (301) @sv
alternative label: Regressionsanalys, samhällsvetenskaper (301) @sv
alternative label: Surveyundersökning, samhällsvetenskaper (301) @sv
broader: URN:NBN:fi:au:hklj:300
in scheme: URN:NBN:fi:au:hklj:
notation: 301
preferred label: Philosophy. Theory. Research methods @en
preferred label: Filosofi. Teori. Forskningsmetoder @sv
related: Yhteiskuntafilosofia
scope note: Yhteiskuntatieteiden yleinen filosofia, teoria ja tutkimusmenetelmät Eri yhteiskuntatieteiden filosofia, teoria ja tutkimusmenetelmät alan mukaisessa luokassa
scope note: Samhällsvetenskapernas allmänna filosofi, teori och forskningsmetoder Olika filosofier, teorier och forskningsmetoder som rör samhällsvetenskaper klassificeras enligt område @sv

Sanakirjat. Hakuteokset
type: Class
type: Concept
subclass of: URN:NBN:fi:au:hklj:300
broader: URN:NBN:fi:au:hklj:300
in scheme: URN:NBN:fi:au:hklj:
notation: 303
preferred label: Dictionaries. Reference books @en
preferred label: Ordböcker. Uppslagsböcker @sv
scope note: Yhteiskuntaa tai yhteiskuntatieteitä koskevat yleiset sanakirjat ja hakuteokset Eri yhteiskuntatieteitä koskevat sanakirjat ja hakuteokset alan mukaisessa luokassa
scope note: Allmänna ordböcker och uppslagsböcker som hänför sig till samhället eller samhällsvetenskaperna Ordböcker och uppslagsböcker som rör olika samhällsvetenskaper klassificeras enligt område @sv

Esseet
type: Class
type: Concept
subclass of: URN:NBN:fi:au:hklj:300
alternative label: Juhlapuheet, poliitikkojen puheet (304)
alternative label: Juhlapuheet, valtiomiesten puheet (304)
alternative label: Pamfletit, yhteiskunnalliset esseet (304)
alternative label: Puheet, poliitikkojen (304)
alternative label: Puheet, valtiomiesten (304)
alternative label: Festtal, politikernas tal (304) @sv
alternative label: Festtal, statsmäns tal (304) @sv
alternative label: Pamfletter, samhälleliga essäer (304) @sv
alternative label: Tal, föredrag, politikernas (304) @sv
alternative label: Tal, föredrag, statsmäns (304) @sv
broader: URN:NBN:fi:au:hklj:300
in scheme: URN:NBN:fi:au:hklj:
notation: 304
preferred label: Essays @en
preferred label: Essäer @sv
related: Kokoomateokset
scope note: Yhteiskuntaa tai yhteiskuntatieteitä koskevat yleiset tai sekasisältöiset essee-, puhe- ja kirjoituskokoelmat Eri yhteiskuntatieteitä koskevat essee-, puhe ja kirjoituskokoelmat alan mukaisessa luokassa
scope note: Essäsamlingar samt samlingar av tal och skrifter med allmänt eller blandat innehåll som handlar om samhället eller samhällsvetenskaperna Essäsamlingar samt samlingar med tal och skrifter som handlar om specialområden inom olika samhällsvetenskaper klassificeras enligt område @sv

Yhdistykset. Laitokset. Kokoukset
type: Class
type: Concept
subclass of: URN:NBN:fi:au:hklj:300
broader: URN:NBN:fi:au:hklj:300
in scheme: URN:NBN:fi:au:hklj:
notation: 306
preferred label: Associations. Institutions. Meetings @en
preferred label: Organisationer. Institutioner. Möten @sv
scope note: Yhteiskuntaa tai yhteiskuntatieteitä koskevat yleiset yhdistykset, laitokset ja kokoukset Eri yhteiskuntatieteitä koskevat yhdistykset, laitokset ja kokoukset alan mukaisessa luokassa
scope note: Allmänna organisationer, institutioner och möten som rör samhället eller samhällsvetenskaperna Allmänna organisationer, institutioner och möten som rör olika samhällsvetenskaper klassificeras enligt område @sv

URN:NBN:fi:au:hklj:352.09
alternative label: Aateli, historia (352.09)
alternative label: Aatelisarvot, aateli, historia (352.09)
alternative label: Aateliset, historia (352.09)
alternative label: Aatelisto, historia (352.09)
alternative label: Esiteollinen yhteiskunta, yhteiskuntahistoria (352.09)
alternative label: Feodaalilaitos, historia (352.09)
alternative label: Feodaaliyhteiskunnat, historia (352.09)
alternative label: Feodalismi, yhteiskuntahistoria (352.09)
alternative label: Historiallinen sosiologia (352.09)
alternative label: Kolonialistiset yhteiskunnat, historia (352.09)
alternative label: Läänityslaitos, historia (352.09)
alternative label: Maaorjuus, historia (352.09)
alternative label: Orjat, orjayhteiskunnat, historia (352.09)
alternative label: Orjayhteiskunnat, historia (352.09)
alternative label: Pajarit, aatelisto, historia, (352.09)
alternative label: Papisto, yhteiskuntaluokat, historia (352.09)
alternative label: Pappissääty, yhteiskuntaluokat, historia (352.09)
alternative label: Porvarillisuus, yhteiskunnan rakenne, historia (352.09 +)
alternative label: Porvaristo, historia, yhteiskuntaluokat (352.09)
alternative label: Porvarit, historia, yhteiskuntaluokat (352.09)
alternative label: Ritaristo, aateliston historia (352.09)
alternative label: Ritarit, aateliston historia (352.09)
alternative label: Rälssi, historia (352.09)
alternative label: Sosiaalihistoria, yhteiskuntaluokkien historia (352.09)
alternative label: Sosiaalinen järjestelmä, yhteiskunnan rakenne, historia (352.09)
alternative label: Sosiaalinen kerrostuneisuus, yhteiskunnan rakenne, historia (352.09)
alternative label: Sosiaalinen liikkuvuus, yhteiskunnan rakenne, historia (352.09)
alternative label: Sosiaalinen muutos, yhteiskunnan rakenne, historia (352.09)
alternative label: Sosiaalinen nousu, yhteiskunnan rakenne, historia (352.09)
alternative label: Sosiaalinen rakenne, yhteiskunnan rakenne, historia (352.09)
alternative label: Sosiaaliset järjestelmät, yhteiskunnan rakenne, historia (352.09)
alternative label: Sosiaaliset rakenteet, historia (352.09)
alternative label: Säädyt, historia (352.09)
alternative label: Sääty-yhteiskunta, historia (352.09)
alternative label: Säätyläiset, yhteiskuntaluokkien historia (352.09)
alternative label: Työläiset, työväenluokka, historia (352.09)
alternative label: Työväenluokka, historia (352.09)
alternative label: Työväestö, historia (352.09)
alternative label: Ylimysvalta, yhteiskunnan rakenne, historia (352.09)
alternative label: Yläluokka, yhteiskunnan rakenne, historia (352.09)
alternative label: Adel, historia (352.09) @sv
alternative label: Adelstitlar, adel, historia (352.09) @sv
alternative label: Arbetarbefolkning, historia (352.09) @sv
alternative label: Arbetare, arbetarklassen, historia (352.09) @sv
alternative label: Arbetarklassen, historia (352.09) @sv
alternative label: Bojarer, adel, historia (352.09) @sv
alternative label: Borgare, historia, samhällsklasser (352.09) @sv
alternative label: Borgerlighet, samhällets struktur, historia (352.09 +) @sv
alternative label: Borgerskapet, historia, samhällsklasser (352.09) @sv
alternative label: Elitokrati, samhällets struktur, historia (352.09) @sv
alternative label: Feodalism, samhällshistoria (352.09) @sv
alternative label: Feodalsamhällen, historia (352.09) @sv
alternative label: Feodalväsen, historia (352.09) @sv
alternative label: Feodalväsendet, historia (352.09) @sv
alternative label: Frälse, historia (352.09) @sv
alternative label: Förindustriellt samhälle, samhällshistoria (352.09) @sv
alternative label: Historisk sociologi (352.09) @sv
alternative label: Kolonialistiska samhällen, historia (352.09) @sv
alternative label: Livegenskap, historia (352.09) @sv
alternative label: Prästerskapet, samhällsklasser, historia (352.09) @sv
alternative label: Prästeståndet, samhällsklasser, historia (352.09) @sv
alternative label: Riddare, adelns historia (352.09) @sv
alternative label: Riddersdkap, adelns historia (352.09) @sv
alternative label: Slavar, slavsamhällen, historia (352.09) @sv
alternative label: Slavsamhällen, historia (352.09) @sv
alternative label: Social förändring, samhällets struktur, historia (352.09) @sv
alternative label: Social rörlighet, samhällets struktur, historia (352.09) @sv
alternative label: Social skiktning, samhällets struktur, historia (352.09) @sv
alternative label: Social struktur, samhällets struktur, historia (352.09) @sv
alternative label: Social upphöjning, samhällets struktur, historia (352.09) @sv
alternative label: Sociala strukturer, historia (352.09) @sv
alternative label: Sociala system, samhällets struktur, historia (352.09) @sv
alternative label: Socialhistoria, samhällsklassernas historia (352.09) @sv
alternative label: Socialt system, samhällets struktur, historia (352.09) @sv
alternative label: Ständer, historia (352.09) @sv
alternative label: Ståndspersoner, samhällsklassernas historia (352.09) @sv
alternative label: Ståndssamhälle, historia (352.09) @sv
related: Orjuus
related: Yhteiskunnan rakenne
related: Maapolitiikka

URN:NBN:fi:au:hklj:4
alternative label: Amerikka, englanninkielinen kaunokirjallisuus (4 +)
alternative label: Australia, englanninkielinen kaunokirjallisuus (4 +)
alternative label: Englannin kieli, kaunokirjallisuus (4 +)
alternative label: Pohjois-Amerikka, englanninkielinen kaunokirjallisuus (4 +)
alternative label: Amerika, engelsk skönlitteratur (4 +) @sv
alternative label: Australien, engelsk skönlitteratur (4 +) @sv
alternative label: Engelska, skönlitteratur (4 +) @sv
alternative label: Nordamerika, engelsk skönlitteratur (4 +) @sv
related: Englanninkielisen kirjallisuuden historia ja tutkimus
related: Amerikan englanninkielisen kirjallisuuden historia ja tutkimus
related: Englannin kieli

Sanakirjat. Hakuteokset
type: Class
type: Concept
subclass of: URN:NBN:fi:au:hklj:400
alternative label: Maantieteelliset nimet, maantiede, hakuteokset (403)
alternative label: Geografiska namn, geografi, uppslagsverk (403) @sv
broader: URN:NBN:fi:au:hklj:400
in scheme: URN:NBN:fi:au:hklj:
notation: 403
preferred label: Dictionaries. Reference books @en
preferred label: Ordböcker. Uppslagsböcker @sv
scope note: Maantieteen tai maantiedon yleiset sanakirjat ja hakuteokset Eri maantieteen aloja tai eri maantieteellisiä alueita koskevat sanakirjat ja hakuteokset alan tai alueen mukaisessa luokassa
scope note: Allmänna ordböcker och uppslagsböcker som hänför sig till geografi Ordböcker och uppslagsböcker som rör olika ämnesområden inom geografi eller olika geografiska områden klassificeras enligt ämnesområde eller geografiskt område @sv

Kypros
type: Class
type: Concept
subclass of: Etu-Aasia
alternative label: Kypros (421.2)
alternative label: Kypros, maantiede, matkat (421.2)
alternative label: Cypern (421.2) @sv
alternative label: Cypern, geografi, resor (421.2) @sv
broader: Etu-Aasia
in scheme: URN:NBN:fi:au:hklj:
notation: 421.2
preferred label: Cyprus @en
preferred label: Cypern @sv
related: Etu-Aasian historia

Korea
type: Class
type: Concept
subclass of: AASIA
alternative label: Etelä-Korea (425)
alternative label: Etelä-Korea, maantiede, matkat (425)
alternative label: Itä-Aasia, Korea (425)
alternative label: Kaukoitä, Korea (425)
alternative label: Korea (425)
alternative label: Korea, maantiede, matkat (425)
alternative label: Korean kansantasavalta (425)
alternative label: Korean kansantasavalta, maantiede, matkat (425)
alternative label: Korean tasavalta (425)
alternative label: Korean tasavalta, maantiede, matkat (425)
alternative label: Pohjois-Korea (425)
alternative label: Pohjois-Korea, maantiede, matkat (425)
alternative label: Fjärran Östern, Korea (425) @sv
alternative label: Folkrepubliken Korea (425) @sv
alternative label: Folkrepubliken Korea, geografi, resor (425) @sv
alternative label: Korea, geografi, resor (425) @sv
alternative label: Nordkorea (425) @sv
alternative label: Nordkorea, geografi, resor (425) @sv
alternative label: Ostasien, Korea (425) @sv
alternative label: Republiken Korea (425) @sv
alternative label: Republiken Korea, geografi, resor (425) @sv
alternative label: Sydkorea (425) @sv
alternative label: Sydkorea, geografi, resor (425) @sv
broader: AASIA
in scheme: URN:NBN:fi:au:hklj:
notation: 425
related: Keski- ja Itä-Aasian historia
scope note: Korean tasavalta. Korean kansantasavalta
scope note: Republiken Korea. Demokratiska Folkrepubliken Korea @sv

Japani
type: Class
type: Concept
subclass of: AASIA
alternative label: Itä-Aasia, Japani (427)
alternative label: Japani (427)
alternative label: Japani, maantiede, matkat (427)
alternative label: Kaukoitä, Japani (427)
alternative label: Kuriilit, Japani (427)
alternative label: Fjärran Östern, Japan (427) @sv
alternative label: Japan (427) @sv
alternative label: Japan, geografi, resor (427) @sv
alternative label: Kurilerna, Japan (427) @sv
alternative label: Ostasien, Japan (427) @sv
broader: AASIA
in scheme: URN:NBN:fi:au:hklj:
notation: 427
preferred label: Japan @en
related: Japanin historia

Länsi-Afrikka
type: Class
type: Concept
subclass of: AFRIKKA
alternative label: Benin (434)
alternative label: Benin, maantiede, matkat (434)
alternative label: Burkina Faso (434)
alternative label: Burkina Faso, maantiede, matkat (434)
alternative label: Dahomey (434)
alternative label: Dahomey, maantiede, matkat (434)
alternative label: Gambia (434)
alternative label: Gambia, maantiede, matkat (434)
alternative label: Ghana (434)
alternative label: Ghana, maantiede, matkat (434)
alternative label: Guinea (434)
alternative label: Guinea, maantiede, matkat (434)
alternative label: Guinea-Bissau (434)
alternative label: Guinea-Bissau, maantiede, matkat (434)
alternative label: Kultarannikko (434)
alternative label: Kultarannikko, maantiede, matkat (434)
alternative label: Liberia (434)
alternative label: Liberia, maantiede, matkat (434)
alternative label: Länsi-Afrikka (434)
alternative label: Länsi-Afrikka, maantiede, matkat (434)
alternative label: Mali (434)
alternative label: Mali, maantiede, matkat (434)
alternative label: Mauritania (434)
alternative label: Mauritania, maantiede, matkat (434)
alternative label: Niger (434)
alternative label: Niger, maantiede, matkat (434)
alternative label: Nigeria (434)
alternative label: Nigeria, maantiede, matkat (434)
alternative label: Norsunluurannikko (434)
alternative label: Norsunluurannikko, maantiede, matkat (434)
alternative label: Sahel (434)
alternative label: Sahel, maantiede, matkat (434)
alternative label: Senegal (434)
alternative label: Senegal, maantiede, matkat (434)
alternative label: Sierra Leone (434)
alternative label: Sierra Leone, maantiede, matkat (434)
alternative label: Togo (434)
alternative label: Togo, maantiede, matkat (434)
alternative label: Benin, geografi, resor (434) @sv
alternative label: Burkina Faso, geografi, resor (434) @sv
alternative label: Dahomey, geografi, resor (434) @sv
alternative label: Elfenbenskusten (434) @sv
alternative label: Elfenbenskusten, geografi, resor (434) @sv
alternative label: Gambia, geografi, resor (434) @sv
alternative label: Ghana, geografi, resor (434) @sv
alternative label: Guinea, geografi, resor (434) @sv
alternative label: Guinea-Bissau, geografi, resor (434) @sv
alternative label: Guldkusten (434) @sv
alternative label: Guldkusten, geografi, resor (434) @sv
alternative label: Liberia, geografi, resor (434) @sv
alternative label: Mali, geografi, resor (434) @sv
alternative label: Mauretanien (434) @sv
alternative label: Mauretanien, geografi, resor (434) @sv
alternative label: Niger, geografi, resor (434) @sv
alternative label: Nigeria, geografi, resor (434) @sv
alternative label: Sahel, geografi, resor (434) @sv
alternative label: Senegal, geografi, resor (434) @sv
alternative label: Sierra Leone, geografi, resor (434) @sv
alternative label: Togo, geografi, resor (434) @sv
alternative label: Västafrika (434) @sv
alternative label: Västafrika, geografi, resor (434) @sv
broader: AFRIKKA
in scheme: URN:NBN:fi:au:hklj:
notation: 434
preferred label: West Africa @en
preferred label: Västafrika @sv
related: Länsi-, Itä- ja Keski-Afrikan historia
scope note: Benin. Burkina Faso. Gambia. Ghana. Guinea. Guinea-Bissau. Liberia. Mali. Mauritania. Niger. Nigeria. Norsunluurannikko. Senegal. Sierra Leone. Togo
scope note: Benin. Burkina Faso. Elfenbenskusten. Gambia. Ghana. Guinea Guinea-Bissau. Liberia. Mali. Mauretanien. Niger. Nigeria. Senegal. Sierra Leone. Togo @sv

Keski-Afrikka
type: Class
type: Concept
subclass of: AFRIKKA
alternative label: Angola (435)
alternative label: Angola, maantiede, matkat (435)
alternative label: Gabon (435)
alternative label: Gabon, maantiede, matkat (435)
alternative label: Kamerun (435)
alternative label: Kamerun, maantiede, matkat (435)
alternative label: Keski-Afrikka (435)
alternative label: Keski-Afrikka, maantiede, matkat (435)
alternative label: Kongo (435)
alternative label: Kongo Brazzaville (435)
alternative label: Kongo Brazzaville, maantiede, matkat (435)
alternative label: Kongo Kinshasa (435)
alternative label: Kongo Kinshasa, maantiede, matkat (435)
alternative label: Kongo, maantiede, matkat (435)
alternative label: Päiväntasaajan Guinea (435)
alternative label: Päiväntasaajan Guinea, maantiede, matkat (435)
alternative label: Tsad (435)
alternative label: Tsad, maantiede, matkat (435)
alternative label: Zaire (435)
alternative label: Zaire, maantiede, matkat (435)
alternative label: Angola, geografi, resor (435) @sv
alternative label: Centralafrika (435) @sv
alternative label: Centralafrika, geografi, resor (435) @sv
alternative label: Ekvatorialguinea (435) @sv
alternative label: Ekvatorialguinea, geografi, resor (435) @sv
alternative label: Gabon, geografi, resor (435) @sv
alternative label: Kamerun, geografi, resor (435) @sv
alternative label: Kongo, geografi, resor (435) @sv
alternative label: Kongo-Brazzaville (435) @sv
alternative label: Kongo-Brazzaville, geografi, resor (435) @sv
alternative label: Kongo-Kinshasa (435) @sv
alternative label: Kongo-Kinshasa, geografi, resor (435) @sv
alternative label: Tchad (435) @sv
alternative label: Tchad, geografi, resor (435) @sv
alternative label: Zaire, geografi, resor (435) @sv
broader: AFRIKKA
in scheme: URN:NBN:fi:au:hklj:
notation: 435
preferred label: Central Africa @en
preferred label: Centralafrika @sv
related: Länsi-, Itä- ja Keski-Afrikan historia
scope note: Angola. Gabon. Kamerun. Keski-Afrikan tasavalta. Kongo. Päiväntasaajan Guinea. Tsad. Zaire
scope note: Angola. Centralafrikanska republiken. Ekvatorialguinea. Gabon. Kamerun. Kongo. Tchad. Zaire @sv

Etelä-Afrikka
type: Class
type: Concept
subclass of: AFRIKKA
alternative label: Ambomaa (438)
alternative label: Ambomaa, maantiede, matkat (438)
alternative label: Betsuanamaa (438)
alternative label: Betsuanamaa, maantiede, matkat (438)
alternative label: Botswana (438)
alternative label: Botswana, maantiede, matkat (438)
alternative label: Etelä-Afrikan tasavalta (438)
alternative label: Etelä-Afrikan tasavalta, maantiede, matkat (438)
alternative label: Etelä-Afrikka (438)
alternative label: Etelä-Afrikka, maantiede, matkat (438)
alternative label: Lesotho (438)
alternative label: Lesotho, maantiede, matkat (438)
alternative label: Malawi (438)
alternative label: Malawi, maantiede, matkat (438)
alternative label: Mosambik (438)
alternative label: Mosambik, maantiede, matkat (438)
alternative label: Namibia (438)
alternative label: Namibia, maantiede, matkat (438)
alternative label: Rhodesia (438)
alternative label: Rhodesia, maantiede, matkat (438)
alternative label: Sambia (438)
alternative label: Sambia, maantiede, matkat (438)
alternative label: Swazimaa (438)
alternative label: Swazimaa, maantiede, matkat (438)
alternative label: Zimbabwe (438)
alternative label: Zimbabwe, maantiede, matkat (438)
alternative label: Amboland (438) @sv
alternative label: Amboland, geografi, resor (438) @sv
alternative label: Bechuanaland (438) @sv
alternative label: Bechuanaland, geografi, resor (438) @sv
alternative label: Botswana, geografi, resor (438) @sv
alternative label: Lesotho, geografi, resor (438) @sv
alternative label: Malawi, geografi, resor (438) @sv
alternative label: Moçambique (438) @sv
alternative label: Moçambique, geografi, resor (438) @sv
alternative label: Namibia, geografi, resor (438) @sv
alternative label: Rhodesia, geografi, resor (438) @sv
alternative label: Swaziland (438) @sv
alternative label: Swaziland, geografi, resor (438) @sv
alternative label: Sydafrika (438) @sv
alternative label: Sydafrika, geografi, resor (438) @sv
alternative label: Sydafrikanska republiken (438) @sv
alternative label: Sydafrikanska republiken, geografi, resor (438) @sv
alternative label: Zambia (438) @sv
alternative label: Zambia, geografi, resor (438) @sv
alternative label: Zimbabwe, geografi, resor (438) @sv
broader: AFRIKKA
in scheme: URN:NBN:fi:au:hklj:
notation: 438
preferred label: South Africa @en
preferred label: Sydafrika @sv
related: Etelä-Afrikan historia
scope note: Botswana. Etelä-Afrikan tasavalta. Lesotho. Malawi. Mosambik. Namibia. Sambia. Swazimaa. Zimbabwe
scope note: Botswana. Lesotho. Malawi. Moçambique. Namibia. Swaziland. Sydafrikanska republiken. Zambia. Zimbabwe @sv

Sanakirjat. Hakuteokset
type: Class
type: Concept
subclass of: LUONNONTIETEET
broader: LUONNONTIETEET
in scheme: URN:NBN:fi:au:hklj:
notation: 503
preferred label: Dictionaries. Reference books @en
preferred label: Ordböcker. Uppslagsböcker @sv
scope note: Luontoa tai luonnontieteitä koskevat yleiset sanakirjat ja hakuteokset Eri luonnontieteen aloja koskevat sanakirjat ja hakuteokset alan mukaisessa luokassa
scope note: Allmänna ordböcker och uppslagsböcker som hänför sig till naturen eller naturvetenskaperna Ordböcker och uppslagsböcker som rör olika områden inom naturvetenskaperna klassificeras enligt område @sv

Esseet
type: Class
type: Concept
subclass of: LUONNONTIETEET
alternative label: Meditaatio, luonnonäänet (504)
alternative label: Metamusiikki, luonnonäänikokoelmat (504)
alternative label: Mietiskely, luonnonäänet (504)
alternative label: Meditation, meditaatio, naturljud (504) @sv
alternative label: Meditation, mietiskely, naturljud (504) @sv
alternative label: Metamusik, naturljudssamlingar (504) @sv
broader: LUONNONTIETEET
in scheme: URN:NBN:fi:au:hklj:
notation: 504
preferred label: Essays @en
preferred label: Essäer @sv
related: Kokoomateokset
scope note: Luontoa tai luonnontieteitä koskevat yleiset tai sekasisältöiset essee-, puhe- ja kirjoituskokoelmat Eri luonnontieteen aloja koskevat essee-, puhe- ja kirjoituskokoelmat alan mukaisessa luokassa
scope note: Essäsamlingar och samlingar av tal och skrifter med allmänt eller blandat innehåll som handlar om naturen eller naturvetenskaperna Essäsamlingar och samlingar med tal och skrifter som handlar om specialområden inom olika naturvetenskaper klassificeras enligt område @sv

Yhdistykset. Laitokset. Kokoukset
type: Class
type: Concept
subclass of: LUONNONTIETEET
broader: LUONNONTIETEET
in scheme: URN:NBN:fi:au:hklj:
notation: 506
preferred label: Associations. Institutions. Meetings @en
preferred label: Organisationer. Institutioner. Möten @sv
scope note: Luontoa tai luonnontieteitä koskevat yleiset yhdistykset, laitokset ja kokoukset Eri luonnontieteen aloja koskevat yhdistykset, laitokset ja kokoukset alan mukaisessa luokassa
scope note: Allmänna organisationer, institutioner och möten som rör naturen eller naturvetenskaperna Organisationer, institutioner och möten som rör olika områden inom naturvetenskaperna klassificeras enligt område @sv

Opinnot
type: Class
type: Concept
subclass of: LUONNONTIETEET
broader: LUONNONTIETEET
in scheme: URN:NBN:fi:au:hklj:
notation: 507
preferred label: Studies @en
preferred label: Studier @sv
related: Matematiikan ja luonnontieteiden opetusoppi
scope note: Luonnontieteiden opinnot yleensä Eri luonnontieteen aloja koskevat opinnot alan mukaisessa luokassa
scope note: Studier i naturvetenskaperna i allmänhet Studier i olika områden inom naturvetenskaperna klassificeras enligt område @sv

Lukuteoria. Aritmetiikka
type: Class
type: Concept
subclass of: MATEMATIIKKA
alternative label: Alkuluvut (512)
alternative label: Aritmetiikka (512)
alternative label: Binaarijärjestelmä (512)
alternative label: Binäärijärjestelmä (512)
alternative label: Desimaaliluvut (512)
alternative label: Fibonaccin lukujono (512)
alternative label: Imaginaariluvut (512)
alternative label: Imaginääriluvut (512)
alternative label: Irrationaaliluvut (512)
alternative label: Jakaminen, aritmetiikka (512)
alternative label: Ketjumurtoluvut (512)
alternative label: Kokonaisluvut (512)
alternative label: Kompleksiluvut (512)
alternative label: Kymmenjärjestelmä, matematiikka (512)
alternative label: Laskelmat, aritmetiikka (512)
alternative label: Laskeminen, laskento (512)
alternative label: Laskenta, laskento (512)
alternative label: Laskento (512)
alternative label: Laskuoppi (512)
alternative label: Likiarvot (512)
alternative label: Logaritmit (512)
alternative label: Lukujonot (512)
alternative label: Lukujärjestelmät (512)
alternative label: Lukukäsite (512)
alternative label: Lukuteoria (512)
alternative label: Luonnolliset logaritmit (512)
alternative label: Luonnolliset luvut (512)
alternative label: Matematiikka, aritmetiikka (512)
alternative label: Matematiikka, lukuteoria (512)
alternative label: Murtoluvut (512)
alternative label: Numerojärjestelmät (512)
alternative label: Numerot (512)
alternative label: Pikalaskenta (512)
alternative label: Rationaaliluvut (512)
alternative label: Reaaliluvut (512)
alternative label: Aritmetik (512) @sv
alternative label: Binärt talsystem (512) @sv
alternative label: Bråktal (512) @sv
alternative label: Decimalsystemet, matematik (512) @sv
alternative label: Decimaltal (512) @sv
alternative label: Delning, aritmetik (512) @sv
alternative label: Fibonaccis talföljd (512) @sv
alternative label: Hela tal (512) @sv
alternative label: Imaginära tal (512) @sv
alternative label: Irrationella tal (512) @sv
alternative label: Kalkyl, räkning som skolämne (512) @sv
alternative label: Kalkyler, aritmetik (512) @sv
alternative label: Kedjebråk (512) @sv
alternative label: Komplexa tal (512) @sv
alternative label: Logaritmer (512) @sv
alternative label: Matematik, aritmetik (512) @sv
alternative label: Naturliga logaritmer (512) @sv
alternative label: Naturliga tal (512) @sv
alternative label: Närmevärden (512) @sv
alternative label: Primtal (512) @sv
alternative label: Rationella tal (512) @sv
alternative label: Reella tal (512) @sv
alternative label: Räknelära (512) @sv
alternative label: Räkning som skolämne (512) @sv
alternative label: Räkning, räkning som skolämne (512) @sv
alternative label: Sifferkombinationer (512) @sv
alternative label: Siffror (512) @sv
alternative label: Snabbkalkyl (512) @sv
alternative label: Talbegrepp (512) @sv
alternative label: Talföljder (512) @sv
alternative label: Talsystem (512) @sv
alternative label: Talteori (512) @sv
broader: MATEMATIIKKA
in scheme: URN:NBN:fi:au:hklj:
notation: 512
preferred label: Number theory. Arithmetic @en
preferred label: Talteori. Aritmetik @sv
related: Symbolit. Koodit. Merkkijärjestelmät
scope note: Numerojärjestelmät. Luvut. Alkuluvut. Lukuteoreettiset funktiot ja probleemat Aritmetiikka. Laskento
scope note: Siffersystem. Tal. Primtal. Talteoretiska funktioner och problem Aritmetik. Räkning @sv

Sanakirjat. Hakuteokset
type: Class
type: Concept
subclass of: SOVELLETUT TIETEET
broader: SOVELLETUT TIETEET
in scheme: URN:NBN:fi:au:hklj:
notation: 603
preferred label: Dictionaries. Reference books @en
preferred label: Ordböcker. Uppslagsböcker @sv
scope note: Sovellettuja tieteitä koskevat yleiset sanakirjat ja hakuteokset Tässä esim. sanakirjat, jotka koskevat sekä tekniikkaa että kauppaa Eri sovellettuja tieteitä koskevat sanakirjat ja hakuteokset alan mukaisessa luokassa
scope note: Allmänna ordböcker och uppslagsböcker som hänför sig till tillämpad vetenskap Hit t.ex. ordböcker som rör både teknik och handel Ordböcker och uppslagsböcker som rör olika tillämpade vetenskaper klassificeras enligt område @sv

Esseet
type: Class
type: Concept
subclass of: SOVELLETUT TIETEET
broader: SOVELLETUT TIETEET
in scheme: URN:NBN:fi:au:hklj:
notation: 604
preferred label: Essays @en
preferred label: Essäer @sv
related: Kokoomateokset
scope note: Sovellettuja tieteitä koskevat yleiset tai sekasisältöiset essee-, puhe- ja kirjoituskokoelmat Eri sovellettuja tieteitä koskevat essee-, puhe ja kirjoituskokoelmat alan mukaisessa luokassa
scope note: Essäsamlingar samt samlingar av tal och skrifter med allmänt eller blandat innehåll som handlar om tillämpad vetenskap Essäsamlingar samt samlingar med tal och skrifter som rör olika tillämpade vetenskaper klassificeras enligt område @sv

Yhdistykset. Laitokset. Kokoukset
type: Class
type: Concept
subclass of: SOVELLETUT TIETEET
broader: SOVELLETUT TIETEET
in scheme: URN:NBN:fi:au:hklj:
notation: 606
preferred label: Associations. Institutions. Meetings @en
preferred label: Organisationer. Institutioner. Möten @sv
scope note: Sovellettuja tieteitä koskevat yleiset yhdistykset, laitokset ja kokoukset Eri sovellettuja tieteitä koskevat yhdistykset, laitokset ja kokoukset alan mukaisessa luokassa
scope note: Allmänna organisationer, institutioner och möten som rör tillämpad vetenskap Allmänna organisationer, institutioner och möten som rör olika tillämpade vetenskaper klassificeras enligt område @sv

Opinnot
type: Class
type: Concept
subclass of: SOVELLETUT TIETEET
broader: SOVELLETUT TIETEET
in scheme: URN:NBN:fi:au:hklj:
notation: 607
preferred label: Studies. Educational institutions @en
preferred label: Studier @sv
related: Sovellettujen tieteiden opetusoppi
scope note: Sovellettuja tieteitä koskevat opinnot yleensä Eri sovellettuja tieteitä koskevat opinnot alan mukaisessa luokassa
scope note: Studier i tillämpad vetenskap i allmänhet Studier i olika tillämpade vetenskaper klassificeras enligt område @sv

Duot näppäinsoittimille
type: Class
type: Concept
subclass of: URN:NBN:fi:au:hklj:785.11
broader: URN:NBN:fi:au:hklj:785.11
in scheme: URN:NBN:fi:au:hklj:
notation: 785.112
preferred label: Duets for plucked-string instruments @en
preferred label: Duo för knäppinstrument @sv
related: URN:NBN:fi:au:hklj:789

Duot jousisoittimille
type: Class
type: Concept
subclass of: URN:NBN:fi:au:hklj:785.11
alternative label: Duets for bowed-string instruments @en
alternative label: Jousisoittimet, duot jousisoittimille (785.113)
alternative label: Stråkinstrument, duor för stråkinstrument (785.113) @sv
broader: URN:NBN:fi:au:hklj:785.11
in scheme: URN:NBN:fi:au:hklj:
notation: 785.113
preferred label: Duo för stråkinstrument @sv
related: URN:NBN:fi:au:hklj:789

Duot puhallinsoittimille
type: Class
type: Concept
subclass of: URN:NBN:fi:au:hklj:785.11
broader: URN:NBN:fi:au:hklj:785.11
in scheme: URN:NBN:fi:au:hklj:
notation: 785.114
preferred label: Duets for wind instruments @en
preferred label: Duo för blåsinstrument @sv
related: URN:NBN:fi:au:hklj:789

Pianotriot
type: Class
type: Concept
subclass of: Triot
alternative label: Pianotriot (785.121)
alternative label: Pianotrior (785.121) @sv
broader: Triot
in scheme: URN:NBN:fi:au:hklj:
notation: 785.121
preferred label: Piano trios @en
preferred label: Pianotrio @sv
related: URN:NBN:fi:au:hklj:789

Näppäintriot
type: Class
type: Concept
subclass of: Triot
broader: Triot
in scheme: URN:NBN:fi:au:hklj:
notation: 785.122
preferred label: Trios for plucked-string instruments @en
preferred label: Trio för knäppinstrument @sv
related: URN:NBN:fi:au:hklj:789

Jousitriot
type: Class
type: Concept
subclass of: Triot
alternative label: Jousisoittimet, jousitriot (785.123)
alternative label: Jousitriot (785.123)
alternative label: Stråkinstrument, stråktrior (785.123) @sv
alternative label: Stråktrior (785.123) @sv
broader: Triot
in scheme: URN:NBN:fi:au:hklj:
notation: 785.123
preferred label: Trios for bowed-string instruments @en
preferred label: Stråktrio @sv
related: URN:NBN:fi:au:hklj:789

Puhallintriot
type: Class
type: Concept
subclass of: Triot
broader: Triot
in scheme: URN:NBN:fi:au:hklj:
notation: 785.124
preferred label: Trios for wind instruments @en
preferred label: Blåstrio @sv
related: URN:NBN:fi:au:hklj:789

Pianokvartetit
type: Class
type: Concept
subclass of: Kvartetit
alternative label: Pianokvartetit (785.131)
alternative label: Pianokvartetot (785.131)
alternative label: Pianokvartetter, ensembler (785.131) @sv
alternative label: Pianokvartetter, komposotioner (785.131) @sv
broader: Kvartetit
in scheme: URN:NBN:fi:au:hklj:
notation: 785.131
preferred label: Piano quartets @en
preferred label: Pianokvartetter @sv
related: URN:NBN:fi:au:hklj:789

Näppäinkvartetit
type: Class
type: Concept
subclass of: Kvartetit
broader: Kvartetit
in scheme: URN:NBN:fi:au:hklj:
notation: 785.132
preferred label: Quartets for plucked-string instruments @en
preferred label: Kvartetter för knäppinstrument @sv
related: URN:NBN:fi:au:hklj:789

Jousikvartetit
type: Class
type: Concept
subclass of: Kvartetit
alternative label: Jousikvartetit (785.133)
alternative label: Jousikvartetot (785.133)
alternative label: Jousisoittimet, jousikvartetit (785.133)
alternative label: Stråkinstrument, stråkkvartetter, ensembler (785.133) @sv
alternative label: Stråkkvartetter, ensembler (785.133) @sv
alternative label: Stråkkvartetter, kompositioner (785.133) @sv
broader: Kvartetit
in scheme: URN:NBN:fi:au:hklj:
notation: 785.133
preferred label: Quartets for bowed-string instruments @en
preferred label: Stråkkvartetter @sv
related: URN:NBN:fi:au:hklj:789

Puhallinkvartetit
type: Class
type: Concept
subclass of: Kvartetit
broader: Kvartetit
in scheme: URN:NBN:fi:au:hklj:
notation: 785.134
preferred label: Quartets for wind instruments @en
preferred label: Blåskvartetter @sv
related: URN:NBN:fi:au:hklj:789

Pianokvintetit
type: Class
type: Concept
subclass of: Kvintetit
alternative label: Pianokvintetit (785.141)
alternative label: Pianokvintetot (785.141)
alternative label: Pianokvintetter, ensembler (785.141) @sv
alternative label: Pianokvintetter, kompositioner (785.141) @sv
broader: Kvintetit
in scheme: URN:NBN:fi:au:hklj:
notation: 785.141
preferred label: Piano quintets @en
preferred label: Pianokvintetter @sv
related: URN:NBN:fi:au:hklj:789

Näppäinkvintetit
type: Class
type: Concept
subclass of: Kvintetit
broader: Kvintetit
in scheme: URN:NBN:fi:au:hklj:
notation: 785.142
preferred label: Quintets for plucked-string instruments @en
preferred label: Kvintetter för knäppinstrument @sv
related: URN:NBN:fi:au:hklj:789

Jousikvintetit
type: Class
type: Concept
subclass of: Kvintetit
alternative label: Jousikvintetit (785.143)
alternative label: Jousikvintetot (785.143)
alternative label: Jousisoittimet, jousikvintetit (785.143)
alternative label: Stråkinstrument, stråkkvintetter, ensembler (785.143) @sv
alternative label: Stråkkvintetter, ensembler (785.143) @sv
alternative label: Stråkkvintetter, kompositioner (785.143) @sv
broader: Kvintetit
in scheme: URN:NBN:fi:au:hklj:
notation: 785.143
preferred label: Quintets for bowed-string instruments @en
preferred label: Stråkkvintetter @sv
related: URN:NBN:fi:au:hklj:789

Puhallinkvintetit
type: Class
type: Concept
subclass of: Kvintetit
broader: Kvintetit
in scheme: URN:NBN:fi:au:hklj:
notation: 785.144
preferred label: Quintets for wind instruments @en
preferred label: Blåskvintetter @sv
related: URN:NBN:fi:au:hklj:789

Muut orkesterit (yleensä enemmän kuin 25 soittajaa)
type: Class
type: Concept
subclass of: URN:NBN:fi:au:hklj:785
alternative label: Orkesterimusiikki, sinfoniaorkesterit (785.4 ... 785.6 +)
alternative label: Orkesterit, sinfoniaorkesterit (785.4 ... 785.6 +)
alternative label: Orkestermusik, symfoniorkestrar (785.4 ... 785.6 +) @sv
alternative label: Orkestrar, symfoniorkestrar (785.4 ... 785.6 +) @sv
broader: URN:NBN:fi:au:hklj:785
in scheme: URN:NBN:fi:au:hklj:
notation: 785.5
preferred label: Other orchestras (members generally more than 25) @en
preferred label: Andra orkestrar (i allmänhet fler än 25 medlemmar) @sv
related: URN:NBN:fi:au:hklj:789

Painonnosto
type: Class
type: Concept
subclass of: Voimailu. Itsepuolustus
alternative label: Painonnosto (793.1)
alternative label: Voimanosto (793.1)
alternative label: Styrkelyft (793.1) @sv
alternative label: Tyngdlyftning (793.1) @sv
broader: Voimailu. Itsepuolustus
in scheme: URN:NBN:fi:au:hklj:
notation: 793.1
preferred label: Weight lifting @en
preferred label: Tyngdlyftning @sv
related: Muut urheilu- ja liikuntamuodot
scope note: Tässä myös voimanosto Painonnostokilpailut, -säännöt, -valmennus ja -välineet Painonnostoseurat ja -järjestöt
scope note: Hit också styrkelyft Tävlingar i tyngdlyftning, regler, träning och redskap Klubbar och förbund för tyngdlyftning @sv

Saamenkielisen kirjallisuuden historia ja tutkimus
type: Class
type: Concept
subclass of: SUOMALAIS-UGRILAISTEN KIELTEN KIRJALLISUUDEN HISTORIA JA TUTKIMUS
alternative label: Koltan kieli, kirjallisuuden historia (817)
alternative label: Lapin kieli, kirjallisuuden historia (817)
alternative label: Saamen kieli, kirjallisuuden historia (817)
alternative label: Lapska, litteraturhistoria (817) @sv
alternative label: Samiska, litteraturhistoria (817) @sv
alternative label: Skoltsamiska, litteraturhistoria (817) @sv
broader: SUOMALAIS-UGRILAISTEN KIELTEN KIRJALLISUUDEN HISTORIA JA TUTKIMUS
in scheme: URN:NBN:fi:au:hklj:
notation: 817
preferred label: Sami literature: history and research @en
preferred label: Samisk litteraturhistoria och forskning i samisk litteratur @sv
related: URN:NBN:fi:au:hklj:1.98

Vironkielisen kirjallisuuden historia ja tutkimus
type: Class
type: Concept
subclass of: SUOMALAIS-UGRILAISTEN KIELTEN KIRJALLISUUDEN HISTORIA JA TUTKIMUS
alternative label: Kalevipoeg, folkloristiikka (818)
alternative label: Viron kieli, kirjallisuudenhistoria (818)
alternative label: Estniska, litteraturhistoria (818) @sv
alternative label: Kalevipoeg, folkloristik (818) @sv
broader: SUOMALAIS-UGRILAISTEN KIELTEN KIRJALLISUUDEN HISTORIA JA TUTKIMUS
in scheme: URN:NBN:fi:au:hklj:
notation: 818
preferred label: Estonian literature: history and research @en
preferred label: Estnisk litteraturhistoria och forskning i estnisk litteratur @sv
related: URN:NBN:fi:au:hklj:1.8

Unkarinkielisen kirjallisuuden historia ja tutkimus
type: Class
type: Concept
subclass of: SUOMALAIS-UGRILAISTEN KIELTEN KIRJALLISUUDEN HISTORIA JA TUTKIMUS
alternative label: Ugrilaiset kielet, kirjallisuudenhistoria, unkari (819)
alternative label: Unkarin kieli, kirjallisuuden historia (819)
alternative label: Ugriska språk, litteraturhistoria, ungerska (819) @sv
alternative label: Ungerska, litteraturhistoria (819) @sv
broader: SUOMALAIS-UGRILAISTEN KIELTEN KIRJALLISUUDEN HISTORIA JA TUTKIMUS
in scheme: URN:NBN:fi:au:hklj:
notation: 819
preferred label: Hungarian literature: history and research @en
preferred label: Ungersk litteraturhistoria och forskning i ungersk litteratur @sv
related: URN:NBN:fi:au:hklj:1.94

Portugalinkielisen kirjallisuuden historia ja tutkimus
type: Class
type: Concept
subclass of: ROMAANISTEN, SLAAVILAISTEN JA BALTTILAISTEN KIELTEN KIRJALLISUUDEN HISTORIA JA TUTKIMUS
alternative label: Amerikka, portugalinkielisen kirjallisuuden historia (834)
alternative label: Etelä-Amerikka, port. kirjallisuuden historia (834)
alternative label: Portugalin kieli, kirjallisuuden historia (834)
alternative label: Amerika, portugisisk litteraturhistoria (834) @sv
alternative label: Portugisiska, litteraturhistoria (834) @sv
alternative label: Sydamerika, portugisisk litteraturhistoria (834) @sv
broader: ROMAANISTEN, SLAAVILAISTEN JA BALTTILAISTEN KIELTEN KIRJALLISUUDEN HISTORIA JA TUTKIMUS
in scheme: URN:NBN:fi:au:hklj:
notation: 834
preferred label: Portuguese literature: history and research @en
preferred label: Portugisisk litteraturhistoria och forskning i portugisisk litteratur @sv
related: URN:NBN:fi:au:hklj:7.8
scope note: Tässä myös Amerikan portugalinkielisen kirjallisuuden historia ja tutkimus
scope note: Hit också litteraturhistoria och forskning som rör portugisisk litteratur i Amerika @sv

Kelttiläisten kielten kirjallisuuden historia ja tutkimus
type: Class
type: Concept
subclass of: MUIDEN KIELTEN KIRJALLISUUDEN HISTORIA JA TUTKIMUS
alternative label: Bretonin kieli, kirjallisuudenhistoria (841)
alternative label: Gaelin kieli, kirjallisuuden historia (841)
alternative label: Iirin kieli, kirjallisuuden historia (841)
alternative label: Keltit, kirjallisuuden historia (841)
alternative label: Kelttiläiset kielet, kirjallisuuden historia (841)
alternative label: Kymrin kieli, kirjallisuuden historia (841)
alternative label: Manxin kieli, kirjallisuuden historia (841)
alternative label: Walesin kieli, kirjallisuuden historia (841)
alternative label: Bretonska, litteraturhistoria (841) @sv
alternative label: Iriska, litteraturhistoria (841) @sv
alternative label: Kelter, litteraturhistoria (841) @sv
alternative label: Keltiska språk, litteraturhistoria (841) @sv
alternative label: Kymriska, litteraturhistoria (841) @sv
alternative label: Manx, litteraturhistoria (841) @sv
alternative label: Skotsk Gaeliska, litteraturhistoria (841) @sv
alternative label: Walesiska, litteraturhistoria (841) @sv
broader: MUIDEN KIELTEN KIRJALLISUUDEN HISTORIA JA TUTKIMUS
in scheme: URN:NBN:fi:au:hklj:
notation: 841
preferred label: Celtic literature: history and research @en
preferred label: Keltisk litteraturhistoria och forskning i keltisk litteratur @sv
related: URN:NBN:fi:au:hklj:9.93
scope note: Bretonin, gaelin, iirin, kymrin ja manxin kielten kirjallisuuden historia ja tutkimus
scope note: Litteraturhistoria och litteraturforskning som rör bretonska, gaeliska, iriska, kymriska (walesiska) och manx @sv

Japaninkielisen kirjallisuuden historia ja tutkimus
type: Class
type: Concept
subclass of: MUIDEN KIELTEN KIRJALLISUUDEN HISTORIA JA TUTKIMUS
alternative label: Afroaasialaiset kielet, kirjallisuudenhistoria (845 ... 849)
alternative label: Japanin kieli, kirjallisuuden historia (848)
alternative label: Japanologia, kirjallisuuden tutkimus (848)
alternative label: Afroasiatiska språk, litteraturhistoria (845 ... 849) @sv
alternative label: Japanologi, litteraturforskning (848) @sv
alternative label: Japanska, litteraturhistoria (848) @sv
broader: MUIDEN KIELTEN KIRJALLISUUDEN HISTORIA JA TUTKIMUS
in scheme: URN:NBN:fi:au:hklj:
notation: 848
preferred label: Japanese literature: history and research @en
preferred label: Japansk litteraturhistoria och forskning i japansk litteratur @sv
related: URN:NBN:fi:au:hklj:9.8

Kielenkääntäminen. Tulkkaus
type: Class
type: Concept
subclass of: KIELITIEDE
alternative label: Asioimistulkkaus (850.7)
alternative label: Auktorisoidut kääntäjät, kielenkääntäjän työ (850.7)
alternative label: Automaattinen kielenkääntäminen (850.7)
alternative label: Etätulkkaus (850.7)
alternative label: Kielenkääntäminen (850.7)
alternative label: Kielenkääntäminen, tietokirjallisuuden (850.7)
alternative label: Kielenkääntäminen, tulkkaus (850.7)
alternative label: Kieli-instituutit (850.7)
alternative label: Kieliopistot (850.7)
alternative label: Kirjoitustulkinta (850.7)
alternative label: Kirjoitustulkkaus (850.7)
alternative label: Konsekutiivitulkkaus (850.7)
alternative label: Kotoistus, kääntäminen (850.7)
alternative label: Käännökset, kääntäjän työ (850.7)
alternative label: Käännöstyö (850.7)
alternative label: Käännöstyö, kielenkääntäjän työ (850.7)
alternative label: Käännöstyö, tulkin työ (850.7)
alternative label: Kääntäjänkoulutuslaitokset (850.7)
alternative label: Kääntäminen (850.7)
alternative label: Kääntäminen, kielenkääntäjän työ (850.7)
alternative label: Kääntäminen, tulkin työ (850.7)
alternative label: Lokalisointi, kääntäminen (850.7)
alternative label: Oikeustulkkaus (850.7)
alternative label: Peräkkäistulkkaus (850.7)
alternative label: Simultaanitulkkaus (850.7)
alternative label: Tekstitulkkaus (850.7)
alternative label: Tietokoneavusteinen kääntäminen, kääntäminen, tulkkaus (850.7)
alternative label: Tulkit, tulkin työ (850.7)
alternative label: Tulkkaus (850.7)
alternative label: Tulkkipalvelut (850.7)
alternative label: Auktoriserade translatorer, translatorns arbete (850.7) @sv
alternative label: Automatisk översättning (850.7) @sv
alternative label: Datorstödd översättning, översättning, tolkning (850.7) @sv
alternative label: Distanstolkning, språk (850.7) @sv
alternative label: Institutioner för översättarutbildning (850.7) @sv
alternative label: Konsekutiv tolkning (850.7) @sv
alternative label: Kontakttolkning (850.7) @sv
alternative label: Lokalisering, översättning (850.7) @sv
alternative label: Rättstolkning (850.7) @sv
alternative label: Simultantolkning (850.7) @sv
alternative label: Skrivtolkning, språk (850.7) @sv
alternative label: Språkinstitut (850.7) @sv
alternative label: Språkskolor (850.7) @sv
alternative label: Tolkar, tolkens arbete (850.7) @sv
alternative label: Tolkning, språk (850.7) @sv
alternative label: Tolkservice (850.7) @sv
alternative label: Translation (850.7) @sv
alternative label: Translation, facklitteratur (850.7) @sv
alternative label: Translation, tolkning (850.7) @sv
alternative label: Översättning (850.7) @sv
alternative label: Översättning, tolkens arbete (850.7) @sv
alternative label: Översättning, översättarens arbete (850.7) @sv
alternative label: Översättningar, översättarens arbete (850.7) @sv
alternative label: Översättningsarbete (850.7) @sv
alternative label: Översättningsarbete, tolkens arbete (850.7) @sv
alternative label: Översättningsarbete, translatorns arbete (850.7) @sv
broader: KIELITIEDE
in scheme: URN:NBN:fi:au:hklj:
notation: 850.7
preferred label: Translating. Interpreting @en
preferred label: Översättning. Tolkning @sv
related: Kirjailijan työ. Kääntäjän työ
scope note: Kielenkääntäjän ja tulkin työ. Simultaanitulkkaus Tietokirjallisuuden kääntäminen. Automaattinen kielenkääntäminen Jos teos koskee sekä kauno- että tietokirjallisuuden kääntämistä, on etusija luokalla 850.7
scope note: Översättarens och tolkens arbete. Simultantolkning Översättning av facklitteratur. Maskinöversättning och datorstödd översättning Om verket handlar om översättning av både skönlitteratur och facklitteratur ges företräde åt klass 850.7 @sv

Romanian kieli
type: Class
type: Concept
subclass of: URN:NBN:fi:au:hklj:860
alternative label: Indoeurooppalaiset kielet, eri indoeurooppalaiset kielet (861 ... 879 +)
alternative label: Romaaniset kielet, eri kielet (864 ... 869)
alternative label: Romanian kieli (869)
alternative label: Romanian kieli, kielitiede (869)
alternative label: Indoeuropeiska språk, olika indoeuropeiska språk (861 ... 879 +) @sv
alternative label: Romanska språk, olika språk (864 ... 869) @sv
alternative label: Rumänska (869) @sv
alternative label: Rumänska, lingvistik (869) @sv
broader: URN:NBN:fi:au:hklj:860
in scheme: URN:NBN:fi:au:hklj:
notation: 869
preferred label: Rumanian @en
preferred label: Rumänska @sv
scope note: Tässä myös moldovan kieli
scope note: Hit också moldaviska @sv

Norjan kieli
type: Class
type: Concept
subclass of: Pohjoismaiset kielet
alternative label: Norjan kieli (871.2)
alternative label: Norjan kieli, kielitiede (871.2)
alternative label: Norska (871.2) @sv
alternative label: Norska, lingvistik (871.2) @sv
broader: Pohjoismaiset kielet
in scheme: URN:NBN:fi:au:hklj:
notation: 871.2
preferred label: Norwegian @en
preferred label: Norska @sv
related: URN:NBN:fi:au:hklj:860

Islannin kieli
type: Class
type: Concept
subclass of: Pohjoismaiset kielet
alternative label: Islannin kieli (871.3)
alternative label: Islannin kieli, kielitiede (871.3)
alternative label: Isländska (871.3) @sv
alternative label: Isländska, lingvistik (871.3) @sv
broader: Pohjoismaiset kielet
in scheme: URN:NBN:fi:au:hklj:
notation: 871.3
preferred label: Icelandic @en
preferred label: Isländska @sv
related: URN:NBN:fi:au:hklj:860

Jiddin kieli
type: Class
type: Concept
subclass of: Saksan kieli
alternative label: Jiddisin kieli (874.7)
alternative label: Jiddisin kieli, kielitiede (874.7)
alternative label: Jiddisch (874.7) @sv
alternative label: Jiddisch, lingvistik (874.7) @sv
broader: Saksan kieli
in scheme: URN:NBN:fi:au:hklj:
notation: 874.7
preferred label: Yiddish @en
preferred label: Jiddisch @sv
related: URN:NBN:fi:au:hklj:860

Hollannin kieli
type: Class
type: Concept
subclass of: GERMAANISET, KELTTILÄISET, BALTTILAISET JA SLAAVILAISET KIELET
alternative label: Afrikaansin kieli (876)
alternative label: Afrikaansin kieli, kielitiede (876)
alternative label: Flaamin kieli (876)
alternative label: Flaamin kieli, kielitiede (876)
alternative label: Hollannin kieli (876)
alternative label: Hollannin kieli, kielitiede (876)
alternative label: Länsigermaaniset kielet (874 ... 876)
alternative label: Afrikaans (876) @sv
alternative label: Afrikaans, lingvistik (876) @sv
alternative label: Flamländska (876) @sv
alternative label: Flamländska, lingvistik (876) @sv
alternative label: Holländska (876) @sv
alternative label: Holländska, lingvistik (876) @sv
alternative label: Västgermanska språk (874 ... 876) @sv
broader: GERMAANISET, KELTTILÄISET, BALTTILAISET JA SLAAVILAISET KIELET
in scheme: URN:NBN:fi:au:hklj:
notation: 876
preferred label: Dutch @en
preferred label: Nederländska @sv
related: URN:NBN:fi:au:hklj:860
scope note: Tässä myös flaamin ja afrikaansin kieli
scope note: Hit också flamiska och afrikaans @sv

Kelttiläiset kielet
type: Class
type: Concept
subclass of: GERMAANISET, KELTTILÄISET, BALTTILAISET JA SLAAVILAISET KIELET
alternative label: Bretonin kieli (877)
alternative label: Bretonin kieli, kielitiede (877)
alternative label: Gaelin kieli (877)
alternative label: Gaelin kieli, kielitiede (877)
alternative label: Iirin kieli (877)
alternative label: Iirin kieli, kielitiede (877)
alternative label: Keltit, kielet (877)
alternative label: Kelttiläiset kielet (877)
alternative label: Kelttiläiset kielet, kielitiede (877)
alternative label: Kymrin kieli (877)
alternative label: Kymrin kieli, kielitiede (877)
alternative label: Manxin kieli (877)
alternative label: Manxin kieli, kielitiede (877)
alternative label: Walesin kieli (877)
alternative label: Walesin kieli, kielitiede (877)
alternative label: Bretonska (877) @sv
alternative label: Bretonska, lingvistik (877) @sv
alternative label: Iriska (877) @sv
alternative label: Iriska, lingvistik (877) @sv
alternative label: Kelter, språk (877) @sv
alternative label: Keltiska språk (877) @sv
alternative label: Keltiska språk, lingvistik (877) @sv
alternative label: Kymriska (877) @sv
alternative label: Kymriska, lingvistik (877) @sv
alternative label: Manx (877) @sv
alternative label: Manx, lingvistik (877) @sv
alternative label: Skotsk Gaeliska (877) @sv
alternative label: Skotsk Gaeliska, lingvistik (877) @sv
alternative label: Walesiska (877) @sv
alternative label: Walesiska, lingvistik (877) @sv
broader: GERMAANISET, KELTTILÄISET, BALTTILAISET JA SLAAVILAISET KIELET
in scheme: URN:NBN:fi:au:hklj:
notation: 877
preferred label: Celtic languages @en
preferred label: Keltiska språk @sv
related: URN:NBN:fi:au:hklj:860
scope note: Bretoniin, gaelin, iirin, kymrin ja manxin kieli
scope note: Bretonska, gaeliska, iriska, kymriska (walesiska) och manx @sv

Puolan kieli
type: Class
type: Concept
subclass of: Slaavilaiset kielet
alternative label: Puolan kieli (879.2)
alternative label: Puolan kieli, kielitiede (879.2)
alternative label: Polska (879.2) @sv
alternative label: Polska, lingvistik (879.2) @sv
broader: Slaavilaiset kielet
in scheme: URN:NBN:fi:au:hklj:
notation: 879.2
preferred label: Polish @en
preferred label: Polska @sv
related: URN:NBN:fi:au:hklj:860

Bulgarian kieli
type: Class
type: Concept
subclass of: Slaavilaiset kielet
alternative label: Bulgarian kieli (879.4)
alternative label: Bulgarian kieli, kielitiede (879.4)
alternative label: Bulgariska (879.4) @sv
alternative label: Bulgariska, lingvistik (879.4) @sv
broader: Slaavilaiset kielet
in scheme: URN:NBN:fi:au:hklj:
notation: 879.4
preferred label: Bulgarian @en
preferred label: Bulgariska @sv
related: URN:NBN:fi:au:hklj:860

Viron kieli
type: Class
type: Concept
subclass of: URALILAISET KIELET. ALTAILAISET KIELET
alternative label: Itämerensuomalaiset kielet, viron kieli (885)
alternative label: Suomalais-ugrilaiset kielet (881 ... 887 +)
alternative label: Suomalais-ugrilaiset kielet, kielitiede (881 ... 887 +)
alternative label: Viron kieli (885)
alternative label: Viron kieli, kielitiede (885)
alternative label: Estniska (885) @sv
alternative label: Estniska, lingvistik (885) @sv
alternative label: Finsk-ugriska språk (881 ... 887 +) @sv
alternative label: Finsk-ugriska språk, lingvistik (881 ... 887 +) @sv
alternative label: Östersjöfinska språk, estniska (885) @sv
broader: URALILAISET KIELET. ALTAILAISET KIELET
in scheme: URN:NBN:fi:au:hklj:
notation: 885
preferred label: Estonian @en
preferred label: Estniska @sv
related: Itämerensuomalaiset kielet

Mongolikielet. Tunguusikielet. Korean kieli
type: Class
type: Concept
subclass of: URALILAISET KIELET. ALTAILAISET KIELET
alternative label: Altailaiset kielet (888 ... 889)
alternative label: Burjatin kieli (888)
alternative label: Dahurin kieli (888)
alternative label: Kalmukin kieli (888)
alternative label: Korean kieli (888)
alternative label: Korean kieli, kielitiede (888)
alternative label: Mantsun kieli (888)
alternative label: Mongolikielet (888)
alternative label: Mongolin kieli (888)
alternative label: Mongolin kieli, kielitiede (888)
alternative label: Oirattin kieli (888)
alternative label: Tunguusikielet (888)
alternative label: Altaiska språk (888 ... 889) @sv
alternative label: Burjatiska (888) @sv
alternative label: Dahur, språk (888) @sv
alternative label: Kalmuckiska (888) @sv
alternative label: Koreanska (888) @sv
alternative label: Koreanska, lingvistik (888) @sv
alternative label: Manchu, språket (888) @sv
alternative label: Mongoliska (888) @sv
alternative label: Mongoliska språk (888) @sv
alternative label: Mongoliska, lingvistik (888) @sv
alternative label: Oirat (888) @sv
alternative label: Tungusiska språk (888) @sv
broader: URALILAISET KIELET. ALTAILAISET KIELET
in scheme: URN:NBN:fi:au:hklj:
notation: 888
preferred label: Mongolian languages. Tungusic languages. Korean @en
preferred label: Mongoliska språk. Tungusiska språk. Koreanska @sv
scope note: Burjaatin, dahurin, kalmukin, mongolin ja oiraattin kieli Mantsun ja tunguusin kieli
scope note: Burjatiska, daguriska, kalmuckiska, mongoliska och oiratiska Evenki (tungusiska) och manchu @sv

Turkkilaiset kielet. Turkin kieli
type: Class
type: Concept
subclass of: URALILAISET KIELET. ALTAILAISET KIELET
alternative label: Altailaiset kielet (888 ... 889)
alternative label: Azerin kieli (889)
alternative label: Azerin kieli, kielitíede (889)
alternative label: Baskiirin kieli (889)
alternative label: Gagauzin kieli (889)
alternative label: Jakuutin kieli (889)
alternative label: Kasakin kieli (889)
alternative label: Kazakin kieli (889)
alternative label: Kirgiisin kieli (889)
alternative label: Tataarin kieli (889)
alternative label: Tsuvassin kieli (889)
alternative label: Turkin kieli (889)
alternative label: Turkin kieli, kielitiede (889)
alternative label: Turkkilaiset kielet (889)
alternative label: Turkmeenin kieli (889)
alternative label: Uiguurin kieli (889)
alternative label: Altaiska språk (888 ... 889) @sv
alternative label: Azerbajdzjanska (889) @sv
alternative label: Azerbajdzjanska, lingvistik (889) @sv
alternative label: Basjkiriska (889) @sv
alternative label: Gagauziska (889) @sv
alternative label: Jakutiska (889) @sv
alternative label: Kasakiska (889) @sv
alternative label: Kazakiska (889) @sv
alternative label: Kirgisiska (889) @sv
alternative label: Tatariska (889) @sv
alternative label: Tjuvasjiska (889) @sv
alternative label: Turkiska (889) @sv
alternative label: Turkiska språk (889) @sv
alternative label: Turkiska, lingvistik (889) @sv
alternative label: Turkmeniska (889) @sv
alternative label: Uiguriska (889) @sv
broader: URALILAISET KIELET. ALTAILAISET KIELET
in scheme: URN:NBN:fi:au:hklj:
notation: 889
preferred label: Turkish languages. Turkish @en
preferred label: Turkiska språk. Turkiska @sv
scope note: Azerin, baskiirin, gagauszin, jakuutin, kazakin, kirgiisin, tataarin, tsuvassin, turkmeenin, uiguurin ja uzbekin kieli
scope note: Azerbajdjanska, basjkiriska, gagauziska, jakutiska, kazakiska, kirgisiska, tatariska, tuvinska, turkmenska, uiguriska och uzbekiska @sv

Japanin kieli
type: Class
type: Concept
subclass of: MUUT KIELET
alternative label: Hiragana, japanin kieli (892)
alternative label: Japanin kieli (892)
alternative label: Japanin kieli, kielitiede (892)
alternative label: Japanologia, kielen tutkimus (892)
alternative label: Katakana, japanin kieli (892)
alternative label: Hiragana, japanska (892) @sv
alternative label: Japanologi, språkforskning (892) @sv
alternative label: Japanska (892) @sv
alternative label: Japanska, lingvistik (892) @sv
alternative label: Katakana, japanska (892) @sv
broader: MUUT KIELET
in scheme: URN:NBN:fi:au:hklj:
notation: 892
preferred label: Japanese @en
preferred label: Japanska @sv
related: Kirjoituksen historia. Paleografia. Epigrafia

Viittomakieli
type: Class
type: Concept
subclass of: Muut ei-indoeurooppalaiset kielet
alternative label: AAC-menetelmät, viittomakieli (899.9)
alternative label: Albanialainen viittomakieli (899.9)
alternative label: Brittiläinen viittomakieli (899.9)
alternative label: Kosovolainen viittomakieli (899.9)
alternative label: Puhetta tukeva ja korvaava kommunikaatio, viittomakieli (899.9)
alternative label: Puhetta tukeva ja korvaava kommunikointi, viittomakieli (899.9)
alternative label: Suomenruotsalainen viittomakieli (899.9)
alternative label: Taktiiliviittominen, viittomakieli (899.9)
alternative label: Tukiviittomat (899.9)
alternative label: Viitottu puhe, puhetta tukeva ja korvaava kommunikaatio (899.9)
alternative label: Viittomakieli (899.9)
alternative label: Viittomat (899.9)
alternative label: AKK-metoden, teckenspråk (899.9) @sv
alternative label: Albanskt teckenspråk (899.9) @sv
alternative label: Alternativ och kompletterande kommunikation, teckenspråk (899.9) @sv
alternative label: Brittiskt teckenspråk (899.9) @sv
alternative label: Finlandssvenskt teckenspråk (899.9) @sv
alternative label: Kosovanskt teckenspråk (899.9) @sv
alternative label: Stödtecken (899.9) @sv
alternative label: Taktila tecken, teckenspråk (899.9) @sv
alternative label: Tecken, teckenspråk (899.9) @sv
alternative label: Teckenspråk (899.9) @sv
alternative label: Tecknat tal, alternativ och kompletterande kommunikation (899.9) @sv
broader: Muut ei-indoeurooppalaiset kielet
in scheme: URN:NBN:fi:au:hklj:
notation: 899.9
preferred label: Sign language @en
preferred label: Teckenspråk @sv
related: Kuulovammaiset

URN:NBN:fi:au:hklj:9.4
alternative label: Turkin kieli, kaunokirjallisuus (9.4)
alternative label: Turkiska, skönlitteratur (9.4) @sv
related: Turkkilaisten kielten kirjallisuuden historia ja tutkimus
related: URN:NBN:fi:au:hklj:9
related: URN:NBN:fi:au:hklj:9.97

URN:NBN:fi:au:hklj:9.5
alternative label: Seemiläiset kielet, kaunokirjallisuus (9.5 +)
alternative label: Tigren kieli, kaunokirjallisuus (9.5)
alternative label: Semitiska språk, skönlitteratur (9.5 +) @sv
alternative label: Tigre, språk, skönlitteratur (9.5) @sv
related: Seemiläisten kielten kirjallisuuden historia ja tutkimus
related: Hepreankielisen kirjallisuuden historia ja tutkimus
related: Arabiankielisen kirjallisuuden historia ja tutkimus

URN:NBN:fi:au:hklj:9.6
alternative label: Indoarjalaiset kielet, kaunokirjallisuus (9.6 +)
alternative label: Intialaiset kielet, kaunokirjallisuus (9.6 +)
alternative label: Iranilaiset kielet, kaunokirjallisuus (9.6 +)
alternative label: Sanskriitin kieli, kaunokirjallisuus (9.6)
alternative label: Sindhin kieli, kaunokirjallisuus (9.6)
alternative label: Indariska språk, skönlitteratur (9.6 +) @sv
alternative label: Indiska språk, skönlitteratur (9.6 +) @sv
alternative label: Iranska språk, skönlitteratur (9.6 +) @sv
alternative label: Sanskrit, skönlitteratur (9.6) @sv
alternative label: Sindhi, skönlitteratur (9.6) @sv
related: Indoiraanisten kielten kirjallisuuden historia ja tutkimus
related: Iranilaisten kielten kirjallisuuden historia ja tutkimus
related: Intialaisten kielten kirjallisuuden historia ja tutkimus

Ruotsin historia 1810-1913
type: Class
type: Concept
subclass of: Ruotsin historia 1810-
broader: Ruotsin historia 1810-
in scheme: URN:NBN:fi:au:hklj:
notation: 935.1
preferred label: Sweden’s history 1810–1913 @en
preferred label: Sveriges historia 1810–1913 @sv
related: URN:NBN:fi:au:hklj:989

Ruotsin historia 1914-1938
type: Class
type: Concept
subclass of: Ruotsin historia 1810-
broader: Ruotsin historia 1810-
in scheme: URN:NBN:fi:au:hklj:
notation: 935.2
preferred label: Sweden’s history 1914–1938 @en
preferred label: Sveriges historia 1914–1938 @sv
related: URN:NBN:fi:au:hklj:989

Ruotsin historia 1939-
type: Class
type: Concept
subclass of: Ruotsin historia 1810-
broader: Ruotsin historia 1810-
in scheme: URN:NBN:fi:au:hklj:
notation: 935.3
preferred label: Sweden’s history 1939– @en
preferred label: Sveriges historia 1939– @sv
related: URN:NBN:fi:au:hklj:989

Ranskan esi- ja varhaishistoria vuoteen 986
type: Class
type: Concept
subclass of: RANSKAN HISTORIA
broader: RANSKAN HISTORIA
in scheme: URN:NBN:fi:au:hklj:
notation: 961
preferred label: France’s pre- and ancient history to 986 @en
preferred label: Frankrikes förhistoria och fornhistoria till 986 @sv
scope note: Ranskan arkeologian yleisteokset
scope note: Allmänna verk om Frankrikes arkeologi @sv

Ranskan keskiaika 987-1493
type: Class
type: Concept
subclass of: RANSKAN HISTORIA
broader: RANSKAN HISTORIA
in scheme: URN:NBN:fi:au:hklj:
notation: 962
preferred label: France’s middle ages 987–1493 @en
preferred label: Frankrikes medeltid 987–1493 @sv

Ranskan historia 1589-1788
type: Class
type: Concept
subclass of: RANSKAN HISTORIA
alternative label: Hugenotit, Ranskan historia (963 ... 968)
alternative label: Hugenotter, Frankrikes historia (963 ... 968) @sv
broader: RANSKAN HISTORIA
in scheme: URN:NBN:fi:au:hklj:
notation: 964
preferred label: France’s history 1589–1788 @en
preferred label: Frankrikes historia 1589–1788 @sv
scope note: Itsevaltiuden perustamisesta Ranskan vallankumoukseen
scope note: Från grundandet av enväldet till franska revolutionen @sv

Ranskan historia 1789-1814
type: Class
type: Concept
subclass of: RANSKAN HISTORIA
alternative label: Hugenotit, Ranskan historia (963 ... 968)
alternative label: Ranskan vallankumous 1789 (965)
alternative label: Vallankumoukset, Ranskan (965)
alternative label: Franska revolutionen 1789 (965) @sv
alternative label: Hugenotter, Frankrikes historia (963 ... 968) @sv
alternative label: Revolutioner, Franska (965) @sv
broader: RANSKAN HISTORIA
in scheme: URN:NBN:fi:au:hklj:
notation: 965
preferred label: France’s history 1789–1814 @en
preferred label: Frankrikes historia 1789–1814 @sv
scope note: Ranskan vallankumous. Napoleonin aika
scope note: Franska revolutionen. Napoleontiden @sv

Ranskan historia 1914-1938
type: Class
type: Concept
subclass of: RANSKAN HISTORIA
alternative label: Hugenotit, Ranskan historia (963 ... 968)
alternative label: Hugenotter, Frankrikes historia (963 ... 968) @sv
broader: RANSKAN HISTORIA
in scheme: URN:NBN:fi:au:hklj:
notation: 967
preferred label: France’s history 1914–1938 @en
preferred label: Frankrikes historia 1914–1938 @sv

Ranskan historia 1939-
type: Class
type: Concept
subclass of: RANSKAN HISTORIA
alternative label: Hugenotit, Ranskan historia (963 ... 968)
alternative label: Hugenotter, Frankrikes historia (963 ... 968) @sv
broader: RANSKAN HISTORIA
in scheme: URN:NBN:fi:au:hklj:
notation: 968
preferred label: France’s history 1939– @en
preferred label: Frankrikes historia 1939– @sv

Pikakirjoitus
type: Class
type: Concept
subclass of: Kirjoitus. Kirjoitustaito
alternative label: Pikakirjoitus (001.2)
alternative label: Sanelu (001.2)
alternative label: Diktamen (001.2) @sv
alternative label: Stenografi (001.2) @sv
broader: Kirjoitus. Kirjoitustaito
in scheme: URN:NBN:fi:au:hklj:
notation: 001.2
preferred label: Stenography @en
preferred label: Stenografi @sv
related: Toimistotyö
related: KIELITIEDE
scope note: Pikakirjoitusjärjestelmät ja -oppaat Sanelu. Sanelusta kirjoittaminen
scope note: System och handböcker för stenografi Diktamen. Att skriva efter diktamen @sv

Johdatukset tieteisiin
type: Class
type: Concept
subclass of: KIRJA-ALA
alternative label: Ohjeet (008)
alternative label: Pääsykoetehtävät (008)
alternative label: Toimintaohjeet, ohjeet (008)
alternative label: Ylioppilastehtävät, reaalikoe (008)
alternative label: Anvisningar (008) @sv
alternative label: Förhållningsregler, anvisningar (008) @sv
alternative label: Inträdesprov, provuppgifter (008) @sv
alternative label: Studentuppgifter, realprov (008) @sv
broader: KIRJA-ALA
in scheme: URN:NBN:fi:au:hklj:
notation: 008
preferred label: Introductions to the sciences @en
preferred label: Introduktioner till vetenskaperna @sv
related: YLEISET TIETOSANAKIRJAT
related: YLEISET KOKOOMATEOKSET
scope note: Yleistajuiset, useita tiedonaloja koskevat teokset Jos teos painottuu johonkin tiedonalaan, on etusija ko. alan luokalla
scope note: Populärt skrivna verk som gäller flera kunskapsområden Om ett bestämt område dominerar i verket ges företräde åt klassen för området i fråga @sv

Suomi
type: Class
type: Concept
subclass of: Yleisbibliografiat. Kansallisbibliografiat
alternative label: Kansallisbibliografiat, Suomi (011.1)
alternative label: Nationalbibliografier, Finland (011.1) @sv
broader: Yleisbibliografiat. Kansallisbibliografiat
in scheme: URN:NBN:fi:au:hklj:
notation: 011.1
preferred label: Finland @en
related: Valikoimaluettelot
related: Kirjallisuustiede. Kielitiede

Suomi
type: Class
type: Concept
subclass of: Kustantajien ja kirjakauppojen luettelot
broader: Kustantajien ja kirjakauppojen luettelot
in scheme: URN:NBN:fi:au:hklj:
notation: 013.1
preferred label: Finland @en
related: Yleisbibliografiat. Kansallisbibliografiat
related: Kirjallisuustiede. Kielitiede

URN:NBN:fi:au:hklj:1.1
alternative label: Arkkiveisut, kansanrunous (1.1)
alternative label: Arvoitukset (1.1)
alternative label: Balladit, kansanrunous (1.1)
alternative label: Beowulf, kansanrunous (1.1)
alternative label: Bylinat (1.1)
alternative label: Cidin laulu (1.1)
alternative label: Dainat (1.1)
alternative label: Edda (1.1)
alternative label: Eepokset, kansanrunot (1.1)
alternative label: Eeppiset runot, kansanrunot (1.1)
alternative label: Eläinkertomukset, kansanrunous (1.1)
alternative label: Eläinrunot, kansanrunot (1.1)
alternative label: Eläinsadut, kansanrunous (1.1)
alternative label: Faabelit, kansanrunot (1.1)
alternative label: Folklore, kansanrunous (1.1)
alternative label: Gilgames (1.1)
alternative label: Haltiat, kansanrunot (1.1)
alternative label: Haltijat, kansanrunot (1.1)
alternative label: Historialliset tarinat, kansantarinat (1.1)
alternative label: Ihmesadut, kansanrunous (1.1)
alternative label: Ihmissudet, kansanrunous (1.1)
alternative label: Ilias, kansanrunous (1.1)
alternative label: Itkut (1.1)
alternative label: Jättiläiset, kansanrunous (1.1)
alternative label: Kalevala, kansanrunous (1.1)
alternative label: Kalevipoeg, kansanrunous (1.1)
alternative label: Kansalliseepokset, kansanrunous (1.1)
alternative label: Kansaneepokset, kansanrunous (1.1)
alternative label: Kansankertomukset, kansanrunous (1.1)
alternative label: Kansanperinne, kansanrunous (1.1)
alternative label: Kansanrunot (1.1)
alternative label: Kansanrunous (1.1)
alternative label: Kansansadut, kansanrunous (1.1)
alternative label: Kansantarinat, kansanrunous (1.1)
alternative label: Kanteletar, kansanrunous (1.1)
alternative label: Kaskut, kansanrunous (1.1)
alternative label: Kaupunkilegendat, kansanrunous (1.1)
alternative label: Keijukaiset, kansanrunot (1.1)
alternative label: Keijut, kansanrunot (1.1)
alternative label: Kentaurit, kansanrunous (1.1)
alternative label: Kertomarunot, kansanrunous (1.1)
alternative label: Kertomukset, kansanrunous (1.1)
alternative label: Kompakysymykset, kansanrunous (1.1)
alternative label: Lastenlorut, kansanrunous (1.1)
alternative label: Lastenperinne, kansanrunous (1.1)
alternative label: Legendat, kansanrunous (1.1)
alternative label: Lohikäärmeet, kansarunous (1.1)
alternative label: Loitsut, kansanrunous (1.1)
alternative label: Lorut, kansanrunous (1.1)
alternative label: Mahabharata, kansanrunous (1.1)
alternative label: Memoraatit, kansanrunous (1.1)
alternative label: Muinaisrunot, kansanrunous (1.1)
alternative label: Muistitieto, kansanrunous (1.1)
alternative label: Myytit, kansanrunous (1.1)
alternative label: Nibelungenlied, kansanrunous (1.1)
alternative label: Nykytarinat, kansanrunous (1.1)
alternative label: Odysseia, kansanrunous (1.1)
alternative label: Opetustarinat (1.1)
alternative label: Peikot, kansanrunous (1.1)
alternative label: Perinne, kansanrunous (1.1)
alternative label: Perinteet, kansanrunous (1.1)
alternative label: Pilasadut, kansansadut (1.1)
alternative label: Pyhimystarinat, kansanrunous (1.1)
alternative label: Rolandin laulu, kansanrunous (1.1)
alternative label: Saagat, kansanrunous (1.1)
alternative label: Sadut, kansansadut (1.1)
alternative label: Sananlaskut, kansanrunous (1.1)
alternative label: Sananparret, kansanrunous (1.1)
alternative label: Seireenit, kansanrunous (1.1)
alternative label: Suullinen perinne, kansanrunous (1.1)
alternative label: Syntykertomukset (1.1)
alternative label: Taiat, kansanrunous (1.1)
alternative label: Taikausko, kansanrunous (1.1)
alternative label: Tarinat, kansantarinat (1.1)
alternative label: Troijan sota, kansanrunous (1.1)
alternative label: Tuonela, kansanrunous (1.1)
related: KANSATIEDE. ANTROPOLOGIA
related: Tietokilpailut
related: URN:NBN:fi:au:hklj:807
related: Suomenkielisen kansanrunouden historia ja tutkimus

Oppikirjat
type: Class
type: Concept
subclass of: URN:NBN:fi:au:hklj:210
alternative label: Uskonto, oppikirjat, kristinusko (212)
alternative label: Religion, läroböcker, kristendom (212) @sv
broader: URN:NBN:fi:au:hklj:210
in scheme: URN:NBN:fi:au:hklj:
notation: 212
preferred label: Textbooks @en
preferred label: Läroböcker @sv
related: KIRKKOHISTORIA
related: Suomi
scope note: Kristinuskon tai kristillisen teologian yleiset oppikirjat Kristinuskon tai kristillisen teologian erikoisaloja koskevat oppikirjat alan mukaisessa luokassa
scope note: Allmänna läroböcker inom kristendom eller kristen teologi Läroböcker som handlar om specialområden inom kristendom eller kristen teologi klassificeras enligt område @sv

Sanakirjat. Hakuteokset
type: Class
type: Concept
subclass of: URN:NBN:fi:au:hklj:210
broader: URN:NBN:fi:au:hklj:210
in scheme: URN:NBN:fi:au:hklj:
notation: 213
preferred label: Dictionaries. Reference books @en
preferred label: Ordböcker. Uppslagsböcker @sv
related: URN:NBN:fi:au:hklj:220.03
scope note: Kristinuskoa tai kristillistä teologiaa koskevat yleiset sanakirjat ja hakuteokset Kristinuskon tai kristillisen teologian erikoisaloja koskevat sanakirjat ja hakuteokset alan mukaisessa luokassa
scope note: Allmänna ordböcker och uppslagsböcker i kristendom eller kristen teologi Ordböcker och uppslagsböcker som hänför sig till specialområden inom kristendom eller kristen teologi klassificeras enligt område @sv

Vanhan Testamentin historialliset kirjat
type: Class
type: Concept
subclass of: RAAMATTU. RAAMATUNTUTKIMUS
alternative label: Aikakirjat, Vanha Testamentti (222)
alternative label: Esran kirja (222)
alternative label: Esterin kirja (222)
alternative label: Joosuan kirja (222)
alternative label: Kuningasten kirjat (222)
alternative label: Mooseksen kirjat (222)
alternative label: Nehemian kirja (222)
alternative label: Pentateukki (222)
alternative label: Raamattu, historialliset kirjat (222)
alternative label: Ruutin kirja (222)
alternative label: Samuelin kirjat (222)
alternative label: Tuomarien kirja (222)
alternative label: Vanha Testamentti, historialliset kirjat (222)
alternative label: Vedenpaisumus (222)
alternative label: Bibeln, historiska böckerna (222) @sv
alternative label: Domarboken (222) @sv
alternative label: Esras bok (222) @sv
alternative label: Esters bok (222) @sv
alternative label: Gamla Testamentet, historiska böckerna (222) @sv
alternative label: Josuas bok (222) @sv
alternative label: Konungaböckerna (222) @sv
alternative label: Krönikeböckerna, Gamla (222) @sv
alternative label: Moseböckerna (222) @sv
alternative label: Nehemjas bok (222) @sv
alternative label: Pentateuk (222) @sv
alternative label: Ruts bok (222) @sv
alternative label: Samuels böcker (222) @sv
alternative label: Syndaflod (222) @sv
broader: RAAMATTU. RAAMATUNTUTKIMUS
in scheme: URN:NBN:fi:au:hklj:
notation: 222
preferred label: The Old Testament's historical books @en
preferred label: Gamla testamentets historiska böcker @sv
related: Juutalaisten uskonto ja sen mytologia
scope note: Mooseksen kirjat. Joosuan, Tuomarien, Ruutin ja Samuelin kirjat. Kuninkaiden kirjat. Aikakirjat. Esran, Nehemian ja Esterin kirjat
scope note: Moseböckerna. Josua, Domarboken, Ruth och Samuel. Konungaböckerna. Krönikeböckerna. Esra, Nehemja och Ester @sv

Vanhan Testamentin runolliset kirjat
type: Class
type: Concept
subclass of: RAAMATTU. RAAMATUNTUTKIMUS
alternative label: Jobin kirja (223)
alternative label: Korkea veisu (223)
alternative label: Psalmit, Vanha Testamentti (223)
alternative label: Raamattu, runolliset kirjat (223)
alternative label: Runolliset kirjat, VT (223)
alternative label: Saarnaajan kirjat, Raamattu (223)
alternative label: Sananlaskujen kirja, Raamattu (223)
alternative label: Vanha Testamentti, runolliset kirjat (223)
alternative label: Bibeln, poetiska böckerna (223) @sv
alternative label: Gamla Testamentet, poetiska böckerna (223) @sv
alternative label: Höga visan (223) @sv
alternative label: Jobs bok (223) @sv
alternative label: Ordspråksboken, Bibeln (223) @sv
alternative label: Poetiska böckerna, GT (223) @sv
alternative label: Predikaren, Bibeln (223) @sv
alternative label: Psaltarpsalmer, Gamla Testamentet (223) @sv
broader: RAAMATTU. RAAMATUNTUTKIMUS
in scheme: URN:NBN:fi:au:hklj:
notation: 223
preferred label: The Old Testament's poetical books @en
preferred label: Gamla testamentets poetiska böcker @sv
related: Juutalaisten uskonto ja sen mytologia
scope note: Jobin kirja. Psalmien, Sananlaskujen ja Saarnaajan kirjat. Laulujen laulu eli Korkea veisu
scope note: Job. Psalmerna. Ordspråksboken. Predikaren. Höga visan @sv

Vanhan Testamentin profeetalliset kirjat
type: Class
type: Concept
subclass of: RAAMATTU. RAAMATUNTUTKIMUS
alternative label: Danielin kirja (224)
alternative label: Habakukin kirja (224)
alternative label: Haggain kirja (224)
alternative label: Hesekielin kirja (224)
alternative label: Jeremian kirja (224)
alternative label: Jesajan kirja (224)
alternative label: Joelin kirja (224)
alternative label: Joonan kirja (224)
alternative label: Jumalalliset ilmoitukset, Vanha Testamentti (224)
alternative label: Malakian kirja (224)
alternative label: Miikan kirja (224)
alternative label: Nahumin kirja (224)
alternative label: Obadjan kirja (224)
alternative label: Profeetalliset kirjat (224)
alternative label: Profeetat, Vanha Testamentti (224)
alternative label: Profetiat, Vanha Testamentti (224)
alternative label: Raamattu, profeetalliset kirjat (224)
alternative label: Sakarjan kirja (224)
alternative label: Sefanjan kirja (224)
alternative label: Valitusvirret (224)
alternative label: Vanha Testamentti, profeetalliset kirjat (224)
alternative label: Bibeln, profetiska böckerna (224) @sv
alternative label: Daniels bok (224) @sv
alternative label: Gamla Testamentet, profetiska böckerna (224) @sv
alternative label: Habackuks bok (224) @sv
alternative label: Haggais bok (224) @sv
alternative label: Hesekiels bok (224) @sv
alternative label: Jeremias bok (224) @sv
alternative label: Jesajas bok (224) @sv
alternative label: Joels bok (224) @sv
alternative label: Jonas bok (224) @sv
alternative label: Klagovisorna (224) @sv
alternative label: Malakis bok (224) @sv
alternative label: Mikas bok (224) @sv
alternative label: Nahums bok (224) @sv
alternative label: Obadjas bok (224) @sv
alternative label: Profeter, Gamla Testamentet (224) @sv
alternative label: Profetior, Gamla Testamentet (224) @sv
alternative label: Profetiska böckerna (224) @sv
alternative label: Sakarjas bok (224) @sv
alternative label: Sefanjas bok (224) @sv
broader: RAAMATTU. RAAMATUNTUTKIMUS
in scheme: URN:NBN:fi:au:hklj:
notation: 224
preferred label: The Old Testament's books of prophesy @en
preferred label: Gamla testamentets profetiska böcker @sv
related: Juutalaisten uskonto ja sen mytologia
scope note: Jesajan kirja. Jeremian kirja. Valitusvirret. Hesekielin, Danielin, Hoosean, Joelin, Aamoksen, Obadjan, Joonan, Miikan, Nahumin, Habakukin, Sefanjan, Haggain, Sakarjan ja Malakian kirjat
scope note: Jesaja. Jeremia. Klagovisorna. Hesekiel, Daniel, Hosea, Joel, Amos, Obadja, Jona, Mika, Nahum, Habackuk, Sefanja, Haggai, Sakarja och Malaki @sv

Johanneksen ilmestys
type: Class
type: Concept
subclass of: RAAMATTU. RAAMATUNTUTKIMUS
alternative label: Apostolit (225 ... 228)
alternative label: Harmagedon, Johanneksen ilmestys (228)
alternative label: Ilmestyskirja (228)
alternative label: Johanneksen ilmestys (228)
alternative label: Opetuslapset (225 ... 228)
alternative label: Raamattu, Johanneksen ilmestys (228)
alternative label: Uusi Testamentti, Johanneksen ilmestys (228)
alternative label: Apostlar (225 ... 228) @sv
alternative label: Bibeln, Johannes uppenbarelse (228) @sv
alternative label: Harmageddon, Johannes uppenbarelse (228) @sv
alternative label: Johannes uppenbarelse (228) @sv
alternative label: Lärjungar (225 ... 228) @sv
alternative label: Nya Testamentet, Johannes uppenbarelse (228) @sv
alternative label: Uppenbarelseboken (228) @sv
broader: RAAMATTU. RAAMATUNTUTKIMUS
in scheme: URN:NBN:fi:au:hklj:
notation: 228
preferred label: Revelation @en
preferred label: Johannes uppenbarelse @sv
related: Evankeliumit

Uskontunnustukset. Katekismukset
type: Class
type: Concept
subclass of: KRISTILLINEN DOGMATIIKKA
alternative label: Katekismukset (238)
alternative label: Tunnustus, tunnustuskirjat (238)
alternative label: Tunnustus, uskontunnustus, kristinusko (238)
alternative label: Tunnustuskirjat (238)
alternative label: Uskontunnustukset, kristinusko (238)
alternative label: Bekännelse, bekännelseböcker (238) @sv
alternative label: Bekännelse, trosbekännelser, kristendom (238) @sv
alternative label: Bekännelseböcker (238) @sv
alternative label: Katekeser (238) @sv
alternative label: Trosbekännelser, kristendom (238) @sv
broader: KRISTILLINEN DOGMATIIKKA
in scheme: URN:NBN:fi:au:hklj:
notation: 238
preferred label: Creeds. Catechisms @en
preferred label: Trosbekännelser. Katekeser @sv
related: Seurakunta. Seurakuntatyö
related: Saarnat. Postillat. Kristilliset puhe- ja päivänavauskokoelmat
scope note: Kirkkokunnasta tai yhteisöstä riippumatta kristinuskon tunnustuskirjat ja katekismukset
scope note: Hit kristendomens bekännelseskrifter och katekeser oavsett kyrkosamfund eller kristet samfund @sv

Saarnaoppi
type: Class
type: Concept
subclass of: EVANKELIS-LUTERILAINEN KIRKKO
alternative label: Homiletiikka, ev.-lut. (256)
alternative label: Saarnaoppi, ev.-lut. (256)
alternative label: Homiletik, homiletiikka, ev.-luth. (256) @sv
alternative label: Homiletik, saarnaoppi, ev.luth. (256) @sv
broader: EVANKELIS-LUTERILAINEN KIRKKO
in scheme: URN:NBN:fi:au:hklj:
notation: 256
preferred label: Homiletics. Preaching @en
preferred label: Predikolära @sv
related: Virsikirjat ja hengelliset laulukirjat
related: Saarnat. Postillat. Kristilliset puhe- ja päivänavauskokoelmat
scope note: Saarnojen tutkimus. Homiletiikka
scope note: Forskning i predikningar. Homiletik @sv

Museot. Arkistot. Kokoelmat. Näyttelyt
type: Class
type: Concept
subclass of: Kokoomateokset
broader: Kokoomateokset
in scheme: URN:NBN:fi:au:hklj:
notation: 308.5
preferred label: Museums. Archives. Collections. Exhibitions @en
preferred label: Museer. Arkiv. Samlingar. Utställningar @sv
scope note: Yhteiskuntaa tai yhteiskuntatieteitä koskevat yleiset tai sekasisältöiset museot, arkistot, kokoelmat ja näyttelyt Eri yhteiskuntatieteitä koskevat museot, arkistot, kokoelmat ja näyttelyt alan mukaisessa luokassa
scope note: Museer, arkiv, samlingar och utställningar med allmänt eller blandat innehåll som rör samhället eller samhällsvetenskaperna Museer, arkiv, samlingar och utställningar som rör olika samhällsvetenskaper klassificeras enligt område @sv

Komiteat. Komiteanmietinnöt
type: Class
type: Concept
subclass of: Suomen valtionhallinto
alternative label: Komiteanmietinnöt, Suomi, v:een 1986 sarjana (347.1)
alternative label: Komiteat, Suomi, v:een 1986 sarjana (347.1)
alternative label: Lainvalmistelu, komiteanmietinnöt, Suomi, v:een 1986 sarjana, v:sta 1987 alan mukaan (347.1)
alternative label: Lakiehdotukset, komiteanmietinnöt (347.1)
alternative label: Säädösvalmistelu, komiteanmietinnöt, Suomi, v:een 1986 sarjana, v:sta 1987 alan mukaan (347.1)
alternative label: Vallankäyttö, johtamistaito (347.1)
alternative label: Författningsberedning, kommittébetänkanden, Finland, till år 1986 som serie, från år 1987 enligt sektor (347.1) @sv
alternative label: Kommittébetänkanden, Finland, till år 1986 som serier (347.1) @sv
alternative label: Kommittéer, Finland, till år 1986 som serier (347.1) @sv
alternative label: Lagberedning, kommittébetänkanden, Finland, till år 1986 som serie, från år 1987 enligt sektor (347.1) @sv
alternative label: Lagförslag, kommittébetänkanden (347.1) @sv
alternative label: Maktutövning, ledarskap (347.1) @sv
broader: Suomen valtionhallinto
in scheme: URN:NBN:fi:au:hklj:
notation: 347.1
preferred label: Committees. Committee reports @en
preferred label: Kommittéer. Kommittébetänkanden @sv
related: Yleisbibliografiat. Kansallisbibliografiat
related: Muiden maiden kunnallis-, läänin- ja valtionhallinto
scope note: Tässä vanhoja komiteoita ja niiden mietintöjä Uudet komiteat ja niiden mietinnöt alan mukaisessa luokassa
scope note: Hit gamla komittéer och deras betänkanden Nya kommittéer och deras betänkanden klassificeras enligt område @sv

Oppikirjat. Harjoituskirjat. Tehtäväkokoelmat
type: Class
type: Concept
subclass of: URN:NBN:fi:au:hklj:400
alternative label: Maantiede, oppikirjat (402)
alternative label: Maantieto, oppikirjat (402)
alternative label: Geografi, läroböcker (402) @sv
alternative label: Geografi, maantieto, läroböcker (402) @sv
broader: URN:NBN:fi:au:hklj:400
in scheme: URN:NBN:fi:au:hklj:
notation: 402
preferred label: Text books. Exercise books. Collections of examination exercises @en
preferred label: Läroböcker. Övningsböcker. Samlingar av provuppgifter @sv
related: Oppikirjat. Oppaat. Harjoituskirjat. Tehtäväkokoelmat
related: Suomi
scope note: Maantieteen ja maantiedon yleiset oppikirjat, harjoituskirjat ja tehtäväkokoelmat Eri maantieteen aloja tai eri maantieteellisiä alueita koskevat oppikirjat alan tai alueen mukaisessa luokassa
scope note: Allmänna läroböcker, övningsböcker och samlingar av provuppgifter i geografi Läroböcker som handlar om olika ämnesområden inom geografi eller olika geografiska områden klassificeras enligt ämnesområde eller geografiskt område @sv

Yhdistykset. Laitokset. Kokoukset
type: Class
type: Concept
subclass of: URN:NBN:fi:au:hklj:400
broader: URN:NBN:fi:au:hklj:400
in scheme: URN:NBN:fi:au:hklj:
notation: 406
preferred label: Associations. Institutions. Meetings @en
preferred label: Organisationer. Institutioner. Möten @sv
related: Merenkulkuoppi
scope note: Maantiedettä tai maantietoa koskevat yleiset yhdistykset, laitokset ja kokoukset Eri maantieteen aloja tai eri maantieteellisiä alueita koskevat yhdistykset, laitokset ja kokoukset alan mukaisessa luokassa
scope note: Allmänna organisationer, institutioner och möten som rör geografi Allmänna organisationer, institutioner och möten som rör olika ämnesområden inom geografi eller olika geografiska områden klassificeras enligt ämnesområde @sv

Opinnot
type: Class
type: Concept
subclass of: URN:NBN:fi:au:hklj:400
broader: URN:NBN:fi:au:hklj:400
in scheme: URN:NBN:fi:au:hklj:
notation: 407
preferred label: Studies. Educational institutions @en
preferred label: Studier @sv
related: Maantieteen ja kansatieteen opetusoppi
related: Merenkulkuoppi
scope note: Maantiedettä tai maantietoa koskevat opinnot yleensä Eri maantiedon aloja koskevat opinnot alan mukaisessa luokassa
scope note: Studier i geografi i allmänhet Studier i olika ämnesområden inom geografi klassificeras enligt ämnesområde @sv

Museot. Arkistot. Kokoelmat. Näyttelyt
type: Class
type: Concept
subclass of: Kokoomateokset
broader: Kokoomateokset
in scheme: URN:NBN:fi:au:hklj:
notation: 408.5
preferred label: Museums. Archives. Collections. Exhibitions @en
preferred label: Museer. Arkiv. Samlingar. Utställningar @sv
scope note: Maantiedettä tai maantietoa koskevat yleiset tai sekasisältöiset museot, arkistot, kokoelmat ja näyttelyt Eri maantieteen aloja tai eri maantieteellisiä alueita koskevat museot, arkistot, kokoelmat ja näyttelyt alan tai alueen mukaisessa luokassa Matkailijoille tarkoitetut museo-oppaat ko. maan tai alueen luokassa
scope note: Museer, arkiv, samlingar och utställningar med allmänt eller blandat innehåll som rör geografi Museer, arkiv, samlingar och utställningar som rör olika ämnesområden inom geografi eller olika geografiska områden klassificeras enligt ämnesområde eller geografiskt område Museiguider för turister klassificeras enligt land eller region @sv

Puola
type: Class
type: Concept
subclass of: Keski-Eurooppa
alternative label: Itä-Preussi (413.5)
alternative label: Itä-Preussi, maantiede, matkat (413.5)
alternative label: Puola (413.5)
alternative label: Puola, maantiede, matkat (413.5)
alternative label: Ostpreussen (413.5) @sv
alternative label: Ostpreussen, geografi, resor (413.5) @sv
alternative label: Polen (413.5) @sv
alternative label: Polen, geografi, resor (413.5) @sv
broader: Keski-Eurooppa
in scheme: URN:NBN:fi:au:hklj:
notation: 413.5
preferred label: Poland @en
preferred label: Polen @sv
related: URN:NBN:fi:au:hklj:460
related: Puolan historia

Lontoo
type: Class
type: Concept
subclass of: Iso-Britannia
alternative label: Lontoo (417.11)
alternative label: Lontoo, maantiede, matkat (417.11)
alternative label: London (417.11) @sv
alternative label: London, geografi, resor (417.11) @sv
broader: Iso-Britannia
in scheme: URN:NBN:fi:au:hklj:
notation: 417.11
preferred label: London @en
related: URN:NBN:fi:au:hklj:460
related: BRITTEIN SAARTEN HISTORIA

Turkki
type: Class
type: Concept
subclass of: Etu-Aasia
alternative label: Turkki (421.1)
alternative label: Turkki, maantiede, matkat (421.1)
alternative label: Turkiet (421.1) @sv
alternative label: Turkiet, geografi, resor (421.1) @sv
broader: Etu-Aasia
in scheme: URN:NBN:fi:au:hklj:
notation: 421.1
preferred label: Turkey @en
preferred label: Turkiet @sv
related: Egyptin ja Etu-Aasian muinaishistoria ja arkeologia
related: Etu-Aasian historia

Kiina
type: Class
type: Concept
subclass of: AASIA
alternative label: Hongkong (426)
alternative label: Hongkong, maantiede, matkat (426)
alternative label: Itä-Aasia, Kiina (426)
alternative label: Kaukoitä, Kiina (426)
alternative label: Kiina (426)
alternative label: Kiina, maantiede, matkat (426)
alternative label: Macao (426)
alternative label: Macao, maantiede, matkat (426)
alternative label: Mantsuria (426)
alternative label: Mantsuria, maantiede, matkat (426)
alternative label: Sinologia, Kiinan maantiede (426)
alternative label: Taiwan (426)
alternative label: Taiwan, maantiede, matkat (426)
alternative label: Tiibet (426)
alternative label: Tiibet, maantiede, matkat (426)
alternative label: Fjärran Östern, Kina (426) @sv
alternative label: Hongkong, geografi, resor (426) @sv
alternative label: Kina (426) @sv
alternative label: Kina, geografi, resor (426) @sv
alternative label: Macao, geografi, resor (426) @sv
alternative label: Manchuriet (426) @sv
alternative label: Manchuriet, geografi, resor (426) @sv
alternative label: Ostasien, Kina (426) @sv
alternative label: Sinologi, Kina, geografi (426) @sv
alternative label: Taiwan, geografi, resor (426) @sv
alternative label: Tibet (426) @sv
alternative label: Tibet, geografi, resor (426) @sv
broader: AASIA
in scheme: URN:NBN:fi:au:hklj:
notation: 426
preferred label: China @en
preferred label: Kina @sv
related: Keski-Aasia
related: Keski- ja Itä-Aasian historia
scope note: Tässä myös Hongkong, Macao, Taiwan ja Tiibet
scope note: Hit också Hongkong, Macau, Taiwan och Tibet @sv

Kaakkois-Aasia
type: Class
type: Concept
subclass of: AASIA
alternative label: Akhat, Kaakkois-Aasia (428)
alternative label: Bali (428)
alternative label: Bali, maantiede, matkat (428)
alternative label: Borneo (428)
alternative label: Borneo, maantiede, matkat (428)
alternative label: Brunei (428)
alternative label: Brunei, maantiede, matkat (428)
alternative label: Burma (428)
alternative label: Burma, maantiede, matkat (428)
alternative label: Celebes (428)
alternative label: Celebes, maantiede, matkat (428)
alternative label: Filippiinit (428)
alternative label: Filippiinit, maantiede, matkat (428)
alternative label: Indokiina (428)
alternative label: Indokiina, maantiede, matkat (428)
alternative label: Indonesia (428)
alternative label: Indonesia, maantiede, matkat (428)
alternative label: Itä-Intia (428)
alternative label: Itä-Intia, maantiede, matkat (428)
alternative label: Itä-Timor (428)
alternative label: Itä-Timor, maantiede, matkat (428)
alternative label: Jaava (428)
alternative label: Jaava, maantiede, matkat (428)
alternative label: Kaakkois-Aasia (428)
alternative label: Kaakkois-Aasia, maantiede, matkat (428)
alternative label: Kambodza (428)
alternative label: Kambodza, maantiede, matkat (428)
alternative label: Kambodža (428)
alternative label: Kambodža, maantiede, matkat (428)
alternative label: Kamputsea (428)
alternative label: Kamputsea, maantiede, matkat (428)
alternative label: Laos (428)
alternative label: Laos, maantiede, matkat (428)
alternative label: Malaijien saaristo (428)
alternative label: Malaijien saaristo, maantiede, matkat (428)
alternative label: Malakan niemimaa (428)
alternative label: Malakan niemimaa, maantiede, matkat (428)
alternative label: Malesia (428)
alternative label: Malesia, maantiede, matkat (428)
alternative label: Molukit (428)
alternative label: Molukit, maantiede, matkat (428)
alternative label: Myanmar (428)
alternative label: Myanmar, maantiede, matkat (428)
alternative label: Singapore (428)
alternative label: Singapore, maantiede, matkat (428)
alternative label: Sumatra (428)
alternative label: Sumatra, maantiede, matkat (428)
alternative label: Sundasaaret (428)
alternative label: Sundasaaret, maantiede, matkat (428)
alternative label: Taka-Intia (428)
alternative label: Taka-Intia, maantiede, matkat (428)
alternative label: Thaimaa (428)
alternative label: Thaimaa, maantiede, matkat (428)
alternative label: Timor (428)
alternative label: Timor, maantiede, matkat (428)
alternative label: Vietnam (428)
alternative label: Vietnam, maantiede, matkat (428)
alternative label: Akha, Sydostasien (428) @sv
alternative label: Bali, geografi, resor (428) @sv
alternative label: Borneo, geografi, resor (428) @sv
alternative label: Bortre Indien (428) @sv
alternative label: Bortre Indien, geografi, resor (428) @sv
alternative label: Brunei, geografi, resor (428) @sv
alternative label: Burma, geografi, resor (428) @sv
alternative label: Celebes, geografi, resor (428) @sv
alternative label: Filippinerna (428) @sv
alternative label: Filippinerna, geografi, resor (428) @sv
alternative label: Indokina (428) @sv
alternative label: Indokina, geografi, resor (428) @sv
alternative label: Indonesien (428) @sv
broader: AASIA
in scheme: URN:NBN:fi:au:hklj:
notation: 428
related: Australia. Uusi-Seelanti. Uusi-Guinea
related: Kaakkois-Aasian historia
scope note: Brunei. Burma (Myanmar). Filippiinit. Indonesia. Kambodza. Laos. Malesia. Singapore. Thaimaa. Vietnam
scope note: Brunei. Burma (Myanmar). Filippinerna. Indonesien. Kambodja. Laos. Malaysia. Singapore. Thailand. Vietnam @sv

Pohjois-Afrikka
type: Class
type: Concept
subclass of: AFRIKKA
alternative label: Algeria (431)
alternative label: Algeria, maantiede, matkat (431)
alternative label: Atlasmaat (431)
alternative label: Atlasmaat, maantiede, matkat (431)
alternative label: Libya (431)
alternative label: Libya, maantiede, matkat (431)
alternative label: Länsi-Sahara (431)
alternative label: Länsi-Sahara, maantiede, matkat (431)
alternative label: Marokko (431)
alternative label: Marokko, maantiede, matkat (431)
alternative label: Pohjois-Afrikka (431)
alternative label: Pohjois-Afrikka, maantiede, matkat (431)
alternative label: Sahara (431)
alternative label: Sahara, maantiede, matkat (431)
alternative label: Tunisia (431)
alternative label: Tunisia, maantiede, matkat (431)
alternative label: Algeriet (431) @sv
alternative label: Algeriet, geografi, resor (431) @sv
alternative label: Atlasländerna (431) @sv
alternative label: Atlasländerna, geografi, resor (431) @sv
alternative label: Libyen (431) @sv
alternative label: Libyen, geografi, resor (431) @sv
alternative label: Marocko (431) @sv
alternative label: Marocko, geografi, resor (431) @sv
alternative label: Nordafrika (431) @sv
alternative label: Nordafrika, geografi, resor (431) @sv
alternative label: Sahara, geografi, resor (431) @sv
alternative label: Tunisien (431) @sv
alternative label: Tunisien, geografi, resor (431) @sv
alternative label: Västsahara (431) @sv
alternative label: Västsahara, geografi, resor (431) @sv
broader: AFRIKKA
in scheme: URN:NBN:fi:au:hklj:
notation: 431
preferred label: North Africa @en
preferred label: Nordafrika @sv
related: Egypti. Sudan. Etelä-Sudan
related: Pohjois-Afrikan historia
scope note: Saharan aluetta ja Pohjois-Afrikkaa koskevat yleisteokset Algeria. Libya. Marokko. Tunisia Tässä myös Länsi-Sahara
scope note: Allmänna verk om Saharaområdet och Nordafrika Algeriet. Libyen. Marocko. Tunisien Hit också Västsahara @sv

Itä-Afrikka
type: Class
type: Concept
subclass of: AFRIKKA
alternative label: Burundi (436)
alternative label: Burundi, maantiede, matkat (436)
alternative label: Itä-Afrikka (436)
alternative label: Itä-Afrikka, maantiede, matkat (436)
alternative label: Kenia (436)
alternative label: Kenia, maantiede, matkat (436)
alternative label: Ruanda (436)
alternative label: Ruanda, maantiede, matkat (436)
alternative label: Tansania (436)
alternative label: Tansania, maantiede, matkat (436)
alternative label: Uganda (436)
alternative label: Uganda, maantiede, matkat (436)
alternative label: Burundi, geografi, resor (436) @sv
alternative label: Kenya (436) @sv
alternative label: Kenya, geografi, resor (436) @sv
alternative label: Ruanda, geografi, resor (436) @sv
alternative label: Tanzania (436) @sv
alternative label: Tanzania, geografi, resor (436) @sv
alternative label: Uganda, geografi, resor (436) @sv
alternative label: Östafrika (436) @sv
alternative label: Östafrika, geografi, resor (436) @sv
broader: AFRIKKA
in scheme: URN:NBN:fi:au:hklj:
notation: 436
preferred label: East Africa @en
preferred label: Östafrika @sv
related: Djibouti. Eritrea. Etiopia. Somalia
related: Länsi-, Itä- ja Keski-Afrikan historia
scope note: Itä-Afrikkaa koskevat yleisteokset Burundi. Kenia. Ruanda. Tansania. Uganda
scope note: Allmänna verk om Östafrika Burundi. Kenya. Rwanda. Tanzania. Uganda @sv

Djibouti. Eritrea. Etiopia. Somalia
type: Class
type: Concept
subclass of: AFRIKKA
alternative label: Abessinia (437)
alternative label: Abessinia, maantiede, matkat (437)
alternative label: Djibouti (437)
alternative label: Djibouti, maantiede, matkat (437)
alternative label: Eritrea (437)
alternative label: Eritrea, maantiede, matkat (437)
alternative label: Etiopia (437)
alternative label: Etiopia, maantiede, matkat (437)
alternative label: Itä-Afrikka, Afrikan sarvi (437)
alternative label: Somalia (437)
alternative label: Somalia, maantiede, matkat (437)
alternative label: Abessinien (437) @sv
alternative label: Abessinien, geografi, resor (437) @sv
alternative label: Djibouti, geografi, resor (437) @sv
alternative label: Eritrea, geografi, resor (437) @sv
alternative label: Etiopien (437) @sv
alternative label: Etiopien, geografi, resor (437) @sv
alternative label: Somalia, geografi, resor (437) @sv
alternative label: Östafrika, Afrikas horn (437) @sv
broader: AFRIKKA
in scheme: URN:NBN:fi:au:hklj:
notation: 437
preferred label: Djibouti. Eritrea. Ethiopia. Somalia @en
preferred label: Djibouti. Eritrea. Etiopien. Somalia @sv
related: Itä-Afrikka
related: Länsi-, Itä- ja Keski-Afrikan historia
scope note: Afrikan sarvi
scope note: Afrikas horn @sv

Kanada
type: Class
type: Concept
subclass of: AMERIKKA
alternative label: Kalliovuoret (441 ... 443)
alternative label: Kanada (442)
alternative label: Kanada, maantiede, matkat (442)
alternative label: Labrador (442)
alternative label: Labrador, maantiede, matkat (442)
alternative label: Newfoundland (442)
alternative label: Newfoundland, maantiede, matkat (442)
alternative label: Pohjois-Amerikka, Kanada (442)
alternative label: Preeriat, aluemaantiede (441 ... 443)
alternative label: Preeriat, matkakertomukset (441 ... 443)
alternative label: Quebec (442)
alternative label: Quebec, maantiede, matkat (442)
alternative label: Kanada, geografi, resor (442) @sv
alternative label: Klippiga bergen (441 ... 443) @sv
alternative label: Labrador, geografi, resor (442) @sv
alternative label: Newfoundland, geografi, resor (442) @sv
alternative label: Nordamerika, Kanada (442) @sv
alternative label: Prärier, regionalgeografi (441 ... 443) @sv
alternative label: Prärier, reseskildringar (441 ... 443) @sv
alternative label: Quebec, geografi, resor (442) @sv
broader: AMERIKKA
in scheme: URN:NBN:fi:au:hklj:
notation: 442
preferred label: Canada @en
related: Pohjois-Amerikka
related: Kanadan historia
scope note: Tässä myös St. Pierre ja Miquelon
scope note: Hit också Saint Pierre och Miquelon @sv

Antarktis, eteläiset napamaat
type: Class
type: Concept
subclass of: AUSTRALIA. OSEANIA. NAPAMAAT
alternative label: Antarktinen alue (459)
alternative label: Antarktinen alue, maantiede, matkat (459)
alternative label: Etelämanner (459)
alternative label: Etelämanner, maantiede, matkat (459)
alternative label: Etelänapa (459)
alternative label: Etelänapa, maantiede, matkat (459)
alternative label: Jäävuoret, antarktiset alueet (459)
alternative label: Maanosat, Antarktis (459)
alternative label: Napa-alueet, eteläiset napamaat (459)
alternative label: Napapiirit, eteläiset napamaat (459)
alternative label: Naparetket, eteläiset napamaat (459)
alternative label: Antarktis (459) @sv
alternative label: Antarktis, geografi, resor (459) @sv
alternative label: Antarktiska regionen (459) @sv
alternative label: Antarktiska regionen, geografi, resor (459) @sv
alternative label: Isberg, antarktiska områden (459) @sv
alternative label: Polarexpeditioner, sydliga polarländerna (459) @sv
alternative label: Polarområden, sydliga polarländerna (459) @sv
alternative label: Polcirklar, sydliga polarländerna (459) @sv
alternative label: Sydpolen (459) @sv
alternative label: Sydpolen, geografi, resor (459) @sv
alternative label: Världsdelar, Antarktis (459) @sv
broader: AUSTRALIA. OSEANIA. NAPAMAAT
in scheme: URN:NBN:fi:au:hklj:
notation: 459
preferred label: The Antarctic, South-polar regions @en
preferred label: Antarktis, sydliga polarländerna @sv
related: Arktis, pohjoiset napamaat
related: URN:NBN:fi:au:hklj:989
scope note: Etelämanner. Eteläinen jäämeri ja sen saaret
scope note: Antarktis. Södra ishavet och dess öar @sv

Matkakuvaukset
type: Class
type: Concept
subclass of: URN:NBN:fi:au:hklj:460
alternative label: Aavikot, matkakuvaukset (462 ... 469)
alternative label: Arot, matkakertomukset (462 ... 469)
alternative label: Au pairit, matkakuvaukset (462)
alternative label: Autiomaat, matkakuvaukset (462 ... 469)
alternative label: Karavaanarit, matkakuvaukset (462)
alternative label: Keitaat, matkakuvaukset (462 ... 469)
alternative label: Kokemukset, matkakuvaukset (462 ... 469)
alternative label: Laivamatkailu, merimatkojen kuvaukset (462)
alternative label: Lentomatkailu, matkakuvaukset (462)
alternative label: Liftaus, matkakertomukset (462)
alternative label: Lokikirjat, merimatkojen kuvaukset (462 ... 469)
alternative label: Maailmanympärimatkat (462)
alternative label: Maailmanympäripurjehdukset (462)
alternative label: Matkailijat, matkakuvaukset (462)
alternative label: Matkailuoppaat, matkakertomukset (462)
alternative label: Matkakertomukset, matkakuvaukset (462)
alternative label: Matkakirjallisuus, matkakuvaukset (462)
alternative label: Matkakirjat, matkakuvaukset (462)
alternative label: Matkakuvaukset, matkakertomukset (462)
alternative label: Matkapäiväkirjat, matkakuvaukset (462)
alternative label: Matkaraportit, matkakertomukset (462)
alternative label: Matkat, matkakuvaukset (462)
alternative label: Matkat, merimatkat (462)
alternative label: Merenkulkijat, merimatkat (462)
alternative label: Merenkävijät, merimatkat (462)
alternative label: Merikapteenit, merimatkojen kuvaukset (462)
alternative label: Merikirjallisuus, merimatkojen kuvaukset (462)
alternative label: Merimatkat (462)
alternative label: Merimiehet, merimatkojen kuvaukset (462)
alternative label: Purjehdus, matkakertomukset (462 ... 469)
alternative label: Päiväkirjat, matkapäiväkirjat (462 ... 469)
alternative label: Sademetsät, matkakertomukset (462 ... 469)
alternative label: Savannit, matkakertomukset (462 ... 469)
alternative label: Tundra, matkakertomukset (462 ... 469)
alternative label: Tundravyöhyke, matkakertomukset (462 ... 469)
alternative label: Turistit, matkakuvaukset (462)
alternative label: Vuorikiipeily, matkakertomukset (462)
alternative label: Vuoristoretkeily, matkakertomukset (462)
alternative label: Vuoristot, matkakertomukset (462 ... 469)
alternative label: Au pairer, reseskildringar (462) @sv
alternative label: Bergsbestigning, reseskildringar (462) @sv
alternative label: Bergstrakter, reseskildringar (462 ... 469) @sv
alternative label: Bergvandring, reseskildringar (462) @sv
alternative label: Båtturism, beskrivningar av sjöresor (462) @sv
alternative label: Dagböcker, resedagböcker (462 ... 469) @sv
alternative label: Erfarenheter, reseskildringar (462 ... 469) @sv
alternative label: Flygturism, resebeskrivningar (462) @sv
alternative label: Guider, reseskildringar (462) @sv
alternative label: Jordenruntresor (462) @sv
alternative label: Karavanare, reseskildringar (462) @sv
alternative label: Liftning, reseskildringar (462) @sv
alternative label: Loggböcker, beskrivningar av sjöresor (462 ... 469) @sv
alternative label: Oaser, reseskildringar (462 ... 469) @sv
alternative label: Regnskogar, reseskildringar (462 ... 469) @sv
alternative label: Reseberättelser, reseskildringar (462) @sv
alternative label: Resedagböcker, reseskildringar (462) @sv
alternative label: Resenärer, turism, reseskildringar (462) @sv
alternative label: Reserapporter, reseberättelser (462) @sv
alternative label: Reseskildringar, reseberättelser (462) @sv
alternative label: Resor, reseskildringar (462) @sv
alternative label: Resor, sjöresor (462) @sv
alternative label: Savanner, reseskildringar (462 ... 469) @sv
alternative label: Segling, reseskildringar (462 ... 469) @sv
alternative label: Sjöfarande, sjöresor (462) @sv
alternative label: Sjöfarare, sjöresor (462) @sv
alternative label: Sjökaptener, beskrivningar av sjöresor (462) @sv
alternative label: Sjömän, beskrivningar av sjöresor (462) @sv
alternative label: Sjöresor (462) @sv
alternative label: Sjöromaner, beskrivningar av sjöresor (462) @sv
alternative label: Stäpper, reseskildringar (462 ... 469) @sv
broader: URN:NBN:fi:au:hklj:460
in scheme: URN:NBN:fi:au:hklj:
notation: 462
related: Löytöretket. Tutkimusmatkat
related: Purjehdus. Soutu. Melonta
scope note: Useita maanosia koskevat matkakuvaukset. Merimatkat. Maailmanympärimatkat Muut matkakuvaukset maanosan, maan, alueen tai paikkakunnan luokassa 410-459
scope note: Reseskildringar som rör flera världsdelar. Sjöresor. Jordenruntresor Övriga reseskildringar förs enligt världsdel, land, region eller ort till klasserna 410-459 @sv

Museot. Arkistot. Kokoelmat. Näyttelyt
type: Class
type: Concept
subclass of: Kokoomateokset
alternative label: Museums. Archives. Collections. Exhibitions @en
alternative label: Luonnontieteelliset museot
alternative label: Naturvetenskapliga museer @sv
broader: Kokoomateokset
in scheme: URN:NBN:fi:au:hklj:
notation: 508.5
preferred label: Museer. Arkiv. Samlingar. Utställningar @sv
scope note: Luontoa tai luonnontieteitä koskevat yleiset tai sekasisältöiset museot, arkistot, kokoelmat ja näyttelyt Eri luonnontieteen aloja koskevat museot, arkistot, kokoelmat ja näyttelyt alan mukaisessa luokassa
scope note: Museer, arkiv, samlingar och utställningar med allmänt eller blandat innehåll som rör naturen eller naturvetenskaperna Museer, arkiv, samlingar och utställningar som rör olika områden inom naturvetenskaperna klassificeras enligt område @sv

Luonnontieteiden historia
type: Class
type: Concept
subclass of: LUONNONTIETEET
alternative label: Eetteri, luonnontieteen historia (509)
alternative label: Luonnontutkimus, historia (509)
alternative label: Eter, naturvetenskapens historia (509) @sv
alternative label: Naturforskning, historia (509) @sv
broader: LUONNONTIETEET
in scheme: URN:NBN:fi:au:hklj:
notation: 509
preferred label: History of the natural sciences @en
preferred label: Naturvetenskapernas historia @sv
related: TIEDEOPPI
related: Tieteenhistoria. Oppihistoria
scope note: Luonnontieteiden yleinen historia Eri luonnontieteen alojen historia alan mukaisessa luokassa
scope note: Naturvetenskapernas allmänna historia Historia som rör olika naturvetenskapliga områden klassificeras enligt område @sv

Standardit. Normit. Mittayksiköt
type: Class
type: Concept
subclass of: SOVELLETUT TIETEET
alternative label: Ainemäärä, perussuureet (600.2)
alternative label: Ajanmittaus, mittayksiköt (600.2)
alternative label: Etäisyydenmittaus, mittayksiköt (600.2)
alternative label: Eurokoodit, standardit (600.2)
alternative label: Harmonisointi, mittayksiköt (600.2)
alternative label: Harmonisointi, normit (600.2)
alternative label: Harmonisointi, standardit (600.2)
alternative label: Johdannaissuureet (600.2)
alternative label: Koko, mittayksiköt (600.2)
alternative label: Korkeudenmittaus, mittayksiköt (600.2)
alternative label: Korkeus, mittayksiköt (600.2)
alternative label: Kvantiteetti, mittayksiköt (600.2)
alternative label: Kymmenjärjestelmä, mittayksiköt (600.2)
alternative label: Leveys, mittayksiköt (600.2)
alternative label: Lukumäärä, mittayksiköt (600.2)
alternative label: Metrijärjestelmä (600.2)
alternative label: Metrologia (600.2)
alternative label: Mitat (600.2)
alternative label: Mitta-asteikot, mittajärjestelmät (600.2)
alternative label: Mittajärjestelmät (600.2)
alternative label: Mittasuhteet, mittayksiköt (600.2)
alternative label: Mittaus, mittayksiköt (600.2)
alternative label: Mittayksiköt (600.2)
alternative label: Määrä, mittayksiköt (600.2)
alternative label: Normit, tekniikka (600.2)
alternative label: Painomitat (600.2)
alternative label: Painot (600.2)
alternative label: Perussuureet, mittayksiköt (600.2)
alternative label: Pituudenmittaus (600.2)
alternative label: Pituus, mittayksiköt (600.2)
alternative label: Punnitus, mittayksiköt (600.2)
alternative label: SI-järjestelmä (600.2)
alternative label: Standardit (600.2)
alternative label: Standardointi (600.2)
alternative label: Suureet (600.2)
alternative label: Tarkkuus, mittajärjestelmät (600.2)
alternative label: Tekniset normit (600.2)
alternative label: Tunnusluvut, mittayksiköt (600.2)
alternative label: Tunnusvärit, standardit (600.2)
alternative label: Välimatkat, mittayksiköt (600.2)
alternative label: Yhdenmukaistaminen, mittayksiköt, normit, standardit (600.2)
alternative label: Yhdenmukaisuus, mittayksiköt, normit, standardit (600.2)
alternative label: Yhtenäistäminen, mittayksiköt, normot, standardit (600.2)
alternative label: Antal, måttenheter (600.2) @sv
alternative label: Avståndsmätning, måttenheter (600.2) @sv
alternative label: Bredd, måttenheter (600.2) @sv
alternative label: Decimalsystemet, måttenheter (600.2) @sv
alternative label: Distanser, måttenheter (600.2) @sv
alternative label: Enhetlighet, måttenheter, normer, standarder (600.2) @sv
alternative label: Eurokoder, standarder (600.2) @sv
alternative label: Förenhetligande, måttenheter, normer, standarder (600.2) @sv
alternative label: Grundstorheter, måttenheter (600.2) @sv
alternative label: Harmonisering, förenhetligande, måttenheter (600.2) @sv
alternative label: Harmonisering, förenhetligande, normer (600.2) @sv
alternative label: Harmonisering, förenhetligande, standarder (600.2) @sv
alternative label: Härledda storheter (600.2) @sv
alternative label: Höjd, måttenheter (600.2) @sv
alternative label: Höjdmätning, måttenheter (600.2) @sv
alternative label: Igenkänningsfärger, standarder (600.2) @sv
alternative label: Kvantitet, lingvistik, måttenheter (600.2) @sv
alternative label: Kvantitet, måttenheter (600.2) @sv
alternative label: Längd, måttenheter (600.2) @sv
alternative label: Längdmätning (600.2) @sv
alternative label: Metersystemet (600.2) @sv
alternative label: Metrologi (600.2) @sv
alternative label: Mätning, måttenheter (600.2) @sv
alternative label: Mått (600.2) @sv
alternative label: Måttenheter (600.2) @sv
alternative label: Måttsystem (600.2) @sv
alternative label: Normer, teknik (600.2) @sv
broader: SOVELLETUT TIETEET
in scheme: URN:NBN:fi:au:hklj:
notation: 600.2
related: Raha. Valuutta. Pankit. Pörssit
related: Rahatiede
scope note: Standardeja, normeja, mittayksikköjä tai mittayksikköjärjestelmiä koskevat yleisteokset. SI-järjestelmä Sovellettuja tieteitä koskevat yleiset tai sekasisältöiset standardit ja standardikokoelmat Standardointi yleensä Erikoisalojen standardit ja standardikokoelmat sekä normit ja mittayksiköt alan mukaisessa luokassa
scope note: Allmänna verk som rör standarder, normer, måttenheter och system för måttenheter. SI-systemet Standarder eller samlingar med standarder av allmänt eller blandat innehåll som rör tillämpad vetenskap Standardisering i allmänhet Standarder och samlingar med standarder samt normer och måttenheter inom specialområden klassificeras enligt område @sv

Museot. Arkistot. Kokoelmat. Näyttelyt
type: Class
type: Concept
subclass of: Kokoomateokset
broader: Kokoomateokset
in scheme: URN:NBN:fi:au:hklj:
notation: 608.5
preferred label: Museums. Archives. Collections. Exhibitions @en
preferred label: Museer. Arkiv. Samlingar. Utställningar @sv
scope note: Sovellettuja tieteitä koskevat yleiset tai sekasisältöiset museot, arkistot, kokoelmat ja näyttelyt Eri sovellettuja tieteitä koskevat museot, arkistot, kokoelmat ja näyttelyt alan mukaisessa luokassa
scope note: Museer, arkiv, samlingar och utställningar med allmänt eller blandat innehåll som rör tillämpad vetenskap Museer, arkiv, samlingar och utställningar som rör olika tillämpade vetenskaper klassificeras enligt område @sv

Sovellettujen tieteiden historia
type: Class
type: Concept
subclass of: SOVELLETUT TIETEET
broader: SOVELLETUT TIETEET
in scheme: URN:NBN:fi:au:hklj:
notation: 609
preferred label: History of the applied sciences @en
preferred label: Den tillämpade vetenskapens historia @sv
related: Tieteenhistoria. Oppihistoria
related: URN:NBN:fi:au:hklj:620.09
scope note: Sovellettujen tieteiden yleinen historia Eri sovellettujen tieteiden historia alan mukaisessa luokassa
scope note: Den tillämpade vetenskapens allmänna historia Olika tillämpade vetenskapers historia klassificeras enligt område @sv

URN:NBN:fi:au:hklj:643.03
alternative label: Astiastot, tuoteluettelot, lasi- ja keramiikkaesineet (643.03)
alternative label: Astiat, tuoteluettelot, lasi- ja keramiikkaesineet (643.03)
alternative label: Keraaminen teollisuus, tuoteluettelot (643.03)
alternative label: Keraamiset tuotteet, tuoteluettelot (643.03)
alternative label: Keramiikkateollisuus, tuoteluettelot (643.03)
alternative label: Kristalli, lasiteollisuus, tuoteluettelot (643.03)
alternative label: Kristallilasi, lasiteollisuus, tuoteluettelot (643.03)
alternative label: Lasi, lasiteollisuus, tuoteluettelot (643.03)
alternative label: Lasiesineet, lasiteollisuus, tuoteluettelot (643.03)
alternative label: Lasiteollisuus, tuoteluettelot (643.03)
alternative label: Lasituotteet, tuoteluettelot (643.03)
alternative label: Maljakot, tuoteluettelot, lasi- ja keramiikkaesineet (643.03)
alternative label: Saviteollisuus, tuoteluettelot (643.03)
alternative label: Tuoteluettelot, keramiikkatehtaat (643.03)
alternative label: Tuoteluettelot, lasitehtaat (643.03)
alternative label: Glas, glasindustri, produktkataloger (643.03) @sv
alternative label: Glasföremål, glasindustri, produktkataloger (643.03) @sv
alternative label: Glasindustri, produktkataloger (643.03) @sv
alternative label: Glasprodukter, produktkataloger (643.03) @sv
alternative label: Keramikindustri, produktkataloger (643.03) @sv
alternative label: Keramisk industri, produktkataloger (643.03) @sv
alternative label: Keramiska produkter, produktkataloger (643.03) @sv
alternative label: Kristall, glasindustri, produktkataloger (643.03) @sv
alternative label: Kristallglas, glasindustri, produktkataloger (643.03) @sv
alternative label: Kärl, produktkataloger, glas- och keramikföremål (643.03) @sv
alternative label: Lergodsindustri, produktkataloger (643.03) @sv
alternative label: Produktkataloger, glasbruk (643.03) @sv
alternative label: Produktkataloger, keramiska fabriker (643.03) @sv
alternative label: Serviser, produktkataloger, glas- och keramikföremål (643.03) @sv
alternative label: Vaser, produktkataloger, glas- och keramikföremål (643.03) @sv
related: Keramiikkataide. Posliinitaide
related: Keramiikkataide
related: Posliinitaide. Posliinimaalaus
related: Lasitaide

Muovi- ja kumiteollisuus
type: Class
type: Concept
subclass of: Orgaanisen kemian teollisuus
alternative label: Akryyli, muoviteollisuus (649.5)
alternative label: Biomuovi, muoviteollisuus (649.5)
alternative label: Epoksi, muoviteollisuus (649.5)
alternative label: Formaldehydi, muoviteollisuus (649.5)
alternative label: Hartsit, muoviteollisuus (649.5)
alternative label: Hiilikuidut, muoviteollisuus (649.5)
alternative label: Kautsu, kumiteollisuus (649.5)
alternative label: Keinokuidut, muoviteollisuus (649.5)
alternative label: Kertakäyttöpakkaukset, muoviteollisuus (649.5)
alternative label: Kertamuovi, muoviteollisuus (649.5)
alternative label: Kestomuovi (649.5)
alternative label: Kotelot, muoviteollisuus (649.5)
alternative label: Kuidut, hiilikuitu (649.5)
alternative label: Kuidut, lasikuitu (649.5)
alternative label: Kumi (649.5)
alternative label: Kumiteollisuus (649.5)
alternative label: Kumituotteet (649.5)
alternative label: Köydet, muoviteollisuus (649.5)
alternative label: Laatikot, muovilaatikot (649.5)
alternative label: Laminaatti, muoviteollisuus (649.5)
alternative label: Lasikuidut (649.5)
alternative label: Lasikuitumuovi (649.5)
alternative label: Lateksit (649.5)
alternative label: Lujitemuovi (649.5)
alternative label: Luonnonkumi (649.5)
alternative label: Makromolekyylit, muovi- ja kumiteollisuus (649.5)
alternative label: Melamiini, muoviteollisuus (649.5)
alternative label: Muovi, muoviteollisuus (649.5)
alternative label: Muoviesineet (649.5)
alternative label: Muovilevyt (649.5)
alternative label: Muoviputket, muoviteollisuus (649.5)
alternative label: Muovit, muoviteollisuus (649.5)
alternative label: Muoviteollisuus (649.5)
alternative label: Muovituotteet (649.5)
alternative label: Muovitus, muoviteollisuus (649.5)
alternative label: Nailon, tekokuituteollisuus (649.5)
alternative label: Narut, muoviteollisuus (649.5)
alternative label: Oligomeeri, muoviteollisuus (649.5)
alternative label: PCB-yhdisteet, muoviteollisuus (649.5)
alternative label: PVC-muovit (649.5)
alternative label: Pakkaukset, muoviteollisuus (649.5)
alternative label: Pakkausjätteet , muoviteollisuus (649.5)
alternative label: Pakkausteollisuus, muovipakkaukset (649.5)
alternative label: Pinnoitteet, muovit, laminaatit (649.5)
alternative label: Pintamateriaalit, muovit, laminaatit (649.5)
alternative label: Polyesteri, muoviteollisuus (649.5)
alternative label: Polyeteeni, muoviteollisuus (649.5)
alternative label: Polymeerikemia, muoviteollisuus (649.5)
alternative label: Polymerointi, muoviteollisuus (649.5)
alternative label: Polystyreeni, muoviteollisuus (649.5)
alternative label: Polyuretaani, muoviteollisuus (649.5)
alternative label: Puolisynteettiset muovit, muoviteollisuus (649.5)
alternative label: Silikoni, muoviteollisuus (649.5)
alternative label: Styrox, muoviteollisuus (649.5)
alternative label: Synteettiset kuidut, kemianteollisuus (649.5)
alternative label: Synteettiset materiaalit, kemianteollisuus (649.5)
alternative label: Teflon (649.5)
alternative label: Tekokuidut, muoviteollisuus (649.5)
alternative label: Tutit, kumiteollisuus (649.5)
alternative label: Uusiomuovi, muoviteollisuus (649.5)
alternative label: Vaahtomuovi (649.5)
alternative label: Akryl, plastindustri (649.5) @sv
alternative label: Armerad plast (649.5) @sv
alternative label: Bioplast, plastindustri (649.5) @sv
alternative label: Engångsförpackningar, plastindustri (649.5) @sv
alternative label: Epoxiplast, plastindustri (649.5) @sv
alternative label: Fibrer, glasfibrer (649.5) @sv
alternative label: Fibrer, kolfibrer (649.5) @sv
alternative label: Fodral, plastindustri (649.5) @sv
alternative label: Formaldehyd, plastindustri (649.5) @sv
broader: Orgaanisen kemian teollisuus
in scheme: URN:NBN:fi:au:hklj:
notation: 649.5
related: Orgaaninen kemia. Muovien kemia
related: Kemian teollisuus
scope note: Muovi- ja kumiteollisuuden liiketalous, tuotantomenetelmät, rationalisointi, työt, prosessit, koneet, raaka-aineet, tuotanto ja tuotteiden kauppa Eri muovilaatujen, kuten polyesteri-, polyeteeni, polystyreeni-, akryyli-, PVC- ja PBC-muovien valmistus ja käyttö teollisuudessa Lujite- ja lasikuitumuovit. Synteettiset ja puolisynteettiset muovit Synteettinen ja luonnonkumi Muovi- ja kumiesineiden tuotanto ja kauppa Erikoisalojen muovi- ja kumiesineet alan mukaisessa luokassa
scope note: Företagsekonomi, produktionsmetoder, rationalisering, arbete, processer, maskiner, råmaterial, produktion och handel inom plast- och gummiindustri Tillverkning av olika plastsorter såsom polyester, polyeten, polystyren, akryl, PVC eller PCB och användningen av dem inom industri Armerad plast och glasfiberplast. Syntetiska och halvsyntetiska plaster Syntetiskt gummi och naturgummi Produktion av och handel med föremål av plast och gummi Plast- och gummiföremål för speciella ändamål klassificeras enligt område @sv

URN:NBN:fi:au:hklj:676.103
alternative label: Liikemerkit, liikemerkkiluettelot (676.103)
alternative label: Liiketunnukset, liikemerkkiluettelot (676.103)
alternative label: Logot, luettelot (676.103)
alternative label: Merkit, liikemerkkiluettelot (676.103)
alternative label: Mielikuvat, tuote- ja liikemerkkiluettelot (676.103)
alternative label: Tavaramerkit, tavaramerkkiluettelot (676.103)
alternative label: Tunnukset, liikemerkit (676.103)
alternative label: Tunnukset, tavaramerkit (676.103)
alternative label: Tuotemerkit, tuotemerkkiluettelot (676.103)
alternative label: Tuotenimet, tuotenimiluettelot (676.103)
alternative label: Ylellisyystavarat, tuote- ja liikemerkkiluettelot (676.103)
alternative label: Affärssignum, förteckningar över firmamärken (676.103) @sv
alternative label: Firmamärken, förteckningar över firmamärken (676.103) @sv
alternative label: Föreställningar, uppfattningar, kataloger över varu- och firmamärken (676.103) @sv
alternative label: Kännetecken, firmamärken (676.103) @sv
alternative label: Kännetecken, varumärken (676.103) @sv
alternative label: Logotyper, kataloger (676.103) @sv
alternative label: Lyxvaror, kataloger över varu- och firmamärken (676.103) @sv
alternative label: Produktmärken, produktmärkeskataloger (676.103) @sv
alternative label: Produktnamn, produktnamnkataloger (676.103) @sv
alternative label: Tecken, förteckningar över firmamärken (676.103) @sv
alternative label: Varumärken, varumärkeskataloger (676.103) @sv
related: Symbolit. Koodit. Merkkijärjestelmät
related: Tavaraoppi
related: Markkinointi. Asiakaspalvelu
related: Mainonta

Kuvanveistotaiteen teoria, estetiikka ja filosofia
type: Class
type: Concept
subclass of: KUVANVEISTOTAIDE
alternative label: Kuvanveisto, estetiikka ja filosofia (730.1)
alternative label: Veistotaide, estetiikka ja filosofia (730.1)
alternative label: Bildhuggeri, estetik och filosofi (730.1) @sv
alternative label: Skulptur, estetik och filosofi (730.1) @sv
broader: KUVANVEISTOTAIDE
in scheme: URN:NBN:fi:au:hklj:
notation: 730.1
preferred label: Theory, aesthetics and philosophy of sculpture @en
preferred label: Skulpturens teori, estetik och filosofi @sv
related: Taiteen estetiikka. Taidefilosofia. Taidepsykologia. Taidesosiologia. Taidepolitiikka
related: URN:NBN:fi:au:hklj:739

Suomi
type: Class
type: Concept
subclass of: Taideteollisuuden historia
alternative label: Suomi, taideteollisuus (760.921)
alternative label: Finland, konstindustri (760.921) @sv
broader: Taideteollisuuden historia
in scheme: URN:NBN:fi:au:hklj:
notation: 760.921
preferred label: Finland @en
related: URN:NBN:fi:au:hklj:709
related: Suomen yleinen taidehistoria

Rytmioppi
type: Class
type: Concept
subclass of: Musiikin teoria
alternative label: Kehorytmiikka (782.1)
alternative label: Rytmi, musiikin teoria (782.1)
alternative label: Rytmiikka (782.1)
alternative label: Rytmioppi (782.1)
alternative label: Synkopointi, rytmioppi (782.1)
alternative label: Tempo, musiikki (782.1)
alternative label: Body percussion (782.1) @sv
alternative label: Rytm, musikteori (782.1) @sv
alternative label: Rytmik (782.1) @sv
alternative label: Synkopering, rytmlära (782.1) @sv
alternative label: Tempo, musik (782.1) @sv
broader: Musiikin teoria
in scheme: URN:NBN:fi:au:hklj:
notation: 782.1
preferred label: Rhythmics @en
preferred label: Rytmlära @sv
related: Musiikin filosofia, estetiikka, psykologia ja sosiologia Musiikkikasvatus. Musiikkiopetus
related: Musiikin estetiikka ja filosofia
scope note: Rytmioppi musiikin lajista riippumatta
scope note: Rytmlära oavsett musikslag @sv

Sointuoppi
type: Class
type: Concept
subclass of: Musiikin teoria
alternative label: Basso continuo (782.3)
alternative label: Continuo (782.3)
alternative label: Harmonia, soinnutus (782.3)
alternative label: Harmoniaoppi (782.3)
alternative label: Kadenssit, sävellysoppi (782.3)
alternative label: Kenraalibasso (782.3)
alternative label: Klusterit, musiikin teoria (782.3)
alternative label: Soinnutus (782.3)
alternative label: Sointuanalyysi (782.3)
alternative label: Sointuoppi (782.3)
alternative label: Tonaalisuus, sointuoppi (782.3)
alternative label: Generalbas (782.3) @sv
alternative label: Harmoni, musik (782.3) @sv
alternative label: Harmonianalys (782.3) @sv
alternative label: Harmonilära (782.3) @sv
alternative label: Harmonisering, musik (782.3) @sv
alternative label: Kadenser, kompositionslära (782.3) @sv
alternative label: Kluster, musikteoria (782.3) @sv
alternative label: Satslära, musik (782.3) @sv
alternative label: Tonalitet, harmonilära (782.3) @sv
broader: Musiikin teoria
in scheme: URN:NBN:fi:au:hklj:
notation: 782.3
preferred label: Harmonics @en
preferred label: Harmonilära @sv
related: Musiikin filosofia, estetiikka, psykologia ja sosiologia Musiikkikasvatus. Musiikkiopetus
related: Musiikin estetiikka ja filosofia
scope note: Sointuoppi musiikin lajista riippumatta Soinnutus. Sointuanalyysi. Kenraalibasso
scope note: Harmonilära oavsett musikslag Harmonisering. Ackordanalys. Generalbas @sv

Muoto-oppi
type: Class
type: Concept
subclass of: Musiikin teoria
alternative label: Fuugat, musiikin teoria (782.5)
alternative label: Morfologia, musiikin teoria (782.5)
alternative label: Muodot, musiikin muoto-oppi (782.5)
alternative label: Muoto, musiikin muoto-oppi (782.5)
alternative label: Muoto-oppi, musiikin teoria (782.5)
alternative label: Muunnelmamuoto, musiikki (782.5)
alternative label: Muunnelmat, musiikin teoria (782.5)
alternative label: Rondomuoto (782.5)
alternative label: Sonaattimuoto (782.5)
alternative label: Variaatiot, musiikin teoria (782.5)
alternative label: Form, musikens formlära (782.5) @sv
alternative label: Former, musikens formlära (782.5) @sv
alternative label: Formlära, musikens teori (782.5) @sv
alternative label: Fugor, musikteori (782.5) @sv
alternative label: Kanon, formlära, musik (782.5) @sv
alternative label: Morfologi, musikens teori (782.5) @sv
alternative label: Rondoform (782.5) @sv
alternative label: Sonatform (782.5) @sv
alternative label: Variationer, munnelmat, musikens teori (782.5) @sv
alternative label: Variationer, variaatiot, musikteori (782.5) @sv
alternative label: Variationsform, musik (782.5) @sv
broader: Musiikin teoria
in scheme: URN:NBN:fi:au:hklj:
notation: 782.5
preferred label: Musical morphology @en
preferred label: Formlära @sv
related: Musiikin filosofia, estetiikka, psykologia ja sosiologia Musiikkikasvatus. Musiikkiopetus
related: Musiikin estetiikka ja filosofia
scope note: Muoto-oppi musiikin lajista riippumatta
scope note: Formlära oavsett musikslag @sv

Duot kosketinsoittimille
type: Class
type: Concept
subclass of: URN:NBN:fi:au:hklj:785.11
alternative label: Piano, musiikki kahdelle pianolle (785.111)
alternative label: Piano, musik för två pianon (785.111) @sv
broader: URN:NBN:fi:au:hklj:785.11
in scheme: URN:NBN:fi:au:hklj:
notation: 785.111
preferred label: Duets for keyboard instruments @en
preferred label: Duo för klaviaturinstrument @sv
related: Nelikätinen pianomusiikki
related: URN:NBN:fi:au:hklj:789

Sinfoniat
type: Class
type: Concept
subclass of: Sinfoniat. Konsertot
alternative label: Sinfoniat (785.61)
alternative label: Symfonier (785.61) @sv
broader: Sinfoniat. Konsertot
in scheme: URN:NBN:fi:au:hklj:
notation: 785.61
preferred label: Symphonies @en
preferred label: Symfonier @sv
related: URN:NBN:fi:au:hklj:785.4
related: URN:NBN:fi:au:hklj:789

Suomi
type: Class
type: Concept
subclass of: Liikunnan ja urheilun historia
alternative label: Maajoukkueet, uhrielun historia, Suomi (790.921)
alternative label: SM-kisat, urheilun historia (790.921)
alternative label: SVUL, historia (790.921)
alternative label: Suomen mestaruuskisat, urheilun historia (790.921)
alternative label: Suomi, urheilun historia (790.921)
alternative label: TUL, historia (790.921)
alternative label: AIF, historia (790.921) @sv
alternative label: FRIF, historia (790.921) @sv
alternative label: Finland, idrottens historia (790.921) @sv
alternative label: Finländska mästerskapstävlingar, idrottens historia (790.921) @sv
alternative label: Finska mästerskapstävlingar, idrottens historia (790.921) @sv
alternative label: Landslag, idrottshistoria, Finland (790.921) @sv
broader: Liikunnan ja urheilun historia
in scheme: URN:NBN:fi:au:hklj:
notation: 790.921
preferred label: Finland @en
related: Liikunta. Urheilu

Paini
type: Class
type: Concept
subclass of: Voimailu. Itsepuolustus
alternative label: Kreikkalais-roomalainen paini (793.2)
alternative label: Paini (793.2)
alternative label: Vapaapaini (793.2)
alternative label: Brottning (793.2) @sv
alternative label: Fribrottning (793.2) @sv
alternative label: Grekisk-romersk brottning (793.2) @sv
broader: Voimailu. Itsepuolustus
in scheme: URN:NBN:fi:au:hklj:
notation: 793.2
preferred label: Wrestling @en
preferred label: Brottning @sv
related: Muut urheilu- ja liikuntamuodot
related: Itämaisperäiset lajit. Budo
scope note: Kreikkalais-roomalainen paini. Vapaapaini. Tässä myös sumo Painikilpailut, -säännöt, -valmennus ja -välineet Painiseurat ja -järjestöt
scope note: Grekisk-romersk stil. Fri stil. Hit också fribrottning och sumo Brottningstävlingar, regler, träning och utrustning Brottningsklubbar och brottningsförbund @sv

Golf
type: Class
type: Concept
subclass of: Palloilu
alternative label: Golf (796.7)
alternative label: Golfkentät, golf (796.7)
alternative label: Golfkentät, golfkentän hoito (796.7)
alternative label: Halligolf (796.7)
alternative label: Jäägolf (796.7)
alternative label: Minigolf (796.7)
alternative label: Pienoisgolf (796.7)
alternative label: Ratagolf (796.7)
alternative label: Bangolf (796.7) @sv
alternative label: Golfbanor, golf (796.7) @sv
alternative label: Golfbanor, golfbanornas skötsel (796.7) @sv
alternative label: Inomhusgolf (796.7) @sv
alternative label: Isgolf (796.7) @sv
alternative label: Miniatyrgolf (796.7) @sv
broader: Palloilu
in scheme: URN:NBN:fi:au:hklj:
notation: 796.7
related: Muut urheilu- ja liikuntamuodot
related: Pelit
scope note: Tässä myös pienoisgolf Golfkilpailut ja -turnaukset. Golfkentät Golfsäännöt, -valmennus ja -välineet Golfseurat ja -järjestöt
scope note: Hit också minigolf Golftävlingar och golfturneringar. Golfbanor Golfregler, golfträning och golfutrustning Golfklubbar och golfförbund @sv

Keilailu
type: Class
type: Concept
subclass of: Palloilu
alternative label: Keilahallit, keilailu (796.8)
alternative label: Keilailu (796.8)
alternative label: Bowling (796.8) @sv
alternative label: Bowlinghallar, bowling (796.8) @sv
broader: Palloilu
in scheme: URN:NBN:fi:au:hklj:
notation: 796.8
preferred label: Bowling @en
related: Muut urheilu- ja liikuntamuodot
related: Pelit
scope note: Keilailukilpailut ja -turnaukset. Keilaradat Keilailusäännöt, -valmennus ja -välineet Keilailuseurat ja -järjestöt
scope note: Bowlingtävlingar och bowlingturneringar. Bowlingbanor Bowlingregler, bowlingträning och bowlingutrustning Bowlingklubbar och bowlingförbund @sv

URN:NBN:fi:au:hklj:8.9
alternative label: Makedonian kieli, kaunokirjallisuus (8.9)
alternative label: Montenegron kieli, kaunokirjallisuus (8.9)
alternative label: Makedoniska, skönlitteratur (8.9) @sv
alternative label: Montenegrinska, skönlitteratur (8.9) @sv
related: URN:NBN:fi:au:hklj:8.8
related: URN:NBN:fi:au:hklj:8.98
related: Slaavilaisten kielten kirjallisuuden historia ja tutkimus
related: Venäjänkielisen kirjallisuuden historia ja tutkimus

Norjankielisen kirjallisuuden historia ja tutkimus
type: Class
type: Concept
subclass of: GERMAANISTEN KIELTEN KIRJALLISUUDEN HISTORIA JA TUTKIMUS
alternative label: Norjan kieli, kirjallisuuden historia (823)
alternative label: Norska, litteraturhistoria (823) @sv
broader: GERMAANISTEN KIELTEN KIRJALLISUUDEN HISTORIA JA TUTKIMUS
in scheme: URN:NBN:fi:au:hklj:
notation: 823
preferred label: Norwegian literature: history and research @en
preferred label: Norsk litteraturhistoria och forskning i norsk litteratur @sv
related: URN:NBN:fi:au:hklj:2.9
related: Pohjoismaisten kielten kirjallisuuden historia ja tutkimus

Islanninkielisen kirjallisuuden historia ja tutkimus
type: Class
type: Concept
subclass of: GERMAANISTEN KIELTEN KIRJALLISUUDEN HISTORIA JA TUTKIMUS
alternative label: Edda, folkloristiikka (824)
alternative label: Islannin kieli, kirjallisuuden historia (824)
alternative label: Saagat, kirjallisuudenhistoria, Islanti (824)
alternative label: Edda, folkloristik (824) @sv
alternative label: Isländska, litteraturhistoria (824) @sv
alternative label: Sagor, fornisändska, litteraturhistoria, Island (824) @sv
broader: GERMAANISTEN KIELTEN KIRJALLISUUDEN HISTORIA JA TUTKIMUS
in scheme: URN:NBN:fi:au:hklj:
notation: 824
preferred label: Icelandic literature: history and research @en
preferred label: Isländsk litteraturhistoria och forskning i isländsk litteratur @sv
related: URN:NBN:fi:au:hklj:2.98
related: Pohjoismaisten kielten kirjallisuuden historia ja tutkimus

Italiankielisen kirjallisuuden historia ja tutkimus
type: Class
type: Concept
subclass of: ROMAANISTEN, SLAAVILAISTEN JA BALTTILAISTEN KIELTEN KIRJALLISUUDEN HISTORIA JA TUTKIMUS
alternative label: Italian kieli, kirjallisuuden historia (832)
alternative label: Neorealismi, kirjallisuudenhistoria, Italia (832)
alternative label: Verismi, kirjallisuudenhistoria, italia (832)
alternative label: Italienska, litteraturhistoria (832) @sv
alternative label: Neorealism, litteraturhistoria, Italien (832) @sv
alternative label: Verism, litteraturhistoria, italienska (832) @sv
broader: ROMAANISTEN, SLAAVILAISTEN JA BALTTILAISTEN KIELTEN KIRJALLISUUDEN HISTORIA JA TUTKIMUS
in scheme: URN:NBN:fi:au:hklj:
notation: 832
preferred label: Italyn literature: history and research @en
preferred label: Italiensk litteraturhistoria och forskning i italiensk litteratur @sv
related: URN:NBN:fi:au:hklj:6
related: Saksankielisen kirjallisuuden historia ja tutkimus
scope note: Tässä myös esim. Sveitsin italiankielisen kirjallisuuden historia ja tutkimus
scope note: Hit också italiensk litteraturhistoria och forskning som rör italiensk litteratur i Schweiz @sv

Espanjankielisen kirjallisuuden historia ja tutkimus
type: Class
type: Concept
subclass of: ROMAANISTEN, SLAAVILAISTEN JA BALTTILAISTEN KIELTEN KIRJALLISUUDEN HISTORIA JA TUTKIMUS
alternative label: Amerikka, espanjankielisen kirjallisuden historia (833)
alternative label: Cidin laulu, folkloristiikka (833)
alternative label: Espanjan kieli, kirjallisuuden historia (833)
alternative label: Etelä-Amerikka, esp. kirjallisuuden historia (833)
alternative label: Amerika, spansk litteraturhistoria (833) @sv
alternative label: Spanska, litteraturhistoria (833) @sv
alternative label: Sydamerika, spansk litteraturhistoria (833) @sv
alternative label: Sången om El Cid, folkloristik (833) @sv
broader: ROMAANISTEN, SLAAVILAISTEN JA BALTTILAISTEN KIELTEN KIRJALLISUUDEN HISTORIA JA TUTKIMUS
in scheme: URN:NBN:fi:au:hklj:
notation: 833
preferred label: Spanish literature: history and research @en
preferred label: Spansk litteraturhistoria och forskning i spansk litteratur @sv
related: URN:NBN:fi:au:hklj:7
scope note: Tässä myös Amerikan espanjankielisen kirjallisuuden historia ja tutkimus
scope note: Hit också litteraturhistoria och forskning som rör spansk litteratur i Amerika @sv

Nykykreikankielisen kirjallisuuden historia ja tutkimus
type: Class
type: Concept
subclass of: Kreikankielisen kirjallisuuden historia ja tutkimus
alternative label: Kreikan kieli, nykykreikka, kirj.historia (842.1)
alternative label: Kreikka, kirj.historia, nykyaika (842.1)
alternative label: Nykykreikan kieli, kirjallisuuden historia (842.1)
alternative label: Grekiska, nygrekiska, litt.historia (842.1) @sv
alternative label: Grekland, litt.historia, nutiden (842.1) @sv
alternative label: Nygrekiska, litteraturhistoria (842.1) @sv
broader: Kreikankielisen kirjallisuuden historia ja tutkimus
in scheme: URN:NBN:fi:au:hklj:
notation: 842.1
preferred label: Modern Greek literature: history and research @en
preferred label: Nygrekisk litteraturhistoria och forskning i nygrekisk litteratur @sv
related: URN:NBN:fi:au:hklj:9.2
related: URN:NBN:fi:au:hklj:9.21

Hepreankielisen kirjallisuuden historia ja tutkimus
type: Class
type: Concept
subclass of: Seemiläisten kielten kirjallisuuden historia ja tutkimus
alternative label: Heprean kieli, kirjallisuuden historia (845.1)
alternative label: Ivritin kieli, kirjallisuuden historia (845.1)
alternative label: Hebreiska, litteraturhistoria (845.1) @sv
alternative label: Ivrit, litteraturhistoria (845.1) @sv
broader: Seemiläisten kielten kirjallisuuden historia ja tutkimus
in scheme: URN:NBN:fi:au:hklj:
notation: 845.1
preferred label: Hebrew literature: history and research @en
preferred label: Hebreisk litteraturhistoria och forskning i hebreisk litteratur @sv
related: URN:NBN:fi:au:hklj:9.5
related: URN:NBN:fi:au:hklj:9.52

Arabiankielisen kirjallisuuden historia ja tutkimus
type: Class
type: Concept
subclass of: Seemiläisten kielten kirjallisuuden historia ja tutkimus
alternative label: Arabian kieli, kirjallisuuden historia (845.2)
alternative label: Arabistiikka, kirjallisuuden historia (845.2)
alternative label: Arabiska, litteraturhistoria (845.2) @sv
alternative label: Arabistik, litteraturhistoria (845.2) @sv
broader: Seemiläisten kielten kirjallisuuden historia ja tutkimus
in scheme: URN:NBN:fi:au:hklj:
notation: 845.2
preferred label: Arabic literature: history and research @en
preferred label: Arabisk litteraturhistoria och forskning i arabisk litteratur @sv
related: URN:NBN:fi:au:hklj:9.5
related: URN:NBN:fi:au:hklj:9.51

Kiinankielisen kirjallisuuden historia ja tutkimus
type: Class
type: Concept
subclass of: MUIDEN KIELTEN KIRJALLISUUDEN HISTORIA JA TUTKIMUS
alternative label: Afroaasialaiset kielet, kirjallisuudenhistoria (845 ... 849)
alternative label: Kiinan kieli, kirjallisuuden historia (847)
alternative label: Sinologia, Kiinan kirjallisuuden historia (847)
alternative label: Tiibetiläis-burmalaiset kielet, kiinan kieli (847)
alternative label: Afroasiatiska språk, litteraturhistoria (845 ... 849) @sv
alternative label: Kinesiska, litteraturhistoria (847) @sv
alternative label: Sinologi, Kina, litteraturhistoria (847) @sv
alternative label: Tibeto-burmanska språk, kinesiska (847) @sv
broader: MUIDEN KIELTEN KIRJALLISUUDEN HISTORIA JA TUTKIMUS
in scheme: URN:NBN:fi:au:hklj:
notation: 847
preferred label: Chinese literature: history and research @en
preferred label: Kinesisk litteraturhistoria och forskning i kinesisk litteratur @sv
related: URN:NBN:fi:au:hklj:9.7
related: URN:NBN:fi:au:hklj:9.71

Iranilaiset kielet
type: Class
type: Concept
subclass of: Indoiraaniset kielet
alternative label: Afgaanin kieli (861.5)
alternative label: Afgaanin kieli, kielitiede (861.5)
alternative label: Avestan kieli (861.5)
alternative label: Darin kieli (861.5)
alternative label: Darin kieli, kielitiede (861.5)
alternative label: Farsin kieli (861.5)
alternative label: Farsin kieli, kielitiede (861.5)
alternative label: Iranilaiset kielet (861.5)
alternative label: Iranilaiset kielet, kielitiede (861.5)
alternative label: Jaghnobin kieli (861.5)
alternative label: Kurdin kieli (861.5)
alternative label: Kurdin kieli, kielitiede (861.5)
alternative label: Osseetin kieli (861.5)
alternative label: Pamirin kieli (861.5)
alternative label: Paston kieli (861.5)
alternative label: Paston kieli, kielitiede (861.5)
alternative label: Pehlevin kieli, muinainen (861.5)
alternative label: Persian kieli (861.5)
alternative label: Persian kieli, kielitiede (861.5)
alternative label: Tadzikin kieli (861.5)
alternative label: Afghanska (861.5) @sv
alternative label: Afghanska, lingvistik (861.5) @sv
alternative label: Avestiska (861.5) @sv
alternative label: Dari (861.5) @sv
alternative label: Dari, lingvistik (861.5) @sv
alternative label: Farsi (861.5) @sv
alternative label: Farsi, lingvistik (861.5) @sv
alternative label: Iranska språk (861.5) @sv
alternative label: Iranska språk, lingvistik (861.5) @sv
alternative label: Jaghnob, språket (861.5) @sv
alternative label: Kurdiska (861.5) @sv
alternative label: Kurdiska, lingvistik (861.5) @sv
alternative label: Ossetiska (861.5) @sv
alternative label: Pamir, språk (861.5) @sv
alternative label: Pashto (861.5) @sv
alternative label: Pashto, lingvistik (861.5) @sv
alternative label: Pehlevi, forntida (861.5) @sv
alternative label: Persiska (861.5) @sv
alternative label: Persiska, lingvistik (861.5) @sv
alternative label: Tadzjikiska (861.5) @sv
broader: Indoiraaniset kielet
in scheme: URN:NBN:fi:au:hklj:
notation: 861.5
preferred label: Greek @en
preferred label: Iranska språk @sv
scope note: Belutsin, darin, kurdin, osseetin, pamirin, paston, persian ja tadzikin kieli
scope note: Baluchiska, dari, jaghnob, kurdiska, ossetiska, pamir, pashto, persiska och tadjikiska @sv

Kreikan kieli
type: Class
type: Concept
subclass of: URN:NBN:fi:au:hklj:860
alternative label: Indoeurooppalaiset kielet, eri indoeurooppalaiset kielet (861 ... 879 +)
alternative label: Klassillinen kreikka (862)
alternative label: Klassillinen kreikka, kielitiede (862)
alternative label: Klassinen kreikka (862)
alternative label: Klassinen kreikka, kielitiede (862)
alternative label: Klassiset kielet, kreikka (862)
alternative label: Kreikan kieli, muinaiskreikka (862)
alternative label: Muinaiskreikan kieli (862)
alternative label: Muinaiskreikan kieli, kielitiede (862)
alternative label: Muinaiskreikka (862)
alternative label: Muinaiskreikka, kielitiede (862)
alternative label: Troijan sota, kirjallisuudenhistoria, kreikka (862)
alternative label: Grekiska, forngrekiska (862) @sv
alternative label: Indoeuropeiska språk, olika indoeuropeiska språk (861 ... 879 +) @sv
alternative label: Klassisk grekiska (862) @sv
alternative label: Klassisk grekiska, lingvistik (862) @sv
alternative label: Klassiska språk, grekiska (862) @sv
alternative label: Trojanska kriget, litteraturhistoria, grekiska (862) @sv
broader: URN:NBN:fi:au:hklj:860
in scheme: URN:NBN:fi:au:hklj:
narrower: Nykykreikan kieli
notation: 862
preferred label: Modern Greek @en
preferred label: Grekiska @sv
scope note: Muinaiskreikan kieli Teokset, jotka koskevat sekä muinais- että nykykreikan kieltä
scope note: Forngrekiska Verk som handlar om både forngrekiska och modern grekiska @sv

Tanskan kieli
type: Class
type: Concept
subclass of: Pohjoismaiset kielet
alternative label: Fäärin kieli (871.1)
alternative label: Fäärin kieli, kielitiede (871.1)
alternative label: Tanskan kieli (871.1)
alternative label: Tanskan kieli, kielitiede (871.1)
alternative label: Danska (871.1) @sv
alternative label: Danska, lingvistik (871.1) @sv
alternative label: Färöiska (871.1) @sv
alternative label: Färöiska, lingvistik (871.1) @sv
broader: Pohjoismaiset kielet
in scheme: URN:NBN:fi:au:hklj:
notation: 871.1
preferred label: Danish @en
preferred label: Danska @sv
related: URN:NBN:fi:au:hklj:860
scope note: Tässä myös fäärin kieli
scope note: Hit också färöiska @sv

Saksan kielen kielioppi ja semantiikka
type: Class
type: Concept
subclass of: Saksan kieli
alternative label: Saksan kieli, kielioppi (874.5)
alternative label: Tyska, grammatik (874.5) @sv
broader: Saksan kieli
in scheme: URN:NBN:fi:au:hklj:
notation: 874.5
preferred label: German dictionaries @en
preferred label: Tysk grammatik och betydelselära (semantik) @sv
related: Kielioppi. Muoto-oppi. Sanaoppi. Semantiikka
related: URN:NBN:fi:au:hklj:860
scope note: Saksan kielen kielioppi, muoto-oppi, sanaoppi ja semantiikka Saksan kielen kieliopin oppi- ja harjoituskirjat Sanaluokat. Sananmuodostus. Taivutus. Lauseoppi eli syntaksi
scope note: Tysk betydelselära (semantik), formlära (morfologi), satslära (syntax) och ordlära (lexikologi) Läroböcker och övningsböcker i tysk grammatik Ordklasser. Ordbildning. Böjning. Satslära (syntax) @sv

Venäjän kieli
type: Class
type: Concept
subclass of: Slaavilaiset kielet
alternative label: Kielikurssit, venäjän kieli (879.1)
alternative label: Kuullun ymmärtäminen, venäjän kieli (879.1)
alternative label: Kuullunymmärtäminen, venäjän kieli (879.1)
alternative label: Luetun ymmärtäminen, venäjän kieli (879.1)
alternative label: Venäjän kieli (879.1)
alternative label: Venäjän kieli, kielitiede (879.1)
alternative label: Ylioppilastehtävät, venäjän kieli (879.1)
alternative label: Hörförståelse, ryska (879.1) @sv
alternative label: Läsförståelse, ryska (879.1) @sv
alternative label: Ryska (879.1) @sv
alternative label: Ryska, lingvistik (879.1) @sv
alternative label: Språkkurser, ryska (879.1) @sv
alternative label: Studentuppgifter, ryska (879.1) @sv
broader: Slaavilaiset kielet
in scheme: URN:NBN:fi:au:hklj:
notation: 879.1
preferred label: Russian @en
preferred label: Ryska @sv
related: URN:NBN:fi:au:hklj:860
related: Ukrainan ja valkovenäjän kieli
scope note: Tässä myös
scope note: Hit också @sv

Tsekin ja slovakin kieli
type: Class
type: Concept
subclass of: Slaavilaiset kielet
alternative label: Slovakin kieli (879.3)
alternative label: Slovakin kieli, kielitiede (879.3)
alternative label: Tsekin kieli (879.3)
alternative label: Tsekin kieli, kielitiede (879.3)
alternative label: Slovakiska (879.3) @sv
alternative label: Slovakiska, lingvistik (879.3) @sv
alternative label: Tjeckiska (879.3) @sv
alternative label: Tjeckiska, lingvistik (879.3) @sv
broader: Slaavilaiset kielet
in scheme: URN:NBN:fi:au:hklj:
notation: 879.3
preferred label: Czech and Slovak @en
preferred label: Tjeckiska och slovakiska @sv
related: URN:NBN:fi:au:hklj:860

Ukrainan ja valkovenäjän kieli
type: Class
type: Concept
subclass of: Slaavilaiset kielet
alternative label: Ukrainan kieli (879.6)
alternative label: Ukrainan kieli, kielitiede (879.6)
alternative label: Valkovenäjän kieli (879.6)
alternative label: Valkovenäjän kieli, kielitiede (879.6)
alternative label: Ukrainska (879.6) @sv
alternative label: Ukrainska, lingvistik (879.6) @sv
alternative label: Vitryska (879.6) @sv
alternative label: Vitryska, lingvistik (879.6) @sv
broader: Slaavilaiset kielet
in scheme: URN:NBN:fi:au:hklj:
notation: 879.6
preferred label: Ukrainian and Byelorussian @en
preferred label: Ukrainska och vitryska @sv
related: URN:NBN:fi:au:hklj:860
related: Venäjän kieli

Ugrilaiset kielet
type: Class
type: Concept
subclass of: URALILAISET KIELET. ALTAILAISET KIELET
alternative label: Hantin kieli (887)
alternative label: Mansin kieli (887)
alternative label: Obinugrilaiset kielet (887)
alternative label: Ostjakin kieli (887)
alternative label: Ostjakin kieli, kielitiede (887)
alternative label: Suomalais-ugrilaiset kielet (881 ... 887 +)
alternative label: Suomalais-ugrilaiset kielet, kielitiede (881 ... 887 +)
alternative label: Ugrilaiset kielet (887 +)
alternative label: Ugrilaiset kielet, kielitiede (887 +)
alternative label: Vogulin kieli (887)
alternative label: Vogulin kieli, kielitiede (887)
alternative label: Chanti (887) @sv
alternative label: Finsk-ugriska språk (881 ... 887 +) @sv
alternative label: Finsk-ugriska språk, lingvistik (881 ... 887 +) @sv
alternative label: Mansi (887) @sv
alternative label: Ob-ugriska språk (887) @sv
alternative label: Ostjakiska (887) @sv
alternative label: Ostjakiska, lingvistik (887) @sv
alternative label: Ugriska språk (887 +) @sv
alternative label: Ugriska språk, lingvistik (887 +) @sv
alternative label: Voguliska (887) @sv
alternative label: Voguliska, lingvistik (887) @sv
broader: URALILAISET KIELET. ALTAILAISET KIELET
in scheme: URN:NBN:fi:au:hklj:
narrower: Unkarin kieli
notation: 887
preferred label: Ugric languages @en
preferred label: Ugriska språk @sv
scope note: Ostjakin (hantin) ja vogulin (mansin) kieli
scope note: Ostjakiska (chanti) och voguliska (mansi) @sv

Sinettitiede
type: Class
type: Concept
subclass of: Historian aputieteet
alternative label: Leimasimet, sigillografia (911.7)
alternative label: Leimat, sigillografia (911.7)
alternative label: Sigillografia (911.7)
alternative label: Sinetit (911.7)
alternative label: Sinettitiede (911.7)
alternative label: Sigill (911.7) @sv
alternative label: Sigillografi (911.7) @sv
alternative label: Sigillvetenskap (911.7) @sv
alternative label: Stämplar, leimasimet, sigillografi (911.7) @sv
alternative label: Stämplar, leimat, sigillografi (911.7) @sv
broader: Historian aputieteet
in scheme: URN:NBN:fi:au:hklj:
notation: 911.7
preferred label: Sigillography @en
preferred label: Sigillografi @sv
related: Historian tutkimusmenetelmät
related: Vaakunatiede. Liput
scope note: Sigillografia Eri maanosien, maiden, alueiden ja aikakausien sinetit
scope note: Sigillografi (sfragistik) Sigill i olika världsdelar, länder och geografiska områden samt under olika tidsperioder @sv

Ruotsin historia 1523-1718
type: Class
type: Concept
subclass of: URN:NBN:fi:au:hklj:930
alternative label: Hollikyyti, Ruotsin historia (931 ... 936)
alternative label: Karoliinit, Ruotsin historia (933)
alternative label: Kolmikymmenvuotinen sota, Ruotsin historia (933)
alternative label: Kruununkyyti, Ruotsin historia (931 ... 936)
alternative label: Kyytilaitos, Ruotsin historia (931 ... 936)
alternative label: Reservikyyti, Ruotsin historia (931 ... 936)
alternative label: Ruotsalaiset, Ruotsi, historia (931 ... 936)
alternative label: Ruotsi, historia (931 ... 936)
alternative label: Suurvalta-aika, Ruotsin historia (933)
alternative label: Valtaneuvoskunta, Ruotsin historia (931 ... 934)
alternative label: Hållskjuts, Sveriges historia (931 ... 936) @sv
alternative label: Karoliner, Sveriges historia (933) @sv
alternative label: Kronoskjuts, Sveriges historia (931 ... 936) @sv
alternative label: Riksrådsförsamling, Sveriges historia (931 ... 934) @sv
alternative label: Skjutsväsen, Sveriges historia (931 ... 936) @sv
alternative label: Skjutsväsendet, Sveriges historia (931 ... 936) @sv
alternative label: Stormaktstiden, Sveriges historia (933) @sv
alternative label: Svenskar, Sverige, historia (931 ... 936) @sv
alternative label: Sverige, historia (931 ... 936) @sv
alternative label: Trettioåriga kriget, Sveriges historia (933) @sv
broader: URN:NBN:fi:au:hklj:930
in scheme: URN:NBN:fi:au:hklj:
notation: 933
preferred label: Sweden’s history 1523–1718 @en
preferred label: Sveriges historia 1523–1718 @sv
related: Ruotsi
related: URN:NBN:fi:au:hklj:989
scope note: Kustaa Vaasan valtaistuimelle noususta Kaarle XII:n kuolemaan
scope note: Från Gustav Vasas tronbestigning till Karl XII:s död @sv

Ruotsin historia 1719-1809
type: Class
type: Concept
subclass of: URN:NBN:fi:au:hklj:930
alternative label: Hollikyyti, Ruotsin historia (931 ... 936)
alternative label: Kruununkyyti, Ruotsin historia (931 ... 936)
alternative label: Kustavilainen aika, Ruotsin historia (934)
alternative label: Kyytilaitos, Ruotsin historia (931 ... 936)
alternative label: Reservikyyti, Ruotsin historia (931 ... 936)
alternative label: Ruotsalaiset, Ruotsi, historia (931 ... 936)
alternative label: Ruotsi, historia (931 ... 936)
alternative label: Valtaneuvoskunta, Ruotsin historia (931 ... 934)
alternative label: Vapauden aika, Ruotsin historia (934)
alternative label: Frihetstiden, Sveriges historia (934) @sv
alternative label: Gustavianska tiden, Sveriges historia (934) @sv
alternative label: Hållskjuts, Sveriges historia (931 ... 936) @sv
alternative label: Kronoskjuts, Sveriges historia (931 ... 936) @sv
alternative label: Riksrådsförsamling, Sveriges historia (931 ... 934) @sv
alternative label: Skjutsväsen, Sveriges historia (931 ... 936) @sv
alternative label: Skjutsväsendet, Sveriges historia (931 ... 936) @sv
alternative label: Svenskar, Sverige, historia (931 ... 936) @sv
alternative label: Sverige, historia (931 ... 936) @sv
broader: URN:NBN:fi:au:hklj:930
in scheme: URN:NBN:fi:au:hklj:
notation: 934
preferred label: Sweden’s history 1719–1809 @en
preferred label: Sveriges historia 1719–1809 @sv
related: Ruotsi
related: URN:NBN:fi:au:hklj:989
scope note: Kaarle XII:n kuolemaa seuranneesta ajasta Haminan rauhaan
scope note: Från tiden efter Karl XII:s död till freden i Fredrikshamn @sv

Saksan esi- ja varhaishistoria vuoteen 843
type: Class
type: Concept
subclass of: SAKSAN HISTORIA
broader: SAKSAN HISTORIA
in scheme: URN:NBN:fi:au:hklj:
notation: 941
preferred label: Germany’s pre- and ancient history to 843 @en
preferred label: Tysklands förhistoria och fornhistoria till 843 @sv
related: URN:NBN:fi:au:hklj:909
related: URN:NBN:fi:au:hklj:919
scope note: Saksan arkeologian yleisteokset
scope note: Allmänna verk om Tysklands arkeologi @sv

Saksan historia 1519-1647
type: Class
type: Concept
subclass of: SAKSAN HISTORIA
broader: SAKSAN HISTORIA
in scheme: URN:NBN:fi:au:hklj:
notation: 943
preferred label: Germany’s history 1519–1647 @en
preferred label: Tysklands historia 1519–1647 @sv
related: URN:NBN:fi:au:hklj:909
related: URN:NBN:fi:au:hklj:919

Saksan historia 1648-1814
type: Class
type: Concept
subclass of: SAKSAN HISTORIA
broader: SAKSAN HISTORIA
in scheme: URN:NBN:fi:au:hklj:
notation: 944
preferred label: Germany’s history 1648–1814 @en
preferred label: Tysklands historia 1648–1814 @sv
related: URN:NBN:fi:au:hklj:909
related: URN:NBN:fi:au:hklj:919

Saksan historia 1914-1932
type: Class
type: Concept
subclass of: Saksan historia 1914-1945
alternative label: Weimarin tasavalta, historia (946.1)
alternative label: Weimarrepubliken, historia (946.1) @sv
broader: Saksan historia 1914-1945
in scheme: URN:NBN:fi:au:hklj:
notation: 946.1
preferred label: Germany’s history 1914–1932 @en
preferred label: Tysklands historia 1914–1932 @sv
related: URN:NBN:fi:au:hklj:909
related: URN:NBN:fi:au:hklj:919

Saksan historia 1933-1938
type: Class
type: Concept
subclass of: Saksan historia 1914-1945
broader: Saksan historia 1914-1945
in scheme: URN:NBN:fi:au:hklj:
notation: 946.2
preferred label: Germany’s history 1933–1938 @en
preferred label: Tysklands historia 1933–1938 @sv
related: URN:NBN:fi:au:hklj:909
related: URN:NBN:fi:au:hklj:919

Saksan historia 1939-1945
type: Class
type: Concept
subclass of: Saksan historia 1914-1945
broader: Saksan historia 1914-1945
in scheme: URN:NBN:fi:au:hklj:
notation: 946.3
preferred label: Germany’s history 1939–1945 @en
preferred label: Tysklands historia 1939–1945 @sv
related: URN:NBN:fi:au:hklj:909
related: URN:NBN:fi:au:hklj:919

Saksan historia 1946-
type: Class
type: Concept
subclass of: SAKSAN HISTORIA
alternative label: BRD, historia (948)
alternative label: DDR, historia (948)
alternative label: Fasismi, Saksan historia (946 ... 948)
alternative label: Fasistit, Saksan historia (946 ... 948)
alternative label: Itä-Berliini, historia (948)
alternative label: Itä-Saksa, historia (948)
alternative label: Jaettu valtio, Saksan historia 1946- (948)
alternative label: Kansallissosialismi, Saksan historia (946 ... 948)
alternative label: Kansallissosialistit, Saksan historia (946 ... 948)
alternative label: Kirkkotaistelu, kansallissosialismi, Saksan historia (946 ... 948)
alternative label: Länsi-Berliini, historia (948)
alternative label: Länsi-Saksa, historia (948)
alternative label: Natsismi, Saksan historia (946 ... 948)
alternative label: Natsit, Saksan historia (946 ... 948)
alternative label: Saksan demokraattinen tasavalta, historia (948)
alternative label: Saksan liittotasavalta, historia (948)
alternative label: Delad stat, Tysklands historia 1946- (948) @sv
alternative label: Fascism, Tysklands historia (946 ... 948) @sv
alternative label: Fascister, Tysklands historia (946 ... 948) @sv
alternative label: Förbundsrepubliken Tyskland, historia (948) @sv
alternative label: Kyrkokamp, nationalsocialism, Tysklands historia (946 ... 948) @sv
alternative label: Nationalsocialism, Tysklands historia (946 ... 948) @sv
alternative label: Nationalsocialister, Tysklands historia (946 ... 948) @sv
alternative label: Nazism, Tysklands historia (946 ... 948) @sv
alternative label: Nazister, Tysklands historia (946 ... 948) @sv
alternative label: Tyska demokratiska republiken, historia (948) @sv
alternative label: Västberlin, historia (948) @sv
alternative label: Västtyskland, historia (948) @sv
alternative label: Östberlin, historia (948) @sv
alternative label: Östtyskland, historia (948) @sv
broader: SAKSAN HISTORIA
in scheme: URN:NBN:fi:au:hklj:
notation: 948
preferred label: Germany’s history 1946– @en
preferred label: Tysklands historia 1946– @sv
related: URN:NBN:fi:au:hklj:909
related: URN:NBN:fi:au:hklj:919

Iso-Britannian alueen esi- ja varhaishistoria vuoteen 1066
type: Class
type: Concept
subclass of: BRITTEIN SAARTEN HISTORIA
alternative label: Piktit, historia (951)
alternative label: Pikter, historia (951) @sv
broader: BRITTEIN SAARTEN HISTORIA
in scheme: URN:NBN:fi:au:hklj:
notation: 951
preferred label: Britain’s pre- and ancient history to 1066 @en
preferred label: Storbritanniens förhistoria och fornhistoria till 1066 @sv
related: URN:NBN:fi:au:hklj:909
related: URN:NBN:fi:au:hklj:919
scope note: Iso-Britannian alueen arkeologian yleisteokset
scope note: Allmänna verk om Brittiska öarnas arkeologi @sv

Iso-Britannian alueen keskiaika 1067-1484
type: Class
type: Concept
subclass of: BRITTEIN SAARTEN HISTORIA
broader: BRITTEIN SAARTEN HISTORIA
in scheme: URN:NBN:fi:au:hklj:
notation: 952
preferred label: Britain’s middle ages 1067–1484 @en
preferred label: Storbritanniens medeltid 1067–1484 @sv
related: URN:NBN:fi:au:hklj:909
related: URN:NBN:fi:au:hklj:919

Iso-Britannian alueen historia 1688-1814
type: Class
type: Concept
subclass of: BRITTEIN SAARTEN HISTORIA
broader: BRITTEIN SAARTEN HISTORIA
in scheme: URN:NBN:fi:au:hklj:
notation: 954
preferred label: Britain’s history 1688–1814 @en
preferred label: Storbritanniens historia 1688–1814 @sv
related: URN:NBN:fi:au:hklj:909
related: URN:NBN:fi:au:hklj:919
scope note: 1688 vallankumouksesta Pariisin rauhaan 1814
scope note: Från revolutionen 1688 till freden i Paris 1814 @sv

Iso-Britannian historia 1914-1938
type: Class
type: Concept
subclass of: BRITTEIN SAARTEN HISTORIA
broader: BRITTEIN SAARTEN HISTORIA
in scheme: URN:NBN:fi:au:hklj:
notation: 956
preferred label: Britain’s history 1914–1938 @en
preferred label: Storbritanniens historia 1914–1938 @sv
related: URN:NBN:fi:au:hklj:909
related: URN:NBN:fi:au:hklj:919

Iso-Britannian historia 1939-
type: Class
type: Concept
subclass of: BRITTEIN SAARTEN HISTORIA
broader: BRITTEIN SAARTEN HISTORIA
in scheme: URN:NBN:fi:au:hklj:
notation: 957
preferred label: Britain’s history 1939– @en
preferred label: Storbritanniens historia 1939– @sv
related: URN:NBN:fi:au:hklj:909
related: URN:NBN:fi:au:hklj:919

Ranskan historia 1494-1588
type: Class
type: Concept
subclass of: RANSKAN HISTORIA
alternative label: Hugenotit, Ranskan historia (963 ... 968)
alternative label: Hugenotter, Frankrikes historia (963 ... 968) @sv
broader: RANSKAN HISTORIA
in scheme: URN:NBN:fi:au:hklj:
notation: 963
preferred label: France’s history 1494–1588 @en
preferred label: Frankrikes historia 1494–1588 @sv
scope note: Ranskan renessanssin aika. Uskonsotien aika
scope note: Franska renässanstiden. Religionskrigens tid @sv

Ranskan historia 1815-1913
type: Class
type: Concept
subclass of: RANSKAN HISTORIA
alternative label: Hugenotit, Ranskan historia (963 ... 968)
alternative label: Waterloon taistelu (966)
alternative label: Hugenotter, Frankrikes historia (963 ... 968) @sv
alternative label: Slaget vid Waterloo (966) @sv
broader: RANSKAN HISTORIA
in scheme: URN:NBN:fi:au:hklj:
notation: 966
preferred label: France’s history 1815–1913 @en
preferred label: Frankrikes historia 1815–1913 @sv

Kaakkois-Aasian historia
type: Class
type: Concept
subclass of: Aasian historia
alternative label: Akhat, Kaakkois-Aasia, historia (981.3)
alternative label: Bali, historia (981.3)
alternative label: Borneo, historia (981.3)
alternative label: Brunei, historia (981.3)
alternative label: Burma, historia (981.3)
alternative label: Celebes, historia (981.3)
alternative label: Filippiinit, historia (981.3)
alternative label: Indokiina, historia (981.3)
alternative label: Indonesia, historia (981.3)
alternative label: Itä-Intia, historia (981.3)
alternative label: Itä-Timor, historia (981.3)
alternative label: Jaava, historia (981.3)
alternative label: Jaettu valtio, Vietnamin historia (981.3)
alternative label: Kaakkois-Aasia, historia (981.3)
alternative label: Kambodza, historia (981.3)
alternative label: Kambodža, historia (981.3)
alternative label: Kamputsea, historia (981.3)
alternative label: Malaijien saaristo, historia (981.3)
alternative label: Malakan niemimaa, historia (981.3)
alternative label: Malesia, historia (981.3)
alternative label: Molukit, historia (981.3)
alternative label: Myanmar, historia (981.3)
alternative label: Singapore, historia (981.3)
alternative label: Sumatra, historia (981.3)
alternative label: Sundasaaret, historia (981.3)
alternative label: Taka-Intia, historia (981.3)
alternative label: Thaimaa, historia (981.3)
alternative label: Timor, historia (981.3)
alternative label: Vietnam, historia (981.3)
alternative label: Akha, Sydostasien, historia (981.3) @sv
alternative label: Bortre Indien, historia (981.3) @sv
alternative label: Delad stat, Vietnamese history (981.3) @sv
alternative label: Filippinerna, historia (981.3) @sv
alternative label: Indokina, historia (981.3) @sv
alternative label: Indonesien, historia (981.3) @sv
alternative label: Java, historia (981.3) @sv
alternative label: Kambodja, historia (981.3) @sv
alternative label: Kampuchea, historia (981.3) @sv
alternative label: Malackahalvön, historia (981.3) @sv
alternative label: Malajiska övärlden, historia (981.3) @sv
alternative label: Malaysia, historia (981.3) @sv
alternative label: Moluckerna, historia (981.3) @sv
alternative label: Ostindien, historia (981.3) @sv
alternative label: Sundaöarna, historia (981.3) @sv
alternative label: Sydostasien, historia (981.3) @sv
alternative label: Thailand, historia (981.3) @sv
alternative label: Östra Timor, historia (981.3) @sv
broader: Aasian historia
in scheme: URN:NBN:fi:au:hklj:
notation: 981.3
preferred label: South-East Asia's history @en
preferred label: Sydöstasiens historia @sv
related: AASIA
related: Kaakkois-Aasia
scope note: Brunein, Burman (myanmarin), Filippiinien, Indonesian, Kambodzan, Laosin, Malesian, Singaporen, Thaimaan ja Vietnamin historia
scope note: Bruneis, Burmas (Myanmars), Filippinernas, Indonesiens, Kambodjas, Laos, Malaysias, Singapores, Thailands och Vietnams historia @sv

Suomenkieliset sadut (Kaunoluokka)
type: Class
type: Concept
type: FormClass
subclass of: SUOMENKIELINEN KAUNOKIRJALLISUUS (Kaunoluokka)
broader: SUOMENKIELINEN KAUNOKIRJALLISUUS (Kaunoluokka)
in scheme: URN:NBN:fi:au:hklj:
narrower: Suomenkieliset kuvakirjat (Kaunoluokka)
notation: 1.7
preferred label: Fairy tales (Fiction class) @en
preferred label: Sagor på finska (Skönklass) @sv
scope note: Sadut. Satuelokuvat. Ääneen luetut sadut
scope note: Sagor. Sagofilmer. Inlästa sagor @sv

Suomenkieliset kuvakirjat (Kaunoluokka)
type: Class
type: Concept
type: FormClass
subclass of: Suomenkieliset sadut (Kaunoluokka)
broader: Suomenkieliset sadut (Kaunoluokka)
in scheme: URN:NBN:fi:au:hklj:
narrower: Suomenkieliset sarjakuvat ja animaatioelokuvat (Kaunoluokka)
notation: 1.79
preferred label: Picture books (Fiction class) @en
preferred label: Bilderböcker på finska (Skönklass) @sv
scope note: Kuvakirjat. Tässä myös tekstiltään runomuotoiset kuvakirjat Tässä myös aikuisille tarkoitetut kuvakirjat ja kuvalliset vitsit
scope note: Bilderböcker. Hit också bilderböcker med text i versform Hit också bilderböcker och samlingar av illustrerade vitsar avsedda för vuxna @sv

Vironkieliset sadut, kuvakirjat ja sarjakuvat (Kaunoluokka)
type: Class
type: Concept
type: FormClass
subclass of: Vironkielinen kaunokirjallisuus (Kaunoluokka)
broader: Vironkielinen kaunokirjallisuus (Kaunoluokka)
in scheme: URN:NBN:fi:au:hklj:
notation: 1.87
preferred label: Fairy tales. Picture books. Comics (Fiction class) @en
preferred label: Sagor, bilderböcker och tecknade serier på estniska (Skönklass) @sv
scope note: Sadut. Satuelokuvat. Ääneen luetut sadut Kuvakirjat, myös tekstiltään runomuotoiset Tässä myös aikuisille tarkoitetut kuvakirjat ja kuvalliset vitsit Fiktiiviset sarjakuvat Fiktiiviset piirretyt, animaatio- ja nukke-elokuvat
scope note: Sagor. Sagofilmer. Inlästa sagor Bilderböcker, också med text i versform Hit också bilderböcker och samlingar av illustrerade vitsar avsedda för vuxna Fiktiva tecknade serier Fiktiva tecknade filmer, animationsfilmer och dockfilmer @sv

Unkarinkieliset sadut, kuvakirjat ja sarjakuvat (Kaunoluokka)
type: Class
type: Concept
type: FormClass
subclass of: Unkarinkielinen kaunokirjallisuus (Kaunoluokka)
broader: Unkarinkielinen kaunokirjallisuus (Kaunoluokka)
in scheme: URN:NBN:fi:au:hklj:
notation: 1.947
preferred label: Fairy stories. Picture books. Comics (Fiction class) @en
preferred label: Sagor, bilderböcker och tecknade serier på ungerska (Skönklass) @sv
scope note: Sadut. Satuelokuvat. Ääneen luetut sadut Kuvakirjat, myös tekstiltään runomuotoiset Tässä myös aikuisille tarkoitetut kuvakirjat ja kuvalliset vitsit Fiktiiviset sarjakuvat Fiktiiviset piirretyt, animaatio- ja nukke-elokuvat
scope note: Sagor. Sagofilmer. Inlästa sagor Bilderböcker, också med text i versform Hit också bilderböcker och samlingar av illustrerade vitsar avsedda för vuxna Fiktiva tecknade serier Fiktiva tecknade filmer, animationsfilmer och dockfilmer @sv

Ruotsinkieliset sadut (Kaunoluokka)
type: Class
type: Concept
type: FormClass
subclass of: RUOTSINKIELINEN KAUNOKIRJALLISUUS (Kaunoluokka)
broader: RUOTSINKIELINEN KAUNOKIRJALLISUUS (Kaunoluokka)
in scheme: URN:NBN:fi:au:hklj:
narrower: Ruotsinkieliset kuvakirjat (Kaunoluokka)
notation: 2.7
preferred label: Fairy stories (Fiction class) @en
preferred label: Sagor på svenska (Skönklass) @sv
scope note: Sadut. Satuelokuvat. Ääneen luetut sadut
scope note: Sagor. Sagofilmer. Inlästa sagor @sv

Ruotsinkieliset kuvakirjat (Kaunoluokka)
type: Class
type: Concept
type: FormClass
subclass of: Ruotsinkieliset sadut (Kaunoluokka)
broader: Ruotsinkieliset sadut (Kaunoluokka)
in scheme: URN:NBN:fi:au:hklj:
narrower: Ruotsinkieliset sarjakuvat ja animaatioelokuvat (Kaunoluokka)
notation: 2.79
preferred label: Picture books (Fiction class) @en
preferred label: Bilderböcker på svenska (Skönklass) @sv
scope note: Kuvakirjat. Tässä myös tekstiltään runomuotoiset kuvakirjat Tässä myös aikuisille tarkoitetut kuvakirjat ja kuvalliset vitsit
scope note: Bilderböcker. Hit också bilderböcker med text i versform Hit också bilderböcker och samlingar av illustrerade vitsar avsedda för vuxna @sv

Tanskankieliset sadut (Kaunoluokka)
type: Class
type: Concept
type: FormClass
subclass of: Tanskankielinen kaunokirjallisuus (Kaunoluokka)
broader: Tanskankielinen kaunokirjallisuus (Kaunoluokka)
in scheme: URN:NBN:fi:au:hklj:
narrower: Tanskankieliset kuvakirjat (Kaunoluokka)
notation: 2.87
preferred label: Fairy stories (Fiction class) @en
preferred label: Sagor på danska (Skönklass) @sv
scope note: Sadut. Satuelokuvat. Ääneen luetut sadut
scope note: Sagor. Sagofilmer. Inlästa sagor @sv

Tanskankieliset kuvakirjat (Kaunoluokka)
type: Class
type: Concept
type: FormClass
subclass of: Tanskankieliset sadut (Kaunoluokka)
broader: Tanskankieliset sadut (Kaunoluokka)
in scheme: URN:NBN:fi:au:hklj:
narrower: Tanskankieliset sarjakuvat ja animaatioelokuvat (Kaunoluokka)
notation: 2.879
preferred label: Picture books (Fiction class) @en
preferred label: Bilderböcker på danska (Skönklass) @sv
scope note: Kuvakirjat. Tässä myös tekstiltään runomuotoiset kuvakirjat Tässä myös aikuisille tarkoitetut kuvakirjat ja kuvalliset vitsit
scope note: Bilderböcker. Hit också bilderböcker med text i versform Hit också bilderböcker och samlingar av illustrerade vitsar avsedda för vuxna @sv

Norjankieliset sadut (Kaunoluokka)
type: Class
type: Concept
type: FormClass
subclass of: Norjankielinen kaunokirjallisuus (Kaunoluokka)
broader: Norjankielinen kaunokirjallisuus (Kaunoluokka)
in scheme: URN:NBN:fi:au:hklj:
narrower: Norjankieliset kuvakirjat (Kaunoluokka)
notation: 2.97
preferred label: Fairy stories (Fiction class) @en
preferred label: Sagor på norska (Skönklass) @sv
scope note: Sadut. Satuelokuvat. Ääneen luetut sadut
scope note: Sagor. Sagofilmer. Inlästa sagor @sv

Norjankieliset kuvakirjat (Kaunoluokka)
type: Class
type: Concept
type: FormClass
subclass of: Norjankieliset sadut (Kaunoluokka)
broader: Norjankieliset sadut (Kaunoluokka)
in scheme: URN:NBN:fi:au:hklj:
narrower: Norjankieliset sarjakuvat ja animaatioelokuvat (Kaunoluokka)
notation: 2.979
preferred label: Picture books (Fiction class) @en
preferred label: Bilderböcker på norska (Skönklass) @sv
scope note: Kuvakirjat. Tässä myös tekstiltään runomuotoiset kuvakirjat Tässä myös aikuisille tarkoitetut kuvakirjat ja kuvalliset vitsit
scope note: Bilderböcker. Hit också bilderböcker med text i versform Hit också bilderböcker och samlingar av illustrerade vitsar avsedda för vuxna @sv

Saksankieliset sadut (Kaunoluokka)
type: Class
type: Concept
type: FormClass
subclass of: SAKSANKIELINEN KAUNOKIRJALLISUUS (Kaunoluokka)
broader: SAKSANKIELINEN KAUNOKIRJALLISUUS (Kaunoluokka)
in scheme: URN:NBN:fi:au:hklj:
narrower: Saksankieliset kuvakirjat (Kaunoluokka)
notation: 3.7
preferred label: Fairy stories (Fiction class) @en
preferred label: Sagor på tyska (Skönklass) @sv
scope note: Sadut. Satuelokuvat. Ääneen luetut sadut
scope note: Sagor. Sagofilmer. Inlästa sagor @sv

Saksankieliset kuvakirjat (Kaunoluokka)
type: Class
type: Concept
type: FormClass
subclass of: Saksankieliset sadut (Kaunoluokka)
broader: Saksankieliset sadut (Kaunoluokka)
in scheme: URN:NBN:fi:au:hklj:
narrower: Saksankieliset sarjakuvat ja animaatioelokuvat (Kaunoluokka)
notation: 3.79
preferred label: Picture books (Fiction class) @en
preferred label: Bilderböcker på tyska (Skönklass) @sv
scope note: Kuvakirjat. Tässä myös tekstiltään runomuotoiset kuvakirjat Tässä myös aikuisille tarkoitetut kuvakirjat ja kuvalliset vitsit
scope note: Bilderböcker. Hit också bilderböcker med text i versform Hit också bilderböcker och samlingar av illustrerade vitsar avsedda för vuxna @sv

Englanninkieliset sadut (Kaunoluokka)
type: Class
type: Concept
type: FormClass
subclass of: ENGLANNINKIELINEN KAUNOKIRJALLISUUS (Kaunoluokka)
broader: ENGLANNINKIELINEN KAUNOKIRJALLISUUS (Kaunoluokka)
in scheme: URN:NBN:fi:au:hklj:
narrower: Englanninkieliset kuvakirjat (Kaunoluokka)
notation: 4.7
preferred label: Fairy stories (Fiction class) @en
preferred label: Sagor på engelska (Skönklass) @sv
scope note: Sadut. Satuelokuvat. Ääneen luetut sadut
scope note: Sagor. Sagofilmer. Inlästa sagor @sv

Englanninkieliset kuvakirjat (Kaunoluokka)
type: Class
type: Concept
type: FormClass
subclass of: Englanninkieliset sadut (Kaunoluokka)
broader: Englanninkieliset sadut (Kaunoluokka)
in scheme: URN:NBN:fi:au:hklj:
narrower: Englanninkieliset sarjakuvat ja animaatioelokuvat (Kaunoluokka)
notation: 4.79
preferred label: Picture books (Fiction class) @en
preferred label: Bilderböcker på engelska (Skönklass) @sv
scope note: Kuvakirjat. Tässä myös tekstiltään runomuotoiset kuvakirjat Tässä myös aikuisille tarkoitetut kuvakirjat ja kuvalliset vitsit
scope note: Bilderböcker. Hit också bilderböcker med text i versform Hit också bilderböcker och samlingar av illustrerade vitsar avsedda för vuxna @sv

Ranskankieliset sadut (Kaunoluokka)
type: Class
type: Concept
type: FormClass
subclass of: RANSKANKIELINEN KAUNOKIRJALLISUUS (Kaunoluokka)
broader: RANSKANKIELINEN KAUNOKIRJALLISUUS (Kaunoluokka)
in scheme: URN:NBN:fi:au:hklj:
narrower: Ranskankieliset kuvakirjat (Kaunoluokka)
notation: 5.7
preferred label: Fairy stories (Fiction class) @en
preferred label: Sagor på franska (Skönklass) @sv
scope note: Sadut. Satuelokuvat. Ääneen luetut sadut
scope note: Sagor. Sagofilmer. Inlästa sagor @sv

Ranskankieliset kuvakirjat (Kaunoluokka)
type: Class
type: Concept
type: FormClass
subclass of: Ranskankieliset sadut (Kaunoluokka)
broader: Ranskankieliset sadut (Kaunoluokka)
in scheme: URN:NBN:fi:au:hklj:
narrower: Ranskankieliset sarjakuvat ja animaatioelokuvat (Kaunoluokka)
notation: 5.79
preferred label: Picture books (Fiction class) @en
preferred label: Bilderböcker på franska (Skönklass) @sv
scope note: Kuvakirjat. Tässä myös tekstiltään runomuotoiset kuvakirjat Tässä myös aikuisille tarkoitetut kuvakirjat ja kuvalliset vitsit
scope note: Bilderböcker. Hit också bilderböcker med text i versform Hit också bilderböcker och samlingar av illustrerade vitsar avsedda för vuxna @sv

Italiankieliset sadut (Kaunoluokka)
type: Class
type: Concept
type: FormClass
subclass of: ITALIANKIELINEN KAUNOKIRJALLISUUS (Kaunoluokka)
broader: ITALIANKIELINEN KAUNOKIRJALLISUUS (Kaunoluokka)
in scheme: URN:NBN:fi:au:hklj:
narrower: Italiankieliset kuvakirjat (Kaunoluokka)
notation: 6.7
preferred label: Fairy stories (Fiction class) @en
preferred label: Sagor på italienska (Skönklass) @sv
scope note: Sadut. Satuelokuvat. Ääneen luetut sadut
scope note: Sagor. Sagofilmer. Inlästa sagor @sv

Italiankieliset kuvakirjat (Kaunoluokka)
type: Class
type: Concept
type: FormClass
subclass of: Italiankieliset sadut (Kaunoluokka)
broader: Italiankieliset sadut (Kaunoluokka)
in scheme: URN:NBN:fi:au:hklj:
narrower: Italiankieliset sarjakuvat ja animaatioelokuvat (Kaunoluokka)
notation: 6.79
preferred label: Picture books (Fiction class) @en
preferred label: Bilderböcker på italienska (Skönklass) @sv
scope note: Kuvakirjat. Tässä myös tekstiltään runomuotoiset kuvakirjat Tässä myös aikuisille tarkoitetut kuvakirjat ja kuvalliset vitsit
scope note: Bilderböcker. Hit också bilderböcker med text i versform Hit också bilderböcker och samlingar av illustrerade vitsar avsedda för vuxna @sv

Espanjankieliset sadut (Kaunoluokka)
type: Class
type: Concept
type: FormClass
subclass of: ESPANJANKIELINEN KAUNOKIRJALLISUUS (Kaunoluokka)
broader: ESPANJANKIELINEN KAUNOKIRJALLISUUS (Kaunoluokka)
in scheme: URN:NBN:fi:au:hklj:
narrower: Espanjankieliset kuvakirjat (Kaunoluokka)
notation: 7.7
preferred label: Fairy stories (Fiction class) @en
preferred label: Sagor på spanska (Skönklass) @sv
scope note: Sadut. Satuelokuvat. Ääneen luetut sadut
scope note: Sagor. Sagofilmer. Inlästa sagor @sv

Espanjankieliset kuvakirjat (Kaunoluokka)
type: Class
type: Concept
type: FormClass
subclass of: Espanjankieliset sadut (Kaunoluokka)
broader: Espanjankieliset sadut (Kaunoluokka)
in scheme: URN:NBN:fi:au:hklj:
narrower: Espanjankieliset sarjakuvat ja animaatioelokuvat (Kaunoluokka)
notation: 7.79
preferred label: Picture books (Fiction class) @en
preferred label: Bilderböcker på spanska (Skönklass) @sv
scope note: Kuvakirjat. Tässä myös tekstiltään runomuotoiset kuvakirjat Tässä myös aikuisille tarkoitetut kuvakirjat ja kuvalliset vitsit
scope note: Bilderböcker. Hit också bilderböcker med text i versform Hit också bilderböcker och samlingar av illustrerade vitsar avsedda för vuxna @sv

Venäjänkieliset sadut (Kaunoluokka)
type: Class
type: Concept
type: FormClass
subclass of: VENÄJÄNKIELINEN KAUNOKIRJALLISUUS (Kaunoluokka)
broader: VENÄJÄNKIELINEN KAUNOKIRJALLISUUS (Kaunoluokka)
in scheme: URN:NBN:fi:au:hklj:
narrower: Venäjänkieliset kuvakirjat (Kaunoluokka)
notation: 8.7
preferred label: Fairy stories (Fiction class) @en
preferred label: Sagor på ryska (Skönklass) @sv
scope note: Sadut. Satuelokuvat. Ääneen luetut sadut
scope note: Sagor. Sagofilmer. Inlästa sagor @sv

Venäjänkieliset kuvakirjat (Kaunoluokka)
type: Class
type: Concept
type: FormClass
subclass of: Venäjänkieliset sadut (Kaunoluokka)
broader: Venäjänkieliset sadut (Kaunoluokka)
in scheme: URN:NBN:fi:au:hklj:
narrower: Venäjänkieliset sarjakuvat ja animaatioelokuvat (Kaunoluokka)
notation: 8.79
preferred label: Picture books (Fiction class) @en
preferred label: Bilderböcker på ryska (Skönklass) @sv
scope note: Kuvakirjat. Tässä myös tekstiltään runomuotoiset kuvakirjat Tässä myös aikuisille tarkoitetut kuvakirjat ja kuvalliset vitsit
scope note: Bilderböcker. Hit också bilderböcker med text i versform Hit också bilderböcker och samlingar av illustrerade vitsar avsedda för vuxna @sv

Keinotekoisten kielten kaunokirjallisuus (Kaunoluokka)
type: Class
type: Concept
type: FormClass
subclass of: Muiden kielten kaunokirjallisuus (Kaunoluokka)
broader: Muiden kielten kaunokirjallisuus (Kaunoluokka)
in scheme: URN:NBN:fi:au:hklj:
narrower: Esperantonkielinen kaunokirjallisuus (Kaunoluokka)
notation: 9.99
preferred label: Fiction in artificial languages (Fiction class) @en
preferred label: Skönlitteratur på artificiella språk (Skönklass) @sv
scope note: Idon-, latino sine flexionen- ja novialinkielinen kaunokirjallisuus
scope note: Skönlitteratur på ido, latino sine flexione och novial @sv

Suomessa ilmestyvät ruotsinkieliset
type: Class
type: Concept
subclass of: Suomenkieliset
broader: Suomenkieliset
in scheme: URN:NBN:fi:au:hklj:
notation: 051.1
preferred label: Finnish-Swedish @en
preferred label: Finlandssvenska @sv

Suomessa ilmestyvät vieraskieliset
type: Class
type: Concept
subclass of: Suomenkieliset
broader: Suomenkieliset
in scheme: URN:NBN:fi:au:hklj:
notation: 051.2
preferred label: Foreign-language serial publications published in Finland @en
preferred label: Seriella publikationer utgivna på främmande språk i Finland @sv

Ruotsinkieliset
type: Class
type: Concept
subclass of: YLEISET KAUSIJULKAISUT
broader: YLEISET KAUSIJULKAISUT
in scheme: URN:NBN:fi:au:hklj:
notation: 052
preferred label: Swedish @en
preferred label: Svenska @sv

Saksankieliset
type: Class
type: Concept
subclass of: YLEISET KAUSIJULKAISUT
broader: YLEISET KAUSIJULKAISUT
in scheme: URN:NBN:fi:au:hklj:
notation: 053
preferred label: German @en
preferred label: Tyska @sv

Amerikan englanninkieliset
type: Class
type: Concept
subclass of: Englanninkieliset
broader: Englanninkieliset
in scheme: URN:NBN:fi:au:hklj:
notation: 054.1
preferred label: American @en
preferred label: Amerikanska @sv

Ranskankieliset
type: Class
type: Concept
subclass of: YLEISET KAUSIJULKAISUT
broader: YLEISET KAUSIJULKAISUT
in scheme: URN:NBN:fi:au:hklj:
notation: 055
preferred label: French @en
preferred label: Franska @sv

Italiankieliset
type: Class
type: Concept
subclass of: YLEISET KAUSIJULKAISUT
broader: YLEISET KAUSIJULKAISUT
in scheme: URN:NBN:fi:au:hklj:
notation: 056
preferred label: Italian @en
preferred label: Italienska @sv

Espanjankieliset
type: Class
type: Concept
subclass of: YLEISET KAUSIJULKAISUT
broader: YLEISET KAUSIJULKAISUT
in scheme: URN:NBN:fi:au:hklj:
notation: 057
preferred label: Spanish @en
preferred label: Spanska @sv

Venäjänkieliset
type: Class
type: Concept
subclass of: YLEISET KAUSIJULKAISUT
broader: YLEISET KAUSIJULKAISUT
in scheme: URN:NBN:fi:au:hklj:
notation: 058
preferred label: Russian @en
preferred label: Ryska @sv

Englanninkieliset
type: Class
type: Concept
subclass of: SANOMALEHDET
broader: SANOMALEHDET
in scheme: URN:NBN:fi:au:hklj:
narrower: Amerikan englanninkieliset
notation: 074
preferred label: English @en
preferred label: Engelska @sv
related: URN:NBN:fi:au:hklj:384

URN:NBN:fi:au:hklj:1.9
alternative label: Ersän kieli, kaunokirjallisuus (1.9)
alternative label: Liivin kieli, kaunokirjallisuus (1.9)
alternative label: Marin kieli, kaunokirjallisuus (1.9)
alternative label: Mordvan kieli, kaunokirjallisuus (1.9)
alternative label: Ostjakin kieli, kaunokirjallisuus (1.9)
alternative label: Permiläiset kielet, kaunokirjallisuus (1.9)
alternative label: Syrjäänin kieli, kaunokirjallisuus (1.9)
alternative label: Tseremissin kieli, kaunokirjallisuus (1.9)
alternative label: Udmurtin kieli, kaunokirjallisuus (1.9)
alternative label: Ugrilaiset kielet, kaunokirjallisuus (1.9 +)
alternative label: Vatjan kieli, kaunokirjallisuus (1.9)
alternative label: Vepsän kieli, kaunokirjallisuus (1.9)
alternative label: Vogulin kieli, kaunokirjallisuus (1.9)
alternative label: Volgalaiset kielet, kaunokirjallisuus (1.9)
alternative label: Votjakin kieli, kaunokirjallisuus (1.9)
alternative label: Erzamordvinska, skönlitteratur (1.9) @sv
alternative label: Liviska, skönlitteratur (1.9) @sv
alternative label: Mari, skönlitteratur (1.9) @sv
alternative label: Mordvinska, skönlitteratur (1.9) @sv
alternative label: Ostjakiska, skönlitteratur (1.9) @sv
alternative label: Permiska språk, skönlitteratur (1.9) @sv
alternative label: Syrjänska, skönlitteratur (1.9) @sv
alternative label: Tjeremissiska, skönlitteratur (1.9) @sv
alternative label: Udmurtiska, skönlitteratur (1.9) @sv
alternative label: Ugriska språk, skönlitteratur (1.9 +) @sv
alternative label: Vepsiska, skönlitteratur (1.9) @sv
alternative label: Voguliska, skönlitteratur (1.9) @sv
alternative label: Volgafinska språk, skönlitteratur (1.9) @sv
alternative label: Votiska, skönlitteratur (1.9) @sv
alternative label: Votjakiska, skönlitteratur (1.9) @sv
related: URN:NBN:fi:au:hklj:1.8
related: URN:NBN:fi:au:hklj:1.91
related: URN:NBN:fi:au:hklj:1.94
related: URN:NBN:fi:au:hklj:1.98
related: SUOMALAIS-UGRILAISTEN KIELTEN KIRJALLISUUDEN HISTORIA JA TUTKIMUS

Teoria. Tutkimusmenetelmät
type: Class
type: Concept
subclass of: URN:NBN:fi:au:hklj:100
broader: URN:NBN:fi:au:hklj:100
in scheme: URN:NBN:fi:au:hklj:
notation: 101
preferred label: Theory. Research methods @en
preferred label: Teori. Forskningsmetoder @sv
related: LOGIIKKA
related: TIETOTEORIA. TIETO-OPPI
related: TIEDEOPPI
scope note: Filosofian yleinen teoria ja tutkimusmenetelmät Filosofian erikoisalojen teoria ja tutkimusmenetelmät alan mukaisessa luokassa
scope note: Filosofins allmänna teori och forskningsmetoder Filosofiska teorier som rör specialområden klassificeras enligt område @sv

Opinnot
type: Class
type: Concept
subclass of: URN:NBN:fi:au:hklj:100
broader: URN:NBN:fi:au:hklj:100
in scheme: URN:NBN:fi:au:hklj:
notation: 107
preferred label: Studies. Educational institutions @en
preferred label: Studier. Läroinrättningar @sv
related: Oppikirjat. Johdatukset filosofiaan
related: Elämänfilosofia
related: Filosofian ja psykologian opetusoppi
scope note: Filosofian alaan kuuluvat yleiset opinnot Filosofian erikoisalojen opinnot alan mukaisessa luokassa
scope note: Allmänna studier och läroinrättningar inom filosofin Studier och läroinrättningar som rör specialområden inom filosofin klassificeras enligt område @sv

Lauselogiikka. Lausekalkyyli
type: Class
type: Concept
subclass of: LOGIIKKA
alternative label: Kielellinen logiikka (131)
alternative label: Kielipelit, logiikka (131)
alternative label: Lauselogiikka (131)
alternative label: Looginen semantiikka (131)
alternative label: Nominalismi, logiikka (131)
alternative label: Semantiikka, logiikka (131)
alternative label: Syntaksi, logiikka (131)
alternative label: Logisk semantik (131) @sv
alternative label: Nominalism, logik (131) @sv
alternative label: Satslogik (131) @sv
alternative label: Semantik, logik (131) @sv
alternative label: Språklig logik (131) @sv
alternative label: Språkspel, logik (131) @sv
alternative label: Syntax, logik (131) @sv
broader: LOGIIKKA
in scheme: URN:NBN:fi:au:hklj:
notation: 131
preferred label: Dialectics. Syllogism @en
preferred label: Satslogik. Satskalkyl @sv
related: Logistiikka. Looginen kalkyyli
related: Kielifilosofia
related: Kielioppi. Muoto-oppi. Sanaoppi. Semantiikka
scope note: Logiikka ja kieli. Looginen syntaksi ja semantiikka
scope note: Logik och språk. Logisk satslära (syntax) och betydelselära (semantik) @sv

Tieteenfilosofia
type: Class
type: Concept
subclass of: Tieteenfilosofia. Metodologia
alternative label: Dogmaattisuus, tieteen filosofia (151.1)
alternative label: Doktriinit, tieteen filosofia (151.1)
alternative label: Epävarmuus, tieteenfilosofia (151.1)
alternative label: Erehdys, tieteenfilosofia (151.1)
alternative label: Filosofia, tieteenfilosofia (151.1)
alternative label: Hermeneutiikka, tieteenfilosofia (151.1)
alternative label: Heuristiikka, tieteenfilosofia (151.1)
alternative label: Holismi, tieteenfilosofia (151.1)
alternative label: Holistisuus, tieteenfilosofia (151.1)
alternative label: Humanistiset tieteet, tieteenfilosofia (151.1)
alternative label: Ihmistieteet, tieteenfilosofia (151.1)
alternative label: Intersubjektiivisuus, tieteenfilosofia (151.1)
alternative label: Kaaosteoria, tieteenfilosofia (151.1)
alternative label: Katastrofiteoria, tieteenfilosofia (151.1)
alternative label: Kausaalisuus, tieteen filosofia (151.1)
alternative label: Kausaliteetti, tieteen filosofia (151.1)
alternative label: Kokonaisvaltaisuus, tieteenfilosofia (151.1)
alternative label: Kompleksisuus, tieteenfilosofia (151.1)
alternative label: Koulukunnat, tieteenfilosofia (151.1)
alternative label: Kriittisyys, tieteenfilosofia (151.1)
alternative label: Kvalitatiivinen tutkimus, tieteenfilosofia (151.1)
alternative label: Kvantitatiivinen tutkimus, tieteenfilosofia (151.1)
alternative label: Kyseenalaistaminen, tieteenfilosofia (151.1)
alternative label: Käytännöllinen filosofia, tieteenfilosofia (151.1)
alternative label: Laadullinen tutkimus, tieteenfilosofia (151.1)
alternative label: Looginen empirismi, tieteenfilosofia (151.1)
alternative label: Looginen positivismi, tieteenfilosofia (151.1)
alternative label: Monialaisuus, tieteenfilosofia (151.1)
alternative label: Monimutkaisuus, tieteenfilosofia (151.1)
alternative label: Määritelmät, tieteenfilosofia (151.1)
alternative label: Määrällinen tutkimus, tieteenfilosofia (151.1)
alternative label: Objektiivisuus, tieteenfilosofia (151.1)
alternative label: Oppiriidat, tieteen filosofia (151.1)
alternative label: Perustelut, tieteenfilosofia (151.1)
alternative label: Positivismi, tieteenfilosofia (151.1)
alternative label: Reduktio, tieteen filosofia (151.1)
alternative label: Reduktionismi, tieteen filosofia (151.1)
alternative label: Skientismi, tieteenfilosofia (151.1)
alternative label: Strukturalismi, tieteen filosofia (151.1)
alternative label: Subjektiivisuus, tieteenfilosofia (151.1)
alternative label: Synteesi, tieteenfilosofia (151.1)
alternative label: Syysuhde, tieteen filosofia (151.1)
alternative label: Teoreettinen tutkimus, tieteenfilosofia (151.1)
alternative label: Tiedeoppi, tieteenfilosofia (151.1)
alternative label: Tieteellinen ajattelu (151.1)
alternative label: Tieteellinen tieto, tieteenfilosofia (151.1)
alternative label: Tieteen edistyminen, tieteenfilosofia (151.1)
alternative label: Tieteenfilosofia (151.1)
alternative label: Tutkimus, tieteenfilosofia (151.1)
alternative label: Tutkimusetiikka (151.1)
alternative label: Tutkimustulokset, tieteenfilosofia (151.1)
alternative label: Uuspositivismi, tieteenfilosofia (151.1)
alternative label: Varmuus, tieteenfilosofia (151.1)
alternative label: Väitelauseet, tieteenfilosofia (151.1)
alternative label: Väittämät, tieteenfilosofia (151.1)
alternative label: Argument, vetenskapsfilosofi (151.1) @sv
alternative label: Argumenteringar, vetenskapsfilosofi (151.1) @sv
alternative label: Definitioner, vetenskapsfilosofi (151.1) @sv
alternative label: Dogmatisk personlighet, vetenskapens filosofi (151.1) @sv
alternative label: Doktriner, vetenskapens filosofi (151.1) @sv
alternative label: Filosofi, vetenskapsfilosofi (151.1) @sv
alternative label: Forskning, vetenskapsfilosofi (151.1) @sv
alternative label: Forskningsetik (151.1) @sv
alternative label: Forskningsresultat, vetenskapsfilosofi (151.1) @sv
alternative label: Helhetsbetoning, vetenskapsfilosofi (151.1) @sv
alternative label: Helhetsorientering, vetenskapsfilosofi (151.1) @sv
alternative label: Hermeneutik, vetenskapsfilosofi (151.1) @sv
alternative label: Heuristik, vetenskapsfilosofi (151.1) @sv
alternative label: Holism, vetenskapsfilosofi (151.1) @sv
broader: Tieteenfilosofia. Metodologia
in scheme: URN:NBN:fi:au:hklj:
notation: 151.1
related: TIETOTEORIA. TIETO-OPPI
related: Kulttuurifilosofia
related: Filosofia. Teoria. Tutkimusmenetelmät
scope note: Yleinen tieteenfilosofia Tieteen merkitys ja arvo filosofisena kysymyksenä Tässä myös humanististen tieteiden yleinen tieteenfilosofia Erikoisalojen tieteenfilosofia alan mukaisessa luokassa
scope note: Allmän vetenskapsfilosofi Vetenskapens betydelse och värde som filosofisk fråga Hit också allmän vetenskapsfilosofi inom de humanistiska vetenskaperna Specialområden inom vetenskapsfilosofi och metodologi klassificeras enligt område @sv

Yleinen estetiikka
type: Class
type: Concept
subclass of: ETIIKKA. ESTETIIKKA
alternative label: Asymmetria, estetiikka (166)
alternative label: Elämyksellisyys, esteettinen elämys (166)
alternative label: Elämys, esteettinen elämys (166)
alternative label: Epäsymmetria, estetiikka (166)
alternative label: Estetiikka (166)
alternative label: Filosofia, estetiikka (166)
alternative label: Formalismi, estetiikka (166)
alternative label: Intersubjektiivisuus, estetiikka (166)
alternative label: Kauneus (166)
alternative label: Kauneus, estetiikka (166)
alternative label: Kauneusihanteet, estetiikka (166)
alternative label: Kaunis, estetiikka (166)
alternative label: Kokemukset, estetiikka (166)
alternative label: Maku, estetiikka (166)
alternative label: Mielihyvä, estetiikka (166)
alternative label: Muodot, estetiikka (166)
alternative label: Muoto, estetiikka (166)
alternative label: Relativismi, estetiikka (166)
alternative label: Reseptioestetiikka (166)
alternative label: Rumuus, estetiikka (166)
alternative label: Subjektiivisuus, estetiikka (166)
alternative label: Suhteellisuus, estetiikka (166)
alternative label: Symmetria, estetiikka (166)
alternative label: Tragiikka, estetiikka (166)
alternative label: Tragikomiikka, estetiikka (166)
alternative label: Vastaanotto, estetiikka (166)
alternative label: Ylevä, estetiikka (166)
alternative label: Asymmetri, estetik (166) @sv
alternative label: Erfarenheter, estetik (166) @sv
alternative label: Estetik (166) @sv
alternative label: Filosofi, estetik (166) @sv
alternative label: Form, estetik (166) @sv
alternative label: Formalism, estetik (166) @sv
alternative label: Former, estetik (166) @sv
alternative label: Fulhet, estetik (166) @sv
alternative label: Inlevelse, estetisk upplevelse (166) @sv
alternative label: Intersubjektivitet, estetik (166) @sv
alternative label: Osymmetri, estetik (166) @sv
alternative label: Reception, estetik (166) @sv
alternative label: Receptionsestetik (166) @sv
alternative label: Relativism, estetik (166) @sv
alternative label: Relativitet, estetik (166) @sv
alternative label: Sköna, det sköna, estetik (166) @sv
alternative label: Skönhet (166) @sv
alternative label: Skönhet, estetik (166) @sv
alternative label: Skönhetsideal, estetik (166) @sv
alternative label: Smak, estetik (166) @sv
alternative label: Subjektivitet, estetik (166) @sv
alternative label: Sublima, det sublima, estetik (166) @sv
alternative label: Symmetri, estetik (166) @sv
alternative label: Tragik, estetik (166) @sv
alternative label: Tragikomik, estetik (166) @sv
alternative label: Upplevelse, estetisk upplevelse (166) @sv
alternative label: Vällust, estetik (166) @sv
broader: ETIIKKA. ESTETIIKKA
in scheme: URN:NBN:fi:au:hklj:
notation: 166
preferred label: General aesthetics @en
preferred label: Allmän estetik @sv
related: Taiteen estetiikka. Taidefilosofia. Taidepsykologia. Taidesosiologia. Taidepolitiikka
related: Luonnon- ja kulttuurimaiseman suunnittelu
related: Kirjallisuuden filosofia, teoria ja estetiikka. Runousoppi
scope note: Estetiikan yleinen teoria, joka koskee kauneuden ja rumuuden ongelmaa sekä taiteessa, luonnossa että kulttuuriympäristössä Eri taiteenalojen estetiikka alan mukaisessa luokassa
scope note: Allmän estetisk teori som rör det skönas och det fulas problem både i konsten, i naturen och i kulturmiljön Estetik inom olika konstområden klassificeras enligt område @sv

Museot. Arkistot. Kokoelmat. Näyttelyt
type: Class
type: Concept
subclass of: Kokoomateokset
broader: Kokoomateokset
in scheme: URN:NBN:fi:au:hklj:
notation: 218.5
preferred label: Museums. Archives. Collections. Exhibitions @en
preferred label: Museer. Arkiv. Samlingar. Utställningar @sv
related: Yhdistykset. Laitokset. Kokoukset. Ekumenia
scope note: Kristinuskoa tai kristillistä teologiaa koskevat yleiset museot, arkistot, kokoelmat ja näyttelyt Kristinuskon tai kristillisen teologian erikoisaloja koskevat museot, arkistot, kokoelmat ja näyttelyt alan mukaisessa luokassa
scope note: Allmänna museer, arkiv, samlingar och utställningar som rör kristendom eller kristen teologi Museer, arkiv, samlingar och utställningar som rör specialområden inom kristendom eller kristen teologi klassificeras enligt område @sv

Uusi Testamentti
type: Class
type: Concept
subclass of: RAAMATTU. RAAMATUNTUTKIMUS
alternative label: Apostolit (225 ... 228)
alternative label: Johannes Kastaja (225 ... 226)
alternative label: Luukas, Raamatun henkilöt (225 ... 226)
alternative label: Opetuslapset (225 ... 228)
alternative label: Raamattu, Uusi Testamentti (225)
alternative label: Uusi Testamentti (225)
alternative label: Apostlar (225 ... 228) @sv
alternative label: Bibeln, Nya Testamentet (225) @sv
alternative label: Johannes Döparen (225 ... 226) @sv
alternative label: Lukas, bibliska personer (225 ... 226) @sv
alternative label: Lärjungar (225 ... 228) @sv
alternative label: Nya Testamentet (225) @sv
broader: RAAMATTU. RAAMATUNTUTKIMUS
in scheme: URN:NBN:fi:au:hklj:
notation: 225
preferred label: The New Testament @en
preferred label: Nya testamentet @sv
related: URN:NBN:fi:au:hklj:225.09
related: Kristologia
scope note: Tässä ja luokissa 226-229 myös Uuden Testamentin tutkimus, Uuden Testamentin maantiede ja Uuden Testamentin henkilöt
scope note: Hit och till klasserna 226-229 också forskning i Nya testamentet, Nya testamentets geografi och Nya testamentets personer @sv

Evankeliumit
type: Class
type: Concept
subclass of: RAAMATTU. RAAMATUNTUTKIMUS
alternative label: Apostolit (225 ... 228)
alternative label: Evankeliumi (226)
alternative label: Evankeliumit (226)
alternative label: Johanneksen evankeliumi (226)
alternative label: Johannes Kastaja (225 ... 226)
alternative label: Johannes, apostoli (226)
alternative label: Luukas, Raamatun henkilöt (225 ... 226)
alternative label: Luukkaan evankeliumi (226)
alternative label: Markuksen evankeliumi (226)
alternative label: Markus, Raamatun henkilöt (226)
alternative label: Matteuksen evankeliumi (226)
alternative label: Matteus, Raamatun henkilöt (226)
alternative label: Opetuslapset (225 ... 228)
alternative label: Pietari, apostoli (226)
alternative label: Raamattu, evankeliumit (226)
alternative label: Uusi Testamentti, evankeliumit (226)
alternative label: Vuorisaarna (226)
alternative label: Apostlar (225 ... 228) @sv
alternative label: Bergspredikan (226) @sv
alternative label: Bibeln, evangelierna (226) @sv
alternative label: Evangelierna (226) @sv
alternative label: Evangeliet (226) @sv
alternative label: Johannes Döparen (225 ... 226) @sv
alternative label: Johannes evangelium (226) @sv
alternative label: Johannes, aposteln (226) @sv
alternative label: Lukas, bibliska personer (225 ... 226) @sv
alternative label: Lukasevangeliet (226) @sv
alternative label: Lärjungar (225 ... 228) @sv
alternative label: Markus, bibliska personer (226) @sv
alternative label: Markusevangeliet (226) @sv
alternative label: Matteus, bibliska personer (226) @sv
alternative label: Matteusevangeliet (226) @sv
alternative label: Nya Testamentet, evangelierna (226) @sv
alternative label: Petrus, aposteln (226) @sv
broader: RAAMATTU. RAAMATUNTUTKIMUS
in scheme: URN:NBN:fi:au:hklj:
notation: 226
preferred label: The Gospels @en
preferred label: Evangelierna @sv
related: Johanneksen ilmestys
related: Kristologia
scope note: Evankeliumit Matteuksen, Markuksen, Luukkaan ja Johanneksen mukaan
scope note: Matteus, Markus, Lukas och Johannes evangelier @sv

Kirkko-oikeus
type: Class
type: Concept
subclass of: EVANKELIS-LUTERILAINEN KIRKKO
alternative label: Kanoninen oikeus, ev.-lut. kirkko (253)
alternative label: Kirkko-oikeus, ev.-lut. kirkko (253)
alternative label: Kirkkokuri, kirkko-oikeus, ev.-lut. (253)
alternative label: Kirkkolait, ev.-lut. kirkko (253)
alternative label: Kirkollisvero, ev.-lut. kirkko, lainsäädäntö (253)
alternative label: Kirkosta erottaminen, ev.-lut. kirkko, lainsäädäntö (253)
alternative label: Oikeusteologia, ev.-lut. kirkko (253)
alternative label: Vero-oikeus, kirkollisverotusta koskeva (253)
alternative label: Exkommunikation, ev.luth. kyrkan, lagstiftning (253) @sv
alternative label: Kanonisk rätt, ev.luth. kyrkan (253) @sv
alternative label: Kyrkolagar, ev.luth. kyrkan (253) @sv
alternative label: Kyrkorätt, ev.luth. kyrkan (253) @sv
alternative label: Kyrkoskatt, ev.luth. kyrkan, lagstiftning (253) @sv
alternative label: Kyrkotukt, kyrkorätt, ev.luth. (253) @sv
alternative label: Rättsteologi, ev.luth. kyrkan (253) @sv
alternative label: Skatterätt, i kyrkobeskattning (253) @sv
broader: EVANKELIS-LUTERILAINEN KIRKKO
in scheme: URN:NBN:fi:au:hklj:
notation: 253
preferred label: Church law @en
preferred label: Kyrkorätt @sv
related: URN:NBN:fi:au:hklj:330
related: Vero-oikeus
related: Valtionverotus. Veropolitiikka
scope note: Ev.-lut. kirkkoa koskeva kirkko-oikeus. Kirkollisverotusta koskeva lainsäädäntö Kirkko-oikeus muiden kristillisten kirkkokuntien ja yhteisöjen kannalta 260-269
scope note: Den evangelisk-lutherska kyrkans kyrkorätt. Lagstiftning om kyrkoskatt Kyrkorätt ur andra kristna kyrkosamfunds och kristna samfunds synvinkel 260-269 @sv

Kansainväliset yleiset tilastot
type: Class
type: Concept
subclass of: TILASTOTIEDE
alternative label: Kansainväliset tilastot (314)
alternative label: Mittausvirheet, yleiset tilastot (312 ... 316)
alternative label: Tilastointi, yleiset tilastot (312 ... 316)
alternative label: Tilastolliset mallit, yleiset tilastot (312 ... 316)
alternative label: Tilastot, kansainväliset (314)
alternative label: Tilastotiede, yleiset tilastot (312 ... 316)
alternative label: Internationell statistik (314) @sv
alternative label: Mätfel, allmänna statistiker (312 ... 316) @sv
alternative label: Statistik, internationella (314) @sv
alternative label: Statistik, vetenskap, allmänna statistiker (312 ... 316) @sv
alternative label: Statistikföring, allmänna statistiker (312 ... 316) @sv
alternative label: Statistiska modeller, allmänna statistiker (312 ... 316) @sv
broader: TILASTOTIEDE
in scheme: URN:NBN:fi:au:hklj:
notation: 314
preferred label: General international statistics @en
preferred label: Internationell allmän statistik @sv
related: Väestötilasto. Sosiaalitilasto
related: Suomen yleiset tilastot
related: Muiden maiden yleiset tilastot
scope note: Useampaa kuin yhtä maata koskevat yleiset tilastot. YK:n yleiset tilastot Erikoisalojen tilastot alan mukaisessa luokassa
scope note: Allmän statistik som rör fler än ett land. FN:s allmänna statistik Statististik som rör specialområden klassificeras enligt område @sv

Suomen yleiset tilastot
type: Class
type: Concept
subclass of: TILASTOTIEDE
alternative label: Mittausvirheet, yleiset tilastot (312 ... 316)
alternative label: Suomen virallinen tilasto (315)
alternative label: Tilastointi, yleiset tilastot (312 ... 316)
alternative label: Tilastolliset mallit, yleiset tilastot (312 ... 316)
alternative label: Tilastot, Suomen (315)
alternative label: Tilastotiede, yleiset tilastot (312 ... 316)
alternative label: Finlands officiella statistik (315) @sv
alternative label: Mätfel, allmänna statistiker (312 ... 316) @sv
alternative label: Statistik, i Finland (315) @sv
alternative label: Statistik, vetenskap, allmänna statistiker (312 ... 316) @sv
alternative label: Statistikföring, allmänna statistiker (312 ... 316) @sv
alternative label: Statistiska modeller, allmänna statistiker (312 ... 316) @sv
broader: TILASTOTIEDE
in scheme: URN:NBN:fi:au:hklj:
notation: 315
preferred label: General Finnish statistics @en
preferred label: Allmän finländsk statistik @sv
related: Väestötilasto. Sosiaalitilasto
related: Kansainväliset yleiset tilastot
related: Muiden maiden yleiset tilastot
scope note: Erikoisalojen tilastot alan mukaisessa luokassa
scope note: Statististik som rör specialområden klassificeras enligt område @sv

Muiden maiden yleiset tilastot
type: Class
type: Concept
subclass of: TILASTOTIEDE
alternative label: Mittausvirheet, yleiset tilastot (312 ... 316)
alternative label: Tilastointi, yleiset tilastot (312 ... 316)
alternative label: Tilastolliset mallit, yleiset tilastot (312 ... 316)
alternative label: Tilastot, muiden maiden (316)
alternative label: Tilastotiede, yleiset tilastot (312 ... 316)
alternative label: Mätfel, allmänna statistiker (312 ... 316) @sv
alternative label: Statistik, i övriga länder (316) @sv
alternative label: Statistik, vetenskap, allmänna statistiker (312 ... 316) @sv
alternative label: Statistikföring, allmänna statistiker (312 ... 316) @sv
alternative label: Statistiska modeller, allmänna statistiker (312 ... 316) @sv
broader: TILASTOTIEDE
in scheme: URN:NBN:fi:au:hklj:
notation: 316
preferred label: General statistics of other countries @en
preferred label: Andra länders allmänna statistik @sv
related: Väestötilasto. Sosiaalitilasto
related: Kansainväliset yleiset tilastot
related: Suomen yleiset tilastot
scope note: Erikoisalojen tilastot alan mukaisessa luokassa
scope note: Statististik som rör specialområden klassificeras enligt område @sv

Suomen valtiopäiväasiakirjat
type: Class
type: Concept
subclass of: Suomen valtiojärjestelmä
alternative label: Eduskunta, Suomen valtiopäiväasiakirjat (327.1)
alternative label: Eduskunta-aloitteet, Suomen valtiopäiväasiakirjat (327.1)
alternative label: Eduskuntakäsittely, Suomen valtiopäiväasiakirjat (327.1)
alternative label: Hallituksen esitykset, Suomi (327.1)
alternative label: Päätöslauselmat, valtiopäiväasiakirjat, Suomi (327.1)
alternative label: Senaatit, Suomi, valtiopäiväasiakirjat (327.1)
alternative label: Valtiopäiväasiakirjat, Suomi (327.1)
alternative label: Välikysymykset, Suomen valtiopäiväasiakirjat (327.1)
alternative label: Interpellationer, Finlands riksdagshandlingar (327.1) @sv
alternative label: Regeringspropositioner, Finland (327.1) @sv
alternative label: Resolutioner, riksdagshandlingar, Finland (327.1) @sv
alternative label: Riksdagen, Finlands riksdagshandlingar (327.1) @sv
alternative label: Riksdagsbehandling, Finlands riksdagshandlingar (327.1) @sv
alternative label: Riksdagshandlingar, Finland (327.1) @sv
alternative label: Riksdagsmotioner, Finlands riksdagshandlingar (327.1) @sv
alternative label: Senater, Finland, riksdagshandlingar (327.1) @sv
broader: Suomen valtiojärjestelmä
in scheme: URN:NBN:fi:au:hklj:
notation: 327.1
preferred label: Finland’s parliamentary proceedings @en
preferred label: Finlands riksdagshandlingar @sv
related: Muiden maiden valtiojärjestelmät
related: URN:NBN:fi:au:hklj:340
related: Suomen valtionhallinto

Oikeussosiologia. Oikeuspolitiikka. Oikeuspsykologia
type: Class
type: Concept
subclass of: Oikeusfilosofia
alternative label: Aivopesu, oikeuspsykologia (330.12)
alternative label: Lakien yhdenmukaistaminen, oikeuspolitiikka (330.12)
alternative label: Oikeuskulttuuri, oikeuspolitiikka (330.12)
alternative label: Oikeuskulttuuri, oikeussosiologia (330.12)
alternative label: Oikeuspolitiikka (330.12)
alternative label: Oikeuspsykologia (330.12)
alternative label: Oikeussosiologia (330.12)
alternative label: Oikeustaju, oikeuspolitiikka (330.12)
alternative label: Oikeustaju, oikeuspsykologia (330.12)
alternative label: Oikeustaju, oikeussosiologia (330.12)
alternative label: Todistajanpsykologia (330.12)
alternative label: Todistajat, oikeuspsykologia (330.12)
alternative label: Viktimologia (330.12)
alternative label: Enhetligandet av lagar, rättspolitik (330.12) @sv
alternative label: Hjärntvätt, rättspsykologi (330.12) @sv
alternative label: Rättskultur, rättspolitik (330.12) @sv
alternative label: Rättskultur, rättssociologi (330.12) @sv
alternative label: Rättskänsla, rättspolitik (330.12) @sv
alternative label: Rättskänsla, rättspsykologi (330.12) @sv
alternative label: Rättskänsla, rättssociologi (330.12) @sv
alternative label: Rättspolitik (330.12) @sv
alternative label: Rättspsykologi (330.12) @sv
alternative label: Rättssociologi (330.12) @sv
alternative label: Viktimologi (330.12) @sv
alternative label: Vittnen, rättspsykologi (330.12) @sv
alternative label: Vittnespsykologi (330.12) @sv
broader: Oikeusfilosofia
in scheme: URN:NBN:fi:au:hklj:
notation: 330.12
preferred label: Legal sociology. Legal policy. Legal psychology @en
preferred label: Rättssociologi. Rättspolitik. Rättspsykologi @sv
related: URN:NBN:fi:au:hklj:326.2
related: Oikeuslääketiede
related: Oikeuspsykiatria
scope note: Oikeussosiologia, oikeuspolitiikka ja oikeuspsykologia yleensä Suomen ja EU:n lainsäädännön erikoisaloja koskevat kysymykset alan mukaisessa luokassa 332-334+
scope note: Rättssociologi, rättspolitik och rättspsykologi i allmänhet Frågor som rör specialområden inom Finlands och EU:s lagstiftning klassificeras enligt område i klasserna 332-334+ @sv

Oikeushistoria
type: Class
type: Concept
subclass of: URN:NBN:fi:au:hklj:330
alternative label: Etuoikeudet, oikeushistoria (339)
alternative label: Humanitaarinen oikeus, oikeushistoria (339)
alternative label: Hyvä tapa, oikeushistoria (339)
alternative label: Häpeärangaistus, oikeushistoria (339)
alternative label: Inkvisitio, noitavainot (339)
alternative label: Inkvisitio, oikeushistoria (339)
alternative label: Islamilainen laki, oikeushistoria (339)
alternative label: Islamilainen oikeus, oikeushistoria (339)
alternative label: Islamilainen oikeusjärjestys, oikeushistoria (339)
alternative label: Islamin laki, oikeushistoria (339)
alternative label: Islamismi, islamilainen oikeusjärjestys, oikeushistoria (339)
alternative label: Koodeksit, Roomalainen oikeus (339)
alternative label: Kuolemanrangaistus, oikeushistoria (339)
alternative label: Kuolemantuomio, oikeushistoria (339)
alternative label: Kyläjärjestykset, oikeushistoria (339)
alternative label: Maantapa, oikeushistoria (339)
alternative label: Noidat, noitavainot, oikeushistoria (339)
alternative label: Noitavainot, oikeushistoria (339)
alternative label: Noituus, noitavainot, oikeushistoria (339)
alternative label: Oikeushallinto, oikeushistoria (339)
alternative label: Oikeushistoria (339)
alternative label: Oikeusjärjestelmät, oikeushistoria (339)
alternative label: Oikeusjärjestys, oikeushistoria (339)
alternative label: Oikeuskulttuuri, oikeushistoria (339)
alternative label: Oikeuslaitos, oikeushistoria (339)
alternative label: Oikeusmurha, oikeushistoria (339)
alternative label: Oikeustaju, oikeushistoria (339)
alternative label: Omankädenoikeus, oikeushistoria (339)
alternative label: Patronaattioikeudet, oikeushistoria (339)
alternative label: Perinnöksiostot, oikeushistoria (339)
alternative label: Perustamiskirjat, oikeushistoria (339)
alternative label: Poliittinen islam, islamilainen oikeusjärjestys, oikeushistoria (339)
alternative label: Pyövelit, oikeushistoria (339)
alternative label: Rikokset, oikeushistoria (339)
alternative label: Romaanis-germaaninen oikeusjärjestelmä (339)
alternative label: Roomalainen oikeus (339)
alternative label: Saria, oikeushistoria (339)
alternative label: Sharia, oikeushistoria (339)
alternative label: Sosialistinen oikeusjärjestelmä, oikeushistoria (339)
alternative label: Tapaoikeus, oikeushistoria (339)
alternative label: Teloittajat, oikeushistoria (339)
alternative label: Uskonvainot, noitavainot, oikeushistoria (339)
alternative label: Vainot, noitavainot, oikeushistoria (339)
alternative label: Valamiehet, oikeushistoria (339)
alternative label: Velhot, noitavainot, oikeushistoria (339)
alternative label: Verikosto, oikeushistoria (339)
alternative label: Väkivalta, oikeushistoria (339)
alternative label: Besvärjare, häxförföljelser, rättshistoria (339) @sv
alternative label: Blodshämnd, rättshistoria (339) @sv
alternative label: Brott, juridik, rättshistoria (339) @sv
alternative label: Byordningar, rättshistoria (339) @sv
alternative label: Bödlar, rättshistoria (339) @sv
alternative label: Dödsdom, rättshistoria (339) @sv
alternative label: Dödsstraff, rättshistoria (339) @sv
alternative label: Egenhandsrätt, rättshistoria (339) @sv
alternative label: Fundationsbrev, rättshistoria (339) @sv
alternative label: Förföljelser, häxförföljelser, rättshistoria (339) @sv
alternative label: God sed, rättshistoria (339) @sv
alternative label: Humanitär rätt, rättshistoria (339) @sv
alternative label: Häxeri, häxförföljelser, rättshistoria (339) @sv
alternative label: Häxor, häxförföljelser, rättshistoria (339) @sv
alternative label: Häxprocesser, rättshistoria (339) @sv
alternative label: Inkvisitionen, häxförföljelser (339) @sv
alternative label: Inkvisitionen, rättshistoria (339) @sv
alternative label: Islamisk lag, rättshistoria (339) @sv
alternative label: Islamisk rättsordning, rättshistoria (339) @sv
alternative label: Islamism, islamisk rättsordning, rättshistoria (339) @sv
alternative label: Islamsk rättspraxis, rättshistoria (339) @sv
alternative label: Jurymedlemmar, rättshistoria (339) @sv
broader: URN:NBN:fi:au:hklj:330
in scheme: URN:NBN:fi:au:hklj:
notation: 339
related: URN:NBN:fi:au:hklj:192
related: URN:NBN:fi:au:hklj:326.2
related: URN:NBN:fi:au:hklj:336.09
scope note: Yleinen oikeushistoria. Yleinen oikeustieteen historia Tässä esim. noitavainoja koskeva oikeushistoria
scope note: Allmän rättshistoria. Rättsvetenskapens allmänna historia Hit t.ex. häxförföljelser ur rättshistorisk synvinkel @sv

URN:NBN:fi:au:hklj:393.09
alternative label: Ampuma-aseet, asehistoria (393.09)
alternative label: Aseet, asehistoria (393.09)
alternative label: Asehistoria (393.09)
alternative label: Hyökkäysvaunut, historia (393.09)
alternative label: Kilvet, asehistoria (393.09)
alternative label: Käsiaseet, asehistoria (393.09)
alternative label: Panssarivaunut, historia (393.09)
alternative label: Pienaseet, asehistoria (393.09)
alternative label: Pistoolit, asehistoria (393.09)
alternative label: Pyssyt, asehistoria (393.09)
alternative label: Rannikkotykit, historia (393.09)
alternative label: Revolverit, asehistoria (393.09)
alternative label: Ruuti, asetekniikka, historia (393.09)
alternative label: Rynnäkkötykit, historia (393.09)
alternative label: Samurait, aseet, historia (393.09)
alternative label: Tankit, hyökkäysvaunut, historia (393.09)
alternative label: Teräaseet, historia (393.09)
alternative label: Tykit, historia (393.09)
alternative label: Bössor, vapenhistoria (393.09) @sv
alternative label: Eggvapen, historia (393.09) @sv
alternative label: Handvapen, vapenhistoria (393.09) @sv
alternative label: Kanoner, historia (393.09) @sv
alternative label: Krut, vapenteknik, historia (393.09) @sv
alternative label: Kustkanoner, historia (393.09) @sv
alternative label: Pansarvagnar, historia (393.09) @sv
alternative label: Pistoler, vapenhistoria (393.09) @sv
alternative label: Revolvrar, vapenhistoria (393.09) @sv
alternative label: Samurajer, vapen, historia (393.09) @sv
alternative label: Skjutvapen, vapenhistoria (393.09) @sv
alternative label: Sköldar, vapenhistroria (393.09) @sv
alternative label: Småvapen, vapenhistoria (393.09) @sv
alternative label: Stormkanoner, historia (393.09) @sv
alternative label: Stridsvagnar, historia (393.09) @sv
alternative label: Tankar, stridsvagnar, historia (393.09) @sv
alternative label: Vapen, stridsredskap, vapenhistoria (393.09) @sv
alternative label: Vapenhistoria (393.09) @sv
related: Aseteknologia
related: Sotahistoria
related: Suomi
related: Miekkailu
related: Ammunta

Oslo
type: Class
type: Concept
subclass of: Norja
alternative label: Oslo (411.21)
alternative label: Oslo, maantiede, matkat (411.21)
alternative label: Oslo, geografi, resor (411.21) @sv
broader: Norja
in scheme: URN:NBN:fi:au:hklj:
notation: 411.21
related: URN:NBN:fi:au:hklj:460
related: URN:NBN:fi:au:hklj:930
related: Norjan historia

Islanti
type: Class
type: Concept
subclass of: URN:NBN:fi:au:hklj:411
alternative label: Geysirit, Islannin maantiede (411.3)
alternative label: Islanti (411.3)
alternative label: Islanti, maantiede, matkat (411.3)
alternative label: Gejsrar, Islands geografi (411.3) @sv
alternative label: Island (411.3) @sv
alternative label: Island, geografi, resor (411.3) @sv
broader: URN:NBN:fi:au:hklj:411
in scheme: URN:NBN:fi:au:hklj:
notation: 411.3
preferred label: Iceland @en
preferred label: Island @sv
related: URN:NBN:fi:au:hklj:460
related: URN:NBN:fi:au:hklj:930
related: Islannin historia

Kööpenhamina
type: Class
type: Concept
subclass of: Tanska
alternative label: Kööpenhamina (411.41)
alternative label: Kööpenhamina, maantiede, matkat (411.41)
alternative label: Köpenhamn (411.41) @sv
alternative label: Köpenhamn, geografi, resor (411.41) @sv
broader: Tanska
in scheme: URN:NBN:fi:au:hklj:
notation: 411.41
preferred label: Copenhagen @en
preferred label: Köpenhamn @sv
related: URN:NBN:fi:au:hklj:460
related: URN:NBN:fi:au:hklj:930
related: Tanskan historia

Färsaaret
type: Class
type: Concept
subclass of: Tanska
alternative label: Färsaaret (411.42)
alternative label: Färsaaret, maantiede, matkat (411.42)
alternative label: Färöarna (411.42) @sv
alternative label: Färöarna, geografi, resor (411.42) @sv
broader: Tanska
in scheme: URN:NBN:fi:au:hklj:
notation: 411.42
preferred label: Faroe Islands @en
preferred label: Färöarna @sv
related: URN:NBN:fi:au:hklj:460
related: URN:NBN:fi:au:hklj:930
related: Tanskan historia

Alankomaat, Hollanti
type: Class
type: Concept
subclass of: Benelux-maat
alternative label: Alankomaat (413.21)
alternative label: Alankomaat, maantiede, matkat (413.21)
alternative label: Hollanti (413.21)
alternative label: Hollanti, maantiede, matkat (413.21)
alternative label: Holland (413.21) @sv
alternative label: Holland, geografi, resor (413.21) @sv
alternative label: Nederländerna (413.21) @sv
alternative label: Nederländerna, geografi, resor (413.21) @sv
broader: Benelux-maat
in scheme: URN:NBN:fi:au:hklj:
notation: 413.21
preferred label: The Netherlands, Holland @en
preferred label: Nederländerna, Holland @sv
related: URN:NBN:fi:au:hklj:460
related: URN:NBN:fi:au:hklj:970
related: Alankomaiden historia

Belgia
type: Class
type: Concept
subclass of: Benelux-maat
alternative label: Belgia (413.22)
alternative label: Belgia, maantiede, matkat (413.22)
alternative label: Belgien (413.22) @sv
alternative label: Belgien, geografi, resor (413.22) @sv
broader: Benelux-maat
in scheme: URN:NBN:fi:au:hklj:
notation: 413.22
preferred label: Belgium @en
preferred label: Belgien @sv
related: URN:NBN:fi:au:hklj:460
related: URN:NBN:fi:au:hklj:970
related: Belgian historia

Luxemburg
type: Class
type: Concept
subclass of: Benelux-maat
alternative label: Luxemburg (413.23)
alternative label: Luxemburg, maantiede, matkat (413.23)
alternative label: Luxemburg, geografi, resor (413.23) @sv
broader: Benelux-maat
in scheme: URN:NBN:fi:au:hklj:
notation: 413.23
preferred label: Luxembourg @en
related: URN:NBN:fi:au:hklj:460
related: URN:NBN:fi:au:hklj:970
related: Belgian historia

Tsekki
type: Class
type: Concept
subclass of: Entisen Tsekkoslovakian alue
alternative label: Tsekki (413.61)
alternative label: Tsekki, maantiede, matkat (413.61)
alternative label: Tjeckien (413.61) @sv
alternative label: Tjeckien, geografi, resor (413.61) @sv
broader: Entisen Tsekkoslovakian alue
in scheme: URN:NBN:fi:au:hklj:
notation: 413.61
preferred label: Czech Republic @en
preferred label: Tjeckien @sv
related: URN:NBN:fi:au:hklj:460
related: Tsekin ja slovakian historia
related: Tsekin historia

Slovakia
type: Class
type: Concept
subclass of: Entisen Tsekkoslovakian alue
alternative label: Slovakia (413.62)
alternative label: Slovakia, maantiede, matkat (413.62)
alternative label: Slovakien (413.62) @sv
alternative label: Slovakien, geografi, resor (413.62) @sv
broader: Entisen Tsekkoslovakian alue
in scheme: URN:NBN:fi:au:hklj:
notation: 413.62
preferred label: Slovakien @sv
related: URN:NBN:fi:au:hklj:460
related: Tsekin ja slovakian historia
related: Slovakian historia

Romania
type: Class
type: Concept
subclass of: Keski-Eurooppa
alternative label: Romania (413.7)
alternative label: Romania, maantiede, matkat (413.7)
alternative label: Rumänien (413.7) @sv
alternative label: Rumänien, geografi, resor (413.7) @sv
broader: Keski-Eurooppa
in scheme: URN:NBN:fi:au:hklj:
notation: 413.7
preferred label: Rumänien @sv
related: Balkanin niemimaa
related: URN:NBN:fi:au:hklj:460
related: Romanian historia

Berliini
type: Class
type: Concept
subclass of: Saksa
alternative label: Berliini (414.1)
alternative label: Berliini, maantiede, matkat (414.1)
alternative label: Länsi-Berliini (414.1)
alternative label: Länsi-Berliini, maantiede, matkat (414.1)
alternative label: Berlin (414.1) @sv
alternative label: Berlin, geografi, resor (414.1) @sv
alternative label: Västberlin (414.1) @sv
alternative label: Västberlin, geografi, resor (414.1) @sv
broader: Saksa
in scheme: URN:NBN:fi:au:hklj:
notation: 414.1
preferred label: Berlin @en
related: Keski-Eurooppa
related: URN:NBN:fi:au:hklj:460
related: SAKSAN HISTORIA

Bulgaria
type: Class
type: Concept
subclass of: Balkanin niemimaa
alternative label: Bulgaria (419.33)
alternative label: Bulgaria, maantiede, matkat (419.33)
alternative label: Bulgarien (419.33) @sv
alternative label: Bulgarien, geografi, resor (419.33) @sv
broader: Balkanin niemimaa
in scheme: URN:NBN:fi:au:hklj:
notation: 419.33
preferred label: Bulgarien @sv
related: URN:NBN:fi:au:hklj:460
related: URN:NBN:fi:au:hklj:979
related: Bulgarian historia

Albania
type: Class
type: Concept
subclass of: Balkanin niemimaa
alternative label: Albania (419.34)
alternative label: Albania, maantiede, matkat (419.34)
alternative label: Albanien (419.34) @sv
alternative label: Albanien, geografi, resor (419.34) @sv
broader: Balkanin niemimaa
in scheme: URN:NBN:fi:au:hklj:
notation: 419.34
preferred label: Albanien @sv
related: URN:NBN:fi:au:hklj:460
related: URN:NBN:fi:au:hklj:979
related: Albanian historia

Malta
type: Class
type: Concept
subclass of: Etelä-Eurooppa
alternative label: Malta (419.4)
alternative label: Malta, maantiede, matkat (419.4)
alternative label: Malta, geografi, resor (419.4) @sv
broader: Etelä-Eurooppa
in scheme: URN:NBN:fi:au:hklj:
notation: 419.4
related: URN:NBN:fi:au:hklj:460
related: URN:NBN:fi:au:hklj:979
related: Maltan historia

Israel. Palestiina
type: Class
type: Concept
subclass of: AASIA
alternative label: Etu-Aasia (421 ... 422)
alternative label: Etu-Aasia, maantiede, matkat (421 ... 422)
alternative label: Israel (422)
alternative label: Israel, maantiede, matkat (422)
alternative label: Jerusalem (422)
alternative label: Jerusalem, maantiede, matkat (422)
alternative label: Lähi-Itä (421 ... 422)
alternative label: Lähi-Itä, maantiede, matkat (421 ... 422)
alternative label: Palestiina (422)
alternative label: Palestiina, maantiede, matkat (422)
alternative label: Vähä-Aasia (421 ... 422)
alternative label: Vähä-Aasia, maantiede, matkat (421 ... 422)
alternative label: Främre Asien (421 ... 422) @sv
alternative label: Främre Asien, geografi, resor (421 ... 422) @sv
alternative label: Israel, geografi, resor (422) @sv
alternative label: Jerusalem, geografi, resor (422) @sv
alternative label: Mellanöstern (421 ... 422) @sv
alternative label: Mellanöstern, geografi, resor (421 ... 422) @sv
alternative label: Mindre Asien (421 ... 422) @sv
alternative label: Mindre Asien, geografi, resor (421 ... 422) @sv
alternative label: Palestina (422) @sv
alternative label: Palestina, geografi, resor (422) @sv
broader: AASIA
in scheme: URN:NBN:fi:au:hklj:
notation: 422
preferred label: Israel. Palestine @en
preferred label: Israel. Palestina @sv
related: Egyptin ja Etu-Aasian muinaishistoria ja arkeologia
related: Etu-Aasian historia
related: Israelin ja Palestiinan historia

Etelä-Aasia
type: Class
type: Concept
subclass of: AASIA
alternative label: Andamaanit (429)
alternative label: Andamaanit, maantiede, matkat (429)
alternative label: Bangladesh (429)
alternative label: Bangladesh, maantiede, matkat (429)
alternative label: Bengali (429)
alternative label: Bengali, maantiede, matkat (429)
alternative label: Bhutan (429)
alternative label: Bhutan, maantiede, matkat (429)
alternative label: Ceylon (429)
alternative label: Ceylon, maantiede, matkat (429)
alternative label: Dalit, kastijärjestelmä, Intia (429)
alternative label: Dalitit, kastijärjestelmä, Intia (429)
alternative label: Etelä-Aasia (429)
alternative label: Etelä-Aasia, maantiede, matkat (429)
alternative label: Etu-Intia (429)
alternative label: Etu-Intia, maantiede, matkat (429)
alternative label: Intia (429)
alternative label: Intia, maantiede, matkat (429)
alternative label: Kastijärjestelmä, Intia (429)
alternative label: Kastittomat, kastijärjestelmä, Intia (429)
alternative label: Lakkadiivit (429)
alternative label: Lakkadiivit, maantiede, matkat (429)
alternative label: Malediivit (429)
alternative label: Malediivit, maantiede, matkat (429)
alternative label: Nepal (429)
alternative label: Nepal, maantiede, matkat (429)
alternative label: Nikobaarit (429)
alternative label: Nikobaarit, maantiede, matkat (429)
alternative label: Paariat, kastijärjestelmä, Intia (429)
alternative label: Pakistan (429)
alternative label: Pakistan, maantiede, matkat (429)
alternative label: Sherpat, Nepal (429)
alternative label: Sikhit, Intia (429)
alternative label: Singaleesit, Sri Lanka (429)
alternative label: Sri Lanka (429)
alternative label: Sri Lanka, maantiede, matkat (429)
alternative label: Andamanerna (429) @sv
alternative label: Andamanerna, geografi, resor (429) @sv
alternative label: Bangladesh, geografi, resor (429) @sv
alternative label: Bengal (429) @sv
alternative label: Bengal, geografi, resor (429) @sv
alternative label: Bhutan, geografi, resor (429) @sv
alternative label: Ceylon, geografi, resor (429) @sv
alternative label: Daliter, kastväsen, Indien (429) @sv
alternative label: Främre Indien (429) @sv
alternative label: Främre Indien, geografi, resor (429) @sv
alternative label: Indien (429) @sv
alternative label: Indien, geografi, resor (429) @sv
alternative label: Kastlösa, kastväsen, Indien (429) @sv
alternative label: Kastväsen, Indien (429) @sv
alternative label: Lackadiverna (429) @sv
alternative label: Lackadiverna, geografi, resor (429) @sv
alternative label: Maldiverna (429) @sv
alternative label: Maldiverna, geografi, resor (429) @sv
alternative label: Nepal, geografi, resor (429) @sv
alternative label: Nikobarerna (429) @sv
alternative label: Nikobarerna, geografi, resor (429) @sv
alternative label: Oberörbara, kastväsen, Indien (429) @sv
alternative label: Pakistan, geografi, resor (429) @sv
alternative label: Sherpa, Nepal (429) @sv
alternative label: Sikher, Indien (429) @sv
alternative label: Singaleser, Sri Lanka (429) @sv
alternative label: Sri Lanka, geografi, resor (429) @sv
alternative label: Sydasien (429) @sv
alternative label: Sydasien, geografi, resor (429) @sv
broader: AASIA
in scheme: URN:NBN:fi:au:hklj:
notation: 429
preferred label: South Asia @en
preferred label: Sydasien @sv
related: Keski-Aasia
related: Etelä-Aasian historia
scope note: Bangladesh. Bhutan. Intia. Malediivit. Nepal. Pakistan. Sri Lanka Tässä myös Kashmir, Andamaanit, Kookossaaret ja Nikobaarit Tässä myös Mt. Everest ja K2
scope note: Bangladesh. Bhutan. Indien. Maldiverna. Nepal. Pakistan. Sri Lanka Hit också Kashmir, Andamarerna, Kokosöarna och Nikobarerna Hit också Mt. Everest och K2 @sv

Egypti. Sudan. Etelä-Sudan
type: Class
type: Concept
subclass of: AFRIKKA
alternative label: Egypti (432)
alternative label: Egypti, maantiede, matkat (432)
alternative label: Egyptin arabitasavalta (432)
alternative label: Egyptin arabitasavalta, maantiede, matkat (432)
alternative label: Etelä-Sudan (432)
alternative label: Etelä-Sudan, maantiede, matkat (432)
alternative label: Pohjois-Afrikka, Egypti ja Sudan (432)
alternative label: Sudan (432)
alternative label: Sudan, maantiede, matkat (432)
alternative label: Arabrepubliken Egypten (432) @sv
alternative label: Arabrepubliken Egypten, geografi, resor (432) @sv
alternative label: Egypten (432) @sv
alternative label: Egypten, geografi, resor (432) @sv
alternative label: Nordafrika, Egypten och Sudan (432) @sv
alternative label: Sudan, geografi, resor (432) @sv
alternative label: Sydsudan (432) @sv
alternative label: Sydsudan, geografi, resor (432) @sv
broader: AFRIKKA
in scheme: URN:NBN:fi:au:hklj:
notation: 432
preferred label: Egypt. Sudan. South Sudan @en
preferred label: Egypten. Sudan. Sydsudan @sv
related: Pohjois-Afrikka
related: Egyptin ja Etu-Aasian muinaishistoria ja arkeologia
related: Pohjois-Afrikan historia

Afrikan saaret
type: Class
type: Concept
subclass of: AFRIKKA
alternative label: Afrikan saaret (439)
alternative label: Afrikan saaret, maantiede, matkat (439)
alternative label: Aldabrasaaret (439)
alternative label: Aldabrasaaret, maantiede, matkat (439)
alternative label: Amirantit (439)
alternative label: Amirantit, maantiede, matkat (439)
alternative label: Ascension (439)
alternative label: Ascension, maantiede, matkat (439)
alternative label: Azorit (439)
alternative label: Azorit, maantiede, matkat (439)
alternative label: Kanarian saaret (439)
alternative label: Kanarian saaret, maantiede, matkat (439)
alternative label: Kap Verde (439)
alternative label: Kap Verde, maantiede, matkat (439)
alternative label: Komorit (439)
alternative label: Komorit, maantiede, matkat (439)
alternative label: Madagaskar (439)
alternative label: Madagaskar, maantiede, matkat (439)
alternative label: Madeira (439)
alternative label: Madeira, maantiede, matkat (439)
alternative label: Mauritius (439)
alternative label: Mauritius, maantiede, matkat (439)
alternative label: Mayotte (439)
alternative label: Mayotte, maantiede, matkat (439)
alternative label: Principe (439)
alternative label: Principe, maantiede, matkat (439)
alternative label: Réunion (439)
alternative label: Réunion, maantiede, matkat (439)
alternative label: Saint Helena (439)
alternative label: Saint Helena, maantiede, matkat (439)
alternative label: Sao Tomé ja Principe (439)
alternative label: Sao Tomé ja Principe, maantiede, matkat (439)
alternative label: Seychellit (439)
alternative label: Seychellit, maantiede, matkat (439)
alternative label: Tristan da Cunha (439)
alternative label: Tristan da Cunha, maantiede, matkat (439)
alternative label: Afrikas öar (439) @sv
alternative label: Afrikas öar, geografi, resor (439) @sv
alternative label: Aldabraöarna (439) @sv
alternative label: Aldabraöarna, geografi, resor (439) @sv
alternative label: Amiranterna (439) @sv
alternative label: Amiranterna, geografi, resor (439) @sv
alternative label: Ascension, geografi, resor (439) @sv
alternative label: Azorerna (439) @sv
alternative label: Azorerna, geografi, resor (439) @sv
alternative label: Kanarieöarna (439) @sv
alternative label: Kanarieöarna, geografi, resor (439) @sv
alternative label: Kap Verde, geografi, resor (439) @sv
alternative label: Komorerna (439) @sv
alternative label: Komorerna, geografi, resor (439) @sv
alternative label: Madagaskar, geografi, resor (439) @sv
alternative label: Madeira, geografi, resor (439) @sv
alternative label: Mauritius, geografi, resor (439) @sv
alternative label: Mayotte, geografi, resor (439) @sv
alternative label: Principe, geografi, resor (439) @sv
alternative label: Réunion, geografi, resor (439) @sv
alternative label: Saint Helena, geografi, resor (439) @sv
alternative label: Sao Tomé och Principe (439) @sv
alternative label: Sao Tomé och Principe, geografi, resor (439) @sv
alternative label: Seychellerna (439) @sv
alternative label: Seychellerna, geografi, resor (439) @sv
alternative label: Tristan da Cunha, geografi, resor (439) @sv
broader: AFRIKKA
in scheme: URN:NBN:fi:au:hklj:
notation: 439
preferred label: Islands around Africa @en
preferred label: Öarna kring Afrika @sv
related: Espanja
related: Portugali
related: Afrikan historia
scope note: Aldabrasaaret. Amirantit. Ascension. Azorit. Kanarian saaret. Kap Verde. Komorit. Madagaskar. Madeira. Mauritius. Mayotte. Réunion. Saint Helena. Sao Tomé ja Principe. Seychellit. Tristan da Cunha
scope note: Aldabrasöarna. Amiranterna. Ascension. Azorerna. Comorerna. Kanarieöarna. Kap Verde. Madagaskar. Madeira. Mauritius. Mayotte. Réunion. Saint Helena. São Tomé och Príncipe. Seychellerna. Tristan da Cunha @sv

Brasilia
type: Class
type: Concept
subclass of: AMERIKKA
alternative label: Amazonas (448)
alternative label: Amazonas, maantiede, matkat (448)
alternative label: Brasilia (448)
alternative label: Brasilia, maantiede, matkat (448)
alternative label: Etelä-Amerikka, Brasilia (448)
alternative label: Eteläamerikkalaiset, brasilialaiset (448)
alternative label: Latinalainen Amerikka, Etelä-Amerikka (447 ... 449)
alternative label: Amazonas, geografi, resor (448) @sv
alternative label: Brasilien (448) @sv
alternative label: Brasilien, geografi, resor (448) @sv
alternative label: Latinamerika, Sydamerika (447 ... 449) @sv
alternative label: Sydamerika, Brasilien (448) @sv
alternative label: Sydamerikaner, brasilianare (448) @sv
broader: AMERIKKA
in scheme: URN:NBN:fi:au:hklj:
notation: 448
preferred label: Brazil @en
preferred label: Brasilien @sv
related: Etelä-Amerikka
related: Keski-Amerikan historia
related: Etelä-Amerikan historia

Argentiina
type: Class
type: Concept
subclass of: AMERIKKA
alternative label: Argentiina (449)
alternative label: Argentiina, maantiede, matkat (449)
alternative label: Etelä-Amerikka, Argentiina (449)
alternative label: Eteläamerikkalaiset, argentiinalaiset (449)
alternative label: Falklandinsaaret (449)
alternative label: Falklandinsaaret, maantiede, matkat (449)
alternative label: Latinalainen Amerikka, Etelä-Amerikka (447 ... 449)
alternative label: Malvinassaaret (449)
alternative label: Malvinassaaret, maantiede, matkat (449)
alternative label: Pampat, Argentiinan maantiede (449)
alternative label: Tulimaa, Argentiina (449)
alternative label: Argentina (449) @sv
alternative label: Argentina, geografi, resor (449) @sv
alternative label: Eldslandet, Argentina (449) @sv
alternative label: Falklandsöarna (449) @sv
alternative label: Falklandsöarna, geografi, resor (449) @sv
alternative label: Latinamerika, Sydamerika (447 ... 449) @sv
alternative label: Malvinasöarna (449) @sv
alternative label: Malvinasöarna, geografi, resor (449) @sv
alternative label: Pampas, Argentinas geografi (449) @sv
alternative label: Sydamerika, Argentina (449) @sv
alternative label: Sydamerikaner, argentinare (449) @sv
broader: AMERIKKA
in scheme: URN:NBN:fi:au:hklj:
notation: 449
preferred label: Argentina @en
related: Etelä-Amerikka
related: Keski-Amerikan historia
related: Etelä-Amerikan historia
scope note: Tässä myös Falklandinsaaret
scope note: Hit också Falklandsöarna @sv

Tyynen meren saaret
type: Class
type: Concept
subclass of: AUSTRALIA. OSEANIA. NAPAMAAT
alternative label: Bismarckinsaaret (456)
alternative label: Bismarckinsaaret, maantiede, matkat (456)
alternative label: Cookinsaaret (456)
alternative label: Cookinsaaret, maantiede, matkat (456)
alternative label: Ellisinsaaret (456)
alternative label: Ellisinsaaret, maantiede, matkat (456)
alternative label: Etelämeren saaret (451 ... 456)
alternative label: Etelämeren saaret, maantiede, matkat (451 ... 456)
alternative label: Fidzisaaret (456)
alternative label: Fidzisaaret, maantiede, matkat (456)
alternative label: Galapagossaaret (456)
alternative label: Galapagossaaret, maantiede, matkat (456)
alternative label: Gilbertinsaaret (456)
alternative label: Gilbertinsaaret, maantiede, matkat (456)
alternative label: Guam (456)
alternative label: Guam, maantiede, matkat (456)
alternative label: Joulusaari (456)
alternative label: Joulusaari, maantiede, matkat (456)
alternative label: Karoliinit, Tyynen meren saaret (456)
alternative label: Kiribati (456)
alternative label: Kiribati, maantiede, matkat (456)
alternative label: Kookossaari (456)
alternative label: Kookossaari, maantiede, matkat (456)
alternative label: Länsi-Samoa (456)
alternative label: Länsi-Samoa, maantiede, matkat (456)
alternative label: Mariaanit (456)
alternative label: Mariaanit, maantiede, matkat (456)
alternative label: Marquesassaaret (456)
alternative label: Marquesassaaret, maantiede, matkat (456)
alternative label: Marshallin saaret (456)
alternative label: Marshallin saaret, maantiede, matkat (456)
alternative label: Melanesia (456)
alternative label: Melanesia, maantiede, matkat (456)
alternative label: Mikronesia (456)
alternative label: Mikronesia, maantiede, matkat (456)
alternative label: Naurun tasavalta (456)
alternative label: Naurun tasavalta, maantiede, matkat (456)
alternative label: Niue (456)
alternative label: Niue, maantiede, matkat (456)
alternative label: Norfolkinsaari (456)
alternative label: Norfolkinsaari, maantiede, matkat (456)
alternative label: Palau (456)
alternative label: Palau, maantiede, matkat (456)
alternative label: Pitcairn (456)
alternative label: Pitcairn, maantiede, matkat (456)
alternative label: Polynesia (456)
alternative label: Polynesia, maantiede, matkat (456)
alternative label: Pääsiäissaari (456)
alternative label: Pääsiäissaari, maantiede, matkat (456)
alternative label: Salomonsaaret (456)
alternative label: Salomonsaaret, maantiede, matkat (456)
alternative label: Samoa (456)
alternative label: Samoa, maantiede, matkat (456)
alternative label: Seurasaaret (456)
alternative label: Seurasaaret, maantiede, matkat (456)
alternative label: Tahiti (456)
alternative label: Tahiti, maantiede, matkat (456)
alternative label: Tokelau (456)
alternative label: Tokelau, maantiede, matkat (456)
alternative label: Tonga (456)
alternative label: Tonga, maantiede, matkat (456)
alternative label: Tuvalu (456)
alternative label: Tuvalu, maantiede, matkat (456)
alternative label: Tyynen meren saaret (456)
alternative label: Tyynen meren saaret, maantiede, matkat (456)
alternative label: Uudet-Hebridit (456)
alternative label: Uudet-Hebridit, maantiede, matkat (456)
alternative label: Uusi-Kaledonia (456)
alternative label: Uusi-Kaledonia, maantiede, matkat (456)
broader: AUSTRALIA. OSEANIA. NAPAMAAT
in scheme: URN:NBN:fi:au:hklj:
notation: 456
related: Australia. Uusi-Seelanti. Uusi-Guinea
related: Havaiji
related: URN:NBN:fi:au:hklj:989
scope note: Tyynen meren saaria koskevat yleisteokset Melanesia. Mikronesia. Polynesia Bismarckinsaaret. Cookinsaaret. Fidzi. Galapagossaaret. Gilbertinsaaret. Guam. Johnstoninsaari. Joulusaari. Karoliinit. Kiribati. Kookossaari. Mariaanit. Marquesassaaret. Marshallinsaaret. Midwaysaaret. Nauru. Niuesaari. Norfolkinsaari. Palau. Phoenixsaaret. Pitcairn. Pohjois-Mariaanit. Pääsiäissaari. Ranskan Polynesia. Salomonsaaret. Samoa. Seurasaaret. Tahiti. Tokelau. Tonga. Tuvalu. Uudet-Hebridit. Uusi-Kaledonia. Wallis- ja Futunasaaret. Vanuatu
scope note: Allmänna verk som rör öarna i Stilla havet Melanesien. Mikronesien. Polynesien Bismarcköarna. Carolinerna. Cooköarna. Fiji. Franska Polynesien. Galapagosöarna. Gilbertöarna. Guam. Johnstonöarna. Julön. Kiribati. Kokosöarna. Marianerna. Marquesasöarna. Marshallöarna. Midwayöarna. Nauru. Niue. Nordmarianerna. Norfolkön. Nya Hebriderna. Nya Kaledonien. Palau. Phoenixöarna. Pitcairn. Påskön. Salomonöarna. Samoa. Sällskapsöarna. Tahiti. Tokelau Tonga. Tuvalu. Wallis- och Futunaöarna. Vanuatu @sv

Geodesia. Maanmittaus. Paikannus. Geoinformatiikka
type: Class
type: Concept
subclass of: FYYSINEN MAANTIEDE
alternative label: Astemittaus (483)
alternative label: Etäisyydenmittaus, maanmittaus (483)
alternative label: Fotogrammetria (483)
alternative label: GPS (483)
alternative label: GPS, geodesia (483)
alternative label: Geodeettiset projektiot (483)
alternative label: Geodesia (483)
alternative label: Geoidi, geodesia (483)
alternative label: Geoinformatiikka (483)
alternative label: Geostatistiikka, geodesia (483)
alternative label: Ilmakuvamittaus (483)
alternative label: Ilmakuvat (483)
alternative label: Ilmakuvaus (483)
alternative label: Ilmansuunnat, maanmittaus (483)
alternative label: Kartoitus, maanmittaus (483)
alternative label: Kaupunkimittaus (483)
alternative label: Kenttämittaus (483)
alternative label: Kiinteistö- ja mittaustoimi, maanmittaus (483)
alternative label: Kiinteistötoimitus, maanmittaus (483)
alternative label: Kiintopistemittaus (483)
alternative label: Kolmiomittaus (483)
alternative label: Korkeudenmittaus, maanmittaus (483)
alternative label: Korkeussuhteet, maanmittaus (483)
alternative label: Lokalisointi, geodesia, maanmittaus (483)
alternative label: Maanmittaus (483)
alternative label: Maanmittaushallinto (483)
alternative label: Maanpinnan korkeus, maanmittaus (483)
alternative label: Maantieteellinen paikanmääritys, geodesia, maanmittaus (483)
alternative label: Matemaattinen maantiede (483)
alternative label: Mittaus, etäisyydenmittaus (483)
alternative label: Mittaus, fotogrammetria (483)
alternative label: Mittaus, kolmiomittaus (483)
alternative label: Mittaus, korkeudenmittaus (483)
alternative label: Mittaus, maanmittaus (483)
alternative label: Mittaus, monikulmiomittaus (483)
alternative label: Mittaus, pituudenmittaus (483)
alternative label: Monikulmiomittaus (483)
alternative label: Navigointilaitteet, satelliittipaikannusjärjestelmä (483)
alternative label: Paikallistaminen, geodesia, maanmittaus (483)
alternative label: Paikanmääritys (483)
alternative label: Paikanmääritys, geodesia, maanmittaus (483)
alternative label: Paikannus (483)
alternative label: Paikannus, geodesia, maanmittaus (483)
alternative label: Paikka, geodesia, maanmittaus (483)
alternative label: Pinta-ala, maanmittaus (483)
alternative label: Pituuspiirit, geodesia (483)
alternative label: Projektio, geodesia (483)
alternative label: Satelliitit, geodesia (483)
alternative label: Satelliittikuvaus (483)
alternative label: Satelliittipaikannus (483)
alternative label: Satelliittipaikannus, geodesia (483)
alternative label: Sisätilapaikannus (483)
alternative label: Stereokartoitus, geodesia (483)
alternative label: Teodoliitit (483)
alternative label: Triangulaatio, geodesia (483)
alternative label: Vaaitus (483)
alternative label: Area, lantmäteri (483) @sv
alternative label: Avståndsmätning, lantmäteri (483) @sv
alternative label: Avvägning (483) @sv
alternative label: Fastighets- och mätningsväsen, lantmäteri (483) @sv
alternative label: Fastighetsförrättning, lantmäteri (483) @sv
alternative label: Fixpunktsmätning (483) @sv
alternative label: Flygbilder (483) @sv
alternative label: Flygfotografering (483) @sv
alternative label: Flygmätning (483) @sv
alternative label: Fotogrammetri (483) @sv
alternative label: Fältmätning (483) @sv
alternative label: GPS, geodesi (483) @sv
alternative label: Geodesi (483) @sv
broader: FYYSINEN MAANTIEDE
in scheme: URN:NBN:fi:au:hklj:
notation: 483
related: Kartografia
related: GEOLOGIA
related: Valokuvauksen materiaalit ja tekniikka. Valokuvausoppaat
scope note: Geodeettiset kojeet, mittaus ja mittausvälineet Kolmiomittaus. Maastomittaus. Kaupunkimittaus. Fotogrammetria. Ilma- ja satelliittikuvaus. Ilmakuvamittaus. Geodeettiset projektiot Maantieteellinen paikanmääritys ja satelliittipaikannus yleensä. GPS yleensä Geoinformatiikka yleensä Jos teos koskee sekä kartografiaa että geodesiaa tai maanmittausta, on etusija luokalla 482
scope note: Geodetisk apparatur, mätning och mätinstrument Triangelmätning. Terrängmätning. Stadsmätning. Fotogrammetri. Flyg- och satellitfotografering. Flygfotografimätning. Geodetiska projektioner Geoinformatik i allmänhet Geografgisk ortbestämning och satellitnavigering i allmänhet. GPS i allmänhet Om verket rör såväl kartografi som geodesi eller lantmäteri ges företräde åt klass 482 @sv

URN:NBN:fi:au:hklj:520.084
alternative label: Astronomia, tähtikartat (520.084)
alternative label: Atlakset, tähtikartastot (520.084)
alternative label: Kartastot, tähtikartat (520.084)
alternative label: Kartat, tähtikartat (520.084)
alternative label: Planetaariot (520.084)
alternative label: Tähdet, tähtikartat (520.084)
alternative label: Tähdistöt, tähtikartat (520.084)
alternative label: Tähtijoukot, tähtikartat (520.084)
alternative label: Tähtikartat (520.084)
alternative label: Tähtisumut, tähtikartat (520.084)
alternative label: Tähtitiede, tähtikartat (520.084)
alternative label: Astronomi, stjärnkartor (520.084) @sv
alternative label: Atlaser, stjärnkartor (520.084) @sv
alternative label: Kartor, stjärnkartor (520.084) @sv
alternative label: Kartverk, stjärnkartor (520.084) @sv
alternative label: Nebulosor, stjärnkartor (520.084) @sv
alternative label: Planetarier (520.084) @sv
alternative label: Stellarastronomi, stjärnkartor (520.084) @sv
alternative label: Stjärnbilder, stjärnkartor (520.084) @sv
alternative label: Stjärnhopar, stjärnkartor (520.084) @sv
alternative label: Stjärnkartor (520.084) @sv
alternative label: Stjärnor, stjärnkartor (520.084) @sv
related: Maailmankartat. Maailmankartastot
related: Kartografia
related: TÄHTITIEDE
related: Tähtitieteelliset kojeet
related: Tähtijärjestelmät. Aurinkokunnat

Aineoppi. Aineenkoetus
type: Class
type: Concept
subclass of: URN:NBN:fi:au:hklj:620
alternative label: Aineenkoetus (620.15)
alternative label: Aineenkoetuskokeet (620.15)
alternative label: Aineensuojelu (620.15)
alternative label: Aineoppi, tekniikka (620.15)
alternative label: Aineviat, tekniikka (620.15)
alternative label: Iskukokeet, aineenkoetus (620.15)
alternative label: Korroosio, aineenkoetus (620.15)
alternative label: Korroosiokokeet (620.15)
alternative label: Korroosionesto (620.15)
alternative label: Korroosionkestävyys (620.15)
alternative label: Kovuus, tekninen aineoppi (620.15)
alternative label: Kovuuskokeet (620.15)
alternative label: Kuluminen, aineoppi (620.15)
alternative label: Kulumiskokeet (620.15)
alternative label: Materiaalinkoetus (620.15)
alternative label: Materiaalit, aineenkoetus (620.15)
alternative label: Materiaalitekniikka (620.15)
alternative label: Rikkomaton aineenkoetus (620.15)
alternative label: Taivutuskokeet (620.15)
alternative label: Taivutuslujuus (620.15)
alternative label: Vetokokeet, aineenkoetus (620.15)
alternative label: Virumiskokeet (620.15)
alternative label: Väsyminen, aineenkoetus (620.15)
alternative label: Väsymiskokeet (620.15)
alternative label: Väsymislujuus, aineenkoetus (620.15)
alternative label: Vääntökokeet (620.15)
alternative label: Böjhållfasthet (620.15) @sv
alternative label: Böjprov (620.15) @sv
alternative label: Dragprov, materialprovning (620.15) @sv
alternative label: Hårdhet, teknisk materiallära (620.15) @sv
alternative label: Hårdhetsprov (620.15) @sv
alternative label: Korrosion, materialprovning (620.15) @sv
alternative label: Korrosionsbeständighet (620.15) @sv
alternative label: Korrosionsprov (620.15) @sv
alternative label: Korrosionsskydd (620.15) @sv
alternative label: Krypmekanik (620.15) @sv
alternative label: Material, materiaalit, materialprovning (620.15) @sv
alternative label: Materialfel, teknik (620.15) @sv
alternative label: Materiallära, teknik (620.15) @sv
alternative label: Materialprovning (620.15) @sv
alternative label: Materialprovning (tester) (620.15) @sv
alternative label: Materialskydd (620.15) @sv
alternative label: Materialteknik (620.15) @sv
alternative label: Oförstörande materialprovning (620.15) @sv
alternative label: Slagprov, materialprovning (620.15) @sv
alternative label: Slitage, materiallära (620.15) @sv
alternative label: Slitprov (620.15) @sv
alternative label: Utmattning, materialprovning (620.15) @sv
alternative label: Utmattningshållfasthet, materialprovning (620.15) @sv
alternative label: Utmattningsprov (620.15) @sv
alternative label: Vridprov (620.15) @sv
broader: URN:NBN:fi:au:hklj:620
in scheme: URN:NBN:fi:au:hklj:
notation: 620.15
preferred label: Materials. Materials testing @en
preferred label: Materiallära. Materialprovning @sv
related: Kokeellinen fysiikka
related: Tekninen mekaniikka
related: Tavaraoppi
scope note: Aineopin ja aineenkoetuksen yleisteokset Aineiden mekaanisten ominaisuuksien ja rakenteen tutkimus ja testaus yleensä Aineensuojelu, aine- ja pintaviat yleensä Erikoisalojen aineoppi ja aineenkoetus alan mukaisessa luokassa
scope note: Allmänna verk om materiallära och materialprovning Testning och undersökning av materialens mekaniska egenskaper och struktur i allmänhet Materialskydd, materialfel och ytfel i allmänhet Materiallära och materialprovning som rör specialområden klassificeras enligt område @sv

Metallurgia. Metallioppi
type: Class
type: Concept
subclass of: KEMIAN TEOLLISUUS. KAIVOSTEOLLISUUS
alternative label: Alumiini, metallioppi (645)
alternative label: Alumiini, rikastus ja jalostus (645)
alternative label: Alumiinimalmit, metallurgia (645)
alternative label: Epäpuhtaudet, metallien jalostus (645)
alternative label: Erotusmenetelmät, metallien jalostus (645)
alternative label: Gallium, alkuaineet, metallurgia (645)
alternative label: Haponkestävä teräs, metallurgia (645)
alternative label: Harvinaiset maametallit, metallioppi (645)
alternative label: Hiiliteräs, teräksen tuotanto (645)
alternative label: Hopea, metallurgia (645)
alternative label: Hopeamalmit, jalostus ja rikastus (645)
alternative label: Hydrometallurgia (645)
alternative label: Jalometallit, metallioppi, metallurgia (645)
alternative label: Jalostaminen, metallit, metallurgia (645)
alternative label: Jalostus, metallit, metallurgia (645)
alternative label: Jauhemetallurgia (645)
alternative label: Järvimalmit, jalostus ja rikastus (645)
alternative label: Kevytmetalliseokset (645)
alternative label: Kevytmetallit, metallioppi (645)
alternative label: Kevytmetallit, metallurgia (645)
alternative label: Kobolttimalmit, jalostus ja rikastus (645)
alternative label: Korroosio, metallioppi (645)
alternative label: Kromaus (645)
alternative label: Kromi, metallioppi (645)
alternative label: Kromimalmit, jalostus ja rikastus (645)
alternative label: Kulta, metallioppi (645)
alternative label: Kultamalmit, jalostus ja rikastus (645)
alternative label: Kupari, kuparimalmi, jalostus (645)
alternative label: Kupari, metallioppi (645)
alternative label: Kuparimalmit, jalostus ja rikastus (645)
alternative label: Kupariseokset (645)
alternative label: Lantanidit, metallioppi (645)
alternative label: Lantanoidit, metallioppi (645)
alternative label: Lejeeringit, metallurgia (645)
alternative label: Lyijy, lyijymalmi, jalostus (645)
alternative label: Lyijy, metallioppi (645)
alternative label: Lyijymalmit, jalostus ja rikastus (645)
alternative label: Maametallit, metallioppi (645)
alternative label: Malmit, jalostus ja rikastus (645)
alternative label: Mangaani, metallurgia (645)
alternative label: Mangaanimalmit, jalostus ja rikastus (645)
alternative label: Messinki, metallioppi (645)
alternative label: Metalliala, metallurgia (645)
alternative label: Metallien perusteollisuus, metallurgia (645)
alternative label: Metallien valmistus (645)
alternative label: Metallimalmit, jalostus ja rikastus (645)
alternative label: Metallioppi (645)
alternative label: Metalliseokset, metallurgia (645)
alternative label: Metallit, metallioppi (645)
alternative label: Metallit, metallurgia (645)
alternative label: Metallografia (645)
alternative label: Metallurgia (645)
alternative label: Mikrorakenne, metallurgia (645)
alternative label: Mikrorakenteet, metallurgia (645)
alternative label: Molybdeeni, metallurgia (645)
alternative label: Nanorakenteet, metallurgia (645)
alternative label: Nikkeli, metallioppi (645)
alternative label: Platina, metallioppi (645)
alternative label: Platinametallit, metallurgia (645)
alternative label: Pronssi, metalliseokset (645)
alternative label: Puolimetallit, metallioppi (645)
alternative label: Puolimetallit, metallurgia (645)
alternative label: Raskasmetallit, metallioppi, metallurgia (645)
alternative label: Rauta, metallioppi (645)
alternative label: Rauta, rautamalmit, jalostus (645)
alternative label: Rautamalmit, jalostus ja rikastus (645)
alternative label: Rautateollisuus, metallurgia (645)
alternative label: Rikastamot (645)
alternative label: Rikasteet, metallurgia (645)
broader: KEMIAN TEOLLISUUS. KAIVOSTEOLLISUUS
in scheme: URN:NBN:fi:au:hklj:
notation: 645
related: Epäorgaaninen kemia
related: URN:NBN:fi:au:hklj:631
related: Kaivos- ja kaivannaisteollisuus
scope note: Metallurgisen teollisuuden liiketalous, tuotantomenetelmät, rationalisointi, työt, prosessit, koneet, raaka-aineet, tuotanto ja tuotteiden kauppa Metallien rikastus, jalostus ja kehittäminen malmeista Raudan teräksen ja muiden metallien tuotanto ja kauppa Metallioppi. Metallit. Lejeeringit. Metalliseokset. Jalometallit. Raskasmetallit. Kevytmetallit. Maametallit Metallien rakenne ja ominaisuudet. Korroosio ja sen esto
scope note: Företagsekonomi, produktionsmetoder, rationalisering, arbete, processer, maskiner, råmaterial, produktion och handel inom metallurgisk industri Anrikning, förädling och utveckling av malmer till metall Produktion av och handel med järn, stål och andra metaller Metallära. Metaller. Legeringar. Ädelmetaller. Tungmetaller. Lättmetaller. Jordmetaller Metallernas struktur och egenskaper. Korrosion och korrosionsskydd @sv

URN:NBN:fi:au:hklj:7.9
alternative label: Galegon kieli , kaunokirjallisuus (7.9)
alternative label: Galician kieli, kaunokirjallisuus (7.9)
alternative label: Oksitaanin kieli, kaunokirjallisuus (7.9)
alternative label: Retoromaanin kieli, kaunokirjallisuus (7.9)
alternative label: Sardin kieli, kaunokirjallisuus (7.9)
alternative label: Galego, skönlitteratur (7.9) @sv
alternative label: Galiciska, skönlitteratur (7.9) @sv
alternative label: Occitanska, skönlitteratur (7.9) @sv
alternative label: Retoromanska, skönlitteratur (7.9) @sv
alternative label: Sardiska, skönlitteratur (7.9) @sv
related: URN:NBN:fi:au:hklj:5
related: URN:NBN:fi:au:hklj:6
related: URN:NBN:fi:au:hklj:7.8
related: ROMAANISTEN, SLAAVILAISTEN JA BALTTILAISTEN KIELTEN KIRJALLISUUDEN HISTORIA JA TUTKIMUS
related: URN:NBN:fi:au:hklj:9.3

Saksa
type: Class
type: Concept
subclass of: Länsi- ja Keski-Eurooppa
alternative label: Saksa, arkkitehtuuri (720.931)
alternative label: Tyskland, arkitektur (720.931) @sv
broader: Länsi- ja Keski-Eurooppa
in scheme: URN:NBN:fi:au:hklj:
notation: 720.931
preferred label: Germany @en
preferred label: Tyskland @sv
related: URN:NBN:fi:au:hklj:709
related: Arkkitehtuurikilpailut. Arkkitehtuurinäyttelyt. Arkkitehtuuripalkinnot
related: URN:NBN:fi:au:hklj:749.1

Brittein saaret
type: Class
type: Concept
subclass of: Länsi- ja Keski-Eurooppa
alternative label: Britannia, arkkitehtuuri (720.934)
alternative label: Eire, arkkitehtuuri (720.934)
alternative label: Englanti, arkkitehtuuri (720.934)
alternative label: Irlanti, arkkitehtuuri (720.934)
alternative label: Iso-Britannia, arkkitehtuuri (720.934)
alternative label: Yhdistynyt kuningaskunta, arkkitehtuuri (720.934)
alternative label: Britannien, arkitektur (720.934) @sv
alternative label: Eire, arkitektur (720.934) @sv
alternative label: England, arkitektur (720.934) @sv
alternative label: Förenade konungariket, arkitektur (720.934) @sv
alternative label: Irland, arkitektur (720.934) @sv
alternative label: Storbritannien, arkitektur (720.934) @sv
broader: Länsi- ja Keski-Eurooppa
in scheme: URN:NBN:fi:au:hklj:
notation: 720.934
preferred label: British Isles @en
preferred label: Brittiska öarna @sv
related: URN:NBN:fi:au:hklj:709
related: Arkkitehtuurikilpailut. Arkkitehtuurinäyttelyt. Arkkitehtuuripalkinnot
related: URN:NBN:fi:au:hklj:749.1
scope note: Iso-Britannia. Irlanti
scope note: Storbritannien. Irland @sv

Espanja
type: Class
type: Concept
subclass of: Etelä-Eurooppa
alternative label: Espanja, arkkitehtuuri (720.942)
alternative label: Spanien, arkitektur (720.942) @sv
broader: Etelä-Eurooppa
in scheme: URN:NBN:fi:au:hklj:
notation: 720.942
preferred label: Spain @en
preferred label: Spanien @sv
related: URN:NBN:fi:au:hklj:709
related: Arkkitehtuurikilpailut. Arkkitehtuurinäyttelyt. Arkkitehtuuripalkinnot
related: URN:NBN:fi:au:hklj:749.1
scope note: Tässä myös Gibraltar
scope note: Hit också Gibraltar @sv

Venäjä
type: Class
type: Concept
subclass of: Itä-Eurooppa
alternative label: Venäjä, arkkitehtuuri (720.951)
alternative label: Ryssland, arkitektur (720.951) @sv
broader: Itä-Eurooppa
in scheme: URN:NBN:fi:au:hklj:
notation: 720.951
preferred label: Russia @en
preferred label: Ryssland @sv
related: URN:NBN:fi:au:hklj:709
related: Arkkitehtuurikilpailut. Arkkitehtuurinäyttelyt. Arkkitehtuuripalkinnot
related: URN:NBN:fi:au:hklj:749.1
scope note: Tässä myös Venäjän Aasian puoleiset alueet
scope note: Hit också de asiatiska områdena av Ryssland @sv

Säveloppi
type: Class
type: Concept
subclass of: Musiikin teoria
alternative label: 12-säveljärjestelmä, säveloppi (782.2)
alternative label: 12-säveltekniikka, säveloppi (782.2)
alternative label: Asteikot, sävelasteikot (782.2)
alternative label: Atonaalisuus, säveloppi (782.2)
alternative label: Diktaatti (782.2)
alternative label: Dodekafonia, säveloppi (782.2)
alternative label: Intervallit, sävelasteikot (782.2)
alternative label: Kaksitoistasäveljärjestelmä, säveloppi (782.2)
alternative label: Kaksitoistasäveltekniikka, säveloppi (782.2)
alternative label: Kirkkosävellajit (782.2)
alternative label: Kromatiikka, säveloppi (782.2)
alternative label: Melodiadiktaatit, säveltapailu (782.2)
alternative label: Mikrotonaalinen musiikki, säveloppi (782.2)
alternative label: Modaalisuus, säveloppi (782.2)
alternative label: Moodit (782.2)
alternative label: Sävelasteikot (782.2)
alternative label: Säveljärjestelmät (782.2)
alternative label: Sävellajit (782.2)
alternative label: Säveloppi (782.2)
alternative label: Säveltapailu (782.2)
alternative label: Tonaalisuus, säveloppi (782.2)
alternative label: 12-tonssystem, tonlära (782.2) @sv
alternative label: 12-tonsteknik, tonlära (782.2) @sv
alternative label: Atonalitet, tonlära (782.2) @sv
alternative label: Diktat (782.2) @sv
alternative label: Dodekafoni, tonlära (782.2) @sv
alternative label: Intervaller, tonsystem (782.2) @sv
alternative label: Kromatik, melodik (782.2) @sv
alternative label: Kyrkotonarter (782.2) @sv
alternative label: Melodidiktat, tonträffning (782.2) @sv
alternative label: Mikrointervallmusik, tonlära (782.2) @sv
alternative label: Modalitet, tonlära (782.2) @sv
alternative label: Modus, moodit (782.2) @sv
alternative label: Skalor, tonskalor (782.2) @sv
alternative label: Tolvtonssystem, tonlära (782.2) @sv
alternative label: Tolvtonsteknik, tonlära (782.2) @sv
alternative label: Tonalitet, tonlära (782.2) @sv
alternative label: Tonarter (782.2) @sv
alternative label: Tonlära (782.2) @sv
alternative label: Tonskalor (782.2) @sv
alternative label: Tonsystem (782.2) @sv
alternative label: Tonträffning (782.2) @sv
broader: Musiikin teoria
in scheme: URN:NBN:fi:au:hklj:
notation: 782.2
preferred label: Melodics @en
preferred label: Melodibildningslära @sv
related: Musiikin filosofia, estetiikka, psykologia ja sosiologia Musiikkikasvatus. Musiikkiopetus
related: Musiikin estetiikka ja filosofia
scope note: Säveloppi musiikin lajista riippumatta Säveljärjestelmät. Viritysjärjestelmät. Säveltapailu
scope note: Melodibildningslära oavsett musikslag Tonsystem. Stämsystem. Tonträffning @sv

Kamariorkesterit (yli 9, yleensä alle 25 soittajaa)
type: Class
type: Concept
subclass of: URN:NBN:fi:au:hklj:785
alternative label: Jousiorkesterit (785.2)
alternative label: Jousisoittimet, jousiorkesterit (785.2)
alternative label: Kamariorkesterit (785.2)
alternative label: Kouluorkesterit (785.2)
alternative label: Orkesterimusiikki, kamariorkesterit (785.2)
alternative label: Orkesterit, kamariorkesterit (785.2)
alternative label: Sinfonietat (785.2)
alternative label: Kammarorkestrar (785.2) @sv
alternative label: Orkestermusik, kammarorkestrar (785.2) @sv
alternative label: Orkestrar, kammarorkestrar (785.2) @sv
alternative label: Sinfoniettor (785.2) @sv
alternative label: Skolorkestrar (785.2) @sv
alternative label: Stråkinstrument, stråkorkestrar (785.2) @sv
alternative label: Stråkorkestrar (785.2) @sv
broader: URN:NBN:fi:au:hklj:785
in scheme: URN:NBN:fi:au:hklj:
notation: 785.2
preferred label: Chamber orchestras (members more than 9, generally less than 25) @en
preferred label: Kammarorkestrar (fler än 9, i allmänhet mindre än 25 medlemmar) @sv
related: Puhallinorkesterit
related: URN:NBN:fi:au:hklj:789
scope note: Eri soitinryhmien soittimia sisältävät kamariorkesterit Jousiorkesterit. Kouluorkesterit
scope note: Kammarorkestrar med instrument ur olika instrumentgrupper Stråkorkestrar. Skolorkestrar @sv

Konsertot kolmelle tai useammalle soittimelle
type: Class
type: Concept
subclass of: Konsertot
alternative label: Kolmoiskonsertot (785.622)
alternative label: Trippelkonserter (785.622) @sv
broader: Konsertot
in scheme: URN:NBN:fi:au:hklj:
notation: 785.622
preferred label: Concerti for three or more instruments @en
preferred label: Konserter för tre eller fler instrument @sv
related: URN:NBN:fi:au:hklj:785.4
related: URN:NBN:fi:au:hklj:786
related: URN:NBN:fi:au:hklj:789

Konsertot kahdelle soittimelle
type: Class
type: Concept
subclass of: Konsertot
alternative label: Kaksoiskonsertot (785.623)
alternative label: Dubbelkonserter (785.623) @sv
broader: Konsertot
in scheme: URN:NBN:fi:au:hklj:
notation: 785.623
preferred label: Concerti for two instruments @en
preferred label: Konserter för två instrument @sv
related: URN:NBN:fi:au:hklj:785.4
related: URN:NBN:fi:au:hklj:786
related: URN:NBN:fi:au:hklj:789

Pianokonsertot
type: Class
type: Concept
subclass of: Konsertot yhdelle kosketinsoittimelle
alternative label: Piano, konsertot (785.6241)
alternative label: Piano, konserter (785.6241) @sv
broader: Konsertot yhdelle kosketinsoittimelle
in scheme: URN:NBN:fi:au:hklj:
notation: 785.6241
preferred label: Piano concerti @en
preferred label: Pianokonserter @sv
related: URN:NBN:fi:au:hklj:785.4
related: URN:NBN:fi:au:hklj:786
related: URN:NBN:fi:au:hklj:789

Cembalokonsertot
type: Class
type: Concept
subclass of: Konsertot yhdelle kosketinsoittimelle
alternative label: Cembalo, konsertot (785.6242)
alternative label: Kielflügel, konsertot (785.6242)
alternative label: Cembalo, konserter (785.6242) @sv
alternative label: Kielflügel, konserter (785.6242) @sv
broader: Konsertot yhdelle kosketinsoittimelle
in scheme: URN:NBN:fi:au:hklj:
notation: 785.6242
preferred label: Harpsichord concerti @en
preferred label: Cembalokonserter @sv
related: URN:NBN:fi:au:hklj:785.4
related: URN:NBN:fi:au:hklj:786
related: URN:NBN:fi:au:hklj:789

Urkukonsertot
type: Class
type: Concept
subclass of: Konsertot yhdelle kosketinsoittimelle
broader: Konsertot yhdelle kosketinsoittimelle
in scheme: URN:NBN:fi:au:hklj:
notation: 785.6243
preferred label: Organ concerti @en
preferred label: Orgelkonserter @sv
related: URN:NBN:fi:au:hklj:785.4
related: URN:NBN:fi:au:hklj:786
related: URN:NBN:fi:au:hklj:789

Harppukonsertot
type: Class
type: Concept
subclass of: Konsertot yhdelle näppäinsoittimelle
alternative label: Harppu, harppukonsertot (785.6251)
alternative label: Harpa, harpkonserter (785.6251) @sv
broader: Konsertot yhdelle näppäinsoittimelle
in scheme: URN:NBN:fi:au:hklj:
notation: 785.6251
preferred label: Concerti for harp @en
preferred label: Konserter för harpa @sv
related: URN:NBN:fi:au:hklj:785.4
related: URN:NBN:fi:au:hklj:786
related: URN:NBN:fi:au:hklj:789

Kitarakonsertot
type: Class
type: Concept
subclass of: Konsertot yhdelle näppäinsoittimelle
alternative label: Akustinen kitara, konsertot (785.6253)
alternative label: Kitara, konsertot (785.6253)
alternative label: Akustisk gitarr, konserter (785.6253) @sv
alternative label: Gitarr, konserter (785.6253) @sv
broader: Konsertot yhdelle näppäinsoittimelle
in scheme: URN:NBN:fi:au:hklj:
notation: 785.6253
preferred label: Concerti for guitar @en
preferred label: Gitarrkonserter @sv
related: URN:NBN:fi:au:hklj:785.4
related: URN:NBN:fi:au:hklj:786
related: URN:NBN:fi:au:hklj:789

Luuttukonsertot
type: Class
type: Concept
subclass of: Konsertot yhdelle näppäinsoittimelle
broader: Konsertot yhdelle näppäinsoittimelle
in scheme: URN:NBN:fi:au:hklj:
notation: 785.6255
preferred label: Concerti for lute @en
preferred label: Konserter för luta @sv
related: URN:NBN:fi:au:hklj:785.4
related: URN:NBN:fi:au:hklj:786
related: URN:NBN:fi:au:hklj:789

Mandoliinikonsertot
type: Class
type: Concept
subclass of: Konsertot yhdelle näppäinsoittimelle
broader: Konsertot yhdelle näppäinsoittimelle
in scheme: URN:NBN:fi:au:hklj:
notation: 785.6256
preferred label: Concerti for mandolin @en
preferred label: Mandolinkonserter @sv
related: URN:NBN:fi:au:hklj:785.4
related: URN:NBN:fi:au:hklj:786
related: URN:NBN:fi:au:hklj:789

Konsertot muille näppäinsoittimille
type: Class
type: Concept
subclass of: Konsertot yhdelle näppäinsoittimelle
broader: Konsertot yhdelle näppäinsoittimelle
in scheme: URN:NBN:fi:au:hklj:
notation: 785.6259
preferred label: Concerti for other plucked-string instrument @en
preferred label: Konserter för andra knäppinstrument @sv
related: URN:NBN:fi:au:hklj:785.4
related: URN:NBN:fi:au:hklj:786
related: URN:NBN:fi:au:hklj:789

Viulukonsertot
type: Class
type: Concept
subclass of: Konsertot yhdelle jousisoittimelle
alternative label: Viulu, konsertot (785.6261)
alternative label: Violin, konserter (785.6261) @sv
broader: Konsertot yhdelle jousisoittimelle
in scheme: URN:NBN:fi:au:hklj:
notation: 785.6261
preferred label: Concerti for violin @en
preferred label: Violinkonserter @sv
related: URN:NBN:fi:au:hklj:785.4
related: URN:NBN:fi:au:hklj:786
related: URN:NBN:fi:au:hklj:789

Alttoviulukonsertot
type: Class
type: Concept
subclass of: Konsertot yhdelle jousisoittimelle
alternative label: Alttoviulu, konsertot (785.6262)
alternative label: Viola, konsertot (785.6262)
alternative label: Altviolin, konserter (785.6262) @sv
alternative label: Viola, konserter (785.6262) @sv
broader: Konsertot yhdelle jousisoittimelle
in scheme: URN:NBN:fi:au:hklj:
notation: 785.6262
preferred label: Concerti for viola @en
preferred label: Konserter för atviolin @sv
related: URN:NBN:fi:au:hklj:785.4
related: URN:NBN:fi:au:hklj:786
related: URN:NBN:fi:au:hklj:789

Sellokonsertot
type: Class
type: Concept
subclass of: Konsertot yhdelle jousisoittimelle
alternative label: Sello, konsertot (785.6263)
alternative label: Cello, konserter (785.6263) @sv
broader: Konsertot yhdelle jousisoittimelle
in scheme: URN:NBN:fi:au:hklj:
notation: 785.6263
preferred label: Concerti for cello @en
preferred label: Cellokonserter @sv
related: URN:NBN:fi:au:hklj:785.4
related: URN:NBN:fi:au:hklj:786
related: URN:NBN:fi:au:hklj:789

Kontrabassokonsertot
type: Class
type: Concept
subclass of: Konsertot yhdelle jousisoittimelle
alternative label: Kontrabasso, konsertot (785.6264)
alternative label: Kontrabas, konserter (785.6264) @sv
broader: Konsertot yhdelle jousisoittimelle
in scheme: URN:NBN:fi:au:hklj:
notation: 785.6264
preferred label: Concerti for double bass @en
preferred label: Konserter för kontrabas @sv
related: URN:NBN:fi:au:hklj:785.4
related: URN:NBN:fi:au:hklj:786
related: URN:NBN:fi:au:hklj:789

Konsertot muille jousisoittimille
type: Class
type: Concept
subclass of: Konsertot yhdelle jousisoittimelle
broader: Konsertot yhdelle jousisoittimelle
in scheme: URN:NBN:fi:au:hklj:
notation: 785.6269
preferred label: Concerti for other bowed-string instrument @en
preferred label: Konserter för andra stråkinstrument @sv
related: URN:NBN:fi:au:hklj:785.4
related: URN:NBN:fi:au:hklj:786
related: URN:NBN:fi:au:hklj:789

Huilukonsertot
type: Class
type: Concept
subclass of: Konsertot yhdelle puupuhaltimelle
alternative label: Huilu, konsertot (785.6271)
alternative label: Flöjt, konserter (785.6271) @sv
broader: Konsertot yhdelle puupuhaltimelle
in scheme: URN:NBN:fi:au:hklj:
notation: 785.6271
preferred label: Concerti for flute @en
preferred label: Flöjtkonserter @sv
related: URN:NBN:fi:au:hklj:785.4
related: URN:NBN:fi:au:hklj:786
related: URN:NBN:fi:au:hklj:789

Nokkahuilukonsertot
type: Class
type: Concept
subclass of: Konsertot yhdelle puupuhaltimelle
alternative label: Nokkahuilu, konsertot (785.6272)
alternative label: Blockflöjt, konserter (785.6272) @sv
broader: Konsertot yhdelle puupuhaltimelle
in scheme: URN:NBN:fi:au:hklj:
notation: 785.6272
preferred label: Concerti for recorder @en
preferred label: Blockflöjtskonserter @sv
related: URN:NBN:fi:au:hklj:785.4
related: URN:NBN:fi:au:hklj:786
related: URN:NBN:fi:au:hklj:789

Klarinettikonsertot
type: Class
type: Concept
subclass of: Konsertot yhdelle puupuhaltimelle
alternative label: Klarinetti, konsertot (785.6273)
alternative label: Klarinett, konserter (785.6273) @sv
broader: Konsertot yhdelle puupuhaltimelle
in scheme: URN:NBN:fi:au:hklj:
notation: 785.6273
preferred label: Concerti for clarinet @en
preferred label: Klarinettkonserter @sv
related: URN:NBN:fi:au:hklj:785.4
related: URN:NBN:fi:au:hklj:786
related: URN:NBN:fi:au:hklj:789

Saksofonikonsertot
type: Class
type: Concept
subclass of: Konsertot yhdelle puupuhaltimelle
alternative label: Saksofoni, konsertot (785.6274)
alternative label: Saxofon, konserter (785.6274) @sv
broader: Konsertot yhdelle puupuhaltimelle
in scheme: URN:NBN:fi:au:hklj:
notation: 785.6274
preferred label: Concerti for saxophone @en
preferred label: Saxofonkonserter @sv
related: URN:NBN:fi:au:hklj:785.4
related: URN:NBN:fi:au:hklj:786
related: URN:NBN:fi:au:hklj:789

Oboekonsertot
type: Class
type: Concept
subclass of: Konsertot yhdelle puupuhaltimelle
alternative label: Oboe, konsertot (785.6275)
alternative label: Oboe, konserter (785.6275) @sv
broader: Konsertot yhdelle puupuhaltimelle
in scheme: URN:NBN:fi:au:hklj:
notation: 785.6275
preferred label: Concerti for oboe @en
preferred label: Oboekonserter @sv
related: URN:NBN:fi:au:hklj:785.4
related: URN:NBN:fi:au:hklj:786
related: URN:NBN:fi:au:hklj:789

Fagottikonsertot
type: Class
type: Concept
subclass of: Konsertot yhdelle puupuhaltimelle
alternative label: Fagotti, konsertot (785.6276)
alternative label: Fagott, konserter (785.6276) @sv
broader: Konsertot yhdelle puupuhaltimelle
in scheme: URN:NBN:fi:au:hklj:
notation: 785.6276
preferred label: Concerti for bassoon @en
preferred label: Fagottkonserter @sv
related: URN:NBN:fi:au:hklj:785.4
related: URN:NBN:fi:au:hklj:786
related: URN:NBN:fi:au:hklj:789

Konsertot muille puupuhaltimille
type: Class
type: Concept
subclass of: Konsertot yhdelle puupuhaltimelle
broader: Konsertot yhdelle puupuhaltimelle
in scheme: URN:NBN:fi:au:hklj:
notation: 785.6279
preferred label: Concerti for other woodwind instruments @en
preferred label: Konserter för andra träblåsinstrument @sv
related: URN:NBN:fi:au:hklj:785.4
related: URN:NBN:fi:au:hklj:786
related: URN:NBN:fi:au:hklj:789

Käyrätorvikonsertot
type: Class
type: Concept
subclass of: Konsertot yhdelle vaskipuhaltimelle
alternative label: Käyrätorvi, konsertot (785.6281)
alternative label: Valthorn, konserter (785.6281) @sv
broader: Konsertot yhdelle vaskipuhaltimelle
in scheme: URN:NBN:fi:au:hklj:
notation: 785.6281
preferred label: Concerti for French horn @en
preferred label: Valthornskonserter @sv
related: URN:NBN:fi:au:hklj:785.4
related: URN:NBN:fi:au:hklj:786
related: URN:NBN:fi:au:hklj:789

Trumpettikonsertot
type: Class
type: Concept
subclass of: Konsertot yhdelle vaskipuhaltimelle
alternative label: Trumpetti, konsertot (785.6282)
alternative label: Trumpet, konserter (785.6282) @sv
broader: Konsertot yhdelle vaskipuhaltimelle
in scheme: URN:NBN:fi:au:hklj:
notation: 785.6282
preferred label: Concerti for trumpet @en
preferred label: Trumpetkonserter @sv
related: URN:NBN:fi:au:hklj:785.4
related: URN:NBN:fi:au:hklj:786
related: URN:NBN:fi:au:hklj:789

Pasuunakonsertot
type: Class
type: Concept
subclass of: Konsertot yhdelle vaskipuhaltimelle
alternative label: Pasuuna, konsertot (785.6285)
alternative label: Basun, konserter (785.6285) @sv
broader: Konsertot yhdelle vaskipuhaltimelle
in scheme: URN:NBN:fi:au:hklj:
notation: 785.6285
preferred label: Concerti for trombone @en
preferred label: Konserter för dragbasun @sv
related: URN:NBN:fi:au:hklj:785.4
related: URN:NBN:fi:au:hklj:786
related: URN:NBN:fi:au:hklj:789

Tuubakonsertot
type: Class
type: Concept
subclass of: Konsertot yhdelle vaskipuhaltimelle
alternative label: Tuuba, konsertot (785.6286)
alternative label: Tuba, konserter, kompositioner (785.6286) @sv
broader: Konsertot yhdelle vaskipuhaltimelle
in scheme: URN:NBN:fi:au:hklj:
notation: 785.6286
preferred label: Concerti for tuba @en
preferred label: Tubakonserter @sv
related: URN:NBN:fi:au:hklj:785.4
related: URN:NBN:fi:au:hklj:786
related: URN:NBN:fi:au:hklj:789

Konsertot muille vaskipuhaltimille
type: Class
type: Concept
subclass of: Konsertot yhdelle vaskipuhaltimelle
broader: Konsertot yhdelle vaskipuhaltimelle
in scheme: URN:NBN:fi:au:hklj:
notation: 785.6289
preferred label: Concerti for other brass instruments @en
preferred label: Konserter för andra bleckblåsinstrument @sv
related: URN:NBN:fi:au:hklj:785.4
related: URN:NBN:fi:au:hklj:786
related: URN:NBN:fi:au:hklj:789

Konsertot muille soolosoittimille
type: Class
type: Concept
subclass of: Konsertot
broader: Konsertot
in scheme: URN:NBN:fi:au:hklj:
notation: 785.629
preferred label: Concerti for other solo instruments @en
preferred label: Konserter för andra soloinstrument @sv
related: URN:NBN:fi:au:hklj:785.4
related: URN:NBN:fi:au:hklj:786
related: URN:NBN:fi:au:hklj:789
scope note: Tässä myös soolot muille soittimille orkesterin säestämänä
scope note: Hit också solopartier för andra instrument till orkesterackompajemang @sv

Yleisurheilu
type: Class
type: Concept
subclass of: Liikunta. Urheilu
alternative label: Aitajuoksu (791.1)
alternative label: Ampumajuoksu (791.1)
alternative label: Estejuoksu (791.1)
alternative label: Heittolajit, yleisurheilu (791.1)
alternative label: Hyppylajit, yleisurheilu (791.1)
alternative label: Hyppääminen, yleisurheilu (791.1)
alternative label: Hölkkä (791.1)
alternative label: Juokseminen (791.1)
alternative label: Juoksu (791.1)
alternative label: Juoksulajit (791.1)
alternative label: Keihäänheitto (791.1)
alternative label: Kenttälajit, yleisurheilu (791.1)
alternative label: Kestävyysjuoksu (791.1)
alternative label: Kiekonheitto (791.1)
alternative label: Kiipeilyjuoksu, kestävyysjuoksu (791.1)
alternative label: Kilpajuoksu (791.1)
alternative label: Kilpakävely (791.1)
alternative label: Kolmiloikka (791.1)
alternative label: Korkeushyppy (791.1)
alternative label: Kuntopolut, kuntoliikunta (791.1)
alternative label: Kuntoradat, kuntoliikunta (791.1)
alternative label: Kuulantyöntö (791.1)
alternative label: Kymmenottelu (791.1)
alternative label: Kävely, liikunta ja yleisurheilu (791.1)
alternative label: Kävelyurheilu (791.1)
alternative label: Maastojuoksu (791.1)
alternative label: Maratonjuoksu (791.1)
alternative label: Moniottelut, yleisurheilu (791.1)
alternative label: Moukarinheitto (791.1)
alternative label: Pikajuoksu (791.1)
alternative label: Pituushyppy (791.1)
alternative label: Pururadat, kuntoliikunta (791.1)
alternative label: Radat, kuntoradat (791.1)
alternative label: Ratajuoksut (791.1)
alternative label: Sauvakävely (791.1)
alternative label: Seitsenottelu, yleisurheilu (791.1)
alternative label: Seiväshyppy (791.1)
alternative label: Ultrajuoksu, kestävyysjuoksu (791.1)
alternative label: Viestilajit, yleisurheilu (791.1)
alternative label: Viestit, urheilu, yleisurheilu (791.1)
alternative label: Vuorijuoksu, kestävyysjuoksu (791.1)
alternative label: Yleisurheilu (791.1)
alternative label: Ylipitkien matkojen juoksu, kestävyysjuoksu (791.1)
alternative label: Banlöpning (791.1) @sv
alternative label: Banor, motionsslingor (791.1) @sv
alternative label: Bergslöpning, uthållighetslöpning (791.1) @sv
alternative label: Diskus (791.1) @sv
alternative label: Fjällöpning, uthållighetslöpning (791.1) @sv
alternative label: Friidrott (791.1) @sv
alternative label: Gång, motion och friidrott (791.1) @sv
alternative label: Gångsport (791.1) @sv
alternative label: Hinderlöpning (791.1) @sv
alternative label: Hopp, friidrott (791.1) @sv
alternative label: Hoppande, friidrott (791.1) @sv
alternative label: Häcklöpning (791.1) @sv
alternative label: Höjdhopp (791.1) @sv
alternative label: Joggning (791.1) @sv
alternative label: Kapplöpning (791.1) @sv
alternative label: Kast, friidrott (791.1) @sv
alternative label: Kast- och hoppgrenar, friidrott (791.1) @sv
alternative label: Konditionslingor, motionsidrott (791.1) @sv
alternative label: Kula (791.1) @sv
alternative label: Längdhopp (791.1) @sv
alternative label: Löpgrenar (791.1) @sv
alternative label: Löpning (791.1) @sv
alternative label: Löpskytte (791.1) @sv
alternative label: Maratonlöpning (791.1) @sv
alternative label: Motionsslingor, motionsidrott (791.1) @sv
alternative label: Motionsstigar, motionsidrott (791.1) @sv
broader: Liikunta. Urheilu
in scheme: URN:NBN:fi:au:hklj:
notation: 791.1
related: Liikuntatiede ja -tutkimus. Liikuntapolitiikka
related: URN:NBN:fi:au:hklj:791.109
related: Muut urheilu- ja liikuntamuodot
scope note: Juoksu. Kävely. Heitot. Hypyt. Yleisurheilun moniottelut Yleisurheilu kilpa-, huippu-, kunto- ja vammaisurheilun kannalta Yleisurheilukilpailut, -säännöt, -valmennus ja -välineet Yleisurheilukentät ja -tilat. Yleisurheiluseurat ja -järjestöt
scope note: Löpning. Gång. Kast. Hopp. Mångkamp inom friidrotten Friidrott ur tävlings-, elit-, motions- och handikappidrottens synvinkel Friidrottstävlingar, regler, träning och redskap inom friidrott Friidrottsplatser och friidrottslokaler. Friidrottsföreningar och friidrottsförbund @sv

Miekkailu
type: Class
type: Concept
subclass of: Muut urheilu- ja liikuntamuodot
alternative label: Florettimiekkailu (791.91)
alternative label: Kalpamiekkailu (791.91)
alternative label: Kendo (791.91)
alternative label: Miekkailu (791.91)
alternative label: Säilämiekkailu (791.91)
alternative label: Florettfäktning (791.91) @sv
alternative label: Fäktning (791.91) @sv
alternative label: Sabelfäktning (791.91) @sv
alternative label: Värjfäktning (791.91) @sv
broader: Muut urheilu- ja liikuntamuodot
in scheme: URN:NBN:fi:au:hklj:
notation: 791.91
preferred label: Fencing @en
preferred label: Fäktning @sv
related: URN:NBN:fi:au:hklj:393.09
related: Liikuntatiede ja -tutkimus. Liikuntapolitiikka
related: Itämaisperäiset lajit. Budo
scope note: Säilä-, kalpa- ja florettimiekkailu. Tässä myös kendo ja iaido Miekkailu kilpa-, huippu- ja kuntourheilun kannalta Miekkailukilpailut, -säännöt, -valmennus ja -välineet Miekat miekkailu-urheilun kannalta Miekkailuseurat ja -järjestöt
scope note: Fäktning med sabel, värja och florett. Hit också kendo och iaido Fäktning ur tävlings-, elit- och motionsidrottens synvinkel Fäktmatcher, regler, träning och utrustning Svärd ur fäktsportens synvinkel Fäktklubbar och fäktförbund @sv

Nyrkkeily
type: Class
type: Concept
subclass of: Voimailu. Itsepuolustus
alternative label: Kickboxning (793.3)
alternative label: Nyrkkeily (793.3)
alternative label: Potkunyrkkeily (793.3)
alternative label: Thainyrkkeily (793.3)
alternative label: Boxning (793.3) @sv
alternative label: Thaiboxning (793.3) @sv
broader: Voimailu. Itsepuolustus
in scheme: URN:NBN:fi:au:hklj:
notation: 793.3
preferred label: Boxing @en
preferred label: Boxning @sv
related: Muut urheilu- ja liikuntamuodot
related: Itämaisperäiset lajit. Budo
scope note: Tässä myös thainyrkkeily ja potkunyrkkeily Nyrkkeilykilpailut, -säännöt, -valmennus ja -välineet Nyrkkeilyseurat ja -järjestöt
scope note: Hit också thaiboxning och kickboxing Boxningstävlingar, regler, träning och utrustning Boxningsklubbar och boxningsförbund @sv

Jalkapallo
type: Class
type: Concept
subclass of: Palloilu
alternative label: Estäminen, jalkapallo (796.1)
alternative label: Jalkapallo (796.1)
alternative label: Jalkapallokentät (796.1)
alternative label: Kaukalojalkapallo (796.1)
alternative label: Maalivahdit, jalkapallo (796.1)
alternative label: Maalivahdit, jääkiekko (796.1)
alternative label: Fotboll (796.1) @sv
alternative label: Fotbollsplaner (796.1) @sv
alternative label: Förhindrande, fotboll (796.1) @sv
alternative label: Målvakter, fotboll (796.1) @sv
alternative label: Målvakter, ishockey (796.1) @sv
alternative label: Rinkfotboll (796.1) @sv
broader: Palloilu
in scheme: URN:NBN:fi:au:hklj:
notation: 796.1
preferred label: Football @en
preferred label: Fotboll @sv
related: Muut urheilu- ja liikuntamuodot
related: Muut joukkuepelit
related: Pelit
scope note: Jalkapallo-ottelut ja -turnaukset Jalkapallokentät ja -stadionit urheilun kannalta Jalkapallosäännöt, -valmennus ja -välineet Jalkapalloseurat ja -järjestöt
scope note: Fotbollsmatcher och fotbollsturneringar Fotbollsplaner och fotbollsstadion ur sportens synvinkel Fotbollsregler, fotbollsträning och fotbollsutrustning Fotbollsklubbar och fotbollsförbund @sv

Jääkiekko
type: Class
type: Concept
subclass of: Palloilu
alternative label: Estäminen, jääkiekko (796.2)
alternative label: Jääkiekko (796.2)
alternative label: Kypärät, jääkiekko (796.2)
alternative label: Päänsuojaimet, jääkiekko (796.2)
alternative label: Suojakypärät, jääkiekko (796.2)
alternative label: Förhindrande, ishockey (796.2) @sv
alternative label: Hjälmar, ishockey (796.2) @sv
alternative label: Huvudskydd, ishockey (796.2) @sv
alternative label: Ishockey (796.2) @sv
alternative label: Skyddshjälmar, ishockey (796.2) @sv
broader: Palloilu
in scheme: URN:NBN:fi:au:hklj:
notation: 796.2
preferred label: Ice hockey @en
preferred label: Ishockey @sv
related: Muut urheilu- ja liikuntamuodot
related: Muut joukkuepelit
related: Pelit
scope note: Jääkiekko-ottelut ja -turnaukset Jääkiekkokaukalot ja jäähallit jääkiekon kannalta Jääkiekkosäännöt, -valmennus ja -välineet Jääkiekkoseurat ja -järjestöt
scope note: Ishockeymatcher och ishockeyturneringar Ishockeyrinkar och ishallar ur ishockeyns synvinkel Ishockeyregler, ishockeyträning och ishockeyutrustning Ishockeyklubbar och ishockeyförbund @sv

Tennis. Squash. Sulkapallo
type: Class
type: Concept
subclass of: Palloilu
alternative label: Speedminton (796.5)
alternative label: Squash (796.5)
alternative label: Sulkapallo (796.5)
alternative label: Tennis (796.5)
alternative label: Tenniskentät (796.5)
alternative label: Verkkopallo (796.5)
alternative label: Badminton (796.5) @sv
alternative label: Nätboll (796.5) @sv
alternative label: Tennisbanor (796.5) @sv
broader: Palloilu
in scheme: URN:NBN:fi:au:hklj:
notation: 796.5
preferred label: Tennis. Squash. Badminton @en
related: Muut urheilu- ja liikuntamuodot
related: Pöytätennis
related: Pelit
scope note: Tennis-, squash- ja sulkapallo-ottelut ja -turnaukset Tennis-, squash- ja sulkapallokentät ja -hallit urheilun kannalta Tennis-, squash- ja sulkapallosäännöt, -valmennus ja -välineet Tennis-, squash- ja sulkapalloseurat ja -järjestöt
scope note: Matcher och turneringar inom tennis, squash och badminton Tennisplaner och tennishallar samt planer och hallar för squash och badminton ur sportens synvinkel Regler, träning och utrustning för tennis, squash och badminton Tennisklubbar och tennisförbund samt klubbar och förbund för squash och badminton @sv

Pöytätennis
type: Class
type: Concept
subclass of: Palloilu
alternative label: Pingis (796.6)
alternative label: Pöytätennis (796.6)
alternative label: Bordtennis (796.6) @sv
broader: Palloilu
in scheme: URN:NBN:fi:au:hklj:
notation: 796.6
preferred label: Table tennis @en
preferred label: Bordtennis @sv
related: Muut urheilu- ja liikuntamuodot
related: Tennis. Squash. Sulkapallo
related: Pelit
scope note: Pöytätennisottelut ja -turnaukset Pöytätennissäännöt, -valmennus ja -välineet Pöytätennisseurat ja -järjestöt
scope note: Bordtennismatcher och bordtennisturneringar Regler, träning och utrustning för bordtennis Bordtennisklubbar och bordtennisförbund @sv

Sirkus. Huvipuistot. Varietee
type: Class
type: Concept
subclass of: Julkiset huvit
alternative label: Akrobatia, sirkus (799.1)
alternative label: Drag showt (799.1)
alternative label: Eläintenkesyttäjät, sirkus (799.1)
alternative label: Esiintymistaito, sirkus (799.1)
alternative label: Esittäjät, varieteetaiteilijat (799.1)
alternative label: Esittäminen, sirkus (799.1)
alternative label: Esittäminen, varietee (799.1)
alternative label: Esitykset, varietee, sirkus (799.1)
alternative label: Fakiirit, sirkus (799.1)
alternative label: Huvipuistolaitteet, huvipuistot (799.1)
alternative label: Huvipuistot (799.1)
alternative label: Huvit, huvipuistot (799.1)
alternative label: Huvit, sirkus (799.1)
alternative label: Huvit, varietee (799.1)
alternative label: Ilma-akrobatia, sirkus (799.1)
alternative label: Imitaatio (799.1)
alternative label: Imitaattorit (799.1)
alternative label: Imitoijat (799.1)
alternative label: Imitointi (799.1)
alternative label: Jongleeraus (799.1)
alternative label: Jonglöörit (799.1)
alternative label: Jäljittely, imitaatioesitykset (799.1)
alternative label: Kahlekuninkaat (799.1)
alternative label: Karusellit (799.1)
alternative label: Klovneria (799.1)
alternative label: Klovnit, sirkus (799.1)
alternative label: Kokeellinen sirkus (799.1)
alternative label: Koomikot, sirkus, julkiset huvit (799.1)
alternative label: Käärmeenlumoojat (799.1)
alternative label: Maailmanpyörät, huvipuistot (799.1)
alternative label: Narrit, klovnit (799.1)
alternative label: Nykysirkus (799.1)
alternative label: Puistot, huvipuistot (799.1)
alternative label: Seikkailupuistot (799.1)
alternative label: Showt, varietee (799.1)
alternative label: Sirkukset (799.1)
alternative label: Sirkus (799.1)
alternative label: Sirkusala (799.1)
alternative label: Sirkusarvostelut (799.1)
alternative label: Sirkuseläimet, sirkus (799.1)
alternative label: Sirkuskoulut (799.1)
alternative label: Sirkusryhmät (799.1)
alternative label: Sirkustaiteilijat, sirkus (799.1)
alternative label: Sirkustemput (799.1)
alternative label: Talk showt, varietee (799.1)
alternative label: Tivolit (799.1)
alternative label: Trapetsitaiteilijat, sirkus (799.1)
alternative label: Tulennielijät, sirkus (799.1)
alternative label: Tulitaide (799.1)
alternative label: Uusi sirkus (799.1)
alternative label: Varieteet, huvit (799.1)
alternative label: Vatsastapuhuminen (799.1)
alternative label: Vaudeville, varietee (799.1)
alternative label: Vesipuistot (799.1)
alternative label: Vuoristoradat, hyvipuistot (799.1)
alternative label: Yökerhot, julkiset huvit (799.1)
alternative label: Akrobatik, cirkus (799.1) @sv
alternative label: Bergochdalbanor, nöjesparker (799.1) @sv
alternative label: Buktaleri (799.1) @sv
alternative label: Cirkus (799.1) @sv
alternative label: Cirkusar (799.1) @sv
alternative label: Cirkusbranschen (799.1) @sv
alternative label: Cirkusdjur, cirkus (799.1) @sv
alternative label: Cirkusgrupper (799.1) @sv
alternative label: Cirkuskonster (799.1) @sv
alternative label: Cirkuskonstnärer, cirkus (799.1) @sv
alternative label: Cirkusrecensioner (799.1) @sv
alternative label: Cirkusskolor (799.1) @sv
alternative label: Clowner, cirkus (799.1) @sv
alternative label: Clowneri (799.1) @sv
broader: Julkiset huvit
in scheme: URN:NBN:fi:au:hklj:
notation: 799.1
related: Seksologia
related: Taikatemput
scope note: Akrobaatit. Eläintenkesyttäjät. Jonglöörit. Klovnit. Trapetsitaiteilijat. Tulennielijät. Voimailu- ja eläinnumerot Huvipuistojen laitteet. Varietee-esitykset
scope note: Akrobater. Atletik och djurnummer. Clowner. Djurtämjare. Eldslukare. Jonglörer. Trapetskonstnärer Nöjesparkernas attraktioner. Varietéföreställningar @sv

Sanakirjat. Hakuteokset
type: Class
type: Concept
subclass of: URN:NBN:fi:au:hklj:800
alternative label: Elämäkerralliset hakuteokset, kirjailijat (800.03)
alternative label: Esikoiskirjailijat, elämäkerralliset hakuteokset (800.03)
alternative label: Esikoisteokset, elämäkerralliset hakuteokset (800.03)
alternative label: Henkilöhakemistot, kirjailijat (800.03)
alternative label: Kirjailijat, elämäkerralliset hakuteokset (800.03)
alternative label: Lyyrikot, elämäkerralliset hakuteokset (800.03)
alternative label: Matrikkelit, kirjailijat (800.03)
alternative label: Nimikirjat, kirjailijat (800.03)
alternative label: Näytelmäkirjailijat, hakuteokset (800.03)
alternative label: Biografiska uppslagsverk, författare (800.03) @sv
alternative label: Debutförfattare, biografiska uppslagsverk (800.03) @sv
alternative label: Debutverk, biografiska uppslagsverk (800.03) @sv
alternative label: Diktare, biografiska uppslagsverk (800.03) @sv
alternative label: Dramatiker, uppslagsverk (800.03) @sv
alternative label: Författare, biografiska uppslagsverk (800.03) @sv
alternative label: Matriklar, matrikkelit, författare (800.03) @sv
alternative label: Matriklar, nimikirjat, författare (800.03) @sv
broader: URN:NBN:fi:au:hklj:800
in scheme: URN:NBN:fi:au:hklj:
notation: 800.03
preferred label: Dictionaries. Reference books @en
preferred label: Ordböcker. Uppslagsböcker @sv
related: URN:NBN:fi:au:hklj:811.03
related: Elämäkerralliset hakuteokset
scope note: Yleiset kirjallisuustieteen sanakirjat ja hakuteokset sekä yleiset kirjailijamatrikkelit Jos teos koskee tiettyä kirjallisuustyyppiä tai aihepiiriä, tietyn kielen tai tietyn aikakauden kirjallisuutta, on etusija järjestyksessä: kirjallisuustyyppi tai aihepiiri, kieli, aikakausi
scope note: Litteraturvetenskapliga ordböcker och uppslagsböcker i allmänhet samt allmänna författarmatriklar Om verket representerar en bestämd genre eller ett bestämt temaområde inom litteraturen eller om det hänför sig till litteraturen på ett bestämt språk eller under en bestämd tidsperiod, är prioritetsordningen följande: litterär genre eller temaområde, språk, tidsperiod @sv

Kirjailijan työ. Kääntäjän työ
type: Class
type: Concept
subclass of: URN:NBN:fi:au:hklj:800
alternative label: Harrastajakirjoittajat (800.86)
alternative label: Harrastukset, kirjoittaminen (800.86)
alternative label: Kielenkääntäminen, kaunokirjallisuuden (800.86)
alternative label: Kirjailijan työ (800.86)
alternative label: Kirjallinen ilmaisu, kirjailijan työ (800.86)
alternative label: Kirjallinen viestintä, kirjailijan työ (800.86)
alternative label: Kirjallisuuspiirit, kirjailijan työ (800.86)
alternative label: Kirjoittajakoulutus (800.86)
alternative label: Kirjoittajapiirit, kirjoittajakoulutus (800.86)
alternative label: Kirjoittamaan oppiminen, kirjoittajakoulutus (800.86)
alternative label: Kirjoittaminen, kirjailijan työ (800.86)
alternative label: Kirjoittaminen, kirjoittajakoulutus (800.86)
alternative label: Käännökset, kääntäjän työ, kaunokirjallisuus (800.86)
alternative label: Käännöstyö, kaunokirjallisuuden kääntäminen (800.86)
alternative label: Kääntäminen, kaunokirjallisuuden kääntäminen (800.86)
alternative label: Lukupiirit, kirjailijan työ (800.86)
alternative label: Luova kirjoittaminen (800.86)
alternative label: Prosessikirjoittaminen, kirjailijan työ (800.86)
alternative label: Taideharrastukset, kirjoittaminen harrasteena (800.86)
alternative label: Tietokirjailijat, kirjailijan työ (800.86)
alternative label: Tietokoneavusteinen kääntäminen, kaunokirjallisuuden. kääntäminen (800.86)
alternative label: Tulkinta, kaunokirjallisuuden kääntäminen (800.86)
alternative label: Amatörförfattare (800.86) @sv
alternative label: Bokcirklar, författarens arbete (800.86) @sv
alternative label: Datorstödd översättning, översättning av skönlitteratur (800.86) @sv
alternative label: Fackboksförfattare, författarens arbete (800.86) @sv
alternative label: Författarens arbete (800.86) @sv
alternative label: Hobbyer, skrivande (800.86) @sv
alternative label: Konstintressen, skrivande som hobby (800.86) @sv
alternative label: Kreativt skrivande (800.86) @sv
alternative label: Litteraturcirklar, författarens arbete (800.86) @sv
alternative label: Processkrivning, författarens arbete (800.86) @sv
alternative label: Skriftlig framställning, författarens arbete (800.86) @sv
alternative label: Skriftlig kommunikation, författarens arbete (800.86) @sv
alternative label: Skrivande, författarens arbete (800.86) @sv
alternative label: Skrivande, skrivarutbildning (800.86) @sv
alternative label: Skrivarcirklar, skrivarutbildning (800.86) @sv
alternative label: Skrivarutbildning (800.86) @sv
alternative label: Skrivinlärning, skrivarutbildning (800.86) @sv
alternative label: Tolkning, uttydning, översättning av skönlitteratur (800.86) @sv
alternative label: Translation, skönlitteratur (800.86) @sv
alternative label: Översättning, översättning av skönlitteratur (800.86) @sv
alternative label: Översättningar, översättarens arbete, skönlitteratur (800.86) @sv
alternative label: Översättningsarbete, översättning av skönlitteratur (800.86) @sv
broader: URN:NBN:fi:au:hklj:800
in scheme: URN:NBN:fi:au:hklj:
notation: 800.86
preferred label: Authorship. Translating @en
preferred label: Författarens arbete. Översättarens arbete @sv
related: Kansalais-, kansan- ja työväenopistot. Kansankorkeakoulut
related: Harrastajateatteri
related: Kielenkääntäminen. Tulkkaus
scope note: Kirjailijan työ. Kaunokirjallisuuden kääntäjän työ Kirjoittaminen harrastuksena. Harrastajakirjoittajille tarkoitetut oppaat Kirjailija- ja kääntäjäkoulutus Jos teoksessa on sekä kauno- että tietokirjallisuuden kääntämistä, on etusija luokalla 850.7
scope note: Författarens arbete. Den skönlitterära översättarens arbete Författande som hobby. Handböcker för amatörförfattare Författar- och översättarutbildning Om verket handlar om översättning av både skönlitteratur och facklitteratur ges företräde åt klass 850.7 @sv

Esseet. Kirjallisuusarvostelut
type: Class
type: Concept
subclass of: URN:NBN:fi:au:hklj:800
alternative label: Arvostelut, kirjallisuus (804)
alternative label: Kirja-arvostelut (804)
alternative label: Kirjallisuusarvostelut (804)
alternative label: Kritiikki, kirjallisuusarvostelut (804)
alternative label: Bokrecensioner (804) @sv
alternative label: Kritik, litteraturrecensioner (804) @sv
alternative label: Litteraturrecensioner (804) @sv
alternative label: Recensioner, litteratur (804) @sv
broader: URN:NBN:fi:au:hklj:800
in scheme: URN:NBN:fi:au:hklj:
notation: 804
preferred label: Essays. Literary reviews @en
preferred label: Essäer. Litteraturrecensioner @sv
related: Symbolit. Koodit. Merkkijärjestelmät
related: Esseet. Taidearvostelut
related: Kirjallisuuden filosofia, teoria ja estetiikka. Runousoppi
scope note: Yleiset tai sekasisältöiset kirjallisuutta koskevat essee-, puhe-, kirjoitus- ja kirjallisuusarvostelukokoelmat Jos teos koskee tiettyä kirjallisuustyyppiä tai aihepiiriä, tietyn kielen tai tietyn aikakauden kirjallisuutta, on etusija järjestyksessä: kirjallisuustyyppi tai aihepiiri, kieli, aikakausi
scope note: Essäsamlingar samt samlingar av tal och skrifter med allmänt eller blandat innehåll som handlar om litteratur och samlingar av litteraturrecensioner med allmänt eller blandat innehåll Om verket representerar en bestämd genre eller ett bestämt temaområde inom litteraturen eller om det hänför sig till litteraturen på ett bestämt språk eller under en bestämd tidsperiod, är prioritetsordningen följande: litterär genre eller temaområde, språk, tidsperiod @sv

Venäjänkielisen kirjallisuuden historia ja tutkimus
type: Class
type: Concept
subclass of: ROMAANISTEN, SLAAVILAISTEN JA BALTTILAISTEN KIELTEN KIRJALLISUUDEN HISTORIA JA TUTKIMUS
alternative label: Bylinat, folkloristiikka (836)
alternative label: Neuvostokirjallisuus, kirjallisuudenhistoria (836)
alternative label: Neuvostoliitto, kirjallisuudenhistoria (836)
alternative label: Slaavilaiset kielet, kirjallisuuden historia (835 ... 836)
alternative label: Slavistiikka, kirjallisuuden historia (835 ... 836)
alternative label: Slavofiilit, kirjallisuudenhistoria (835 ... 836)
alternative label: Venäjän kieli, kirjallisuuden historia (836)
alternative label: Bylinor, folkloristik (836) @sv
alternative label: Ryska, litteraturhistoria (836) @sv
alternative label: Slaviska språk, litteraturhistoria (835 ... 836) @sv
alternative label: Slavistik, litteraturhistoria (835 ... 836) @sv
alternative label: Slavofiler, litteraturhistoria (835 ... 836) @sv
alternative label: Sovjetlitteratur, litteraturhistoria (836) @sv
alternative label: Sovjetunionen, litteraturhistoria (836) @sv
broader: ROMAANISTEN, SLAAVILAISTEN JA BALTTILAISTEN KIELTEN KIRJALLISUUDEN HISTORIA JA TUTKIMUS
in scheme: URN:NBN:fi:au:hklj:
notation: 836
preferred label: Russian literature: history and research @en
preferred label: Rysk litteraturhistoria och forskning i rysk litteratur @sv
related: URN:NBN:fi:au:hklj:8
related: URN:NBN:fi:au:hklj:8.9
related: Slaavilaisten kielten kirjallisuuden historia ja tutkimus
scope note: Tässä myös Venäjän ja IVY:n alueen kirjallisuuden historian ja tutkimuksen yleisteokset
scope note: Hit också allmänna verk om litteraturhistoria och litteraturforskning i Ryssland och områdena inom OSS @sv

Turkkilaisten kielten kirjallisuuden historia ja tutkimus
type: Class
type: Concept
subclass of: MUIDEN KIELTEN KIRJALLISUUDEN HISTORIA JA TUTKIMUS
alternative label: Azerin kieli, kirjallisuuden historia (844)
alternative label: Turkin kieli, kirjallisuuden historia (844)
alternative label: Azerbajdzjanska, litteraturhistoria (844) @sv
alternative label: Turkiska, litteraturhistoria (844) @sv
broader: MUIDEN KIELTEN KIRJALLISUUDEN HISTORIA JA TUTKIMUS
in scheme: URN:NBN:fi:au:hklj:
notation: 844
preferred label: Turkish languages' literature: history and research @en
preferred label: De turkiska språkens litteraturhistoria och forskning i de turkiska språkens litteratur @sv
related: URN:NBN:fi:au:hklj:9.4
related: URN:NBN:fi:au:hklj:9.973
scope note: Turkinkielisen kirjallisuuden historia ja tutkimus Azerin-, baskiirin-, gagauzin-, jakuutin-, kazakin-, kirgiisin-, tataarin-, tsuvassin-, turkmeenin-, uiguurin- ja uzbekinkielisen kirjallisuuden historia ja tutkimus
scope note: Turkisk litteraturhistoria och forskning i turkisk litteratur Litteraturhistoria och litteraturforskning som rör azerbajdjanska, basjkiriska, gagauziska, jakutiska, kazakiska, kirgisiska, tatariska, tuvinska, turkmenska, uiguriska och uzbekiska @sv

Saksan kielen yksikieliset sanakirjat
type: Class
type: Concept
subclass of: Saksan kieli
alternative label: Saksan kieli, sanakirjat, yksikieliset (874.3)
alternative label: Tyska, ordböcker, enspråkiga (874.3) @sv
broader: Saksan kieli
in scheme: URN:NBN:fi:au:hklj:
notation: 874.3
preferred label: German dictionaries @en
preferred label: Enspråkiga tyska ordböcker @sv
related: Monikieliset sanakirjat. Sivistyssanakirjat
related: URN:NBN:fi:au:hklj:860
related: URN:NBN:fi:au:hklj:874.03
scope note: Saksan kielen yleiset yksikieliset sanakirjat Saksan kielen etymologiset sanakirjat Saksan kielen murre- ja slangisanakirjat Erikoisalojen sanakirjat alan mukaisessa luokassa
scope note: Allmänna enspråkiga ordböcker över tyska Tyska etymologiska ordböcker Tyska dialektordböcker och slangordböcker Ordböcker över specialområden klassificeras enligt område @sv

Englannin kielen kielioppi ja semantiikka
type: Class
type: Concept
subclass of: Englannin kieli
alternative label: Englannin kieli, kielioppi (875.5)
alternative label: Engelska, grammatik (875.5) @sv
broader: Englannin kieli
in scheme: URN:NBN:fi:au:hklj:
notation: 875.5
preferred label: English grammar and semantics @en
preferred label: Engelsk grammatik och betydelselära (semantik) @sv
related: Kielioppi. Muoto-oppi. Sanaoppi. Semantiikka
related: URN:NBN:fi:au:hklj:860
related: Amerikan englannin kieli
scope note: Englannin kielen kielioppi, muoto-oppi, sanaoppi ja semantiikka Englannin kielen kieliopin oppi- ja harjoituskirjat Sanaluokat. Sananmuodostus. Taivutus. Lauseoppi eli syntaksi
scope note: Engelsk betydelselära (semantik), formlära (morfologi), satslära (semantik) och ordlära (lexikologi) Läroböcker och övningsböcker i engelsk grammatik Ordklasser. Ordbildning. Böjning. Satslära (syntax) @sv

Balttilaiset kielet
type: Class
type: Concept
subclass of: GERMAANISET, KELTTILÄISET, BALTTILAISET JA SLAAVILAISET KIELET
alternative label: Balttilaiset kielet (878)
alternative label: Balttilaiset kielet, kielitiede (878)
alternative label: Latvian kieli (878)
alternative label: Latvian kieli, kielitiede (878)
alternative label: Liettuan kieli (878)
alternative label: Liettuan kieli, kielitiede (878)
alternative label: Baltiska språk (878) @sv
alternative label: Baltiska språk, lingvistik (878) @sv
alternative label: Lettiska (878) @sv
alternative label: Lettiska, lingvistik (878) @sv
alternative label: Litauiska (878) @sv
alternative label: Litauiska, lingvistik (878) @sv
broader: GERMAANISET, KELTTILÄISET, BALTTILAISET JA SLAAVILAISET KIELET
in scheme: URN:NBN:fi:au:hklj:
notation: 878
preferred label: Baltic languages @en
preferred label: Baltiska språk @sv
related: URN:NBN:fi:au:hklj:860
scope note: Latvian ja liettuan kieli
scope note: Lettiska och litauiska @sv

Muut ei-indoeurooppalaiset kielet
type: Class
type: Concept
subclass of: MUUT KIELET
alternative label: Ainun kieli (899)
alternative label: Aleutin kieli (899)
alternative label: Amerikka, alkuperäiskielet (899)
alternative label: Australia, alkuperäiskielet (899)
alternative label: Austroaasialaiset kielet (899)
alternative label: Austronesialaiset kielet (899)
alternative label: Austronesialaiset kielet, kielitiede (899)
alternative label: Avaarin kieli (899)
alternative label: Baskin kieli (899)
alternative label: Baskin kieli, kielitiede (899)
alternative label: Dravidakielet (899)
alternative label: Dravidakielet, kielitiede (899)
alternative label: Eskimokielet (899)
alternative label: Eskimokielet, kielitiede (899)
alternative label: Etelä-Amerikka, alkuperäiskielet (899)
alternative label: Etruskin kieli (899)
alternative label: Euskeran kieli (899)
alternative label: Euskeran kieli, kielitiede (899)
alternative label: Georgian kieli (899)
alternative label: Georgian kieli, kielitiede (899)
alternative label: Gruusian kieli (899)
alternative label: Grönlannin kieli (899)
alternative label: Grönlannin kieli, kielitiede (899)
alternative label: Indonesian kieli (899)
alternative label: Indonesian kieli, kielitiede (899)
alternative label: Intiaanikielet (899)
alternative label: Intiaanikielet, kielitiede (899)
alternative label: Inuiittikielet (899)
alternative label: Inuiittikielet, kielitiede (899)
alternative label: Kannadan kieli, kielitiede (899)
alternative label: Kaukasialaiset kielet (899)
alternative label: Khmerin kieli (899)
alternative label: Khmerin kieli, kielitiede (899)
alternative label: Koillissiperialaiset kielet (899)
alternative label: Korjakin kieli (899)
alternative label: Kreolikielet (899)
alternative label: Malaijikielet (899)
alternative label: Malaijilais-polynesialaiset kielet (899)
alternative label: Malaijilais-polynesialaiset kielet, kielitiede (899)
alternative label: Malajalamin kieli (899)
alternative label: Malajalamin kieli, kielitiede (899)
alternative label: Melanesialaiset kielet (899)
alternative label: Mikronesialaiset kielet (899)
alternative label: Mundakielet (899)
alternative label: Oseaaniset kielet (899)
alternative label: Oseania, alkuperäiskielet (899)
alternative label: Oseanian kielet (899)
alternative label: Paleoaasialaiset kielet (899)
alternative label: Paleosiperialaiset kielet (899)
alternative label: Papuakielet (899)
alternative label: Pidginkielet (899)
alternative label: Pohjois-Amerikka, alkuperäiskielet (899)
alternative label: Polynesialaiset kielet (899)
alternative label: Sekakielet (899)
alternative label: Tagalogin kieli (899)
alternative label: Tagalogin kieli, kielitiede (899)
alternative label: Tamilin kieli (899)
alternative label: Tamilin kieli, kielitiede (899)
alternative label: Telugun kieli, kielitiede (899)
alternative label: Tserkessin kieli (899)
alternative label: Tsuktsin kieli (899)
alternative label: suržik, kreolikielet (899)
alternative label: Ainu (899) @sv
alternative label: Aleutiska (899) @sv
alternative label: Amerika, ursprungsspråk (899) @sv
alternative label: Australien, ursprungsspråk (899) @sv
alternative label: Austroasiatiska språk (899) @sv
alternative label: Austronesiska språk (899) @sv
alternative label: Austronesiska språk, lingvistik (899) @sv
alternative label: Avariska (899) @sv
alternative label: Baskiska (899) @sv
broader: MUUT KIELET
in scheme: URN:NBN:fi:au:hklj:
narrower: Viittomakieli
notation: 899
scope note: Baskin kieli. Etruskin kieli Australian ja Oseanian kielet. Papuakielet. Austro- ja paloeoaasialaiset kielet Dravidakielet. Malajalamin kieli. Tamilin kieli. Telugun kieli Austronesialaiset kielet. Khmerin kieli. Tagalogin kieli. Indonesian kieli Georgian, tserkessin ja avaarin kieli Eskimo- ja intiaanikielet. Grönlannin- ja aleutin kieli Pidgin- ja kreolikielet
scope note: Baskiska. Etruskiska Språk i Australien och Oceanien. Papuaspråk. Austroasiatiska och paleoasiatiska språk Dravidiska språk. Malayalam. Tamil. Telugu Austronesiska språk. Khmer. Tagalog. Indonesiska Georgiska, tjerkessiska och avariska Eskimåspråk och indianpråk. Grönländska och aleutiska Pidgin och kreolska @sv

Diplomatiikka
type: Class
type: Concept
subclass of: Historian aputieteet
alternative label: Asiakirjat, diplomatiikka (911.4)
alternative label: Diplomatiikka, historialliset asiakirjat (911.4)
alternative label: Kansainväliset sopimukset, diplomatiikka (911.4)
alternative label: Diplomatik, historiska dokument (911.4) @sv
alternative label: Handlingar, diplomatik (911.4) @sv
alternative label: Internationella överenskommelser, diplomatik (911.4) @sv
broader: Historian aputieteet
in scheme: URN:NBN:fi:au:hklj:
notation: 911.4
preferred label: Diplomatics @en
preferred label: Diplomatik @sv
related: URN:NBN:fi:au:hklj:325
related: Suomen ulkopolitiikka
related: Historian tutkimusmenetelmät
scope note: Historiallisten asiakirjojen tutkimus yleensä Eri maanosia, maita, alueita tai aikakausia koskeva diplomatiikka ko. maanosan, maan, alueen tai aikakauden historian luokassa
scope note: Forskning i historiska dokument i allmänhet Diplomatik som rör olika världsdelar, länder, geografiska områden och tidsperioder förs till klassen för världsdelens, landets, det geografiska områdets eller tidsperiodens historia @sv

Vaakunatiede. Liput
type: Class
type: Concept
subclass of: Historian aputieteet
alternative label: Heraldiikka (911.6)
alternative label: Juhlaliputus, liput (911.6)
alternative label: Järjestöliput (911.6)
alternative label: Kansallisliput (911.6)
alternative label: Kansallissymbolit, heraldiikka (911.6)
alternative label: Kuviot, heraldiikka, liput (911.6)
alternative label: Lippulinnat, heraldiikka (911.6)
alternative label: Liput (911.6)
alternative label: Liputus, liput (911.6)
alternative label: Symboliikka, heraldiikka (911.6)
alternative label: Symbolit, heraldiikka (911.6)
alternative label: Tunnukset, liput (911.6)
alternative label: Tunnukset, vaakunat (911.6)
alternative label: Vaakunat (911.6)
alternative label: Vaakunat, vaakunatiede (911.6)
alternative label: Valtakuntien liput (911.6)
alternative label: Valtiot, liput, vaakunat (911.6)
alternative label: Vertauskuvat, heraldiikka (911.6)
alternative label: Viirit (911.6)
alternative label: Festflaggning, flaggor (911.6) @sv
alternative label: Figurer, heraldik, flaggor (911.6) @sv
alternative label: Flaggning, flaggor (911.6) @sv
alternative label: Flaggor (911.6) @sv
alternative label: Flaggtåg, heraldik (911.6) @sv
alternative label: Heraldik (911.6) @sv
alternative label: Kännetecken, flaggor (911.6) @sv
alternative label: Kännetecken, vapen, heraldik (911.6) @sv
alternative label: Nationalflaggor (911.6) @sv
alternative label: Nationalsymboler, heraldik (911.6) @sv
alternative label: Nationsflaggor (911.6) @sv
alternative label: Organisationsflaggor (911.6) @sv
alternative label: Sinnebilder, heraldik (911.6) @sv
alternative label: Stater, flaggor, vapen (911.6) @sv
alternative label: Symboler, heraldik (911.6) @sv
alternative label: Symbolik, heraldik (911.6) @sv
alternative label: Vapen, heraldik (911.6) @sv
alternative label: Vapen, heraldik, heraldik (911.6) @sv
alternative label: Vimplar (911.6) @sv
broader: Historian aputieteet
in scheme: URN:NBN:fi:au:hklj:
notation: 911.6
preferred label: Heraldry. Flags @en
preferred label: Heraldik. Flaggor @sv
related: Merenkulkuoppi
related: Historian tutkimusmenetelmät
related: Sinettitiede
scope note: Heraldiikka Eri maanosien, maiden, alueiden ja aikakausien vaakunat, liput ja viirit
scope note: Heraldik Vapenbilder, flaggor och vimplar i olika världsdelar, länder och geografiska områden samt under olika tidsperioder @sv

Ruotsin historia 1060-1522
type: Class
type: Concept
subclass of: URN:NBN:fi:au:hklj:930
alternative label: Hollikyyti, Ruotsin historia (931 ... 936)
alternative label: Kruununkyyti, Ruotsin historia (931 ... 936)
alternative label: Kyytilaitos, Ruotsin historia (931 ... 936)
alternative label: Reservikyyti, Ruotsin historia (931 ... 936)
alternative label: Ruotsalaiset, Ruotsi, historia (931 ... 936)
alternative label: Ruotsi, historia (931 ... 936)
alternative label: Valtaneuvoskunta, Ruotsin historia (931 ... 934)
alternative label: Hållskjuts, Sveriges historia (931 ... 936) @sv
alternative label: Kronoskjuts, Sveriges historia (931 ... 936) @sv
alternative label: Riksrådsförsamling, Sveriges historia (931 ... 934) @sv
alternative label: Skjutsväsen, Sveriges historia (931 ... 936) @sv
alternative label: Skjutsväsendet, Sveriges historia (931 ... 936) @sv
alternative label: Svenskar, Sverige, historia (931 ... 936) @sv
alternative label: Sverige, historia (931 ... 936) @sv
broader: URN:NBN:fi:au:hklj:930
in scheme: URN:NBN:fi:au:hklj:
notation: 932
preferred label: Sweden’s history 1060–1522 @en
preferred label: Sveriges historia 1060–1522 @sv
related: Ruotsi
related: Esi- ja varhaishistoria
related: URN:NBN:fi:au:hklj:989

Islannin historia
type: Class
type: Concept
subclass of: URN:NBN:fi:au:hklj:930
alternative label: Islanti, historia (939)
alternative label: Island, historia (939) @sv
broader: URN:NBN:fi:au:hklj:930
in scheme: URN:NBN:fi:au:hklj:
notation: 939
preferred label: Iceland's history @en
preferred label: Islands historia @sv
related: Islanti
related: Esi- ja varhaishistoria
related: URN:NBN:fi:au:hklj:989

Saksan keskiaika 843-1518
type: Class
type: Concept
subclass of: SAKSAN HISTORIA
broader: SAKSAN HISTORIA
in scheme: URN:NBN:fi:au:hklj:
notation: 942
preferred label: Germany’s middle ages 843–1518 @en
preferred label: Tysklands medeltid 843–1518 @sv
related: URN:NBN:fi:au:hklj:909
related: URN:NBN:fi:au:hklj:919

Saksan historia 1815-1913
type: Class
type: Concept
subclass of: SAKSAN HISTORIA
broader: SAKSAN HISTORIA
in scheme: URN:NBN:fi:au:hklj:
notation: 945
preferred label: Germany’s history 1815–1913 @en
preferred label: Tysklands historia 1815–1913 @sv
related: URN:NBN:fi:au:hklj:909
related: URN:NBN:fi:au:hklj:919

Iso-Britannian alueen historia 1485-1687
type: Class
type: Concept
subclass of: BRITTEIN SAARTEN HISTORIA
broader: BRITTEIN SAARTEN HISTORIA
in scheme: URN:NBN:fi:au:hklj:
notation: 953
preferred label: Britain’s history 1485–1687 @en
preferred label: Storbritanniens historia 1485–1687 @sv
related: URN:NBN:fi:au:hklj:909
related: URN:NBN:fi:au:hklj:919
scope note: Tudorien ja Stuartien aika
scope note: Tudortiden och Stuarttiden @sv

Iso-Britannian historia 1815-1913
type: Class
type: Concept
subclass of: BRITTEIN SAARTEN HISTORIA
alternative label: Viktoriaaninen aika, Iso-Britannia, historia (955)
alternative label: Viktoriaaninen aika, Iso-Britannia, kulttuuri (955)
alternative label: Viktorianska tiden, Storbritannien, historia (955) @sv
alternative label: Viktorianska tiden, Storbritannien, kultur (955) @sv
broader: BRITTEIN SAARTEN HISTORIA
in scheme: URN:NBN:fi:au:hklj:
notation: 955
preferred label: Britain’s history 1815–1913 @en
preferred label: Storbritanniens historia 1815–1913 @sv
related: URN:NBN:fi:au:hklj:909
related: URN:NBN:fi:au:hklj:919
scope note: Siirtomaavallan suuruuden aika
scope note: Kolonialväldets storhetstid @sv

Puolan historia
type: Class
type: Concept
subclass of: URN:NBN:fi:au:hklj:970
alternative label: Itä-Preussi, historia, Puola (972)
alternative label: Kasakat, historia (971 ... 972)
alternative label: Puola, historia (972)
alternative label: Venäläistämispolitiikka, Puolan historia (972)
alternative label: Förryskningspolitik, Polens historia (972) @sv
alternative label: Kosacker, historia (971 ... 972) @sv
alternative label: Ostpreussen, historia, Polen (972) @sv
alternative label: Polen, historia (972) @sv
broader: URN:NBN:fi:au:hklj:970
in scheme: URN:NBN:fi:au:hklj:
notation: 972
preferred label: Poland's history @en
preferred label: Polens historia @sv
related: Puola
related: URN:NBN:fi:au:hklj:909
related: URN:NBN:fi:au:hklj:919

Sveitsin historia
type: Class
type: Concept
subclass of: URN:NBN:fi:au:hklj:970
alternative label: Sveitsi, historia (975)
alternative label: Schweiz, historia (975) @sv
broader: URN:NBN:fi:au:hklj:970
in scheme: URN:NBN:fi:au:hklj:
notation: 975
preferred label: Switzerland's history @en
preferred label: Schweiz historia @sv
related: Sveitsi
related: URN:NBN:fi:au:hklj:909
related: URN:NBN:fi:au:hklj:919

Alankomaiden historia
type: Class
type: Concept
subclass of: URN:NBN:fi:au:hklj:970
alternative label: Alankomaat, historia (976)
alternative label: Benelux-maat, historia, Alankomaat (976)
alternative label: Hollanti, historia (976)
alternative label: Benelux-länder, historia, Näderländerna (976) @sv
alternative label: Holland, historia (976) @sv
alternative label: Nederländerna, historia (976) @sv
broader: URN:NBN:fi:au:hklj:970
in scheme: URN:NBN:fi:au:hklj:
notation: 976
preferred label: The Netherlands' history @en
preferred label: Nederländernas historia @sv
related: Alankomaat, Hollanti
related: URN:NBN:fi:au:hklj:909
related: URN:NBN:fi:au:hklj:919

Suomenkieliset kansanrunot (Kaunoluokka)
type: Class
type: Concept
type: FormClass
subclass of: SUOMENKIELINEN KAUNOKIRJALLISUUS (Kaunoluokka)
broader: SUOMENKIELINEN KAUNOKIRJALLISUUS (Kaunoluokka)
in scheme: URN:NBN:fi:au:hklj:
notation: 1.1
preferred label: Folk stories (Fiction class) @en
preferred label: Folkdiktning på finska (Skönklass) @sv
scope note: Kansanrunot. Kansanrunokokoelmat. Loitsut. Taiat. Itkuvirret. Arkkiveisut Kansanperinteeseen kuuluvat lorut, arvoitukset, sananlaskut, vertaukset ja kaskut Kansaneepokset sekä niiden lyhennelmät ja mukaelmat Kansansadut ja kansantarinat. Legendat. Uskomustarinat. Synty-, varoitus- ja opetustarinat
scope note: Folkdiktning. Besvärjelser. Trollformler. Gråtkväden. Skillingtryck Ramsor, gåtor, ordspråk, liknelser och anekdoter som hänför sig till folklore Nationalepos samt förkortningar och bearbetningar av dem Folksagor och folksägner. Legender. Folkliga trosföreställningar. Sägner med etiologisk och didaktisk funktion samt sägner med varningsfunktion @sv

Vironkieliset kansanrunot (Kaunoluokka)
type: Class
type: Concept
type: FormClass
subclass of: Vironkielinen kaunokirjallisuus (Kaunoluokka)
broader: Vironkielinen kaunokirjallisuus (Kaunoluokka)
in scheme: URN:NBN:fi:au:hklj:
notation: 1.81
preferred label: Folk stories (Fiction class) @en
preferred label: Folkdiktning på estniska (Skönklass) @sv
scope note: Kansanrunot. Kansanrunokokoelmat. Loitsut. Taiat. Itkuvirret. Arkkiveisut Kansanperinteeseen kuuluvat lorut, arvoitukset, sananlaskut, vertaukset ja kaskut Kansaneepokset sekä niiden lyhennelmät ja mukaelmat Kansansadut ja kansantarinat. Legendat. Uskomustarinat. Synty-, varoitus- ja opetustarinat
scope note: Folkdiktning. Besvärjelser. Trollformler. Gråtkväden. Skillingtryck Ramsor, gåtor, ordspråk, liknelser och anekdoter som hänför sig till folklore Nationalepos samt förkortningar och bearbetningar av dem Folksagor och folksägner. Legender. Folkliga trosföreställningar. Sägner med etiologisk och didaktisk funktion samt sägner med varningsfunktion @sv

Unkarinkieliset kansanrunot (Kaunoluokka)
type: Class
type: Concept
type: FormClass
subclass of: Unkarinkielinen kaunokirjallisuus (Kaunoluokka)
broader: Unkarinkielinen kaunokirjallisuus (Kaunoluokka)
in scheme: URN:NBN:fi:au:hklj:
notation: 1.941
preferred label: Folk stories (Fiction class) @en
preferred label: Folkdiktning på ungerska (Skönklass) @sv
scope note: Kansanrunot. Kansanrunokokoelmat. Loitsut. Taiat. Itkuvirret. Arkkiveisut Kansanperinteeseen kuuluvat lorut, arvoitukset, sananlaskut, vertaukset ja kaskut Kansaneepokset sekä niiden lyhennelmät ja mukaelmat Kansansadut ja kansantarinat. Legendat. Uskomustarinat. Synty-, varoitus- ja opetustarinat
scope note: Folkdiktning. Besvärjelser. Trollformler. Gråtkväden. Skillingtryck Ramsor, gåtor, ordspråk, liknelser och anekdoter som hänför sig till folklore Nationalepos samt förkortningar och bearbetningar av dem Folksagor och folksägner. Legender. Folkliga trosföreställningar. Sägner med etiologisk och didaktisk funktion samt sägner med varningsfunktion @sv

Ruotsinkieliset kansanrunot (Kaunoluokka)
type: Class
type: Concept
type: FormClass
subclass of: RUOTSINKIELINEN KAUNOKIRJALLISUUS (Kaunoluokka)
broader: RUOTSINKIELINEN KAUNOKIRJALLISUUS (Kaunoluokka)
in scheme: URN:NBN:fi:au:hklj:
notation: 2.1
preferred label: Folk stories (Fiction class) @en
preferred label: Folkdiktning på svenska (Skönklass) @sv
scope note: Kansanrunot. Kansanrunokokoelmat. Loitsut. Taiat. Itkuvirret. Arkkiveisut Kansanperinteeseen kuuluvat lorut, arvoitukset, sananlaskut, vertaukset ja kaskut Kansaneepokset sekä niiden lyhennelmät ja mukaelmat Kansansadut ja kansantarinat. Legendat. Uskomustarinat. Synty-, varoitus- ja opetustarinat
scope note: Folkdiktning. Besvärjelser. Trollformler. Gråtkväden. Skillingtryck Ramsor, gåtor, ordspråk, liknelser och anekdoter som hänför sig till folklore Nationalepos samt förkortningar och bearbetningar av dem Folksagor och folksägner. Legender. Folkliga trosföreställningar. Sägner med etiologisk och didaktisk funktion samt sägner med varningsfunktion @sv

Tanskankieliset kansanrunot (Kaunoluokka)
type: Class
type: Concept
type: FormClass
subclass of: Tanskankielinen kaunokirjallisuus (Kaunoluokka)
broader: Tanskankielinen kaunokirjallisuus (Kaunoluokka)
in scheme: URN:NBN:fi:au:hklj:
notation: 2.81
preferred label: Folk stories (Fiction class) @en
preferred label: Folkdiktning på danska (Skönklass) @sv
scope note: Kansanrunot. Kansanrunokokoelmat. Loitsut. Taiat. Itkuvirret. Arkkiveisut Kansanperinteeseen kuuluvat lorut, arvoitukset, sananlaskut, vertaukset ja kaskut Kansaneepokset sekä niiden lyhennelmät ja mukaelmat Kansansadut ja kansantarinat. Legendat. Uskomustarinat. Synty-, varoitus- ja opetustarinat
scope note: Folkdiktning. Besvärjelser. Trollformler. Gråtkväden. Skillingtryck Ramsor, gåtor, ordspråk, liknelser och anekdoter som hänför sig till folklore Nationalepos samt förkortningar och bearbetningar av dem Folksagor och folksägner. Legender. Folkliga trosföreställningar. Sägner med etiologisk och didaktisk funktion samt sägner med varningsfunktion @sv

Norjankieliset kansanrunot (Kaunoluokka)
type: Class
type: Concept
type: FormClass
subclass of: Norjankielinen kaunokirjallisuus (Kaunoluokka)
broader: Norjankielinen kaunokirjallisuus (Kaunoluokka)
in scheme: URN:NBN:fi:au:hklj:
notation: 2.91
preferred label: Folk stories (Fiction class) @en
preferred label: Folkdiktning på norska (Skönklass) @sv
scope note: Kansanrunot. Kansanrunokokoelmat. Loitsut. Taiat. Itkuvirret. Arkkiveisut Kansanperinteeseen kuuluvat lorut, arvoitukset, sananlaskut, vertaukset ja kaskut Kansaneepokset sekä niiden lyhennelmät ja mukaelmat Kansansadut ja kansantarinat. Legendat. Uskomustarinat. Synty-, varoitus- ja opetustarinat
scope note: Folkdiktning. Besvärjelser. Trollformler. Gråtkväden. Skillingtryck Ramsor, gåtor, ordspråk, liknelser och anekdoter som hänför sig till folklore Nationalepos samt förkortningar och bearbetningar av dem Folksagor och folksägner. Legender. Folkliga trosföreställningar. Sägner med etiologisk och didaktisk funktion samt sägner med varningsfunktion @sv

Saksankieliset kansanrunot (Kaunoluokka)
type: Class
type: Concept
type: FormClass
subclass of: SAKSANKIELINEN KAUNOKIRJALLISUUS (Kaunoluokka)
broader: SAKSANKIELINEN KAUNOKIRJALLISUUS (Kaunoluokka)
in scheme: URN:NBN:fi:au:hklj:
notation: 3.1
preferred label: Folk stories (Fiction class) @en
preferred label: Folkdiktning på tyska (Skönklass) @sv
scope note: Kansanrunot. Kansanrunokokoelmat. Loitsut. Taiat. Itkuvirret. Arkkiveisut Kansanperinteeseen kuuluvat lorut, arvoitukset, sananlaskut, vertaukset ja kaskut Kansaneepokset sekä niiden lyhennelmät ja mukaelmat Kansansadut ja kansantarinat. Legendat. Uskomustarinat. Synty-, varoitus- ja opetustarinat
scope note: Folkdiktning. Besvärjelser. Trollformler. Gråtkväden. Skillingtryck Ramsor, gåtor, ordspråk, liknelser och anekdoter som hänför sig till folklore Nationalepos samt förkortningar och bearbetningar av dem Folksagor och folksägner. Legender. Folkliga trosföreställningar. Sägner med etiologisk och didaktisk funktion samt sägner med varningsfunktion @sv

Englanninkieliset kansanrunot (Kaunoluokka)
type: Class
type: Concept
type: FormClass
subclass of: ENGLANNINKIELINEN KAUNOKIRJALLISUUS (Kaunoluokka)
broader: ENGLANNINKIELINEN KAUNOKIRJALLISUUS (Kaunoluokka)
in scheme: URN:NBN:fi:au:hklj:
notation: 4.1
preferred label: Folk stories (Fiction class) @en
preferred label: Folkdiktning på engelska (Skönklass) @sv
scope note: Kansanrunot. Kansanrunokokoelmat. Loitsut. Taiat. Itkuvirret. Arkkiveisut Kansanperinteeseen kuuluvat lorut, arvoitukset, sananlaskut, vertaukset ja kaskut Kansaneepokset sekä niiden lyhennelmät ja mukaelmat Kansansadut ja kansantarinat. Legendat. Uskomustarinat. Synty-, varoitus- ja opetustarinat
scope note: Folkdiktning. Besvärjelser. Trollformler. Gråtkväden. Skillingtryck Ramsor, gåtor, ordspråk, liknelser och anekdoter som hänför sig till folklore Nationalepos samt förkortningar och bearbetningar av dem Folksagor och folksägner. Legender. Folkliga trosföreställningar. Sägner med etiologisk och didaktisk funktion samt sägner med varningsfunktion @sv

Ranskankieliset kansanrunot (Kaunoluokka)
type: Class
type: Concept
type: FormClass
subclass of: RANSKANKIELINEN KAUNOKIRJALLISUUS (Kaunoluokka)
broader: RANSKANKIELINEN KAUNOKIRJALLISUUS (Kaunoluokka)
in scheme: URN:NBN:fi:au:hklj:
notation: 5.1
preferred label: Folk stories (Fiction class) @en
preferred label: Folkdiktning på franska (Skönklass) @sv
scope note: Kansanrunot. Kansanrunokokoelmat. Loitsut. Taiat. Itkuvirret. Arkkiveisut Kansanperinteeseen kuuluvat lorut, arvoitukset, sananlaskut, vertaukset ja kaskut Kansaneepokset sekä niiden lyhennelmät ja mukaelmat Kansansadut ja kansantarinat. Legendat. Uskomustarinat. Synty-, varoitus- ja opetustarinat
scope note: Folkdiktning. Besvärjelser. Trollformler. Gråtkväden. Skillingtryck Ramsor, gåtor, ordspråk, liknelser och anekdoter som hänför sig till folklore Nationalepos samt förkortningar och bearbetningar av dem Folksagor och folksägner. Legender. Folkliga trosföreställningar. Sägner med etiologisk och didaktisk funktion samt sägner med varningsfunktion @sv

Italiankieliset kansanrunot (Kaunoluokka)
type: Class
type: Concept
type: FormClass
subclass of: ITALIANKIELINEN KAUNOKIRJALLISUUS (Kaunoluokka)
broader: ITALIANKIELINEN KAUNOKIRJALLISUUS (Kaunoluokka)
in scheme: URN:NBN:fi:au:hklj:
notation: 6.1
preferred label: Folk stories (Fiction class) @en
preferred label: Folkdiktning på italienska (Skönklass) @sv
scope note: Kansanrunot. Kansanrunokokoelmat. Loitsut. Taiat. Itkuvirret. Arkkiveisut Kansanperinteeseen kuuluvat lorut, arvoitukset, sananlaskut, vertaukset ja kaskut Kansaneepokset sekä niiden lyhennelmät ja mukaelmat Kansansadut ja kansantarinat. Legendat. Uskomustarinat. Synty-, varoitus- ja opetustarinat
scope note: Folkdiktning. Besvärjelser. Trollformler. Gråtkväden. Skillingtryck Ramsor, gåtor, ordspråk, liknelser och anekdoter som hänför sig till folklore Nationalepos samt förkortningar och bearbetningar av dem Folksagor och folksägner. Legender. Folkliga trosföreställningar. Sägner med etiologisk och didaktisk funktion samt sägner med varningsfunktion @sv

Espanjankieliset kansanrunot (Kaunoluokka)
type: Class
type: Concept
type: FormClass
subclass of: ESPANJANKIELINEN KAUNOKIRJALLISUUS (Kaunoluokka)
broader: ESPANJANKIELINEN KAUNOKIRJALLISUUS (Kaunoluokka)
in scheme: URN:NBN:fi:au:hklj:
notation: 7.1
preferred label: Folk stories (Fiction class) @en
preferred label: Folkdiktning på spanska (Skönklass) @sv
scope note: Kansanrunot. Kansanrunokokoelmat. Loitsut. Taiat. Itkuvirret. Arkkiveisut Kansanperinteeseen kuuluvat lorut, arvoitukset, sananlaskut, vertaukset ja kaskut Kansaneepokset sekä niiden lyhennelmät ja mukaelmat Kansansadut ja kansantarinat. Legendat. Uskomustarinat. Synty-, varoitus- ja opetustarinat
scope note: Folkdiktning. Besvärjelser. Trollformler. Gråtkväden. Skillingtryck Ramsor, gåtor, ordspråk, liknelser och anekdoter som hänför sig till folklore Nationalepos samt förkortningar och bearbetningar av dem Folksagor och folksägner. Legender. Folkliga trosföreställningar. Sägner med etiologisk och didaktisk funktion samt sägner med varningsfunktion @sv

Venäjänkieliset kansanrunot (Kaunoluokka)
type: Class
type: Concept
type: FormClass
subclass of: VENÄJÄNKIELINEN KAUNOKIRJALLISUUS (Kaunoluokka)
broader: VENÄJÄNKIELINEN KAUNOKIRJALLISUUS (Kaunoluokka)
in scheme: URN:NBN:fi:au:hklj:
notation: 8.1
preferred label: Folk stories (Fiction class) @en
preferred label: Folkdiktning på ryska (Skönklass) @sv
scope note: Kansanrunot. Kansanrunokokoelmat. Loitsut. Taiat. Itkuvirret. Arkkiveisut Kansanperinteeseen kuuluvat lorut, arvoitukset, sananlaskut, vertaukset ja kaskut Kansaneepokset sekä niiden lyhennelmät ja mukaelmat Kansansadut ja kansantarinat. Legendat. Uskomustarinat. Synty-, varoitus- ja opetustarinat
scope note: Folkdiktning. Besvärjelser. Trollformler. Gråtkväden. Skillingtryck Ramsor, gåtor, ordspråk, liknelser och anekdoter som hänför sig till folklore Nationalepos samt förkortningar och bearbetningar av dem Folksagor och folksägner. Legender. Folkliga trosföreställningar. Sägner med etiologisk och didaktisk funktion samt sägner med varningsfunktion @sv

Uskonto
type: Class
type: Concept
subclass of: Erikoisalojen bibliografiat
broader: Erikoisalojen bibliografiat
in scheme: URN:NBN:fi:au:hklj:
notation: 015.2
preferred label: Religion @en
related: Lasten- ja nuortenkirjallisuuden luettelot
related: Yleisbibliografiat. Kansallisbibliografiat
related: Kirjastojen luettelot
related: Kustantajien ja kirjakauppojen luettelot
scope note: Bibliografiset julkaisut, jotka koskevat pääluokan 200 erikoisaloja, kuten uskontoa, uskontotiedettä, uskontofilosofiaa, kristinuskoa, teologiaa, hartauskirjoja, kirkkoja, kirkkokuntia, kirkkohistoriaa tai ei-kristillisiä uskontoja
scope note: Bibliografier över specialområden som hör till huvudklass 200, såsom religioner, religionsvetenskap, religionsfilosofi, kristendom, teologi, andaktsböcker, kyrkor, kyrkosamfund, kyrkohistoria eller icke-kristna religioner @sv

Luonnontieteet. Matematiikka
type: Class
type: Concept
subclass of: Erikoisalojen bibliografiat
broader: Erikoisalojen bibliografiat
in scheme: URN:NBN:fi:au:hklj:
notation: 015.5
preferred label: Natural sciences. Mathematics @en
preferred label: Naturvetenskaper. Matematik @sv
related: Lasten- ja nuortenkirjallisuuden luettelot
related: Yleisbibliografiat. Kansallisbibliografiat
related: Kirjastojen luettelot
related: Kustantajien ja kirjakauppojen luettelot
scope note: Bibliografiset julkaisut, jotka koskevat pääluokan 500 erikoisaloja, kuten luonnontieteitä, luonnon- ja ympäristönsuojelua, matematiikkaa, tähtitiedettä, fysiikkaa, kemiaa tai biologiaa
scope note: Bibliografier över specialområden som hör till huvudklass 500, såsom naturvetenskaper, naturskydd, miljövård, matematik, astronomi, fysik, kemi eller biologi @sv

Historia
type: Class
type: Concept
subclass of: Erikoisalojen bibliografiat
broader: Erikoisalojen bibliografiat
in scheme: URN:NBN:fi:au:hklj:
notation: 015.9
preferred label: History @en
related: Lasten- ja nuortenkirjallisuuden luettelot
related: Yleisbibliografiat. Kansallisbibliografiat
related: Kirjastojen luettelot
related: Kustantajien ja kirjakauppojen luettelot
scope note: Bibliografiset julkaisut, jotka koskevat pääluokan 900 erikoisaloja, kuten yleistä historiaa, kulttuurihistoriaa, arkeologiaa, paikallishistoriaa tai henkilöhistoriaa
scope note: Bibliografier över specialområden som hör till huvudklass 900, såsom allmän historia, kulturhistoria, arkeologi, lokalhistoria och personhistoria @sv

URN:NBN:fi:au:hklj:1
alternative label: Aapiset (1)
alternative label: Antologiat, kaunokirjalliset sekasisältöiset (1)
alternative label: Kokoomateokset, kaunokirjallisuus (1)
alternative label: Kootut teokset, kaunokirjallisuus (1)
alternative label: Lukemistot, kaunokirjallisuus (1)
alternative label: Lukukirjat, kaunokirjallisuus (1)
alternative label: Suomalais-ugrilaiset kielet, kaunokirjallisuus (1 +)
alternative label: Teokset, kootut teokset (1)
alternative label: Teokset, valitut teokset (1)
alternative label: Valikoimateokset, kaunokirjallisuus (1)
alternative label: Valitut teokset, kaunokirjallisuus (1)
alternative label: ABC-böcker (1) @sv
alternative label: Antologier, skönlitterära med blandat innehåll (1) @sv
alternative label: Finsk-ugriska språk, skönlitteratur (1 +) @sv
alternative label: Krestomatier, skönlitteratur (1) @sv
alternative label: Läseböcker, skönlitteratur (1) @sv
alternative label: Samlade verk, skönlitteratur (1) @sv
alternative label: Samlingsverk, skönlitteratur (1) @sv
alternative label: Urvalsverk, skönlitteratur (1) @sv
alternative label: Valda verk, skönlitteratur (1) @sv
alternative label: Verk, samlade verk (1) @sv
alternative label: Verk, valda verk (1) @sv
related: YLEISET KOKOOMATEOKSET
related: Suomenkielisen kirjallisuuden historia ja tutkimus
related: Suomenkielisen kansanrunouden historia ja tutkimus
related: Suomenkielisen kirjallisuuden aihepiirejä ja kirjallisuustyyppejä koskeva historia ja tutkimus
related: Suomenkielisen lasten- ja nuortenkirjallisuuden historia ja tutkimus
related: Suomen kieli

Kausijulkaisut
type: Class
type: Concept
subclass of: URN:NBN:fi:au:hklj:100
broader: URN:NBN:fi:au:hklj:100
in scheme: URN:NBN:fi:au:hklj:
notation: 105
preferred label: Journals. Serial publications @en
preferred label: Tidskrifter. Seriella publikationer @sv
scope note: Filosofian yleiset kausijulkaisut Filosofian erikoisalojen kausijulkaisut alan mukaisessa luokassa
scope note: Allmänna tidskrifter och seriella publikationer i filosofi Tidskrifter och seriella publikationer i specialområden inom filosofin klassificeras enligt område @sv

Yhdistykset. Laitokset. Kokoukset
type: Class
type: Concept
subclass of: URN:NBN:fi:au:hklj:100
broader: URN:NBN:fi:au:hklj:100
in scheme: URN:NBN:fi:au:hklj:
notation: 106
preferred label: Associations. Institutions. Meetings @en
preferred label: Föreningar. Institutioner. Möten @sv
scope note: Filosofian alaan kuuluvat yleiset yhdistykset, laitokset ja kokoukset Filosofian erikoisalojen yhdistykset, laitokset ja kokoukset alan mukaisessa luokassa
scope note: Allmänna föreningar, institutioner och möten inom filosofin Föreningar, institutioner och möten som rör specialområden inom filosofin klassificeras enligt område @sv

Fysiologinen psykologia
type: Class
type: Concept
subclass of: Muita psykologian aloja
alternative label: Aivokuori, fysiologinen psykologia (128.7)
alternative label: Aivot, fysiologinen psykologia (128.7)
alternative label: Biologinen psykologia, fysiologinen psykologia (128.7)
alternative label: Biopalaute, psykologia (128.7 +)
alternative label: Biopsykologia, fysiologinen psykologia (128.7)
alternative label: Ehdolliset refleksit, psykologia (128.7)
alternative label: Fysiologinen psykologia (128.7)
alternative label: Hermosto, psykologia (128.7)
alternative label: Isoaivokuori, fysiologinen psykologia (128.7)
alternative label: Keskushermosto, fysiologinen psykologia (128.7)
alternative label: Keskushermosto, neuropsykologia (128.7)
alternative label: Korteksi, fysiologinen psykologia (128.7)
alternative label: Neuromarkkinointi, neuropsykologia (128.7)
alternative label: Neuroplastisuus, psykologia (128.7)
alternative label: Neuropsykologia (128.7)
alternative label: Oikeakätisyys, fysiologinen psykologia (128.7 +)
alternative label: Psykobiologia, fysiologinen psykologia (128.7)
alternative label: Psykofysiikka (128.7)
alternative label: Psykofysiologia (128.7)
alternative label: Psykologia, fysiologinen psykologia (128.7)
alternative label: Refleksit, fysiologinen psykologia (128.7)
alternative label: Sisäeritys, fysiologinen psykologia (128.7)
alternative label: Umpieritys, fysiologinen psykologia (128.7)
alternative label: Vasen ja oikea, fysiologinen psykologia (128.7)
alternative label: Vasenkätisyys, fysiologinen psykologia (128.7)
alternative label: Ärtyvyys, hermosto, psykologia (128.7)
alternative label: Betingade reflexer, psykologi (128.7) @sv
alternative label: Biofeedback, psykologi (128.7 +) @sv
alternative label: Biologisk psykologi, fysiologisk psykologi (128.7) @sv
alternative label: Biopsykologi, fysiologisk psykologi (128.7) @sv
alternative label: Centrala nervsystemet, fysiologisk psykologi (128.7) @sv
alternative label: Centrala nervsystemet, neuropsykologi (128.7) @sv
alternative label: Cortex, fysiologisk psykologi (128.7) @sv
alternative label: Endokrin sekretion, fysiologisk psykologi (128.7) @sv
alternative label: Fysiologisk psykologi (128.7) @sv
alternative label: Hjärnan, fysiologisk psykologi (128.7) @sv
alternative label: Hjärnbarken, fysiologisk psykologi (128.7) @sv
alternative label: Högerhänthet, fysiologisk psykologi (128.7 +) @sv
alternative label: Inre sekretion, fysiologisk psykologi (128.7) @sv
alternative label: Irritabilitet, nervsystemet, psykologi (128.7) @sv
alternative label: Nervsystemet, psykologi (128.7) @sv
alternative label: Neuromarknadsföring, neuropsykologi (128.7) @sv
alternative label: Neuroplasticitet, psykologi (128.7) @sv
alternative label: Neuropsykologi (128.7) @sv
alternative label: Psykobiologi, fysiologisk psykologi (128.7) @sv
alternative label: Psykofysik (128.7) @sv
alternative label: Psykofysiologi (128.7) @sv
alternative label: Psykologi, fysiologisk psykologi (128.7) @sv
alternative label: Reflexer, fysiologi, fysiologisk psykologi (128.7) @sv
alternative label: Storhjärnans bark, fysiologisk psykologi (128.7) @sv
alternative label: Vänster och höger, fysiologisk psykologi (128.7) @sv
alternative label: Vänsterhänthet, fysiologisk psykologi (128.7) @sv
broader: Muita psykologian aloja
in scheme: URN:NBN:fi:au:hklj:
notation: 128.7
preferred label: Physiological psychology @en
preferred label: Fysiologisk psykologi @sv
related: Psyyken rakenne ja toiminnot
related: Psykologian suunnat
related: Perinnöllisyyspsykologia
related: URN:NBN:fi:au:hklj:617.2
scope note: Neuropsykologia. Psyyken biologinen perusta
scope note: Neuropsykologi. Psykets biologiska bas @sv

Tieteenhistoria. Oppihistoria
type: Class
type: Concept
subclass of: TIEDEOPPI
alternative label: Ajatushautomot , tieteenhistoria (159)
alternative label: Ajatusmyllyt, tieteenhistoria (159)
alternative label: Ajatuspajat, tieteenhistoria (159)
alternative label: Doktriinit, tieteenhistoria (159)
alternative label: Edelläkävijät, tieteenhistoria (159)
alternative label: Erehdys, tieteenhistoria (159)
alternative label: Erikoistuminen, tieteen historia (159)
alternative label: Humanistiset tieteet, tieteenhistoria (159)
alternative label: Ihmistieteet, tieteenhistoria (159)
alternative label: Koehenkilöt, tieteenhistoria (159)
alternative label: Koulukunnat, tieteenhistoria (159)
alternative label: Opinnäytetyöt, tieteenhistoria (159)
alternative label: Opinnäytteet, tieteenhistoria (159)
alternative label: Oppihistoria (159)
alternative label: Oppiriidat, oppihistoria (159)
alternative label: Pseudotiede, tieteenhistoria (159)
alternative label: Riidat, oppiriidat, tieteen historia (159)
alternative label: Suuntaukset, tieteenhistoria (159)
alternative label: Teoreettinen tutkimus, tieteenhistoria (159)
alternative label: Think tankit, tieteenhistoria (159)
alternative label: Tiedemiehet, tieteenhistoria (159)
alternative label: Tiedenaiset, tieteenhistoria (159)
alternative label: Tiedeoppi, tieteenhistoria (159)
alternative label: Tieteen edistyminen, tieteenhistoria (159)
alternative label: Tieteenhistoria (159)
alternative label: Tutkimus, tieteen historia (159)
alternative label: Tutkimusasemat, tieteenhistoria (159)
alternative label: Tutkimuslaitokset, tieteenhistoria (159)
alternative label: Tutkimustulokset, tieteenhistoria (159)
alternative label: Uranuurtajat, tieteenhistoria (159)
alternative label: Vilppi, tieteenhistoria (159)
alternative label: Väitöskirjat, tieteenhistoria (159)
alternative label: Doktorsavhandlingar, vetenskapshistoria (159) @sv
alternative label: Doktriner, vetenskapshistoria (159) @sv
alternative label: Forskning, vetenskapens historia (159) @sv
alternative label: Forskningscentra, vetenskapshistoria (159) @sv
alternative label: Forskningsresultat, vetenskapshistoria (159) @sv
alternative label: Forskningsstationer, vetenskapshistoria (159) @sv
alternative label: Fusk, vetenskapshistoria (159) @sv
alternative label: Föregångare, vetenskapshistoria (159) @sv
alternative label: Försökspersoner, vetenskapens historia (159) @sv
alternative label: Gräl, lärostrider, vetenskapshistoria (159) @sv
alternative label: Humanistiska vetenskaper, vetenskapshistoria (159) @sv
alternative label: Humanvetenskaper, vetenskapshistoria (159) @sv
alternative label: Inriktningar, vetenskapshistoria (159) @sv
alternative label: Kvinnliga forskare, vetenskapshistoria (159) @sv
alternative label: Lärdomshistoria (159) @sv
alternative label: Lärdomsprov, vetenskapshistoria (159) @sv
alternative label: Lärostrider, lärdomshistoria (159) @sv
alternative label: Misstag, vetenskapshistoria (159) @sv
alternative label: Pionjärer, vetenskapshistoria (159) @sv
alternative label: Pseudovetenskap, vetenskapshistoria (159) @sv
alternative label: Skolor, läroriktning, vetenskapshistoria (159) @sv
alternative label: Specialisering, vetenskapens historia (159) @sv
alternative label: Tankesmedjor, vetenskapshistoria (159) @sv
alternative label: Teoretisk forskning, vetenskapshistoria (159) @sv
alternative label: Vetenskaplig utveckling, vetenskapshistoria (159) @sv
alternative label: Vetenskapshistoria (159) @sv
alternative label: Vetenskapslära, vetenskapshistoria (159) @sv
alternative label: Vetenskapsmän, vetenskapshistoria (159) @sv
broader: TIEDEOPPI
in scheme: URN:NBN:fi:au:hklj:
notation: 159
preferred label: History of science. History of learning @en
preferred label: Vetenskapens historia. Lärdomshistoria @sv
related: Tietoteorian historia ja suunnat
related: Yhteiskuntatieteiden historia
related: Luonnontieteiden historia
related: Sovellettujen tieteiden historia
scope note: Yleinen tieteen historia ja oppihistoria Tässä myös humanististen tieteiden yleinen tieteenhistoria Erikoisalojen tieteenhistoria alan mukaisessa luokassa
scope note: Vetenskapens allmänna historia och lärdomshistoria Hit också vetenskapens allmänna historia inom de humanistiska vetenskaperna Specialområden inom vetenskapens historia klassificeras enligt område @sv

Mietelausekokoelmat. Sitaattikokoelmat
type: Class
type: Concept
subclass of: ELÄMÄNFILOSOFIA. KULTTUURIFILOSOFIA
alternative label: Aforismit, kokoelmat (171)
alternative label: Ajatelmat, kokoelmat (171)
alternative label: Elämänfilosofia, aforismit (171)
alternative label: Elämänviisaus, aforismit (171)
alternative label: Iskulauseet, kokoelmat (171)
alternative label: Kaveruus, aforismit (171)
alternative label: Kiitollisuus, aforismit (171)
alternative label: Käytännöllinen filosofia, aforismit (171)
alternative label: Lentävät lauseet, kokoelmat (171)
alternative label: Mietelauseet, kokoelmat (171)
alternative label: Mietelmät, kokoelmat (171)
alternative label: Onnellisuus, aforismit (171)
alternative label: Onni, aforismit (171)
alternative label: Siivekkäät sanat, kokoelmat (171)
alternative label: Sitaatit, kokoelmat (171)
alternative label: Slogaanit, kokoelmat (171)
alternative label: Sloganit, kokoelmat (171)
alternative label: Ystävyys, aforismit (171)
alternative label: Ystävät, aforismit (171)
alternative label: Aforismer, samlingar (171) @sv
alternative label: Bevingade citat, samlingar (171) @sv
alternative label: Bevingade ord, kokoelmat (171) @sv
alternative label: Citat, samlingar (171) @sv
alternative label: Kompisskap, aforismer (171) @sv
alternative label: Levnadsvisdom, aforismer (171) @sv
alternative label: Livsfilosofi, aforismer (171) @sv
alternative label: Lycka, aforismer (171) @sv
alternative label: Maximer, samlingar (171) @sv
alternative label: Praktisk filosofi, aforismer (171) @sv
alternative label: Sentenser, samlingar (171) @sv
alternative label: Slagord, samlingar (171) @sv
alternative label: Slogan, samlingar (171) @sv
alternative label: Sloganer, samlingar (171) @sv
alternative label: Tacksamhet, aforismer (171) @sv
alternative label: Tänkespråk, samlingar (171) @sv
alternative label: Vänner, aforismer (171) @sv
alternative label: Vänskap, aforismer (171) @sv
broader: ELÄMÄNFILOSOFIA. KULTTUURIFILOSOFIA
in scheme: URN:NBN:fi:au:hklj:
notation: 171
preferred label: Collections of aphorisms and quotations @en
preferred label: Samlingar med tänkespråk och citat @sv
related: YLEISET KOKOOMATEOKSET
related: Etiikka. Moraalifilosofia
related: URN:NBN:fi:au:hklj:171.03
related: Monikieliset sanakirjat. Sivistyssanakirjat
scope note: Yleiset mietelause-, aforismi-, ajatelma- ja sitaattikokoelmat Lentävät lauseet. Siivekkäät sanat Erikoisalojen kokoelmat alan mukaisessa luokassa
scope note: Allmänna samlingar med tänkespråk, aforismer, sentenser och citat Bevingade ord Samlingar ur specialområden klassificeras enligt område @sv

Kasvatuksen ja kasvatustieteen historia
type: Class
type: Concept
subclass of: KASVATUS. OPETUS. KASVATUSTIEDE
alternative label: Kasvatuksen historia (189)
alternative label: Kasvatus, kasvatushistoria (189)
alternative label: Kasvatusala, kasvatushistoria (189)
alternative label: Kasvatushistoria (189)
alternative label: Kasvatusopin historia (189)
alternative label: Kasvatustieteen historia (189)
alternative label: Kuritus, kasvatuksen historia (189)
alternative label: Ruumiillinen kuritus, kasvatuksen historia (189)
alternative label: Aga, uppfostrans historia (189) @sv
alternative label: Fostran, pedagogikens historia (189) @sv
alternative label: Kroppsaga, uppfostrans historia (189) @sv
alternative label: Pedagogikens historia (189) @sv
alternative label: Uppfostrans historia (189) @sv
alternative label: Uppfostringshistoria (189) @sv
alternative label: Uppfostringslärans historia (189) @sv
broader: KASVATUS. OPETUS. KASVATUSTIEDE
in scheme: URN:NBN:fi:au:hklj:
notation: 189
preferred label: History of upbringing and pedagogy @en
preferred label: Uppfostrans och pedagogikens historia @sv
related: URN:NBN:fi:au:hklj:181.7
related: URN:NBN:fi:au:hklj:182
related: URN:NBN:fi:au:hklj:183.5
related: URN:NBN:fi:au:hklj:183.7
scope note: Kasvatuksen, kasvatustieteen, kasvatusopin ja pedagogiikan yleinen historia Eri maiden kasvatus- ja koulutusjärjestelmien sekä kasvatus- ja koulutuspolitiikan yleinen historia Opettajanvalmistuksen yleinen historia Kasvatuksen, kasvatustieteen tai opetuksen erikoisalojen historia alan mukaisessa luokassa
scope note: Uppfostrans och pedagogikens allmänna historia De pedagogiska systemens och utbildningssystemens samt den pedagogiska politikens och utbildningspolitikens allmänna historia i olika länder Lärarutbildningens allmänna historia Specialområden inom uppfostrans, pedagogikens och utbildningens historia klassificeras enligt område @sv

Vapaamuurarius
type: Class
type: Concept
subclass of: Teosofia. Antroposofia. Vapaamuurarius
alternative label: Esoterismi, vapaamuurarius (204.3)
alternative label: Salaseurat, vapaamuurarit (204.3)
alternative label: Vapaamuurarit (204.3)
alternative label: Veljeskunnat, vapaamuurarit (204.3)
alternative label: Brödraskap, frimurare (204.3) @sv
alternative label: Esoterism, frimureri (204.3) @sv
alternative label: Frimurare (204.3) @sv
alternative label: Hemliga sällskap, frimurare (204.3) @sv
broader: Teosofia. Antroposofia. Vapaamuurarius
in scheme: URN:NBN:fi:au:hklj:
notation: 204.3
preferred label: Freemasonry @en
preferred label: Frimurarna @sv
related: RAJATIETO
related: URN:NBN:fi:au:hklj:192
related: Uskonnonfilosofia
related: URN:NBN:fi:au:hklj:280

Kausijulkaisut
type: Class
type: Concept
subclass of: URN:NBN:fi:au:hklj:210
alternative label: Uskonnolliset lehdet, kristinusko (215)
alternative label: Religiösa tidningar, kristinusko (215) @sv
broader: URN:NBN:fi:au:hklj:210
in scheme: URN:NBN:fi:au:hklj:
notation: 215
preferred label: Journals. Serial publications @en
preferred label: Tidskrifter. Seriella publikationer @sv
scope note: Kristinuskoa tai kristillistä teologiaa koskevat yleiset ja sekasisältöiset kausijulkaisut Kristinuskon tai kristillisen teologian erikoisaloja koskevat kausijulkaisut alan mukaisessa luokassa
scope note: Tidskrifter och seriella publikationer med allmänt eller blandat innehåll som handlar om kristendom eller kristen teologi Tidskrifter och seriella publikationer i specialområden inom kristendom eller kristen teologi klassificeras enligt område @sv

Vanha Testamentti
type: Class
type: Concept
subclass of: RAAMATTU. RAAMATUNTUTKIMUS
alternative label: Intertestamentaariset tekstit (221)
alternative label: Nooan arkki, Raamattu, Vanha Testamentti (221)
alternative label: Raamattu, Vanha Testamentti (221)
alternative label: Vanha Testamentti (221)
alternative label: Bibeln, Gamla Testamentet (221) @sv
alternative label: Gamla Testamentet (221) @sv
alternative label: Intertestamentariska texter (221) @sv
alternative label: Noas ark, Bibeln, Gamla Testamentet (221) @sv
broader: RAAMATTU. RAAMATUNTUTKIMUS
in scheme: URN:NBN:fi:au:hklj:
notation: 221
preferred label: The Old Testament @en
preferred label: Gamla testamentet @sv
related: URN:NBN:fi:au:hklj:221.09
related: Apokryfikirjat. Apostoliset isät
related: Juutalaisten uskonto ja sen mytologia
scope note: Tässä ja luokissa 222-224 myös Vanhan testamentin tutkimus, Vanhan Testamentin maantiede ja Vanhan Testamentin henkilöt
scope note: Hit och till klasserna 222-224 också forskning i Gamla testamentet, Gamla testamentets geografi och Gamla testamentets personer @sv

Apokryfikirjat. Apostoliset isät
type: Class
type: Concept
subclass of: RAAMATTU. RAAMATUNTUTKIMUS
alternative label: Apokryfikirjat (229)
alternative label: Apokryfiset kirjat (229)
alternative label: Apokryfit (229)
alternative label: Apostoliset isät (229)
alternative label: Raamattu, apokryfit (229)
alternative label: Uusi Testamentti, apokryfikirjat (229)
alternative label: Uusi Testamentti, apostoliset isät (229)
alternative label: Apokryfer (229) @sv
alternative label: Apokryfiska böcker (229) @sv
alternative label: Apostoliska fäder (229) @sv
alternative label: Bibeln, apokryfer (229) @sv
alternative label: Nya Testamentet, apokryfiska böckerna (229) @sv
alternative label: Nya Testamentet, apostoliska fäderna (229) @sv
broader: RAAMATTU. RAAMATUNTUTKIMUS
in scheme: URN:NBN:fi:au:hklj:
notation: 229
preferred label: Apocrypha. The Apostolic Fathers @en
preferred label: Apokryferna. Apostoliska fäderna @sv
related: Vanha Testamentti
related: KRISTILLINEN DOGMATIIKKA
scope note: Vanhan ja Uuden Testamentin apokryfikirjat
scope note: Gamla och nya testamentets apokryfer @sv

Eskatologia
type: Class
type: Concept
subclass of: KRISTILLINEN DOGMATIIKKA
alternative label: Apokalyptiikka (236)
alternative label: Ennustukset, eskatologia (236)
alternative label: Eskatologia (236)
alternative label: Harmagedon, maailmanlopun ennustukset (236)
alternative label: Maailmanloppu, kristinusko (236)
alternative label: Maailmanlopun ennustukset, kristillinen teologia (236)
alternative label: Viimeiset tapahtumat, kristinusko (236)
alternative label: Apokalyptik (236) @sv
alternative label: Domedagsprofetior, kristen teologi (236) @sv
alternative label: Eskatologi (236) @sv
alternative label: Förutsägelser, eskatologi (236) @sv
alternative label: Harmageddon, domedagsprofetior (236) @sv
alternative label: Världsundergång, kristendom (236) @sv
alternative label: Yttersta tingen, kristendom (236) @sv
broader: KRISTILLINEN DOGMATIIKKA
in scheme: URN:NBN:fi:au:hklj:
notation: 236
preferred label: Eschatology @en
preferred label: Eskatologi @sv
related: URN:NBN:fi:au:hklj:192
related: Astrologia. Horoskoopit
related: Unikirjat
related: Apologetiikka
scope note: Kristillinen oppi viimeisistä tapahtumista. Maailmanlopun ennustukset
scope note: Den kristna läran om de yttersta händelserna. Profetior om världens undergång @sv

Itämaiset kirkot
type: Class
type: Concept
subclass of: URN:NBN:fi:au:hklj:260
alternative label: Itämaiset kirkot (261)
alternative label: Katolinen kirkko, Armenian (261)
alternative label: Koptilainen kirkko (261)
alternative label: Tuomaskristittyjen kirkko (261)
alternative label: Katolska kyrkan, armeniska (261) @sv
alternative label: Koptiska kyrkan (261) @sv
alternative label: Thomaskristna kyrkan (261) @sv
alternative label: Österländska kyrkor (261) @sv
broader: URN:NBN:fi:au:hklj:260
in scheme: URN:NBN:fi:au:hklj:
notation: 261
preferred label: Oriental churches @en
preferred label: Österlandets kyrkor @sv
related: RAAMATTU. RAAMATUNTUTKIMUS
related: KRISTILLINEN DOGMATIIKKA
related: KÄYTÄNNÖLLINEN TEOLOGIA
related: URN:NBN:fi:au:hklj:261.09
scope note: Itämaisia kirkkoja, niiden organisaatiota tai toimintaa koskevat yleisteokset Lähi-idän varhaiset kirkot. Armenian katolinen kirkko. Koptilainen kirkko. Intian tuomaskristittyjen kirkko Itämaisia kirkkoja koskevat erikoisalojen kysymykset alan mukaan luokissa 220-248
scope note: Allmänna verk som rör österlandets kyrkor, deras organisation eller verksamhet De första kyrkorna i Mellanöstern. Den katolska kyrkan i Armenien. Den koptiska kyrkan. De tomaskristna kyrkorna i Indien Frågor som rör specialområden inom österlandets kyrkor klassificeras enligt område i klasserna 220-248 @sv

Kausijulkaisut
type: Class
type: Concept
subclass of: URN:NBN:fi:au:hklj:300
broader: URN:NBN:fi:au:hklj:300
in scheme: URN:NBN:fi:au:hklj:
notation: 305
preferred label: Serial publications @en
preferred label: Seriella publikationer @sv
scope note: Yhteiskuntaa tai yhteiskuntatieteitä koskevat yleiset kausijulkaisut Eri yhteiskuntatieteitä koskevat kausijulkaisut alan mukaisessa luokassa
scope note: Allmänna seriella publikationer som handlar om samhället eller samhällsvetenskaperna Seriella publikationer som handlar om olika samhällsvetenskaper klassificeras enligt område @sv

Teoria. Tutkimusmenetelmät. Tilastomatematiikka
type: Class
type: Concept
subclass of: TILASTOTIEDE
alternative label: Aikasarja-analyysi, tilastotiede (311)
alternative label: Aikasarjat, tilastotiede (311)
alternative label: Approksimointi, tilastomatematiikka (311)
alternative label: Asutusmaantiede, väestömaantiede (311)
alternative label: Bifurkaatio, tilastomatematiikka (311)
alternative label: Delfoimenetelmä, tilastotiede (311)
alternative label: Diagrammit, tilastomatematiikka (311)
alternative label: Faktorianalyysi, matemaattinen tilastotiede (311)
alternative label: Frekvenssit, tilastotiede (311)
alternative label: Gaussin käyrä, tilastotiede (311)
alternative label: Graafinen esitys, tilastotiede (311)
alternative label: Hajonta, tilastotiede (311)
alternative label: Havainnollistaminen, tilastojen laatiminen (311)
alternative label: Jakaumat, tilastotiede (311)
alternative label: Kartogrammit, tilastotiede (311)
alternative label: Keskiarvot, tilastotiede (311)
alternative label: Keskihajonta, tilastotiede (311)
alternative label: Klusterianalyysi, matemaattinen tilastotiede (311)
alternative label: Korrelaatio, tilastotiede (311)
alternative label: Kovarianssianalyysi, tilastotiede (311)
alternative label: Luotettavuusanalyysi, tilastomatematiikka (311)
alternative label: Matemaattinen tilastotiede (311)
alternative label: Matemaattiset menetelmät, tilastomatematiikka (311)
alternative label: Matemaattiset tieteet, matemaattinen tilastotiede (311)
alternative label: Matematiikka, tilastomatematiikka (311)
alternative label: Mediaanit (311)
alternative label: Meta-analyysi, tilastomenetelmät (311)
alternative label: Mittausvirheet, matemaattinen tilastotiede (311)
alternative label: Monimuuttujamenetelmät, matemaattinen tilastotiede (311)
alternative label: Monte Carlo -menetelmät (311)
alternative label: Muuttujat, tilastomatematiikka (311)
alternative label: Normaalijakauma, tilastotiede (311)
alternative label: Operaattorit, tilastomatematiikka (311)
alternative label: Otanta, tilastotiede (311)
alternative label: Rakenneyhtälömallit, tilastomatematiikka (311)
alternative label: Regressioanalyysi, matemaattinen tilastotiede (311)
alternative label: Ryhmittelyanalyysi, matemaattinen tilastotiede (311)
alternative label: Sattuma, matemaattinen tilastotiede (311)
alternative label: Taulukointi, tilastojen laatiminen (311)
alternative label: Taulukot, tilastojen laatiminen (311)
alternative label: Tilastointi, matemaattinen tilastotiede (311)
alternative label: Tilastointi, tilastojen laadinta (311)
alternative label: Tilastolliset mallit, tilastomatematiikka (311)
alternative label: Tilastomatematiikka (311)
alternative label: Tilastomenetelmät (311)
alternative label: Tilastoteoria (311)
alternative label: Tilastotiede, matemaattinen tilastotiede (311)
alternative label: Todennäköisyys, tilastotiede (311)
alternative label: Vakiot, tilastomatematiikka (311)
alternative label: Variaabelit, tilastomatematiikka (311)
alternative label: Varianssianalyysi (311)
alternative label: Ääriarvot, tilastomatematiikka (311)
alternative label: Approximation, statistisk matematik (311) @sv
alternative label: Bebyggelsegeografi, demografisk geografi (311) @sv
alternative label: Bifurkation, statistisk matematik (311) @sv
alternative label: Delfimetod, statistik (311) @sv
alternative label: Diagram, statistisk matematik (311) @sv
alternative label: Extremvärden, statistisk matematik (311) @sv
alternative label: Faktoranalys, matematisk statistik (311) @sv
alternative label: Frekvenser, statistik (311) @sv
alternative label: Fördelningar, statistik (311) @sv
alternative label: Gauss-kurva, statistik (311) @sv
alternative label: Grafisk framställning, statistik (311) @sv
alternative label: Kartogram, statistik (311) @sv
alternative label: Klusteranalys, matematisk statistik (311) @sv
alternative label: Konstanter, muuttujat, statistisk matematik (311) @sv
alternative label: Korrelation, statistik (311) @sv
alternative label: Kovariansanalys, statistik (311) @sv
broader: TILASTOTIEDE
in scheme: URN:NBN:fi:au:hklj:
notation: 311
related: MATEMATIIKKA
related: Todennäköisyyslaskenta
related: Matematiikan muut alat
related: Taulukkolaskentaohjelmat
scope note: Tilastojen laatiminen ja tulkinta Tilastollinen analyysi. Matemaattinen tilastotiede Otanta- ja gallupmenetelmät tilastotieteen kannalta Erikoisalojen tilastolliset menetelmät alan mukaisessa luokassa
scope note: Statistikproduktion och statistisk tolkning Statistisk analys. Matematisk statistik Urvals- och gallupmetoder ur statistikens synvinkel Statistiska metoder som rör specialområden klassificeras enligt område @sv

Oikeusfilosofia
type: Class
type: Concept
subclass of: URN:NBN:fi:au:hklj:330
alternative label: Common law -oikeusjärjestelmä (330.1)
alternative label: Epäoikeudenmukaisuus, oikeusfilosofia (330.1 +)
alternative label: Filosofia, oikeusfilosofia (330.1)
alternative label: Humanitaarinen oikeus, oikeusfilosofia (330.1)
alternative label: Hyvä tapa, oikeusfilosofia (330.1)
alternative label: Kansallinen oikeus, oikeusfilosofia (330.1 +)
alternative label: Laintulkinta, oikeusfilosofia (330.1)
alternative label: Lainvastaisuus, oikeusfilosofia (330.1 +)
alternative label: Lakien yhdenmukaistaminen, oikeusfilosofia (330.1)
alternative label: Luonnonoikeus, oikeusfilosofia (330.1)
alternative label: Luontaisoikeus, oikeusfilosofia (330.1)
alternative label: Maantapa, oikeusfilosofia (330.1)
alternative label: Oikeidenvastaisuus, oikeusfilosofia (330.1 +)
alternative label: Oikeudenloukkaus, oikeusfilosofia (330.1 +)
alternative label: Oikeudenmukaisuus, oikeusfilosofia (330.1 +)
alternative label: Oikeudenvastaisuus, oikeusfilosofia (330.1 +)
alternative label: Oikeudet, oikeusfilosofia (330.1 +)
alternative label: Oikeus, oikeusfilosofia (330.1 +)
alternative label: Oikeusfilosofia, oikeustiede (330.1 +)
alternative label: Oikeuslogiikka (330.1)
alternative label: Oikeusmurha, oikeusfilosofia (330.1)
alternative label: Oikeussubjekti, oikeusfilosofia (330.1 +)
alternative label: Oikeustaju, oikeusfilosofia (330.1)
alternative label: Oikeusteoria (330.1)
alternative label: Omankädenoikeus, oikeusfilosofia (330.1)
alternative label: Taannehtivuus, oikeusfilosofia (330.1)
alternative label: Tapaoikeus, oikeusfilosofia (330.1)
alternative label: Todistustaakka, oikeusfilosofia (330.1)
alternative label: Totuuskomissiot, oikeusfilosofia (330.1 +)
alternative label: Valtionsisäinen oikeus, oikeusfilosofia (330.1)
alternative label: Bevisbörda, rättsfilosofi (330.1) @sv
alternative label: Common law-rättssystem (330.1) @sv
alternative label: Egenhandsrätt, rättsfilosofi (330.1) @sv
alternative label: Enhetligandet av lagar, rättsfilosofi (330.1) @sv
alternative label: Filosofi, rättsfilosofi (330.1) @sv
alternative label: God sed, rättsfilosofi (330.1) @sv
alternative label: Humanitär rätt, rättsfilosofi (330.1) @sv
alternative label: Inomstatlig rätt, rättsfilosofi (330.1) @sv
alternative label: Justitiemord, rättsfilosofi (330.1) @sv
alternative label: Lagstridighet, rättsfilosofi (330.1 +) @sv
alternative label: Lagtolkning, rättsfilosofi (330.1) @sv
alternative label: Landssed, rättsfilosofi (330.1) @sv
alternative label: Nationell rätt, rättsfilosofi (330.1 +) @sv
alternative label: Naturlig rätt, rättsfilosofi (330.1) @sv
alternative label: Naturrätt, rättsfilosofi (330.1) @sv
alternative label: Orättvisa, rättsfilosofi (330.1 +) @sv
alternative label: Retroaktivitet, rättsfilosofi (330.1) @sv
alternative label: Rätt, rättsfilosofi (330.1 +) @sv
alternative label: Rättigheter, rättsfilosofi (330.1 +) @sv
alternative label: Rättsfilosofi, juridik (330.1 +) @sv
alternative label: Rättskränkning, rättsfilosofi (330.1 +) @sv
alternative label: Rättskänsla, rättsfilosofi (330.1) @sv
alternative label: Rättslogik (330.1) @sv
alternative label: Rättsstridighet, rättsfilosofi (330.1 +) @sv
alternative label: Rättssubjekt, rättsfilosofi (330.1 +) @sv
alternative label: Rättsteori (330.1) @sv
alternative label: Rättvisa, rättsfilosofi (330.1 +) @sv
alternative label: Sanningskommissioner, rättsfilosofi (330.1 +) @sv
alternative label: Sedvanerätt, rättsfilosofi (330.1) @sv
broader: URN:NBN:fi:au:hklj:330
in scheme: URN:NBN:fi:au:hklj:
narrower: Oikeussosiologia. Oikeuspolitiikka. Oikeuspsykologia
notation: 330.1
preferred label: Legal philosophy @en
preferred label: Rättsfilosofi @sv
related: Etiikka. Moraalifilosofia
related: URN:NBN:fi:au:hklj:326.2
scope note: Oikeustieteen yleinen filosofia ja teoria. Oikeuslogiikka Suomen ja EU:n lainsäädännön erikoisaloja koskevat kysymykset alan mukaisessa luokassa 332-334+
scope note: Rättsvetenskapens allmänna filosofi och teori. Rättslogik Frågor som rör specialområden inom Finlands och EU:s lagstiftning klassificeras enligt område i klasserna 332-334+ @sv

Yhteiskunnallinen futurologia
type: Class
type: Concept
subclass of: URN:NBN:fi:au:hklj:370
alternative label: Antiutopiat, futurologia (370.2)
alternative label: Biohakkerointi, futurologia (370.2)
alternative label: Dystopiat, futurologia (370.2)
alternative label: Ennakointi, futurologia (370.2)
alternative label: Ennusteet (370.2)
alternative label: Ennusteet, futurologia (370.2)
alternative label: Ennustettavuus, tulevaisuudentutkimus (370.2)
alternative label: Epävarmuus, tulevaisuudentutkimus (370.2)
alternative label: Futurologia (370.2)
alternative label: Futurologia, yhteiskunta (370.2)
alternative label: Globaali hallinta, futurologia (370.2)
alternative label: Globaalihallinta, futurologia (370.2)
alternative label: Globaaliset ongelmat, futurologia (370.2)
alternative label: Global governance, futurologia (370.2)
alternative label: Globalisaatio, futurologia (370.2)
alternative label: Globalisaation hallinta, futurologi (370.2)
alternative label: Heikot signaalit (370.2)
alternative label: Heikot signaalit, tulevaisuudentutkimus (370.2)
alternative label: Heikot signaalit, yhteiskunnallinen futurologia (370.2)
alternative label: Ihmiskunta, futurologia (370.2)
alternative label: Kattavuus, ennusteet, futurologia (370.2)
alternative label: Maailma, futurologia (370.2)
alternative label: Maailmanhallinta, futurologia (370.2)
alternative label: Maailmanlaajuinen hallinta, futurologia (370.2)
alternative label: Maailmanlaajuiset ongelmat, futurologia (370.2)
alternative label: Odotukset, tulevaisuus (370.2)
alternative label: Pitkän aikavälin suunnittelu, tulevaisuudentutkimus (370.2)
alternative label: Reformit, futurologia (370.2)
alternative label: Riskiyhteiskunta, yhteiskunnallinen futurologia (370.2)
alternative label: Skenaariot, yhteiskunnallinen futurologia (370.2)
alternative label: Talouskylät, aluepolitiikka (370.2)
alternative label: Teknologiakritiikki, futurologia (370.2)
alternative label: Transhumanismi, futurologia (370.2)
alternative label: Trendit, tulevaisuudentutkimus (370.2)
alternative label: Tulevaisuudenodotukset, futurologia (370.2)
alternative label: Tulevaisuudentutkimus (370.2)
alternative label: Tulevaisuudentutkimus, yhteiskunnallinen futurologia (370.2)
alternative label: Tulevaisuus (370.2)
alternative label: Uhat, tulevaisuudentutkimus (370.2)
alternative label: Uhkakuvat, tulevaisuudentutkimus (370.2)
alternative label: Uhkat, tulevaisuudentutkimus (370.2)
alternative label: Utopiat, futurologia (370.2)
alternative label: Uudistukset, futurologia (370.2)
alternative label: Visiot, tulevaisuudentutkimus (370.2)
alternative label: Yhteiskunnallinen futurologia (370.2)
alternative label: Yhteiskunta, yhteiskunnallinen futurologia (370.2)
alternative label: Ylikansallisuus, futurologia (370.2)
alternative label: Antiutopier, futurologi (370.2) @sv
alternative label: Biohacking, futurologi (370.2) @sv
alternative label: Dystopier, futurologi (370.2) @sv
alternative label: Ekonomibyar, regionalpolitik (370.2) @sv
alternative label: Framtid (370.2) @sv
alternative label: Framtidsforskning (370.2) @sv
alternative label: Framtidsforskning, samhällsfuturologi (370.2) @sv
alternative label: Framtidsförväntningar, futurologi (370.2) @sv
alternative label: Futurologi (370.2) @sv
alternative label: Futurologi, samhälle (370.2) @sv
alternative label: Förutseende, futurologi (370.2) @sv
alternative label: Förutsägbarhet, framtidsforskning (370.2) @sv
alternative label: Förväntningar, framtid (370.2) @sv
alternative label: Global governance, futurologi (370.2) @sv
alternative label: Global styrning, futurologi (370.2) @sv
alternative label: Globala problem, futurologi (370.2) @sv
alternative label: Globalisering, futurologi (370.2) @sv
alternative label: Globaliseringsstyre, futurologi (370.2) @sv
alternative label: Globalt styre, futurologi (370.2) @sv
alternative label: Hotbilder, framtidsforskning (370.2) @sv
alternative label: Hotelser, framtidsforskning (370.2) @sv
broader: URN:NBN:fi:au:hklj:370
in scheme: URN:NBN:fi:au:hklj:
notation: 370.2
related: Yhteiskuntafilosofia
related: URN:NBN:fi:au:hklj:371
related: URN:NBN:fi:au:hklj:620
related: Maatalouspolitiikka
scope note: Yhteiskunnallisen tulevaisuudentutkimuksen yleisteokset Tässä myös teokset, jotka koskevat sekä yhteiskunnallista että teknologista futurologiaa Erikoisalojen futurologia alan mukaisessa luokassa
scope note: Allmänna verk som rör samhällelig framtidsforskning Hit också verk som rör både samhällelig och teknologisk futurologi Specialområden inom futurologi klassificeras enligt område @sv

Tukholma
type: Class
type: Concept
subclass of: Ruotsi
alternative label: Tukholma (411.11)
alternative label: Tukholma, maantiede, matkat (411.11)
alternative label: Stockholm (411.11) @sv
alternative label: Stockholm, geografi, resor (411.11) @sv
broader: Ruotsi
in scheme: URN:NBN:fi:au:hklj:
notation: 411.11
preferred label: Stockholm @en
related: URN:NBN:fi:au:hklj:460
related: URN:NBN:fi:au:hklj:930
related: Ruotsin historia
related: Ruotsin paikallishistoria

Viro
type: Class
type: Concept
subclass of: Baltian maat
alternative label: Viro (411.51)
alternative label: Viro, maantiede, matkat (411.51)
alternative label: Virolaiset, maantiede, matkat (411.51)
alternative label: Ester, geografi, resor (411.51) @sv
alternative label: Estland (411.51) @sv
alternative label: Estland, geografi, resor (411.51) @sv
broader: Baltian maat
in scheme: URN:NBN:fi:au:hklj:
notation: 411.51
preferred label: Estonia @en
preferred label: Estland @sv
related: URN:NBN:fi:au:hklj:460
related: URN:NBN:fi:au:hklj:930
related: Baltian maiden historia
related: Viron historia

Latvia
type: Class
type: Concept
subclass of: Baltian maat
alternative label: Latvia (411.52)
alternative label: Latvia, maantiede, matkat (411.52)
alternative label: Liiviläiset, Latvia (411.52)
alternative label: Lettland (411.52) @sv
alternative label: Lettland, geografi, resor (411.52) @sv
alternative label: Livländare, Lettland (411.52) @sv
broader: Baltian maat
in scheme: URN:NBN:fi:au:hklj:
notation: 411.52
preferred label: Lettland @sv
related: URN:NBN:fi:au:hklj:460
related: URN:NBN:fi:au:hklj:930
related: Baltian maiden historia
related: Latvian historia

Liettua
type: Class
type: Concept
subclass of: Baltian maat
alternative label: Liettua (411.53)
alternative label: Liettua, maantiede, matkat (411.53)
alternative label: Litauen (411.53) @sv
alternative label: Litauen, geografi, resor (411.53) @sv
broader: Baltian maat
in scheme: URN:NBN:fi:au:hklj:
notation: 411.53
preferred label: Lithuania @en
preferred label: Litauen @sv
related: URN:NBN:fi:au:hklj:460
related: URN:NBN:fi:au:hklj:930
related: Baltian maiden historia
related: Liettuan historia

Turku
type: Class
type: Concept
subclass of: Varsinais-Suomi. Satakunta
alternative label: Turku (412.21)
alternative label: Turku, maantiede, matkat (412.21)
alternative label: Åbo (412.21) @sv
alternative label: Åbo, geografi, resor (412.21) @sv
broader: Varsinais-Suomi. Satakunta
in scheme: URN:NBN:fi:au:hklj:
notation: 412.21
preferred label: Åbo @sv
related: URN:NBN:fi:au:hklj:411
related: URN:NBN:fi:au:hklj:460
related: URN:NBN:fi:au:hklj:920
related: URN:NBN:fi:au:hklj:929

Ahvenanmaa
type: Class
type: Concept
subclass of: Suomi
alternative label: Ahvenanmaa (412.3)
alternative label: Ahvenanmaa, maantiede, matkat (412.3)
alternative label: Ahvenanmaalaiset (412.3)
alternative label: Ahvenanmaalaiset, maantiede, matkat (412.3)
alternative label: Åland (412.3) @sv
alternative label: Åland, geografi, resor (412.3) @sv
alternative label: Ålänningar (412.3) @sv
alternative label: Ålänningar, geografi, resor (412.3) @sv
broader: Suomi
in scheme: URN:NBN:fi:au:hklj:
notation: 412.3
preferred label: The Åland islands @en
preferred label: Åland @sv
related: URN:NBN:fi:au:hklj:411
related: URN:NBN:fi:au:hklj:460
related: URN:NBN:fi:au:hklj:920
related: URN:NBN:fi:au:hklj:929
scope note: Ahvenanmaan maakunta
scope note: Landskapet Åland @sv

Tampere
type: Class
type: Concept
subclass of: Häme. Pirkanmaa
alternative label: Tampere (412.41)
alternative label: Tampere, maantiede, matkat (412.41)
alternative label: Tammerfors (412.41) @sv
alternative label: Tammerfors, geografi, resor (412.41) @sv
broader: Häme. Pirkanmaa
in scheme: URN:NBN:fi:au:hklj:
notation: 412.41
preferred label: Tammerfors @sv
related: URN:NBN:fi:au:hklj:411
related: URN:NBN:fi:au:hklj:460
related: URN:NBN:fi:au:hklj:920
related: URN:NBN:fi:au:hklj:929

Pohjois-Karjala
type: Class
type: Concept
subclass of: Pohjois-Savo
alternative label: Pohjois-Karjala (412.79)
alternative label: Pohjois-Karjala, maantiede, matkat (412.79)
alternative label: Pohjois-Karjalan lääni (412.79)
alternative label: Pohjois-Karjalan lääni, maantiede, matkat (412.79)
alternative label: Norra Karelen (412.79) @sv
alternative label: Norra Karelen, geografi, resor (412.79) @sv
alternative label: Norra Karelens län (412.79) @sv
alternative label: Norra Karelens län, geografi, resor (412.79) @sv
broader: Pohjois-Savo
in scheme: URN:NBN:fi:au:hklj:
notation: 412.79
preferred label: Norra Karelen @sv
related: URN:NBN:fi:au:hklj:411
related: URN:NBN:fi:au:hklj:460
related: URN:NBN:fi:au:hklj:920
related: URN:NBN:fi:au:hklj:929
scope note: Pohjois-Karjalan lääni
scope note: Norra Karelens län @sv

Keski-Suomi
type: Class
type: Concept
subclass of: Etelä-Pohjanmaa. Keski-Pohjanmaa
alternative label: Keski-Suomen lääni (412.89)
alternative label: Keski-Suomen lääni, maantiede, matkat (412.89)
alternative label: Keski-Suomi (412.89)
alternative label: Keski-Suomi, maantiede, matkat (412.89)
alternative label: Mellersta Finland (412.89) @sv
alternative label: Mellersta Finland, geografi, resor (412.89) @sv
alternative label: Mellersta Finlands län (412.89) @sv
alternative label: Mellersta Finlands län, geografi, resor (412.89) @sv
broader: Etelä-Pohjanmaa. Keski-Pohjanmaa
in scheme: URN:NBN:fi:au:hklj:
notation: 412.89
preferred label: Mellersta Finland @sv
related: URN:NBN:fi:au:hklj:411
related: URN:NBN:fi:au:hklj:460
related: URN:NBN:fi:au:hklj:920
related: URN:NBN:fi:au:hklj:929
scope note: Keski-Suomen lääni
scope note: Mellersta Finlands län @sv

Unkari
type: Class
type: Concept
subclass of: Keski-Eurooppa
alternative label: Budapest (413.4)
alternative label: Budapest, maantiede, matkat (413.4)
alternative label: Unkari (413.4)
alternative label: Unkari, maantiede, matkat (413.4)
alternative label: Unkarilaiset, Unkari (413.4)
alternative label: Budapest, geografi, resor (413.4) @sv
alternative label: Ungern (413.4) @sv
alternative label: Ungern, geografi, resor (413.4) @sv
alternative label: Ungrare, Ungern (413.4) @sv
broader: Keski-Eurooppa
in scheme: URN:NBN:fi:au:hklj:
notation: 413.4
preferred label: Hungary @en
preferred label: Ungern @sv
related: URN:NBN:fi:au:hklj:460
related: Itävallan ja Unkarin historia
related: Itävallan historia
related: Unkarin historia

Sveitsi
type: Class
type: Concept
subclass of: Keski-Eurooppa
alternative label: Liechtenstein (413.8)
alternative label: Liechtenstein, maantiede, matkat (413.8)
alternative label: Sveitsi (413.8)
alternative label: Sveitsi, maantiede, matkat (413.8)
alternative label: Liechtenstein, geografi, resor (413.8) @sv
alternative label: Schweiz (413.8) @sv
alternative label: Schweiz, geografi, resor (413.8) @sv
broader: Keski-Eurooppa
in scheme: URN:NBN:fi:au:hklj:
notation: 413.8
preferred label: Switzerland @en
preferred label: Schweiz @sv
related: URN:NBN:fi:au:hklj:460
related: Sveitsin historia
related: Muiden Keski-Euroopan maiden historia
scope note: Tässä myös Liechtenstein
scope note: Hit också Liechtenstein @sv

Wien
type: Class
type: Concept
subclass of: Itävalta
alternative label: Wien (413.91)
alternative label: Wien, maantiede, matkat (413.91)
alternative label: Wien, geografi, resor (413.91) @sv
broader: Itävalta
in scheme: URN:NBN:fi:au:hklj:
notation: 413.91
preferred label: Vienna @en
related: URN:NBN:fi:au:hklj:460
related: Itävallan ja Unkarin historia
related: Itävallan historia
related: Unkarin historia

Pariisi
type: Class
type: Concept
subclass of: Ranska
alternative label: Pariisi (415.1)
alternative label: Pariisi, maantiede, matkat (415.1)
alternative label: Paris (415.1) @sv
alternative label: Paris, geografi, resor (415.1) @sv
broader: Ranska
in scheme: URN:NBN:fi:au:hklj:
notation: 415.1
preferred label: Paris @en
related: Keski-Eurooppa
related: URN:NBN:fi:au:hklj:460
related: RANSKAN HISTORIA
related: Muiden Keski-Euroopan maiden historia

Irlannin tasavalta, Eire
type: Class
type: Concept
subclass of: Irlanti
alternative label: Eire (417.21)
alternative label: Eire, maantiede, matkat (417.21)
alternative label: Irlannin tasavalta (417.21)
alternative label: Irlannin tasavalta, maantiede, matkat (417.21)
alternative label: Eire, geografi, resor (417.21) @sv
alternative label: Irländska republiken (417.21) @sv
alternative label: Irländska republiken, geografi, resor (417.21) @sv
broader: Irlanti
in scheme: URN:NBN:fi:au:hklj:
notation: 417.21
preferred label: Irish Republic, Eire @en
preferred label: Irländska republiken, Eire @sv
related: URN:NBN:fi:au:hklj:460
related: BRITTEIN SAARTEN HISTORIA
related: Irlannin historia
related: Irlannin tasavallan eli Eiren historia

Moskova
type: Class
type: Concept
subclass of: Venäjä
alternative label: Moskova (418.21)
alternative label: Moskova, maantiede, matkat (418.21)
alternative label: Moskva (418.21) @sv
alternative label: Moskva, geografi, resor (418.21) @sv
broader: Venäjä
in scheme: URN:NBN:fi:au:hklj:
notation: 418.21
preferred label: Moscow @en
preferred label: Moskva @sv
related: Armenia. Azerbaidzan. Georgia. Kazakstan. Kirgisia. Tadzikistan. Turkmenistan. Uzbekistan
related: URN:NBN:fi:au:hklj:460
related: URN:NBN:fi:au:hklj:970
related: Venäjän historia

Pietari
type: Class
type: Concept
subclass of: Venäjä
alternative label: Pietari, kaupunki (418.22)
alternative label: Pietari, kaupunki, maantiede, matkat (418.22)
alternative label: S:t Petersburg (418.22) @sv
alternative label: S:t Petersburg, geografi, resor (418.22) @sv
broader: Venäjä
in scheme: URN:NBN:fi:au:hklj:
notation: 418.22
preferred label: St Petersburg @en
preferred label: S:t Petersburg @sv
related: Armenia. Azerbaidzan. Georgia. Kazakstan. Kirgisia. Tadzikistan. Turkmenistan. Uzbekistan
related: URN:NBN:fi:au:hklj:460
related: URN:NBN:fi:au:hklj:970
related: Venäjän historia

Ukraina
type: Class
type: Concept
subclass of: Itä-Eurooppa
alternative label: Krim (418.3)
alternative label: Krim, maantiede, matkat (418.3)
alternative label: Ukraina (418.3)
alternative label: Ukraina, maantiede, matkat (418.3)
alternative label: Krim, geografi, resor (418.3) @sv
alternative label: Ukraina, geografi, resor (418.3) @sv
broader: Itä-Eurooppa
in scheme: URN:NBN:fi:au:hklj:
notation: 418.3
preferred label: The Ukraine @en
related: Armenia. Azerbaidzan. Georgia. Kazakstan. Kirgisia. Tadzikistan. Turkmenistan. Uzbekistan
related: URN:NBN:fi:au:hklj:460
related: URN:NBN:fi:au:hklj:970
related: Ukrainan historia
scope note: Tässä myös Krim
scope note: Hit också Krim @sv

Valko-Venäjä
type: Class
type: Concept
subclass of: Itä-Eurooppa
alternative label: Valko-Venäjä (418.4)
alternative label: Valko-Venäjä, maantiede, matkat (418.4)
alternative label: Vitryssland (418.4) @sv
alternative label: Vitryssland, geografi, resor (418.4) @sv
broader: Itä-Eurooppa
in scheme: URN:NBN:fi:au:hklj:
notation: 418.4
preferred label: Belorussia @en
preferred label: Vitryssland @sv
related: Armenia. Azerbaidzan. Georgia. Kazakstan. Kirgisia. Tadzikistan. Turkmenistan. Uzbekistan
related: URN:NBN:fi:au:hklj:460
related: URN:NBN:fi:au:hklj:970
related: Valko-Venäjän historia

Moldova
type: Class
type: Concept
subclass of: Itä-Eurooppa
alternative label: Moldova (418.5)
alternative label: Moldova, maantiede, matkat (418.5)
alternative label: Moldova, geografi, resor (418.5) @sv
broader: Itä-Eurooppa
in scheme: URN:NBN:fi:au:hklj:
notation: 418.5
related: Armenia. Azerbaidzan. Georgia. Kazakstan. Kirgisia. Tadzikistan. Turkmenistan. Uzbekistan
related: URN:NBN:fi:au:hklj:460
related: URN:NBN:fi:au:hklj:970
related: Moldovan historia

Kreikka
type: Class
type: Concept
subclass of: Balkanin niemimaa
alternative label: Aigeianmeren saaret (419.31)
alternative label: Aigeianmeren saaret, maantiede, matkat (419.31)
alternative label: Aigeianmeri (419.31)
alternative label: Ateena (419.31)
alternative label: Ateena, maantiede, matkat (419.31)
alternative label: Kreeta (419.31)
alternative label: Kreeta, maantiede, matkat (419.31)
alternative label: Kreikka (419.31)
alternative label: Kreikka, maantiede, matkat (419.31)
alternative label: Makedonia, Kreikka (419.31)
alternative label: Peloponnesos (419.31)
alternative label: Peloponnesos, maantiede, matkat (419.31)
alternative label: Rhodos (419.31)
alternative label: Rhodos, maantiede, matkat (419.31)
alternative label: Aten (419.31) @sv
alternative label: Aten, geografi, resor (419.31) @sv
alternative label: Egeiska havet (419.31) @sv
alternative label: Egeiska öarna (419.31) @sv
alternative label: Egeiska öarna, geografi, resor (419.31) @sv
alternative label: Grekland (419.31) @sv
alternative label: Grekland, geografi, resor (419.31) @sv
alternative label: Kreta (419.31) @sv
alternative label: Kreta, geografi, resor (419.31) @sv
alternative label: Makedonien, Grekland (419.31) @sv
alternative label: Peloponnesos, geografi, resor (419.31) @sv
alternative label: Rhodos, geografi, resor (419.31) @sv
broader: Balkanin niemimaa
in scheme: URN:NBN:fi:au:hklj:
notation: 419.31
preferred label: Greece @en
preferred label: Grekland @sv
related: URN:NBN:fi:au:hklj:460
related: Kreikan muinaishistoria ja arkeologia
related: URN:NBN:fi:au:hklj:979
related: Kreikan nykyhistoria

Slovenia
type: Class
type: Concept
subclass of: Entisen Jugoslavian alue
alternative label: Slovenia (419.321)
alternative label: Slovenia, maantiede, matkat (419.321)
alternative label: Slovenien (419.321) @sv
alternative label: Slovenien, geografi, resor (419.321) @sv
broader: Entisen Jugoslavian alue
in scheme: URN:NBN:fi:au:hklj:
notation: 419.321
preferred label: Slovenien @sv
related: URN:NBN:fi:au:hklj:460
related: URN:NBN:fi:au:hklj:979
related: Entisen Jugoslavian alueen historia
related: Slovenian historia

Kroatia
type: Class
type: Concept
subclass of: Entisen Jugoslavian alue
alternative label: Dalmatia (419.322)
alternative label: Dalmatia, maantiede, matkat (419.322)
alternative label: Kroatia (419.322)
alternative label: Kroatia, maantiede, matkat (419.322)
alternative label: Dalmatien (419.322) @sv
alternative label: Dalmatien, geografi, resor (419.322) @sv
alternative label: Kroatien (419.322) @sv
alternative label: Kroatien, geografi, resor (419.322) @sv
broader: Entisen Jugoslavian alue
in scheme: URN:NBN:fi:au:hklj:
notation: 419.322
preferred label: Croatia @en
preferred label: Kroatien @sv
related: URN:NBN:fi:au:hklj:460
related: URN:NBN:fi:au:hklj:979
related: Entisen Jugoslavian alueen historia
related: Kroatian historia

Bosnia ja Hertsegovina
type: Class
type: Concept
subclass of: Entisen Jugoslavian alue
alternative label: Bosnia (419.323)
alternative label: Bosnia ja Hertsegovina (419.323)
alternative label: Bosnia ja Hertsegovina, maantiede, matkat (419.323)
alternative label: Bosnia, maantiede, matkat (419.323)
alternative label: Herzegovina (419.323)
alternative label: Herzegovina, maantiede, matkat (419.323)
alternative label: Bosnien (419.323) @sv
alternative label: Bosnien och Hercegovina (419.323) @sv
alternative label: Bosnien och Hercegovina, geografi, resor (419.323) @sv
alternative label: Bosnien, geografi, resor (419.323) @sv
alternative label: Hercegovina (419.323) @sv
alternative label: Hercegovina, geografi, resor (419.323) @sv
broader: Entisen Jugoslavian alue
in scheme: URN:NBN:fi:au:hklj:
notation: 419.323
preferred label: Bosnia-Herzegovina @en
preferred label: Bosnien och Hercegovina @sv
related: URN:NBN:fi:au:hklj:460
related: URN:NBN:fi:au:hklj:979
related: Entisen Jugoslavian alueen historia
related: Bosnian ja Hertsegovinan historia

Serbia
type: Class
type: Concept
subclass of: Entisen Jugoslavian alue
alternative label: Serbia (419.324)
alternative label: Serbia, maantiede, matkat (419.324)
alternative label: Vojvodina (419.324)
alternative label: Vojvodina, maantiede, matkat (419.324)
alternative label: Serbien (419.324) @sv
alternative label: Serbien, geografi, resor (419.324) @sv
alternative label: Vojvodina, geografi, resor (419.324) @sv
broader: Entisen Jugoslavian alue
in scheme: URN:NBN:fi:au:hklj:
notation: 419.324
preferred label: Serbien @sv
related: URN:NBN:fi:au:hklj:460
related: URN:NBN:fi:au:hklj:979
related: Entisen Jugoslavian alueen historia
related: Serbian historia
scope note: Vojvodina

Makedonia, EJTM
type: Class
type: Concept
subclass of: Entisen Jugoslavian alue
alternative label: Makedonia, EJTM (419.325)
alternative label: Makedonien, fd jugoslaviska republiken Makedonien (419.325) @sv
broader: Entisen Jugoslavian alue
in scheme: URN:NBN:fi:au:hklj:
notation: 419.325
preferred label: Macedonia (in the former Yugoslavia) @en
preferred label: Makedonien (i det tidigare Jugoslavien) @sv
related: URN:NBN:fi:au:hklj:460
related: URN:NBN:fi:au:hklj:979
related: Entisen Jugoslavian alueen historia
related: Makedonian historia

Montenegro
type: Class
type: Concept
subclass of: Entisen Jugoslavian alue
alternative label: Montenegro (419.326)
alternative label: Montenegro, maantiede, matkat (419.326)
alternative label: Montenegro, geografi, resor (419.326) @sv
broader: Entisen Jugoslavian alue
in scheme: URN:NBN:fi:au:hklj:
notation: 419.326
related: URN:NBN:fi:au:hklj:460
related: URN:NBN:fi:au:hklj:979
related: Entisen Jugoslavian alueen historia
related: Montenegron historia

Kosovo
type: Class
type: Concept
subclass of: Entisen Jugoslavian alue
alternative label: Kosovo (419.327)
alternative label: Kosovo, maantiede, matkat (419.327)
alternative label: Kosovo, geografi, resor (419.327) @sv
broader: Entisen Jugoslavian alue
in scheme: URN:NBN:fi:au:hklj:
notation: 419.327
related: URN:NBN:fi:au:hklj:460
related: URN:NBN:fi:au:hklj:979
related: Entisen Jugoslavian alueen historia
related: Kosovon historia

Keski-Aasia
type: Class
type: Concept
subclass of: AASIA
alternative label: Himalaja (424)
alternative label: Keski-Aasia (424)
alternative label: Keski-Aasia, maantiede, matkat (424)
alternative label: Mongolia (424)
alternative label: Mongolia, maantiede, matkat (424)
alternative label: Turkestan (424)
alternative label: Turkestan, maantiede, matkat (424)
alternative label: Centralasien (424) @sv
alternative label: Centralasien, geografi, resor (424) @sv
alternative label: Himalaya (424) @sv
alternative label: Mongolien (424) @sv
alternative label: Mongolien, geografi, resor (424) @sv
alternative label: Turkestan, geografi, resor (424) @sv
broader: AASIA
in scheme: URN:NBN:fi:au:hklj:
notation: 424
preferred label: Central Asia @en
preferred label: Centralasien @sv
related: Armenia. Azerbaidzan. Georgia. Kazakstan. Kirgisia. Tadzikistan. Turkmenistan. Uzbekistan
related: Kiina
related: Etelä-Aasia
related: Keski- ja Itä-Aasian historia
scope note: Keski-Aasian ja Himalajan aluetta koskevat yleisteokset Mongolia
scope note: Allmänna verk om Centralasien och Himalayaområdet Mongoliet @sv

Meksiko
type: Class
type: Concept
subclass of: AMERIKKA
alternative label: Meksiko (444)
alternative label: Meksiko, maantiede, matkat (444)
alternative label: Pohjois-Amerikka, Meksiko (444)
alternative label: Mexico (444) @sv
alternative label: Mexico, geografi, resor (444) @sv
alternative label: Nordamerika, Mexico (444) @sv
broader: AMERIKKA
in scheme: URN:NBN:fi:au:hklj:
notation: 444
preferred label: Mexico @en
related: Pohjois-Amerikka
related: Keski-Amerikka
related: Etelä-Amerikka
related: Keski-Amerikan historia

Karibianmeren saaret
type: Class
type: Concept
subclass of: AMERIKKA
alternative label: Alankomaiden Antillit (446)
alternative label: Alankomaiden Antillit, maantiede, matkat (446)
alternative label: Anguilla (446)
alternative label: Anguilla, maantiede, matkat (446)
alternative label: Antigua ja Barbuda (446)
alternative label: Antigua ja Barbuda, maantiede, matkat (446)
alternative label: Antillit (446)
alternative label: Antillit, maantiede, matkat (446)
alternative label: Aruba (446)
alternative label: Aruba, maantiede, matkat (446)
alternative label: Bahama (446)
alternative label: Bahama, maantiede, matkat (446)
alternative label: Barbados (446)
alternative label: Barbados, maantiede, matkat (446)
alternative label: Barbuda (446)
alternative label: Barbuda, maantiede, matkat (446)
alternative label: Bermuda (446)
alternative label: Bermuda, maantiede, matkat (446)
alternative label: Caicos (446)
alternative label: Caicos, maantiede, matkat (446)
alternative label: Caymansaaret (446)
alternative label: Caymansaaret, maantiede, matkat (446)
alternative label: Dominica (446)
alternative label: Dominica, maantiede, matkat (446)
alternative label: Dominikaaninen tasavalta (446)
alternative label: Dominikaaninen tasavalta, maantiede, matkat (446)
alternative label: Grenada (446)
alternative label: Grenada, maantiede, matkat (446)
alternative label: Grenadiinit (446)
alternative label: Grenadiinit, maantiede, matkat (446)
alternative label: Guadeloupe (446)
alternative label: Guadeloupe, maantiede, matkat (446)
alternative label: Haiti (446)
alternative label: Haiti, maantiede, matkat (446)
alternative label: Isot Antillit (446)
alternative label: Isot Antillit, maantiede, matkat (446)
alternative label: Jamaika (446)
alternative label: Jamaika, maantiede, matkat (446)
alternative label: Karibianmeren saaret (446)
alternative label: Karibianmeren saaret, maantiede, matkat (446)
alternative label: Kuuba (446)
alternative label: Kuuba, maantiede, matkat (446)
alternative label: Latinalainen Amerikka, Karibian meren saaret (446)
alternative label: Länsi-Intian saaristo (446)
alternative label: Länsi-Intian saaristo, maantiede, matkat (446)
alternative label: Martinique (446)
alternative label: Martinique, maantiede, matkat (446)
alternative label: Montserrat (446)
alternative label: Montserrat, maantiede, matkat (446)
alternative label: Neitsytsaaret (446)
alternative label: Neitsytsaaret, maantiede, matkat (446)
alternative label: Nevis (446)
alternative label: Nevis, maantiede, matkat (446)
alternative label: Pienet Antillit (446)
alternative label: Pienet Antillit, maantiede, matkat (446)
alternative label: Puerto Rico (446)
alternative label: Puerto Rico, maantiede, matkat (446)
alternative label: Saint Kitts-Nevis (446)
alternative label: Saint Kitts-Nevis, maantiede, matkat (446)
alternative label: Saint Lucia (446)
alternative label: Saint Lucia, maantiede, matkat (446)
alternative label: Saint Vincent ja Grenadiinit (446)
alternative label: Saint Vincent ja Grenadiinit, maantiede, matkat (446)
alternative label: Trinidad ja Tobago (446)
alternative label: Trinidad ja Tobago, maantiede, matkat (446)
alternative label: Turks ja Caicos (446)
alternative label: Turks ja Caicos, maantiede, matkat (446)
alternative label: Väli-Amerikka, Karibianmeren saaret (446)
broader: AMERIKKA
in scheme: URN:NBN:fi:au:hklj:
notation: 446
related: Yhdysvallat, USA
related: Keski-Amerikka
related: Etelä-Amerikka
related: Keski-Amerikan historia
scope note: Isot-Antillit. Pienet-Antillit Alankomaiden Antillit. Anguilla. Antigua ja Barbuda. Aruba. Bahama. Barbados. Bermuda. Caymansaaret. Dominica. Dominikaaninen tasavalta. Grenada. Guadeloupe. Haiti. Jamaika. Kuuba. Martinique. Montserrat. Neitsytsaaret. Puerto Rico. Saint Kitts ja Nevis. Saint Lucia. Saint Vincent ja Grenadiinit. Trinidad ja Tobago. Turks- ja Caicossaaret
scope note: Stora Antillerna. Små Antillerna Anguilla. Antigua och Barbuda. Aruba. Bahamaöarna. Barbados. Bermuda. Caymanöarna. Dominica. Dominikanska republiken. Grenada. Guadeloupe. Haiti. Jamaica. Jungfruöarna. Kuba. Martinique. Montserrat. Nederländska Antillerna. Puerto Rico. Saint Christopher och Nevis. Saint Lucia. Saint Vincent och Grenadinerna. Trinidad och Tobago. Turks- och Caicosöarna @sv

Havaiji
type: Class
type: Concept
subclass of: AUSTRALIA. OSEANIA. NAPAMAAT
alternative label: Etelämeren saaret (451 ... 456)
alternative label: Etelämeren saaret, maantiede, matkat (451 ... 456)
alternative label: Havaiji (453)
alternative label: Havaiji, maantiede, matkat (453)
alternative label: Tyynen meren saaret, Havaiji (453)
alternative label: Hawaii (453) @sv
alternative label: Hawaii, geografi, resor (453) @sv
alternative label: Stillahavsöar, Hawaii (453) @sv
alternative label: Söderhavsöar (451 ... 456) @sv
alternative label: Söderhavsöar, geografi, resor (451 ... 456) @sv
broader: AUSTRALIA. OSEANIA. NAPAMAAT
in scheme: URN:NBN:fi:au:hklj:
notation: 453
preferred label: Hawaii @en
related: Yhdysvallat, USA
related: New York
related: Tyynen meren saaret
related: URN:NBN:fi:au:hklj:989

Yleiset matkaoppaat
type: Class
type: Concept
subclass of: URN:NBN:fi:au:hklj:460
alternative label: Aamiaismajoitus, matkaoppaat (461)
alternative label: Ajoreitit, matkaoppaat (461)
alternative label: Asuntovaunumatkailu, oppaat (461)
alternative label: Automatkailu, matkaoppaat (461)
alternative label: Bed and breakfast, matkaoppaat (461)
alternative label: Camping, matkaoppaat (461)
alternative label: Camping-matkailu, matkaoppaat (461)
alternative label: Ekologinen matkailu, matkaoppaat (461)
alternative label: Ekomatkailu, matkaoppaat (461)
alternative label: Ekoturismi, matkaoppaat (461)
alternative label: Elämysmatkailu, matkaoppaat (461)
alternative label: Elämyspalvelut, matkaoppaat (461)
alternative label: Erikoisuudet, matkaoppaat (461)
alternative label: Extreme-matkailu, matkaoppaat (461)
alternative label: Harrastematkailu, matkaoppaat (461)
alternative label: Hiihtokeskukset, matkaoppaat (461)
alternative label: Hostellit, matkaoppaat (461)
alternative label: Huvipuistot, matkaoppaat (461)
alternative label: Hyvinvointimatkailu, matkaoppaaat (461)
alternative label: Interrailmatkailu, matkaoppaat (461)
alternative label: Jokiristeilyt, matkaoppaat (461)
alternative label: Junamatkailu, matkaoppaat (461)
alternative label: Kalastusmatkailu, matkaoppaat (461)
alternative label: Kannustematkailu, matkaoppaat (461)
alternative label: Kanoottiretkeily, melontareitit (461)
alternative label: Karavaanarit, matkaoppaat (461)
alternative label: Kaupungit, matkaoppaat (461)
alternative label: Kestikievarit, matkaoppaat (461)
alternative label: Kesäkodit, matkaoppaat (461)
alternative label: Kesäloma, matkaoppaat (461)
alternative label: Kesänvietto, matkaoppaat (461)
alternative label: Kiertokävelyt, matkaoppaat (461)
alternative label: Kokousmatkailu, matkaoppaat (461)
alternative label: Konferenssimatkailu, matkaoppaat (461)
alternative label: Kotiseutumatkailu, matkaoppaat (461)
alternative label: Kulttuurikohteet, matkaoppaat (461)
alternative label: Kulttuurimatkailu, matkaoppaat (461)
alternative label: Kuriositeetit, matkaoppaat (461)
alternative label: Kävelykierrokset, matkaoppaat (461)
alternative label: Kävelyreitit, patikointi, vaellusreitit (461 +)
alternative label: Laavut, retkeily, leirintämatkailu (461)
alternative label: Laivamatkailu, matkaoppaat (461)
alternative label: Laskettelukeskukset, matkaoppaat (461)
alternative label: Leirintä, matkaoppaat (461)
alternative label: Leirintäalueet, leirintämatkailuoppaat (461)
alternative label: Lentomatkailu, matkaoppaat (461)
alternative label: Lepokodit, matkaoppaat (461)
alternative label: Liftaus, matkaoppaat (461)
alternative label: Liikuntamatkailu, matkaoppaat (461)
alternative label: Lomailu, matkaoppaat (461)
alternative label: Lomakodit, matkaoppaat (461)
alternative label: Lomakylät, matkaoppaat (461)
alternative label: Lomamatkailu, matkaoppaat (461)
alternative label: Lomanvietto, matkaoppaat (461)
alternative label: Luontokohteet, matkaoppaat (461)
alternative label: Luontomatkailu, matkaoppaat (461)
alternative label: Maailmanperintökohteet, matkaoppaat (461)
alternative label: Maaseutumatkailu, matkaoppaat (461)
alternative label: Maatilamatkailu, matkaoppaat (461)
alternative label: Majatalot, matkaoppaat (461)
alternative label: Matka-aika, matkaoppaat (461)
alternative label: Matkailu, matkaoppaaat (461)
alternative label: Matkailualueet, matkaoppaat (461)
alternative label: Matkailukalastus, matkaoppaat (461)
alternative label: Matkailukeskukset, matkaoppaat (461)
alternative label: Matkailukohteet, matkaoppaat (461)
alternative label: Matkailunähtävyydet, matkaoppaat (461)
alternative label: Matkailureitit, matkaoppaat (461)
broader: URN:NBN:fi:au:hklj:460
in scheme: URN:NBN:fi:au:hklj:
notation: 461
related: Vesiliikenne
related: URN:NBN:fi:au:hklj:461.03
related: Hotelli- ja ravintolatalous
related: Retkeily. Ulkoilu. Vuorikiipeily. Suunnistus
scope note: Matkailijoille tarkoitetut yleiset tai useita maanosia koskevat matkaoppaat, leirintäalue-, hotelli-, motelli-, retkeilymaja-, nähtävyys- ja museo-oppaat Yleiset interrail-oppaat Muut matkaoppaat maanosan, maan, alueen tai paikkakunnan luokassa 410-459
scope note: Resehandböcker och guideböcker om campingområden, hotell, motell, vandrarhem, sevärdheter och museer av allmän karaktär eller som rör flera länder, avsedda för turister Allmänna interrailhandböcker Övriga resehandböcker förs enligt världsdel, land, region eller ort till klasserna 410-459 @sv

Suomen geologia
type: Class
type: Concept
subclass of: Fennoskandian geologia
alternative label: Geologia, Suomen geologia (495.1)
alternative label: Peruskallio, Suomen geologia (495.1)
alternative label: Suomi, geologia (495.1)
alternative label: Vaarat, Suomen geologia (495.1)
alternative label: Finland, geologi (495.1) @sv
alternative label: Geologi, Finlands geologi (495.1) @sv
alternative label: Skogbevuxna fjäll, Finlands geologi (495.1) @sv
alternative label: Urberg, Finlands geologi (495.1) @sv
broader: Fennoskandian geologia
in scheme: URN:NBN:fi:au:hklj:
notation: 495.1
preferred label: Finland's geology @en
preferred label: Finlands geologi @sv
related: Geomorfologia. Geodynamiikka
related: Mineralogia. Kristallografia. Petrologia
related: URN:NBN:fi:au:hklj:495.1084
related: Historiallinen geologia
scope note: Suomen geologian yleisteokset Suomen geologian erikoisaloja koskevat teokset alan mukaisessa luokassa
scope note: Allmänna verk om Finlands geologi Verk som rör specialområden inom Finlands geologi klassificeras enligt ämnesområde @sv

Historiallinen geologia
type: Class
type: Concept
subclass of: GEOLOGIA
alternative label: Aikakaudet, geologia (498)
alternative label: Ajoitus, geologia (498)
alternative label: Antroposeeni, kvartäärikausi, geologia (498)
alternative label: Arkeeinen kausi, geologia (498)
alternative label: C14-menetelmä, geologia (498)
alternative label: Geokronologia (498)
alternative label: Geologia, historiallinen geologia (498)
alternative label: Geologiset kaudet (498)
alternative label: Geologiset kerrostumat, stratigrafia (498)
alternative label: Geologiset muodostumat, geologia (498)
alternative label: Glasiologia, jääkaudet (498)
alternative label: Historiallinen geologia (498)
alternative label: Ikirouta, jääkaudet (498)
alternative label: Isotooppigeologia, iänmääritys (498)
alternative label: Iänmääritys, geologia (498)
alternative label: Jääkaudet (498)
alternative label: Jääkaudet, geologia (498)
alternative label: Jääkausigeologia (498)
alternative label: Jäätiköntutkimus, jääkaudet (498)
alternative label: Jäätiköt, jääkaudet (498)
alternative label: Kenotsooinen maailmankausi, geologia (498)
alternative label: Kerrostumat, geologia (498)
alternative label: Kivikehä, historiallinen geologia (498)
alternative label: Kronologia, geologia (498)
alternative label: Kvartäärigeologia (498)
alternative label: Kvartäärikausi, geologia (498)
alternative label: Litosfääri, historiallinen geologia (498)
alternative label: Maa, historiallinen geologia (498)
alternative label: Maa, planeetta, historiallinen geologia (498)
alternative label: Maailmankaudet, geologia (498)
alternative label: Maapallo, historiallinen geologia (498)
alternative label: Mesotsooinen maailmankausi, geologia (498)
alternative label: Neotsooinen maailmankausi, geologia (498)
alternative label: Paleomaantiede (498)
alternative label: Paleotsooinen maailmankausi, geologia (498)
alternative label: Prekambrinen maailmankausi, geologia (498)
alternative label: Proterotsooinen kausi, geologia (498)
alternative label: Radiohiiliajoitus, geologia (498)
alternative label: Sedimentit, geologiset aikakaudet (498)
alternative label: Stratigrafia, geologia (498)
alternative label: Tertiäärikausi, geologia (498)
alternative label: Antropocen, kvartärperioden, geologi (498) @sv
alternative label: Arkeiska eonen, geologi (498) @sv
alternative label: Avlagringar, geologi (498) @sv
alternative label: C14-metoden, geologi (498) @sv
alternative label: Datering, geologi (498) @sv
alternative label: Evig tjäle, istider (498) @sv
alternative label: Geokronologi (498) @sv
alternative label: Geologi, historisk geologi (498) @sv
alternative label: Geologiska avlagringar, stratigrafi (498) @sv
alternative label: Geologiska formationer, geologi (498) @sv
alternative label: Geologiska perioder (498) @sv
alternative label: Geologiska perioder, geologi (498) @sv
alternative label: Glaciologi, istider (498) @sv
alternative label: Glaciärer, istider (498) @sv
alternative label: Glaciärforskning, istider (498) @sv
alternative label: Historisk geologi (498) @sv
alternative label: Isotopgeologi, datering (498) @sv
alternative label: Istidens geologi (498) @sv
alternative label: Istider (498) @sv
alternative label: Istider, geologi (498) @sv
alternative label: Jorden, historisk geologi (498) @sv
alternative label: Jordklotet, historisk geologi (498) @sv
alternative label: Kenozoicum, geologi (498) @sv
alternative label: Kol-14-datering, geologi (498) @sv
alternative label: Kronologi, geologi (498) @sv
alternative label: Kvartärgeologi (498) @sv
alternative label: Kvartärperioden, geologi (498) @sv
broader: GEOLOGIA
in scheme: URN:NBN:fi:au:hklj:
notation: 498
related: Geomorfologia. Geodynamiikka
related: Fennoskandian geologia
related: Suomen geologia
related: Paleontologia
scope note: Geologiset aikakaudet. Jääkaudet yleensä. Paleogeografia. Stratigrafia Tässä myös Fennoskandian ja Suomen historiallinen geologia
scope note: Geologiska perioder. Istiderna i allmänhet. Paleogeografi. Stratigrafi Hit också Fennoskandiens och Finlands historiska geologi @sv

Kausijulkaisut
type: Class
type: Concept
subclass of: LUONNONTIETEET
broader: LUONNONTIETEET
in scheme: URN:NBN:fi:au:hklj:
notation: 505
preferred label: Serial publications @en
preferred label: Seriella publikationer @sv
scope note: Luontoa tai luonnontieteitä koskevat yleiset kausijulkaisut Eri luonnontieteen aloja koskevat kausijulkaisut alan mukaisessa luokassa
scope note: Allmänna seriella publikationer som handlar om naturen eller naturvetenskaperna Seriella publikationer som handlar om olika områden inom naturvetenskaperna klassificeras enligt område @sv

Todennäköisyyslaskenta
type: Class
type: Concept
subclass of: MATEMATIIKKA
alternative label: Ekstrapolointi (518)
alternative label: Epävarmuus, todennäköisyyslaskenta (518)
alternative label: Erikoisprosessit, todennäköisyyslaskenta (518)
alternative label: Estimointi, todennäköisyyslaskenta (518)
alternative label: Etsintäteoriat (518)
alternative label: Evoluutiolaskenta, matemaattinen optimointi (518)
alternative label: Hyötyteoria, matematiikka (518)
alternative label: Jonoteoria (518)
alternative label: Kombinatoriikka, todennäköisyyslaskenta (518)
alternative label: Laskentamallit, todennäköisyyslaskenta (518)
alternative label: Lineaarinen optimointi (518)
alternative label: Luotettavuusanalyysi, matematiikka (518)
alternative label: Mallinnus, matematiikka (518)
alternative label: Mallintaminen, matematiikka (518)
alternative label: Mallit, matematiikka (518)
alternative label: Malliteoria, matematiikka (518)
alternative label: Mallittaminen, matematiikka (518)
alternative label: Markovin ketjut (518)
alternative label: Matemaattinen optimointi (518)
alternative label: Matemaattiset mallit (518)
alternative label: Matematiikka, todennäköisyyslaskenta (518)
alternative label: Operaatioanalyysi, matematiikka (518)
alternative label: Optimointi, matematiikka (518)
alternative label: Peliteoria, matematiikka (518)
alternative label: Päätösteoria (518)
alternative label: Riskiteoria, matematiikka (518)
alternative label: Sattuma, todennäköisyyslaskenta (518)
alternative label: Satunnaisluvut (518)
alternative label: Stokastiset prosessit, matematiikka (518)
alternative label: Todennäköisyys, matematiikka (518)
alternative label: Todennäköisyyslaskenta (518)
alternative label: Varastoteoriat, matematiikka (518)
alternative label: Verkkoteoria (518)
alternative label: Virheanalyysi, matematiikka (518)
alternative label: Avbildning, matematik (518) @sv
alternative label: Beslutsteori (518) @sv
alternative label: Estimering, sannolikhetskalkyl (518) @sv
alternative label: Evolutionär beräkning, matematisk optimering (518) @sv
alternative label: Extrapolation (518) @sv
alternative label: Felanalys, matematik (518) @sv
alternative label: Kalkylmodeller, sannolikhetskalkyl (518) @sv
alternative label: Kombinatorik, sannolikhetskalkyl (518) @sv
alternative label: Köteori (518) @sv
alternative label: Lagerteorier, matematik (518) @sv
alternative label: Linjär optimering (518) @sv
alternative label: Markovkedjor (518) @sv
alternative label: Matematik, sannolikhetskalkyl (518) @sv
alternative label: Matematisk optimering (518) @sv
alternative label: Matematiska modeller (518) @sv
alternative label: Modeller, matematik (518) @sv
alternative label: Modellering, matematik (518) @sv
alternative label: Modellteori, matematik (518) @sv
alternative label: Nyttoteori, matematik (518) @sv
alternative label: Nätteori (518) @sv
alternative label: Operationsanalys, matematik (518) @sv
alternative label: Optimering, matematik (518) @sv
alternative label: Osäkerhet, sannolikhetskalkyl (518) @sv
alternative label: Riskteori, matematik (518) @sv
alternative label: Sannolikhet, matematik (518) @sv
alternative label: Sannolikhetskalkyl (518) @sv
alternative label: Slump, sannolikhetskalkyl (518) @sv
alternative label: Slumptal (518) @sv
alternative label: Specialprocesser, sannolikhetskalkyl (518) @sv
alternative label: Spelteori, matematik (518) @sv
alternative label: Stokastiska processer, matematik (518) @sv
alternative label: Sökteorier (518) @sv
alternative label: Tillförlitlighetsanalys, matematik (518) @sv
broader: MATEMATIIKKA
in scheme: URN:NBN:fi:au:hklj:
notation: 518
preferred label: Probability calculus @en
related: Logistiikka. Looginen kalkyyli
related: TILASTOTIEDE
related: Teoria. Tutkimusmenetelmät. Tilastomatematiikka
related: URN:NBN:fi:au:hklj:627.7
scope note: Todennäköisyysteoria. Stokastiset prosessit Markovin prosessit. Erikoisprosessit Matemaattiset hyöty-, luotettavuus-, varasto-, etsintä- ja päätöksentekoteoriat Matemaattinen optimointi. Matemaattinen simulointi. Peliteoria. Jonoteoria. Kombinatoriikka. Verkkoteoria
scope note: Sannolikhetsteori. Stokastiska processer Markovprocesser. Specialprocesser. Operationsanalys Matematisk nytto-, tillförlitlighets-, lager-, sök- och beslutsteori Matematisk optimering. Matematisk simulering. Spelteori. Köteori. Kombinatorik. Nätverksteori @sv

Suhteellisuusteoria
type: Class
type: Concept
subclass of: Yleinen ja teoreettinen fysiikka
alternative label: Suhteellisuus, suhteellisuusteoria (531.1)
alternative label: Suhteellisuusteoria (531.1)
alternative label: Relativitet, relativitetsteori (531.1) @sv
alternative label: Relativitetsteorin (531.1) @sv
broader: Yleinen ja teoreettinen fysiikka
in scheme: URN:NBN:fi:au:hklj:
notation: 531.1
preferred label: Relativity theory @en
preferred label: Relativitetsteorin @sv
related: Maailmankaikkeus. Kosmologia. Kosmogonia
related: Kvanttiteoria. Kvanttimekaniikka
related: Kokeellinen fysiikka
related: Teoreettinen kemia

Kvanttiteoria. Kvanttimekaniikka
type: Class
type: Concept
subclass of: Yleinen ja teoreettinen fysiikka
alternative label: Aaltomekaniikka (531.3)
alternative label: Fysiikka, kvanttifysiikka (531.3)
alternative label: Kvanttifysiikka (531.3)
alternative label: Kvanttikenttäteoria (531.3)
alternative label: Kvanttimekaniikka (531.3)
alternative label: Kvanttiteoria (531.3)
alternative label: Fysik, kvantfysik (531.3) @sv
alternative label: Kvantfysik (531.3) @sv
alternative label: Kvantfältteori (531.3) @sv
alternative label: Kvantmekanik (531.3) @sv
alternative label: Kvantteori (531.3) @sv
alternative label: Vågmekanik (531.3) @sv
broader: Yleinen ja teoreettinen fysiikka
in scheme: URN:NBN:fi:au:hklj:
notation: 531.3
preferred label: Quantum theory. Quantum mechanics @en
preferred label: Kvantteori. Kvantmekanik @sv
related: Maailmankaikkeus. Kosmologia. Kosmogonia
related: Suhteellisuusteoria
related: Kokeellinen fysiikka
related: Teoreettinen kemia

Mekaniikka
type: Class
type: Concept
subclass of: FYSIIKKA
alternative label: Absorptio, fysiikka (533)
alternative label: Adheesio, fysiikka (533)
alternative label: Adsorptio, fysiikka (533)
alternative label: Aerodynamiikka, fysiikka (533)
alternative label: Aeromekaniikka, fysiikka (533)
alternative label: Aerosolifysiikka (533)
alternative label: Aerostatiikka, fysiikka (533)
alternative label: Diffuusio, fysiikka (533)
alternative label: Dynamiikka, fysiikka (533)
alternative label: Elastisuus, fysiikka (533)
alternative label: Fysiikka, mekaniikka (533)
alternative label: Gravitaatio, mekaniikka (533)
alternative label: Heilurit, fysiikka (533)
alternative label: Hitaus, mekaniikka (533)
alternative label: Hitausvoima, fysiikka (533)
alternative label: Hydrauliikka, mekaniikka (533)
alternative label: Hydrodynamiikka, fysiikka (533)
alternative label: Hydromekaniikka, fysiikka (533)
alternative label: Hydrostatiikka, fysiikka (533)
alternative label: Hyrrät, mekaniikka (533)
alternative label: Höyry, mekaniikka (533)
alternative label: Joustavuus, fysiikka (533)
alternative label: Kaasujen fysiikka (533)
alternative label: Kaasut, mekaniikka (533)
alternative label: Kapillariteetti, fysiikka (533)
alternative label: Kavitaatio, hydrodynamiikka, fysiikka (533)
alternative label: Keskeisvoima (533)
alternative label: Keskipakoisvoima (533)
alternative label: Keskipakovoima (533)
alternative label: Kiihtyvyys, fysiikka (533)
alternative label: Kiinteiden kappaleiden mekaniikka (533)
alternative label: Kimmoisuus, fysiikka (533)
alternative label: Kinematiikka, fysiikka (533)
alternative label: Kinetiikka, fysiikka (533)
alternative label: Kitka, fysiikka (533)
alternative label: Koheesio, fysiikka (533)
alternative label: Kompressio, fysiikka (533)
alternative label: Liike, fysiikka (533)
alternative label: Liike-energia, mekaniikka (533)
alternative label: Liikeoppi, fysiikka (533)
alternative label: Liikeradat, liike, fysiikka (533)
alternative label: Liikkeet, kinematiikka, fysiikka (533)
alternative label: Liukkaus, kitka, fysiikka (533)
alternative label: Lujuusoppi, fysiikka (533)
alternative label: Massa, fysiikka (533)
alternative label: Massakeskipiste (533)
alternative label: Mekaaninen energia (533)
alternative label: Mekaaniset ominaisuudet, fysiikka (533)
alternative label: Mekaniikka, fysiikka (533)
alternative label: Mikromekaniikka, mekaniikka (533)
alternative label: Modulaarisuus, kimmo-oppi, fysiikka (533)
alternative label: Moduulit, kimmo-oppi, fysiikka (533)
alternative label: Murtolujuus, mekaniikka (533)
alternative label: Murtumismekaniikka (533)
alternative label: Nestefysiikka (533)
alternative label: Nesteiden mekaniikka (533)
alternative label: Newtonin lait, mekaniikka, fysiikka (533)
alternative label: Nopeus, mekaniikka (533)
alternative label: Ominaispaino, fysiikka (533)
alternative label: Osmoosi, fysiikka (533)
alternative label: Paine, fysiikka (533)
alternative label: Paino, fysiikka (533)
alternative label: Painopiste, fysiikka (533)
alternative label: Painovoima, mekaniikka (533)
alternative label: Pintailmiöt (533)
alternative label: Pintajännitys (533)
alternative label: Plasma, fysiikka (533)
alternative label: Plasmafysiikka (533)
broader: FYSIIKKA
in scheme: URN:NBN:fi:au:hklj:
notation: 533
related: Aseteknologia
related: Tekninen mekaniikka
related: Yleinen konetekniikka
related: Koneenrakennus. Pneumatiikka. Hydrauliikka
scope note: Kiinteiden ja jäykkien kappaleiden mekaniikka Nesteiden mekaniikka. Kaasujen mekaniikka. Plasmafysiikka Statiikka. Dynamiikka. Kinetiikka Painovoima. Heiluri. Kitka. Lujuus. Kimmoisuus. Plastisuus Hydrodynamiikka, -mekaniikka ja -statiikka Aerodynamiikka, -mekaniikka ja -statiikka Virtaus. Kapillariteetti. Osmoosi. Diffuusio
scope note: Fasta och styva kroppars mekanik Vätskors mekanik. Gasers mekanik. Plasmafysik Statik. Dynamik. Kinetik Tyngdkraft. Pendeln. Friktion. Hållfasthet. Elasticitet. Plasticitet Hydrodynamik, hydromekanik och hydrostatik Aerodynamik, aeromekanik och aerostatik Strömning. Kapillaritet. Osmos. Diffusion @sv

Kokeellinen kemia
type: Class
type: Concept
subclass of: KEMIA
alternative label: Indikaattorit, kokeellinen kemia (542)
alternative label: Kemia, kokeellinen kemia (542)
alternative label: Kokeellinen kemia (542)
alternative label: Kokeet, kemia (542)
alternative label: Laboratoriokokeet, kemia (542)
alternative label: Laboratoriot, kemia (542)
alternative label: Laboratoriotekniikka, kemia (542)
alternative label: Laboratoriotutkimus, kemia (542)
alternative label: Laboratoriotyöt, kemia (542)
alternative label: Laboratoriovälineet, kemia (542)
alternative label: Sentrifugointi, kokeellinen kemia (542)
alternative label: Suodatus, kemia (542)
alternative label: Titraus (542)
alternative label: Centrifugering, experimentell kemi (542) @sv
alternative label: Experimentell kemi (542) @sv
alternative label: Filtrering, kemi (542) @sv
alternative label: Indikatorer, experimentell kemi (542) @sv
alternative label: Kemi, experimentell kemi (542) @sv
alternative label: Laboratoriearbeten, kemi (542) @sv
alternative label: Laboratorieprov, kemi (542) @sv
alternative label: Laboratorier, kemi (542) @sv
alternative label: Laboratorieteknik, kemi (542) @sv
alternative label: Laboratorieundersökning, kemi (542) @sv
alternative label: Laboratorieutrustning, kemi (542) @sv
alternative label: Prov, kemi (542) @sv
alternative label: Titrering (542) @sv
broader: KEMIA
in scheme: URN:NBN:fi:au:hklj:
notation: 542
preferred label: Experimental chemistry @en
preferred label: Experimentell kemi @sv
related: Kemia harrasteena ja ajanvietteenä
related: Teoreettinen kemia
related: Sovellettu kemia
related: Optiset ja lääketieteelliset laitteet
scope note: Kokeellisen kemian yleisteokset Mittaukset, kojeet ja laboratoriotekniikka yleensä Tiettyyn kemian alaan liittyvät kokeet, mittaukset ja laboratoriotekniikka alan mukaisessa luokassa
scope note: Allmänna verk om experimentell kemi Mätningar, instrument och laboratorieteknik i allmänhet Prov, mätningar och laboratorieteknik som rör ett bestämt område inom kemi klassificeras enligt område @sv

Analyyttinen kemia
type: Class
type: Concept
subclass of: KEMIA
alternative label: Alkuaineanalyysi (543)
alternative label: Analyysi, kemia (543)
alternative label: Analyysilaitteet, kemia (543)
alternative label: Analyysimenetelmät, kemia (543)
alternative label: Analyyttinen kemia (543)
alternative label: Bioanalytiikka, analyyttinen kemia (543)
alternative label: Epäorgaaniset analyysit (543)
alternative label: Erotusmenetelmät, kemialliset analyysit (543)
alternative label: Fosfaattianalyysi (543)
alternative label: Gravimetria, kemiallinen analyysi (543)
alternative label: Indikaattorit, analyyttinen kemia (543)
alternative label: Kemia, analyyttinen kemia (543)
alternative label: Kemiallinen analyysi (543)
alternative label: Kemialliset analyysit (543)
alternative label: Kvalitatiivinen analyysi, kemia (543)
alternative label: Kvantitatiivinen analyysi, kemia (543)
alternative label: Lähi-infrapunaspektroskopia (543)
alternative label: Massaspektrografia (543)
alternative label: Mikroanalyysi (543)
alternative label: Mittaus, gravimetria (543)
alternative label: Mittaus, polarimetria (543)
alternative label: Mittaus, spektrometria (543)
alternative label: NMR-spektroskopia (543)
alternative label: Optiset analyysit (543)
alternative label: Orgaaniset analyysit (543)
alternative label: Polarimetria (543)
alternative label: Polarografia (543)
alternative label: Spektrianalyysi (543)
alternative label: Spektrografia (543)
alternative label: Spektrometria (543)
alternative label: Spektroskopia (543)
alternative label: Tislaus, kemiallinen analyysi (543)
alternative label: Vaahdotus, analyyttinen kemia (543)
alternative label: Vesianalyysi, kemia (543)
alternative label: Analys, kemi (543) @sv
alternative label: Analysapparatur, kemi (543) @sv
alternative label: Analysmetoder, kemi (543) @sv
alternative label: Analytisk kemi (543) @sv
alternative label: Bioanalytik, analytisk kemi (543) @sv
alternative label: Destillation, kemisk analys (543) @sv
alternative label: Elementaranalys (543) @sv
alternative label: Flotation, analytisk kemi (543) @sv
alternative label: Fosfatanalys (543) @sv
alternative label: Gravimetri, kemisk analys (543) @sv
alternative label: Indikatorer, analytisk kemi (543) @sv
alternative label: Kemi, analytisk kemi (543) @sv
alternative label: Kemisk analys (543) @sv
alternative label: Kemiska analyser (543) @sv
alternative label: Kvalitativ analys, kemi (543) @sv
alternative label: Kvantitativ analys, kemi (543) @sv
alternative label: Masspektrografi (543) @sv
alternative label: Mikroanalys (543) @sv
alternative label: Mätning, gravimetri (543) @sv
alternative label: Mätning, polarimetri (543) @sv
alternative label: Mätning, spektrometri (543) @sv
alternative label: NMR-spektroskopi (543) @sv
alternative label: Nära infraröd spektroskopi (543) @sv
alternative label: Oorganiska analyser (543) @sv
alternative label: Optiska analyser (543) @sv
alternative label: Organiska analyser (543) @sv
alternative label: Polarimetri (543) @sv
alternative label: Polarografi (543) @sv
alternative label: Separeringsmetoder, kemiska analyser (543) @sv
alternative label: Spektranalys (543) @sv
alternative label: Spektrografi (543) @sv
alternative label: Spektrometri (543) @sv
alternative label: Spektroskopi (543) @sv
alternative label: Vattenanalys, kemi (543) @sv
broader: KEMIA
in scheme: URN:NBN:fi:au:hklj:
notation: 543
related: Valo-oppi. Värioppi. Säteilyoppi
related: Epäorgaaninen kemia
related: Orgaaninen kemia. Muovien kemia
related: FYSIKAALINEN KEMIA
scope note: Kemialliset analyysit. Optiset analyysit. Orgaaniset ja epäorgaaniset analyysit. Kvalitatiiviset ja kvantitatiiviset analyysit Spektrometria. Spektroskopia. Spektrianalyysi
scope note: Kemiska analyser. Optiska analyser. Organiska och oorganiska analyser. Kvalitativa och kvantitativa analyser Spektrometri. Spektroskopi. Spektralanalys @sv

Kausijulkaisut
type: Class
type: Concept
subclass of: SOVELLETUT TIETEET
broader: SOVELLETUT TIETEET
in scheme: URN:NBN:fi:au:hklj:
notation: 605
preferred label: Serial publications @en
preferred label: Seriella publikationer @sv
scope note: Sovellettuja tieteitä koskevat yleiset kausijulkaisut Eri sovellettuja tieteitä koskevat kausijulkaisut alan mukaisessa luokassa
scope note: Allmänna seriella publikationer som handlar om tillämpad vetenskap Seriella publikationer som rör olika tillämpade vetenskaper klassificeras enligt område @sv

URN:NBN:fi:au:hklj:620.09
alternative label: Ikiliikkujat, keksintöjen historia (620.09)
alternative label: Innovaatiot, keksintöjen historia (620.09)
alternative label: Joukkotuotanto, teollisuuden historia (620.09)
alternative label: Keksinnöt, historia (620.09)
alternative label: Luddiitit, protestiliikkeet, teollinen vallankumous, historia (620.09)
alternative label: Massatuotanto, teollisuuden historia (620.09)
alternative label: Sarjatuotanto, teollisuuden historia (620.09)
alternative label: Tehdasrakennukset, teollisuus, historia (620.09)
alternative label: Tehdasteollisuus, historia (620.09)
alternative label: Tehdasyhdyskunnat, teollisuuden historia (620.09)
alternative label: Tehtaat, teollisuus, historia (620.09)
alternative label: Tekniikan historia (620.09)
alternative label: Teollinen vallankumous, historia (620.09)
alternative label: Teollistuminen, historia (620.09)
alternative label: Teollistumisen aikakausi, industrialismin historia (620.09)
alternative label: Teollisuuden historia (620.09)
alternative label: Teollisuusarkeologia, teollisuuden historia (620.09)
alternative label: Teollisuusrakennukset, teollisuus, historia (620.09)
alternative label: Teollisuusyhdyskunnat, teollisuuden historia (620.09)
alternative label: Tuotantorakennukset, teollisuus, historia (620.09)
alternative label: Työsuhdekeksinnöt, keksinnöt, historia (620.09)
alternative label: Arbetstagares uppfinningar, uppfinningar, historia (620.09) @sv
alternative label: Ekonomibyggnader, industri, historia (620.09) @sv
alternative label: Fabriker, industri, historia (620.09) @sv
alternative label: Fabriksbyggnader, industri, historia (620.09) @sv
alternative label: Fabriksindustri, historia (620.09) @sv
alternative label: Fabrikssamhällen, industrins historia (620.09) @sv
alternative label: Industrialisering, historia (620.09) @sv
alternative label: Industrialiseringens tidevarv, industrialismens historia (620.09) @sv
alternative label: Industriarkeologi, industrins historia (620.09) @sv
alternative label: Industribyggnader, industri, historia (620.09) @sv
alternative label: Industriella revolutionen, historia (620.09) @sv
alternative label: Industrins historia (620.09) @sv
alternative label: Industrisamhällen, industrins historia (620.09) @sv
alternative label: Innovationer, uppfinningarnas historia (620.09) @sv
alternative label: Ludditer, proteströrelser, industriella revolutionen, historia (620.09) @sv
alternative label: Massproduktion, industrins historia (620.09) @sv
alternative label: Perpetuum mobile, uppfinningarnas historia (620.09) @sv
alternative label: Serieproduktion, industrins historia (620.09) @sv
alternative label: Teknikens historia (620.09) @sv
alternative label: Tillverkningsindustri, historia (620.09) @sv
alternative label: Uppfinningar, historia (620.09) @sv
related: Talousmaantiede. Taloushistoria
related: Sovellettujen tieteiden historia
related: URN:NBN:fi:au:hklj:620
related: Tuotekehittely. Innovaatiot. Keksinnöt. Patentit
related: METALLITEOLLISUUS. PUUNJALOSTUSTEOLLISUUSSÄHKÖTEKNINEN TEOLLISUUS TEKSTIILI- JA NAHKATEOLLISUUS
related: KEMIAN TEOLLISUUS. KAIVOSTEOLLISUUS

Renessanssin arkkitehtuuri
type: Class
type: Concept
subclass of: URN:NBN:fi:au:hklj:720.9
alternative label: Arkkitehdit, elämäkerralliset hakuteokset (720.903 ... 720.9903)
alternative label: Klassismi, arkkitehtuuri, renessanssi. (720.905)
alternative label: Manierismi, arkkitehtuuri (720.905)
alternative label: Renessanssi, arkkitehtuuri (720.905)
alternative label: Täysrenessanssi, arkkitehtuuri (720.905)
alternative label: Varhaisrenessanssi, arkkitehtuuri (720.905)
alternative label: Arkitekter, biografiska uppslagsverk (720.903 ... 720.9903) @sv
alternative label: Högrenässansen, arkitektur (720.905) @sv
alternative label: Klassicism, arkitektur, renässans (720.905) @sv
alternative label: Manierism, arkitektur (720.905) @sv
alternative label: Renässans, arkitektur (720.905) @sv
alternative label: Ungrenässansen, arkitektur (720.905) @sv
broader: URN:NBN:fi:au:hklj:720.9
in scheme: URN:NBN:fi:au:hklj:
notation: 720.905
preferred label: Renaissance architecture @en
preferred label: Renässansens arkitektur @sv
related: URN:NBN:fi:au:hklj:709
related: Renessanssin taidehistoria
related: Arkkitehtuurikilpailut. Arkkitehtuurinäyttelyt. Arkkitehtuuripalkinnot
related: URN:NBN:fi:au:hklj:749.1
scope note: Euroopan renessanssin arkkitehtuuri yleensä Renessanssin arkkitehtuurin erikoisaloja koskevat teokset alan mukaisessa luokassa Tietyn maan renessanssin arkkitehtuuria tai arkkitehteja koskevat teokset maan mukaisessa luokassa
scope note: Europeisk renässansarkitektur i allmänhet Verk som handlar om specialområden inom renässansens arkitektur klassificeras enligt område Verk som handlar om renässansens arkitektur eller arkitekter i ett bestämt land klassificeras enligt land @sv

Nykyajan arkkitehtuuri
type: Class
type: Concept
subclass of: URN:NBN:fi:au:hklj:720.9
alternative label: Arkkitehdit, elämäkerralliset hakuteokset (720.903 ... 720.9903)
alternative label: Avant-garde, arkkitehtuuri (720.907)
alternative label: Avantgarde, arkkitehtuuri (720.907)
alternative label: Avantgardismi, arkkitehtuuri (720.907)
alternative label: Funktionalismi, arkkitehtuuri (720.907)
alternative label: Moderni taide, arkkitehtuuri (720.907)
alternative label: Modernismi, arkkitehtuuri (720.907)
alternative label: Nykytaide, arkkitehtuuri (720.907)
alternative label: Sosialistinen realismi, arkkitehtuuri (720.907)
alternative label: Uudenaikaisuus, arkkitehtuuri (720.907)
alternative label: Uusasiallisuus, arkkitehtuuri (720.907)
alternative label: Arkitekter, biografiska uppslagsverk (720.903 ... 720.9903) @sv
alternative label: Avantgarde, arkitektur (720.907) @sv
alternative label: Avantgardism, arkitektur (720.907) @sv
alternative label: Funktionalism, arkitektur (720.907) @sv
alternative label: Modern konst, arkitektur (720.907) @sv
alternative label: Modernism, arkitektur (720.907) @sv
alternative label: Modernitet, arkitektur (720.907) @sv
alternative label: Nutidskonst, arkitektur (720.907) @sv
alternative label: Nysaklighet, arkitektur (720.907) @sv
alternative label: Socialistisk realism, arkitektur (720.907) @sv
broader: URN:NBN:fi:au:hklj:720.9
in scheme: URN:NBN:fi:au:hklj:
notation: 720.907
preferred label: Contemporary architecture @en
preferred label: Nutida arkitektur @sv
related: URN:NBN:fi:au:hklj:709
related: Nykyajan taidehistoria
related: Arkkitehtuurikilpailut. Arkkitehtuurinäyttelyt. Arkkitehtuuripalkinnot
related: URN:NBN:fi:au:hklj:749.1
scope note: Euroopan nykyajan arkkitehtuuri yleensä - funktionalismista alkaen Tässä myös Euroopan ulkopuolinen länsimainen nykyajan arkkitehtuuri yleensä Funktionalismin, modernismin ja postmodernismin arkkitehtuuri yleensä Nykyajan arkkitehtuurin erikoisaloja koskevat teokset alan mukaisessa luokassa Tietyn maan nykyajan arkkitehtuuria tai arkkitehteja koskevat teokset maan mukaisessa luokassa
scope note: Europeisk nutidsarkitektur i allmänhet - med början i funktionalismen Hit också utomeuropeisk västerländsk nutidsarkitektur i allmänhet funktionalistisk, modernistisk och postmodernistisk arkitektur i allmänhet Verk som handlar om specialområden inom nutida arkitektur klassificeras enligt område Verk som handlar om nutida arkitektur eller arkitekter i ett bestämt land klassificeras enligt land @sv

Suomi
type: Class
type: Concept
subclass of: Pohjoismaat. Baltian maat
alternative label: Arkkitehtuuri, henkilöhistoria, Suomi (720.921)
alternative label: Arkkitehtuuri, historia, Suomi (720.921)
alternative label: Karelianismi, arkkitehtuuri (720.921)
alternative label: Rakennustaide, historia, Suomi (720.921)
alternative label: Suomi, arkkitehtuuri (720.921)
alternative label: Arkitektur, historia, Finland (720.921) @sv
alternative label: Arkitektur, personhistoria, Finland (720.921) @sv
alternative label: Byggnadskonst, historia, Finland (720.921) @sv
alternative label: Finland, arkitektur (720.921) @sv
alternative label: Karelianism, arkitektur (720.921) @sv
broader: Pohjoismaat. Baltian maat
in scheme: URN:NBN:fi:au:hklj:
notation: 720.921
preferred label: Finland @en
related: URN:NBN:fi:au:hklj:709
related: Suomen yleinen taidehistoria
related: Arkkitehtuurikilpailut. Arkkitehtuurinäyttelyt. Arkkitehtuuripalkinnot
related: URN:NBN:fi:au:hklj:749.1

Ranska
type: Class
type: Concept
subclass of: Länsi- ja Keski-Eurooppa
alternative label: Ranska, arkkitehtuuri (720.933)
alternative label: Frankrike, arkitektur (720.933) @sv
broader: Länsi- ja Keski-Eurooppa
in scheme: URN:NBN:fi:au:hklj:
notation: 720.933
preferred label: France @en
preferred label: Frankrike @sv
related: URN:NBN:fi:au:hklj:709
related: Arkkitehtuurikilpailut. Arkkitehtuurinäyttelyt. Arkkitehtuuripalkinnot
related: URN:NBN:fi:au:hklj:749.1
scope note: Tässä myös Andorra ja Monaco
scope note: Hit också Andorra och Monaco @sv

Italia
type: Class
type: Concept
subclass of: Etelä-Eurooppa
alternative label: Italia, arkkitehtuuri (720.941)
alternative label: Italien, arkitektur (720.941) @sv
broader: Etelä-Eurooppa
in scheme: URN:NBN:fi:au:hklj:
notation: 720.941
preferred label: Italy @en
preferred label: Italien @sv
related: URN:NBN:fi:au:hklj:709
related: Arkkitehtuurikilpailut. Arkkitehtuurinäyttelyt. Arkkitehtuuripalkinnot
related: Vanhan ajan arkkitehtuuri. Euroopan ulkopuolisten vanhojen kulttuurien arkkitehtuuri
related: URN:NBN:fi:au:hklj:749.1
scope note: Tässä myös San Marino ja Vatikaanivaltio
scope note: Hit också San Marino och Vatikanstaten @sv

Yhdysvallat
type: Class
type: Concept
subclass of: Amerikka
alternative label: USA, arkkitehtuuri (720.981)
alternative label: Yhdysvallat, arkkitehtuuri (720.981)
alternative label: Förenta staterna, arkitektur (720.981) @sv
alternative label: USA, arkitektur (720.981) @sv
broader: Amerikka
in scheme: URN:NBN:fi:au:hklj:
notation: 720.981
preferred label: United States of America @en
preferred label: Förenta Staterna @sv
related: URN:NBN:fi:au:hklj:709
related: Arkkitehtuurikilpailut. Arkkitehtuurinäyttelyt. Arkkitehtuuripalkinnot
related: Alkuperäiskansojen arkkitehtuuri
related: URN:NBN:fi:au:hklj:749.1

Australia. Oseania
type: Class
type: Concept
subclass of: URN:NBN:fi:au:hklj:720.9
alternative label: Aboriginaalit, Australia, arkkitehtuuri (720.99)
alternative label: Australia, arkkitehtuuri (720.99)
alternative label: Oseania, arkkitehtuuri, moderni (720.99)
alternative label: Aboriginer, Australien, arkitektur (720.99) @sv
alternative label: Australien, arkitektur (720.99) @sv
alternative label: Oceanien, arkitektur, modern (720.99) @sv
broader: URN:NBN:fi:au:hklj:720.9
in scheme: URN:NBN:fi:au:hklj:
notation: 720.99
preferred label: Australia. Oceania @en
preferred label: Australien. Oceanien @sv
related: URN:NBN:fi:au:hklj:709
related: Arkkitehtuurikilpailut. Arkkitehtuurinäyttelyt. Arkkitehtuuripalkinnot
related: Alkuperäiskansojen arkkitehtuuri
related: URN:NBN:fi:au:hklj:749.1
scope note: Australian ja Oseanian nykyarkkitehtuuri
scope note: Australiens och Oceaniens nutidsarkitektur @sv

Linnat. Linnoitukset. Palatsit. Kartanot
type: Class
type: Concept
subclass of: URN:NBN:fi:au:hklj:726
alternative label: Bunkkerit, arkkitehtuuri (726.2)
alternative label: Hallintorakennukset, arkkitehtuuri (726.2)
alternative label: Kartanot, arkkitehtuuri (726.2)
alternative label: Kenttälinnoitukset, arkkitehtuuri (726.2)
alternative label: Korppoonkartano, arkkitehtuuri (726.2)
alternative label: Kosken kartano, arkkitehtuuri (726.2)
alternative label: Kuistit, arkkitehtuuri, linnat, kartanot (726.2)
alternative label: Kyyhkylän kartano, arkkitehtuuri (726.2)
alternative label: Linnat, arkkitehtuuri (726.2)
alternative label: Linnoitukset, arkkitehtuuri (726.2)
alternative label: Myttäälän kartano, arkkitehtuuri (726.2)
alternative label: Palatsit, arkkitehtuuri (726.2)
alternative label: Selkeen kartano, arkkitehtuuri (726.2)
alternative label: Skarhultin linna, arkkitehtuuri (726.2)
alternative label: Strömman kartano, arkkitehtuuri (726.2)
alternative label: Terassit, arkkitehtuuri, linnat, kartanot (726.2)
alternative label: Tertin kartano, arkkitehtuuri (726.2)
alternative label: Verannat, arkkitehtuuri, linnat, kartanot (726.2)
alternative label: Vilpolat, arkkitehtuuri, linnat, kartanot (726.2)
alternative label: Voiniemen hovi, kartanot, arkkitehtuuri (726.2)
alternative label: Bunkrar, arkitektur (726.2) @sv
alternative label: Farstukvistar, arkitektur, slott, herrgårdar (726.2) @sv
alternative label: Farstur, arkitektur, slott, herrgårdar (726.2) @sv
alternative label: Fältbefästningar, arkitektur (726.2) @sv
alternative label: Fästningar, arkitektur (726.2) @sv
alternative label: Förvaltningsbyggnader, arkitektur (726.2) @sv
alternative label: Herrgårdar, arkitektur (726.2) @sv
alternative label: Korpo gård, arkitektur (726.2) @sv
alternative label: Koskis gård, arkitektur (726.2) @sv
alternative label: Kyyhkylä gård, arkitektur (726.2) @sv
alternative label: Myttäälä herrgård, arkitektur (726.2) @sv
alternative label: Palats, arkitektur (726.2) @sv
alternative label: Selkeen kartano, arkitektur (726.2) @sv
alternative label: Skarhults slott, arkitektur (726.2) @sv
alternative label: Slott, arkitektur (726.2) @sv
alternative label: Strömma gård, arkitektur (726.2) @sv
alternative label: Terrasser, arkitektur, slott, herrgårdar (726.2) @sv
alternative label: Tertin kartano, arkitektur (726.2) @sv
alternative label: Verandor, arkitektur, slott, herrgårdar (726.2) @sv
alternative label: Voiniemen hovi, herrgårdar, arkitektur (726.2) @sv
broader: URN:NBN:fi:au:hklj:726
in scheme: URN:NBN:fi:au:hklj:
notation: 726.2
preferred label: Castles. Forts. Palaces. Mansions @en
preferred label: Slott. Fästningar. Palats. Herrgårdar @sv
related: Arkkitehtuurin teoria, estetiikka ja filosofia
related: Arkkitehtuurikilpailut. Arkkitehtuurinäyttelyt. Arkkitehtuuripalkinnot
related: URN:NBN:fi:au:hklj:720.9
related: Asuinrakennukset
scope note: Maasta tai aikakaudesta riippumatta linnoja, linnoituksia, palatseja ja kartanoita koskeva arkkitehtuuri Jos teoksessa on sekä arkkitehtuuria että historiaa tai kulttuurihistoriaa, on etusija historian luokilla
scope note: Hit slotts-, fästnings-, palats- och herrgårdsarkitektur oavsett land och tidsperiod Om verket handlar om såväl arkitektur som historia eller kulturhistoria ges företräde åt klassen för historia @sv

Saksa
type: Class
type: Concept
subclass of: Länsi- ja Keski-Eurooppa
alternative label: Saksa, kuvanveisto (730.931)
alternative label: Tyskland, skulptur (730.931) @sv
broader: Länsi- ja Keski-Eurooppa
in scheme: URN:NBN:fi:au:hklj:
notation: 730.931
preferred label: Germany @en
preferred label: Tyskland @sv
related: URN:NBN:fi:au:hklj:709
related: Kuvanveistotaiteen materiaalit ja tekniikka
related: URN:NBN:fi:au:hklj:739
related: URN:NBN:fi:au:hklj:742

Brittein saaret
type: Class
type: Concept
subclass of: Länsi- ja Keski-Eurooppa
alternative label: Britannia, kuvanveisto (730.934)
alternative label: Eire, kuvanveisto (730.934)
alternative label: Englanti, kuvanveisto (730.934)
alternative label: Irlanti, kuvanveisto (730.934)
alternative label: Iso-Britannia, kuvanveisto (730.934)
alternative label: Yhdistynyt kuningaskunta, kuvanveisto (730.934)
alternative label: Britannien, skulptur (730.934) @sv
alternative label: Eire, skulptur (730.934) @sv
alternative label: England, skulptur (730.934) @sv
alternative label: Förenade konungariket, skulptur (730.934) @sv
alternative label: Irland, skulptur (730.934) @sv
alternative label: Storbritannien, skulptur (730.934) @sv
broader: Länsi- ja Keski-Eurooppa
in scheme: URN:NBN:fi:au:hklj:
notation: 730.934
preferred label: British Isles @en
preferred label: Brittiska öarna @sv
related: URN:NBN:fi:au:hklj:709
related: Kuvanveistotaiteen materiaalit ja tekniikka
related: URN:NBN:fi:au:hklj:739
related: URN:NBN:fi:au:hklj:742
scope note: Iso-Britannia. Irlanti
scope note: Storbritannien. Irland @sv

Espanja
type: Class
type: Concept
subclass of: Etelä-Eurooppa
alternative label: Espanja, kuvanveisto (730.942)
alternative label: Spanien, skulptur (730.942) @sv
broader: Etelä-Eurooppa
in scheme: URN:NBN:fi:au:hklj:
notation: 730.942
preferred label: Spain @en
preferred label: Spanien @sv
related: URN:NBN:fi:au:hklj:709
related: Kuvanveistotaiteen materiaalit ja tekniikka
related: URN:NBN:fi:au:hklj:739
related: URN:NBN:fi:au:hklj:742
scope note: Tässä myös Gibraltar
scope note: Hit också Gibraltar @sv

Venäjä
type: Class
type: Concept
subclass of: Itä-Eurooppa
alternative label: Venäjä, kuvanveisto (730.951)
alternative label: Ryssland, skulptur (730.951) @sv
broader: Itä-Eurooppa
in scheme: URN:NBN:fi:au:hklj:
notation: 730.951
preferred label: Russia @en
preferred label: Ryssland @sv
related: URN:NBN:fi:au:hklj:709
related: Kuvanveistotaiteen materiaalit ja tekniikka
related: URN:NBN:fi:au:hklj:739
related: URN:NBN:fi:au:hklj:742
scope note: Tässä myös Venäjän Aasian puoleiset alueet
scope note: Hit också de asiatiska områdena av Ryssland @sv

Musiikin sosiologia. Musiikkipolitiikka
type: Class
type: Concept
subclass of: Musiikin filosofia, estetiikka, psykologia ja sosiologia Musiikkikasvatus. Musiikkiopetus
alternative label: Amatöörimuusikot, musiikin sosiologia (781.4)
alternative label: Esittäminen, musiikkisosiologia (781.4)
alternative label: Harrastemusiikki, musiikin sosiologia (781.4)
alternative label: Hausmusik, musiikin sosiologia (781.4)
alternative label: Katsojat, musiikin sosiologia (781.4)
alternative label: Katumusiikki, musiikin sosiologia (781.4)
alternative label: Kiertueet, musiikin sosiologia (781.4)
alternative label: Kotimusiikki, musiikin sosiologia (781.4)
alternative label: Kuulijat, musiikin sosiologia (781.4)
alternative label: Kuunteleminen, musiikin sosiologia (781.4)
alternative label: Kuuntelijatutkimukset, musiikin sosiologia (781.4)
alternative label: Kuuntelutottumukset, musiikin sosiologia (781.4)
alternative label: Kävijät, musiikin sosiologia (781.4)
alternative label: Kävijätutkimukset, musiikin sosiologia (781.4)
alternative label: Käyttömusiikki, musiikin sosiologia (781.4)
alternative label: Musiikin sosiologia (781.4)
alternative label: Musiikkikulttuuri, musiikin sosiologia (781.4)
alternative label: Musiikkikulttuuri, musiikkipolitiikka (781.4)
alternative label: Musiikkipolitiikka (781.4)
alternative label: Musiikkisosiologia (781.4)
alternative label: Plagiaatit, musiikki (781.4)
alternative label: Plagiointi, musiikki (781.4)
alternative label: Taiteilijakodit, musiikkipolitiikka (781.4)
alternative label: Taiteilijatalot, musiikkipolitiikka (781.4)
alternative label: Amatörmusik, musikens sociologi (781.4) @sv
alternative label: Amatörmusiker, musikens sociologi (781.4) @sv
alternative label: Besökare, musikens sociologi (781.4) @sv
alternative label: Besökarundersökningar, musikens sociologi (781.4) @sv
alternative label: Bruksmusik, musikens sociologi (781.4) @sv
alternative label: Framförande, musiksociologi (781.4) @sv
alternative label: Gatumusik, musikens sociologi (781.4) @sv
alternative label: Hausmusik, musikens sociologi (781.4) @sv
alternative label: Hemmamusik, musikens sociologi (781.4) @sv
alternative label: Konstnärshem, musikpolitik (781.4) @sv
alternative label: Konstnärshus, musikpolitik (781.4) @sv
alternative label: Lyssnande, musikens sociologi (781.4) @sv
alternative label: Lyssnare, musikens sociologi (781.4) @sv
alternative label: Lyssnarundersökningar, musikens sociologi (781.4) @sv
alternative label: Lyssnarvanor, musikens sociologi (781.4) @sv
alternative label: Musikens sociologi (781.4) @sv
alternative label: Musikkultur, musikens sociologi (781.4) @sv
alternative label: Musikkultur, musikpolitik (781.4) @sv
alternative label: Musikpolitik (781.4) @sv
alternative label: Musiksociologi (781.4) @sv
alternative label: Plagiat, musik (781.4) @sv
alternative label: Plagiering, musik (781.4) @sv
alternative label: Turnéer, musikens sociologi (781.4) @sv
alternative label: Åskådare, musikens sociologi (781.4) @sv
broader: Musiikin filosofia, estetiikka, psykologia ja sosiologia Musiikkikasvatus. Musiikkiopetus
in scheme: URN:NBN:fi:au:hklj:
notation: 781.4
preferred label: Sociology of music. Music policy @en
preferred label: Musiksociologi. Musikpolitik @sv
related: Taiteen estetiikka. Taidefilosofia. Taidepsykologia. Taidesosiologia. Taidepolitiikka
related: Musiikin psykologia. Musiikin akustiikka
related: Musiikin teoria
scope note: Musiikin sosiologia ja musiikkipolitiikka yleensä Muusikon ammatti yleensä. Muusikon asema yhteiskunnassa yleensä Musiikin rahoitus yleensä. Musiikkiapurahat yleensä Tiettyyn musiikin erikoisalaan liittyvä musiikkisosiologia ja -politiikka alan mukaisessa luokassa
scope note: Musiksociologi och musikpolitik i allmänhet Musikerns yrke i allmänhet. Musikerns ställning i samhället i allmänhet Finansiering av musik i allmänhet. Musikstipendier i allmänhet Musiksociologi och musikpolitik som rör ett bestämt specialområde inom musiken klassificeras enligt område @sv

Notaatio
type: Class
type: Concept
subclass of: Musiikin teoria
alternative label: Mensuraalimusiikki, nuottikirjoitus (782.9)
alternative label: Neumikirjoitus (782.9)
alternative label: Neumit (782.9)
alternative label: Notaatio (782.9)
alternative label: Nuotinluku (782.9)
alternative label: Nuotit, notaatio (782.9)
alternative label: Nuottikirjoitus (782.9)
alternative label: Tabulatuurinotaatiot (782.9)
alternative label: Mensuralmusik, notskrift (782.9) @sv
alternative label: Neumer (782.9) @sv
alternative label: Neumskrift (782.9) @sv
alternative label: Notation (782.9) @sv
alternative label: Noter, notation (782.9) @sv
alternative label: Notläsning (782.9) @sv
alternative label: Notskrift (782.9) @sv
alternative label: Tabulaturer (782.9) @sv
broader: Musiikin teoria
in scheme: URN:NBN:fi:au:hklj:
notation: 782.9
preferred label: Notation @en
related: Kirjoitus. Kirjoitustaito
related: Kirjoituksen historia. Paleografia. Epigrafia
related: Musiikin filosofia, estetiikka, psykologia ja sosiologia Musiikkikasvatus. Musiikkiopetus
related: Musiikin estetiikka ja filosofia
scope note: Notaatio musiikin lajista riippumatta Nuottikirjoitus. Nuottikirjoituksen tyylit ja historia Nuottikirjoitusta koskeva paleografia
scope note: Notation oavsett musikslag Notskrift. Notskriftens stilar och historia Paleografi inom notskrift @sv

Puhallinorkesterit
type: Class
type: Concept
subclass of: URN:NBN:fi:au:hklj:785
alternative label: Brass bandit (785.3)
alternative label: Fanfaarit, puhallinorkesterit (785.3)
alternative label: Orkesterimusiikki, puhallinorkesterit (785.3)
alternative label: Orkesterit, puhallinorkesterit (785.3)
alternative label: Puhallinorkesterit (785.3)
alternative label: Soittokunnat, puhallinorkesterit (785.3)
alternative label: Blåsorkestrar (785.3) @sv
alternative label: Brass band (785.3) @sv
alternative label: Fanfarer, blåsorkestrar (785.3) @sv
alternative label: Musikkårer, blåsorkestrar (785.3) @sv
alternative label: Orkestermusik, blåsorkestrar (785.3) @sv
alternative label: Orkestrar, blåsorkestrar (785.3) @sv
broader: URN:NBN:fi:au:hklj:785
in scheme: URN:NBN:fi:au:hklj:
notation: 785.3
preferred label: Wind orchestras @en
preferred label: Blåsorkestrar @sv
related: Kamariorkesterit (yli 9, yleensä alle 25 soittajaa)
related: URN:NBN:fi:au:hklj:787.34
related: URN:NBN:fi:au:hklj:789

Konsertot muille kosketinsoittimille
type: Class
type: Concept
subclass of: Konsertot yhdelle kosketinsoittimelle
broader: Konsertot yhdelle kosketinsoittimelle
in scheme: URN:NBN:fi:au:hklj:
notation: 785.6249
preferred label: Concerti for other keyboard instruments @en
preferred label: Konserter för andra klaviaturinstrument @sv
related: URN:NBN:fi:au:hklj:785.4
related: URN:NBN:fi:au:hklj:786
related: URN:NBN:fi:au:hklj:789

Taikatemput
type: Class
type: Concept
subclass of: URN:NBN:fi:au:hklj:798
alternative label: Korttitemput (798.3)
alternative label: Taiat, taikatemput (798.3)
alternative label: Taikatemput (798.3)
alternative label: Taikuriohjeet (798.3)
alternative label: Taikurit, taikuriesitykset (798.3)
alternative label: Taikurit, taikuriohjeet (798.3)
alternative label: Kortkonster (798.3) @sv
alternative label: Trollerier, trollkonster (798.3) @sv
alternative label: Trollerihandböcker (798.3) @sv
alternative label: Trollkonster (798.3) @sv
alternative label: Trollkonstnärer, trolleriföreställningar (798.3) @sv
alternative label: Trollkonstnärer, trollerihandböcker (798.3) @sv
broader: URN:NBN:fi:au:hklj:798
in scheme: URN:NBN:fi:au:hklj:
notation: 798.3
preferred label: Conjuring @en
preferred label: Trollkonster @sv
related: Leikit
related: Korttipelit. Pasianssit
related: URN:NBN:fi:au:hklj:798.309
related: Sirkus. Huvipuistot. Varietee
scope note: Taikatemppuohjeet. Taikurivälineet. Korttitemput
scope note: Handböcker i trollkonster. Utrustning för trollkonstnärer. Kortkonster @sv

Kausijulkaisut
type: Class
type: Concept
subclass of: URN:NBN:fi:au:hklj:800
alternative label: Kirjallisuuslehdet (800.05)
alternative label: Litteraturtidskrifter (800.05) @sv
broader: URN:NBN:fi:au:hklj:800
in scheme: URN:NBN:fi:au:hklj:
notation: 800.05
preferred label: Journals. Serial publications @en
preferred label: Tidskrifter. Seriella publikationer @sv
scope note: Yleiset kirjallisuustieteen kausijulkaisut Jos teos koskee tiettyä kirjallisuustyyppiä tai aihepiiriä, tietyn kielen tai tietyn aikakauden kirjallisuutta, on etusija järjestyksessä: kirjallisuustyyppi tai aihepiiri, kieli, aikakausi
scope note: Allmänna litteraturvetenskapliga tidskrifter och seriella publikationer Om verket representerar en bestämd genre eller ett bestämt temaområde inom litteraturen eller om det hänför sig till litteraturen på ett bestämt språk eller under en bestämd tidsperiod, är prioritetsordningen följande: litterär genre eller temaområde, språk, tidsperiod @sv

Tanskankielisen kirjallisuuden historia ja tutkimus
type: Class
type: Concept
subclass of: GERMAANISTEN KIELTEN KIRJALLISUUDEN HISTORIA JA TUTKIMUS
alternative label: Fäärin kieli, kirjallisuuden historia (822)
alternative label: Tanskan kieli, kirjallisuuden historia (822)
alternative label: Danska, litteraturhistoria (822) @sv
alternative label: Färöiska, litteraturhistoria (822) @sv
broader: GERMAANISTEN KIELTEN KIRJALLISUUDEN HISTORIA JA TUTKIMUS
in scheme: URN:NBN:fi:au:hklj:
notation: 822
preferred label: Danish literature: history and research @en
preferred label: Dansk litteraturhistoria och forskning i dansk litteratur @sv
related: URN:NBN:fi:au:hklj:2.8
related: URN:NBN:fi:au:hklj:2.99
related: Pohjoismaisten kielten kirjallisuuden historia ja tutkimus
scope note: Tässä myös fäärinkielisen kirjallisuuden historia ja tutkimus
scope note: Hit också färöisk litteraturhistoria och forskning i dansk och färöisk litteratur @sv

Hollanninkielisen kirjallisuuden historia ja tutkimus
type: Class
type: Concept
subclass of: GERMAANISTEN KIELTEN KIRJALLISUUDEN HISTORIA JA TUTKIMUS
alternative label: Afrikaansin kieli, kirjallisuudenhistoria (826)
alternative label: Flaamin kieli, kirjallisuuden historia (826)
alternative label: Hollannin kieli, kirjallisuuden historia (826)
alternative label: Afrikaans, litteraturhistoria (826) @sv
alternative label: Flamländska, litteraturhistoria (826) @sv
alternative label: Holländska, litteraturhistoria (826) @sv
broader: GERMAANISTEN KIELTEN KIRJALLISUUDEN HISTORIA JA TUTKIMUS
in scheme: URN:NBN:fi:au:hklj:
notation: 826
preferred label: Dutch literature: history and research @en
preferred label: Nederländsk litteraturhistoria och forskning i nederländsk litteratur @sv
related: URN:NBN:fi:au:hklj:3.8
related: URN:NBN:fi:au:hklj:3.89
related: Englanninkielisen kirjallisuuden historia ja tutkimus
related: Ranskankielisen kirjallisuuden historia ja tutkimus
scope note: Tässä myös afrikaansin- ja flaaminkielisen kirjallisuuden historia ja tutkimus
scope note: Hit också litteraturhistoria och litteraturforskning som rör afrikaans och flamländska @sv

Ranskankielisen kirjallisuuden historia ja tutkimus
type: Class
type: Concept
subclass of: ROMAANISTEN, SLAAVILAISTEN JA BALTTILAISTEN KIELTEN KIRJALLISUUDEN HISTORIA JA TUTKIMUS
alternative label: Amerikka, ranskankielisen kirjallisuuden historia (831)
alternative label: Pohjois-Amerikka, ranskankielisen kirjallisuuden historia (831)
alternative label: Ranskan kieli, kirjallisuuden historia (831)
alternative label: Rolandin laulu, kirjallisuudenhistoria, Ranska (831)
alternative label: Uusi romaani, kirjallisuudenhistoria (831)
alternative label: Amerika, fransk litteraturhistoria (831) @sv
alternative label: Franska, litteraturhistoria (831) @sv
alternative label: Nordamerika, fransk litteraturhistoria (831) @sv
alternative label: Nya romanen, litteraturhistoria (831) @sv
alternative label: Rolandssången, litteraturhistoria, Frankrike (831) @sv
broader: ROMAANISTEN, SLAAVILAISTEN JA BALTTILAISTEN KIELTEN KIRJALLISUUDEN HISTORIA JA TUTKIMUS
in scheme: URN:NBN:fi:au:hklj:
notation: 831
preferred label: French literature: history and research @en
preferred label: Fransk litteraturhistoria och forskning i fransk litteratur @sv
related: URN:NBN:fi:au:hklj:5
related: Saksankielisen kirjallisuuden historia ja tutkimus
related: Hollanninkielisen kirjallisuuden historia ja tutkimus
related: Amerikan englanninkielisen kirjallisuuden historia ja tutkimus
scope note: Tässä myös esim. Belgian, Kanadan, Luxemburgin, Sveitsin ja Afrikan ranskankielisen kirjallisuuden historia ja tutkimus Tässä myös Belgian ja Luxemburgin kirjallisuuden tutkimuksen yleisteokset
scope note: Hit också litteraturhistoria och forskning som rör fransk litteratur i t.ex. Belgien, Kanada, Luxemburg, Schweiz och Afrika Hit också allmänna verk om litteraturhistoria och litteraturforskning i Belgien och Luxemburg @sv

Latinankielisen kirjallisuuden historia ja tutkimus
type: Class
type: Concept
subclass of: MUIDEN KIELTEN KIRJALLISUUDEN HISTORIA JA TUTKIMUS
alternative label: Antiikki, kirjallisuudenhistoria, latina (843)
alternative label: Itaaliset kielet, latinan kieli (843)
alternative label: Kirkkolatina, kirjallisuuden historia (843)
alternative label: Latinan kieli, kirjallisuuden historia (843)
alternative label: Latinan kieli, uusi aika, kirjallisuuden historia (843)
alternative label: Nykylatina, kirjallisuuden historia (843)
alternative label: Uudenajan latina, kirjallisuuden historia (843)
alternative label: Uuslatina, kirjallisuuden historia (843)
alternative label: Antiken, litteraturhistoria, latin (843) @sv
alternative label: Italiska språk, latin (843) @sv
alternative label: Kyrkolatin, litteraturhistoria (843) @sv
alternative label: Latin, litteraturhistoria (843) @sv
alternative label: Latin, nya tiden, litteraturhistoria (843) @sv
broader: MUIDEN KIELTEN KIRJALLISUUDEN HISTORIA JA TUTKIMUS
in scheme: URN:NBN:fi:au:hklj:
notation: 843
preferred label: Latin literature: history and research @en
preferred label: Den latinska litteraturens historia och forskning i latinsk litteratur @sv
related: Vanha aika
related: Keskiaika
related: URN:NBN:fi:au:hklj:9.3
related: Rooman valtakunnan historia ja arkeologia

Keinotekoiset kielet
type: Class
type: Concept
subclass of: KIELITIEDE
alternative label: Bliss-kieli (858)
alternative label: Esperanto, keinotekoiset kielet (858)
alternative label: Fraasit, kielioppaat, eri kielet (858 ... 899 +)
alternative label: Fraseologia, kielioppaat, eri kielet (858 ... 899 +)
alternative label: Idon kieli (858)
alternative label: Interlingua, keinotekoiset kielet (858)
alternative label: Kasetit, kielikurssikasetit (858 ... 899 +)
alternative label: Keinotekoiset kielet (858)
alternative label: Keskustelu, keskusteluoppaat, eri kielet (858 ... 899 +)
alternative label: Keskusteluoppaat, eri kielet (858 ... 899 +)
alternative label: Kielentutkimus, kielittäin (858 ... 899 +)
alternative label: Kielet, eri kielet (858 ... 899 +)
alternative label: Kielikurssit (858 ... 899 +)
alternative label: Kielikurssit, kielitiede (858 ... 899 +)
alternative label: Kielitiede, kielittäin (858 ... 899 +)
alternative label: Konstruoidut kielet (858)
alternative label: Korpukset , kielittäin (858 ... 899 +)
alternative label: Korpuslingvistiikka, kielittäin (858 ... 899 +)
alternative label: Latino sine flexione (858)
alternative label: Moniviestimet, kielikurssit (858 ... 899 +)
alternative label: Novial, kieli (858)
alternative label: Occidental, kieli (858)
alternative label: Salaaminen, salakielet (858)
alternative label: Salakielet (858)
alternative label: Salaus, salakielet (858)
alternative label: Sanonnat, kielioppaat, eri kielet (858 ... 899 +)
alternative label: Sanontatavat, kielioppaat (858 ... 899 +)
alternative label: Volapük (858)
alternative label: Yleiset kielitutkinnot, kielittäin (858 ... 899 +)
alternative label: Äänikasetit, kielikurssiäänitteet (858 ... 899 +)
alternative label: Äänilevyt, kielikurssiäänitteet (858 ... 899 +)
alternative label: Ääninauhat, kielikurssiäänitteet (858 ... 899 +)
alternative label: Äänitallenteet, kielikurssiäänitteet (858 ... 899 +)
alternative label: Äänitteet, kielikurssiäänitteet (858 ... 899 +)
alternative label: Allmänna språkexamina, språkvis (858 ... 899 +) @sv
alternative label: Artificiella språk (858) @sv
alternative label: Blissymboler (858) @sv
alternative label: Chifferspråk (858) @sv
alternative label: Debatt, konversationshandböcker, olika språk (858 ... 899 +) @sv
alternative label: Esperanto, artificiella språk (858) @sv
alternative label: Fonogram, språkursinspelningar (858 ... 899 +) @sv
alternative label: Fraseologi, språkhandböcker, olika språk (858 ... 899 +) @sv
alternative label: Fraser, språkhandböcker, olika språk (858 ... 899 +) @sv
alternative label: Grammofonskivor, språkursinspelningar (858 ... 899 +) @sv
alternative label: Hemlighållande, chifferspråk (858) @sv
alternative label: Ido-språket (858) @sv
alternative label: Interlingua, artificiella språk (858) @sv
alternative label: Kassetter, språkkurskassetter (858 ... 899 +) @sv
alternative label: Konstruerade språk (858) @sv
alternative label: Konversationshandböcker, olika språk (858 ... 899 +) @sv
alternative label: Korpukset , språkvis (858 ... 899 +) @sv
alternative label: Korpuslingvistik, språkvis (858 ... 899 +) @sv
alternative label: Ljudband, språkursinspelningar (858 ... 899 +) @sv
alternative label: Ljudkassetter, språkursinspelningar (858 ... 899 +) @sv
alternative label: Ljudupptagningar, språkursinspelningar (858 ... 899 +) @sv
alternative label: Multimedier, språkkurser (858 ... 899 +) @sv
alternative label: Novial, språket (858) @sv
alternative label: Occidental, språk (858) @sv
alternative label: Språk, olika språk (858 ... 899 +) @sv
alternative label: Språkforskning , språkvis (858 ... 899 +) @sv
alternative label: Språkkurser (858 ... 899 +) @sv
alternative label: Språkkurser, lingvistik (858 ... 899 +) @sv
alternative label: Språkvetenskap, språkvis (858 ... 899 +) @sv
alternative label: Talesätt, språkhandböcker (858 ... 899 +) @sv
broader: KIELITIEDE
in scheme: URN:NBN:fi:au:hklj:
notation: 858
preferred label: Artificial languages @en
preferred label: Artificiella språk @sv
related: Kirjoitus. Kirjoitustaito
related: Symbolit. Koodit. Merkkijärjestelmät
related: Kuulovammaiset
related: Näkövammaiset
scope note: Esperanto. Ido. Latino sine flexione. Novial Salakielet ja niiden tulkitseminen
scope note: Esperanto. Ido. Latino sine flexione. Novial Chifferspråk och avkodning av dem @sv

Kielihistoria
type: Class
type: Concept
subclass of: KIELITIEDE
alternative label: Alkukieli, kielihistoria (859)
alternative label: Fraasit, kielioppaat, eri kielet (858 ... 899 +)
alternative label: Fraseologia, kielioppaat, eri kielet (858 ... 899 +)
alternative label: Hiipuvat kielet, kielihistoria (859)
alternative label: Historiallinen kielitiede (859)
alternative label: Kantakieli, kielihistoria (859)
alternative label: Kasetit, kielikurssikasetit (858 ... 899 +)
alternative label: Keskustelu, keskusteluoppaat, eri kielet (858 ... 899 +)
alternative label: Keskusteluoppaat, eri kielet (858 ... 899 +)
alternative label: Kielen elvytys, kielihistoria (859)
alternative label: Kielen elvytys, kielisosiologia (859)
alternative label: Kielen kehityskaudet, kielihistoria (859)
alternative label: Kielen kuoleminen, kielihistoria (859)
alternative label: Kielentutkimus, kielittäin (858 ... 899 +)
alternative label: Kielet, eri kielet (858 ... 899 +)
alternative label: Kielihistoria (859)
alternative label: Kielikontaktit, kielihistoria (859)
alternative label: Kielikurssit (858 ... 899 +)
alternative label: Kielikurssit, kielitiede (858 ... 899 +)
alternative label: Kielitiede, kielittäin (858 ... 899 +)
alternative label: Konvergenssi, kielihistoria (859)
alternative label: Korpukset , kielittäin (858 ... 899 +)
alternative label: Korpuslingvistiikka, kielittäin (858 ... 899 +)
alternative label: Kuolevat kielet, kielihistoria (859)
alternative label: Kuolleet kielet (859)
alternative label: Lainasanat, kielihistoria (859)
alternative label: Lainautuminen, kielihistoria (859)
alternative label: Moniviestimet, kielikurssit (858 ... 899 +)
alternative label: Muinaiskielet (859)
alternative label: Sammuneet kielet (859)
alternative label: Sammuvat kielet, kielihistoria (859)
alternative label: Sanonnat, kielioppaat, eri kielet (858 ... 899 +)
alternative label: Sanontatavat, kielioppaat (858 ... 899 +)
alternative label: Uhanalaiset kielet, kielihistoria (859)
alternative label: Yleiset kielitutkinnot, kielittäin (858 ... 899 +)
alternative label: Äänikasetit, kielikurssiäänitteet (858 ... 899 +)
alternative label: Äänilevyt, kielikurssiäänitteet (858 ... 899 +)
alternative label: Ääninauhat, kielikurssiäänitteet (858 ... 899 +)
alternative label: Äänitallenteet, kielikurssiäänitteet (858 ... 899 +)
alternative label: Äänitteet, kielikurssiäänitteet (858 ... 899 +)
alternative label: Allmänna språkexamina, språkvis (858 ... 899 +) @sv
alternative label: Debatt, konversationshandböcker, olika språk (858 ... 899 +) @sv
alternative label: Döda språk (859) @sv
alternative label: Fonogram, språkursinspelningar (858 ... 899 +) @sv
alternative label: Fornspråk (859) @sv
alternative label: Fraseologi, språkhandböcker, olika språk (858 ... 899 +) @sv
alternative label: Fraser, språkhandböcker, olika språk (858 ... 899 +) @sv
alternative label: Grammofonskivor, språkursinspelningar (858 ... 899 +) @sv
alternative label: Historisk språkvetenskap (859) @sv
alternative label: Hotade språk, språkhistoria (859) @sv
alternative label: Inlån, språk, språkhistoria (859) @sv
alternative label: Kassetter, språkkurskassetter (858 ... 899 +) @sv
alternative label: Konvergens, språkhistoria (859) @sv
alternative label: Konversationshandböcker, olika språk (858 ... 899 +) @sv
alternative label: Korpukset , språkvis (858 ... 899 +) @sv
alternative label: Korpuslingvistik, språkvis (858 ... 899 +) @sv
alternative label: Ljudband, språkursinspelningar (858 ... 899 +) @sv
alternative label: Ljudkassetter, språkursinspelningar (858 ... 899 +) @sv
alternative label: Ljudupptagningar, språkursinspelningar (858 ... 899 +) @sv
alternative label: Lånord, språkhistoria (859) @sv
alternative label: Multimedier, språkkurser (858 ... 899 +) @sv
alternative label: Språk, olika språk (858 ... 899 +) @sv
alternative label: Språkdöd, språkhistoria (859) @sv
alternative label: Språkets utvecklingsstadier, språkhistoria (859) @sv
alternative label: Språkforskning , språkvis (858 ... 899 +) @sv
alternative label: Språkhistoria (859) @sv
alternative label: Språkkontakter, språkhistoria (859) @sv
alternative label: Språkkurser (858 ... 899 +) @sv
broader: KIELITIEDE
in scheme: URN:NBN:fi:au:hklj:
notation: 859
related: Kielioppi. Muoto-oppi. Sanaoppi. Semantiikka
related: Etymologia. Onomastiikka
related: Ruotsin kielen historia
related: Suomen kielen historia
scope note: Kielen ja kielten historia ja kehitys yleensä Kielihistoria yleensä. Kielen synty Tietyn kielen tai kieliryhmän kielihistoria ko. kielen tai kieliryhmän mukaisessa luokassa
scope note: Språkens historia och språkens utveckling i allmänhet Språkhistoria i allmänhet. Uppkomsten av språk Språkhistoria som rör ett bestämt språk eller en bestämd språkgrupp förs till klassen för språket eller språkgruppen i fråga @sv

Englannin kielen yksikieliset sanakirjat
type: Class
type: Concept
subclass of: Englannin kieli
alternative label: Englannin kieli, sanakirjat, yksikieliset (875.3)
alternative label: Engelska, ordböcker, enspråkiga (875.3) @sv
broader: Englannin kieli
in scheme: URN:NBN:fi:au:hklj:
notation: 875.3
preferred label: English dictionaries @en
preferred label: Enspråkiga engelska ordböcker @sv
related: Monikieliset sanakirjat. Sivistyssanakirjat
related: URN:NBN:fi:au:hklj:860
related: URN:NBN:fi:au:hklj:875.03
related: URN:NBN:fi:au:hklj:875.703
scope note: Englannin kielen yleiset yksikieliset sanakirjat Englannin kielen etymologiset sanakirjat Englannin kielen murre- ja slangisanakirjat Erikoisalojen sanakirjat alan mukaisessa luokassa
scope note: Allmänna enspråkiga ordböcker över engelska Engelska etymologiska ordböcker Engelska dialektordböcker och slangordböcker Ordböcker över specialområden klassificeras enligt område @sv

Seemiläiset kielet
type: Class
type: Concept
subclass of: Seemiläiset kielet. Haamilaiset kielet
alternative label: Akkadin kieli (891.1)
alternative label: Amharan kieli (891.1)
alternative label: Amharan kieli, kielitiede (891.1)
alternative label: Aramean kieli (891.1)
alternative label: Assyrialais-babylonialaiset kielet (891.1)
alternative label: Hararin kieli (891.1)
alternative label: Maltan kieli (891.1)
alternative label: Seemiläiset kielet (891.1 +)
alternative label: Seemiläiset kielet, kielitiede (891.1 +)
alternative label: Syyrian kieli (891.1)
alternative label: Tigren kieli (891.1)
alternative label: Tigren kieli, kielitiede (891.1)
alternative label: Tigrinjan kieli (891.1)
alternative label: Tigrinjan kieli, kielitiede (891.1)
alternative label: Akkadiska (891.1) @sv
alternative label: Amhara-språket (891.1) @sv
alternative label: Amhara-språket, lingvistik (891.1) @sv
alternative label: Arameiska (891.1) @sv
alternative label: Assyrisk-babyloniska språk (891.1) @sv
alternative label: Harari (891.1) @sv
alternative label: Maltesiska (891.1) @sv
alternative label: Semitiska språk (891.1 +) @sv
alternative label: Semitiska språk, lingvistik (891.1 +) @sv
alternative label: Syriska (891.1) @sv
alternative label: Tigre, språk (891.1) @sv
alternative label: Tigre, språk, lingvistik (891.1) @sv
alternative label: Tigrinja, språk (891.1) @sv
alternative label: Tigrinja, språk, lingvistik (891.1) @sv
broader: Seemiläiset kielet. Haamilaiset kielet
in scheme: URN:NBN:fi:au:hklj:
narrower: Heprean kieli
narrower: Arabian kieli
notation: 891.1
preferred label: Semitic languages @en
preferred label: Semitiska språk @sv
scope note: Yleisteokset seemiläisistä kielistä Amharan, aramean, guragen, hararin, maltan, syyrian, tigren ja tigrinjan kieli
scope note: Allmänna verk om semitiska språk Amhariska, arameiska, gurageiska, harari, maltesiska, syriska, tigré och tigrinja @sv

Tiibetiläis-burmalaiset kielet
type: Class
type: Concept
subclass of: MUUT KIELET
alternative label: Annamin kieli (896)
alternative label: Annamin kieli, kielitiede (896)
alternative label: Burman kieli (896)
alternative label: Burman kieli, kielitiede (896)
alternative label: Indokiinalaiset kielet (896)
alternative label: Kiinan kieli (896)
alternative label: Kiinan kieli, kielitiede (896)
alternative label: Laon kieli (896)
alternative label: Sinologia, kiinan kieli (896)
alternative label: Sinotiibetiläiset kielet (896)
alternative label: Thain kieli (896)
alternative label: Thain kieli, kielitiede (896)
alternative label: Tiibetin kieli (896)
alternative label: Vietnamin kieli (896)
alternative label: Vietnamin kieli, kielitiede (896)
alternative label: Annamitiska (896) @sv
alternative label: Annamitiska, lingvistik (896) @sv
alternative label: Burmesiska (896) @sv
alternative label: Burmesiska, lingvistik (896) @sv
alternative label: Indokinesiska språk (896) @sv
alternative label: Kinesiska (896) @sv
alternative label: Kinesiska, lingvistik (896) @sv
alternative label: Laotiska (896) @sv
alternative label: Sinologi, kinesiska (896) @sv
alternative label: Sinotibetanska språk (896) @sv
alternative label: Thailändska (896) @sv
alternative label: Thailändska, lingvistik (896) @sv
alternative label: Tibetanska (896) @sv
alternative label: Vietnamesiska (896) @sv
alternative label: Vietnamesiska, lingvistik (896) @sv
broader: MUUT KIELET
in scheme: URN:NBN:fi:au:hklj:
notation: 896
preferred label: Tibeto-Burman languages @en
preferred label: Tibeto-burmanska språk @sv
related: Kirjoituksen historia. Paleografia. Epigrafia
scope note: Burman, kiinan, laon, thain, tiibetin ja vietnamin kieli
scope note: Burmanska, kinesiska, laotiska, thailändska (siamesiska), tibetanska och vietnamesiska @sv

Yleinen kronologia ja kronografia
type: Class
type: Concept
subclass of: Historian aputieteet
alternative label: Aika, kronologia (911.1)
alternative label: Ajoitus, historia (911.1)
alternative label: Kronografia, historia (911.1)
alternative label: Kronologia, historia (911.1)
alternative label: Kronologiset taulukot (911.1)
alternative label: Kronografi, historia (911.1) @sv
alternative label: Kronologi, historia (911.1) @sv
alternative label: Kronologiska tabeller (911.1) @sv
alternative label: Tid, kronologi (911.1) @sv
alternative label: Åldersbestämning, historia (911.1) @sv
broader: Historian aputieteet
in scheme: URN:NBN:fi:au:hklj:
notation: 911.1
preferred label: General chronology and chronography @en
preferred label: Allmän kronologi och kronografi @sv
related: Ajanlasku
related: URN:NBN:fi:au:hklj:909
related: Historian tutkimusmenetelmät
related: Yleinen arkeologia
scope note: Maailmanhistoria vuosittain. Yleiset kronologiset taulukot Eri maanosien, maiden, alueiden ja aikakausien kronologia, kronografia ja kronologiset taulukot ko. maanosan, maan, alueen tai aikakauden historian luokassa
scope note: Världshistorien indelad enligt år. Allmänna kronologiska tabeller Kronologi, kronografi och kronologiska tabeller som rör olika världsdelar, länder, geografiska områden och tidsperioder förs till klassen för världsdelens, landets, det geografiska områdets eller tidsperiodens historia @sv

Kadonneet mantereet. Maapallon ulkopuolisten kulttuurien vaikutus muinaishistoriaan
type: Class
type: Concept
subclass of: Yleinen arkeologia
alternative label: Atlantis (915.1)
alternative label: Ekstraterrestiaalinen elämä, vaikutus maailmanhistoriaan (915.1)
alternative label: Ekstraterrestinen elämä, vaikutus maailmanhistoriaan (915.1)
alternative label: Maan ulkopuolinen elämä, vaikutus maailmanhistoriaan (915.1)
alternative label: Maapallon ulkopuolinen elämä , vaikutus maailmanhistoriaan (915.1)
alternative label: Maapallon ulkopuoliset kulttuurit, arkeologinen tutkimus (915.1)
alternative label: Paranormaalit ilmiöt, maailmanhistoria (915.1)
alternative label: Rajatieto, kadonneet mantereet (915.1)
alternative label: Rajatieto, vieraat sivilisaatiot ja maailmanhistoria (915.1)
alternative label: Selittämättömät ilmiöt, vieraat kulttuurit maailmanhistoriassa (915.1)
alternative label: Vieraat sivilisaatiot, vaikutus maailmanhistoriaan (915.1)
alternative label: Främmande civilisationer, inverkan på världshistorien (915.1) @sv
alternative label: Oförklarliga fenomen, främmande kulturer i världshistorien (915.1) @sv
alternative label: Omstridda fenomen, främmande civilisationer och världshistoria (915.1) @sv
alternative label: Omstridda fenomen, försvunna kontinenter (915.1) @sv
alternative label: Paranormala fenomen, världshistoria (915.1) @sv
alternative label: Utomjordiska kulturer, arkeologisk forskning (915.1) @sv
alternative label: Utomjordiskt liv, inverkan på världshistorien (915.1) @sv
broader: Yleinen arkeologia
in scheme: URN:NBN:fi:au:hklj:
notation: 915.1
preferred label: Lost continents. Influence of extra-terrestrial cultures on the earth's ancient history @en
preferred label: Försvunna kontinenter. Utomjordiska kulturers inflytande på jordens fornhistoria @sv
related: RAJATIETO
related: Elämä maailmankaikkeudessa. Astrobiologia
related: Ufot. Ilmakehän tunnistamattomat ilmiöt
scope note: Atlantis

Ruotsin historia
type: Class
type: Concept
subclass of: URN:NBN:fi:au:hklj:930
alternative label: Hollikyyti, Ruotsin historia (931 ... 936)
alternative label: Kruununkyyti, Ruotsin historia (931 ... 936)
alternative label: Kyytilaitos, Ruotsin historia (931 ... 936)
alternative label: Reservikyyti, Ruotsin historia (931 ... 936)
alternative label: Ruotsalaiset, Ruotsi, historia (931 ... 936)
alternative label: Ruotsi, historia (931 ... 936)
alternative label: Valtaneuvoskunta, Ruotsin historia (931 ... 934)
alternative label: Hållskjuts, Sveriges historia (931 ... 936) @sv
alternative label: Kronoskjuts, Sveriges historia (931 ... 936) @sv
alternative label: Riksrådsförsamling, Sveriges historia (931 ... 934) @sv
alternative label: Skjutsväsen, Sveriges historia (931 ... 936) @sv
alternative label: Skjutsväsendet, Sveriges historia (931 ... 936) @sv
alternative label: Svenskar, Sverige, historia (931 ... 936) @sv
alternative label: Sverige, historia (931 ... 936) @sv
broader: URN:NBN:fi:au:hklj:930
in scheme: URN:NBN:fi:au:hklj:
notation: 931
preferred label: Sweden's history @en
preferred label: Sveriges historia @sv
related: Ruotsi
related: Tukholma
related: URN:NBN:fi:au:hklj:989
scope note: Tässä ja luokissa 932-936 myös Ruotsin hallitsijoita, kuninkaallisia ja kuningashuoneita koskeva historia ja henkilöhistoria Ruotsin historian ja arkeologian yleisteokset Ruotsin esi- ja varhaishistoria. Ruotsin viikingit ja viikinkiaika Jos teos koskee vähintään kolmea luokkien 931-935 aikakautta, se kuuluu pääluokkaan 931 Jos teos koskee samassa määrin kahta aikakautta, se kuuluu varhaisemman aikakauden luokkaan, muuten siihen luokkaan, johon se selvästi painottuu
scope note: Hit och till klasserna 932-936 också historia eller personhistoria som rör regenter, kungligheter eller kungahus i Sverige Allmänna verk om Sveriges historia och arkeologi Sveriges förhistoria och fornhistoria. Vikingarna och vikingatiden i Sverige Om verket handlar om minst tre tidsperioder inom klasserna 931-935 förs det till huvudklass 931 Om verket behandlar två tidsperioder jämbördigt förs det till klassen för den tidigare tidsperioden, i andra fall till klassen för den tidsperiod som klart dominerar i verket @sv

Norjan historia
type: Class
type: Concept
subclass of: URN:NBN:fi:au:hklj:930
alternative label: Komsan kulttuuri, Ruija (938)
alternative label: Lappi, Norjan Lappi, historia (938)
alternative label: Norja, historia (938)
alternative label: Oslo, historia (938)
alternative label: Ruija, historia (938)
alternative label: Suomalaismetsät, Norja: paikallishistoria (938)
alternative label: Suomalaisseudut, Norja: paikallishistoria (938)
alternative label: Finnmarken, historia (938) @sv
alternative label: Finnmarker, Norge: lokalhistoria (938) @sv
alternative label: Finnskogar, Norge: lokalhistora (938) @sv
alternative label: Komsakulturen, Finnmarken (938) @sv
alternative label: Lappland, Norska Lappland, historia (938) @sv
alternative label: Norge, historia (938) @sv
broader: URN:NBN:fi:au:hklj:930
in scheme: URN:NBN:fi:au:hklj:
notation: 938
preferred label: Norway's history @en
preferred label: Norges historia @sv
related: Norja
related: Oslo
related: Esi- ja varhaishistoria
related: URN:NBN:fi:au:hklj:989

Tsekin historia
type: Class
type: Concept
subclass of: Tsekin ja slovakian historia
alternative label: Tsekki, historia (978.11)
alternative label: Tjeckien, historia (978.11) @sv
broader: Tsekin ja slovakian historia
in scheme: URN:NBN:fi:au:hklj:
notation: 978.11
preferred label: The Czech Republic's history @en
preferred label: Tjeckiens historia @sv
related: Entisen Tsekkoslovakian alue
related: Tsekki
related: URN:NBN:fi:au:hklj:909
related: URN:NBN:fi:au:hklj:919

Slovakian historia
type: Class
type: Concept
subclass of: Tsekin ja slovakian historia
alternative label: Slovakia, historia (978.12)
alternative label: Slovakien, historia (978.12) @sv
broader: Tsekin ja slovakian historia
in scheme: URN:NBN:fi:au:hklj:
notation: 978.12
preferred label: Slovakia's history @en
preferred label: Slovakiens historia @sv
related: Entisen Tsekkoslovakian alue
related: Slovakia
related: URN:NBN:fi:au:hklj:909
related: URN:NBN:fi:au:hklj:919

Romanian historia
type: Class
type: Concept
subclass of: Muiden Keski-Euroopan maiden historia
alternative label: Romania, historia (978.2)
alternative label: Rumänien, historia (978.2) @sv
broader: Muiden Keski-Euroopan maiden historia
in scheme: URN:NBN:fi:au:hklj:
notation: 978.2
preferred label: Rumania's history @en
preferred label: Rumäniens historia @sv
related: Romania
related: URN:NBN:fi:au:hklj:909
related: URN:NBN:fi:au:hklj:919
related: URN:NBN:fi:au:hklj:979

Kanadan historia
type: Class
type: Concept
subclass of: Amerikan historia
alternative label: Intiaanisodat, Kanada (987.1)
alternative label: Kanada, historia (987.1)
alternative label: Labrador, historia (987.1)
alternative label: Newfoundland, historia (987.1)
alternative label: Pohjois-Amerikka, Kanada, historia (987.1)
alternative label: Quebec, historia (987.1)
alternative label: Indiankrig, Kanada (987.1) @sv
alternative label: Nordamerika, Kanada, historia (987.1) @sv
broader: Amerikan historia
in scheme: URN:NBN:fi:au:hklj:
notation: 987.1
preferred label: Canada's history @en
preferred label: Kanadas historia @sv
related: Pohjois-Amerikka
related: Kanada
related: BRITTEIN SAARTEN HISTORIA
related: URN:NBN:fi:au:hklj:989

Yhdysvaltojen historia vuoteen 1775
type: Class
type: Concept
subclass of: Yhdysvaltojen historia
broader: Yhdysvaltojen historia
in scheme: URN:NBN:fi:au:hklj:
notation: 987.21
preferred label: History of the United States of America to 1775 @en
preferred label: Förenta staternas historia till 1775 @sv
related: Pohjois-Amerikka
related: Yhdysvallat, USA
related: New York
related: URN:NBN:fi:au:hklj:989

Yhdysvaltojen historia 1775-1860
type: Class
type: Concept
subclass of: Yhdysvaltojen historia
broader: Yhdysvaltojen historia
in scheme: URN:NBN:fi:au:hklj:
notation: 987.22
preferred label: History of the United States of America 1775–1860 @en
preferred label: Förenta staternas historia 1775–1860 @sv
related: Pohjois-Amerikka
related: Yhdysvallat, USA
related: New York
related: URN:NBN:fi:au:hklj:989

Yhdysvaltojen historia 1861-1938
type: Class
type: Concept
subclass of: Yhdysvaltojen historia
broader: Yhdysvaltojen historia
in scheme: URN:NBN:fi:au:hklj:
notation: 987.23
preferred label: History of the United States of America 1861–1938 @en
preferred label: Förenta staternas historia 1861–1938 @sv
related: Pohjois-Amerikka
related: Yhdysvallat, USA
related: New York
related: URN:NBN:fi:au:hklj:989

Muiden romaanisten kielten kaunokirjallisuus (Kaunoluokka)
type: Class
type: Concept
type: FormClass
subclass of: ESPANJANKIELINEN KAUNOKIRJALLISUUS (Kaunoluokka)
broader: ESPANJANKIELINEN KAUNOKIRJALLISUUS (Kaunoluokka)
in scheme: URN:NBN:fi:au:hklj:
narrower: Romaniankielinen kaunokirjallisuus (Kaunoluokka)
narrower: Katalaaninkielinen kaunokirjallisuus (Kaunoluokka)
notation: 7.9
preferred label: Fiction in other Romance languages (Fiction class) @en
preferred label: Skönlitteratur på andra romanska språk (Skönklass) @sv
scope note: Galegon-, ladinon-, moldovan-, oksitaanin-, retoromanian- ja sardinkielinen kaunokirjallisuus
scope note: Skönlitteratur på galego, ladino, moldaviska, occitanska, rätoromanska och sardiska @sv

Balttilaisten kielten kaunokirjallisuus (Kaunoluokka)
type: Class
type: Concept
type: FormClass
subclass of: MUIDEN KIELTEN KAUNOKIRJALLISUUS (Kaunoluokka)
broader: MUIDEN KIELTEN KAUNOKIRJALLISUUS (Kaunoluokka)
in scheme: URN:NBN:fi:au:hklj:
narrower: Latviankielinen kaunokirjallisuus (Kaunoluokka)
narrower: Liettuankielinen kaunokirjallisuus (Kaunoluokka)
notation: 9.1
preferred label: Baltic fiction (Fiction class) @en
preferred label: Baltisk skönlitteratur (Skönklass) @sv
scope note: Latvian- ja liettuankielinen kaunokirjallisuus
scope note: Skönlitteratur på lettiska och litauiska @sv

Konekirjoitus
type: Class
type: Concept
subclass of: Kirjoitus. Kirjoitustaito
alternative label: Kirjoituskoneet, konekirjoitus (001.1)
alternative label: Konekirjoitus (001.1)
alternative label: Kymmensormijärjestelmä (001.1)
alternative label: Maskinskrivning (001.1) @sv
alternative label: Skrivmaskiner, maskinskrivning (001.1) @sv
alternative label: Tiofingersystem (001.1) @sv
broader: Kirjoitus. Kirjoitustaito
in scheme: URN:NBN:fi:au:hklj:
notation: 001.1
preferred label: Typewriting @en
preferred label: Maskinskrivning @sv
related: Kirjapainotaito. Graafinen teollisuus
related: Tekstinkäsittelyohjelmat
related: Toimistotyö
related: Toimistokoneet
related: KIELITIEDE
scope note: Konekirjoitusjärjestelmät ja -oppaat Kirjoituskoneiden käyttö
scope note: System och handböcker för maskinskrivning Användning av skrivmaskiner @sv

Kirjansidonta. Kirjansidontataide
type: Class
type: Concept
subclass of: KIRJA-ALA
alternative label: Kannet, kirjan, kirjansidonta (006)
alternative label: Kirjankannet, kirjansidonta (006)
alternative label: Kirjansidonta, kirjansidontataide (006)
alternative label: Kirjansitomot (006)
alternative label: Kirjataide, kirjansidontataide (006)
alternative label: Konservointi, kirjat (006)
alternative label: Muovitus, kirjansidonta (006)
alternative label: Sidonta, kirjansidonta (006)
alternative label: Sitomot (006)
alternative label: Binderier, bokbinderier (006) @sv
alternative label: Bindning, bokbinderi (006) @sv
alternative label: Bokbinderi, bokbindarkonst (006) @sv
alternative label: Bokbinderier (006) @sv
alternative label: Bokkonst, bokbindarkonst (006) @sv
alternative label: Bokomslag, bokbinderi (006) @sv
alternative label: Bokpärmar, bokbinderi (006) @sv
alternative label: Konservering, böcker (006) @sv
alternative label: Plastbeläggning, bokbinderi (006) @sv
alternative label: Pärmar, bokbinderi (006) @sv
broader: KIRJA-ALA
in scheme: URN:NBN:fi:au:hklj:
notation: 006
preferred label: Bookbinding. Art of bookbinding @en
preferred label: Bokbindning. Bokbindningskonst @sv
related: Kirjan historia
related: Kirjapainotaito. Graafinen teollisuus
related: Kirjastoaineisto. Kokoelmatyö
related: URN:NBN:fi:au:hklj:748
related: Kuvitustaide
scope note: Kirjansidonta ja sen tekniikka teollisuuden ja käsityön kannalta Kirjan sidosasu. Kirjan kunnossapito, korjaaminen ja konservointi
scope note: Bokbindning och bokbindningsteknik som industri och hantverk Bokband. Underhåll och reparation av böcker. Bokkonservering @sv

Valikoimaluettelot
type: Class
type: Concept
subclass of: URN:NBN:fi:au:hklj:010
alternative label: Abstraktijulkaisut (010.5 ... 016)
alternative label: Aikakauslehti-indeksit (010.5 ... 016)
alternative label: Aikakauslehtiartikkelit, indeksit (010.5 ... 016)
alternative label: Arvostelevat luettelot (010.5 ... 016)
alternative label: Bibliografiat, valikoimaluettelot (010.5)
alternative label: Bibliografiset tietokannat, valikoimaluettelot (010.5)
alternative label: Harvinaiskirjat, luettelot (010.5)
alternative label: Kaunokirjallisuusluettelot, valikoimaluettelot (010.5)
alternative label: Kiellettyjen kirjojen luettelot (010.5)
alternative label: Kirjaharvinaisuudet, luettelot (010.5)
alternative label: Kirjaluettelot, valikoimaluettelot (010.5)
alternative label: Referaattijulkaisut (010.5 ... 016)
alternative label: Tiivistelmäjulkaisut (010.5 ... 016)
alternative label: Valikoimaluettelot (010.5)
alternative label: Abstraktpublikationer (010.5 ... 016) @sv
alternative label: Bibliografier, urvalskataloger (010.5) @sv
alternative label: Bibliografiska databaser, urvalskataloger (010.5) @sv
alternative label: Bokkataloger, urvalskataloger (010.5) @sv
alternative label: Bokrariteter, kataloger (010.5) @sv
alternative label: Förbjudna böcker, index (010.5) @sv
alternative label: Recenserande kataloger (010.5 ... 016) @sv
alternative label: Referatpublikationer, referaattijulkaisut (010.5 ... 016) @sv
alternative label: Referatpublikationer, tiivistelmäjulkaisut (010.5 ... 016) @sv
alternative label: Skönlitteraturkataloger, urvalskataloger (010.5) @sv
alternative label: Sällsynta böcker, kataloger (010.5) @sv
alternative label: Tidskriftsartiklar, index (010.5 ... 016) @sv
alternative label: Tidskriftsindex (010.5 ... 016) @sv
alternative label: Urvalskataloger (010.5) @sv
broader: URN:NBN:fi:au:hklj:010
in scheme: URN:NBN:fi:au:hklj:
notation: 010.5
preferred label: Lists of selections @en
preferred label: Urvalsförteckningar @sv
related: Yleisbibliografiat. Kansallisbibliografiat
related: Suomi
related: Kirjallisuustiede. Kielitiede
related: Musiikkibibliografiat. Diskografiat
scope note: Yleis- ja sekasisältöiset tietokirjallisuuden valikoimaluettelot luettelon aineistotyypistä riippumatta Kaunokirjallisuuden valikoimaluettelot luettelon aineistotyypistä riippumatta Aikakausjulkaisujen, sanomalehtien, mikrofilmien ja -korttien valikoimaluettelot samassa luokassa kuin vastaavat kirjaluettelot
scope note: Urvalsförteckningar över facklitteratur av allmänt och varierande innehåll oavsett katalogens mediatyp Urvalsförteckningar över skönlitteratur oavsett katalogens mediatyp Urvalsförteckningar över seriella publikationer, tidningar, mikrofilmer och mikrokort förs till samma klass som motsvarande litteraturförteckningar @sv

Filosofia. Psykologia. Kasvatustiede
type: Class
type: Concept
subclass of: Erikoisalojen bibliografiat
broader: Erikoisalojen bibliografiat
in scheme: URN:NBN:fi:au:hklj:
notation: 015.1
preferred label: Philosophy. Psychology. Pedagogy @en
preferred label: Filosofi. Psykologi. Pedagogik @sv
related: Lasten- ja nuortenkirjallisuuden luettelot
related: Yleisbibliografiat. Kansallisbibliografiat
related: Kirjastojen luettelot
related: Kustantajien ja kirjakauppojen luettelot
scope note: Bibliografiset julkaisut, jotka koskevat pääluokan 100 erikoisaloja, kuten filosofiaa, logiikkaa, tiedeoppia, psykologiaa, kasvatustiedettä tai rajatietoa
scope note: Bibliografier över specialområden som hör till huvudklass 100, såsom filosofi, logik, vetenskapsteori, psykologi, pedagogik eller paranormala fenomen @sv

Yhteiskunta
type: Class
type: Concept
subclass of: Erikoisalojen bibliografiat
broader: Erikoisalojen bibliografiat
in scheme: URN:NBN:fi:au:hklj:
notation: 015.3
preferred label: Society @en
preferred label: Samhälle @sv
related: Lasten- ja nuortenkirjallisuuden luettelot
related: Yleisbibliografiat. Kansallisbibliografiat
related: Kirjastojen luettelot
related: Kustantajien ja kirjakauppojen luettelot
scope note: Bibliografiset julkaisut, jotka koskevat pääluokan 300 erikoisaloja, kuten yhteiskuntatieteitä, tilastotiedettä, valtio-oppia, politiikkaa, oikeustiedettä, hallintoa, sosiologiaa, taloustiedettä, sosiaalipolitiikkaa, joukkotiedotusta, liikennettä tai maanpuolustusta
scope note: Bibliografier över specialområden som hör till huvudklass 300, såsom samhällsvetenskaperna, statistik, statslära, politik, rättsvetenskap, förvaltning, sociologi, nationalekonomi, socialpolitik, masskommunikation, trafik eller försvar @sv

Maantiede. Matkat. Kansatiede
type: Class
type: Concept
subclass of: Erikoisalojen bibliografiat
broader: Erikoisalojen bibliografiat
in scheme: URN:NBN:fi:au:hklj:
notation: 015.4
preferred label: Geography. Travel. Ethnology @en
preferred label: Geografi. Resor. Etnologi @sv
related: Lasten- ja nuortenkirjallisuuden luettelot
related: Yleisbibliografiat. Kansallisbibliografiat
related: Kirjastojen luettelot
related: Kustantajien ja kirjakauppojen luettelot
scope note: Bibliografiset julkaisut, jotka koskevat pääluokan 400 erikoisaloja, kuten maantiedettä, matkailua, matkakuvauksia, karttoja, kansatiedettä, kulttuuriantropologiaa tai fyysistä maantiedettä
scope note: Bibliografier över specialområden som hör till huvudklass 400, såsom geografi, turism, reseskildringar, kartor, etnologi, kulturantropologi eller fysisk geografi @sv

Lääketiede. Tekniikka. Teollisuus. Maa- ja metsätalous. Liiketalous. Kotitalous. Käsityö
type: Class
type: Concept
subclass of: Erikoisalojen bibliografiat
alternative label: Patenttijulkaisut, bibliografiat (015.6)
alternative label: Patentpublikationer, bibliografier (015.6) @sv
broader: Erikoisalojen bibliografiat
in scheme: URN:NBN:fi:au:hklj:
notation: 015.6
preferred label: Medicine. Engineering. Industry. Agriculture and Forestry. Commerce. Domestic science. Handicrafts @en
preferred label: Medicin. Teknik. Industri. Jord- och skogsbruk. Företagsekonomi. Hushåll. Hantverk och hemslöjd @sv
related: Lasten- ja nuortenkirjallisuuden luettelot
related: Yleisbibliografiat. Kansallisbibliografiat
related: Kirjastojen luettelot
related: Kustantajien ja kirjakauppojen luettelot
scope note: Bibliografiset julkaisut, jotka koskevat pääluokan 600 erikoisaloja, kuten lääketiedettä, tekniikkaa, teollisuutta, energia-alaa, kulkuvälineitä, sähkötekniikkaa, elektroniikkaa, tietotekniikkaa, tietoliikennettä, rakennustekniikkaa, maataloutta, metsätaloutta, koti- ja laitostaloutta, liiketaloutta, kauppaa tai markkinointia
scope note: Bibliografier över specialområden som hör till huvudklass 600, såsom medicin, teknik, energi, transportmedel, elteknik, elektronik, datateknik, datakommunikation, byggnadsteknik lantbruk, skogsbruk, hushåll, storhushåll, företagsekonomi, handel eller marknadsföring @sv

Englanninkieliset
type: Class
type: Concept
subclass of: YLEISET KAUSIJULKAISUT
broader: YLEISET KAUSIJULKAISUT
in scheme: URN:NBN:fi:au:hklj:
narrower: Amerikan englanninkieliset
notation: 054
preferred label: English @en
preferred label: Engelska @sv

Suomenkieliset
type: Class
type: Concept
subclass of: SANOMALEHDET
broader: SANOMALEHDET
in scheme: URN:NBN:fi:au:hklj:
narrower: Suomessa ilmestyvät ruotsinkieliset
narrower: Suomessa ilmestyvät vieraskieliset
notation: 071
preferred label: Finnish @en
preferred label: Finska @sv
related: URN:NBN:fi:au:hklj:384

Renessanssin ja uuden ajan filosofia
type: Class
type: Concept
subclass of: Filosofian historia
alternative label: Ensyklopedistit, filosofia (108.4)
alternative label: Filosofian historia, uusi aika (108.4)
alternative label: Kartesiolaisuus (108.4)
alternative label: Uusi aika, filosofia (108.4 ... 108.6)
alternative label: Valistuksen aika, filosofia (108.4)
alternative label: Valistus, filosofia (108.4)
alternative label: Valistusfilosofia (108.4)
alternative label: Cartesianism (108.4) @sv
alternative label: Encyklopedister, filosofi (108.4) @sv
alternative label: Filosofins historia, nya tiden (108.4) @sv
alternative label: Nya tiden, filosofi (108.4 ... 108.6) @sv
alternative label: Upplysning, filosofi (108.4) @sv
alternative label: Upplysningstiden, filosofi (108.4) @sv
alternative label: Uupplysningsfilosofi (108.4) @sv
broader: Filosofian historia
in scheme: URN:NBN:fi:au:hklj:
notation: 108.4
preferred label: Renaissance and modern philosophy @en
preferred label: Renässansens och nya tidens filosofi @sv
related: Oppikirjat. Johdatukset filosofiaan
related: Esseet
related: URN:NBN:fi:au:hklj:110
related: Tietoteorian historia ja suunnat
related: Uuden ajan kulttuurihistoria 1500-1788
scope note: Valistuksen aika. Ensyklopedistit Rationalismi ja empirismi 1700-luvun loppuun Cusanus, Hobbes, Descartes, Pascal, Voltaire, Diderot, Leibnitz, Spinoza, Locke, Berkeley, Hume, Kant ja heidän aikalaistensa filosofia Filosofian erikoisalojen kysymykset alan mukaisessa luokassa
scope note: Upplysningstiden. Encyklopedisterna Rationalism och empirism till 1700-talets slut Cusanus, Hobbes, Descartes, Pascal, Voltaire, Diderot, Leibnitz, Spinoza, Locke, Berkeley, Hume, Kant och deras samtida inom filosofin Specialfrågor inom filosofin klassificeras enligt område @sv

Typologia. Karakterologia
type: Class
type: Concept
subclass of: URN:NBN:fi:au:hklj:120
alternative label: Ekstroversio, luonnetyypit (125)
alternative label: Introversio, luonnetyypit (125)
alternative label: Karakterologia (125)
alternative label: Luonne, luonnetyypit (125)
alternative label: Luonnetestit (125)
alternative label: Luonnetyypit (125)
alternative label: Luonteenpiirteet, luonnetyypit (125)
alternative label: Persoonallisuuden piirteet, luonnetyypit (125)
alternative label: Persoonallisuus, luonnetyypit (125)
alternative label: Temperamentti (125)
alternative label: Typologiat, psykologia (125)
alternative label: Tyyppipsykologia (125)
alternative label: Extroversion, personlighetstyper (125) @sv
alternative label: Introversion, personlighetstyper (125) @sv
alternative label: Karakterologi (125) @sv
alternative label: Karaktär, personlighetstyper (125) @sv
alternative label: Karaktärsdrag, personlighetstyper (125) @sv
alternative label: Personlighet, personlighetstyper (125) @sv
alternative label: Personlighetsdrag, personlighetstyper (125) @sv
alternative label: Personlighetstest (125) @sv
alternative label: Personlighetstyper (125) @sv
alternative label: Temperament (125) @sv
alternative label: Typlära, psykologi (125) @sv
alternative label: Typologier, psykologi (125) @sv
broader: URN:NBN:fi:au:hklj:120
in scheme: URN:NBN:fi:au:hklj:
notation: 125
preferred label: Typology. Characterology @en
preferred label: Typlära. Karakterologi @sv
related: Kokeellinen psykologia. Psykometriikka
related: Psykologian suunnat
related: Differentiaalipsykologia. Persoonallisuuden psykologia
related: Psychology of expression {@en
related: Muita psykologian aloja
scope note: Luonnetyypit. Temperamenttityypit. Luonnetestit
scope note: Karaktärstyper. Temperamentstyper. Karaktärstest @sv

Tieteenfilosofia. Metodologia
type: Class
type: Concept
subclass of: TIEDEOPPI
alternative label: Induktio, tiedeoppi (151 +)
alternative label: Metatiede (151)
alternative label: Paradigmat, tiede (151 +)
alternative label: Systeemiteoria, tieteenfilosofia (151)
alternative label: Systeemitiede, tieteenfilosofia (151)
alternative label: Tieteen paradigmat (151 +)
alternative label: Tieteenteoria (151 +)
alternative label: Todistusteoria, tiede (151 +)
alternative label: Typologiat, tieteiden järjestelmät (151 +)
alternative label: Bevisteori, vetenskap (151 +) @sv
alternative label: Induktion, vetenskapslära (151 +) @sv
alternative label: Metavetenskap (151) @sv
alternative label: Paradigmer, vetenskap (151 +) @sv
alternative label: Systemteori, vetenskapsfilosofi (151) @sv
alternative label: Typologier, vetenskapernas system (151 +) @sv
alternative label: Vetenskapens paradigm (151 +) @sv
alternative label: Vetenskapsteori (151 +) @sv
broader: TIEDEOPPI
in scheme: URN:NBN:fi:au:hklj:
narrower: Tieteenfilosofia
narrower: Metodologia
notation: 151
preferred label: Philosophy of science. Methodology @en
preferred label: Vetenskapsfilosofi. Metodologi @sv
related: Filosofia. Teoria. Tutkimusmenetelmät
scope note: Teokset, jotka koskevat sekä yleistä tieteenfilosofiaa että tieteen yleistä metodologiaa Tieteiden järjestelmät, jaottelut ja keskinäiset suhteet yleensä Tieteen paradigmat yleensä Tässä ja alaluokissa myös humanististen tieteiden yleinen tieteenfilosofia ja metodologia Erikoisalojen tieteenfilosofia ja metodologia alan mukaisessa luokassa
scope note: Verk som rör både allmän vetenskapsfilosofi och vetenskapens allmänna metodologi Vetenskapernas system, indelningar och inbördes förhållanden Vetenskapens paradigmer i allmänhet Hit och till underklasserna också allmän vetenskapsfilosofi och metodologi inom de humanistiska vetenskaperna Specialområden inom vetenskapsfilosofi och metodologi klassificeras enligt område @sv

Uskontososiologia
type: Class
type: Concept
subclass of: YLEINEN USKONTOTIEDE. YLEINEN USKONNONFILOSOFIA
alternative label: Fanaattisuus, uskontososiologia (208)
alternative label: Fanatismi, uskontososiologia (208)
alternative label: Gurur, uskontososiologia (208)
alternative label: Hengelliset johtajat, uskontososiologia (208)
alternative label: Lahkot, uskontososiologia (208)
alternative label: Maallistuminen (208)
alternative label: Nativistiset liikkeet, uskontososiologia (208)
alternative label: Papisto, uskontososiologia (208)
alternative label: Pappissääty, uskontososiologia (208)
alternative label: Sekularisaatio (208)
alternative label: Sitoutuminen, uskontososiologia (208)
alternative label: Uskonlahkot, uskontososiologia (208)
alternative label: Uskonnollinen käyttäytyminen, uskontososiologia (208)
alternative label: Uskonnollinen syrjintä, uskontososiologia (208)
alternative label: Uskonnolliset johtajat, uskontososiologia (208)
alternative label: Uskonnolliset järjestöt, uskontososiologia (208)
alternative label: Uskonnolliset liikkeet, uskontososiologia (208)
alternative label: Uskonnolliset yhteisöt, uskontososiologia (208)
alternative label: Uskonto, uskontososiologia (208)
alternative label: Uskontodialogi, uskontososiologia (208)
alternative label: Uskontososiologia (208)
alternative label: Andliga ledare, religionssociologi (208) @sv
alternative label: Bindning, social, religionssociologi (208) @sv
alternative label: Fanatism, religionssociologi (208) @sv
alternative label: Guruer, religionssociologi (208) @sv
alternative label: Nativistiska rörelser, religionssociologi (208) @sv
alternative label: Primitiva religioner, olika religioner (208 ... 289 +) @sv
alternative label: Prästerskapet, religionssociologi (208) @sv
alternative label: Prästeståndet, religionssociologi (208) @sv
alternative label: Religion, religionssociologi (208) @sv
alternative label: Religionsdialog, religionssociologi (208) @sv
alternative label: Religionssociologi (208) @sv
alternative label: Religiös diskriminering, religionssociologi (208) @sv
alternative label: Religiösa ledare, religionssociologi (208) @sv
alternative label: Religiösa organisationer, religionssociologi (208) @sv
alternative label: Religiösa rörelser, religionssociologi (208) @sv
alternative label: Religiösa samfund, religionssociologi (208) @sv
alternative label: Religiösa sekter, religionssociologi (208) @sv
alternative label: Religiöst beteende, religionssociologi (208) @sv
alternative label: Sekter, religionssociologi (208) @sv
alternative label: Sekularisation (208) @sv
alternative label: Sekularisering (208) @sv
broader: YLEINEN USKONTOTIEDE. YLEINEN USKONNONFILOSOFIA
in scheme: URN:NBN:fi:au:hklj:
notation: 208
preferred label: Sociology of religion @en
preferred label: Religionssociologi @sv
related: Uskonto- ja maailmankatsomuspsykologia
related: Uskonnonfilosofia
related: Uskonto ja valtio
related: URN:NBN:fi:au:hklj:209
related: URN:NBN:fi:au:hklj:210
scope note: Uskonnollisten ja uskonnottomien yhteisöjen tutkimus Tässä sekä kristittyjä että muita uskonnollisia yhteisöjä koskeva uskontososiologia
scope note: Forskning kring religiösa och religionslösa samfund Hit religionssociologi som rör både kristna och andra religiösa samfund @sv

Esseet
type: Class
type: Concept
subclass of: URN:NBN:fi:au:hklj:210
broader: URN:NBN:fi:au:hklj:210
in scheme: URN:NBN:fi:au:hklj:
notation: 214
preferred label: Essays @en
preferred label: Essäer @sv
related: Kokoomateokset
related: Hartauskirjat
related: Rukouskirjat
related: Saarnat. Postillat. Kristilliset puhe- ja päivänavauskokoelmat
related: URN:NBN:fi:au:hklj:260
scope note: Kristinuskoa tai kristillistä teologiaa koskevat yleiset ja sekasisältöiset esseekokoelmat Kristinuskon tai kristillisen teologian erikoisaloja koskevat esseekokoelmat alan mukaisessa luokassa
scope note: Essäsamlingar med allmänt eller blandat innehåll som handlar om kristendom eller kristen teologi Essäsamlingar som handlar om specialområden inom kristendom eller kristen teologi klassificeras enligt område @sv

Apologetiikka
type: Class
type: Concept
subclass of: KRISTILLINEN DOGMATIIKKA
alternative label: Apologetiikka (239)
alternative label: Armolahjat, kristinusko (239)
alternative label: Glossolalia (239)
alternative label: Ihmeet, kristinusko (239)
alternative label: Ihmeparannus, kristinusko (239)
alternative label: Ihmeteot, kristinusko (239)
alternative label: Ilmestykset, kristinusko, ihmeet (239)
alternative label: Jumalalliset ilmoitukset, kristillinen dogmatiikka (239)
alternative label: Jumalatodistukset, kristinusko (239)
alternative label: Karismaattisuus, armolahjat (239)
alternative label: Kielilläpuhuminen (239)
alternative label: Kristinusko, apologetiikka (239)
alternative label: Kristinuskon puolustaminen (239)
alternative label: Käsillä parantaminen, kristinusko (239)
alternative label: Näyt, kristillinen apologetiikka (239)
alternative label: Paraneminen, ihmeparannus, kristinusko (239)
alternative label: Parannus, ihmeparannus, kristinusko (239)
alternative label: Parantuminen, ihmeparannus, kristinusko (239)
alternative label: Profetiat, kristillinen dogmatiikka (239)
alternative label: Profetismi, armolahjat, kristinusko (239)
alternative label: Profetointi, kristillinen dogmatiikka (239)
alternative label: Pyhäinjäännökset (239)
alternative label: Rukouksella parantaminen, kristinusko (239)
alternative label: Uskonelämä, kristinuskon puolustus (239)
alternative label: Uskonnolliset kokemukset, kristinuskon todistukset (239)
alternative label: Apokalypser, kristendom, under (239) @sv
alternative label: Apologetik (239) @sv
alternative label: Bot, helbrägdagörelse, kristendom (239) @sv
alternative label: Botande genom bön, kristendom (239) @sv
alternative label: Botande genom handpåläggning, kristendom (239) @sv
alternative label: Glossolali (239) @sv
alternative label: Gudsbevis, kristendom (239) @sv
alternative label: Helbrägdagörelse, kristendom (239) @sv
alternative label: Karisma, nådegåvor (239) @sv
alternative label: Kristendom, apologetik (239) @sv
alternative label: Kristendomens försvar (239) @sv
alternative label: Nådegåvor, kristendom (239) @sv
alternative label: Profeterande, kristen dogmatik (239) @sv
alternative label: Profetior, kristen dogmatik (239) @sv
alternative label: Profetism, nådegåvor, kristendom (239) @sv
alternative label: Religiösa upplevelser, vittnesbörd i kristendomen (239) @sv
alternative label: Reliker (239) @sv
alternative label: Syner, kristen apologetik (239) @sv
alternative label: Tillfrisknande, helbrägdagörelse, kristendom (239) @sv
alternative label: Trosliv, apologetik (239) @sv
alternative label: Tungomålstalande (239) @sv
alternative label: Under, kristendom (239) @sv
alternative label: Underverk, kristendom (239) @sv
alternative label: Återhämtning, helbrägdagörelse, kristendom (239) @sv
broader: KRISTILLINEN DOGMATIIKKA
in scheme: URN:NBN:fi:au:hklj:
notation: 239
preferred label: Apologetics @en
preferred label: Apologetik @sv
related: URN:NBN:fi:au:hklj:192
related: Jumalan olemus
related: Eskatologia
related: URN:NBN:fi:au:hklj:615
scope note: Kristinuskon puolustus. Kristinuskon todistukset Ihmeet, ihmeparannukset, ennustukset, profetointi, kielillä puhuminen ja pyhäinjäännökset kristinuskon kannalta
scope note: Försvaret av den kristna förkunnelsen. Kristen vittnesbörd Under, helbrägdagörelse genom under, förutsägelser, profeterande, tungomålstalande och reliker ur kristen synvinkel @sv

Kirkolliset esineet ja symbolit
type: Class
type: Concept
subclass of: KÄYTÄNNÖLLINEN TEOLOGIA
alternative label: Alttarit, kristilliset (246)
alternative label: Alttaritila, kristilliset (246)
alternative label: Alttarivaatteet (246)
alternative label: Astiat, kirkolliset esineet (246)
alternative label: Ehtoollisastiat (246)
alternative label: Ikonit, kristillinen symboliikka (246)
alternative label: Ikonostaasit, kristillinen symboliikka (246)
alternative label: Kappelit, sisustus, esineet (246)
alternative label: Kastealtaat (246)
alternative label: Kastemaljat (246)
alternative label: Kellot, kirkonkellot (246)
alternative label: Kirkkolaivat (246)
alternative label: Kirkkotaide, kirkolliset esineet (246)
alternative label: Kirkkotekstiilit (246)
alternative label: Kirkolliset esineet (246)
alternative label: Kirkolliset symbolit (246)
alternative label: Kirkon sisustus (246)
alternative label: Kirkonkellot (246)
alternative label: Koristeveisto, kirkolliset esineet (246)
alternative label: Kristillinen symboliikka (246)
alternative label: Kristillinen taide, kirkolliset esineet (246)
alternative label: Krusifiksit, kirkolliset esineet (246)
alternative label: Kuvaseinät, kristillinen symboliikka (246)
alternative label: Kuviot, kristilliset symbolit (246)
alternative label: Liturgiset esineet (246)
alternative label: Liturgiset symbolit (246)
alternative label: Liturgiset värit, liturgiset symbolit (246)
alternative label: Lukusymboliikka, kristillinen symboliikka (246)
alternative label: Maljakot, kirkolliset esineet (246)
alternative label: Messukasukat (246)
alternative label: Pyhäköt, kirkolliset esineet (246)
alternative label: Pyhätöt, kirkolliset esineet (246)
alternative label: Rasiat, kirkolliset esineet (246)
alternative label: Risti, kristilliset symbolit (246)
alternative label: Ristit, kirkolliset esineet (246)
alternative label: Ristit, kristilliset symbolit (246)
alternative label: Rukousnauhat (246)
alternative label: Saarnatuolit (246)
alternative label: Sakraaliesineet (246)
alternative label: Siunauskappelit, sisustus, esineet (246)
alternative label: Symboliikka, kirkollinen (246)
alternative label: Symbolit, kirkolliset, kristilliset (246)
alternative label: Tuli, kristillinen symboliikka (246)
alternative label: Tuomiokirkot, kirkolliset esineet (246)
alternative label: Uskonnollinen taide, kirkolliset esineet (246)
alternative label: Uskonnolliset symbolit, kristilliset (246)
alternative label: Vertauskuvat, kirkolliset, kristilliset (246)
alternative label: Votiivit, kirkolliset esineet (246)
alternative label: Altare, kristna (246) @sv
alternative label: Altarkläden (246) @sv
alternative label: Askar, kyrkliga föremål (246) @sv
alternative label: Begravningskapell, inredning, föremål (246) @sv
alternative label: Domkyrkor, kyrkliga föremål (246) @sv
alternative label: Dopfuntar (246) @sv
alternative label: Eld, kristen symbolik (246) @sv
alternative label: Figurer, kristliga symboler (246) @sv
alternative label: Helgedomar, kyrkliga föremål (246) @sv
alternative label: Ikoner, kristen symbolik (246) @sv
alternative label: Ikonostaser, kristen symbolik (246) @sv
alternative label: Kapell, inredning, föremål (246) @sv
alternative label: Klockor, kyrkklockor (246) @sv
alternative label: Konstslöjd, kyrkliga föremål (246) @sv
alternative label: Kors, kristna symboler (246) @sv
alternative label: Kors, kyrkliga föremål (246) @sv
alternative label: Korset, kristna symboler (246) @sv
alternative label: Kristen konst, kyrkliga föremål (246) @sv
alternative label: Kristen symbolik (246) @sv
broader: KÄYTÄNNÖLLINEN TEOLOGIA
in scheme: URN:NBN:fi:au:hklj:
notation: 246
related: Symbolit. Koodit. Merkkijärjestelmät
related: URN:NBN:fi:au:hklj:209
related: Kirkot ja muut uskonnolliset rakennukset
related: URN:NBN:fi:au:hklj:742
related: Ikonimaalaus
scope note: Kirkolliset ja liturgiset esineet ja välineet. Kirkolliset ja kristilliset symbolit Kirkolliset tekstiilit, astiat, kastemaljat, alttarit, saarnastuolit, kirkonkellot, kirkkolaivat, kirkkojen koriste-esineet ja sisustus sekä kirkolliselta että taidehistorialliselta kannalta Jos teoksessa on sekä kirkollisia esineitä ja symboleja että kirkkoarkkitehtuuria, on etusija luokalla 726.4
scope note: Kyrkliga och liturgiska föremål och utensilier. Kyrkliga och kristna symboler Kyrkotextilier, kärl, dopfuntar, altaren, predikstolar, kyrkklockor, kyrkskepp, kyrkliga prydnadsföremål och interiörer ur både kyrklig och konsthistorisk synvinkel Om verket handlar om såväl kyrkliga föremål och symboler som kyrkoarkitektur ges företräde åt klass 726.4 @sv

Roomalaiskatolinen kirkko
type: Class
type: Concept
subclass of: URN:NBN:fi:au:hklj:260
alternative label: Aneet, katolinen kirkko (262)
alternative label: Benediktiinit, munkkijärjestöt (262)
alternative label: Birgittalaiset, nunnajärjestöt (262)
alternative label: Dominikaanit, munkkijärjestöt (262)
alternative label: Fransiskaanit, munkkijärjestöt (262)
alternative label: Jesuiitat (262)
alternative label: Kardinaalit, katolinen kirkko (262)
alternative label: Kartusiaanit, munkkijärjestöt (262)
alternative label: Katolinen kirkko, roomalaiskatolinen (262)
alternative label: Katoliset, roomalaiskatoliset (262)
alternative label: Katolisuus, roomalaiskatolisuus (262)
alternative label: Kerjäläismunkistot, katolinen kirkko (262)
alternative label: Kerjäläisveljeskunnat, katolinen kirkko (262)
alternative label: Kerjäläisveljestöt, katolinen kirkko (262)
alternative label: Kiirastuli, roomalaiskatolinen kirkko (262)
alternative label: Kirkkokunnat, roomalaiskatolinen kirkko (262)
alternative label: Klarissalaiset, nunnajärjestöt, katoliset (262)
alternative label: Luostarilaitos, katolinen (262)
alternative label: Luostarit, katoliset (262)
alternative label: Mozarabit, kirkkokunnat, roomalaiskatolinen kirkko (262)
alternative label: Munkkijärjestöt, katoliset (262)
alternative label: Mystikot, katolinen kirkko (262)
alternative label: Nunnajärjestöt, katoliset (262)
alternative label: Paavinistuin (262)
alternative label: Paavit, katolinen kirkko (262)
alternative label: Paavius, roomalaiskatolinen kirkko (262)
alternative label: Pannaanjulistaminen (262)
alternative label: Patriarkat, katolinen kirkko (262)
alternative label: Pyhiinvaellukset, katolinen kirkko (262)
alternative label: Pyhiinvaeltajat, katolinen kirkko (262)
alternative label: Pyhimykset, katoliset (262)
alternative label: Pyhät henkilöt, katoliset (262)
alternative label: Rippi, katolinen kirkko (262)
alternative label: Rippisalaisuus, katolinen kirkko (262)
alternative label: Ristisaatot, katolinen kirkko (262)
alternative label: Roomalaiskatolinen kirkko (262)
alternative label: Synninpäästö, katolinen kirkko (262)
alternative label: Sääntökunnat, katolinen kirkko (262)
alternative label: Vatikaani, katolinen kirkko (262)
alternative label: Veljeskunnat, katoliset (262)
alternative label: Viimeinen voitelu, katolinen kirkko (262)
alternative label: Avlat, katolska kyrkan (262) @sv
alternative label: Bannlysning (262) @sv
alternative label: Benediktiner, munkordnar (262) @sv
alternative label: Bikt, katolska kyrkan (262) @sv
alternative label: Bikthemlighet , katolska kyrkan (262) @sv
alternative label: Birgittiner, nunneordnar (262) @sv
alternative label: Brödraskap, katolska (262) @sv
alternative label: Dominikaner, munkordnar (262) @sv
alternative label: Franciskaner, munkordnar (262) @sv
alternative label: Helgon, katolska (262) @sv
alternative label: Heliga personer, katolska (262) @sv
alternative label: Jesuiterna (262) @sv
alternative label: Kardinaler, katolska kyrkan (262) @sv
alternative label: Kartusianer, munkordnar (262) @sv
alternative label: Katolicism, romersk-katolicism (262) @sv
alternative label: Katoliker, romersk-katolska (262) @sv
alternative label: Katolska kyrkan, romersk-katolska (262) @sv
alternative label: Klarissor, nunneordnar, katolska (262) @sv
alternative label: Kloster, romersk-katolska (262) @sv
alternative label: Klosterväsen, romersk-katolskt (262) @sv
alternative label: Korsprocessioner, katolska kyrkan (262) @sv
alternative label: Kyrkosamfund, romersk-katolska kyrkan (262) @sv
alternative label: Mozaraber, kyrkosamfund, romersk-katolska kyrkan (262) @sv
alternative label: Munkordnar, romersk-katolska (262) @sv
alternative label: Mystiker, romersk-katolska kyrkan (262) @sv
alternative label: Nunneordnar, katolska (262) @sv
broader: URN:NBN:fi:au:hklj:260
in scheme: URN:NBN:fi:au:hklj:
notation: 262
related: RAAMATTU. RAAMATUNTUTKIMUS
related: KRISTILLINEN DOGMATIIKKA
related: KÄYTÄNNÖLLINEN TEOLOGIA
related: URN:NBN:fi:au:hklj:262.09
related: URN:NBN:fi:au:hklj:992
scope note: Roomalaiskatolista kirkkoa, sen organisaatiota tai toimintaa koskevat yleisteokset Roomalaiskatolisen kirkon erikoisaloja koskevat teokset alan mukaan luokissa 220-248
scope note: Allmänna verk som rör den romersk-katolska kyrkan, dess organisation eller verksamhet Frågor som rör specialområden inom den romersk-katolska kyrkan klassificeras enligt område i klasserna 220-248 @sv

Ortodoksinen kirkko
type: Class
type: Concept
subclass of: URN:NBN:fi:au:hklj:260
alternative label: Arkkimandriitat (263)
alternative label: Bysanttilainen kirkko (263)
alternative label: Itsehallinto, kirkollinen, ortodoksinen (263)
alternative label: Julkisyhteisöt, kirkot, ortodoksinen (263)
alternative label: Kansankirkko, ortodoksinen kirkko (263)
alternative label: Katolinen kirkko, kreikkalaiskatolinen (263)
alternative label: Katoliset, kreikkalaiskatoliset (263)
alternative label: Katolisuus, kreikkalaiskatolisuus (263)
alternative label: Kerjäläismunkistot, ortodoksinen kirkko (263)
alternative label: Kerjäläisveljeskunnat, ortodoksinen kirkko (263)
alternative label: Kerjäläisveljestöt, ortodoksinen kirkko (263)
alternative label: Kirkkokunnat, ortodoksinen kirkko (263)
alternative label: Kreikkalaiskatolinen kirkko (263)
alternative label: Kristinoppikoulu, kirkon kasvatustoiminta, ortodoksinen kirkko (263)
alternative label: Luostarilaitos, ortodoksinen (263)
alternative label: Luostarit, ortodoksiset (263)
alternative label: Munkkijärjestöt, ortodoksiset (263)
alternative label: Mystikot, ortodoksinen kirkko (263)
alternative label: Nunnajärjestöt, ortodoksiset (263)
alternative label: Ortodoksinen kirkko (263)
alternative label: Ortodoksisuus, ortodoksinen kirkko (263)
alternative label: Patriarkaatti, ortodoksinen kirkko (263)
alternative label: Patriarkat, ortodoksinen kirkko (263)
alternative label: Praasniekat, ortodoksinen kirkko (263)
alternative label: Pyhiinvaellukset, ortodoksinen kirkko (263)
alternative label: Pyhiinvaeltajat, ortodoksinen kirkko (263)
alternative label: Pyhimykset, ortodoksiset (263)
alternative label: Pyhät henkilöt, ortodoksiset (263)
alternative label: Pyhät, ortodoksiset (263)
alternative label: Raskolnikot (263)
alternative label: Rippi, ortodoksinen kirkko (263)
alternative label: Rippisalaisuus, ortodoksinen kirkko (263)
alternative label: Ristisaatot, ortodoksinen kirkko (263)
alternative label: Suomi, ortodoksinen kirkko (263)
alternative label: Synninpäästö, ortodoksinen kirkko (263)
alternative label: Vanhauskoiset (263)
alternative label: Veljeskunnat, ortodoksiset (263)
alternative label: Arkimandriter (263) @sv
alternative label: Bikt, ortodoxa kyrkan (263) @sv
alternative label: Bikthemlighet , ortodoxa kyrkan (263) @sv
alternative label: Brödraskap, ortodoxa (263) @sv
alternative label: Bysantinska kyrkan (263) @sv
alternative label: Finland, ortodoxa kyrkan (263) @sv
alternative label: Folkkyrka, ortodoxa kyrkan (263) @sv
alternative label: Gammaltroende (263) @sv
alternative label: Grekisk-katolska kyrkan (263) @sv
alternative label: Helgon, ortodoxa (263) @sv
alternative label: Heliga personer, ortodoxa (263) @sv
alternative label: Katolicism, grekisk-katolicism (263) @sv
alternative label: Katoliker, grekisk-katolska (263) @sv
alternative label: Katolska kyrkan, grekisk-katolska (263) @sv
alternative label: Kloster, ortodoxa (263) @sv
alternative label: Klosterväsen, ortodoxt (263) @sv
alternative label: Korsprocessioner, ortodoxa kyrkan (263) @sv
alternative label: Kristendomsskola, kyrklig fostran, ortodoxa kyrkan (263) @sv
alternative label: Kyrkosamfund, ortodoxa kyrkan (263) @sv
alternative label: Munkordnar, ortodoxa (263) @sv
alternative label: Mystiker, ortodoxa kyrkan (263) @sv
alternative label: Nunneordnar, ortodoxa (263) @sv
alternative label: Offentligrättsliga samfund, kyrkor, ortodoxa (263) @sv
alternative label: Ortodoxa kyrkan (263) @sv
alternative label: Ortodoxi, ortodoxa kyrkan (263) @sv
alternative label: Patriarkat, ortodoxa kyrkan (263) @sv
alternative label: Patriarker, ortodoxa kyrkan (263) @sv
alternative label: Pilgrimer, ortodoxa kyrkan (263) @sv
alternative label: Pilgrimsfärder, ortodoxa kyrkan (263) @sv
alternative label: Prasniek, ortodoxa kyrkan (263) @sv
broader: URN:NBN:fi:au:hklj:260
in scheme: URN:NBN:fi:au:hklj:
notation: 263
related: RAAMATTU. RAAMATUNTUTKIMUS
related: KRISTILLINEN DOGMATIIKKA
related: KÄYTÄNNÖLLINEN TEOLOGIA
related: URN:NBN:fi:au:hklj:263.09
related: URN:NBN:fi:au:hklj:992
scope note: Ortodoksista kirkkoa, sen organisaatiota tai toimintaa koskevat yleisteokset Ortodoksisen kirkon erikoisaloja koskevat teokset alan mukaan luokissa 220-248
scope note: Allmänna verk som rör den ortodoxa kyrkan, dess organisation eller verksamhet Frågor som rör specialområden inom den ortodoxa kyrkan klassificeras enligt område i klasserna 220-248 @sv

Muut kristillisperäiset yhteisöt
type: Class
type: Concept
subclass of: URN:NBN:fi:au:hklj:260
alternative label: Antitrinitaarit (269)
alternative label: Christian science (269)
alternative label: Hartevalaisuus (269)
alternative label: Jehovan todistajat (269)
alternative label: Kastajaliikkeet, kristillisperäiset yhteisöt (269)
alternative label: Kveekarit (269)
alternative label: MRA (269)
alternative label: Moraalinen varustautuminen (269)
alternative label: Moral Re-Armament (269)
alternative label: Mormonit (269)
alternative label: Myöhempien aikojen pyhien Jeesuksen Kristuksen kirkko (269)
alternative label: Oxfordin ryhmäliike (269)
alternative label: Russellilaisuus (269)
alternative label: Shakers (269)
alternative label: Unitaarit (269)
alternative label: Unitaariuniversalistit (269)
alternative label: Uudestikastajat, kristillisperäiset yhteisöt (269)
alternative label: Uudet uskonnot, kristillisperäiset yhteisöt (269)
alternative label: Uususkonnollisuus, kristillisperäiset yhteisöt (269)
alternative label: Vapaakatolisuus (269)
alternative label: Antitrinitarier (269) @sv
alternative label: Döparrörelser, samfund med kristet ursprung (269) @sv
alternative label: Frikatolicism (269) @sv
alternative label: Jehovas vittnen (269) @sv
alternative label: Jesu Kristi Kyrka av Sista Dagars Heliga (269) @sv
alternative label: Kväkare (269) @sv
alternative label: Moralisk upprustning (269) @sv
alternative label: Mormoner (269) @sv
alternative label: Nya religioner, samfund med kristet ursprung (269) @sv
alternative label: Nyreligiositet, samfund med kristet ursprung (269) @sv
alternative label: Oxfordgrupprörelsen (269) @sv
alternative label: Russellianism (269) @sv
alternative label: Unitarierna (269) @sv
alternative label: Universalister (269) @sv
alternative label: Vederdöpare, samfund med kristet ursprung (269) @sv
broader: URN:NBN:fi:au:hklj:260
in scheme: URN:NBN:fi:au:hklj:
notation: 269
preferred label: Other denominations of Christian origin @en
preferred label: Andra samfund av kristet ursprung @sv
related: RAAMATTU. RAAMATUNTUTKIMUS
related: KRISTILLINEN DOGMATIIKKA
related: KÄYTÄNNÖLLINEN TEOLOGIA
related: URN:NBN:fi:au:hklj:269.09
related: URN:NBN:fi:au:hklj:280
scope note: Muita kristillisperäisiä yhteisöjä, niiden organisaatiota ja toimintaa koskevat yleisteokset Antitrinitaarit. Christian science. Jehovan todistajat. Kveekarit. Mormonit. MRA. Unitaarit. Vapaakatolinen kirkko Kristillisperäisten yhteisöjen erikoisaloja koskevat teokset alan mukaan luokissa 220-248
scope note: Allmänna verk som rör andra samfund av kristet ursprung, deras organisation eller verksamhet Antitrinitarer. Christian science. Jehovas vittnen. Kväkare. Mormoner. MRA. Unitarer. Den fria katolska kyrkan Frågor som rör specialområden inom andra samfund av kristet ursprung klassificeras enligt område i klasserna 220-248 @sv

Sosiaalivakuutus
type: Class
type: Concept
subclass of: Vakuutustoimi
alternative label: Ansioeläkkeet (372.1)
alternative label: Ansioturva (372.1)
alternative label: Eläkeikä (372.1)
alternative label: Eläkejärjestelmät (372.1)
alternative label: Eläkekarttuma, eläkepolitiikka (372.1)
alternative label: Eläkekarttuma, eläkkeet (372.1)
alternative label: Eläkekassat (372.1)
alternative label: Eläkekertymä, eläkepolitiikka (372.1)
alternative label: Eläkekertymä, eläkkeet (372.1)
alternative label: Eläkelaitokset (372.1)
alternative label: Eläkeläiset, eläkepolitiikka (372.1)
alternative label: Eläkeläiset, eläkkeet (372.1)
alternative label: Eläkemaksut, eläkepolitiikka (372.1)
alternative label: Eläkepolitiikka (372.1)
alternative label: Eläkerahastot (372.1)
alternative label: Eläkesäästäminen (372.1)
alternative label: Eläkesäätiöt (372.1)
alternative label: Eläketurvapolitiikka (372.1)
alternative label: Eläkevakuutus (372.1)
alternative label: Eläkevakuutusmaksut, eläkepolitiikka (372.1)
alternative label: Eläkkeelle siirtyminen, eläkepolitiikka (372.1)
alternative label: Eläkkeelle siirtyminen, eläkkeet (372.1)
alternative label: Eläkkeet (372.1)
alternative label: Eläkkeet, eläkepolitiikka (372.1)
alternative label: Eläköityminen, eläkepolitiikka (372.1)
alternative label: Hoitotuki (372.1)
alternative label: Kansaneläkkeet (372.1)
alternative label: Kansaneläkkeet, sosiaalivakuutus (372.1)
alternative label: Korvaukset, työttömyyskorvaus (372.1)
alternative label: Kunnalliset eläkkeet (372.1)
alternative label: Kuntoutustuki (372.1)
alternative label: Lakisääteinen eläkevakuutus (372.1)
alternative label: Lakisääteinen eläkevakuutus, eläkepolitiikka (372.1)
alternative label: Leskeneläkkeet (372.1)
alternative label: Lesket, perhe-eläkkeet (372.1)
alternative label: Lisäeläkkeet (372.1)
alternative label: Luopuminen, luopumiseläkkeet (372.1)
alternative label: Luopumiseläkkeet (372.1)
alternative label: Luopumiskorvaus, eläkejärjestelmät (372.1)
alternative label: Luopumistuki, eläkejärjestelmät (372.1)
alternative label: Luopumistukijärjestelmät (372.1)
alternative label: Maanvuokra, maapolitiikka (372.1)
alternative label: Maanvuokraus, maapolitiikka (372.1)
alternative label: Osa-aikaeläkkeet (372.1)
alternative label: Osasairauspäivärahat (372.1)
alternative label: Osatyökyvyttömyyseläkkeet (372.1)
alternative label: Ostoeläke (372.1)
alternative label: Palkkaturva (372.1)
alternative label: Perhe-eläkkeet (372.1)
alternative label: Pitkäaikaistyöttömät, työttömyysturva (372.1)
alternative label: Päivärahat, sosiaalivakuutus (372.1)
alternative label: Rintamasotilaseläkkeet (372.1)
alternative label: Sairaudenturva (372.1)
alternative label: Sairauskassat (372.1)
alternative label: Sairauspäivärahat (372.1)
alternative label: Sairausvakuutus (372.1)
alternative label: Sosiaalivakuutus (372.1)
alternative label: Sotilasvammavakuutus (372.1)
alternative label: Sukupolvenvaihdoseläkkeet, eläkepolitiikka (372.1)
alternative label: Säästöeläke (372.1)
alternative label: Takuueläke, eläkepolitiikka (372.1)
alternative label: Toimintakyky, työkyvyttömyyden turva (372.1)
alternative label: Työeläkekassat (372.1)
alternative label: Työeläkelaitokset, (372.1)
alternative label: Työeläkerahastot (372.1)
alternative label: Työeläkkeet (372.1)
alternative label: Työjärjestys, työelämä (372.1 +)
broader: Vakuutustoimi
in scheme: URN:NBN:fi:au:hklj:
notation: 372.1
related: Kehityspsykologia. Eri ikäkausien psykologia
related: URN:NBN:fi:au:hklj:332.22
related: Kauppaoikeus. Yhtiölainsäädäntö. Pankki- ja vakuutuslainsäädäntö
related: Osuustoiminta
related: URN:NBN:fi:au:hklj:371
scope note: Sairauden, vanhuuden ja työkyvyttömyyden turva. Työttömyysturva Eläketurvapolitiikka. Eläkevakuutus. Kansaneläke. Perhe-eläke. Työeläke. Sairausvakuutus. Eläkevakuutus Eläkkeelle siirtyminen
scope note: Trygghet vid sjukdom, ålderdom och arbetsoförmåga. Utkomstskydd för arbetslösa Pensionsskyddspolitik. Pensionsskydd. Folkpension. Arbetspension. Sjukförsäkring. Pensionsförsäkring Pensioneringstiden @sv

Maailmankartat. Maailmankartastot
type: Class
type: Concept
subclass of: URN:NBN:fi:au:hklj:400
alternative label: Atlakset, maailmankartastot (404)
alternative label: Hakukartat, maailmankartat (404)
alternative label: Ilmakuvakartat, maailmankartat (404)
alternative label: Kartastot, maailmankartat (404)
alternative label: Kartat, maailmankartat (404)
alternative label: Karttapallot (404)
alternative label: Maa, planeetta, maailmankartat (404)
alternative label: Maailma, maailmankartat (404)
alternative label: Maailmankartat (404)
alternative label: Maailmankartat, maantiede, matkat (404)
alternative label: Maapallo, maailmankartat (404)
alternative label: Maastokartat (404)
alternative label: Maastokartat, maantiede, matkat (404)
alternative label: Matkailukartat (404)
alternative label: Matkailukartat, maantiede, matkat (404)
alternative label: Merikartat (404)
alternative label: Merikortit (404)
alternative label: Opaskartat (404)
alternative label: Osoitekartat (404)
alternative label: Pallokartat (404)
alternative label: Sisävesiväylät, merikortit (404)
alternative label: Teemakartat (404)
alternative label: Tiekartat (404)
alternative label: Topografiset kartat (404)
alternative label: Topografiset kartat, maantiede, matkat (404)
alternative label: Välimatkat, kartat (404)
alternative label: Yleiskartoitukset, kartat (404)
alternative label: Adresskartor (404) @sv
alternative label: Allmänna kartläggningar, kartor (404) @sv
alternative label: Atlaser, världsatlaser (404) @sv
alternative label: Distanser, kartor (404) @sv
alternative label: Flygbildskartor, världskartor (404) @sv
alternative label: Globkartor (404) @sv
alternative label: Guidekartor (404) @sv
alternative label: Indexkartor, världskartor (404) @sv
alternative label: Insjöfarleder, sjökort (404) @sv
alternative label: Jorden, världskartor (404) @sv
alternative label: Jordglober (404) @sv
alternative label: Jordklotet, världskartor (404) @sv
alternative label: Kartor, världskartor (404) @sv
alternative label: Kartverk, världskartor (404) @sv
alternative label: Sjökartor (404) @sv
alternative label: Sjökort (404) @sv
alternative label: Tematiska kartor (404) @sv
alternative label: Terrängkartor (404) @sv
alternative label: Terrängkartor, geografi, resor (404) @sv
alternative label: Topografiska kartor (404) @sv
alternative label: Topografiska kartor, geografi, resor (404) @sv
alternative label: Turistkartor (404) @sv
alternative label: Turistkartor, geografi, resor (404) @sv
alternative label: Vägkartor (404) @sv
alternative label: Världen, världskartor (404) @sv
alternative label: Världskartor (404) @sv
alternative label: Världskartor, geografi, resor (404) @sv
broader: URN:NBN:fi:au:hklj:400
in scheme: URN:NBN:fi:au:hklj:
notation: 404
preferred label: World maps. Map books @en
preferred label: Världskartor. Kartböcker @sv
related: Kartografia
related: URN:NBN:fi:au:hklj:487.084
related: URN:NBN:fi:au:hklj:520.084
related: Merenkulkuoppi
related: Historialliset kartat. Historiallinen maantiede
scope note: Yleiset maailmankartat ja -kartastot Tiettyä maanosaa, maata tai aluetta koskevat kartat, kartastot ja merikortit alueen mukaisessa luokassa 410.084-459.084 Eri aihepiireihin liittyvät kartat ja kartastot alan mukaisessa luokassa
scope note: Allmänna världskartor och kartböcker Kartor, kartböcker och sjökort som rör bestämda världsdelar, länder eller regioner klassificeras enligt geografiskt område i klasserna 410.084-459.084 Kartor och kartböcker med olika teman klassificeras enligt ämnesområde @sv

Kausijulkaisut
type: Class
type: Concept
subclass of: URN:NBN:fi:au:hklj:400
broader: URN:NBN:fi:au:hklj:400
in scheme: URN:NBN:fi:au:hklj:
notation: 405
preferred label: Serial publications @en
preferred label: Seriella publikationer @sv
related: Merenkulkuoppi
scope note: Maantiedettä tai maantietoa koskevat yleiset kausijulkaisut Eri maantieteen aloja tai eri maantieteellisiä alueita koskevat kausijulkaisut alan tai alueen mukaisessa luokassa
scope note: Allmänna seriella publikationer som handlar om geografi Seriella publikationer som handlar om olika ämnesområden inom geografi eller olika geografiska områden klassificeras enligt ämnesområde eller geografiskt område @sv

Kokoomateokset
type: Class
type: Concept
subclass of: URN:NBN:fi:au:hklj:400
broader: URN:NBN:fi:au:hklj:400
in scheme: URN:NBN:fi:au:hklj:
narrower: Tilastot. Taulukot
narrower: Museot. Arkistot. Kokoelmat. Näyttelyt
notation: 408
preferred label: Compilations. Polygraphies @en
preferred label: Samlingsverk. Polygrafier @sv
related: Merenkulkuoppi
scope note: Maantiedettä tai maantietoa koskevat yleiset tai sekasisältöiset kokoomateokset sekä sekasisältöiset essee-, puhe- ja artikkelikokoelmat Eri maantieteen aloja tai eri maantieteellisiä alueita koskevat kokoomateokset ym. alan mukaisessa luokassa Jos teoksessa on sekä maantiedettä että historiaa, on etusija maantieteen luokalla
scope note: Samlingsverk och polygrafier med allmänt eller blandat innehåll samt essä- och artikelsamlingar samt samlingar av tal med blandat innehåll som handlar om geografi Samlingsverk, polygrafier o.dyl. som handlar om olika ämnesområden inom geografi eller olika geografiska områden klassificeras enligt ämnesområde Om verket handlar om både geografi och historia ges företräde åt klassen för geografi @sv

Helsinki. Pääkaupunkiseutu
type: Class
type: Concept
subclass of: Uusimaa
alternative label: Espoo (412.11)
alternative label: Espoo, maantiede, matkat (412.11)
alternative label: Helsinki, ympäristöineen (412.11)
alternative label: Helsinki, ympäristöineen, maantiede, matkat (412.11)
alternative label: Kauniainen (412.11)
alternative label: Kauniainen, maantiede, matkat (412.11)
alternative label: Pääkaupunkiseutu (412.11)
alternative label: Pääkaupunkiseutu, maantiede, matkat (412.11)
alternative label: Vantaa (412.11)
alternative label: Vantaa, maantiede, matkat (412.11)
alternative label: Esbo (412.11) @sv
alternative label: Esbo, geografi, resor (412.11) @sv
alternative label: Grankulla (412.11) @sv
alternative label: Grankulla, geografi, resor (412.11) @sv
alternative label: Helsingfors, med omnejd (412.11) @sv
alternative label: Helsingfors, med omnejd, geografi, resor (412.11) @sv
alternative label: Huvudstadsregion (412.11) @sv
alternative label: Huvudstadsregion, geografi, resor (412.11) @sv
alternative label: Vanda (412.11) @sv
alternative label: Vanda, geografi, resor (412.11) @sv
broader: Uusimaa
in scheme: URN:NBN:fi:au:hklj:
notation: 412.11
preferred label: Helsinki. Metropolitan area @en
preferred label: Helsingfors. Huvudstadsregionen @sv
related: Helsinki. Pääkaupunkiseutu
related: URN:NBN:fi:au:hklj:411
related: URN:NBN:fi:au:hklj:460
related: URN:NBN:fi:au:hklj:920
scope note: Espoo. Vantaa. Kauniainen
scope note: Esbo. Vanda. Grankulla @sv

Etelä-Savo
type: Class
type: Concept
subclass of: Suomi
alternative label: Etelä-Savo (412.6)
alternative label: Etelä-Savo, maantiede, matkat (412.6)
alternative label: Mikkelin lääni (412.6)
alternative label: Mikkelin lääni, maantiede, matkat (412.6)
alternative label: Savo (412.6)
alternative label: Savo, Etelä-Savo (412.6)
alternative label: S:t Michels län (412.6) @sv
alternative label: S:t Michels län, geografi, resor (412.6) @sv
alternative label: Savolax (412.6) @sv
alternative label: Savolax, Södra Savolax (412.6) @sv
alternative label: Södra Savolax (412.6) @sv
alternative label: Södra Savolax, geografi, resor (412.6) @sv
broader: Suomi
in scheme: URN:NBN:fi:au:hklj:
notation: 412.6
preferred label: Södra Savolax @sv
related: URN:NBN:fi:au:hklj:411
related: URN:NBN:fi:au:hklj:460
related: URN:NBN:fi:au:hklj:920
related: URN:NBN:fi:au:hklj:929
scope note: Mikkelin lääni Savoa koskevat yleisteokset
scope note: S:t Michels län Allmänna verk som rör Savolax @sv

Saksa
type: Class
type: Concept
subclass of: EUROOPPA
alternative label: BRD (414 +)
alternative label: BRD, maantiede, matkat (414 +)
alternative label: Keski-Eurooppa, Saksa (414 +)
alternative label: Osavaltiot, Saksan Liittotasavalta (414 +)
alternative label: Preussi (414)
alternative label: Preussi, maantiede, matkat (414)
alternative label: Saksa (414 +)
alternative label: Saksa, maantiede, matkat (414 +)
alternative label: Saksalaiset, Saksa (414 +)
alternative label: BRD, geografi, resor (414 +) @sv
alternative label: Delstater, Förbundsrepubliken Tyskland (414 +) @sv
alternative label: Mellaneuropa, Tyskland (414 +) @sv
alternative label: Preussen (414) @sv
alternative label: Preussen, geografi, resor (414) @sv
alternative label: Tyskar, Tyskland (414 +) @sv
alternative label: Tyskland (414 +) @sv
alternative label: Tyskland, geografi, resor (414 +) @sv
broader: EUROOPPA
in scheme: URN:NBN:fi:au:hklj:
narrower: Berliini
notation: 414
preferred label: Germany @en
preferred label: Tyskland @sv
related: Keski-Eurooppa
related: URN:NBN:fi:au:hklj:460
related: SAKSAN HISTORIA

Pohjois-Irlanti
type: Class
type: Concept
subclass of: Irlanti
alternative label: Pohjois-Irlanti (417.22)
alternative label: Pohjois-Irlanti, maantiede, matkat (417.22)
alternative label: Ulster (417.22)
alternative label: Ulster, maantiede, matkat (417.22)
alternative label: Nordirland (417.22) @sv
alternative label: Nordirland, geografi, resor (417.22) @sv
alternative label: Ulster, geografi, resor (417.22) @sv
broader: Irlanti
in scheme: URN:NBN:fi:au:hklj:
notation: 417.22
preferred label: Northern Ireland @en
preferred label: Nordirland @sv
related: Iso-Britannia
related: URN:NBN:fi:au:hklj:460
related: BRITTEIN SAARTEN HISTORIA
related: Irlannin historia
related: Pohjois-Irlannin historia

Espanja
type: Class
type: Concept
subclass of: Pyreneiden niemimaa
alternative label: Baleaarit (419.11)
alternative label: Baleaarit, maantiede, matkat (419.11)
alternative label: Baskimaa (419.11)
alternative label: Baskimaa, maantiede, matkat (419.11)
alternative label: Espanja (419.11)
alternative label: Espanja, maantiede, matkat (419.11)
alternative label: Espanjalaiset (419.11)
alternative label: Espanjalaiset, maantiede, matkat (419.11)
alternative label: Gibraltar (419.11)
alternative label: Gibraltar, maantiede, matkat (419.11)
alternative label: Ibiza (419.11)
alternative label: Ibiza, maantiede, matkat (419.11)
alternative label: Katalonia (419.11)
alternative label: Katalonia, maantiede, matkat (419.11)
alternative label: Mallorca (419.11)
alternative label: Mallorca, maantiede, matkat (419.11)
alternative label: Balearerna (419.11) @sv
alternative label: Balearerna, geografi, resor (419.11) @sv
alternative label: Baskien (419.11) @sv
alternative label: Baskien, geografi, resor (419.11) @sv
alternative label: Gibraltar, geografi, resor (419.11) @sv
alternative label: Ibiza, geografi, resor (419.11) @sv
alternative label: Katalonien (419.11) @sv
alternative label: Katalonien, geografi, resor (419.11) @sv
alternative label: Mallorca, geografi, resor (419.11) @sv
alternative label: Spanien (419.11) @sv
alternative label: Spanien, geografi, resor (419.11) @sv
alternative label: Spanjorer (419.11) @sv
alternative label: Spanjorer, geografi, resor (419.11) @sv
broader: Pyreneiden niemimaa
in scheme: URN:NBN:fi:au:hklj:
notation: 419.11
preferred label: Spain @en
preferred label: Spanien @sv
related: Afrikan saaret
related: URN:NBN:fi:au:hklj:460
related: URN:NBN:fi:au:hklj:979
related: Espanjan historia
related: Afrikan historia
scope note: Tässä myös Gibraltar
scope note: Hit också Gibraltar @sv

Portugali
type: Class
type: Concept
subclass of: Pyreneiden niemimaa
alternative label: Portugali (419.12)
alternative label: Portugali, maantiede, matkat (419.12)
alternative label: Portugal (419.12) @sv
alternative label: Portugal, geografi, resor (419.12) @sv
broader: Pyreneiden niemimaa
in scheme: URN:NBN:fi:au:hklj:
notation: 419.12
preferred label: Portugal @en
related: Afrikan saaret
related: URN:NBN:fi:au:hklj:460
related: URN:NBN:fi:au:hklj:979
related: Portugalin historia
related: Afrikan historia

Rooma
type: Class
type: Concept
subclass of: Italia
alternative label: Rooma, nykyajan Rooma (419.21)
alternative label: Vatikaanivaltio (419.21)
alternative label: Vatikaanivaltio, maantiede, matkat (419.21)
alternative label: Rom, nutidens Rom (419.21) @sv
alternative label: Vatikanstaten (419.21) @sv
alternative label: Vatikanstaten, geografi, resor (419.21) @sv
broader: Italia
in scheme: URN:NBN:fi:au:hklj:
notation: 419.21
preferred label: Rome @en
preferred label: Rom @sv
related: URN:NBN:fi:au:hklj:460
related: Rooman valtakunnan historia ja arkeologia
related: URN:NBN:fi:au:hklj:979
related: Italian historia
scope note: Tässä myös Vatikaanivaltio
scope note: Hit också Vatikanstaten @sv

Keski-Amerikka
type: Class
type: Concept
subclass of: AMERIKKA
alternative label: Belize (445)
alternative label: Belize, maantiede, matkat (445)
alternative label: Costa Rica (445)
alternative label: Costa Rica, maantiede, matkat (445)
alternative label: El Salvador (445)
alternative label: El Salvador, maantiede, matkat (445)
alternative label: Guatemala (445)
alternative label: Guatemala, maantiede, matkat (445)
alternative label: Honduras (445)
alternative label: Honduras, maantiede, matkat (445)
alternative label: Keski-Amerikka (445)
alternative label: Keski-Amerikka, maantiede, matkat (445)
alternative label: Latinalainen Amerikka, Keski-Amerikka (445)
alternative label: Nicaragua (445)
alternative label: Nicaragua, maantiede, matkat (445)
alternative label: Panama (445)
alternative label: Panama, maantiede, matkat (445)
alternative label: Salvador (445)
alternative label: Salvador, maantiede, matkat (445)
alternative label: Väli-Amerikka (445)
alternative label: Väli-Amerikka, Keski-Amerikka (445)
alternative label: Väli-Amerikka, maantiede, matkat (445)
alternative label: Belize, geografi, resor (445) @sv
alternative label: Centralamerika (445) @sv
alternative label: Centralamerika, geografi, resor (445) @sv
alternative label: Costa Rica, geografi, resor (445) @sv
alternative label: El Salvador, geografi, resor (445) @sv
alternative label: Guatemala, geografi, resor (445) @sv
alternative label: Honduras, geografi, resor (445) @sv
alternative label: Latinamerika, Centralamerika (445) @sv
alternative label: Mellanamerika (445) @sv
alternative label: Mellanamerika, Centralamerika (445) @sv
alternative label: Mellanamerika, geografi, resor (445) @sv
alternative label: Nicaragua, geografi, resor (445) @sv
alternative label: Panama, geografi, resor (445) @sv
alternative label: Salvador, geografi, resor (445) @sv
broader: AMERIKKA
in scheme: URN:NBN:fi:au:hklj:
notation: 445
preferred label: Central America @en
preferred label: Centralamerika @sv
related: Meksiko
related: Karibianmeren saaret
related: Etelä-Amerikka
related: Keski-Amerikan historia
scope note: Tässä myös Väli-Amerikkaa koskevat yleisteokset Belize. Costa Rica. El Salvador. Guatemala. Honduras. Nicaragua. Panama
scope note: Hit också allmänna verk som rör Mellanamerika Belize. Costa Rica. El Salvador. Guatemala. Honduras. Nicaragua. Panama @sv

Kotiseutututkimus
type: Class
type: Concept
subclass of: KANSATIEDE. ANTROPOLOGIA
alternative label: Kotiseutu, kotiseutututkimus (471)
alternative label: Kotiseutuarkistot (471)
alternative label: Kotiseutujuhlat, kotiseutututkimus (471)
alternative label: Kotiseutukokoelmat (471)
alternative label: Kotiseutukuvaukset, kotiseututukimus (471)
alternative label: Kotiseutumuseot (471)
alternative label: Kotiseututuntemus (471)
alternative label: Kotiseutututkimus (471)
alternative label: Kotiseututyö (471)
alternative label: Kotiseutuyhdistykset (471)
alternative label: Kulttuurintutkimus, kotiseutututkimus (471)
alternative label: Kulttuuriperintö, kotiseutututkimus (471)
alternative label: Kyläavustajat, kylätoiminta, kotiseututyö (471)
alternative label: Kylät, kotiseutututkimus (471)
alternative label: Kylätoiminta, kotiseututyö (471)
alternative label: Kylätutkimus, kotiseutututkimus (471)
alternative label: Paikalliskulttuuri, kotiseutututkimus (471)
alternative label: Synnyinseutu, kotiseutututkimus (471)
alternative label: Bya-assistenter, byarådsverksamhet, hembygdsarbete (471) @sv
alternative label: Byar, hembygdsforskning (471) @sv
alternative label: Byarådsverksamhet, hembygdsarbete (471) @sv
alternative label: Byundersökning, hembygdsforskning (471) @sv
alternative label: Födelsebygd, hembygdsforskning (471) @sv
alternative label: Hembygd, hembygdsforskning (471) @sv
alternative label: Hembygdsarbete (471) @sv
alternative label: Hembygdsarkiv (471) @sv
alternative label: Hembygdsfester, hembygdsforskning (471) @sv
alternative label: Hembygdsforskning (471) @sv
alternative label: Hembygdsföreningar (471) @sv
alternative label: Hembygdskunskap (471) @sv
alternative label: Hembygdsmuseer (471) @sv
alternative label: Hembygdssamlingar (471) @sv
alternative label: Hembygdsskildringar, hembygdsforskning (471) @sv
alternative label: Kulturarv, hembygdsforskning (471) @sv
alternative label: Kulturforskning, hembygdsforskning (471) @sv
alternative label: Lokalkultur, hembygdsforskning (471) @sv
broader: KANSATIEDE. ANTROPOLOGIA
in scheme: URN:NBN:fi:au:hklj:
notation: 471
preferred label: Research in local history and culture @en
preferred label: Hembygdsforskning @sv
related: URN:NBN:fi:au:hklj:900
related: URN:NBN:fi:au:hklj:919
related: URN:NBN:fi:au:hklj:929
related: Helsinki. Pääkaupunkiseutu
scope note: Tähän kotiseutututkimusta yleensä koskevat teokset Kansatieteellinen kotiseutututkimus yleensä Kotiseutututkimuksen menetelmät ja oppaat Tiettyä aluetta koskevat kotiseutututkimukset luokissa 475-476+ Jos teoksessa on sekä kotiseutututkimusta että paikallishistoriaa, on etusija paikallishistorian luokilla
scope note: Hit verk som rör hembygdsforskning i allmänhet Etnologiskt inriktad hembygdsforskning i allmänhet Metoder och handledningar för hembygdsforskning Hembygdsforskning som rör ett bestämt geografiskt område förs till klasserna 475-476+ Om verket handlar om både hembygdsforskning och lokalhistoria ges företräde åt klasserna för lokalhistoria @sv

Kartografia
type: Class
type: Concept
subclass of: FYYSINEN MAANTIEDE
alternative label: Aerogeofysiikka (482)
alternative label: Ekvaattori, kartografia (482)
alternative label: Hakukartat, kartografia (482)
alternative label: Ilmakuvakartat, kartografia (482)
alternative label: Ilmakuvakartoitus (482)
alternative label: Ilmansuunnat, kartografia (482)
alternative label: Kartanpiirustus (482)
alternative label: Kartografia (482)
alternative label: Kartoitus, kartografia (482)
alternative label: Karttaoppi (482)
alternative label: Karttaprojektiot (482)
alternative label: Kaukokartoitus (482)
alternative label: Kauriin kääntöpiiri, leveyspiirit, kartografia (482)
alternative label: Koordinaatit (482)
alternative label: Korkeussuhteet, kartografia (482)
alternative label: Kravun kääntöpiiri, leveyspiirit, kartografia (482)
alternative label: Kääntöpiirit, leveyspiirit, kartografia (482)
alternative label: Laserkeilaus (482)
alternative label: Leveyspiirit, karttaoppi (482)
alternative label: Maanpinnan korkeus, kartografia (482)
alternative label: Maantieteelliset koordinaatit (482)
alternative label: Mittakaava, kartografia (482)
alternative label: Piirtäminen, kartanpiirustus (482)
alternative label: Piirustus, kartanpiirustus (482)
alternative label: Pinnanmuodot, kartografia (482)
alternative label: Pituuspiirit, kartografia (482)
alternative label: Projektio, kartografia (482)
alternative label: Päiväntasaaja, kartografia (482)
alternative label: Rantaviiva, kartografia (482)
alternative label: Spatiaalinen analyysi, kartografia (482)
alternative label: Stereokartoitus, kartografia (482)
alternative label: Tietokoneavusteinen kartografia, kartografia (482)
alternative label: Topografia (482)
alternative label: Yleiskartoitukset, kartografia (482)
alternative label: Allmänna kartläggningar, kartografi (482) @sv
alternative label: Datorstödd kartografi, kartografi (482) @sv
alternative label: Ekvator, kartografi (482) @sv
alternative label: Ekvatorn, kartografi (482) @sv
alternative label: Fjärranalys (482) @sv
alternative label: Flygbildskartering (482) @sv
alternative label: Flygbildskartor, kartografi (482) @sv
alternative label: Geografiska koordinater (482) @sv
alternative label: Höjdförhållanden, kartografi (482) @sv
alternative label: Indexkartor, kartografi (482) @sv
alternative label: Jordytans höjd, kartografi (482) @sv
alternative label: Kartering, kartografi (482) @sv
alternative label: Kartlära (482) @sv
alternative label: Kartografi (482) @sv
alternative label: Kartprojektioner (482) @sv
alternative label: Kartritning (482) @sv
alternative label: Koordinater (482) @sv
alternative label: Kräftans vändkrets, parallellcirklar, kartografi (482) @sv
alternative label: Laserskanning (482) @sv
alternative label: Meridianer, kartografi (482) @sv
alternative label: Parallellcirklar, kartografi (482) @sv
alternative label: Projektion, kartografi (482) @sv
alternative label: Ritande, kartritning (482) @sv
alternative label: Ritning, kartritning (482) @sv
alternative label: Skala, kartografi (482) @sv
alternative label: Spatial analys, kartografi (482) @sv
alternative label: Stenbockens vändkrets, parallellcirklar, kartografi (482) @sv
alternative label: Stereokartering, kartografi (482) @sv
alternative label: Strandlinje, kartografi (482) @sv
alternative label: Topografi (482) @sv
alternative label: Väderstreck, kartografi (482) @sv
alternative label: Vändkretsar, parallellcirklar, kartografi (482) @sv
alternative label: Ytformer, kartografi (482) @sv
broader: FYYSINEN MAANTIEDE
in scheme: URN:NBN:fi:au:hklj:
notation: 482
related: Maailmankartat. Maailmankartastot
related: URN:NBN:fi:au:hklj:482.09
related: Geodesia. Maanmittaus. Paikannus. Geoinformatiikka
related: URN:NBN:fi:au:hklj:520.084
related: Historialliset kartat. Historiallinen maantiede
scope note: Kartoitus. Kartanpiirustus. Karttaoppi Karttaprojektiot. Koordinaattijärjestelmät. Mittakaavat Ilma- ja satelliittikuvaus kartografiassa Jos teos koskee sekä kartografiaa että geodesiaa tai maanmittausta, on etusija luokalla 482 Erikoisalojen kartat alan mukaisessa luokassa
scope note: Kartering. Kartritning. Kartlära Kartprojektioner. Koordinatsystem. Skalor Flyg- och satellitfotografering i kartografiskt syfte Om verket rör såväl kartografi som geodesi eller lantmäteri ges företräde åt klass 482 Kartor som rör specialområden klassificeras enligt ämnesområde @sv

Filosofia. Teoria. Tutkimusmenetelmät
type: Class
type: Concept
subclass of: LUONNONTIETEET
alternative label: Aistihavainnot, luonnontieteen metodit (501)
alternative label: Biologiset menetelmät, biologian tutkimus (501)
alternative label: Empiirinen tutkimus, luonnontieteiden metodit (501)
alternative label: Epävarmuus (501)
alternative label: Havainnointi, luonnontieteen metodit (501)
alternative label: Havainnot, luonnontieteen metodit (501)
alternative label: Kaaosteoria, luonnontiede (501)
alternative label: Katastrofiteoria, luonnontiede (501)
alternative label: Kenttätyö, luonnontieteet (501)
alternative label: Kompleksisuus, luonnontiede (501)
alternative label: Luonnonfilosofia, luonnontiet. filosofia (501)
alternative label: Luonnontutkimus, metodit (501)
alternative label: Monimutkaisuus, luonnontiede (501)
alternative label: Osallistava tutkimus, luonnontieteen metodit (501)
alternative label: Osallistuva havainnointi, luonnontieteen metodit (501)
alternative label: Perustutkimus, luonnontieteet (501)
alternative label: Sattuma, luonnontiet. filosofia (501)
alternative label: Todennäköisyys, luonnontieteet (501)
alternative label: Biologiska metoder, biologisk forskning (501) @sv
alternative label: Delaktig forskning, naturvetenskapens metoder (501) @sv
alternative label: Deltagande observation, naturvetenskapens metoder (501) @sv
alternative label: Empirisk forskning, naturvetenskapernas metoder (501) @sv
alternative label: Fältarbete, naturvetenskaper (501) @sv
alternative label: Grundforskning, naturvetenskaper (501) @sv
alternative label: Kaosteori, naturvetenskap (501) @sv
alternative label: Katastrofteori, naturvetenskap (501) @sv
alternative label: Komplexitet, naturvetenskap (501) @sv
alternative label: Naturfilosofi, vetensk. filosofi (501) @sv
alternative label: Naturforskning, metoder (501) @sv
alternative label: Observation, naturvetenskapens metoder (501) @sv
alternative label: Observationer, naturvetenskapens metoder (501) @sv
alternative label: Omständlighet, naturvetenskap (501) @sv
alternative label: Osäkerhet (501) @sv
alternative label: Sannolikhet, naturvetenskaper (501) @sv
alternative label: Slump, naturvetensk. filosofi (501) @sv
broader: LUONNONTIETEET
in scheme: URN:NBN:fi:au:hklj:
notation: 501
preferred label: Philosophy. Theory. Research methods @en
preferred label: Filosofi. Teori. Forskningsmetoder @sv
related: URN:NBN:fi:au:hklj:110
related: Tieteenfilosofia. Metodologia
related: Tieteenfilosofia
related: Metodologia
related: Biologian filosofia
scope note: Luonnontieteiden yleinen filosofia, teoria ja tutkimusmenetelmät Eri luonnontieteen alojen filosofia, teoria ja tutkimusmenetelmät alan mukaisessa luokassa
scope note: Naturvetenskapernas allmänna filosofi, teori och forskningsmetoder Olika filosofier, teorier och forskningsmetoder inom naturvetenskaperna klassificeras enligt område @sv

Matematiikan taulukot ja kaavakokoelmat. Laskumenetelmät
type: Class
type: Concept
subclass of: MATEMATIIKKA
alternative label: Algoritmit, laskumenetelmät (510.1)
alternative label: Elektroniset laskimet (510.1)
alternative label: Evoluutiolaskenta, memeettiset algoritmit (510.1)
alternative label: Geneettiset algoritmit, laskumenetelmät (510.1)
alternative label: Iterointi, laskumenetelmät (510.1)
alternative label: Laskelmat, laskumenetelmät, matematiikka (510.1)
alternative label: Laskeminen, laskumenetelmät (510.1)
alternative label: Laskenta, laskumenetelmät (510.1)
alternative label: Laskentamenetelmät (510.1)
alternative label: Laskimet, matematiikka (510.1)
alternative label: Laskukoneet, matematiikka (510.1)
alternative label: Laskumenetelmät, matematiikka (510.1)
alternative label: Laskutikut (510.1)
alternative label: Logaritmitaulut (510.1)
alternative label: Matemaattiset kaavat (510.1)
alternative label: Matemaattiset menetelmät, matematiikka, laskumenetelmät (510.1)
alternative label: Matemaattiset taulukot (510.1)
alternative label: Matematiikan kaavakokoelmat (510.1)
alternative label: Matematiikan laskumenetelmät (510.1)
alternative label: Matematiikan taulukot (510.1)
alternative label: Matematiikka, laskumenetelmät (510.1)
alternative label: Matematiikka, taulukot ja kaavakokoelmat (510.1)
alternative label: Numeerinen analyysi (510.1)
alternative label: Numeerinen matematiikka (510.1)
alternative label: Numeeriset menetelmät (510.1)
alternative label: Prosenttilasku (510.1)
alternative label: Ruudukkolaskenta, matematiikka (510.1)
alternative label: Taskulaskimet, matematiikka (510.1)
alternative label: Taulukkolaskenta, matematiikka (510.1)
alternative label: Taulukointi, matematiikka (510.1)
alternative label: Taulukot, matematiikka (510.1)
alternative label: memeettiset algoritmit, laskumenetelmät (510.1)
alternative label: Algoritmer, räkningsmetoder (510.1) @sv
alternative label: Beräkningsmetoder (510.1) @sv
alternative label: Elektroniska kalkylatorer (510.1) @sv
alternative label: Evolutionär beräkning, memetiska algoritmer (510.1) @sv
alternative label: Fickräknare, matematik (510.1) @sv
alternative label: Genetiska algoritmer, räkningsmetoder (510.1) @sv
alternative label: Iteration, räkningsmetoder (510.1) @sv
alternative label: Kalkyl, räkningsmetoder (510.1) @sv
alternative label: Kalkylatorer, matematik (510.1) @sv
alternative label: Kalkyler, räknemetoder, matematik (510.1) @sv
alternative label: Kalkylering, matematik (510.1) @sv
alternative label: Logaritmtabeller (510.1) @sv
alternative label: Matematik, räknemetoder (510.1) @sv
alternative label: Matematik, tabeller och formelsamlingar (510.1) @sv
alternative label: Matematikens formelsamlingar (510.1) @sv
alternative label: Matematikens räknemetoder (510.1) @sv
alternative label: Matematikens tabeller (510.1) @sv
alternative label: Matematiska formler (510.1) @sv
alternative label: Matematiska metoder, matematik, räknemetoder (510.1) @sv
alternative label: Matematiska tabeller (510.1) @sv
alternative label: Matriskalkylering, matematik (510.1) @sv
alternative label: Numerisk analys (510.1) @sv
alternative label: Numerisk matematik (510.1) @sv
alternative label: Numeriska metoder (510.1) @sv
alternative label: Procenträkning (510.1) @sv
alternative label: Räknemaskiner, matematik (510.1) @sv
alternative label: Räknemetoder, matematik (510.1) @sv
alternative label: Räknestickor (510.1) @sv
alternative label: Räkning, räkningsmetoder (510.1) @sv
alternative label: Tabeller, matematik (510.1) @sv
alternative label: Tabellering, matematik (510.1) @sv
alternative label: memetiska algoritmer, räkningsmetoder (510.1) @sv
broader: MATEMATIIKKA
in scheme: URN:NBN:fi:au:hklj:
notation: 510.1
preferred label: Mathematical tables and formulae. Methods of calculation @en
preferred label: Matematiska tabeller och formelsamlingar. Räknemetoder @sv
related: Matematiikan muut alat
related: Taulukkolaskentaohjelmat
related: Laskentatoimi. Rahoitus. Talousarviot
related: Liiketaloudellinen kirjanpito ja tilintarkastus
related: Toimistokoneet
scope note: Matematiikan yleiset taulukot ja kaavakokoelmat Laskumenetelmät. Laskutikun, laskimien ja laskukoneiden käyttö laskentatehtävissä Erikoisalojen matemaattiset taulukot ja kaavakokoelmat alan mukaisessa luokassa
scope note: Allmänna matematiska tabeller och formelsamlingar Räknemetoder. Användning av räknestickor, kalkylatorer och räknemaskiner vid kalkylering Matematiska tabeller och formelsamlingar som rör specialområden klassificerad enligt område @sv

Matematiikka harrasteena ja ajanvietteenä
type: Class
type: Concept
subclass of: MATEMATIIKKA
alternative label: Ajanviete, matematiikka (510.88)
alternative label: Harrastukset, matematiikka (510.88)
alternative label: Matemaattinen ajanviete (510.88)
alternative label: Matematiikka, harrasteena ja ajanvietteenä (510.88)
alternative label: Taskulaskintehtävät (510.88)
alternative label: Älykkyyspelit, matemaattiset probleemat (510.88)
alternative label: Älypelit, matemaattiset probleemat (510.88)
alternative label: Hobbyer, matematik (510.88) @sv
alternative label: Intelligensspel, matematiska problem (510.88) @sv
alternative label: Matematik, som hobby och fritidssysselsättning (510.88) @sv
alternative label: Matematiskt tidsfördriv (510.88) @sv
alternative label: Tidsfördriv, matematik (510.88) @sv
alternative label: Uppgifter för fickräknare (510.88) @sv
broader: MATEMATIIKKA
in scheme: URN:NBN:fi:au:hklj:
notation: 510.88
preferred label: Mathematics as a hobby and pastime @en
preferred label: Matematik som hobby och fritidssysselsättning @sv
related: Luonto-oppaat. Oppikirjat
related: Fysiikka harrasteena ja ajanvietteenä
related: Kemia harrasteena ja ajanvietteenä
related: URN:NBN:fi:au:hklj:620.88
related: URN:NBN:fi:au:hklj:798
scope note: Matemaattiset probleemat ja tehtävät harrastajille
scope note: Matematiska problem och uppgifter för matematikintresserade @sv

Tähtitieteelliset kojeet. Ajanlasku
type: Class
type: Concept
subclass of: TÄHTITIEDE
broader: TÄHTITIEDE
in scheme: URN:NBN:fi:au:hklj:
narrower: Tähtitieteelliset kojeet
narrower: Ajanlasku
notation: 522
preferred label: Astronomical instruments. Measuring time @en
preferred label: Astronomiska instrument. Tideräkning @sv
related: Astrologia. Horoskoopit
scope note: Teokset, jotka koskevat sekä tähtitieteellisiä kojeita että ajanlaskua ja siihen liittyviä kojeita
scope note: Verk som handlar om såväl astronomiska instrument som om tideräkning och instrument för tidmätning @sv

Lämpöoppi
type: Class
type: Concept
subclass of: FYSIIKKA
alternative label: Alhaisen lämpötilan tutkimus, fysiikka (534)
alternative label: Energetiikka (534)
alternative label: Energia, energetiikka (534)
alternative label: Energiamittarit, lämpömittarit (534)
alternative label: Entropia, lämpöoppi (534)
alternative label: Fysiikka, lämpöoppi (534)
alternative label: Kalorimetria (534)
alternative label: Kondensoituminen, lämpöoppi (534)
alternative label: Konvektio, lämpöoppi (534)
alternative label: Korkean lämpötilan tutkimus (534)
alternative label: Korkeiden lämpötilojen tutkimus (534)
alternative label: Kryofysiikka (534)
alternative label: Kuumuus, korkeiden lämpötilojen tutkimus (534)
alternative label: Kylmyys, lämpöoppi (534)
alternative label: Kylmäfysiikka (534)
alternative label: Liike-energia, energetiikka (534)
alternative label: Lämmön johtuminen (534)
alternative label: Lämmön kuljetus, lämpöoppi (534)
alternative label: Lämmön siirtyminen (534)
alternative label: Lämmönjohtavuus (534)
alternative label: Lämpö, fysiikka (534)
alternative label: Lämpö, lämpöoppi (534)
alternative label: Lämpöarvo, fysiikka (534)
alternative label: Lämpöenergia, fysiikka. (534)
alternative label: Lämpökapasiteetti (534)
alternative label: Lämpölaajeneminen (534)
alternative label: Lämpöliike (534)
alternative label: Lämpömittarit (534)
alternative label: Lämpöoppi (534)
alternative label: Lämpösäteily (534)
alternative label: Lämpötila, lämpöoppi (534)
alternative label: Lämpötilan mittaus (534)
alternative label: Matalien lämpötilojen fysiikka (534)
alternative label: Mittaus, kalorimetria (534)
alternative label: Ominaislämpö (534)
alternative label: Suprajohtavuus, kylmäfysiikka (534)
alternative label: Suprajohteet, kylmäfysiikka (534)
alternative label: Sähkönjohtavuus, suprajohtavuus, kylmäfysiikka (534)
alternative label: Säteily, lämpösäteily (534)
alternative label: Termodynamiikka, fysiikka (534)
alternative label: Termofysiikka (534)
alternative label: Termostaatit, fysiikka (534)
alternative label: Energetik (534) @sv
alternative label: Energi, energetik (534) @sv
alternative label: Energimätare, termometrar (534) @sv
alternative label: Entropi, värmelära (534) @sv
alternative label: Fysik, värmelära (534) @sv
alternative label: Hetta, högtemperaturforskning (534) @sv
alternative label: Högtemperaturforskning (534) @sv
alternative label: Kalorimetri (534) @sv
alternative label: Kinetisk energi, energetik (534) @sv
alternative label: Kondensering, värmelära (534) @sv
alternative label: Konduktivitet, supraledning, köldfysik (534) @sv
alternative label: Konvektion, värmelära (534) @sv
alternative label: Kryofysik (534) @sv
alternative label: Kyla, värmelära (534) @sv
alternative label: Köldfysik (534) @sv
alternative label: Lågtemperaturforskning, fysik (534) @sv
alternative label: Lågtemperaturfysik (534) @sv
alternative label: Mätning, kalorimetri (534) @sv
alternative label: Specifik värme (534) @sv
alternative label: Strålning, värmestrålning (534) @sv
alternative label: Supraledare, köldfysik (534) @sv
alternative label: Supraledning, köldfysik (534) @sv
alternative label: Temperatur, värmelära (534) @sv
alternative label: Temperaturmätning (534) @sv
alternative label: Termodynamik, fysik (534) @sv
broader: FYSIIKKA
in scheme: URN:NBN:fi:au:hklj:
notation: 534
related: Meteorologia. Klimatologia
related: FYSIKAALINEN KEMIA
related: Tekninen mekaniikka
related: URN:NBN:fi:au:hklj:667.71
related: Uunit. Takat
scope note: Lämpösäteily. Lämmön johtuminen. Lämpötilan vaikutus Termodynamiikka. Energetiikka. Entropia Korkeiden ja matalien lämpötilojen fysiikka. Kylmäfysiikka Lämpötilan mittaus ja säätö. Kalorimetria Lämpömittarin ja termostaatin fysiikka
scope note: Värmestrålning. Värmeledare. Värmets inverkan på ämnen Termodynamik. Energetik. Entropi Höga och låga temperaturers fysik. Köldfysik Mätning och reglering av värmet. Kalorimetrar Termometerns och termostatens fysik @sv

Epäorgaaninen kemia
type: Class
type: Concept
subclass of: KEMIA
alternative label: Alumiini, epäorgaaninen kemia (545)
alternative label: Epämetallit, epämetallien kemia (545)
alternative label: Epäorgaaninen kemia (545)
alternative label: Epäorgaaniset yhdisteet (545)
alternative label: Fosfaatit, epäorgaaniset yhdisteet (545)
alternative label: Hapot, epäorgaaninen kemia (545)
alternative label: Harvinaiset maametallit, epäorgaaninen kemia (545)
alternative label: Kemia, epäorgaaninen kemia (545)
alternative label: Kemialliset yhdisteet, epäorgaaninen kemia (545)
alternative label: Kevytmetallit, kemia (545)
alternative label: Kipsi, kemia (545)
alternative label: Kuningasvesi, hapot, epäorgaaninen kemia (545)
alternative label: Lantanidit, epäorgaaninen kemia (545)
alternative label: Lantanoidit, epäorgaaninen kemia (545)
alternative label: Maametallit, epäorgaaninen kemia (545)
alternative label: Magnesiumkarbonaatti, epäorgaaninen kemia (545)
alternative label: Metallit, kemia (545)
alternative label: Metalloidit, kemia (545)
alternative label: Mineraalikemia, epäorgaaninen kemia (545)
alternative label: Puolimetallit, kemia (545)
alternative label: Silikaatit, epäorgaaninen kemia (545)
alternative label: Suolahappo, epäorgaaninen kemia (545)
alternative label: Aluminium, oorganisk kemi (545) @sv
alternative label: Fosfater, oorganiska föreningar (545) @sv
alternative label: Gips, kemi (545) @sv
alternative label: Halvmetaller, kemi (545) @sv
alternative label: Icke-metaller, icke-metallers kemi (545) @sv
alternative label: Jordmetaller, oorganisk kemi (545) @sv
alternative label: Kemi, oorganisk kemi (545) @sv
alternative label: Kemiska föreningar, oorganisk kemi (545) @sv
alternative label: Kungsvatten, syror, oorganisk kemi (545) @sv
alternative label: Lantanider, oorganisk kemi (545) @sv
alternative label: Lantanoider, oorganisk kemi (545) @sv
alternative label: Lättmetaller, kemi (545) @sv
alternative label: Magnesiumkarbonat, oorganisk kemi (545) @sv
alternative label: Metaller, kemi (545) @sv
alternative label: Metalloider, kemi (545) @sv
alternative label: Mineralkemi, oorganisk kemi (545) @sv
alternative label: Oorganisk kemi (545) @sv
alternative label: Oorganiska föreningar (545) @sv
alternative label: Saltsyra, oorganisk kemi (545) @sv
alternative label: Silikater, oorganisk kemi (545) @sv
alternative label: Syror, oorganisk kemi (545) @sv
alternative label: Sällsynta jordartsmetaller, oorganisk kemi (545) @sv
broader: KEMIA
in scheme: URN:NBN:fi:au:hklj:
notation: 545
preferred label: Inorganic chemistry @en
preferred label: Oorganisk kemi @sv
related: Mineralogia. Kristallografia. Petrologia
related: Teoreettinen kemia
related: Analyyttinen kemia
related: Metallurgia. Metallioppi
related: Kemian teollisuus
scope note: Epäorgaaniset reaktiot ja yhdisteet Metallien, metalloidien ja epämetallien kemia
scope note: Oorganiska reaktioner och föreningar Kemiska egenskaper hos metaller, metalloider och icke-metaller @sv

Biologian filosofia
type: Class
type: Concept
subclass of: BIOLOGIA
alternative label: Digitaalielämä (571)
alternative label: Elämä, biologian filosofia (571)
alternative label: Elämä, tekoelämä (571)
alternative label: Ihminen-luontosuhde, biologian filosofia (571)
alternative label: Keinoelämä (571)
alternative label: Luonto, biologian filosofia (571)
alternative label: Luontosuhde, biologian filosofia (571)
alternative label: Sattuma, biologian filosofia (571)
alternative label: Tekoelämä (571)
alternative label: Vitalismi, biologian filosofia (571)
alternative label: Yksilö, biologian filosofia (571)
alternative label: Artificiellt liv (571) @sv
alternative label: Digitalt liv (571) @sv
alternative label: Individen, biologins filosofi (571) @sv
alternative label: Konstgjort liv (571) @sv
alternative label: Livet, artificiellt liv (571) @sv
alternative label: Livet, biologins filosofi (571) @sv
alternative label: Människa-naturförhållande, biologins filosofi (571) @sv
alternative label: Naturen, biologins filosofi (571) @sv
alternative label: Naturrelation, biologins filosofi (571) @sv
alternative label: Slump, biologins filosofi (571) @sv
alternative label: Vitalism, biologins filosofi (571) @sv
broader: BIOLOGIA
in scheme: URN:NBN:fi:au:hklj:
notation: 571
preferred label: Biological philosophy @en
preferred label: Biologisk filosofi @sv
related: URN:NBN:fi:au:hklj:110
related: Filosofia. Teoria. Tutkimusmenetelmät
related: Elämä maailmankaikkeudessa. Astrobiologia
related: Kehitysoppi. Evoluutio
related: Biotekniikka
scope note: Biologian, biologisen ajattelun ja biologisen tutkimuksen filosofia yleensä Elämä ja elolliset olennot tutkimuskohteena yleensä Biologian teoria ja tutkimusmenetelmät yleensä Biologisen tutkimuksen etiikka yleensä Tiettyyn biologian erikoisalaan liittyvä filosofia, teoria ja tutkimusmenetelmät alan mukaisessa luokassa
scope note: Biologisk filosofi och det biologiska tänkandets och den biologiska forskningens filosofi i allmänhet Livet och levande varelser som undersökningsobjekt i allmänhet Biologins teori och forskningsmetoder i allmänhet Den biologiska forskningens etik i allmänhet Filosofi, teori och forskningsmetoder inom ett bestämt biologiskt specialområde klassificeras enligt område @sv

Lääkärin työ
type: Class
type: Concept
subclass of: Hoitotiede. Hoitotyö. Hoitohenkilökunta
alternative label: Erikoislääkärit, lääkärin työ (610.73)
alternative label: Hoitotyö, lääkärin työ (610.73)
alternative label: Hoitovirheet, lääkärin työ (610.73)
alternative label: Kotikäynnit, lääkärin työ (610.73)
alternative label: Lääkintävirheet, lääkärin työ (610.73)
alternative label: Lääkäri-potilassuhde (610.73)
alternative label: Lääkärin työ (610.73)
alternative label: Lääkärit, lääkärin työ (610.73)
alternative label: Omalääkärijärjestelmä (610.73)
alternative label: Omalääkärit, lääkärin työ (610.73)
alternative label: Potilas-lääkärisuhde (610.73)
alternative label: Päivystys, lääkärin työ (610.73)
alternative label: Behandlingsskador, läkarens arbete (610.73) @sv
alternative label: Egenläkare, läkarens arbete (610.73) @sv
alternative label: Felbehandling, medicin, läkarens arbete (610.73) @sv
alternative label: Hembesök, läkarens arbete (610.73) @sv
alternative label: Husläkare, läkarens arbete (610.73) @sv
alternative label: Husläkarsystem (610.73) @sv
alternative label: Jour, läkarens arbete (610.73) @sv
alternative label: Läkare, läkarens arbete (610.73) @sv
alternative label: Läkare-patientrelation (610.73) @sv
alternative label: Läkarens arbete (610.73) @sv
alternative label: Patient-läkarrelation (610.73) @sv
alternative label: Specialistläkare, läkarens arbete (610.73) @sv
alternative label: Specialläkare, läkarens arbete (610.73) @sv
alternative label: Vårdarbete, läkarens arbete (610.73) @sv
broader: Hoitotiede. Hoitotyö. Hoitohenkilökunta
in scheme: URN:NBN:fi:au:hklj:
notation: 610.73
preferred label: Doctors' work @en
preferred label: Läkarens arbete @sv
related: URN:NBN:fi:au:hklj:332.22
related: URN:NBN:fi:au:hklj:371.6
related: Lääketieteen filosofia ja etiikka
related: URN:NBN:fi:au:hklj:615
related: URN:NBN:fi:au:hklj:617
scope note: Lääkärin työ yleensä. Yleislääkärin työ Erikoislääkärin työ alan mukaisessa luokassa
scope note: Läkarens arbete i allmänhet. Allmänläkarens arbete Specialiserade läkares arbete klassificeras enligt område @sv

Tuotekehittely. Innovaatiot. Keksinnöt. Patentit
type: Class
type: Concept
subclass of: URN:NBN:fi:au:hklj:620
alternative label: Aivovienti, innovaatiopolitiikka (620.11)
alternative label: Aivovuoto, innovaatiopolitiikka (620.11)
alternative label: Biopiratismi, patentit (620.11)
alternative label: Henkinen pääoma, innovaatiot (620.11)
alternative label: Ideointi, keksinnöt (620.11)
alternative label: Ideointi, tuotekehittely (620.11)
alternative label: Inhimillinen pääoma, innovaatiot (620.11)
alternative label: Innovaatiojärjestelmät (620.11)
alternative label: Innovaatiopolitiikka (620.11)
alternative label: Innovaatiot, tuotekehittely (620.11)
alternative label: Innovatiivisuus, innovaatiot ja keksinnöt (620.11)
alternative label: Keksinnöt, tuotekehittely (620.11)
alternative label: Know-how, tuotekehittely (620.11)
alternative label: Käytettävyys, tuotekehittely (620.11)
alternative label: Lisenssit, patentit (620.11)
alternative label: Mallit, tuotekehittely (620.11)
alternative label: Muunneltavuus, tuotekehittely (620.11)
alternative label: Muutosvalmius, innovaatiot (620.11)
alternative label: Muutosvastarinta, innovaatiot (620.11)
alternative label: Osaaminen, tuotekehittely (620.11)
alternative label: Osaamispääoma, innovaatiot (620.11)
alternative label: Patentit (620.11)
alternative label: Patentointi (620.11)
alternative label: Patenttijulkaisut (620.11)
alternative label: Pienoismallit, tuotekehittely (620.11)
alternative label: Prototyypit (620.11)
alternative label: R&D, tuotekehittely (620.11)
alternative label: Reformit, innovaatiot, tekniikka (620.11)
alternative label: T&K, tuotekehittely (620.11)
alternative label: Taitotieto, tuotekehittely (620.11)
alternative label: Teknologiaohjelmat, innovaatiot ja tuotekehitys (620.11)
alternative label: Teollisuusvakoilu (620.11)
alternative label: Tietotaito, tuotekehittely (620.11)
alternative label: Tietämys, innovaatiot (620.11)
alternative label: Tuotekehittely (620.11)
alternative label: Tuotekehitys (620.11)
alternative label: Tuotesuunnittelu, tuotekehittely (620.11)
alternative label: Tutkimus- ja kehittämistoiminta, tuotekehittely (620.11)
alternative label: Tyyppihyväksyntä, innovaatiot (620.11)
alternative label: Työsuhdekeksinnöt, tuotekehittely (620.11)
alternative label: Uudistukset, innovaatiot, tekniikka (620.11)
alternative label: Vakoilu, teollisuusvakoilu (620.11)
alternative label: Yritysvakoilu (620.11)
alternative label: tuotemallit, tuotekehittely (620.11 +)
alternative label: Användbarhet, produktutveckling (620.11) @sv
alternative label: Arbetstagares uppfinningar, produktutveckling (620.11) @sv
alternative label: Brain drain, innovationspolitik (620.11) @sv
alternative label: Brainstorming, produktutveckling (620.11) @sv
alternative label: Brainstorming, uppfinningar (620.11) @sv
alternative label: FoU, produktutveckling (620.11) @sv
alternative label: Forskning och utveckling, produktutveckling (620.11) @sv
alternative label: Företagsspionage (620.11) @sv
alternative label: Förändringsbenägenhet, innovationer (620.11) @sv
alternative label: Förändringsmotstånd, innovationer (620.11) @sv
alternative label: Humankapital, innovationer (620.11) @sv
alternative label: Industrispionage (620.11) @sv
alternative label: Innovationer, produktutveckling (620.11) @sv
alternative label: Innovationspolitik (620.11) @sv
alternative label: Innovationssystem (620.11) @sv
alternative label: Innovativitet, innovationer och uppfinningar (620.11) @sv
alternative label: Intellektuellt kapital, innovationer (620.11) @sv
alternative label: Know-how, know-how, produktutveckling (620.11) @sv
alternative label: Know-how, taitotieto, produktutveckling (620.11) @sv
alternative label: Know-how, tietotaito, produktutvceckling (620.11) @sv
alternative label: Kompetensflykt, innovationspolitik (620.11) @sv
alternative label: Kunnande, produktutveckling (620.11) @sv
alternative label: Kunskap, tietämys, innovationer (620.11) @sv
alternative label: Licenser, patent (620.11) @sv
broader: URN:NBN:fi:au:hklj:620
in scheme: URN:NBN:fi:au:hklj:
notation: 620.11
related: URN:NBN:fi:au:hklj:325
related: URN:NBN:fi:au:hklj:620.09
related: URN:NBN:fi:au:hklj:620.88
related: Liiketalouden hallinto ja organisaatio
scope note: Tekninen tuotekehittely yleensä. Innovaatiopolitiikka yleensä Patentointi yleensä. Patentit, mallit ja prototyypit yleensä Keksinnöt, innovaatiot ja tekniset parannukset yleensä Teollisuus- ja yritysvakoilu yleensä Tiettyyn tekniikan tai teollisuuden alaan liittyvä tuotekehittely ja patentit alan mukaisessa luokassa
scope note: Teknisk produktutveckling i allmänhet Patentering i allmänhet. Patent, modeller och prototyper i allmänhet Uppfinningar, innovationer och tekniska förbättringar i allmänhet Industri- och företagsspionage i allmänhet Produktutveckling och patent inom ett bestämt tekniskt eller industriellt område klassificeras enligt område @sv

Museot. Arkistot. Kokoelmat. Näyttelyt
type: Class
type: Concept
subclass of: Kokoomateokset
alternative label: Avajaiset, taidenäyttelyt (708.5)
alternative label: Julkinen taide, taidemuseot (708.5)
alternative label: Julkinen taide, taidenäyttelyt (708.5)
alternative label: Kiertonäyttelyt, taidenäyttelyt (708.5)
alternative label: Kokoelmat, taidekokoelmat (708.5)
alternative label: Kuratointi, taidenäyttelyt (708.5)
alternative label: Kävijät, taidenäyttelyt (708.5)
alternative label: Kävijätutkimukset, taidenäyttelyt (708.5)
alternative label: Museot, taidemuseot (708.5)
alternative label: Näyttelyjulkaisut, taidenäyttelyt (708.5)
alternative label: Näyttelyluettelot, taidenäyttelyt (708.5)
alternative label: Näyttelysuunnittelu, taidenäyttelyt (708.5)
alternative label: Näyttelyt, taidenäyttelyt (708.5)
alternative label: Näyttelytoiminta, taidenäyttelyt (708.5)
alternative label: Pääsyliput, taidemuseot (708.5)
alternative label: Pääsyliput, taidenäyttelyt (708.5)
alternative label: Retrospektiivit, taidenäyttelyt (708.5)
alternative label: Taidegalleriat, taidemuseot (708.5)
alternative label: Taidekokoelmat (708.5)
alternative label: Taidemuseot (708.5)
alternative label: Taidenäyttelyt (708.5)
alternative label: Taidetapahtumat , taidenäyttelyt (708.5)
alternative label: Vilppi, taideväärennökset (708.5)
alternative label: Ambulerande utställningar, konstutställningar (708.5) @sv
alternative label: Besökare, konstutställningar (708.5) @sv
alternative label: Besökarundersökningar, konstutställningar (708.5) @sv
alternative label: Fusk, konstförfalskningar (708.5) @sv
alternative label: Inträdesbiljetter, konstmuseer (708.5) @sv
alternative label: Inträdesbiljetter, konstutställningar (708.5) @sv
alternative label: Konstevenemang, konstutställningar (708.5) @sv
alternative label: Konstgallerier, konstmuseer (708.5) @sv
alternative label: Konstmuseer (708.5) @sv
alternative label: Konstsamlingar (708.5) @sv
alternative label: Konstutställningar (708.5) @sv
alternative label: Kuratering, konstutställningar (708.5) @sv
alternative label: Museer, konstmuseer (708.5) @sv
alternative label: Offentlig konst, konstmuseer (708.5) @sv
alternative label: Offentlig konst, konstutställningar (708.5) @sv
alternative label: Retrospektiv, konstutställningar (708.5) @sv
alternative label: Samlingar, konstsamlingar (708.5) @sv
alternative label: Utställningar, konstutställningar (708.5) @sv
alternative label: Utställningskataloger, konstutställningar (708.5) @sv
alternative label: Utställningsplanering, konstutställningar (708.5) @sv
alternative label: Utställningspublikationer, konstutställningar (708.5) @sv
alternative label: Utställningsverksamhet, konstutställningar (708.5) @sv
alternative label: Vandringsutställningar, konstutställningar (708.5) @sv
broader: Kokoomateokset
in scheme: URN:NBN:fi:au:hklj:
notation: 708.5
preferred label: Museums. Archives. Collections. Exhibitions @en
preferred label: Museer. Arkiv. Samlingar. Utställningar @sv
related: URN:NBN:fi:au:hklj:061
related: URN:NBN:fi:au:hklj:063
related: Taidekauppa
scope note: Taiteita koskevat yleiset tai sekasisältöiset museot, arkistot, kokoelmat ja näyttelyt Jos taidemuseota, -arkistoa, -kokoelmaa tai -näyttelyä koskeva teos sopii sekä ko. taiteenalan aihepiirin, tekniikan maan että aikakauden mukaiseen luokkaan, on etusija järjestyksessä: aihepiirin, tekniikan, maan ja aikakauden mukaisella luokalla Yksittäistä taiteilijaa koskevat näyttelyt, museot ym. ovat kuitenkin aina ko. taiteenalan maan mukaisessa luokassa, jos taiteenalalla sellainen on
scope note: Museer, arkiv, samlingar och utställningar med allmänt eller blandat innehåll som rör konst Om ett verk som handlar om museer, arkiv, samlingar eller utställningar passar i klasserna för respektive konstarts motivkrets, teknik, land och tidsperiod, ges företräde åt dessa i följande ordning: motivkrets, teknik, land och tidsperiod Utställningar, museer o.dyl. som rör en enskild konstnär klassificeras dock alltid enligt landet för konstarten, om konstarten har en sådan klass @sv

Asuinrakennukset
type: Class
type: Concept
subclass of: URN:NBN:fi:au:hklj:726
alternative label: Asuinhuoneistot, arkkitehtuuri (726.1)
alternative label: Asuinrakennukset, arkkitehtuuri (726.1)
alternative label: Asukastilat, arkkitehtuuri, asuinrakennukset (726.1)
alternative label: Asunnot, arkkitehtuuri (726.1)
alternative label: Asuntomessut, arkkitehtuuri (726.1)
alternative label: Asuntonäyttelyt, arkkitehtuuri (726.1)
alternative label: Ekotalot, arkkitehtuuri (726.1)
alternative label: Erillistalot, arkkitehtuuri (726.1)
alternative label: Huoneistot, arkkitehtuuri (726.1)
alternative label: Huvilat, arkkitehtuuri (726.1)
alternative label: Huvimajat, arkkitehtuuri (726.1)
alternative label: Kakkosasunnot, arkkitehtuuri (726.1)
alternative label: Kasarmit, arkkitehtuuri (726.1)
alternative label: Kaupunkipientalot, arkkitehtuuri (726.1)
alternative label: Kerrostalot, arkkitehtuuri, asuintalot (726.1)
alternative label: Kesäasunnot, arkkitehtuuri (726.1)
alternative label: Kesämökit, arkkitehtuuri (726.1)
alternative label: Koerakentaminen, asuntoarkkitehtuuri (726.1)
alternative label: Koti, asuntoarkkitehtuuri (726.1)
alternative label: Kruununtilat, arkkitehtuuri (726.1)
alternative label: Kruunuvarastot, arkkitehtuuri (726.1)
alternative label: Kuistit, arkkitehtuuri, asuinrakenn. (726.1)
alternative label: Kuninkaankartanot, arkkitehtuuri (726.1)
alternative label: Lastenhuoneet, arkkitehtuuri (726.1)
alternative label: Latokartanot, arkkitehtuuri (726.1)
alternative label: Loft-asunnot, arkkitehtuuri (726.1)
alternative label: Loma-asunnot, arkkitehtuuri (726.1)
alternative label: Luhtitalot, arkkitehtuuri (726.1)
alternative label: Maalaistalot, arkkitehtuuri (726.1)
alternative label: Maatilat, arkkitehtuuri (726.1)
alternative label: Makuuhuoneet, arkkitehtuuri (726.1)
alternative label: Matalaenergiatalot, arkkitehtuuri (726.1)
alternative label: Matalaenergiset talot, arkkitehtuuri (726.1)
alternative label: Nollaenergiatalot, arkkitehtuuri (726.1)
alternative label: Olohuoneet, arkkitehtuuri (726.1)
alternative label: Omakotitalot, arkkitehtuuri (726.1)
alternative label: Palvelutalot, arkkitehtuuri (726.1)
alternative label: Pappilat, arkkitehtuuri (726.1)
alternative label: Paritalot, arkkitehtuuri (726.1)
alternative label: Passiiviset talot, arkkitehtuuri (726.1)
alternative label: Passiivitalot, arkkitehtuuri (726.1)
alternative label: Pientalot, arkkitehtuuri (726.1)
alternative label: Pientilat, arkkitehtuuri (726.1)
alternative label: Plusenergiatalot, arkkitehtuuri (726.1)
alternative label: Pohjalaistalot, arkkitehtuuri (726.1)
alternative label: Puukerrostalot, arkkitehtuuri (726.1)
alternative label: Puustellit, arkkitehtuuri (726.1)
alternative label: Rintamamiestalot , arkkitehtuuri (726.1)
alternative label: Rivitalot, arkkitehtuuri (726.1)
alternative label: Saunat, arkkitehtuuri (726.1)
alternative label: Savusaunat, arkkitehtuuri (726.1)
alternative label: Senioritalot, arkkitehtuuri (726.1)
alternative label: Sotilasvirkatalot, arkkitehtuuri (726.1)
alternative label: Taiteilijakodit, arkkitehtuuri (726.1)
alternative label: Taiteilijatalot, arkkitehtuuri (726.1)
alternative label: Terassit, arkkitehtuuri, asuinrakennukset (726.1)
alternative label: Tyyppitalot , arkkitehtuuri (726.1)
alternative label: Täysihoitolat, arkkitehtuuri (726.1)
alternative label: Vapaa-ajanasunnot, arkkitehtuuri (726.1)
alternative label: Verannat, arkkitehtuuri, asuinrakennukset (726.1)
alternative label: Villa Erstavik, huvilat, arkkitehtuuri (726.1)
alternative label: Vilpolat, arkkitehtuuri, asuinrakennukset (726.1)
alternative label: Virka-asunnot, arkkitehtuuri (726.1)
alternative label: Virkatalot, arkkitehtuuri (726.1)
alternative label: Yhteistilat, arkkitehtuuri, asuinrakennukset (726.1)
alternative label: Andrabostäder, arkitektur (726.1) @sv
alternative label: Barnkamrar, arkitektur (726.1) @sv
broader: URN:NBN:fi:au:hklj:726
in scheme: URN:NBN:fi:au:hklj:
notation: 726.1
related: Asuntopolitiikka
related: Arkkitehtuurin teoria, estetiikka ja filosofia
related: Arkkitehtuurikilpailut. Arkkitehtuurinäyttelyt. Arkkitehtuuripalkinnot
related: URN:NBN:fi:au:hklj:720.9
related: Linnat. Linnoitukset. Palatsit. Kartanot
scope note: Maasta tai aikakaudesta riippumatta asuinrakennuksia koskeva arkkitehtuuri Kerrostalot. Rivitalot. Pientalot. Paritalot. Omakotitalot. Huvilat. Loma-asunnot. Kesäasunnot. Saunat. Hotellit. Majatalot. Motellit
scope note: Arkitektur som rör bostadshus oavsett land eller tidsperiod Flervåningshus. Radhus. Småhus. Parhus. Egnahemshus. Villor. Fritidshus. Sommarhus. Bastur. Hotell. Värdshus. Motell @sv

Renessanssin kuvanveistotaide
type: Class
type: Concept
subclass of: URN:NBN:fi:au:hklj:730.9
alternative label: Kuvanveistäjät, elämäkerralliset hakuteokset (730.903 ... 730.9903)
alternative label: Manierismi, kuvanveisto (730.905)
alternative label: Renessanssi, kuvanveisto (730.905)
alternative label: Täysrenessanssi, kuvanveisto (730.905)
alternative label: Varhaisrenessanssi, kuvanveisto (730.905)
alternative label: Högrenässansen, skulptur (730.905) @sv
alternative label: Manierism, skulptur (730.905) @sv
alternative label: Renässans, skulptur (730.905) @sv
alternative label: Skulptörer, biografiska uppslagsverk (730.903 ... 730.9903) @sv
alternative label: Ungrenässansen, skulptur (730.905) @sv
broader: URN:NBN:fi:au:hklj:730.9
in scheme: URN:NBN:fi:au:hklj:
notation: 730.905
preferred label: Renaissance sculpture @en
preferred label: Renässansens skulptur @sv
related: URN:NBN:fi:au:hklj:709
related: Renessanssin taidehistoria
related: Kuvanveistotaiteen materiaalit ja tekniikka
related: URN:NBN:fi:au:hklj:739
related: URN:NBN:fi:au:hklj:742
scope note: Euroopan renessanssin kuvanveistotaide yleensä Tietyn maan renessanssin kuvanveistotaidetta tai kuvanveistäjiä koskevat teokset maan mukaisessa luokassa
scope note: Europeisk renässanstida skulptur i allmänhet Verk som handlar om renässansens skulptur eller skulptörer i ett bestämt land klassificeras enligt land @sv

Suomi
type: Class
type: Concept
subclass of: Pohjoismaat. Baltian maat
alternative label: Karelianismi, kuvanveisto (730.921)
alternative label: Suomi, kuvanveisto (730.921)
alternative label: Vaivaisukot (730.921)
alternative label: Fattiggubbar (730.921) @sv
alternative label: Finland, skulptur (730.921) @sv
alternative label: Karelianism, skulptur (730.921) @sv
broader: Pohjoismaat. Baltian maat
in scheme: URN:NBN:fi:au:hklj:
notation: 730.921
preferred label: Finland @en
related: URN:NBN:fi:au:hklj:709
related: Suomen yleinen taidehistoria
related: Kuvanveistotaiteen materiaalit ja tekniikka
related: URN:NBN:fi:au:hklj:739
related: URN:NBN:fi:au:hklj:742

Ranska
type: Class
type: Concept
subclass of: Länsi- ja Keski-Eurooppa
alternative label: Ranska, kuvanveisto (730.933)
alternative label: Frankrike, skulptur (730.933) @sv
broader: Länsi- ja Keski-Eurooppa
in scheme: URN:NBN:fi:au:hklj:
notation: 730.933
preferred label: France @en
preferred label: Frankrike @sv
related: URN:NBN:fi:au:hklj:709
related: Kuvanveistotaiteen materiaalit ja tekniikka
related: URN:NBN:fi:au:hklj:739
related: URN:NBN:fi:au:hklj:742
scope note: Tässä myös Andorra ja Monaco
scope note: Hit också Andorra och Monaco @sv

Italia
type: Class
type: Concept
subclass of: Etelä-Eurooppa
alternative label: Italia, kuvanveisto (730.941)
alternative label: Italien, skulptur (730.941) @sv
broader: Etelä-Eurooppa
in scheme: URN:NBN:fi:au:hklj:
notation: 730.941
preferred label: Italy @en
preferred label: Italien @sv
related: URN:NBN:fi:au:hklj:709
related: Vanhan ajan kuvanveistotaide. Euroopan ulkopuolisten vanhojen kulttuurien kuvanveistotaide
related: Kuvanveistotaiteen materiaalit ja tekniikka
related: URN:NBN:fi:au:hklj:739
related: URN:NBN:fi:au:hklj:742
scope note: Tässä myös San Marino ja Vatikaanivaltio
scope note: Hit också San Marino och Vatikanstaten @sv

Yhdysvallat
type: Class
type: Concept
subclass of: Amerikka
alternative label: USA, kuvanveisto (730.981)
alternative label: Yhdysvallat, kuvanveisto (730.981)
alternative label: Förenta staterna, skulptur (730.981) @sv
alternative label: USA, skulptur (730.981) @sv
broader: Amerikka
in scheme: URN:NBN:fi:au:hklj:
notation: 730.981
preferred label: United States of America @en
preferred label: Förenta staterna @sv
related: URN:NBN:fi:au:hklj:709
related: Alkuperäiskansojen kuvanveistotaide
related: Kuvanveistotaiteen materiaalit ja tekniikka
related: URN:NBN:fi:au:hklj:739
related: URN:NBN:fi:au:hklj:742

Australia. Oseania
type: Class
type: Concept
subclass of: URN:NBN:fi:au:hklj:730.9
alternative label: Australia, kuvanveisto (730.99)
alternative label: Oseania, kuvanveisto, moderni (730.99)
alternative label: Australien, skulptur (730.99) @sv
alternative label: Oceanien, skulptur, modern (730.99) @sv
broader: URN:NBN:fi:au:hklj:730.9
in scheme: URN:NBN:fi:au:hklj:
notation: 730.99
preferred label: Australia. Oceania @en
preferred label: Australien. Oceanien @sv
related: URN:NBN:fi:au:hklj:709
related: Alkuperäiskansojen kuvanveistotaide
related: Kuvanveistotaiteen materiaalit ja tekniikka
related: URN:NBN:fi:au:hklj:739
related: URN:NBN:fi:au:hklj:742
scope note: Australian ja Oseanian nykyajan kuvanveistotaide
scope note: Australiens och Oceaniens nutida skulptur @sv

Tatuointi. Kehotaide
type: Class
type: Concept
subclass of: MAALAUSTAIDE. PIIRUSTUSTAIDE
alternative label: Henna-tatuointi (745)
alternative label: Kehotaide (745)
alternative label: Lävistys, kehotaide (745)
alternative label: Mehndi (745)
alternative label: Tatuointi (745)
alternative label: Vartalomaalaus (745)
alternative label: Henna-tatuering (745) @sv
alternative label: Kroppskonst (745) @sv
alternative label: Kroppsmålning (745) @sv
alternative label: Piercing, kroppskonst (745) @sv
alternative label: Tatuering (745) @sv
broader: MAALAUSTAIDE. PIIRUSTUSTAIDE
in scheme: URN:NBN:fi:au:hklj:
notation: 745
preferred label: Tattooing. Body-art @en
preferred label: Tatuering. Kroppskonst @sv
related: Elämäntapojen sosiologia. Kulttuurisosiologia
related: URN:NBN:fi:au:hklj:357.1
related: Kauneudenhoito
related: URN:NBN:fi:au:hklj:749
related: URN:NBN:fi:au:hklj:749.1
scope note: Tatuointi. Tatuointitaide. Kehotaide Mehndi. Henna-tatuointi. Vartalomaalaus Tatuoinnin estetiikka, historia, henkilöhistoria, kulttuurihistoria ja kulttuurisosiologia aihepiiristä, maasta ja aikakaudesta riippumatta Tatuoinnin ja kehotaiteen materiaalit ja tekniikka
scope note: Tatuering. Tatueringskonst. Kroppskonst Mehndi. Henna-tatuering. Kroppsmålning Tatueringens etstetik, historia, personhistoria, kulturhistoria och kultursociologi oavsett motivkrets, land eller tidsperiod Tatueringens och kroppskonstens material och tekniker @sv

Suomi
type: Class
type: Concept
subclass of: Graafisen taiteen historia
alternative label: Suomi, graafinen taide (750.921)
alternative label: Finland, grafisk konst (750.921) @sv
broader: Graafisen taiteen historia
in scheme: URN:NBN:fi:au:hklj:
notation: 750.921
preferred label: Finland @en
related: MAALAUSTAIDE. PIIRUSTUSTAIDE
related: URN:NBN:fi:au:hklj:740.9
related: URN:NBN:fi:au:hklj:749.1
related: URN:NBN:fi:au:hklj:756
related: Valokuvataide

Kukkien asettelu ja sidonta. Ikebana
type: Class
type: Concept
subclass of: URN:NBN:fi:au:hklj:760
alternative label: Ikebana (768)
alternative label: Kasviharrastus, kukkien sidonta (768)
alternative label: Kranssit (768)
alternative label: Kuivakukat (768)
alternative label: Kuivaus, kuivakukat (768)
alternative label: Kukat, kuivakukat (768)
alternative label: Kukat, kukkien asettelu ja sidonta (768)
alternative label: Kukat, leikkokukat (768)
alternative label: Kukka-asetelmat (768)
alternative label: Kukkien asettelu (768)
alternative label: Kukkien sidonta (768)
alternative label: Leikkokukat, kukkien asettelu (768)
alternative label: Muotoilijat, eri alat (761 ... 768)
alternative label: Muotoilu, eri alat (761 ... 768)
alternative label: Seppeleet (768)
alternative label: Sidonta, kukkien sidonta (768)
alternative label: Tekokukat, kukkien asettelu ja sidonta (768)
alternative label: Bindning, blomsterbindning (768) @sv
alternative label: Blommor, blommor, bindning och arrangemang (768) @sv
alternative label: Blommor, snittblommor (768) @sv
alternative label: Blommor, torkade blommor (768) @sv
alternative label: Blomsterarrangemang (768) @sv
alternative label: Blomsterbinderi (768) @sv
alternative label: Blomsterkransar (768) @sv
alternative label: Blomsteruppsättningar (768) @sv
alternative label: Formgivare, olika branscher (761 ... 768) @sv
alternative label: Formgivning, olika branscher (761 ... 768) @sv
alternative label: Konstgjorda blommor, bindning och arrangemang av blommor (768) @sv
alternative label: Kransar (768) @sv
alternative label: Snittblommor, blomsterarrangemang (768) @sv
alternative label: Torkade blommor (768) @sv
alternative label: Torkning, torkade blommor (768) @sv
alternative label: Växter som hobby, blomsterbindning (768) @sv
broader: URN:NBN:fi:au:hklj:760
in scheme: URN:NBN:fi:au:hklj:
notation: 768
preferred label: Flower arrangement and flower tying. Ikebana @en
preferred label: Blomsterarrangemang och blomsterbindning. Ikebana @sv
related: Koristekasvit
related: Huonekasvit
related: Sisustusoppaat
related: Taideteollisuuden teoria, estetiikka ja filosofia
related: Taideteollisuuden historia
scope note: Kukkien asettelu ja sidonta, ikebana sekä niiden historia ja henkilöhistoria sekä materiaalit, tekniikka ja estetiikka Kukkien asettelu- ja sidonta. Ikebanaohjeet ja -mallit Leikkokukat. Kuivakukat. Kukkien ja kukka-asetelmien symboliikka
scope note: Blomsterarrangemang och blomsterbindning, ikebana samt deras historia och personhistoria samt material, tekniker och estetik Handledningar i blomsterarrangemang och blomsterbindning Arbetsbeskrivningar och modeller för ikebana Snittblommor. Eterneller. Blommornas och blomsterarrangemangens symbolik @sv

Laulukoulut
type: Class
type: Concept
subclass of: Yksinlaulu
alternative label: Altto, laulukoulut (783.21)
alternative label: Altto, yksinlauluoppaat (783.21)
alternative label: Baritoni, laulukoulut (783.21)
alternative label: Baritoni, yksinlauluoppaat (783.21)
alternative label: Basso, laulukoulut (783.21)
alternative label: Basso, yksinlauluoppaat (783.21)
alternative label: Bassobaritoni, laulukoulut (783.21)
alternative label: Bassobaritoni, yksinlauluoppaat (783.21)
alternative label: Bel canto, laulukoulut (783.21)
alternative label: Falsettilaulu, laulutekniikka (783.21)
alternative label: Harjoittelu, musiikki, lauluoppaat (783.21)
alternative label: Koloratuuri, laulukoulut (783.21)
alternative label: Koloratuuri, yksinlauluoppaat (783.21)
alternative label: Kontra-altto, laulukoulut (783.21)
alternative label: Kontra-altto, yksinlauluoppaat (783.21)
alternative label: Kontratenori, laulukoulut (783.21)
alternative label: Kontratenori, yksinlauluoppaat (783.21)
alternative label: Laulaminen (783.21)
alternative label: Laulukoulut (783.21)
alternative label: Laulunoppaat (783.21)
alternative label: Laulutekniikka (783.21)
alternative label: Lauluäänet, laulukoulut (783.21)
alternative label: Lauluäänet, yksinlauluoppaat (783.21)
alternative label: Mezzosopraano, laulukoulut (783.21)
alternative label: Mezzosopraano, yksinlauluoppaat (783.21)
alternative label: Puhelaulu, tekniikka (783.21)
alternative label: Resitointi, puhelaulu, tekniikka (783.21)
alternative label: Solfeesi (783.21)
alternative label: Solmisaatio (783.21)
alternative label: Sopraano, laulukoulut (783.21)
alternative label: Sopraano, yksinlauluoppaat (783.21)
alternative label: Tenori, laulukoulut (783.21)
alternative label: Tenori, yksinlauluoppaat (783.21)
alternative label: Vokaliisit (783.21)
alternative label: Yksinlaulu, laulunoppaat (783.21)
alternative label: Alt, sångskolor (783.21) @sv
alternative label: Alt, sångskolor, solosång (783.21) @sv
alternative label: Baryton, sångskolor (783.21) @sv
alternative label: Baryton, sångskolor, solosång (783.21) @sv
alternative label: Bas, sångskolor (783.21) @sv
alternative label: Bas, sångskolor, solosång (783.21) @sv
alternative label: Basbaryton, sångskolor (783.21) @sv
alternative label: Basbaryton, sångskolor, solosång (783.21) @sv
alternative label: Bel canto, sångskolor (783.21) @sv
alternative label: Falsettsång, sångteknik (783.21) @sv
alternative label: Koloratur, sångskolor (783.21) @sv
alternative label: Koloratur, sångskolor, solosång (783.21) @sv
alternative label: Kontraalt, sångskolor (783.21) @sv
alternative label: Kontraalt, sångskolor, solosång (783.21) @sv
alternative label: Kontratenor, sångskolor (783.21) @sv
alternative label: Kontratenor, sångskolor, solosång (783.21) @sv
alternative label: Mezzosopran, sångskolor (783.21) @sv
alternative label: Mezzosopran, sångskolor, solosång (783.21) @sv
alternative label: Praktik, musik, sånghandböcker (783.21) @sv
alternative label: Recitering, talsång, teknik (783.21) @sv
alternative label: Sjungande (783.21) @sv
alternative label: Solfège (783.21) @sv
alternative label: Solmisation (783.21) @sv
alternative label: Solosång, sångskolor (783.21) @sv
alternative label: Sopran, sångskolor (783.21) @sv
alternative label: Sopran, sångskolor, solosång (783.21) @sv
alternative label: Sångskolor (783.21) @sv
alternative label: Sångstämmor, sångskolor (783.21) @sv
alternative label: Sångstämmor, sångskolor, solosång (783.21) @sv
alternative label: Sångteknik (783.21) @sv
alternative label: Sångundervisning (783.21) @sv
alternative label: Talsång, teknik (783.21) @sv
broader: Yksinlaulu
in scheme: URN:NBN:fi:au:hklj:
notation: 783.21
related: URN:NBN:fi:au:hklj:770
related: URN:NBN:fi:au:hklj:784
related: URN:NBN:fi:au:hklj:784.111
related: URN:NBN:fi:au:hklj:788
related: URN:NBN:fi:au:hklj:789
scope note: Yksinlaulunoppaat. Vokaliisit
scope note: Skolor i solosång. Vokaliser @sv

Yksinlaulu ilman säestystä
type: Class
type: Concept
subclass of: Yksinlaulu
broader: Yksinlaulu
in scheme: URN:NBN:fi:au:hklj:
notation: 783.22
preferred label: Unaccompanied vocal solos @en
preferred label: Solosång utan ackompanjemang @sv
related: URN:NBN:fi:au:hklj:770
related: URN:NBN:fi:au:hklj:784
related: URN:NBN:fi:au:hklj:784.111
related: URN:NBN:fi:au:hklj:788
related: URN:NBN:fi:au:hklj:789

Yksinlaulu pianon tai muun sointusoittimen säestyksellä
type: Class
type: Concept
subclass of: Yksinlaulu
alternative label: Liedit, pianon säestyksellä (783.23)
alternative label: Lieder, till pianoackompanjemang (783.23) @sv
broader: Yksinlaulu
in scheme: URN:NBN:fi:au:hklj:
notation: 783.23
preferred label: Vocal solos with piano or similar accompaniment @en
preferred label: Solosång till ackompanjemang av piano eller andra ackordinstrument @sv
related: URN:NBN:fi:au:hklj:770
related: URN:NBN:fi:au:hklj:784
related: URN:NBN:fi:au:hklj:784.111
related: URN:NBN:fi:au:hklj:788
related: URN:NBN:fi:au:hklj:789

Yksinlaulu jonkin muun soittimen, soitinyhtyeen tai ääninauhan säestyksellä
type: Class
type: Concept
subclass of: Yksinlaulu
broader: Yksinlaulu
in scheme: URN:NBN:fi:au:hklj:
notation: 783.24
preferred label: Vocal solos with the accompaniment of other instruments, ensembles or tape-recordings @en
preferred label: Solosång till ackompanjemang av andra instrument, instrumentensembler eller ljudband @sv
related: URN:NBN:fi:au:hklj:770
related: URN:NBN:fi:au:hklj:784
related: URN:NBN:fi:au:hklj:784.111
related: URN:NBN:fi:au:hklj:788
related: URN:NBN:fi:au:hklj:789

Lauluyhtyeet ilman säestystä
type: Class
type: Concept
subclass of: Lauluyhtyeet (2-9 laulajaa)
alternative label: Duetot, laulumusiikki (783.31)
alternative label: Duot, lauluyhtyeet (783.31)
alternative label: Duetter, vokalmusik (783.31) @sv
alternative label: Duor, sångensembler (783.31) @sv
broader: Lauluyhtyeet (2-9 laulajaa)
in scheme: URN:NBN:fi:au:hklj:
notation: 783.31
preferred label: Unaccompanied vocal groups @en
preferred label: Sånggrupper utan ackompanjemang @sv
related: URN:NBN:fi:au:hklj:770
related: URN:NBN:fi:au:hklj:784
related: URN:NBN:fi:au:hklj:784.111
related: URN:NBN:fi:au:hklj:788
related: URN:NBN:fi:au:hklj:789
scope note: Duot, tertsetit, kvartetit, kvintetit jne.
scope note: Duor, tersetter, kvartetter, kvintetter osv. @sv

Sekakuorot
type: Class
type: Concept
subclass of: Kuorot ilman säestystä
alternative label: Sekakuorot, a cappella (783.411)
alternative label: Blandade körer, a cappella (783.411) @sv
broader: Kuorot ilman säestystä
in scheme: URN:NBN:fi:au:hklj:
notation: 783.411
preferred label: Mixed voice choirs @en
preferred label: Blandade körer @sv
related: URN:NBN:fi:au:hklj:770
related: URN:NBN:fi:au:hklj:784
related: URN:NBN:fi:au:hklj:784.111
related: URN:NBN:fi:au:hklj:788
related: URN:NBN:fi:au:hklj:789

Mieskuorot
type: Class
type: Concept
subclass of: Kuorot ilman säestystä
alternative label: Mieskuorot, a cappella (783.412)
alternative label: Manskörer, a cappella (783.412) @sv
broader: Kuorot ilman säestystä
in scheme: URN:NBN:fi:au:hklj:
notation: 783.412
preferred label: Male voice choirs @en
preferred label: Manskörer @sv
related: URN:NBN:fi:au:hklj:770
related: URN:NBN:fi:au:hklj:784
related: URN:NBN:fi:au:hklj:784.111
related: URN:NBN:fi:au:hklj:788
related: URN:NBN:fi:au:hklj:789

Naiskuorot
type: Class
type: Concept
subclass of: Kuorot ilman säestystä
alternative label: Naiskuorot, a cappella (783.413)
alternative label: Damkörer, a cappella (783.413) @sv
broader: Kuorot ilman säestystä
in scheme: URN:NBN:fi:au:hklj:
notation: 783.413
preferred label: Female voice choirs @en
preferred label: Damkörer @sv
related: URN:NBN:fi:au:hklj:770
related: URN:NBN:fi:au:hklj:784
related: URN:NBN:fi:au:hklj:784.111
related: URN:NBN:fi:au:hklj:788
related: URN:NBN:fi:au:hklj:789

Lapsi- ja nuorisokuorot
type: Class
type: Concept
subclass of: Kuorot ilman säestystä
alternative label: Lapsikuorot, säestyksettömät (783.414)
alternative label: Nuorisokuorot, ilman säestystä (783.414)
alternative label: Poikakuorot, a cappella (783.414)
alternative label: Tyttökuorot, ilman säestystä (783.414)
alternative label: Barnkörer, utan ackompanjemang (783.414) @sv
alternative label: Flickkörer, utan ackompanjemang (783.414) @sv
alternative label: Gosskörer, a cappella (783.414) @sv
alternative label: Ungdomskörer, utan ackompanjemang (783.414) @sv
broader: Kuorot ilman säestystä
in scheme: URN:NBN:fi:au:hklj:
notation: 783.414
preferred label: Children's and youn people's choirs @en
preferred label: Barn- och ungdomskörer @sv
related: URN:NBN:fi:au:hklj:770
related: URN:NBN:fi:au:hklj:784
related: URN:NBN:fi:au:hklj:784.111
related: URN:NBN:fi:au:hklj:788
related: URN:NBN:fi:au:hklj:789

Concerto grossot. Sinfonia concertantet
type: Class
type: Concept
subclass of: Konsertot
alternative label: Concerto grossot (785.621)
alternative label: Concertonet (785.621)
alternative label: Sinfonia concertantet (785.621)
alternative label: Concerto grosson (785.621) @sv
alternative label: Concertones (785.621) @sv
alternative label: Sinfonia concertanten (785.621) @sv
broader: Konsertot
in scheme: URN:NBN:fi:au:hklj:
notation: 785.621
preferred label: Concerti grossi. Sinfonia concertante @en
related: URN:NBN:fi:au:hklj:785.4
related: URN:NBN:fi:au:hklj:786
related: URN:NBN:fi:au:hklj:789

Luistelu
type: Class
type: Concept
subclass of: Liikunta. Urheilu
alternative label: Alamäkiluistelu (791.4)
alternative label: Jäätanssi (791.4)
alternative label: Kaunoluistelu (791.4)
alternative label: Koreografia, taitoluistelu (791.4)
alternative label: Liikemerkintä, taitoluistelu (791.4)
alternative label: Luistelu (791.4)
alternative label: Luistimet (791.4)
alternative label: Luistinradat (791.4)
alternative label: Mäkirullalautailu (791.4)
alternative label: Pariluistelu (791.4)
alternative label: Pikaluistelu (791.4)
alternative label: Roller derby, rullaluistelu (791.4)
alternative label: Rullalaudat (791.4)
alternative label: Rullalauistimet (791.4)
alternative label: Rullalautailu (791.4)
alternative label: Rullaluistelu (791.4)
alternative label: Short track, luistelu (791.4)
alternative label: Skeittailu (791.4)
alternative label: Skeittaus (791.4)
alternative label: Taitoluistelu (791.4)
alternative label: Temppupotkulautailu (791.4)
alternative label: Hastighetsåkning, skridsko (791.4) @sv
alternative label: Ice cross downhill (791.4) @sv
alternative label: Isdans (791.4) @sv
alternative label: Konståkning (791.4) @sv
alternative label: Koreografi, konståkning (791.4) @sv
alternative label: Longboardåkning (791.4) @sv
alternative label: Paråkning (791.4) @sv
alternative label: Roller derby, rullskridskoåkning (791.4) @sv
alternative label: Rullbräden (791.4) @sv
alternative label: Rullbrädsåkning (791.4) @sv
alternative label: Rullskridskor (791.4) @sv
alternative label: Rullskridskoåkning (791.4) @sv
alternative label: Rörelsenotation, konståkning (791.4) @sv
alternative label: Short track, skridskoåkning (791.4) @sv
alternative label: Skateboardsåkning (791.4) @sv
alternative label: Skridskobanor (791.4) @sv
alternative label: Skridskor (791.4) @sv
alternative label: Skridskoåkning (791.4) @sv
alternative label: Skönskrinning (791.4) @sv
alternative label: Tricksparkcykling (791.4) @sv
broader: Liikunta. Urheilu
in scheme: URN:NBN:fi:au:hklj:
notation: 791.4
preferred label: Skating @en
preferred label: Skridskoåkning @sv
related: Liikuntatiede ja -tutkimus. Liikuntapolitiikka
related: Liikunnan ja urheilun historia
related: URN:NBN:fi:au:hklj:791.409
related: Hiihto. Alppihiihto. Ampumahiihto
scope note: Pikaluistelu. Short track. Taitoluistelu. Jäätanssi Rullaluistelu. Rullalautailu eli skeittaus Luistelu kilpa-, huippu- ja kuntourheilun kannalta Luistelu- ym. -kilpailut, -säännöt, -valmennus ja -välineet Luistinradat ym. urheilun kannalta. Luisteluseurat ja -järjestöt
scope note: Hastighetsåkning. Short track. Konståkning. Isdans Rullskridskoåkning. Rullbrädesåkning (skateboardåkning) Skridskoåkning ur tävlings-, elit- och motionsidrottens synvinkel Skridskotävlingar och liknande tävlingar, regler, träning och redskap inom dem Skridskobanor och liknande tävlingsplatser ur idrottens synvinkel Skridskoklubbar och skridskoförbund @sv

Moottoripyöräurheilu
type: Class
type: Concept
subclass of: Moottoriurheilu. Lentourheilu
alternative label: Enduro (791.82)
alternative label: Jääspeedway (791.82)
alternative label: Maastoajo, moottoripyöräily (791.82)
alternative label: Moottoripyöräily (791.82)
alternative label: Moottoripyöräurheilu (791.82)
alternative label: Mopoilu (791.82)
alternative label: Motocross (791.82)
alternative label: Rata-ajot, moottoripyöräurheilu (791.82)
alternative label: Ratamoottoripyöräily (791.82)
alternative label: Road racing (791.82)
alternative label: Speedway (791.82)
alternative label: Stadion-cross (791.82)
alternative label: Trial (791.82)
alternative label: Banåkning, motorcykelsport (791.82) @sv
alternative label: Isracing (791.82) @sv
alternative label: Mopedkörning (791.82) @sv
alternative label: Motorcykelsport (791.82) @sv
alternative label: Motorcykelåkning (791.82) @sv
alternative label: Roadracing (791.82) @sv
alternative label: Stadioncross (791.82) @sv
alternative label: Terrängkörning, motorcykelkörning (791.82) @sv
broader: Moottoriurheilu. Lentourheilu
in scheme: URN:NBN:fi:au:hklj:
notation: 791.82
preferred label: Motorcycle sports @en
preferred label: Motorcykelsport @sv
related: Maaliikenne
related: Tiet. Kadut. Tienrakennus. Kadunrakennus
related: Moottoripyörät. Mopedit
related: Liikenneopetus. Liikenneturvallisuus
related: Liikuntatiede ja -tutkimus. Liikuntapolitiikka
scope note: Rata- ja maastoajo. Enduro. Motocross. Speedway. Trial Jos teos koskee sekä moottoripyöräurheilua että moottoripyöriä, on etusija luokalla 791.82
scope note: Roadracing och körning i terräng. Enduro. Motocross. Speedway. Trial Om verket rör både motorcykelsport och motorcyklar ges företräde åt klass 791.82 @sv

Voimistelu
type: Class
type: Concept
subclass of: LIIKUNTA. URHEILU. LEIKIT. HUVIT
alternative label: Aerobic (792)
alternative label: Akrobatia, voimistelu (792)
alternative label: Cheerleading (792)
alternative label: Feldenkrais-menetelmä, voimistelu (792)
alternative label: Hypyt, voimistelu (792)
alternative label: Ilma-akrobatia, voimistelu (792)
alternative label: Joukkuevoimistelu (792)
alternative label: Koreografia, voimistelu (792)
alternative label: Kuntopyörät, kuntoilu (792)
alternative label: Kuntovoimistelu (792)
alternative label: Liikemerkintä, voimistelu (792)
alternative label: Liikkeet, voimistelu (792)
alternative label: Liikuntamuodot, eri liikuntamuodot (791 ... 796 +)
alternative label: Maailmanmestaruuskisat, lajeittain (791 ... 796 +)
alternative label: Maajoukkueet, eri urheilulajit (791 ... 796 +)
alternative label: Method Putkisto (792)
alternative label: Musiikkiliikunta, aerobic ym. voimistelu (792)
alternative label: Naisvoimistelu (792)
alternative label: Pilates-menetelmä (792)
alternative label: Ruumiinkulttuuri, liikunta, eri lajit (791 ... 796 +)
alternative label: Rytminen kilpavoimistelu (792)
alternative label: Satuliikunta, satuvoimistelu (792)
alternative label: Satuvoimistelu (792)
alternative label: Spinning (792)
alternative label: Stretching (792)
alternative label: Taitovoimistelu (792)
alternative label: Tankotanssi (792)
alternative label: Tasapainoharjoittelu (792)
alternative label: Taukovoimistelu (792)
alternative label: TeamGym (792)
alternative label: Telinevoimistelu (792)
alternative label: Trampoliinivoimistelu (792)
alternative label: Tuolijumppa (792)
alternative label: Työpaikkavoimistelu (792)
alternative label: Urheilulajit, eri urheilulajit (791 ... 796 +)
alternative label: Vauvavoimistelu (792)
alternative label: Venyttely (792)
alternative label: Venytykset (792)
alternative label: Vesiliikunta, vesivoimistelu (792)
alternative label: Vesiurheilu, vesivoimistelu (792)
alternative label: Vesivoimistelu (792)
alternative label: Voimistelu (792)
alternative label: Voimistelumusiikki, musiikkiliikunta (792)
alternative label: Voimistelusalit, voimistelu (792)
alternative label: Välinevoimistelu (792)
alternative label: Äiti ja lapsi -voimistelu (792)
alternative label: Äitiysvoimistelu (792)
alternative label: Akrobatik, gymnastik (792) @sv
alternative label: Arbetsplatsgymnastik (792) @sv
alternative label: Babygymnastik (792) @sv
alternative label: Balansträning (792) @sv
alternative label: Balansövning (792) @sv
alternative label: Damgymnastik (792) @sv
alternative label: Feldenkraismetoden, gymnastik (792) @sv
alternative label: Gymnastik (792) @sv
alternative label: Gymnastik med redskap (792) @sv
alternative label: Gymnastikmusik, musikrörelse (792) @sv
alternative label: Gymnastiksalar, gymnastik (792) @sv
alternative label: Hopp, gymnastik (792) @sv
alternative label: Idrottsgrenar, olika idrottsgrenar (791 ... 796 +) @sv
alternative label: Koreografi, gymnastik (792) @sv
alternative label: Kroppskultur, motion, olika grenar (791 ... 796 +) @sv
alternative label: Laggymnastik (792) @sv
alternative label: Landslag, olika idrottsgrenar (791 ... 796 +) @sv
alternative label: Luftakrobatik, gymnastik (792) @sv
alternative label: Mor och barn-gymnastik (792) @sv
alternative label: Motionscyklar, motionsidrott (792) @sv
broader: LIIKUNTA. URHEILU. LEIKIT. HUVIT
in scheme: URN:NBN:fi:au:hklj:
notation: 792
related: URN:NBN:fi:au:hklj:613.31
related: Lastenhoito
related: Fysioterapia. Fysiologiset hoitomuodot
related: Raskaus. Sikiönkehitys. Synnytys. Gynekologia
related: Muut urheilu- ja liikuntamuodot
scope note: Voimistelun yleisteokset Aerobic. Cheerleading. Joukkuevoimistelu. Method Putkisto. Musiikkiliikunta. Naisvoimistelu. Niska- ja hartiavoimistelu. Pilates-menetelmä. Rytminen voimistelu. Satuvoimistelu. Taukovoimistelu. TeamGym. Telinevoimistelu. Trampoliinihyppely. Työpaikkavoimistelu. Venyttely eli stretching. Äiti ja lapsi -voimistelu. Äitiysvoimistelu Lasten ja vanhusten voimisteluohjeet Voimistelu kilpa-, huippu- ja kuntourheilun kannalta Voimistelukilpailut, -säännöt, -valmennus ja -välineet Voimisteluseurat ja -järjestöt
scope note: Allmänna verk om gymnastik Aerobics. Arbetsplatsgymnastik. Barngymnastik. Cheerleading. Damgymnastik. Gymnastiska program till musik. Gymnastik för nacke och axlar. Laggymnastik. Mamma-barn-gymnastik. Mammagymnastik. Method Putkisto. Pausgymnastik. Pilatesmetoden. Redskapsgymnastik. Rytmisk sportgymnastik. Stretching. TeamGym. Trampolining. Handböcker i gymnastik för barn och äldre Gymnastik ur tävlings-, elit- och motionsidrottens synvinkel Gymnastiktävlingar, regler, träning och utrustning Gymnastikklubbar och gymnastikförbund @sv

Arpajaiset. Veikkaus. Uhkapeli
type: Class
type: Concept
subclass of: Julkiset huvit
alternative label: Arpajaiset (799.2)
alternative label: Bingo (799.2)
alternative label: Hasardit, uhkapelit (799.2)
alternative label: Kasinot (799.2)
alternative label: Kolikkopelit, peliautomaatit (799.2)
alternative label: Lotto (799.2)
alternative label: Pajatso (799.2)
alternative label: Pelaaminen, uhkapelit (799.2)
alternative label: Peliautomaatit (799.2)
alternative label: Pelikasinot (799.2)
alternative label: Raha-arpajaiset (799.2)
alternative label: Raha-automaatit (799.2)
alternative label: Raha-automaattiyhdistys (799.2)
alternative label: Rahapelit (799.2)
alternative label: Raviveikkaus (799.2)
alternative label: Ruletti (799.2)
alternative label: Toto (799.2)
alternative label: Uhkapelit (799.2)
alternative label: Vedonlyönti (799.2)
alternative label: Veikkaus (799.2)
alternative label: Venäläinen ruletti (799.2)
alternative label: Arkadspel, spelautomater (799.2) @sv
alternative label: Hasard, hasardspel (799.2) @sv
alternative label: Hasardspel (799.2) @sv
alternative label: Kasinon (799.2) @sv
alternative label: Lotterier (799.2) @sv
alternative label: Penningautomater (799.2) @sv
alternative label: Penningautomatföreningen (799.2) @sv
alternative label: Penninglotterier (799.2) @sv
alternative label: Penningspel (799.2) @sv
alternative label: Rulett (799.2) @sv
alternative label: Rysk roulette (799.2) @sv
alternative label: Rysk rulett (799.2) @sv
alternative label: Spelande, hasardspel (799.2) @sv
alternative label: Spelautomat (799.2) @sv
alternative label: Spelautomater (799.2) @sv
alternative label: Spelkasinon (799.2) @sv
alternative label: Tippning (799.2) @sv
alternative label: Totalisatorspel (799.2) @sv
alternative label: Vadhållning (799.2) @sv
broader: Julkiset huvit
in scheme: URN:NBN:fi:au:hklj:
notation: 799.2
preferred label: Lotteries. Pools. Gambling @en
preferred label: Lotterier. Tippning. Hasardspel @sv
related: Hevosurheilu. Ratsastus
related: Pelit
related: Korttipelit. Pasianssit
related: Shakki
related: Roolipelit
scope note: Bingo. Lotto. Pajatso. Raha-automaatit. Ruletti. Toto. V5. Vedonlyönti Pelikasinot. Pelihallit Raha-automaattiyhdistys
scope note: Bingo. Lotto. Pajazzo. Rulett. Spelautomater. Totalisatorspel. V5. Vadslagning. Spelkasinon. Spelhallar Penningautomatföreningen @sv

Balttilaisten kielten kirjallisuuden historia ja tutkimus
type: Class
type: Concept
subclass of: ROMAANISTEN, SLAAVILAISTEN JA BALTTILAISTEN KIELTEN KIRJALLISUUDEN HISTORIA JA TUTKIMUS
alternative label: Balttilaiset kielet, kirjallisuuden historia (839)
alternative label: Dainat, folkloristiikka (839)
alternative label: Latvian kieli, kirjallisuuden historia (839)
alternative label: Liettuan kieli, kirjallisuuden historia (839)
alternative label: Baltiska språk, litteraturhistoria (839) @sv
alternative label: Dainos, folkloristik (839) @sv
alternative label: Lettiska, litteraturhistoria (839) @sv
alternative label: Litauiska, litteraturhistoria (839) @sv
broader: ROMAANISTEN, SLAAVILAISTEN JA BALTTILAISTEN KIELTEN KIRJALLISUUDEN HISTORIA JA TUTKIMUS
in scheme: URN:NBN:fi:au:hklj:
notation: 839
preferred label: Baltic literature: history and research @en
preferred label: Baltisk litteraturhistoria och forskning i baltisk litteratur @sv
related: URN:NBN:fi:au:hklj:9.1
related: URN:NBN:fi:au:hklj:9.11
related: URN:NBN:fi:au:hklj:9.12
scope note: Latvian- ja liettuankielisen kirjallisuuden historia ja tutkimus
scope note: Litteraturhistoria och litteraturforskning som rör lettiska och litauiska @sv

Kreikankielisen kirjallisuuden historia ja tutkimus
type: Class
type: Concept
subclass of: MUIDEN KIELTEN KIRJALLISUUDEN HISTORIA JA TUTKIMUS
alternative label: Antiikki, kirjallisuudenhistoria, kreikka (842)
alternative label: Ilias, tutkimus (842)
alternative label: Klassillinen kreikka, kirjallisuuden historia (842)
alternative label: Klassinen kreikka, kirjallisuuden historia (842)
alternative label: Kreikan kieli, muinaiskreikka, kirj.historia (842)
alternative label: Kreikka, kirj.historia, antiikki (842)
alternative label: Labyrintit, folkloristiikka, kreikan kieli (842)
alternative label: Muinaiskreikan kieli, kirjallisuuden historia (842)
alternative label: Muinaiskreikka, kirjallisuuden historia (842)
alternative label: Odysseia, folkloristiikka (842)
alternative label: Seireenit, folkloristiikka, muinaiskreikka (842)
alternative label: Antiken, litteraturhistoria, grekiska (842) @sv
alternative label: Grekiska, forngrekiska, litt.historia (842) @sv
alternative label: Grekland, litt.historia, antiken (842) @sv
alternative label: Iliaden, forskning (842) @sv
alternative label: Klassisk grekiska, litteraturhistoria (842) @sv
alternative label: Labyrinter, folkloristik, grekiska (842) @sv
alternative label: Odyssén, folkloristik (842) @sv
alternative label: Sirener, folkloristik, forngrekiska (842) @sv
broader: MUIDEN KIELTEN KIRJALLISUUDEN HISTORIA JA TUTKIMUS
in scheme: URN:NBN:fi:au:hklj:
narrower: Nykykreikankielisen kirjallisuuden historia ja tutkimus
notation: 842
preferred label: Greek literature: history and research @en
preferred label: Grekisk litteraturhistoria och forskning i grekisk litteratur @sv
related: Vanha aika
related: URN:NBN:fi:au:hklj:9.2
related: Kreikan muinaishistoria ja arkeologia
scope note: Muinaiskreikankielisen kirjallisuuden historia ja tutkimus Teokset, jotka koskevat sekä muinais- että nykykreikankielisen kirjallisuuden historiaa ja tutkimusta
scope note: Litteraturhistoria och litteraturforskning som rör forngrekiska Verk som handlar om litteraturhistoria och litteraturforskning som rör både forngrekiska och nygrekiska @sv

Indoiraanisten kielten kirjallisuuden historia ja tutkimus
type: Class
type: Concept
subclass of: MUIDEN KIELTEN KIRJALLISUUDEN HISTORIA JA TUTKIMUS
alternative label: Afroaasialaiset kielet, kirjallisuudenhistoria (845 ... 849)
alternative label: Afroasiatiska språk, litteraturhistoria (845 ... 849) @sv
broader: MUIDEN KIELTEN KIRJALLISUUDEN HISTORIA JA TUTKIMUS
in scheme: URN:NBN:fi:au:hklj:
narrower: Iranilaisten kielten kirjallisuuden historia ja tutkimus
narrower: Intialaisten kielten kirjallisuuden historia ja tutkimus
notation: 846
preferred label: Indo-Iranian languages' literature: history and research @en
preferred label: De indoiranska språkens litteraturhistoria och forskning i de indoiranska språkens litteratur @sv
related: URN:NBN:fi:au:hklj:9.6
scope note: Indoiraanisten kielten kirjallisuuden historian ja tutkimuksen yleisteokset
scope note: Allmänna verk om indoiransk litteraturhistoria och forskning i indoiransk litteratur @sv

Suomen kielen ainekirjoitusoppaat
type: Class
type: Concept
subclass of: Suomen kieli
alternative label: Ainekirjoitus, suomen kieli (884.8)
alternative label: Ainekokoelmat, suomen kieli (884.8)
alternative label: Kirjoittamaan oppiminen, suomen kieli, ainekirjoitus (884.8)
alternative label: Kirjoittaminen, suomen kieli, ainekirjoitus (884.8)
alternative label: Prosessikirjoittaminen, ainekirjoitusoppaat, suomi (884.8)
alternative label: Suomen kieli, ainekirjoitusoppaat (884.8)
alternative label: Ylioppilastehtävät, ainekirjoitus, suomi (884.8)
alternative label: Ylioppilastehtävät, äidinkieli, suomi (884.8)
alternative label: Finska, handböcker i uppsatsskrivning (884.8) @sv
alternative label: Processkrivning, handböcker i uppsatsskrivning (884.8) @sv
alternative label: Skrivande, finska, uppsatsskrivning (884.8) @sv
alternative label: Skrivinlärning, finska, uppsatsskrivning (884.8) @sv
alternative label: Studentuppgifter, modersmål, finska (884.8) @sv
alternative label: Studentuppgifter, uppsatsskrivning, finska (884.8) @sv
alternative label: Uppsatssamlingar, finska (884.8) @sv
alternative label: Uppsatsskrivning, finska (884.8) @sv
broader: Suomen kieli
in scheme: URN:NBN:fi:au:hklj:
notation: 884.8
preferred label: Handbooks of Finnish composition @en
preferred label: Handböcker i uppsatsskrivning på finska @sv
related: Metodologia
related: URN:NBN:fi:au:hklj:188.4
related: Sähköposti. Verkkojuttelu
related: URN:NBN:fi:au:hklj:627.7512
related: Itämerensuomalaiset kielet
scope note: Suomen kielen ainekirjoitusoppaat ja ainekokoelmat
scope note: Handböcker i uppsatsskrivning på finska och samlingar av finska uppsatser @sv

Seemiläiset kielet. Haamilaiset kielet
type: Class
type: Concept
subclass of: MUUT KIELET
alternative label: Afroaasialaiset kielet (891 +)
alternative label: Afroaasialaiset kielet, kielitiede (891 +)
alternative label: Foinikian kieli (891)
alternative label: Seemiläis-haamilaiset kielet (891 +)
alternative label: Afroasiatiska språk (891 +) @sv
alternative label: Afroasiatiska språk, lingvistik (891 +) @sv
alternative label: Feniciska (891) @sv
alternative label: Semitisk-hamitiska språk (891 +) @sv
broader: MUUT KIELET
in scheme: URN:NBN:fi:au:hklj:
narrower: Seemiläiset kielet
narrower: Haamilaiset kielet
notation: 891
preferred label: Semitic languages. Hamitic languages @en
preferred label: Semitiska språk. Hamitiska språk @sv
related: Kirjoituksen historia. Paleografia. Epigrafia
scope note: Teokset, jotka koskevat sekä seemiläisiä että haamilaisia kieliä
scope note: Verk som handlar om både semitiska och hamitiska språk @sv

Irlannin tasavallan eli Eiren historia
type: Class
type: Concept
subclass of: Irlannin historia
alternative label: Eire, historia (958.1)
alternative label: Irlannin tasavalta, historia (958.1)
alternative label: Irländska republiken, historia (958.1) @sv
broader: Irlannin historia
in scheme: URN:NBN:fi:au:hklj:
notation: 958.1
preferred label: History of the Irish Republic (Eire) @en
preferred label: Irländska republikens (Eires) historia @sv
related: Brittein saaret
related: Irlanti
related: Irlannin tasavalta, Eire
related: URN:NBN:fi:au:hklj:909
related: URN:NBN:fi:au:hklj:919

Itävallan historia
type: Class
type: Concept
subclass of: Itävallan ja Unkarin historia
alternative label: Itävalta, historia (974.1)
alternative label: Österrike, historia (974.1) @sv
broader: Itävallan ja Unkarin historia
in scheme: URN:NBN:fi:au:hklj:
notation: 974.1
preferred label: Austria's history @en
preferred label: Österrikes historia @sv
related: Unkari
related: Itävalta
related: Wien
related: URN:NBN:fi:au:hklj:909
related: URN:NBN:fi:au:hklj:919

Unkarin historia
type: Class
type: Concept
subclass of: Itävallan ja Unkarin historia
alternative label: Budapest, historia (974.2)
alternative label: Unkari, historia (974.2)
alternative label: Unkarilaiset, historia (974.2)
alternative label: Ungern, historia (974.2) @sv
alternative label: Ungrare, historia (974.2) @sv
broader: Itävallan ja Unkarin historia
in scheme: URN:NBN:fi:au:hklj:
notation: 974.2
preferred label: Hungary's history @en
preferred label: Ungerns historia @sv
related: Unkari
related: Itävalta
related: Wien
related: URN:NBN:fi:au:hklj:909
related: URN:NBN:fi:au:hklj:919

Belgian historia
type: Class
type: Concept
subclass of: URN:NBN:fi:au:hklj:970
alternative label: Belgia, historia (977)
alternative label: Benelux-maat, historia, Belgia, Luxemburg (977)
alternative label: Luxemburg, historia (977)
alternative label: Belgien, historia (977) @sv
alternative label: Benelux-länder, historia, Belgien, Luxemburg (977) @sv
broader: URN:NBN:fi:au:hklj:970
in scheme: URN:NBN:fi:au:hklj:
notation: 977
preferred label: Belgium's history @en
preferred label: Belgiens historia @sv
related: Belgia
related: Luxemburg
related: URN:NBN:fi:au:hklj:909
related: URN:NBN:fi:au:hklj:919
scope note: Tässä myös Luxemburgin historia
scope note: Hit också Luxemburgs historia @sv

Slovenian historia
type: Class
type: Concept
subclass of: Entisen Jugoslavian alueen historia
alternative label: Slovenia, historia (979.51)
alternative label: Slovenien, historia (979.51) @sv
broader: Entisen Jugoslavian alueen historia
in scheme: URN:NBN:fi:au:hklj:
notation: 979.51
preferred label: Slovenia's history @en
preferred label: Sloveniens historia @sv
related: Etelä-Eurooppa
related: Pyreneiden niemimaa
related: Slovenia
related: URN:NBN:fi:au:hklj:909
related: URN:NBN:fi:au:hklj:919

Kroatian historia
type: Class
type: Concept
subclass of: Entisen Jugoslavian alueen historia
alternative label: Dalmatia, historia (979.52)
alternative label: Dalmatien, historia (979.52) @sv
broader: Entisen Jugoslavian alueen historia
in scheme: URN:NBN:fi:au:hklj:
notation: 979.52
preferred label: Croatia's history @en
preferred label: Kroatiens historia @sv
related: Etelä-Eurooppa
related: Pyreneiden niemimaa
related: Kroatia
related: URN:NBN:fi:au:hklj:909
related: URN:NBN:fi:au:hklj:919

Bosnian ja Hertsegovinan historia
type: Class
type: Concept
subclass of: Entisen Jugoslavian alueen historia
alternative label: Bosnia ja Hertsegovina, historia (979.53)
alternative label: Bosnia, historia (979.53)
alternative label: Herzegovina, historia (979.53)
alternative label: Jugoslavian hajoamissodat, Bosnia (979.53)
alternative label: Bosnien och Hercegovina, historia (979.53) @sv
alternative label: Bosnien, historia (979.53) @sv
alternative label: Hercegovina, historia (979.53) @sv
alternative label: Jugoslaviska krigen, Bosnien (979.53) @sv
broader: Entisen Jugoslavian alueen historia
in scheme: URN:NBN:fi:au:hklj:
notation: 979.53
preferred label: Bosnia-Herzegovina's history @en
preferred label: Bosnien och Hercegovinas historia @sv
related: Etelä-Eurooppa
related: Pyreneiden niemimaa
related: Bosnia ja Hertsegovina
related: URN:NBN:fi:au:hklj:909
related: URN:NBN:fi:au:hklj:919

Serbian historia
type: Class
type: Concept
subclass of: Entisen Jugoslavian alueen historia
alternative label: Serbia, historia (979.54)
alternative label: Vojvodina, historia (979.54)
alternative label: Serbien, historia (979.54) @sv
broader: Entisen Jugoslavian alueen historia
in scheme: URN:NBN:fi:au:hklj:
notation: 979.54
preferred label: Serbia's history @en
preferred label: Serbiens historia @sv
related: Etelä-Eurooppa
related: Pyreneiden niemimaa
related: Serbia
related: URN:NBN:fi:au:hklj:909
related: URN:NBN:fi:au:hklj:919
scope note: Vojvodinan historia
scope note: Vojvodinas historia @sv

Montenegron historia
type: Class
type: Concept
subclass of: Entisen Jugoslavian alueen historia
alternative label: Montenegro, historia (979.56)
broader: Entisen Jugoslavian alueen historia
in scheme: URN:NBN:fi:au:hklj:
notation: 979.56
preferred label: Montenegro's history @en
preferred label: Montenegros historia @sv
related: Etelä-Eurooppa
related: Pyreneiden niemimaa
related: Montenegro
related: URN:NBN:fi:au:hklj:909
related: URN:NBN:fi:au:hklj:919

Kosovon historia
type: Class
type: Concept
subclass of: Entisen Jugoslavian alueen historia
alternative label: Jugoslavian hajoamissodat, Kosovo (979.57)
alternative label: Kosovo, historia (979.57)
alternative label: Jugoslaviska krigen, Kosovo (979.57) @sv
broader: Entisen Jugoslavian alueen historia
in scheme: URN:NBN:fi:au:hklj:
notation: 979.57
preferred label: Kosovo's history @en
preferred label: Kosovos historia @sv
related: Etelä-Eurooppa
related: Pyreneiden niemimaa
related: Kosovo
related: URN:NBN:fi:au:hklj:909
related: URN:NBN:fi:au:hklj:919

Bulgarian historia
type: Class
type: Concept
subclass of: URN:NBN:fi:au:hklj:979
alternative label: Bulgaria, historia (979.6)
alternative label: Bulgarien, historia (979.6) @sv
broader: URN:NBN:fi:au:hklj:979
in scheme: URN:NBN:fi:au:hklj:
notation: 979.6
preferred label: Bulgaria's history @en
preferred label: Bulgariens historia @sv
related: Etelä-Eurooppa
related: Pyreneiden niemimaa
related: Bulgaria
related: URN:NBN:fi:au:hklj:909
related: URN:NBN:fi:au:hklj:919

Maltan historia
type: Class
type: Concept
subclass of: URN:NBN:fi:au:hklj:979
alternative label: Malta, historia (979.8)
broader: URN:NBN:fi:au:hklj:979
in scheme: URN:NBN:fi:au:hklj:
notation: 979.8
preferred label: Malta's history @en
preferred label: Maltas historia @sv
related: Etelä-Eurooppa
related: Pyreneiden niemimaa
related: Malta
related: URN:NBN:fi:au:hklj:909
related: URN:NBN:fi:au:hklj:919

Japanin historia
type: Class
type: Concept
subclass of: Aasian historia
alternative label: Ainut, Japanin historia (981.5)
alternative label: Itä-Aasia, historia, Japani (981.5)
alternative label: Japani, historia (981.5)
alternative label: Japanologia, kulttuuritutkimus (981.5)
alternative label: Kaukoitä, historia, Japani (981.5)
alternative label: Kuriilit, Japani, historia (981.5)
alternative label: Sahalin, Japanin historia (981.5)
alternative label: Samurait, Japanin historia (981.5)
alternative label: Ainu, Japans historia (981.5) @sv
alternative label: Fjärran Östern, historia, Japan (981.5) @sv
alternative label: Japan, historia (981.5) @sv
alternative label: Japanologi, kulturforskning (981.5) @sv
alternative label: Kurilerna, Japan, historia (981.5) @sv
alternative label: Ostasien, historia, Japan (981.5) @sv
alternative label: Sachalin, Japans historia (981.5) @sv
alternative label: Samurajer, Japans historia (981.5) @sv
broader: Aasian historia
in scheme: URN:NBN:fi:au:hklj:
notation: 981.5
preferred label: Japan's history @en
preferred label: Japans historia @sv
related: AASIA
related: Japani
related: Vanhan ajan historia
related: Vanhan ajan kulttuurihistoria
related: Keski- ja Itä-Aasian historia

Etelä-Afrikan historia
type: Class
type: Concept
subclass of: Afrikan historia
alternative label: Ambomaa, historia (985.3)
alternative label: Apartheid, Etelä-Afrikan historia (985.3)
alternative label: Betsuanamaa, historia (985.3)
alternative label: Botswana, historia (985.3)
alternative label: Buurisota (985.3)
alternative label: Buurit, historia (985.3)
alternative label: Etelä-Afrikan tasavalta, historia (985.3)
alternative label: Etelä-Afrikka, historia (985.3)
alternative label: Lesotho, historia (985.3)
alternative label: Malawi, historia (985.3)
alternative label: Mosambik, historia (985.3)
alternative label: Namibia, historia (985.3)
alternative label: Rhodesia, historia (985.3)
alternative label: Swazimaa, historia (985.3)
alternative label: Zimbabwe, historia (985.3)
alternative label: Amboland, historia (985.3) @sv
alternative label: Apartheid, Sydafrikas historia (985.3) @sv
alternative label: Bechuanaland, historia (985.3) @sv
alternative label: Boer, historia (985.3) @sv
alternative label: Boerkriget (985.3) @sv
alternative label: Moçambique, historia (985.3) @sv
alternative label: Swaziland, historia (985.3) @sv
alternative label: Sydafrika, historia (985.3) @sv
alternative label: Sydafrikanska republiken, historia (985.3) @sv
broader: Afrikan historia
in scheme: URN:NBN:fi:au:hklj:
notation: 985.3
preferred label: History of South Africa @en
preferred label: Sydafrikas historia @sv
related: Rotujen asema. Rotusyrjintä
related: AFRIKKA
related: Etelä-Afrikka
related: BRITTEIN SAARTEN HISTORIA
related: RANSKAN HISTORIA
scope note: Botswanan, Etelä-Afrikan tasavallan, Lesothon, Malawin, Mosambikin, Namibian, Sambian, Swazimaan ja Zimbabwen historia
scope note: Botswanas, Lesothos, Malawis, Moçambiques, Namibias, Swazilands, Sydafrikanska republikens, Zambias och Zimbabwes historia @sv

Yhdysvaltojen historia 1939-
type: Class
type: Concept
subclass of: Yhdysvaltojen historia
broader: Yhdysvaltojen historia
in scheme: URN:NBN:fi:au:hklj:
notation: 987.24
preferred label: History of the United States of America 1939– @en
preferred label: Förenta staternas historia 1939– @sv
related: Pohjois-Amerikka
related: Yhdysvallat, USA
related: New York
related: URN:NBN:fi:au:hklj:989

Uusimman ajan filosofia
type: Class
type: Concept
subclass of: Filosofian historia
alternative label: Dialektinen materialismi, filosofia, 1800-luku (108.5)
alternative label: Filosofian historia, uusin aika (108.5)
alternative label: Hegeliläisyys (108.5)
alternative label: Hegeliläisyys, 1800-luvun filosofia (108.5)
alternative label: Historiallinen materialismi, filosofia, 1800-luku (108.5)
alternative label: Irrationalismi, filosofia, 1800-luvun filosofia (108.5)
alternative label: Marksilaisuus, 1800-luvun filosofia (108.5)
alternative label: Marksismi, 1800-luvun filosofia (108.5)
alternative label: Marxismi, 1800-luvun filosofia (108.5)
alternative label: Materialismi, dialektinen, filosofia 1800-l. (108.5)
alternative label: Materialistinen historiankäsitys, filosofia, 1800-luku (108.5)
alternative label: Transsendentaalifilosofia, 1800-luvun filosofia (108.5)
alternative label: Transsendentalismi, 1800-luvun filosofia (108.5)
alternative label: Uusi aika, filosofia (108.4 ... 108.6)
alternative label: Uuskantilaisuus, 1800-luvun filosofia (108.5)
alternative label: Uustomismi, 1800-luvun filosofia (108.5)
alternative label: Dialektisk materialism, filosofi, 1800-talet (108.5) @sv
alternative label: Filosofins historia, nyaste tiden (108.5) @sv
alternative label: Hegelianism (108.5) @sv
alternative label: Hegelianism, 1800-talets filosofi (108.5) @sv
alternative label: Historiematerialism, filosofi, 1800-talet (108.5) @sv
alternative label: Historisk materialism, filosofi, 1800-talet (108.5) @sv
alternative label: Irrationalism, filosofi, 1800-talets filosofi (108.5) @sv
alternative label: Marksism, 1800-talets filosofi (108.5) @sv
alternative label: Marxism, 1800-talets filosofi (108.5) @sv
alternative label: Materialism, dialektisk, filosofi 1800-l. (108.5) @sv
alternative label: Materialistisk historieuppfattning, filosofi, 1800-talet (108.5) @sv
alternative label: Nya tiden, filosofi (108.4 ... 108.6) @sv
alternative label: Nykantianism, 1800-talets filosofi (108.5) @sv
alternative label: Nythomism, 1800-talets filosofi (108.5) @sv
alternative label: Transcendentalfilosofi, 1800-talets filosofi (108.5) @sv
alternative label: Transcendentalism, 1800-talets filosofi (108.5) @sv
broader: Filosofian historia
in scheme: URN:NBN:fi:au:hklj:
notation: 108.5
preferred label: Recent philosophy @en
preferred label: Nyare tidens filosofi @sv
related: Oppikirjat. Johdatukset filosofiaan
related: Esseet
related: URN:NBN:fi:au:hklj:110
related: Tietoteorian historia ja suunnat
related: Sosialismi. Kommunismi
related: Uusimman ajan kulttuurihistoria 1789-1913
scope note: Romantiikan ajan idealismi, positivismi, marxismi, pragmatismi, uuskantilaisuus, irrationalismi ja historismi 1800-luvun loppuun Fichte, Schlegel, Schleiermacher, Schelling, Hegel, Feuerbach, Marx, Engels, Schopenhauer, Comte, Saint-Simon, Mill, Spencer, Kierkegaard, Nietzsche ja heidän aikalaistensa filosofia Filosofian erikoisalojen kysymykset alan mukaisessa luokassa
scope note: Idealism, positivism, marxism, pragmatism, nykantism irrationalism och historism från romantiken till 1800-talets slut Fichte, Schlegel, Schleiermacher, Schelling, Hegel, Feuerbach, Marx, Engels, Schopenhauer, Comte, Saint-Simon, Mill, Spencer, Kierkegaard, Nietzsche och deras samtida inom filosofin Specialfrågor inom filosofin klassificeras enligt område @sv

Syvyyspsykologia
type: Class
type: Concept
subclass of: Psykologian suunnat
alternative label: Analyyttinen psykologia, syvyyspsykologian suunnat (123.5)
alternative label: Arkkityypit, syvyyspsykologia (123.5)
alternative label: Freudilaisuus, psykologian koulukunnat (123.5)
alternative label: Jungilaisuus (123.5)
alternative label: Kollektiivinen muisti, jungilaisuus (123.5)
alternative label: Piilotajunta, syvyyspsykologian suunnat (123.5)
alternative label: Psykoanalyysi, syvyyspsykologia (123.5)
alternative label: Psykoanalyyttiset teoriat, syvyyspsykologia (123.5)
alternative label: Psykologia, syvyyspsykologia (123.5)
alternative label: Symboliikka, syvyyspsykologia (123.5)
alternative label: Symbolit, syvyyspsykologia (123.5)
alternative label: Syvyyspsykologia (123.5)
alternative label: Tiedostamaton , syvyyspsykologia (123.5)
alternative label: Tiedostamaton sielunelämä, syvyyspsykologia (123.5)
alternative label: Unet, syvyyspsykologia (123.5)
alternative label: Unien tulkinta, syvyyspsykologia (123.5)
alternative label: Vertauskuvat, syvyyspsykologia (123.5)
alternative label: Vietit, syvyyspsykologia (123.5)
alternative label: Analytisk psykologi, djuppsykologins riktningar (123.5) @sv
alternative label: Arketyper, djuppsykologi (123.5) @sv
alternative label: Det omedvetna, djuppsykologi (123.5) @sv
alternative label: Djuppsykologi (123.5) @sv
alternative label: Drifter, djuppsykologi (123.5) @sv
alternative label: Drömmar, djuppsykologi (123.5) @sv
alternative label: Drömtolkning, djuppsykologi (123.5) @sv
alternative label: Freudianism, psykologins skolor (123.5) @sv
alternative label: Jungianism (123.5) @sv
alternative label: Kollektivt minne, jungianism (123.5) @sv
alternative label: Omedvetna , djuppsykologi (123.5) @sv
alternative label: Omedvetna själslivet, djuppsykologi (123.5) @sv
alternative label: Psykoanalys, djuppsykologi (123.5) @sv
alternative label: Psykoanalytiska teorier, djuppsykologi (123.5) @sv
alternative label: Psykologi, djuppsykologi (123.5) @sv
alternative label: Sinnebilder, djuppsykologi (123.5) @sv
alternative label: Symboler, djuppsykologi (123.5) @sv
alternative label: Symbolik, djuppsykologi (123.5) @sv
alternative label: Undermedvetna, djuppsykologins riktningar (123.5) @sv
broader: Psykologian suunnat
in scheme: URN:NBN:fi:au:hklj:
notation: 123.5
preferred label: Depth psychology @en
preferred label: Djuppsykologi @sv
related: Tiedostamaton sielunelämä
related: Uni
related: Alitajunta
related: Hypnoosi. Suggestio
related: Muita psykologian aloja
related: Analyyttinen psykoterapia
scope note: Syvyyspsykologia, psykoanalyysi, freudilaisuus ja jungilaisuus psykologis-psykiatrisina koulukuntina yleensä
scope note: Djuppsykologi, psykoanalys, freudianism och jungianism som psykologisk-psykiatriska skolor i allmänhet @sv

Metodologia
type: Class
type: Concept
subclass of: Tieteenfilosofia. Metodologia
alternative label: Abduktiivinen päättely, tieteen metodit (151.2)
alternative label: Abstraktit, tutkielman laadinta (151.2)
alternative label: Aineistolähtöinen teoria, tieteen metodit (151.2)
alternative label: Aineistot, tutkimusmenetelmät (151.2)
alternative label: Aistihavainnot, tieteen metodit (151.2)
alternative label: Aksiomaattinen menetelmä, tieteen metodit (151.2)
alternative label: Aksioomat, tieteen metodologia (151.2)
alternative label: Altmetriikka, tiede (151.2)
alternative label: Analyysi, tieteen metodit (151.2)
alternative label: Analyysimenetelmät, tieteen metodit (151.2)
alternative label: Argumentaatioteoria, tieteen metodit (151.2)
alternative label: Argumentointi, tieteen metodit (151.2)
alternative label: Arviointitutkimus, tieteen metodit (151.2)
alternative label: Autentikointi (151.2)
alternative label: Bibliometria, tiede (151.2)
alternative label: Bibliometriikka, tiede (151.2)
alternative label: Case-tutkimus, tieteen metodit (151.2)
alternative label: Deskriptio, metodit (151.2)
alternative label: Diskurssianalyysi, tieteen metodit (151.2)
alternative label: Diskurssintutkimus, tieteen metodit (151.2)
alternative label: Eläinkokeet, tieteen metodit (151.2)
alternative label: Empiirinen tutkimus, tieteen metodit (151.2)
alternative label: Epävarmuus, tieteen metodit (151.2)
alternative label: Evaluaatiotutkimus, tieteen metodit (151.2)
alternative label: Falsifiointi, tiede (151.2)
alternative label: Fokusryhmähaastattelut, tieteen metodit (151.2)
alternative label: Gradut, tutkielman laadinnan oppaat (151.2)
alternative label: Grounded theory, tieteen metodit (151.2)
alternative label: Haastattelumenetelmät , tieteen metodit (151.2)
alternative label: Haastattelututkimus, tieteen metodit (151.2)
alternative label: Harrastajatutkijat, metodologia (151.2)
alternative label: Havainnointi, tieteen metodit (151.2)
alternative label: Havainnot, tieteen metodit (151.2)
alternative label: Humanistiset tieteet, tutkimusmenetelmät (151.2)
alternative label: Hypoteesit, tieteen metodit (151.2)
alternative label: Ihmistieteet, tutkimusmenetelmät (151.2)
alternative label: Julkaisun laadinnan oppaat (151.2)
alternative label: Juurisyyanalyysi, tieteen metodit (151.2)
alternative label: Kaaosteoria, tieteen metodit (151.2)
alternative label: Katastrofiteoria, tieteen metodit (151.2)
alternative label: Kausaalisuus, tieteen metodit (151.2)
alternative label: Kausaliteetti, tieteen metodit (151.2)
alternative label: Kenttätutkimus, tieteen metodit (151.2)
alternative label: Kenttätyö, tieteellinen tutkimus (151.2)
alternative label: Keskustelu, tutkimus (151.2)
alternative label: Keskusteluanalyysi, tieteen metodit (151.2)
alternative label: Keskustelunanalyysi, tieteen metodit (151.2)
alternative label: Keskusteluntutkimus, tieteen metodit (151.2)
alternative label: Kirjallisuusviitteet, bibliometriikka (151.2)
alternative label: Kirjallisuusviitteet, tutkielman laadinta (151.2)
alternative label: Koe-eläinmallit, tieteen metodit (151.2)
alternative label: Koehenkilöt (151.2)
alternative label: Koehenkilöt, tieteen metodit (151.2)
alternative label: Koetoiminta, tiede (151.2)
alternative label: Kokeellinen tutkimus (151.2)
alternative label: Kokeelliset menetelmät (151.2)
alternative label: Kokeet, tieteen metodit (151.2)
alternative label: Kompleksisuus, tieteen metodit (151.2)
alternative label: Korvaavat menetelmät (151.2)
alternative label: Koulukunnat, tieteen metodit (151.2)
alternative label: Kriittisyys, tieteen metodit (151.2)
alternative label: Kvalitatiivinen tutkimus, tieteen metodit (151.2)
alternative label: Kvantitatiivinen tutkimus, tieteen metodit (151.2)
alternative label: Kyseenalaistaminen, tieteen metodit (151.2)
alternative label: Kyselytutkimus, tieteen metodit (151.2)
alternative label: Kysymykset, kyselytutkimus (151.2)
alternative label: Käyttäjätutkimus (151.2)
broader: Tieteenfilosofia. Metodologia
in scheme: URN:NBN:fi:au:hklj:
notation: 151.2
related: URN:NBN:fi:au:hklj:184
related: URN:NBN:fi:au:hklj:188.4
related: Filosofia. Teoria. Tutkimusmenetelmät
related: Ruotsin kielen ainekirjoitusoppaat
related: Suomen kielen ainekirjoitusoppaat
scope note: Tieteellisen tutkimuksen menetelmät yleensä Tieteellisen tutkimuksen tai tutkielman laadinta yleensä Yleiset tutkielman laadintaoppaat Ongelmanasettelu, aksioomat, hypoteesit, mallit ja lait tieteellisessä tutkimuksessa Tässä myös humanististen tieteiden yleinen metodologia Erikoisalojen metodologia alan mukaisessa luokassa
scope note: Metoder inom vetenskaplig forskning i allmänhet Vetenskaplig forskning och författande av vetenskapliga avhandlingar i allmänhet Allmänna handledningar i författande av avhandlingar Problemställning, axiom, hypoteser, modeller och lagar inom vetenskaplig forskning Hit också allmän metodologi inom de humanistiska vetenskaperna Specialområden inom metodologi klassificeras enligt område @sv

Erityislahjakkaiden opetus
type: Class
type: Concept
subclass of: Käytännön kasvatus
alternative label: Absoluuttinen sävelkorva, erikoislahjakkaiden opetus (181.8)
alternative label: Erikoislahjakkaiden opetus (181.8)
alternative label: Erikoislahjakkuus, opetus (181.8)
alternative label: Erilaiset oppijat, erikoislahjakkaiden opetus (181.8)
alternative label: Erityiskasvatus, erikoislahjakkaat (181.8)
alternative label: Erityiskoulut, erikoislahjakkaiden koulut (181.8)
alternative label: Erityisluokat, erikoislahjakkaiden luokat (181.8)
alternative label: Erityisopettajat, erikoislahjakkaiden opetus (181.8)
alternative label: Erityisopetus, erikoislahjakkaiden opetus (181.8)
alternative label: Erityispedagogiikka, erikoislahjakkaiden opetus (181.8)
alternative label: Inkluusio, koulutus, erityislahjakkaiden opetus (181.8)
alternative label: Koulukasvatus, erikoislahjakkaat (181.8)
alternative label: Kyvykkyys, erikoislahjakkaiden opetus (181.8)
alternative label: Käytännöllinen lahjakkuus, erikoislahjakkaiden opetus (181.8)
alternative label: Lahjakkuus, erikoislahjakkaiden opetus (181.8)
alternative label: Matemaattinen lahjakkuus, erikoislahjakkaiden opetus (181.8)
alternative label: Musikaalisuus, erikoislahjakkaiden opetus (181.8)
alternative label: Opetus, erikoislahjakkaiden opetus (181.8)
alternative label: Opetustavoitteet, erikoislahjakkaiden opetus (181.8)
alternative label: Oppimiskyky, erikoislahjakkaiden opetus (181.8)
alternative label: Taiteellinen lahjakkuus, erikoislahjakkaiden opetus (181.8)
alternative label: Absolut gehör, undervisning av specialbegåvade (181.8) @sv
alternative label: Begåvning, undervisning av specialbegåvade (181.8) @sv
alternative label: Elever med speciella behov, undervisning av specialbegåvade (181.8) @sv
alternative label: Fostran i skola, specialbegåvade (181.8) @sv
alternative label: Förmåga, undervisning av specialbegåvade (181.8) @sv
alternative label: Inklusion, undervisning, undervisning för specialbegåvade (181.8) @sv
alternative label: Inlärningsförmåga, undervisning av specialbegåvade (181.8) @sv
alternative label: Konstnärlig begåvning, undervisning av specialbegåvade (181.8) @sv
alternative label: Matematisk begåvning, undervisning av specialbegåvade (181.8) @sv
alternative label: Musikalitet, undervisning av specialbegåvade (181.8) @sv
alternative label: Praktisk begåvning, undervisning av specialbegåvade (181.8) @sv
alternative label: Specialbegåvning, undervisning (181.8) @sv
alternative label: Specialfostran, specialbegåvade (181.8) @sv
alternative label: Specialklasser, klasser för specialbegåvade (181.8) @sv
alternative label: Speciallärare, undervisning av specialbegåvade (181.8) @sv
alternative label: Specialpedagogik, undervisning av specialbegåvade (181.8) @sv
alternative label: Specialskolor, skolor för specialbegåvade (181.8) @sv
alternative label: Specialundervisning, undervisning av specialbegåvade (181.8) @sv
alternative label: Undervisning av specialbegåvade (181.8) @sv
alternative label: Undervisning, undervisning av specialbegåvade (181.8) @sv
alternative label: Undervisningsmål, undervisning av specialbegåvade (181.8) @sv
broader: Käytännön kasvatus
in scheme: URN:NBN:fi:au:hklj:
notation: 181.8
preferred label: Educating the exceptionally gifted @en
preferred label: Undervisning för specialbegåvade @sv
related: Kasvatusfilosofia. Kasvatustavoitteet
related: Kasvatuspsykologia
related: URN:NBN:fi:au:hklj:181.7
related: URN:NBN:fi:au:hklj:182
related: URN:NBN:fi:au:hklj:183.5
related: URN:NBN:fi:au:hklj:183.7
scope note: Tässä myös koulukasvatus, opettajan työ ja oppilashuolto erityislahjakkaiden kannalta
scope note: Hit också skoluppfostran, lärarens arbete och elevvård med hänsyn till de specialbegåvade @sv

Teosofia
type: Class
type: Concept
subclass of: Teosofia. Antroposofia. Vapaamuurarius
alternative label: Esoterismi, antroposofia (204.1)
alternative label: Esoterismi, kristosofia (204.1)
alternative label: Esoterismi, ruusuristiläisyys (204.1)
alternative label: Jälleensyntyminen, teosofia (204.1)
alternative label: Karma, teosofia (204.1)
alternative label: Kristosofia (204.1)
alternative label: Kristusviisaus (204.1)
alternative label: Meditaatio, teosofia (204.1)
alternative label: Mietiskely, teosofia (204.1)
alternative label: Reinkarnaatio, teosofia (204.1)
alternative label: Ruusuristiläisyys (204.1)
alternative label: Sielunvaellus, teosofia (204.1)
alternative label: Teosofia (204.1)
alternative label: Uudelleensyntyminen, teosofia (204.1)
alternative label: Veljeskunnat, teosofiset (204.1)
alternative label: Brödraskap, teosofiska (204.1) @sv
alternative label: Esoterism, antroposofi (204.1) @sv
alternative label: Esoterism, kristosofi (204.1) @sv
alternative label: Esoterism, rosenkreutzare (204.1) @sv
alternative label: Karma, teosofi (204.1) @sv
alternative label: Kristosofi (204.1) @sv
alternative label: Meditation, meditaatio, teosofi (204.1) @sv
alternative label: Meditation, mietiskely, teosofi (204.1) @sv
alternative label: Pånyttfödelse, övriga religioner och ockultism, teosofi (204.1) @sv
alternative label: Reinkarnation, teosofi (204.1) @sv
alternative label: Rosenkreutzare (204.1) @sv
alternative label: Själavandring, teosofi (204.1) @sv
alternative label: Teosofi (204.1) @sv
alternative label: Återfödelse, teosofi (204.1) @sv
broader: Teosofia. Antroposofia. Vapaamuurarius
in scheme: URN:NBN:fi:au:hklj:
notation: 204.1
preferred label: Theosophy @en
preferred label: Teosofi @sv
related: RAJATIETO
related: URN:NBN:fi:au:hklj:192
related: Astrologia. Horoskoopit
related: Unikirjat
related: Uskonnonfilosofia
related: URN:NBN:fi:au:hklj:280
scope note: Teosofia, ruusuristiläisyys ja kristosofia yleensä Teosofisesta, ruusuristiläisestä tai kristosofisesta näkökulmasta kirjoitetut erikoisaloja koskevat teokset alan mukaisessa luokassa
scope note: Teosofi, rosenkreutzare och kristosofi i allmänhet Verk som rör specialområden ur teosofisk, rosenkreutziansk eller kristosofisk synvinkel klassificeras enligt område @sv

Uskonto ja valtio
type: Class
type: Concept
subclass of: YLEINEN USKONTOTIEDE. YLEINEN USKONNONFILOSOFIA
alternative label: Antiklerikalismi (207)
alternative label: Jumalanpilkka (207)
alternative label: Kirkkokritiikki (207)
alternative label: Kirkon ja valtion suhde, uskonto ja valtio (207)
alternative label: Kirkosta eroaminen, uskonnonvapaus (207)
alternative label: Teokratia, uskonto ja valtio (207)
alternative label: Tunnustuksellisuus, uskonto ja valtio (207)
alternative label: Uskonnollinen syrjintä, uskonto ja valtio (207)
alternative label: Uskonnonvapaus, uskontotiede (207)
alternative label: Uskontopolitiikka (207)
alternative label: Uskontorikokset, uskontotiede (207)
alternative label: Yhteiskunnalliset vaikutukset, uskonnot (207)
alternative label: Yhteiskuntavaikutukset, uskonnot (207)
alternative label: Antiklerikalism (207) @sv
alternative label: Brott mot trosfrid, religionsvetenskap (207) @sv
alternative label: Hädelse (207) @sv
alternative label: Konfessionalism, religionen och staten (207) @sv
alternative label: Kyrkans och statens förhållande, religionen och staten (207) @sv
alternative label: Kyrkokritik (207) @sv
alternative label: Religionsfrihet, religionsvetenskap (207) @sv
alternative label: Religionspolitik (207) @sv
alternative label: Religiös diskriminering, religion och stat (207) @sv
alternative label: Samhälleliga effekter, religioner (207) @sv
alternative label: Teokrati, religionen och staten (207) @sv
alternative label: Utträde ur kyrkan, religionsfrihet (207) @sv
broader: YLEINEN USKONTOTIEDE. YLEINEN USKONNONFILOSOFIA
in scheme: URN:NBN:fi:au:hklj:
notation: 207
preferred label: Religion and the state @en
preferred label: Religionen och staten @sv
related: Uskonnonfilosofia
related: Uskontososiologia
related: URN:NBN:fi:au:hklj:209
related: URN:NBN:fi:au:hklj:210
related: Kristinuskon filosofia
related: URN:NBN:fi:au:hklj:323
scope note: Uskonnon suhteet valtioon tai yhteiskuntaelämään. Uskonnonvapaus Tässä myös uskonnon ja valtion tai uskonnon ja yhteiskuntaelämän välisiä suhteita koskeva uskonnonfilosofia Tässä sekä kristinuskon että muiden uskontojen ja uskonnollisten yhteisöjen suhde valtioon ja yhteiskuntaan
scope note: Religionen i förhållande till staten eller samhällslivet. Religionsfrihet Hit också religionsfilosofi som rör förhållandet mellan religion och stat eller religion och samhällsliv Hit både kristendomens och andra religioners eller religiösa samfunds förhållande till staten eller samhället @sv

Kristologia
type: Class
type: Concept
subclass of: KRISTILLINEN DOGMATIIKKA
alternative label: Doketismi (232)
alternative label: Ihmiseksi tuleminen, Kristus (232)
alternative label: Jeesus (232)
alternative label: Jeesus, Jeesuksen elämä (232)
alternative label: Jeesus, kristologia (232)
alternative label: Kristologia (232)
alternative label: Kristuksen elämä (232)
alternative label: Kristus, dogmatiikka (232)
alternative label: Kärsimys, kristologia (232)
alternative label: Lunastus, kristologia (232)
alternative label: Lunastustyö, Kristuksen (232)
alternative label: Mariologia (232)
alternative label: Messias, dogmatiikka (232)
alternative label: Mytologia, kristologia (232)
alternative label: Mytologia, mariologia (232)
alternative label: Neitsyt Maria (232)
alternative label: Raamatun henkilöt, Johannes Kastaja (232)
alternative label: Raamatun henkilöt, kristologia (232)
alternative label: Raamatun henkilöt, mariologia (232)
alternative label: Risti, kristologia (232)
alternative label: Ristiinnaulitseminen, lunastustyö, Kristuksen (232)
alternative label: Uskontojen edustajat, kristologia (232)
alternative label: Bibliska personer, Johannes Döparen (232) @sv
alternative label: Bibliska personer, kristologi (232) @sv
alternative label: Bibliska personer, mariologi (232) @sv
alternative label: Doketism (232) @sv
alternative label: Inlösning, kristologi (232) @sv
alternative label: Jesus (232) @sv
alternative label: Jesus, Jesu liv (232) @sv
alternative label: Jesus, kristologi (232) @sv
alternative label: Jungfru Maria (232) @sv
alternative label: Korset, kristologi (232) @sv
alternative label: Korsfästelse, återlösningsverk, Kristi (232) @sv
alternative label: Kristi liv (232) @sv
alternative label: Kristologi (232) @sv
alternative label: Kristus, dogmatik (232) @sv
alternative label: Lidande, kristologi (232) @sv
alternative label: Mariologi (232) @sv
alternative label: Messias, dogmatik (232) @sv
alternative label: Mytologi, kristologi (232) @sv
alternative label: Mytologi, mariologi (232) @sv
alternative label: Människoblivande, Kristus (232) @sv
alternative label: Religionernas företrädare, kristologi (232) @sv
alternative label: Återlösningsverk, Kristi (232) @sv
broader: KRISTILLINEN DOGMATIIKKA
in scheme: URN:NBN:fi:au:hklj:
notation: 232
preferred label: Christology @en
preferred label: Kristologi @sv
related: RAAMATTU. RAAMATUNTUTKIMUS
related: Uusi Testamentti
related: Evankeliumit
related: Jumalan olemus
related: Pelastusoppi. Kristillinen antropologia
related: URN:NBN:fi:au:hklj:992
scope note: Jeesus. Kristus. Messias Jeesuksen henkilö, henkilöhistoria, elämä, elämäntarina ja historiallinen todellisuus Kristuksen persoona, lunastustyö, ihmiseksi tuleminen, kärsimys ja ylösnousemus Jeesuksen omaiset. Neitsyt Maria. Mariologia. Johannes Kastaja
scope note: Jesus. Kristus. Messias Jesu person, personhistoria, liv, levnadshistoria och historiska existens Kristi person, återlösningsverk, människoblivande, lidande och uppståndelse Jesu anhöriga. Jungfru Maria. Mariologi. Johannes Döparen @sv

Laitokset. Järjestöt
type: Class
type: Concept
subclass of: EVANKELIS-LUTERILAINEN KIRKKO
alternative label: Avustusjärjestöt, kirkolliset, ev.-lut. (255)
alternative label: Diakonia, ev.-lut. kirkko (255)
alternative label: Diakoniatiede, ev.-lut. kirkko (255)
alternative label: Kansainvälinen diakonia, ev.-lut. kirkko (255)
alternative label: Kirkolliset laitokset, diakonialaitos (255)
alternative label: Kirkolliset laitokset, ev.-lut. kirkko (255)
alternative label: Kirkolliset nuorisojärjestöt, ev.-lut. kirkko (255)
alternative label: Kirkon sosiaalityö, ev.-lut. kirkko (255)
alternative label: Kristilliset järjestöt, diakonialaitos (255)
alternative label: Kristilliset järjestöt, ev.-lut. kirkko (255)
alternative label: Taizé-liike (255)
alternative label: Uskonnolliset järjestöt, kristilliset, ev.-lut. (255)
alternative label: Veljeskunnat, ev.-lut. (255)
alternative label: Brödraskap, ev.luth. (255) @sv
alternative label: Diakoni, ev.luth. kyrkan (255) @sv
alternative label: Diakonivetenskap, ev.luth. kyrkan (255) @sv
alternative label: Hjälporganisationer, kyrkliga, ev.luth. (255) @sv
alternative label: Internationell diakoni, ev.luth. kyrkan (255) @sv
alternative label: Kristna organisationer, diakoniväsen (255) @sv
alternative label: Kristna organisationer, ev.luth. kyrkan (255) @sv
alternative label: Kristna ungdomsorganisationer, ev.luth. kyrkan (255) @sv
alternative label: Kyrkans sociala arbete, ev.luth. kyrkan (255) @sv
alternative label: Kyrkliga institutioner, diakoniväsen (255) @sv
alternative label: Kyrkliga institutioner, ev.luth. kyrkan (255) @sv
alternative label: Religiösa organisationer, kristna, ev.luth. (255) @sv
alternative label: Taizé-rörelsen (255) @sv
broader: EVANKELIS-LUTERILAINEN KIRKKO
in scheme: URN:NBN:fi:au:hklj:
notation: 255
preferred label: Institutions. Organisations @en
preferred label: Institutioner. Organisationer @sv
related: Seurakunta. Seurakuntatyö
related: Sisälähetys. Evankelioiminen
related: Lähetystyö
related: URN:NBN:fi:au:hklj:260
related: Yksityinen avustus- ja huoltotyö
scope note: Ev.-lut. kirkkoon liittyvät laitokset ja järjestöt. Diakonialaitos Tiettyyn erityistoimintaan liittyvät laitokset ja järjestöt alan mukaisessa luokassa
scope note: Institutioner och organisationer inom den evangelisk-lutherska kyrkan. Diakoniväsendet Institutioner och organisationer verksamma inom specialområden klassificeras enligt område @sv

Vanha aika
type: Class
type: Concept
subclass of: KIRKKOHISTORIA
alternative label: Alkukirkko (271)
alternative label: Alkukristillisyys (271)
alternative label: Alkuseurakunta (271)
alternative label: Areiolaisuus, varhaiskristillisyys (271)
alternative label: Donatolaisuus, varhaiskristillisyys (271)
alternative label: Gnostilaisuus, kristinuskon historia (271)
alternative label: Juutalaiskristillisyys, varhaiskristillisyys (271)
alternative label: Katakombit, kirkkohistoria (271)
alternative label: Markionismi, varhaiskristillisyys (271)
alternative label: Pelagiolaisuus, varhaiskristillisyys (271)
alternative label: Vanha aika, kirkkohistoria (271)
alternative label: Varhaiskristillisyys (271)
alternative label: Arianism, tidig kristendom (271) @sv
alternative label: Donatism, tidig kristendom (271) @sv
alternative label: Gamla tiden, kyrkohistoria (271) @sv
alternative label: Gnosticism, kristendomens historia (271) @sv
alternative label: Judekristendom, tidig kristendom (271) @sv
alternative label: Katakomber, kyrkohistoria (271) @sv
alternative label: Markionism, tidig kristendom (271) @sv
alternative label: Pelagianism, tidig kristendom (271) @sv
alternative label: Tidig kristendom (271) @sv
alternative label: Urförsamlingen (271) @sv
alternative label: Urkristendomen (271) @sv
alternative label: Urkyrkan (271) @sv
broader: KIRKKOHISTORIA
in scheme: URN:NBN:fi:au:hklj:
notation: 271
preferred label: Antiquity @en
preferred label: Forntiden @sv
related: URN:NBN:fi:au:hklj:209
related: URN:NBN:fi:au:hklj:210
related: Kristillisen teologian historia
related: URN:NBN:fi:au:hklj:260
related: Kirkot ja muut uskonnolliset rakennukset
related: URN:NBN:fi:au:hklj:992

Keskiaika
type: Class
type: Concept
subclass of: KIRKKOHISTORIA
broader: KIRKKOHISTORIA
in scheme: URN:NBN:fi:au:hklj:
notation: 272
preferred label: Middle-ages @en
preferred label: Medeltiden @sv
related: URN:NBN:fi:au:hklj:209
related: URN:NBN:fi:au:hklj:210
related: Kristillisen teologian historia
related: URN:NBN:fi:au:hklj:260
related: Kirkot ja muut uskonnolliset rakennukset
related: URN:NBN:fi:au:hklj:992

Uusi aika
type: Class
type: Concept
subclass of: KIRKKOHISTORIA
alternative label: Reformaatio (273)
alternative label: Reformaatio, kirkkohistoria (273)
alternative label: Reformaation aika, kirkkohistoria (273)
alternative label: Uskonpuhdistus, kirkkohistoria (273)
alternative label: Uskonpuhdistusaika, kirkkohistoria (273)
alternative label: Uusi aika, kirkkohistoria (273)
alternative label: Vastauskonpuhdistus, kirkkohistoria (273)
alternative label: Motreformationen, kyrkohistoria (273) @sv
alternative label: Nya tiden, kyrkohistoria (273) @sv
alternative label: Reformation (273) @sv
alternative label: Reformationen, kyrkohistoria (273) @sv
alternative label: Reformationstiden, kyrkohistoria (273) @sv
broader: KIRKKOHISTORIA
in scheme: URN:NBN:fi:au:hklj:
notation: 273
preferred label: Modern age @en
preferred label: Nya tiden @sv
related: URN:NBN:fi:au:hklj:209
related: URN:NBN:fi:au:hklj:210
related: Kristillisen teologian historia
related: URN:NBN:fi:au:hklj:260
related: Kirkot ja muut uskonnolliset rakennukset
related: URN:NBN:fi:au:hklj:992

Uusin aika. Nykyaika
type: Class
type: Concept
subclass of: KIRKKOHISTORIA
broader: KIRKKOHISTORIA
in scheme: URN:NBN:fi:au:hklj:
notation: 274
preferred label: Recent. Present @en
preferred label: Nyare tid. Nutid @sv
related: URN:NBN:fi:au:hklj:209
related: URN:NBN:fi:au:hklj:210
related: Kristillisen teologian historia
related: URN:NBN:fi:au:hklj:260
related: Kirkot ja muut uskonnolliset rakennukset
related: URN:NBN:fi:au:hklj:992

Väestötilasto. Sosiaalitilasto
type: Class
type: Concept
subclass of: TILASTOTIEDE
alternative label: Ammatillinen jakautuminen, väestötilastot (312)
alternative label: Ammatinharjoittajat, väestötilastot (312)
alternative label: Ammatissa toimimaton väestö, väestötilastot (312)
alternative label: Ammatissa toimiva väestö, väestötilastot (312)
alternative label: Ammattirakenne, väestötilastot (312)
alternative label: Asukasluku (312 +)
alternative label: Asukastiheys (312 +)
alternative label: Asuntokunnat, väestötilastot (312)
alternative label: Avioituvuus, väestötilastot (312)
alternative label: Elinaika, väestötilastot (312)
alternative label: Elinajanodote, väestötilastot (312)
alternative label: Elinikä, väestötilastot (312)
alternative label: Elämänaika, väestötilastot (312)
alternative label: Etniset suhteet, väestötilastot (312)
alternative label: Globaaliset ongelmat, väestönkasvu (312 +)
alternative label: Heterogeenisuus, väestö (312 +)
alternative label: Homogeenisuus, väestö (312 +)
alternative label: Ihmiset, väestötilastot (312)
alternative label: Ikäluokat, väestötilastot (312)
alternative label: Ikärakenne, väestötilastot (312)
alternative label: Ikäryhmät, väestötilastot (312)
alternative label: Kantaväestö, väestötilastot (312)
alternative label: Kaupunkiväestö, väestötilastot (312)
alternative label: Kotitaloudet, väestötilastot (312)
alternative label: Kotitausta, väestötilastot (312)
alternative label: Kuolemansyyt, väestötilastot (312)
alternative label: Kuolevuus, väestötilastot (312)
alternative label: Kuolinsyyt, väestötilastot (312)
alternative label: Kuolleisuus, väestötilastot (312)
alternative label: Lapsikuolleisuus, väestötilastot (312)
alternative label: Liikakansoitus, väestötilastot (312)
alternative label: Lisääntyminen, väestötilastot (312)
alternative label: Maahanmuutto, väestötilastot (312)
alternative label: Maailmanlaajuiset ongelmat, väestönkasvu (312 +)
alternative label: Maalaiset, väestötilastot (312)
alternative label: Maallemuuttajat, väestötilastot (312)
alternative label: Maallemuutto, väestötilastot (312)
alternative label: Maaltamuuttajat, väestötilastot (312)
alternative label: Maaltamuutto, väestötilastot (312)
alternative label: Maaltapako, väestötilastot (312)
alternative label: Maaseutuväestö, väestötilastot (312)
alternative label: Maassamuutto, väestötilastot (312)
alternative label: Maassamuuttotilastot (312)
alternative label: Maastamuuttotilastot (312)
alternative label: Miesvaltaisuus, väestötiede (312)
alternative label: Mittausvirheet, yleiset tilastot (312 ... 316)
alternative label: Muuttoliike, väestötilastot (312)
alternative label: Naisvaltaisuus, väestötiede (312)
alternative label: Perheet, väestötilastot (312)
alternative label: Perhesuhteet, väestötilastot (312)
alternative label: Populaatiot, väestötilastot (312)
alternative label: Ruokakunnat, väestötilastot (312)
alternative label: Siirtolaisuus, väestötilastot (312)
alternative label: Sisäinen muuttoliike, väestötilastot (312)
alternative label: Sosioekonominen asema, väestötilastot (312)
alternative label: Sosioekonomiset tekijät, väestötilastot (312)
alternative label: Sukupolvet, väestötilastot (312)
alternative label: Sukupuolijakauma, väestötilastot (312)
alternative label: Sukupuolirakenne, väestötilastot (312)
alternative label: Suuret ikäluokat, väestötilastot (312)
alternative label: Syntyvyys, väestötilastot (312)
alternative label: Taaperoikäiset, väestötilastot (312)
alternative label: Taaperot, väestötilastot (312)
alternative label: Tilastointi, yleiset tilastot (312 ... 316)
alternative label: Tilastolliset mallit, yleiset tilastot (312 ... 316)
alternative label: Tilastot, väestötilastot (312)
alternative label: Tilastotiede, yleiset tilastot (312 ... 316)
broader: TILASTOTIEDE
in scheme: URN:NBN:fi:au:hklj:
narrower: Väestötiede. Väestöpolitiikka
notation: 312
related: Kansainväliset yleiset tilastot
related: Suomen yleiset tilastot
related: Muiden maiden yleiset tilastot
related: Alueellinen sosiologia. Maassamuutto
scope note: Yleiset väestö-, väestönmuutos- ja väestönlaskentatilastot Tässä myös tilastot, jotka koskevat väestön jakoa taloudellis-sosiaalisten tai kulttuuriominaisuuksien mukaan
scope note: Allmän befolkningsstatistik, statistik över befolkningsförändringar och folkräkningsstatistik Hit också statistik över hur befolkningen fördelar sig enligt socioekonomiska eller kulturella egenskaper @sv

Perintö- ja testamenttioikeus
type: Class
type: Concept
subclass of: Siviili- ja kauppaoikeus. Sopimusoikeus
alternative label: Arvoesineet, perintö- ja testamenttioikeus (333.3)
alternative label: Ennakkoperinnöt (333.3)
alternative label: Etuoikeudet, perintöoikeus (333.3)
alternative label: Irtaimisto, perintöoikeus (333.3)
alternative label: Jälkeläiset, perintöoikeus (333.3)
alternative label: Jälkisäädös (333.3)
alternative label: Jäämistöoikeus (333.3)
alternative label: Jäämistöt, lainsäädäntö (333.3)
alternative label: Kansainvälinen perintöoikeus, Euroopan unioni (333.3)
alternative label: Kuolinpesät (333.3)
alternative label: Lakiosa (333.3)
alternative label: Lesket, perintöoikeus (333.3)
alternative label: Leskeys, perintöoikeus (333.3)
alternative label: Ositus, lainsäädäntö (333.3)
alternative label: Perikunnat (333.3)
alternative label: Perilliset (333.3)
alternative label: Perimysjärjestys (333.3)
alternative label: Perinnönjako (333.3)
alternative label: Perinnöt (333.3)
alternative label: Perintöoikeus (333.3)
alternative label: Perintötilat, perintöoikeus (333.3)
alternative label: Perukirjat (333.3)
alternative label: Perunkirjat (333.3)
alternative label: Perunkirjoitus (333.3)
alternative label: Pesänjako (333.3)
alternative label: Pesänselvitys (333.3)
alternative label: Puolisisarukset, perintöoikeus (333.3)
alternative label: Sisaret, perintöoikeus (333.3)
alternative label: Sisarpuolet, perintöoikeus (333.3)
alternative label: Sisarukset, perintöoikeus (333.3)
alternative label: Sisaruus, perintöoikeus (333.3)
alternative label: Siskot, perintöoikeus (333.3)
alternative label: Sukulaiset, perintöoikeus (333.3)
alternative label: Sukulaisuus, perintöoikeus (333.3)
alternative label: Sukutilat, perintöoikeus (333.3)
alternative label: Testamentti (333.3)
alternative label: Testamenttioikeus (333.3)
alternative label: Uskottu mies, perunkirjoitus (333.3)
alternative label: Velipuolet, perintöoikeus (333.3)
alternative label: Veljet, perintöoikeus (333.3)
alternative label: Arv (333.3) @sv
alternative label: Arvingar (333.3) @sv
alternative label: Arvsförordnande (333.3) @sv
alternative label: Arvskifte (333.3) @sv
alternative label: Arvsordning (333.3) @sv
alternative label: Arvsrätt (333.3) @sv
alternative label: Avkomlingar, arvsrätt (333.3) @sv
alternative label: Avvittring, lagstiftning (333.3) @sv
alternative label: Bodelning (333.3) @sv
alternative label: Bouppteckning (333.3) @sv
alternative label: Bouppteckningar (333.3) @sv
alternative label: Bouppteckningsinstrument (333.3) @sv
alternative label: Boutredning (333.3) @sv
alternative label: Bröder, arvsrätt (333.3) @sv
alternative label: Dödsbodelägare (333.3) @sv
alternative label: Dödsbon (333.3) @sv
alternative label: Förskott på arv (333.3) @sv
alternative label: God man, bouppteckning (333.3) @sv
alternative label: Halvbröder, arvsrätt (333.3) @sv
alternative label: Halvsyskon, arvsrätt (333.3) @sv
alternative label: Halvsystrar, arvsrätt (333.3) @sv
alternative label: Internationell arvsrätt, Europeiska unionen (333.3) @sv
alternative label: Kvarlåtenskap, lagstiftning (333.3) @sv
alternative label: Kvarlåtenskapsrätt (333.3) @sv
alternative label: Laglott (333.3) @sv
alternative label: Lösöre, arvsrätt (333.3) @sv
broader: Siviili- ja kauppaoikeus. Sopimusoikeus
in scheme: URN:NBN:fi:au:hklj:
notation: 333.3
related: URN:NBN:fi:au:hklj:326.2
related: Vero-oikeus
related: Kansainvälinen oikeus
related: Suomen ja Euroopan Unionin laki- ja asetuskokoelmat
related: Muiden maiden lait
related: LIIKETALOUS. KAUPPA. MARKKINOINTI. LIIKENNEOPETUS
scope note: Jäämistöoikeus. Perunkirjoitus
scope note: Kvarlåtenskapsrätt. Bouppteckning @sv

Pohjois-Savo
type: Class
type: Concept
subclass of: Suomi
alternative label: Kuopion lääni (412.7)
alternative label: Kuopion lääni, maantiede, matkat (412.7)
alternative label: Pohjois-Savo (412.7)
alternative label: Pohjois-Savo, maantiede, matkat (412.7)
alternative label: Savo, Pohjois-Savo (412.7)
alternative label: Kuopio län (412.7) @sv
alternative label: Kuopio län, geografi, resor (412.7) @sv
alternative label: Norra Savolax (412.7) @sv
alternative label: Norra Savolax, geografi, resor (412.7) @sv
alternative label: Savolax, Norra Savolax (412.7) @sv
broader: Suomi
in scheme: URN:NBN:fi:au:hklj:
narrower: Pohjois-Karjala
notation: 412.7
preferred label: Norra Savolax @sv
related: URN:NBN:fi:au:hklj:411
related: URN:NBN:fi:au:hklj:460
related: URN:NBN:fi:au:hklj:920
related: URN:NBN:fi:au:hklj:929
scope note: Kuopion lääni
scope note: Kuopio län @sv

Itävalta
type: Class
type: Concept
subclass of: Keski-Eurooppa
alternative label: Itävalta (413.9 +)
alternative label: Itävalta, maantiede, matkat (413.9 +)
alternative label: Österrike (413.9 +) @sv
alternative label: Österrike, geografi, resor (413.9 +) @sv
broader: Keski-Eurooppa
in scheme: URN:NBN:fi:au:hklj:
narrower: Wien
notation: 413.9
preferred label: Austria @en
preferred label: Österrike @sv
related: URN:NBN:fi:au:hklj:460
related: Itävallan ja Unkarin historia
related: Itävallan historia
related: Unkarin historia

Australia. Uusi-Seelanti. Uusi-Guinea
type: Class
type: Concept
subclass of: AUSTRALIA. OSEANIA. NAPAMAAT
alternative label: Australia (451)
alternative label: Australia, maantiede, matkat (451)
alternative label: Australialaiset (451)
alternative label: Australialaiset, maantiede, matkat (451)
alternative label: Etelämeren saaret (451 ... 456)
alternative label: Etelämeren saaret, maantiede, matkat (451 ... 456)
alternative label: Maorit, Uusi-Seelanti (451)
alternative label: Papua-Uusi-Guinea (451)
alternative label: Papua-Uusi-Guinea, maantiede, matkat (451)
alternative label: Tasmania (451)
alternative label: Tasmania, maantiede, matkat (451)
alternative label: Tyynen meren saaret, Uusi-Guinea (451)
alternative label: Tyynen meren saaret, Uusi-Seelanti (451)
alternative label: Uusi-Guinea (451)
alternative label: Uusi-Guinea, maantiede, matkat (451)
alternative label: Uusi-Seelanti (451)
alternative label: Uusi-Seelanti, maantiede, matkat (451)
alternative label: Australien (451) @sv
alternative label: Australien, geografi, resor (451) @sv
alternative label: Australier (451) @sv
alternative label: Australier, geografi, resor (451) @sv
alternative label: Maorier, Nya Zeeland (451) @sv
alternative label: Nya Guinea (451) @sv
alternative label: Nya Guinea, geografi, resor (451) @sv
alternative label: Nya Zeeland (451) @sv
alternative label: Nya Zeeland, geografi, resor (451) @sv
alternative label: Papua Nya Guinea (451) @sv
alternative label: Papua Nya Guinea, geografi, resor (451) @sv
alternative label: Stillahavsöar, Nya Guinea (451) @sv
alternative label: Stillahavsöar, Nya Zeeland (451) @sv
alternative label: Söderhavsöar (451 ... 456) @sv
alternative label: Söderhavsöar, geografi, resor (451 ... 456) @sv
alternative label: Tasmanien (451) @sv
alternative label: Tasmanien, geografi, resor (451) @sv
broader: AUSTRALIA. OSEANIA. NAPAMAAT
in scheme: URN:NBN:fi:au:hklj:
notation: 451
preferred label: Australia. New Zealand. New Guinea @en
preferred label: Australien. Nya Zeeland. Nya Guinea @sv
related: Kaakkois-Aasia
related: Tyynen meren saaret
related: URN:NBN:fi:au:hklj:989
scope note: Papua-Uusi Guinea. Uuden Guinean Indonesialle kuuluva osa
scope note: Papua Nya Guinea. Det indonesiska området av Nya Guinea @sv

Löytöretket. Tutkimusmatkat
type: Class
type: Concept
subclass of: URN:NBN:fi:au:hklj:460
alternative label: Aavikot, matkakuvaukset (462 ... 469)
alternative label: Arot, matkakertomukset (462 ... 469)
alternative label: Autiomaat, matkakuvaukset (462 ... 469)
alternative label: Historialliset matkat (469)
alternative label: Keitaat, matkakuvaukset (462 ... 469)
alternative label: Kokemukset, matkakuvaukset (462 ... 469)
alternative label: Lokikirjat, merimatkojen kuvaukset (462 ... 469)
alternative label: Löytöretkeilijät, löytöretkien historia (469)
alternative label: Löytöretket, historialliset (469)
alternative label: Maailmanympärimatkat, historialliset löytöretket (469)
alternative label: Maailmanympärimatkat, historialliset tutkimusmatkat (469)
alternative label: Maailmanympäripurjehdukset, historialliset löytöretket (469)
alternative label: Maailmanympäripurjehdukset, historialliset tutkimusmatkat (469)
alternative label: Matkailijat, tutkimusmatkojen historia (469)
alternative label: Matkakertomukset, löytöretket (469)
alternative label: Matkakertomukset, tutkimusmatkat (469)
alternative label: Matkakirjallisuus, löytöretket (469)
alternative label: Matkakirjallisuus, tutkimusmatkat (469)
alternative label: Matkakirjat, löytöretket (469)
alternative label: Matkakirjat, tutkimusmatkat (469)
alternative label: Matkakuvaukset, löytöretket (469)
alternative label: Matkakuvaukset, tutkimusmatkat (469)
alternative label: Matkapäiväkirjat, löytöretket (469)
alternative label: Matkapäiväkirjat, tutkimusmatkat (469)
alternative label: Matkaraportit, tutkimusmatkat (469)
alternative label: Matkat, löytöretket (469)
alternative label: Matkat, tutkimusmatkat (469)
alternative label: Merenkulkijat, löytöretket (469)
alternative label: Merenkävijät, löytöretket (469)
alternative label: Merikirjallisuus, löytöretket (469)
alternative label: Merikirjallisuus, tutkimusmatkat (469)
alternative label: Merimatkat, löytöretket (469)
alternative label: Merimatkat, tutkimusmatkat (469)
alternative label: Purjehdus, matkakertomukset (462 ... 469)
alternative label: Päiväkirjat, matkapäiväkirjat (462 ... 469)
alternative label: Sademetsät, matkakertomukset (462 ... 469)
alternative label: Savannit, matkakertomukset (462 ... 469)
alternative label: Tundra, matkakertomukset (462 ... 469)
alternative label: Tundravyöhyke, matkakertomukset (462 ... 469)
alternative label: Tutkimusmatkailijat, tutkimusmatkat (469)
alternative label: Tutkimusmatkat (469)
alternative label: Tutkimusmatkat, historialliset (469)
alternative label: Tutkimusretket (469)
alternative label: Tutkimusretket, historialliset (469)
alternative label: Tutkimusretkikunnat, historialliset (469)
alternative label: Vuoristot, matkakertomukset (462 ... 469)
alternative label: Bergstrakter, reseskildringar (462 ... 469) @sv
alternative label: Dagböcker, resedagböcker (462 ... 469) @sv
alternative label: Erfarenheter, reseskildringar (462 ... 469) @sv
alternative label: Expeditioner, forskningsresor, historiska (469) @sv
alternative label: Forskningsfärder (469) @sv
alternative label: Forskningsfärder, historiska (469) @sv
alternative label: Forskningsresande, forskningsresor (469) @sv
alternative label: Forskningsresor (469) @sv
alternative label: Forskningsresor, historiska (469) @sv
alternative label: Historiska resor (469) @sv
alternative label: Jordenruntresor, historiska forskningsresor (469) @sv
alternative label: Jordenruntresor, historiska upptäcktsresor (469) @sv
alternative label: Loggböcker, beskrivningar av sjöresor (462 ... 469) @sv
alternative label: Oaser, reseskildringar (462 ... 469) @sv
alternative label: Regnskogar, reseskildringar (462 ... 469) @sv
alternative label: Reseberättelser, forskningsresor (469) @sv
alternative label: Reseberättelser, upptäcktsresor (469) @sv
alternative label: Resedagböcker, forskningsresor (469) @sv
alternative label: Resedagböcker, upptäcktsresor (469) @sv
alternative label: Reselitteratur, forskningsresor (469) @sv
alternative label: Reselitteratur, reseskildringar (469) @sv
broader: URN:NBN:fi:au:hklj:460
in scheme: URN:NBN:fi:au:hklj:
notation: 469
related: Matkakuvaukset
related: URN:NBN:fi:au:hklj:909
related: MUIDEN MAANOSIEN HISTORIA
related: Maantieteilijät. Tutkimusmatkailijat. Löytöretkeilijät.Kansatieteilijät. Antropologit
related: Suomi
scope note: Historialliset löytöretket sekä useita maanosia koskevat historialliset tutkimusmatkat. Löytöretkien historia Muut tutkimusmatkat maanosan, maan, alueen tai paikkakunnan luokassa 410-459 Tiettyyn tieteenalaan liittyvät tutkimusmatkat alan mukaisessa luokassa
scope note: Historiska upptäcktsresor och historiska forskningsexpeditioner som gäller flera världsdelar. Upptäcktsresornas historia Övriga forskningsexpeditioner förs enligt världsdel, land, region eller ort till klasserna 410-459 Forskningsexpeditioner som rör ett bestämt vetenskapsområde klassificeras enligt ämnesområde @sv

Antropologia
type: Class
type: Concept
subclass of: KANSATIEDE. ANTROPOLOGIA
alternative label: Alkuperäiskansat, antropologia (479 +)
alternative label: Antropologia (479 +)
alternative label: Etnologia, antropologia (479 +)
alternative label: Ihminen, antropologia (479 +)
alternative label: Ihmiset, antropologia (479 +)
alternative label: Ihmiskunta, antropologia (479 +)
alternative label: Ihmiskuva, antropologia (479 +)
alternative label: Kansatiede, antropologia (479 +)
alternative label: Newat, alkuperäiskansat, antropologia (479)
alternative label: Primitiiviset kansat, antropologia (479 +)
alternative label: Ympäristöantropologia (479 +)
alternative label: Antropologi (479 +) @sv
alternative label: Etnologi, antropologi (479 +) @sv
alternative label: Folklivsforskning, antropologi (479 +) @sv
alternative label: Miljöantropologi (479 +) @sv
alternative label: Människan, antropologi (479 +) @sv
alternative label: Människor, antropologi (479 +) @sv
alternative label: Människosyn, antropologi (479 +) @sv
alternative label: Mänskligheten, antropologi (479 +) @sv
alternative label: Newar, urbefolkningar, antropologi (479) @sv
alternative label: Primitiva folk, antropologi (479 +) @sv
alternative label: Urbefolkningar, antropologi (479 +) @sv
broader: KANSATIEDE. ANTROPOLOGIA
in scheme: URN:NBN:fi:au:hklj:
narrower: Biologinen antropologia
narrower: Kulttuuriantropologia. Sosiaaliantropologia
notation: 479
preferred label: Anthropology @en
preferred label: Antropologi @sv
related: URN:NBN:fi:au:hklj:900
related: URN:NBN:fi:au:hklj:919
scope note: Antropologian yleisteokset, joissa on sekä kulttuuri- tai sosiaaliantropologiaa että biologista tai fyysistä antropologiaa
scope note: Allmänna verk om antropologi som handlar om såväl kultur- eller socialantropologi som biologisk eller fysisk antropologi @sv

Fennoskandian geologia
type: Class
type: Concept
subclass of: GEOLOGIA
alternative label: Fennoskandia, geologia (495 +)
alternative label: Geologia, Fennoskandian geologia (495 +)
alternative label: Fennoskandien, geologi (495 +) @sv
alternative label: Geologi, Fennoskandiens geologi (495 +) @sv
broader: GEOLOGIA
in scheme: URN:NBN:fi:au:hklj:
narrower: Suomen geologia
notation: 495
preferred label: Fennoscandian geology @en
preferred label: Fennoskandiens geologi @sv
related: Geomorfologia. Geodynamiikka
related: Mineralogia. Kristallografia. Petrologia
related: URN:NBN:fi:au:hklj:495.084
related: Historiallinen geologia
scope note: Fennoskandian geologian yleisteokset Fennoskandian geologian erikoisaloja koskevat teokset alan mukaisessa luokassa
scope note: Allmänna verk om Fennoskandiens geologi Verk som rör specialområden inom Fennoskandiens geologi klassificeras enligt ämnesområde @sv

Tähtitieteelliset kojeet
type: Class
type: Concept
subclass of: Tähtitieteelliset kojeet. Ajanlasku
alternative label: Astrofotometria (522.1)
alternative label: Astronomia, observatoriot (522.1)
alternative label: Astronomia, radioteleskopia (522.1)
alternative label: Astronomia, tähtitieteelliset kojeet (522.1)
alternative label: Astrospektrometria (522.1)
alternative label: Havaintoasemat, astronomia (522.1)
alternative label: Kaukoputket, tähtitiede (522.1)
alternative label: Observatoriot (522.1)
alternative label: Peilikaukoputket, tähtitiede (522.1)
alternative label: Radioastronomia (522.1)
alternative label: Radioteleskoopit (522.1)
alternative label: Radiotähtitiede (522.1)
alternative label: Teleskoopit (522.1)
alternative label: Tähtitiede, observatoriot (522.1)
alternative label: Tähtitiede, radioteleskopia (522.1)
alternative label: Tähtitiede, tähtitieteelliset kojeet (522.1)
alternative label: Tähtitornit (522.1)
alternative label: Tähtivalokuvaus (522.1)
alternative label: Astrofotometri (522.1) @sv
alternative label: Astronomi, astronomiska apparater (522.1) @sv
alternative label: Astronomi, observatorier (522.1) @sv
alternative label: Astronomi, radioteleskopi (522.1) @sv
alternative label: Astrospektrometri (522.1) @sv
alternative label: Observationsstationer, astronomi (522.1) @sv
alternative label: Observatorier, observatoriot (522.1) @sv
alternative label: Observatorier, tähtitornit (522.1) @sv
alternative label: Radioastronomi (522.1) @sv
alternative label: Radioastronomi, radiotähtitiede (522.1) @sv
alternative label: Radioteleskop (522.1) @sv
alternative label: Spegelteleskop, astronomi (522.1) @sv
alternative label: Stellarastronomi, astronomiska apparater (522.1) @sv
alternative label: Stellarastronomi, observatorier (522.1) @sv
alternative label: Stellarastronomi, radioteleskopi (522.1) @sv
alternative label: Stjärnfotografering (522.1) @sv
alternative label: Teleskop, kaukoputket, astronomi (522.1) @sv
alternative label: Teleskop, teleskoopit (522.1) @sv
broader: Tähtitieteelliset kojeet. Ajanlasku
in scheme: URN:NBN:fi:au:hklj:
notation: 522.1
preferred label: Astronomical instruments @en
preferred label: Astronomiska instrument @sv
related: Astrologia. Horoskoopit
related: URN:NBN:fi:au:hklj:520.084
related: Ajanlasku
related: Avaruustutkimus. Avaruuslennot. Avaruusteknologia
related: Optiset ja lääketieteelliset laitteet
related: Valokuvauksen materiaalit ja tekniikka. Valokuvausoppaat
scope note: Tähtitieteelliset kojeet ja niiden käyttö tähtitieteellisessä tutkimuksessa ja tähtien havainnoinnissa Tähtikaukoputket. Teleskoopit. Tähtitornit. Observatoriot. Astrospektrometria. Astrofotometria. Tähtivalokuvaus. Radioastronomia. Radioteleskoopit
scope note: Astronomiska instrument och användning av dem inom astronomisk forskning och vid observation av stjärnor Teleskop. Observatorier. Astrospektroskopi. Astrofotometri. Stjärnfotografering. Radioastronomi. Radioteleskop @sv

Ajanlasku
type: Class
type: Concept
subclass of: Tähtitieteelliset kojeet. Ajanlasku
alternative label: Aika (522.3)
alternative label: Aika, ajanlasku (522.3)
alternative label: Ajanlasku (522.3)
alternative label: Ajanmittaus, tähtitiede (522.3)
alternative label: Almanakat, ajanlasku (522.3)
alternative label: Astronomia, ajanlasku (522.3)
alternative label: Aurinkokellot, ajanmittaus (522.3)
alternative label: Kalenterit, tähtitieteelliset (522.3)
alternative label: Karkauspäivä, ajanlasku (522.3)
alternative label: Kesäaika (522.3)
alternative label: Kronologia, ajanlasku (522.3)
alternative label: Kronologia, tähtitiede (522.3)
alternative label: Kuukaudet, ajanlasku (522.3)
alternative label: Metronomit (522.3)
alternative label: Mittaus, ajanmittaus, tähtitiede (522.3)
alternative label: Päivänpituus, almanakat, ajanlasku (522.3)
alternative label: Ramadan, Islam, kuukaudet, ajanlasku (522.3)
alternative label: Talviaika (522.3)
alternative label: Tähtitiede, ajanlasku (522.3)
alternative label: Viikonloput, ajanlasku (522.3)
alternative label: Viikonpäivät, ajanlasku (522.3)
alternative label: Vuosi, ajanlasku (522.3)
alternative label: Almanackor, tideräkning (522.3) @sv
alternative label: Astronomi, tideräkning (522.3) @sv
alternative label: Dagslängd, kalendrar, tideräkning (522.3) @sv
alternative label: Kalendrar, astronomiska (522.3) @sv
alternative label: Kronologi, astronomi (522.3) @sv
alternative label: Kronologi, tideräkning (522.3) @sv
alternative label: Metronomer (522.3) @sv
alternative label: Mätning, tidmätning, astronomi (522.3) @sv
alternative label: Månader, tideräkning (522.3) @sv
alternative label: Ramadan, Islam, månader, tideräkning (522.3) @sv
alternative label: Skottårsdag, tideräkning (522.3) @sv
alternative label: Solur, tidmätning (522.3) @sv
alternative label: Sommartid (522.3) @sv
alternative label: Stellarastronomi, tideräkning (522.3) @sv
alternative label: Tid (522.3) @sv
alternative label: Tid, tideräkning (522.3) @sv
alternative label: Tideräkning (522.3) @sv
alternative label: Tidmätning, astronomi (522.3) @sv
alternative label: Veckodagar, tideräkning (522.3) @sv
alternative label: Veckoslut, tideräkning (522.3) @sv
alternative label: Vintertid (522.3) @sv
alternative label: År, tideräkning (522.3) @sv
broader: Tähtitieteelliset kojeet. Ajanlasku
in scheme: URN:NBN:fi:au:hklj:
notation: 522.3
preferred label: Measuring time @en
preferred label: Tideräkning @sv
related: YLEISET KAUSIJULKAISUT
related: Astrologia. Horoskoopit
related: Tähtitieteelliset kojeet
related: URN:NBN:fi:au:hklj:522.309
related: Kelloteollisuus
related: Yleinen kronologia ja kronografia
scope note: Aika yleensä. Ajan mittaus. Ajanmittauskojeet Kalentereiden ja almanakan laatiminen
scope note: Tid i allmänhet. Tidmätning. Instrument för tidmätning Utarbetande av almanackor och kalendrar @sv

Fysiikka harrasteena ja ajanvietteenä
type: Class
type: Concept
subclass of: FYSIIKKA
alternative label: Ajanviete, fysiikka (530.88)
alternative label: Askartelu, fysiikka (530.88)
alternative label: Fysiikka, ajanviete (530.88)
alternative label: Harrastukset, fysiikka (530.88)
alternative label: Kokeet, fysiikka harrasteena (530.88)
alternative label: Fysik, tidsfördriv (530.88) @sv
alternative label: Hobbyer, fysik (530.88) @sv
alternative label: Prov, fysik som hobby (530.88) @sv
alternative label: Pyssel, fysik (530.88) @sv
alternative label: Tidsfördriv, fysik (530.88) @sv
broader: FYSIIKKA
in scheme: URN:NBN:fi:au:hklj:
notation: 530.88
preferred label: Physics as a hobby and pastime @en
preferred label: Fysik som hobby och fritidssysselsättning @sv
related: Luonto-oppaat. Oppikirjat
related: Matematiikka harrasteena ja ajanvietteenä
related: Kokeellinen fysiikka
related: Kemia harrasteena ja ajanvietteenä
related: URN:NBN:fi:au:hklj:620.88
related: URN:NBN:fi:au:hklj:798
scope note: Fysiikan tehtävät, probleemat ja kokeet harrastajille
scope note: Uppgifter, problem och prov för fysikintresserade @sv

Äänioppi. Mekaaniset värähtelyt
type: Class
type: Concept
subclass of: FYSIIKKA
alternative label: Aallonpituus, mekaaniset värähtelyt (535)
alternative label: Aallonpituus, äänioppi (535)
alternative label: Aaltoliike, mekaaniset värähtelyt (535)
alternative label: Aaltoliike, äänioppi (535)
alternative label: Akustiikka, fysiikka (535)
alternative label: Frekvenssit, aaltoliike (535)
alternative label: Frekvenssit, mekaaniset värähtelyt (535)
alternative label: Frekvenssit, äänioppi (535)
alternative label: Fysiikka, äänioppi (535)
alternative label: Heijastuminen, äänioppi (535)
alternative label: Huojunta, mekaaniset värähtelyt (535)
alternative label: Huojunta, äänioppi (535)
alternative label: Infraääni (535)
alternative label: Jaksolliset ilmiöt, mekaaniset värähtelyt (535)
alternative label: Jaksolliset ilmiöt, äänioppi (535)
alternative label: Kaiku, äänioppi (535)
alternative label: Kaikuluotaimet (535)
alternative label: Kaikuluotaus (535)
alternative label: Luotaimet, kaikuluotaimet (535)
alternative label: Luotaus, kaikuluotaus (535)
alternative label: Resonanssi, mekaaniset värähtelyt (535)
alternative label: Resonanssi, äänioppi (535)
alternative label: Sondit, kaikuluotaimet (535)
alternative label: Taajuus, mekaaniset värähtelyt (535)
alternative label: Taajuus, äänioppi (535)
alternative label: Ultraääni (535)
alternative label: Vakavuus, mekaaniset värähtelyt (535)
alternative label: Vakavuus, äänioppi (535)
alternative label: Vibraatio, mekaaninen (535)
alternative label: Vibraatio, äänioppi (535)
alternative label: Värähtelyt, mekaaniset (535)
alternative label: Värähtelyt, äänioppi (535)
alternative label: Ääni, fysiikka, ääniaallot (535)
alternative label: Äänioppi, fysiikka (535)
alternative label: Akustik, fysik (535) @sv
alternative label: Eko, akustik (535) @sv
alternative label: Ekolod (535) @sv
alternative label: Ekolodning (535) @sv
alternative label: Frekvens, akustik (535) @sv
alternative label: Frekvens, mekaniska svängningar (535) @sv
alternative label: Frekvenser, akustik (535) @sv
alternative label: Frekvenser, mekaniska svängningar (535) @sv
alternative label: Frekvenser, vågrörelse (535) @sv
alternative label: Fysik, akustik (535) @sv
alternative label: Infraljud (535) @sv
alternative label: Ljud, fysik, ljudvågor (535) @sv
alternative label: Ljudlära, fysik (535) @sv
alternative label: Lodning, ekolodning (535) @sv
alternative label: Periodiska fenomen, akustik (535) @sv
alternative label: Periodiska fenomen, mekaniska svängningar (535) @sv
alternative label: Perpendiklar, ekolod (535) @sv
alternative label: Reflektion, akustik (535) @sv
alternative label: Resonans, akustik (535) @sv
alternative label: Resonans, mekaniska svängningar (535) @sv
alternative label: Sonder, ekolod (535) @sv
alternative label: Stabilitet, akustik (535) @sv
alternative label: Stabilitet, mekaniska svängningar (535) @sv
alternative label: Svajning, akustik (535) @sv
alternative label: Svajning, mekaniska svängningar (535) @sv
alternative label: Svängningar, akustik (535) @sv
alternative label: Svängningar, mekaniska (535) @sv
alternative label: Ultraljud (535) @sv
alternative label: Vibrationer, akustik (535) @sv
alternative label: Vibrationer, mekanisk (535) @sv
alternative label: Våglängd, akustik (535) @sv
alternative label: Våglängd, mekaniska svängningar (535) @sv
broader: FYSIIKKA
in scheme: URN:NBN:fi:au:hklj:
notation: 535
related: Sähköoppi. Magnetismi
related: Eläinfysiologia
related: Korva. Nenäontelo. Kurkku. Korva-, nenä- ja kurkkutaudit
related: Huoneakustiikka
related: URN:NBN:fi:au:hklj:681.8
related: Musiikin psykologia. Musiikin akustiikka
scope note: Mekaaniset värähtelyt yleensä. Ääniaallot. Infraäänet. Ultraäänet Aaltojen heijastuminen. Kaiku. Kaikuluotaus. Akustiikka yleensä
scope note: Mekaniska svängningar i allmänhet. Ljudvågor. Infraljud. Ultraljud Reflekterande vågor. Eko. Ekolod. Akustik i allmänhet @sv

Kemia harrasteena ja ajanvietteenä
type: Class
type: Concept
subclass of: KEMIA
alternative label: Ajanviete, kemia (540.88)
alternative label: Askartelu, kemia (540.88)
alternative label: Harrastukset, kemia (540.88)
alternative label: Kemia, ajanvietteenä (540.88)
alternative label: Kokeet, kemia harrasteena (540.88)
alternative label: Hobbyer, kemi (540.88) @sv
alternative label: Kemi, som tidsfördriv (540.88) @sv
alternative label: Prov, kemi som hobby (540.88) @sv
alternative label: Pyssel, kemi (540.88) @sv
alternative label: Tidsfördriv, kemi (540.88) @sv
broader: KEMIA
in scheme: URN:NBN:fi:au:hklj:
notation: 540.88
preferred label: Chemistry as a hobby and pastime @en
preferred label: Kemi som hobby och fritidssysselsättning @sv
related: Luonto-oppaat. Oppikirjat
related: Matematiikka harrasteena ja ajanvietteenä
related: Fysiikka harrasteena ja ajanvietteenä
related: Kokeellinen kemia
related: URN:NBN:fi:au:hklj:620.88
related: URN:NBN:fi:au:hklj:798
scope note: Kemian tehtävät, probleemat ja kokeet harrastajille
scope note: Uppgifter, problem och prov för kemiintresserade @sv

Lääketieteen opinnot
type: Class
type: Concept
subclass of: Hoitotiede. Hoitotyö. Hoitohenkilökunta
broader: Hoitotiede. Hoitotyö. Hoitohenkilökunta
in scheme: URN:NBN:fi:au:hklj:
notation: 610.72
preferred label: Medical studies @en
preferred label: Medicinska studier @sv
related: Sovellettujen tieteiden opetusoppi
related: URN:NBN:fi:au:hklj:332.22
related: URN:NBN:fi:au:hklj:371.6
related: Lääketieteen filosofia ja etiikka
related: URN:NBN:fi:au:hklj:615
related: URN:NBN:fi:au:hklj:617
scope note: Lääketieteen opinnot yleensä Erikoislääketieteen opinnot alan mukaisessa luokassa
scope note: Medicinska studier i allmänhet Specialiserade studier i medicin klassificeras enligt område @sv

Siivous. Pesu- ja puhdistustyöt
type: Class
type: Concept
subclass of: KOTITALOUS. LAITOSTALOUS. KAUNEUDENHOITO
alternative label: Astianpesu (698)
alternative label: Astianpesukoneet, kotitalous (698)
alternative label: Desinfektio, siivous-ja puhdistustyö (698)
alternative label: Desinfektioaineet, siivous-ja puhdistustyö (698)
alternative label: Desinfiointi, siivous-ja puhdistustyö (698)
alternative label: Desinfiointiaineet, siivous-ja puhdistustyö (698)
alternative label: Farkut, vaatteiden hoito (698)
alternative label: Farmarihousut, vaatteiden hoito (698)
alternative label: Fosfaatit, pesuaineiden käyttö (698)
alternative label: Itsepuhdistuvuus, pesu ja puhdistus (698)
alternative label: Kemiallinen pesu (698)
alternative label: Keskuspölyimurit, siivoustyö (698)
alternative label: Keskuspölynimurit, siivoustyö (698)
alternative label: Kodin työt, siivous, pesu, puhdistus (698)
alternative label: Kodinkoneet, siivous (698)
alternative label: Kodintekstiilit, hoito (698)
alternative label: Kotitalouskoneet, siivous (698)
alternative label: Kuosit, hoito (698)
alternative label: Liinavaatteet, kodin tekstiilien hoito (698)
alternative label: Lingot, vaatteiden pesu (698)
alternative label: Linkoaminen, pyykinpesu (698)
alternative label: Lyhdyt, askartelu (698)
alternative label: Mankelit (698)
alternative label: Painepesurit, käyttö (698)
alternative label: Pesu (698)
alternative label: Pesuaineet, pesu ja puhdistus (698)
alternative label: Pesukoneet, käyttö (698)
alternative label: Pesulat (698)
alternative label: Pesurit, käyttö (698)
alternative label: Prässäys (698)
alternative label: Puhdistus, koti- ja laitostalous (698)
alternative label: Puhdistusaineet, pesu ja puhdistus (698)
alternative label: Puhdistuspalveluala (698)
alternative label: Puhdistuspalvelut, pesulapalvelut (698)
alternative label: Puhdistuspalvelut, siivous (698)
alternative label: Puhtaanapito, koti- ja laitostalous (698)
alternative label: Puhtaus, pesu, puhdistus, siivous (698)
alternative label: Puhtauspalveluala (698)
alternative label: Puhtauspalvelut, pesulapalvelut (698)
alternative label: Puhtauspalvelut, siivous (698)
alternative label: Pullot, keräily (698)
alternative label: Pyyheliinat, hoito (698)
alternative label: Pyyhkeet, hoito (698)
alternative label: Pyykinpesu (698)
alternative label: Pyykinpesu, pesukoneet, käyttö (698)
alternative label: Pölyimurit, siivoustyö (698)
alternative label: Pölynimurit, siivoustyö (698)
alternative label: Saippua, pesu ja puhdistus (698)
alternative label: Siivoojat, siivoojan työ (698)
alternative label: Siivous (698)
alternative label: Siivousaineet (698)
alternative label: Siivousala (698)
alternative label: Siivouskoneet, siivous (698)
alternative label: Siivousliikkeet (698)
alternative label: Siivouspalvelut (698)
alternative label: Siivousvälineet (698)
alternative label: Silitys, tekstiilien hoito (698)
alternative label: Silitysraudat, tekstiilien hoito (698)
alternative label: Silitysvälineet, tekstiilien hoito (698)
alternative label: Silkki, tekstiilien hoito (698)
alternative label: Tahranpoisto (698)
alternative label: Tahranpoistoaineet, tahranpoisto (698)
alternative label: Taloustekstiilit, hoito (698)
alternative label: Tekstiilihuolto (698)
alternative label: Tekstiilit, hoito (698)
alternative label: Vaatehuolto (698)
alternative label: Vaatteet, vaatteiden hoito (698)
broader: KOTITALOUS. LAITOSTALOUS. KAUNEUDENHOITO
in scheme: URN:NBN:fi:au:hklj:
notation: 698
related: Kemian teollisuus
related: Kodin korjaustöiden oppaat
related: URN:NBN:fi:au:hklj:681
related: Kotitalous. Kodinhoito
related: Pukeutuminen. Kauneudenhoito
scope note: Huonetilojen ja huonekalujen siivous ja puhdistus Siivoustyökalujen ja -koneiden sekä puhdistusaineiden käyttö Laitossiivous. Siivoojan työ. Siivousliikkeet Vaatteiden, liina- ja vuodevaatteiden ja muiden tekstiilien hoito, pesu, silitys, mankelointi ja säilytys Pesukoneiden, linkojen, mankelien ja silityslaitteiden sekä pesu- ja tahranpoistoaineiden käyttö. Pesulat Astioiden ja ruokailuvälineiden pesu, hoito, kiillotus ja säilytys Astianpesukoneiden ja -aineiden käyttö
scope note: Städning och rengöring av rum och möbler Användning av städredskap och städutrustning samt rengöringsmedel Städning i storhushåll. Städerskans arbete. Städfirmor Hit också städarens arbete och städföretag Vård, tvätt, strykning, mangling och förvaring av kläder, linne och sängkläder samt andra textilier Användning av tvättmaskiner, centrifuger, manglar och strykjärn samt tvättmedel och fläckurtagningsmedel. Tvättinrättningar Diskning, vård, putsning och förvaring av kärl och bestick Användning av diskmaskiner och diskmedel @sv

Uuden ajan arkkitehtuuri
type: Class
type: Concept
subclass of: URN:NBN:fi:au:hklj:720.9
alternative label: Arkkitehdit, elämäkerralliset hakuteokset (720.903 ... 720.9903)
alternative label: Art noveau, arkkitehtuuri (720.906)
alternative label: Barokki, arkkitehtuuri (720.906)
alternative label: Empire, arkkitehtuuri (720.906)
alternative label: Jugend, arkkitehtuuri (720.906)
alternative label: Kansallisromantiikka, arkkitehtuuri (720.906)
alternative label: Kertaustyylit, arkkitehtuuri (720.906)
alternative label: Klassismi, arkkitehtuuri, uusklassismi (720.906)
alternative label: Konstruktionismi, arkkitehtuuri (720.906)
alternative label: Konstruktivismi, arkkitehtuuri (720.906)
alternative label: L'art nouveau, arkkitehtuuri (720.906)
alternative label: Neoklassismi, arkkitehtuuri (720.906)
alternative label: Rokokoo, arkkitehtuuri (720.906)
alternative label: Romantiikka, arkkitehtuuri (720.906)
alternative label: Täysromantiikka, arkkitehtuuri (720.906)
alternative label: Uusbarokki, arkkitehtuuri (720.906)
alternative label: Uusgotiikka, arkkitehtuuri (720.906)
alternative label: Uusklassismi, arkkitehtuuri (720.906)
alternative label: Uusrenessanssi, arkkitehtuuri (720.906)
alternative label: Varhaisromantiikka, arkkitehtuuri (720.906)
alternative label: Wasaborg, jugend, arkkitehtuuri (720.906)
alternative label: Arkitekter, biografiska uppslagsverk (720.903 ... 720.9903) @sv
alternative label: Art nouveau, arkitektur (720.906) @sv
alternative label: Barock, arkitektur (720.906) @sv
alternative label: Empire, arkitektur (720.906) @sv
alternative label: Förromantik, arkitektur (720.906) @sv
alternative label: Högromantik, arkitektur (720.906) @sv
alternative label: Imitationsstilar, arkitektur (720.906) @sv
alternative label: Jugend, arkitektur (720.906) @sv
alternative label: Klassicism, arkitektur, nyklassicism (720.906) @sv
alternative label: Konstruktionism, arkitektur (720.906) @sv
alternative label: Konstruktivism, arkitektur (720.906) @sv
alternative label: L'art nouveau, arkitektur (720.906) @sv
alternative label: Nationalromantik, arkitektur (720.906) @sv
alternative label: Neoklassicism, arkitektur (720.906) @sv
alternative label: Nybarock, arkitektur (720.906) @sv
alternative label: Nygotik, arkitektur (720.906) @sv
alternative label: Nyklassicism, arkitektur (720.906) @sv
alternative label: Nyrenässans, arkitektur (720.906) @sv
alternative label: Rokoko, arkitektur (720.906) @sv
alternative label: Romantiken, arkitektur (720.906) @sv
alternative label: Wasaborg, jugend, arkitektur (720.906) @sv
broader: URN:NBN:fi:au:hklj:720.9
in scheme: URN:NBN:fi:au:hklj:
notation: 720.906
preferred label: Moderns age architecture @en
preferred label: Nya tidens arkitektur @sv
related: URN:NBN:fi:au:hklj:709
related: Uuden ajan taidehistoria
related: Arkkitehtuurikilpailut. Arkkitehtuurinäyttelyt. Arkkitehtuuripalkinnot
related: URN:NBN:fi:au:hklj:749.1
scope note: Euroopan uuden ajan arkkitehtuuri yleensä Tässä myös Euroopan ulkopuolinen länsimainen uuden ajan arkkitehtuuri yleensä Barokin, rokokoon, romantiikan, symbolismin, kansallisromantiikan ja jugendin arkkitehtuuri yleensä Kertaustyylien, kuten uusklassismin arkkitehtuuri yleensä Uuden ajan arkkitehtuurin erikoisaloja koskevat teokset alan mukaisessa luokassa Tietyn maan uuden ajan arkkitehtuuria tai arkkitehteja koskevat teokset maan mukaisessa luokassa
scope note: Nya tidens europeiska arkitektur i allmänhet Hit också nya tidens utomeuropeiska västerländska arkitektur i allmänhet Barockens, rokokons, romantikens, symbolismens, nationalromantikens och jugendtidens arkitektur i allmänhet Eklekticism såsom nyklassicistisk arkitektur i allmänhet Verk som handlar om specialområden inom nya tidens arkitektur klassificeras enligt område Verk som handlar om nya tidens arkitektur eller arkitekter i ett bestämt land klassificeras enligt land @sv

Eurooppa
type: Class
type: Concept
subclass of: URN:NBN:fi:au:hklj:720.9
broader: URN:NBN:fi:au:hklj:720.9
in scheme: URN:NBN:fi:au:hklj:
notation: 720.91
preferred label: Europe @en
preferred label: Europa @sv
related: URN:NBN:fi:au:hklj:709
related: Arkkitehtuurikilpailut. Arkkitehtuurinäyttelyt. Arkkitehtuuripalkinnot
related: Alkuperäiskansojen arkkitehtuuri
related: Esihistoriallisen ajan arkkitehtuuri
related: Vanhan ajan arkkitehtuuri. Euroopan ulkopuolisten vanhojen kulttuurien arkkitehtuuri
related: URN:NBN:fi:au:hklj:749.1
scope note: Euroopan arkkitehtuurin yleisteokset
scope note: Allmänna verk om europeisk arkitektur @sv

Pohjoismaat. Baltian maat
type: Class
type: Concept
subclass of: URN:NBN:fi:au:hklj:720.9
alternative label: Baltia, arkkitehtuuri (720.92)
alternative label: Islanti, arkkitehtuuri (720.92)
alternative label: Latvia, arkkitehtuuri (720.92)
alternative label: Liettua, arkkitehtuuri (720.92)
alternative label: Pohjoismaat, arkkitehtuuri (720.92 +)
alternative label: Pohjola, arkkitehtuuri (720.92 +)
alternative label: Ruotsi, arkkitehtuuri (720.92)
alternative label: Viro, arkkitehtuuri (720.92)
alternative label: Baltikum, arkitektur (720.92) @sv
alternative label: Estland, arkitektur (720.92) @sv
alternative label: Island, arkitektur (720.92) @sv
alternative label: Lettland, arkitektur (720.92) @sv
alternative label: Litauen, arkitektur (720.92) @sv
alternative label: Norden, arkitektur (720.92 +) @sv
alternative label: Nordiska länderna, arkitektur (720.92 +) @sv
alternative label: Sverige, arkitektur (720.92) @sv
broader: URN:NBN:fi:au:hklj:720.9
in scheme: URN:NBN:fi:au:hklj:
narrower: Suomi
notation: 720.92
preferred label: Nordic countries. Baltic countries @en
preferred label: Norden. Baltikum @sv
related: URN:NBN:fi:au:hklj:709
related: Arkkitehtuurikilpailut. Arkkitehtuurinäyttelyt. Arkkitehtuuripalkinnot
related: URN:NBN:fi:au:hklj:749.1
scope note: Ruotsi. Tanska. Norja. Islanti Viro. Latvia. Liettua
scope note: Sverige. Danmark. Norge. Island Estland. Lettland. Litauen @sv

Itä-Eurooppa
type: Class
type: Concept
subclass of: URN:NBN:fi:au:hklj:720.9
alternative label: Bulgaria, arkkitehtuuri (720.95)
alternative label: Neuvostoliitto, arkkitehtuuri (720.95 +)
alternative label: Puola, arkkitehtuuri (720.95)
alternative label: Bulgarien, arkitektur (720.95) @sv
alternative label: Polen, arkitektur (720.95) @sv
alternative label: Sovjetunionen, arkitektur (720.95 +) @sv
broader: URN:NBN:fi:au:hklj:720.9
in scheme: URN:NBN:fi:au:hklj:
narrower: Venäjä
notation: 720.95
preferred label: Eastern Europe @en
preferred label: Östeuropa @sv
related: URN:NBN:fi:au:hklj:709
related: Arkkitehtuurikilpailut. Arkkitehtuurinäyttelyt. Arkkitehtuuripalkinnot
related: URN:NBN:fi:au:hklj:749.1
scope note: Moldova. Ukraina. Valko-Venäjä Itsenäisten valtioiden yhteisö yleensä
scope note: Moldova (f.d. Moldavien). Ukraina. Vitryssland Oberoende staternas samvälde i allmänhet @sv

Amerikka
type: Class
type: Concept
subclass of: URN:NBN:fi:au:hklj:720.9
alternative label: Amerikka, arkkitehtuuri, moderni (720.98 +)
alternative label: Etelä-Amerikka, arkkitehtuuri, moderni (720.98)
alternative label: Pohjois-Amerikka, arkkitehtuuri, moderni (720.98 +)
alternative label: Amerika, arkitektur, modern (720.98 +) @sv
alternative label: Nordamerika, arkitektur, modern (720.98 +) @sv
alternative label: Sydamerika, arkitektur, modern (720.98) @sv
broader: URN:NBN:fi:au:hklj:720.9
in scheme: URN:NBN:fi:au:hklj:
narrower: Yhdysvallat
notation: 720.98
preferred label: Americas @en
preferred label: Amerika @sv
related: URN:NBN:fi:au:hklj:709
related: Arkkitehtuurikilpailut. Arkkitehtuurinäyttelyt. Arkkitehtuuripalkinnot
related: Alkuperäiskansojen arkkitehtuuri
related: URN:NBN:fi:au:hklj:749.1
scope note: Amerikan maiden nykyarkkitehtuuri
scope note: De amerikanska ländernas nutidsarkitektur @sv

Keskiajan kuvanveistotaide
type: Class
type: Concept
subclass of: URN:NBN:fi:au:hklj:730.9
alternative label: Bysantti, kuvanveisto (730.904)
alternative label: Gotiikka, kuvanveisto (730.904)
alternative label: Islam, kuvanveisto (730.904)
alternative label: Islamilainen taide, kuvanveisto (730.904)
alternative label: Keskiaika, kuvanveisto (730.904)
alternative label: Kuvanveistäjät, elämäkerralliset hakuteokset (730.903 ... 730.9903)
alternative label: Romaaninen tyyli, kuvanveisto (730.904)
alternative label: Bysans, skulptur (730.904) @sv
alternative label: Gotik, skulptur (730.904) @sv
alternative label: Islam, skulptur (730.904) @sv
alternative label: Islamisk konst, skulptur (730.904) @sv
alternative label: Medeltiden, skulptur (730.904) @sv
alternative label: Romansk stil, skulptur (730.904) @sv
alternative label: Skulptörer, biografiska uppslagsverk (730.903 ... 730.9903) @sv
broader: URN:NBN:fi:au:hklj:730.9
in scheme: URN:NBN:fi:au:hklj:
notation: 730.904
preferred label: Medieval sculpture @en
preferred label: Medeltida skulptur @sv
related: URN:NBN:fi:au:hklj:709
related: Keskiajan taidehistoria
related: Vanhan ajan kuvanveistotaide. Euroopan ulkopuolisten vanhojen kulttuurien kuvanveistotaide
related: Kuvanveistotaiteen materiaalit ja tekniikka
related: URN:NBN:fi:au:hklj:739
related: URN:NBN:fi:au:hklj:742
scope note: Euroopan keskiajan kuvanveistotaide yleensä Romaaninen ja goottilainen kuvanveistotaide yleensä Bysantin kuvanveistotaide yleensä Tietyn maan keskiajan kuvanveistotaidetta tai kuvanveistäjiä koskevat teokset maan mukaisessa luokassa
scope note: Europeisk medeltida skulptur i allmänhet Romansk och gotisk skulptur i allmänhet Bysantisk skulptur i allmänhet Islamisk skulptur i allmänhet Verk som handlar om medeltida skulptur eller skulptörer i ett bestämt land klassificeras enligt land @sv

Nykyajan kuvanveistotaide
type: Class
type: Concept
subclass of: URN:NBN:fi:au:hklj:730.9
alternative label: Abstrakti taide, kuvanveisto (730.907)
alternative label: Abstraktinen taide, kuvanveisto (730.907)
alternative label: Art noveau, kuvanveisto (730.907)
alternative label: Arte povera, kuvanveistotaide (730.907)
alternative label: Avant-garde, kuvanveisto (730.907)
alternative label: Avantgarde, kuvanveisto (730.907)
alternative label: Avantgardismi, kuvanveisto (730.907)
alternative label: Dada, kuvanveisto (730.907)
alternative label: Dadaismi, kuvanveisto (730.907)
alternative label: Ekspressionismi, kuvanveisto (730.907)
alternative label: Figuratiivinen taide, kuvanveisto (730.907)
alternative label: Informalismi, kuvanveisto (730.907)
alternative label: Jugend, kuvanveisto (730.907)
alternative label: Junk art, kuvanveistotaide (730.907)
alternative label: Konkreettinen taide, kuvanveisto (730.907)
alternative label: Konstruktionismi, kuvanveisto (730.907)
alternative label: Konstruktivismi, kuvanveisto (730.907)
alternative label: Kubismi, kuvanveistotaide (730.907)
alternative label: Kuvanveistäjät, elämäkerralliset hakuteokset (730.903 ... 730.9903)
alternative label: L'art nouveau, kuvanveisto (730.907)
alternative label: Minimalismi, kuvanveisto (730.907)
alternative label: Moderni taide, kuvanveisto (730.907)
alternative label: Modernismi, kuvanveisto (730.907)
alternative label: Naivismi, kuvanveisto (730.907)
alternative label: Nonfiguratiivinen taide, kuvanveisto (730.907)
alternative label: Nykytaide, kuvanveisto (730.907)
alternative label: Poptaide, kuvanveisto (730.907)
alternative label: Psykedeelinen taide, kuvanveisto (730.907)
alternative label: Realismi, kuvanveisto (730.906 ... 730.907)
alternative label: Romutaide, kuvanveistotaide (730.907)
alternative label: Sosialistinen realismi, kuvanveisto (730.907)
alternative label: Surrealismi, kuvanveisto (730.907)
alternative label: Undergroundtaide, kuvanveisto (730.907)
alternative label: Uudenaikaisuus, kuvanveisto (730.907)
alternative label: Uusasiallisuus, kuvanveisto (730.907)
alternative label: Abstrakt konst, skulptur (730.907) @sv
alternative label: Art nouveau, skulptur (730.907) @sv
alternative label: Arte povera, skulptur (730.907) @sv
alternative label: Avantgarde, skulptur (730.907) @sv
alternative label: Avantgardism, skulptur (730.907) @sv
alternative label: Dada, skulptur (730.907) @sv
alternative label: Dadaism, skulptur (730.907) @sv
alternative label: Expressionism, skulptur (730.907) @sv
alternative label: Figurativ konst, skulptur (730.907) @sv
alternative label: Informalism, skulptur (730.907) @sv
alternative label: Jugend, skulptur (730.907) @sv
alternative label: Junk art, skulptur (730.907) @sv
alternative label: Konkretism, bildkonst, skulptur (730.907) @sv
alternative label: Konstruktionism, skulptur (730.907) @sv
alternative label: Konstruktivism, skulptur (730.907) @sv
alternative label: Kubism, skulptur (730.907) @sv
alternative label: L'art nouveau, skulptur (730.907) @sv
alternative label: Minimalism, skulptur (730.907) @sv
alternative label: Modern konst, skulptur (730.907) @sv
alternative label: Modernism, skulptur (730.907) @sv
alternative label: Modernitet, skulptur (730.907) @sv
alternative label: Naivism, skulptur (730.907) @sv
alternative label: Nonfigurativ konst, skulptur (730.907) @sv
alternative label: Nutidskonst, skulptur (730.907) @sv
alternative label: Nysaklighet, skulptur (730.907) @sv
alternative label: Popkonst, skulptur (730.907) @sv
alternative label: Psykedelisk konst, skulptur (730.907) @sv
alternative label: Realism, skulptur (730.906 ... 730.907) @sv
alternative label: Skrotkonst, skulptur (730.907) @sv
alternative label: Skulptörer, biografiska uppslagsverk (730.903 ... 730.9903) @sv
alternative label: Socialistisk realism, skulptur (730.907) @sv
broader: URN:NBN:fi:au:hklj:730.9
in scheme: URN:NBN:fi:au:hklj:
notation: 730.907
related: URN:NBN:fi:au:hklj:709
related: Nykyajan taidehistoria
related: URN:NBN:fi:au:hklj:710
related: Kuvanveistotaiteen materiaalit ja tekniikka
related: URN:NBN:fi:au:hklj:739
related: URN:NBN:fi:au:hklj:742
scope note: Euroopan nykyajan kuvanveistotaide yleensä - 1900-luvun alusta alkaen Tässä myös Euroopan ulkopuolinen länsimainen nykyajan kuvanveistotaide yleensä Modernistinen ja abstrakti kuvanveistotaide yleensä Tietyn maan nykyajan kuvanveistotaidetta tai kuvanveistäjiä koskevat teokset maan mukaisessa luokassa
scope note: Europeisk nutida skulptur i allmänhet - med början från 1900-talet Hit också utomeuropeisk västerländsk nutida skulptur i allmänhet Modernistisk och abstrakt skulptur i allmänhet Verk som handlar om nutida skulptur eller skulptörer i ett bestämt land klassificeras enligt land @sv

Tekstaus. Kalligrafia
type: Class
type: Concept
subclass of: URN:NBN:fi:au:hklj:749
alternative label: Alkukirjaimet, tekstaus, kalligrafia (749.2)
alternative label: Anfangit, tekstaus, kalligrafia (749.2)
alternative label: Initiaalit, tekstaus, kalligrafia (749.2)
alternative label: Kalligrafia, kalligrafiataide (749.2)
alternative label: Kaunokirjoitus, kalligrafiataide (749.2)
alternative label: Kirjaimet, tekstaus, kalligrafia (749.2)
alternative label: Kirjaimistot, tekstaus, kalligrafia (749.2)
alternative label: Kirjoitustyylit, kalligrafia, tekstaus (749.2)
alternative label: Tekstaus (749.2)
alternative label: Tekstaus, tekstaustaide (749.2)
alternative label: Tussityöt, kalligrafia, tekstaus (749.2)
alternative label: Alfabet, textning, kalligrafi (749.2) @sv
alternative label: Anfanger, textning, kalligrafi (749.2) @sv
alternative label: Begynnelsebokstäver, textning, kalligrafi (749.2) @sv
alternative label: Bokstäver, textning, kalligrafi (749.2) @sv
alternative label: Initialer, textning, kalligrafi (749.2) @sv
alternative label: Kalligrafi, kalligrafi som konst (749.2) @sv
alternative label: Skrivstilar, kalligrafi, textning (749.2) @sv
alternative label: Textning, skrivande (749.2) @sv
alternative label: Textning, skrivande, textningskonst (749.2) @sv
alternative label: Tuscharbeten, kalligrafi, textning (749.2) @sv
alternative label: Välskrivning, kalligrafi som konst (749.2) @sv
broader: URN:NBN:fi:au:hklj:749
in scheme: URN:NBN:fi:au:hklj:
notation: 749.2
preferred label: Lettering. Calligraphy @en
preferred label: Textning. Kalligrafi @sv
related: Kirjoitus. Kirjoitustaito
related: Kirjoituksen historia. Paleografia. Epigrafia
related: URN:NBN:fi:au:hklj:709
related: Maalaustaiteen teoria, estetiikka ja filosofia
related: URN:NBN:fi:au:hklj:740.9
related: URN:NBN:fi:au:hklj:749.1
scope note: Tekstaus- ja kalligrafiataide sekä niiden historia, henkilöhistoria ja estetiikka Tekstauksen ja kalligrafian materiaalit ja tekniikka Tekstauksen ja kalligrafian käytännön oppaat ja mallit
scope note: Textningskonst och kalligrafi samt deras historia, personhistoria och estetik Material och tekniker som hänför sig till textningskonst och kalligrafi som konst Praktiska handböcker i och modeller för textningskonst och kalligrafi som konst @sv

Suomi
type: Class
type: Concept
subclass of: URN:NBN:fi:au:hklj:770.9
alternative label: Suomen kansallisteatteri (770.921)
alternative label: Suomi, teatterihistoria (770.921)
alternative label: Teatteri, teatterihistoria, Suomi (770.921)
alternative label: Teatterinäyttelijät, elämäkerrat ja muist., Suomi (770.921)
alternative label: Teatteriohjaajat, elämäkerrat ja muist., Suomi (770.921)
alternative label: Finland, teaterhistoria (770.921) @sv
alternative label: Finlands nationalteater (770.921) @sv
alternative label: Teater, teaterhistoria, Finland (770.921) @sv
alternative label: Teaterregissörer, biografier och memoarer, Finland (770.921) @sv
alternative label: Teaterskådespelare, biografier och memoarer, Finland (770.921) @sv
broader: URN:NBN:fi:au:hklj:770.9
in scheme: URN:NBN:fi:au:hklj:
notation: 770.921
preferred label: Finland @en
related: URN:NBN:fi:au:hklj:709
related: Suomen yleinen taidehistoria
related: Teatterityö
related: Teatteritekniikka
related: Elokuva. Elokuvataide
related: URN:NBN:fi:au:hklj:777.9

Yksinlaulu orkesterin ja/tai kuoron säestyksellä
type: Class
type: Concept
subclass of: Yksinlaulu
alternative label: Aariat, konserttiaariat (783.25)
alternative label: Konserttiaariat (783.25)
alternative label: Arior, konsertarior (783.25) @sv
alternative label: Konsertarior (783.25) @sv
broader: Yksinlaulu
in scheme: URN:NBN:fi:au:hklj:
notation: 783.25
preferred label: Vocal solos with orchestral and / or choral accompaniment @en
preferred label: Solosång till ackompanjemang av orkester eller kör @sv
related: URN:NBN:fi:au:hklj:770
related: Oopperoiden solistiset lauluosat
related: URN:NBN:fi:au:hklj:784
related: URN:NBN:fi:au:hklj:784.111
related: URN:NBN:fi:au:hklj:788
related: URN:NBN:fi:au:hklj:789
scope note: Konserttiaariat
scope note: Konsertarior @sv

Sinfoniat. Konsertot
type: Class
type: Concept
subclass of: URN:NBN:fi:au:hklj:785
alternative label: Orkesterimusiikki, sinfoniaorkesterit (785.4 ... 785.6 +)
alternative label: Orkesterit, sinfoniaorkesterit (785.4 ... 785.6 +)
alternative label: Sinfoniaorkesterit, sinfoniat, konsertot (785.6 +)
alternative label: Orkestermusik, symfoniorkestrar (785.4 ... 785.6 +) @sv
alternative label: Orkestrar, symfoniorkestrar (785.4 ... 785.6 +) @sv
alternative label: Symfoniorkestrar, symfonier, konserter (785.6 +) @sv
broader: URN:NBN:fi:au:hklj:785
in scheme: URN:NBN:fi:au:hklj:
narrower: Sinfoniat
narrower: Konsertot
notation: 785.6
preferred label: Symphonies. Concerti @en
preferred label: Symfonier. Konserter @sv
related: URN:NBN:fi:au:hklj:785.4
related: URN:NBN:fi:au:hklj:789
scope note: Yleisteokset ja sekasisältöiset kokoelmat, jotka koskevat sekä sinfonioita että konserttoja Muut orkesterisävellykset ko. orkesterin luokkaan
scope note: Allmänna verk och samlingar med blandat innehåll som rör både symfonier och konserter Andra orkesterkompositioner klassificeras enligt orkester @sv

Pyöräily
type: Class
type: Concept
subclass of: Liikunta. Urheilu
alternative label: BMX-pyöräily (791.3)
alternative label: Kilpapyöräily (791.3)
alternative label: Kypärät, pyöräily (791.3)
alternative label: Maantiepyöräily (791.3)
alternative label: Maastoajo, pyöräily (791.3)
alternative label: Maastopyöräily (791.3)
alternative label: Polkupyöräily (791.3)
alternative label: Pyöräilijät, pyöräily (791.3)
alternative label: Pyöräily (791.3)
alternative label: Pyöräilyreitit, maantiepyöräily (791.3 +)
alternative label: Päänsuojaimet, pyöräily (791.3)
alternative label: Rata-ajot, pyöräily (791.3)
alternative label: Ratapyöräily (791.3)
alternative label: Suojakypärät, pyöräily (791.3)
alternative label: Velodromit, pyöräily (791.3)
alternative label: BMX (791.3) @sv
alternative label: Bancykling (791.3) @sv
alternative label: Banåkning, cykling (791.3) @sv
alternative label: Cykelleder, landsvägscykling (791.3 +) @sv
alternative label: Cykelsport (791.3) @sv
alternative label: Cykelåkning (791.3) @sv
alternative label: Cykling (791.3) @sv
alternative label: Cyklister, cykling (791.3) @sv
alternative label: Hjälmar, cykling (791.3) @sv
alternative label: Huvudskydd, cykling (791.3) @sv
alternative label: Landsvägscykling (791.3) @sv
alternative label: Skyddshjälmar, cykling (791.3) @sv
alternative label: Terrängcykling (791.3) @sv
alternative label: Terrängkörning, cykling (791.3) @sv
alternative label: Velodromer, cykling (791.3) @sv
broader: Liikunta. Urheilu
in scheme: URN:NBN:fi:au:hklj:
notation: 791.3
preferred label: Cycling @en
preferred label: Cykelåkning @sv
related: Paikallisliikenne
related: Helsinki. Pääkaupunkiseutu
related: Polkupyörät
related: URN:NBN:fi:au:hklj:631
related: Liikuntatiede ja -tutkimus. Liikuntapolitiikka
related: URN:NBN:fi:au:hklj:791.309
scope note: Pyöräilyn yleisteokset Yleisteokset, jotka koskevat sekä pyöräilyä että polkupyöriä Pyöräretkeily. Kilpapyöräily. Maantiepyöräily. Ratapyöräily. Maastopyöräily Pyöräily kilpa-, huippu- ja kuntourheilun kannalta Pyöräilykilpailut, -säännöt ja -valmennus. Pyöräilyseurat ja -järjestöt Velodromit pyöräilyn kannalta
scope note: Allmänna verk som rör cykelåkning Allmänna verk om både cykelåkning och cyklar Cykelutfärder. Cykeltävlingar. Landsvägsåkning. Banåkning. Terrängcykling Cykeltävlingar ur tävlings-, elit- och motionsidrottens synvinkel Cykeltävlingar, regler och träning inom cykelsport Cykelklubbar och cykelförbund Velodromer ur cykelåkningens synvinkel @sv

Hevosurheilu. Ratsastus
type: Class
type: Concept
subclass of: Liikunta. Urheilu
alternative label: Eläinurheilu, hevosurheilu (791.7)
alternative label: Esteratsastus (791.7)
alternative label: Hevonen, ratsastus (791.7)
alternative label: Hevonen, raviurheilu (791.7)
alternative label: Hevoset, ratsastus (791.7)
alternative label: Hevoset, raviurheilu (791.7)
alternative label: Hevosurheilu (791.7)
alternative label: Jalustimet, ratsastus (791.7)
alternative label: Kenttäratsastus (791.7)
alternative label: Kilpa-ajot, hevosurheilu (791.7)
alternative label: Kouluratsastus (791.7)
alternative label: Kouluttajat, eläinten koulutus, hevosen koulutus (791.7)
alternative label: Koulutus, eläinten koulutus, hevosen koulutus (791.7)
alternative label: Kuolaimet, ratsastus (791.7)
alternative label: Kuolaimet, raviurheilu (791.7)
alternative label: Laukkakilpailut (791.7)
alternative label: Laukkaurheilu, hevosurheilu (791.7)
alternative label: Lämminverihevoset, ratsastus, hevosurheilu (791.7)
alternative label: Maastoratsastus, ratsastus (791.7)
alternative label: Naksutinkoulutus, hevosen koulutus (791.7)
alternative label: Oriit, ratsastus, hevosurheilu (791.7)
alternative label: Orit, ratsastus, hevosurheilu (791.7)
alternative label: Ratsastus (791.7)
alternative label: Ratsastusjousiammunta, hevosurheilu (791.7)
alternative label: Ratsastuskentät, ratsastus (791.7)
alternative label: Ratsastuskoulut (791.7)
alternative label: Ratsastusreitit, ratsastus (791.7)
alternative label: Ratsuhevoset, ratsastus, hevosurheilu (791.7)
alternative label: Ravihevoset, raviurheilu (791.7)
alternative label: Raviradat, hevosurheilu (791.7)
alternative label: Ravit (791.7)
alternative label: Raviurheilu (791.7)
alternative label: Ravurit, raviurheilu (791.7)
alternative label: Rodeo (791.7)
alternative label: Ruunat, ratsastus, hevosurheilu (791.7)
alternative label: Satulat, ratsastus (791.7)
alternative label: Suitset, ratsastusvälineet (791.7)
alternative label: Tammat, ratsastus, hevosurheilu (791.7)
alternative label: Valakat, ratsastus, hevosurheilu (791.7)
alternative label: Valjaat, ratsastusvälineet (791.7)
alternative label: Valjakkoajo, hevosurheilu (791.7)
alternative label: Valjakkourheilu, hevosurheilu (791.7)
alternative label: Banhoppning (791.7) @sv
alternative label: Beridet bågskytte, hästsport (791.7) @sv
alternative label: Betsel, ridutrustning (791.7) @sv
alternative label: Bett (i betsel), ridning (791.7) @sv
alternative label: Bett (i betsel), travsport (791.7) @sv
alternative label: Djursport, hästsport (791.7) @sv
alternative label: Dressyr, hästdressyr (791.7) @sv
alternative label: Dressyrritt (791.7) @sv
alternative label: Dressörer, hästdressyr (791.7) @sv
alternative label: Fältritt (791.7) @sv
alternative label: Galoppsport, hästsport (791.7) @sv
alternative label: Galopptävlingar (791.7) @sv
alternative label: Hingstar, ridning, hästsport (791.7) @sv
alternative label: Häst, ridning (791.7) @sv
alternative label: Häst, travsport (791.7) @sv
alternative label: Hästsport (791.7) @sv
alternative label: Kappkörningar, hästsport (791.7) @sv
alternative label: Klickerträning, hästdressyr (791.7) @sv
alternative label: Munlag, ridning (791.7) @sv
alternative label: Munlag, travsport (791.7) @sv
alternative label: Ridbanor, ridning (791.7) @sv
alternative label: Ridhästar, ridning, hästsport (791.7) @sv
alternative label: Ridleder, ridning (791.7) @sv
alternative label: Ridskolor (791.7) @sv
broader: Liikunta. Urheilu
in scheme: URN:NBN:fi:au:hklj:
notation: 791.7
related: Nisäkkäät
related: Eläinten vetämät kulkuneuvot
related: Hevoset
related: Liikuntatiede ja -tutkimus. Liikuntapolitiikka
related: URN:NBN:fi:au:hklj:791.709
related: Arpajaiset. Veikkaus. Uhkapeli
scope note: Esteratsastus. Kouluratsastus. Laukka- ja raviurheilu. Rodeo Ratsuhevosen koulutus. Ratsastusoppaat. Ratsastusvälineet Hevosurheilu kilpa-, huippu- ja kuntourheilun kannalta Hevosurheilukilpailut, -säännöt, -valmennus ja välineet Ravi- ja laukkaradat sekä ratsastusstadionit urheilun kannalta Hevosurheiluseurat ja -järjestöt Jos teoksessa on sekä hevosen hoitoa että hevosurheilua tai ratsastusta, on etusija luokalla 654.1
scope note: Banhoppning. Dressyr. Galoppsport (hästkapplöpning) och travsport. Rodeo Skolning av ridhästar. Handböcker i ridning. Ridutrustning Hästsport ur tävlings-, elit- och motionsidrottens synvinkel Tävlingar inom hästsport, deras regler, träning och utrustning Trav- och galoppbanor samt hippodromer ur sportens synvinkel Föreningar och förbund för hästsport Om verket handlar om såväl hästskötsel som hästsport eller ridning, ges företräde åt klass 654.1 @sv

Autourheilu
type: Class
type: Concept
subclass of: Moottoriurheilu. Lentourheilu
alternative label: Autoilijat, autourheilu (791.81)
alternative label: Autoilu, autourheilu (791.81)
alternative label: Autosuunnistus (791.81)
alternative label: Autot, moottoriurheilu (791.81)
alternative label: Autourheilu (791.81)
alternative label: Formula (791.81)
alternative label: Jäärata-ajot (791.81)
alternative label: Kartanlukijat, ralliautoilu (791.81)
alternative label: Karting (791.81)
alternative label: Kiihdytysajo (791.81)
alternative label: Kilpa-autoilu (791.81)
alternative label: Kuorma-autourheilu (791.81)
alternative label: Mikroautoilu (791.81)
alternative label: Monster-ajot (791.81)
alternative label: Ralliautoilu (791.81)
alternative label: Rallicross (791.81)
alternative label: Rata-autoilu, autourheilu (791.81)
alternative label: Truck race (791.81)
alternative label: Banracing, bilsport (791.81) @sv
alternative label: Bilar, motorsport (791.81) @sv
alternative label: Bilism, bilsport (791.81) @sv
alternative label: Bilister, bilsport (791.81) @sv
alternative label: Bilorientering (791.81) @sv
alternative label: Bilsport (791.81) @sv
alternative label: Dragracing (791.81) @sv
alternative label: Go-karting (791.81) @sv
alternative label: Isbanetävlingar (791.81) @sv
alternative label: Kartläsare, rallysport (791.81) @sv
alternative label: Lastbilsport (791.81) @sv
alternative label: Monstertävlingar (791.81) @sv
alternative label: Rally (791.81) @sv
alternative label: Rallycross (791.81) @sv
alternative label: Tävlingsbilism (791.81) @sv
broader: Moottoriurheilu. Lentourheilu
in scheme: URN:NBN:fi:au:hklj:
notation: 791.81
preferred label: Car sports @en
preferred label: Bilsport @sv
related: Maaliikenne
related: Tiet. Kadut. Tienrakennus. Kadunrakennus
related: Autot
related: Liikenneopetus. Liikenneturvallisuus
related: Liikuntatiede ja -tutkimus. Liikuntapolitiikka
related: Retkeily. Ulkoilu. Vuorikiipeily. Suunnistus
scope note: Ralli- ja rata-autoilu. Kiihdytysajot. Formula-ajot. Mikroautourheilu. Autosuunnistus. Kartanluku Jos teos koskee sekä autourheilua että autoja, on etusija luokalla 791.81
scope note: Rally och racing. Dragracing. Formellopp. Karting. Bilorientering. Kartläsning Om verket handlar om både bilsport och bilar ges företräde åt klass 791.81 @sv

Ammunta
type: Class
type: Concept
subclass of: Muut urheilu- ja liikuntamuodot
alternative label: Ammukset, ampumaurheilu (791.92)
alternative label: Ammunta, urheilu (791.92)
alternative label: Ampuma-aseet, ampumaurheilu (791.92)
alternative label: Ampumaradat, ampumaurheilu (791.92)
alternative label: Ampumatarvikkeet, ampumaurheilu (791.92)
alternative label: Ampumaurheilu (791.92)
alternative label: Ampuminen, urheilu (791.92)
alternative label: Aseenkanto, ampumaurheilu (791.92)
alternative label: Aseet, ampumaurheilu (791.92)
alternative label: Aselehdet, ampumaurheilu (791.92)
alternative label: Haulikkoammunta (791.92)
alternative label: Haulikot, ampumaurheilu (791.92)
alternative label: Haulit, ampumaurheilu (791.92)
alternative label: Jouset, jousiammunta (791.92)
alternative label: Jousiammunta (791.92)
alternative label: Kivääriammunta (791.92)
alternative label: Kiväärit, ampumaurheilu (791.92)
alternative label: Kuydo (791.92)
alternative label: Luodit, ampumaurheilu (791.92)
alternative label: Patruunat, ampumaurheilu (791.92)
alternative label: Pistooliammunta (791.92)
alternative label: Ratsastusjousiammunta, jousiammunta (791.92)
alternative label: Skeet-ammunta (791.92)
alternative label: Ammunition, sportskytte (791.92) @sv
alternative label: Beridet bågskytte, bågskytte (791.92) @sv
alternative label: Bågskytte (791.92) @sv
alternative label: Gevär, sportskytte (791.92) @sv
alternative label: Gevärsskytte (791.92) @sv
alternative label: Hagel, ammunition, sportskytte (791.92) @sv
alternative label: Hagelgevär, sportskytte (791.92) @sv
alternative label: Hagelgevärsskytte (791.92) @sv
alternative label: Kulor, sportskytte (791.92) @sv
alternative label: Patroner, sportskytte (791.92) @sv
alternative label: Pilbågar, bågskytte (791.92) @sv
alternative label: Pistolskytte (791.92) @sv
alternative label: Projektiler, sportskytte (791.92) @sv
alternative label: Skeetskytte (791.92) @sv
alternative label: Skjutbanor, sportskytte (791.92) @sv
alternative label: Skjutvapen, sportskytte (791.92) @sv
alternative label: Skytte, idrott (791.92) @sv
alternative label: Sportskytte (791.92) @sv
alternative label: Vapen, stridsredskap, sportskytte (791.92) @sv
alternative label: Vapeninnehav, sportskytte (791.92) @sv
alternative label: Vapentidningar, sportskytte (791.92) @sv
broader: Muut urheilu- ja liikuntamuodot
in scheme: URN:NBN:fi:au:hklj:
notation: 791.92
preferred label: Shooting @en
preferred label: Skytte @sv
related: Aseteknologia
related: URN:NBN:fi:au:hklj:393.09
related: Metsästys
related: Liikuntatiede ja -tutkimus. Liikuntapolitiikka
related: Hiihto. Alppihiihto. Ampumahiihto
related: Itämaisperäiset lajit. Budo
scope note: Kivääri-, pistooli-, haulikko- ja jousiammunta. Tässä myös kyudo Ammunta kilpa- ja huippu-urheilun kannalta. Ammunta harrastuksena Ammuntakilpailut, -säännöt, -valmennus ja -välineet Aseet ja ampumaradat ampumaurheilun kannalta Ammuntaseurat ja -järjestöt
scope note: Gevärs-, pistol-, lerduve- och bågskytte. Hit också kyudo Skytte ur tävlings- och elitidrottens synvinkel. Skytte som hobby Skyttetävlingar, regler, träning och utrustning Vapen och skjutbanor ur sportskyttets synvinkel Skytteklubbar och skytteförbund @sv

Muut pallopelit
type: Class
type: Concept
subclass of: Palloilu
alternative label: Bowls (796.9)
alternative label: Frisbee (796.9)
alternative label: Frisbeegolf (796.9)
alternative label: Kiekkogolf (796.9)
alternative label: Korona (796.9)
alternative label: Kroketti (796.9)
alternative label: Kuulapelit (796.9)
alternative label: Liitokiekko (796.9)
alternative label: Liitokiekkogolf (796.9)
alternative label: Mölkky (796.9)
alternative label: Petankki (796.9)
alternative label: Discgolf (796.9) @sv
alternative label: Frisbee, liitokiekko (796.9) @sv
alternative label: Krocket (796.9) @sv
alternative label: Kulspel (796.9) @sv
alternative label: Petanque (796.9) @sv
broader: Palloilu
in scheme: URN:NBN:fi:au:hklj:
notation: 796.9
preferred label: Other ball games @en
preferred label: Andra bollspel @sv
related: Muut urheilu- ja liikuntamuodot
related: Muut joukkuepelit
related: Pelit
related: Korttipelit. Pasianssit
related: Shakki
related: Roolipelit
scope note: Curling. Kroketti. Kyykkä. Mölkky. Petankki
scope note: Curling. Krocket. Mölkky. Pétanque. Poppi @sv

Postimerkkeily
type: Class
type: Concept
subclass of: URN:NBN:fi:au:hklj:798
alternative label: Aihefilatelia (798.1)
alternative label: Ajanviete, postimerkkeily (798.1)
alternative label: Albumit, postimerkkeily (798.1)
alternative label: Filatelia (798.1)
alternative label: Harrastukset, postimerkkeily (798.1)
alternative label: Huutokauppa, postimerkkihuutokauppa (798.1)
alternative label: Kenttäposti, filatelia (798.1)
alternative label: Keräily, postimerkit (798.1)
alternative label: Leimat, postimerkkeily (798.1)
alternative label: Merkit, postimerkit (798.1)
alternative label: Postihistoria, postileimat (798.1)
alternative label: Postihistoria, postimerkit (798.1)
alternative label: Postileimat (798.1)
alternative label: Postileimat, keräily (798.1)
alternative label: Postimerkit (798.1)
alternative label: Postimerkkeily (798.1)
alternative label: Postimerkkinäyttelyt (798.1)
alternative label: Postimerkkitaide (798.1)
alternative label: Album, filateli (798.1) @sv
alternative label: Auktion, frimärksauktion (798.1) @sv
alternative label: Filateli (798.1) @sv
alternative label: Frimärken (798.1) @sv
alternative label: Frimärkskonst (798.1) @sv
alternative label: Frimärkssamlande (798.1) @sv
alternative label: Frimärksutställningar (798.1) @sv
alternative label: Fältpost, filateli (798.1) @sv
alternative label: Hobbyer, frimärkssamlande (798.1) @sv
alternative label: Posthistoria, frimärken (798.1) @sv
alternative label: Posthistoria, poststämplar (798.1) @sv
alternative label: Poststämplar (798.1) @sv
alternative label: Poststämplar, samlande (798.1) @sv
alternative label: Samlarverksamhet, frimärken (798.1) @sv
alternative label: Stämplar, leimat, filateli (798.1) @sv
alternative label: Tecken, frimärken (798.1) @sv
alternative label: Temafilateli (798.1) @sv
alternative label: Tidsfördriv, frimärkssamlande (798.1) @sv
broader: URN:NBN:fi:au:hklj:798
in scheme: URN:NBN:fi:au:hklj:
notation: 798.1
preferred label: Philately @en
preferred label: Filateli @sv
related: Posti
related: URN:NBN:fi:au:hklj:384.11
related: URN:NBN:fi:au:hklj:384.1109
related: Käyttögrafiikka
related: Leikit
related: URN:NBN:fi:au:hklj:798.103
scope note: Postimerkkien, kirjekuorien ja postileimojen keräily Filatelia. Aihefilatelia Postihistoria postimerkkeilyn kannalta
scope note: Samlande av frimärken, kuvert och poststämplar Filateli. Frimärkssamlande enligt grupp Posthistoria ur filatelins synvinkel @sv

Amerikan englanninkielisen kirjallisuuden historia ja tutkimus
type: Class
type: Concept
subclass of: GERMAANISTEN KIELTEN KIRJALLISUUDEN HISTORIA JA TUTKIMUS
alternative label: Aasialaisamerikkalainen kirjallisuus, englanninkielisen kirjallisuuden tutkimus (829)
alternative label: Afroamerikkalainen kirjallisuus, englanninkielisen kirjallisuuden tutkimus (829)
alternative label: Amerikka, englanninkielisen kirjallisuuden historia (829)
alternative label: Beatnikit, Yhdysvaltain kirjallisuuden historia (829)
alternative label: Englannin kieli, kirjallisuudenhistoria (828 ... 829)
alternative label: Pohjois-Amerikka, englanninkielisen kirjallisuuden historia (829)
alternative label: Afroamerikansk litteratur, forskning i engelsk litteratur (829) @sv
alternative label: Amerika, engelsk litteraturhistoria (829) @sv
alternative label: Asiatisk-amerikansk littertur, forskning i engelsk litteratur (829) @sv
alternative label: Beatniker, Förenta staternas litteraturhistoria (829) @sv
alternative label: Engelska, litteraturhistoria (828 ... 829) @sv
alternative label: Nordamerika, engelsk litteraturhistoria (829) @sv
broader: GERMAANISTEN KIELTEN KIRJALLISUUDEN HISTORIA JA TUTKIMUS
in scheme: URN:NBN:fi:au:hklj:
notation: 829
preferred label: American-English literature: history and research @en
preferred label: Amerikansk engelsk litteraturhistoria och forskning i amerikansk engelsk litteratur @sv
related: URN:NBN:fi:au:hklj:4
related: Kirjallisuuden aihepiirejä ja kirjallisuustyyppejä koskeva historia ja tutkimus
related: Lasten- ja nuortenkirjallisuuden historia ja tutkimus
related: Englanninkielisen kirjallisuuden historia ja tutkimus
related: Ranskankielisen kirjallisuuden historia ja tutkimus
related: Englannin kieli
scope note: Pohjois-, Keski- ja Etelä-Amerikan englanninkielisen kirjallisuuden historia ja tutkimus Tässä myös USA:n ja Kanadan kirjallisuuden historian ja tutkimuksen yleisteokset
scope note: Engelsk litteraturhistoria och forskning som rör engelsk litteratur i Nordamerika, Centralamerika och Sydamerika Hit också allmänna verk om litteraturhistoria och litteraturforskning i USA och Kanada @sv

Indoiraaniset kielet
type: Class
type: Concept
subclass of: URN:NBN:fi:au:hklj:860
alternative label: Indoarjalaiset kielet (861 +)
alternative label: Indoarjalaiset kielet, kielitiede (861 +)
alternative label: Indoeurooppalaiset kielet, eri indoeurooppalaiset kielet (861 ... 879 +)
alternative label: Indoiraaniset kielet (861 +)
alternative label: Intialaiset kielet (861 +)
alternative label: Intialaiset kielet, kielitiede (861 +)
alternative label: Indariska språk (861 +) @sv
alternative label: Indariska språk, lingvistik (861 +) @sv
alternative label: Indiska språk (861 +) @sv
alternative label: Indiska språk, lingvistik (861 +) @sv
alternative label: Indoeuropeiska språk, olika indoeuropeiska språk (861 ... 879 +) @sv
alternative label: Indoiranska språk (861 +) @sv
broader: URN:NBN:fi:au:hklj:860
in scheme: URN:NBN:fi:au:hklj:
narrower: Muinaisintialaiset kielet
narrower: Nykyintialaiset kielet
narrower: Iranilaiset kielet
notation: 861
preferred label: Old Indian languages @en
preferred label: Indoiranska språk @sv
scope note: Indoiraaniset kielet yleensä Teokset, jotka koskevat sekä intialaisia että iraanisia kieliä Teokset, jotka koskevat sekä muinais- että nykyintialaisia kieliä
scope note: Indoiranska språk i allmänhet Verk som handlar om både indiska och iranska språk Verk som handlar om både fornindiska språk och levande indiska språk @sv

Ruotsin kielen ainekirjoitusoppaat
type: Class
type: Concept
subclass of: Ruotsin kieli
alternative label: Riikinruotsi, ainekirjoitusoppaat (872.8)
alternative label: Ruotsin kieli, ainekirjoitusoppaat (872.8)
alternative label: Ruotsin ruotsi, ainekirjoitusoppaat (872.8)
alternative label: Ruotsinruotsi, ainekirjoitusoppaat (872.8)
alternative label: Ylioppilastehtävät, ainekirjoitus, ruotsi (872.8)
alternative label: Ylioppilastehtävät, äidinkieli, ruotsi (872.8)
alternative label: Rikssvenska, handböcker i uppsatsskrivning (872.8) @sv
alternative label: Studentuppgifter, modersmål, svenska (872.8) @sv
alternative label: Studentuppgifter, uppsatsskrivning, svenska (872.8) @sv
alternative label: Svenska, handböcker i uppsatsskrivning (872.8) @sv
alternative label: Sverigesvenska, handböcker i uppsatsskrivning (872.8) @sv
broader: Ruotsin kieli
in scheme: URN:NBN:fi:au:hklj:
notation: 872.8
preferred label: Handbooks of Swedish composition @en
preferred label: Handböcker i uppsatsskrivning på svenska @sv
related: Metodologia
related: URN:NBN:fi:au:hklj:188.4
related: Sähköposti. Verkkojuttelu
related: URN:NBN:fi:au:hklj:627.7512
related: URN:NBN:fi:au:hklj:860
related: Pohjoismaiset kielet
scope note: Ruotsin kielen ainekirjoitusoppaat ja ainekokoelmat
scope note: Handböcker i uppsatsskrivning på svenska och samlingar av svenska uppsatser @sv

Amerikan englannin kieli
type: Class
type: Concept
subclass of: Englannin kieli
alternative label: Amerikanenglanti (875.7)
alternative label: Englannin kieli, amerikanenglanti (875.7)
alternative label: Amerikansk engelska (875.7) @sv
alternative label: Engelska, amerikansk engelska (875.7) @sv
broader: Englannin kieli
in scheme: URN:NBN:fi:au:hklj:
notation: 875.7
preferred label: American English @en
preferred label: Amerikansk engelska @sv
related: KIELITIEDE
related: URN:NBN:fi:au:hklj:860
related: URN:NBN:fi:au:hklj:875.09
related: Englannin kielen kielioppi ja semantiikka
related: URN:NBN:fi:au:hklj:875.703
related: URN:NBN:fi:au:hklj:875.709
scope note: Amerikan englanti yleensä Murteet. Murretutkimus. Murrealueet. Slangit. Slangitutkimus. Maantieteelliset slangit. Eri ammattien ja alojen slangit Äänne-, kieli-, muoto- ja sanaoppi. Semantiikka. Etymologia. Onomastiikka Kielipsykologia, -sosiologia ja -politiikka Amerikan englannin kielen kannalta
scope note: Amerikansk engelska i allmänhet Dialekter. Dialektforskning. Dialektområden. Slang. Slangforskning Regional och lokal slang. Yrkesjargong och jargong inom olika branscher Ljudlära, satslära, formlära och ordlära. Betydelselära (semantik). Etymologi. Onomastik Språkpsykologi, språksociologi och språkpolitik i den amerikanska engelskan @sv

Bosnian, kroatian, makedonian, montenegron, serbian ja sloveenin kieli
type: Class
type: Concept
subclass of: Slaavilaiset kielet
alternative label: Bosnian kieli (879.5)
alternative label: Bosnian kieli, kielitiede (879.5)
alternative label: Kroaatin kieli (879.5)
alternative label: Kroaatin kieli, kielitiede (879.5)
alternative label: Kroatoserbian kieli (879.5)
alternative label: Kroatoserbian kieli, kielitiede (879.5)
alternative label: Montenegron kieli (879.5)
alternative label: Montenegron kieli, kielitiede (879.5)
alternative label: Serbian kieli (879.5)
alternative label: Serbian kieli, kielitiede (879.5)
alternative label: Serbokroaatin kieli (879.5)
alternative label: Serbokroaatin kieli, kielitiede (879.5)
alternative label: Sloveenin kieli (879.5)
alternative label: Sloveenin kieli, kielitiede (879.5)
alternative label: Bosniska (879.5) @sv
alternative label: Bosniska, lingvistik (879.5) @sv
alternative label: Kroatiska (879.5) @sv
alternative label: Kroatiska, lingvistik (879.5) @sv
alternative label: Kroatoserbiska (879.5) @sv
alternative label: Kroatoserbiska, lingvistik (879.5) @sv
alternative label: Montenegriska (879.5) @sv
alternative label: Montenegriska, lingvistik (879.5) @sv
alternative label: Serbiska (879.5) @sv
alternative label: Serbiska, lingvistik (879.5) @sv
alternative label: Serbokroatiska (879.5) @sv
alternative label: Serbokroatiska, lingvistik (879.5) @sv
alternative label: Slovenska (879.5) @sv
alternative label: Slovenska, lingvistik (879.5) @sv
broader: Slaavilaiset kielet
in scheme: URN:NBN:fi:au:hklj:
notation: 879.5
preferred label: Bosnian, Croatian, Macedonian, Serbian and Slovenian @en
preferred label: Bosniska, kroatiska, makedonska, montenegrinska, serbiska och slovenska @sv
related: URN:NBN:fi:au:hklj:860
scope note: Serbokroaatin kieli
scope note: Serbokroatiska @sv

Kunniamerkit. Arvonimet. Mitalitiede
type: Class
type: Concept
subclass of: Historian aputieteet
alternative label: Aatelisarvot (911.8)
alternative label: Ansiomerkit (911.8)
alternative label: Arvomerkit, muut (911.8)
alternative label: Arvonimet (911.8)
alternative label: Kunniamerkit (911.8)
alternative label: Kunnianosoitukset, aatelisarvot, arvonimet (911.8)
alternative label: Marsalkat, arvonimet (911.8)
alternative label: Mitalit, numismatiikka (911.8)
alternative label: Muistomitalit, mitalitiede (911.8)
alternative label: Pinssit (911.8)
alternative label: Rintamerkit (911.8)
alternative label: Rintanapit (911.8)
alternative label: Ristit, kunniamerkit (911.8)
alternative label: Adelstitlar (911.8) @sv
alternative label: Gradbeteckningar, övriga (911.8) @sv
alternative label: Hedersbetygelser, ordnar, titlar (911.8) @sv
alternative label: Kors, utmärkelsetecken (911.8) @sv
alternative label: Marskalkar, titlar (911.8) @sv
alternative label: Medaljer, numismatik (911.8) @sv
alternative label: Minnesmedaljer, medaljvetenskap (911.8) @sv
alternative label: Nålar (911.8) @sv
alternative label: Ordnar (911.8) @sv
alternative label: Pins (911.8) @sv
alternative label: Titlar (911.8) @sv
alternative label: Utmärkelsetecken (911.8) @sv
broader: Historian aputieteet
in scheme: URN:NBN:fi:au:hklj:
notation: 911.8
preferred label: Orders. Titles. Medals @en
preferred label: Ordnar. Titlar. Medaljvetenskap @sv
related: Käytös- ja tapatieto
related: Juhlien järjestäminen
related: URN:NBN:fi:au:hklj:739
related: Historian tutkimusmenetelmät
related: Rahatiede
scope note: Eri maanosien, maiden, alueiden, alojen ja aikakausien kunniamerkit, arvonimet ja mitalit Rintamerkkien ja -nappien tutkimus ja keräily Mitaleiden tutkimus ja keräily
scope note: Ordnar, titlar och medaljer i olika världsdelar, länder och geografiska områden samt under olika tidsperioder Forskning kring pinsar och samlande av pins och nålar Forskning kring medaljer och medaljsamlande @sv

Tanskan historia
type: Class
type: Concept
subclass of: URN:NBN:fi:au:hklj:930
alternative label: Färsaaret, historia (937)
alternative label: Kööpenhamina, historia (937)
alternative label: Tanska, historia (937)
alternative label: Danmark, historia (937) @sv
alternative label: Färöarna, historia (937) @sv
alternative label: Köpenhamn, historia (937) @sv
broader: URN:NBN:fi:au:hklj:930
in scheme: URN:NBN:fi:au:hklj:
notation: 937
preferred label: Denmark's history @en
preferred label: Danmarks historia @sv
related: Tanska
related: Kööpenhamina
related: Färsaaret
related: Esi- ja varhaishistoria
related: URN:NBN:fi:au:hklj:989
scope note: Tässä myös Färsaarten historia
scope note: Hit också Färöarnas historia @sv

Pohjois-Irlannin historia
type: Class
type: Concept
subclass of: Irlannin historia
alternative label: Pohjois-Irlanti, historia (958.2)
alternative label: Ulster, historia (958.2)
alternative label: Nordirland, historia (958.2) @sv
broader: Irlannin historia
in scheme: URN:NBN:fi:au:hklj:
notation: 958.2
preferred label: History of Northern Ireland @en
preferred label: Nordirlands historia @sv
related: Brittein saaret
related: Iso-Britannia
related: Irlanti
related: Pohjois-Irlanti
related: URN:NBN:fi:au:hklj:909
related: URN:NBN:fi:au:hklj:919

Espanjan historia
type: Class
type: Concept
subclass of: URN:NBN:fi:au:hklj:979
alternative label: Baleaarit, historia (979.1)
alternative label: Baskimaa, historia (979.1)
alternative label: Baskit, Espanjan historia (979.1)
alternative label: Espanja, historia (979.1)
alternative label: Gibraltar, historia (979.1)
alternative label: Ibiza, historia (979.1)
alternative label: Katalonia, historia (979.1)
alternative label: Konkistadorit, Espanja, historia (979.1)
alternative label: Mallorca, historia (979.1)
alternative label: Balearerna, historia (979.1) @sv
alternative label: Basker, Spaniens historia (979.1) @sv
alternative label: Baskien, historia (979.1) @sv
alternative label: Conquistadorer, Spanien, historia (979.1) @sv
alternative label: Katalonien, historia (979.1) @sv
alternative label: Spanien, historia (979.1) @sv
broader: URN:NBN:fi:au:hklj:979
in scheme: URN:NBN:fi:au:hklj:
notation: 979.1
preferred label: Spain's history @en
preferred label: Spaniens historia @sv
related: Etelä-Eurooppa
related: Pyreneiden niemimaa
related: Espanja
related: URN:NBN:fi:au:hklj:909
related: URN:NBN:fi:au:hklj:919
related: Afrikan historia

Portugalin historia
type: Class
type: Concept
subclass of: URN:NBN:fi:au:hklj:979
alternative label: Portugali, historia (979.2)
alternative label: Portugal, historia (979.2) @sv
broader: URN:NBN:fi:au:hklj:979
in scheme: URN:NBN:fi:au:hklj:
notation: 979.2
preferred label: Portugal's history @en
preferred label: Portugals historia @sv
related: Etelä-Eurooppa
related: Pyreneiden niemimaa
related: Portugali
related: URN:NBN:fi:au:hklj:909
related: URN:NBN:fi:au:hklj:919
related: Afrikan historia

Kreikan nykyhistoria
type: Class
type: Concept
subclass of: URN:NBN:fi:au:hklj:979
alternative label: Aigeianmeren saaret, Kreikan nykyhistoria (979.4)
alternative label: Ateena, Kreikan nykyhistoria (979.4)
alternative label: Kreeta, nykyhistoria (979.4)
alternative label: Kreikka, historia, nykyaika (979.4)
alternative label: Makedonia, Kreikka, nykyhistoria (979.4)
alternative label: Peloponnesos, Kreikan nykyhistoria (979.4)
alternative label: Rhodos, historia, nykyaika (979.4)
alternative label: Aten, Greklands nutidshistoria (979.4) @sv
alternative label: Egeiska öarna, Greklands nutidshistoria (979.4) @sv
alternative label: Grekland, historia, nutiden (979.4) @sv
alternative label: Kreta, nutidshistoria (979.4) @sv
alternative label: Makedonien, Grekland, nutidshistoria (979.4) @sv
alternative label: Peloponnesos, Greklands nutidshistoria (979.4) @sv
alternative label: Rhodos, historia, nutiden (979.4) @sv
broader: URN:NBN:fi:au:hklj:979
in scheme: URN:NBN:fi:au:hklj:
notation: 979.4
preferred label: Modern history of Greece @en
preferred label: Greklands nutidshistoria @sv
related: Etelä-Eurooppa
related: Pyreneiden niemimaa
related: Kreikka
related: URN:NBN:fi:au:hklj:909
related: Kreikan muinaishistoria ja arkeologia
related: URN:NBN:fi:au:hklj:919

Makedonian historia
type: Class
type: Concept
subclass of: Entisen Jugoslavian alueen historia
alternative label: Makedonia, EJTM, nykyhistoria (979.55)
alternative label: Makedonien, fd jugoslaviska republiken Makedonien, nutidshistoria (979.55) @sv
broader: Entisen Jugoslavian alueen historia
in scheme: URN:NBN:fi:au:hklj:
notation: 979.55
preferred label: Macedonia's history (in the former Yugoslavia) @en
preferred label: Makedoniens historia @sv
related: Etelä-Eurooppa
related: Pyreneiden niemimaa
related: Makedonia, EJTM
related: URN:NBN:fi:au:hklj:909
related: Kreikan muinaishistoria ja arkeologia
related: URN:NBN:fi:au:hklj:919

Albanian historia
type: Class
type: Concept
subclass of: URN:NBN:fi:au:hklj:979
alternative label: Albania, historia (979.7)
alternative label: Albanien, historia (979.7) @sv
broader: URN:NBN:fi:au:hklj:979
in scheme: URN:NBN:fi:au:hklj:
notation: 979.7
preferred label: Albania's history @en
preferred label: Albaniens historia @sv
related: URN:NBN:fi:au:hklj:413.94
related: Etelä-Eurooppa
related: Pyreneiden niemimaa
related: Albania
related: URN:NBN:fi:au:hklj:909
related: URN:NBN:fi:au:hklj:919

Etelä-Aasian historia
type: Class
type: Concept
subclass of: Aasian historia
alternative label: Andamaanit, historia (981.2)
alternative label: Baluchit, Aasia, historia (981.2)
alternative label: Bangladesh, historia (981.2)
alternative label: Bengali, historia (981.2)
alternative label: Bhutan, historia (981.2)
alternative label: Ceylon, historia (981.2)
alternative label: Etelä-Aasia, historia (981.2)
alternative label: Etu-Intia, historia (981.2)
alternative label: Indus-kulttuuri (981.2)
alternative label: Intia, arkeologia (981.2)
alternative label: Intia, historia (981.2)
alternative label: Intia, kulttuurihistoria (981.2)
alternative label: Kastijärjestelmä, Intia, historia (981.2)
alternative label: Lakkadiivit, historia (981.2)
alternative label: Malediivit, historia (981.2)
alternative label: Nepal, historia (981.2)
alternative label: Nikobaarit, historia (981.2)
alternative label: Pakistan, historia (981.2)
alternative label: Sherpat, historia. (981.2)
alternative label: Sikhit, Intian historia (981.2)
alternative label: Singaleesit, historia (981.2)
alternative label: Sri Lanka, historia (981.2)
alternative label: Andamanerna, historia (981.2) @sv
alternative label: Balucher, Asien, historia (981.2) @sv
alternative label: Bengal, historia (981.2) @sv
alternative label: Främre Indien, historia (981.2) @sv
alternative label: Indien, arkeologi (981.2) @sv
alternative label: Indien, historia (981.2) @sv
alternative label: Indien, kulturhistoria (981.2) @sv
alternative label: Induskulturen (981.2) @sv
alternative label: Kastväsen, Indien, historia (981.2) @sv
alternative label: Lackadiverna, historia (981.2) @sv
alternative label: Maldiverna, historia (981.2) @sv
alternative label: Nikobarerna, historia (981.2) @sv
alternative label: Sherpa, historia (981.2) @sv
alternative label: Sikher, Indiens historia (981.2) @sv
alternative label: Singaleser, historia (981.2) @sv
alternative label: Sydasien, historia (981.2) @sv
broader: Aasian historia
in scheme: URN:NBN:fi:au:hklj:
notation: 981.2
preferred label: South Asia's history @en
preferred label: Sydasiens historia @sv
related: AASIA
related: Etelä-Aasia
related: Vanhan ajan historia
related: Vanhan ajan kulttuurihistoria
related: BRITTEIN SAARTEN HISTORIA
scope note: Bangladeshin, Bhutanin, Intian, Malediivien, Nepalin, Pakistanin ja Sri Lankan historia Tässä myös Kashmirin historia Tässä myös Andamaanien, Kookossaarten ja Nikobaarien historia
scope note: Bangladeshs, Bhutans, Indiens, Maldivernas, Nepals, Pakistans och Sri Lankas historia Hit också Kashmirs historia Hit också Andamarernas, Kokosöarnas och Nikobarernas historia @sv

Pohjois-Afrikan historia
type: Class
type: Concept
subclass of: Afrikan historia
alternative label: Algeria, historia (985.1)
alternative label: Atlasmaat, historia (985.1)
alternative label: Egypti, historia vuodesta 639 j.Kr. (985.1)
alternative label: Egyptin arabitasavalta, historia (985.1)
alternative label: Etelä-Sudan, historia (985.1)
alternative label: Koptit, Egyptin historia (985.1)
alternative label: Libya, historia (985.1)
alternative label: Länsi-Sahara, historia (985.1)
alternative label: Marokko, historia (985.1)
alternative label: Pohjois-Afrikka, historia (985.1)
alternative label: Sahara, historia (985.1)
alternative label: Sudan, historia (985.1)
alternative label: Tunisia, historia (985.1)
alternative label: Algeriet, historia (985.1) @sv
alternative label: Arabrepubliken Egypten, historia (985.1) @sv
alternative label: Atlasländerna, historia (985.1) @sv
alternative label: Egypten, historia från år 639 e.Kr. (985.1) @sv
alternative label: Kopter, Egyptens historia (985.1) @sv
alternative label: Libyen, historia (985.1) @sv
alternative label: Marocko, historia (985.1) @sv
alternative label: Nordafrika, historia (985.1) @sv
alternative label: Sydsudan, historia (985.1) @sv
alternative label: Tunisien, historia (985.1) @sv
alternative label: Västsahara, historia (985.1) @sv
broader: Afrikan historia
in scheme: URN:NBN:fi:au:hklj:
notation: 985.1
preferred label: History of North Africa @en
preferred label: Nordafrikas historia @sv
related: AFRIKKA
related: Pohjois-Afrikka
related: Egypti. Sudan. Etelä-Sudan
related: Egyptin ja Etu-Aasian muinaishistoria ja arkeologia
related: BRITTEIN SAARTEN HISTORIA
related: RANSKAN HISTORIA
scope note: Algerian, Egyptin, Etelä-Sudanin, Libyan, Marokon, Sudanin ja Tunisian historia Tässä myös Länsi-Saharan historia Tässä myös Saharan alueen historian yleisteokset
scope note: Algeriets, Egyptens, Libyens, Marockos, Sudans, Sydsudans och Tunisiens historia Hit också Västsaharas historia Hit också allmänna verk om Saharaområdets historia @sv

Muiden suomalais-ugrilaisten kielten kaunokirjallisuus (Kaunoluokka)
type: Class
type: Concept
type: FormClass
subclass of: SUOMENKIELINEN KAUNOKIRJALLISUUS (Kaunoluokka)
broader: SUOMENKIELINEN KAUNOKIRJALLISUUS (Kaunoluokka)
in scheme: URN:NBN:fi:au:hklj:
narrower: Karjalankielinen kaunokirjallisuus (Kaunoluokka)
narrower: Unkarinkielinen kaunokirjallisuus (Kaunoluokka)
narrower: Saamenkielinen kaunokirjallisuus (Kaunoluokka)
notation: 1.9
preferred label: Fiction in other Finno-Ugric languages (Fiction class) @en
preferred label: Skönlitteratur på andra finsk-ugriska språk (Skönklass) @sv
scope note: Inkerin-, liivin-, vatjan- ja vepsänkielinen kaunokirjallisuus Mordvan-, ostjakin- (hantin-), syrjäänin- (komin-), tseremissin- (marin-), vogulin- (mansin-) ja votjakinkielinen (udmurtin-) kaunokirjallisuus
scope note: Skönlitteratur på ingermanländska, liviska, vepsiska och votiska Skönlitteratur på mordvinska, ostjakiska (chanti), syrjänska (komi), tjeremissiska (mari), udmurtiska (votjakiska) och voguliska (mansi) @sv

Afrikan kielten kaunokirjallisuus (Kaunoluokka)
type: Class
type: Concept
type: FormClass
subclass of: Muiden kielten kaunokirjallisuus (Kaunoluokka)
broader: Muiden kielten kaunokirjallisuus (Kaunoluokka)
in scheme: URN:NBN:fi:au:hklj:
narrower: Somalinkielinen kaunokirjallisuus (Kaunoluokka)
narrower: Swahilinkielinen kaunokirjallisuus (Kaunoluokka)
narrower: Lingalankielinen kaunokirjallisuus (Kaunoluokka)
notation: 9.98
preferred label: Fiction in African languages (Fiction class) @en
preferred label: Afrikansk skönlitteratur (Skönklass) @sv
scope note: Saharan eteläpuolella puhuttujen afrikkalaisten kielten kaunokirjallisuus Haamilaisten kielten, khoisankielten, sudanilaisten kielten, bantukielten-, busmannikielten- ja hottentottikielten kaunokirjallisuus
scope note: Skönlitteratur på afrikanska språk som talas söder om Sahara Skönlitteratur på hamitiska språk, xhosaspråk, sudanska, bantuspråk, bushmanspråk, hottentottspråk @sv

Suomenkieliset
type: Class
type: Concept
subclass of: YLEISET KAUSIJULKAISUT
broader: YLEISET KAUSIJULKAISUT
in scheme: URN:NBN:fi:au:hklj:
narrower: Suomessa ilmestyvät ruotsinkieliset
narrower: Suomessa ilmestyvät vieraskieliset
notation: 051
preferred label: Finnish @en
preferred label: Finska @sv

Keskiajan filosofia
type: Class
type: Concept
subclass of: Filosofian historia
alternative label: Filosofian historia, keskiaika (108.3)
alternative label: Keskiaika, filosofia (108.3)
alternative label: Keskiajan filosofia (108.3)
alternative label: Skolastiikka (108.3)
alternative label: Tomismi (108.3)
alternative label: Filosofins historia, medeltiden (108.3) @sv
alternative label: Medeltida filosofi (108.3) @sv
alternative label: Medeltiden, filosofi (108.3) @sv
alternative label: Skolastik (108.3) @sv
alternative label: Thomism (108.3) @sv
broader: Filosofian historia
in scheme: URN:NBN:fi:au:hklj:
notation: 108.3
preferred label: Medieval philosophy @en
preferred label: Medeltida filosofi @sv
related: Oppikirjat. Johdatukset filosofiaan
related: Esseet
related: URN:NBN:fi:au:hklj:110
related: Tietoteorian historia ja suunnat
related: Kristinuskon filosofia
related: KRISTILLINEN DOGMATIIKKA
related: Keskiajan kulttuurihistoria 400-1499
scope note: Keskiajan filosofia ja sen historia kirkkoisistä alkaen vuoteen 1450 Skolastiikka ja sen historia Keskiajan bysanttilainen ja islamilainen filosofia ja sen historia Filosofian erikoisalojen kysymykset alan mukaisessa luokassa
scope note: Medeltidens filosofi och dess historia från kyrkofäderna till år 1450 Skolastiken och dess historia Medeltida bysantinsk och islamisk filosofi och dess historia Specialfrågor inom filosofin klassificeras enligt område @sv

Unikirjat
type: Class
type: Concept
subclass of: URN:NBN:fi:au:hklj:192
alternative label: Ennustaminen, ennusunet (192.2)
alternative label: Ennusunet (192.2)
alternative label: Paranormaalit ilmiöt, unien selitykset (192.2)
alternative label: Rajatieto, unikirjat (192.2)
alternative label: Selittämättömät ilmiöt, unien selitykset (192.2)
alternative label: Symboliikka, unikirjat (192.2)
alternative label: Symbolit, unikirjat (192.2)
alternative label: Unet, ennusunet (192.2)
alternative label: Unien tulkinta, rajatieto (192.2)
alternative label: Unikirjat (192.2)
alternative label: Vertauskuvat, unikirjat (192.2)
alternative label: Yhteensopivuus, astrologia (192.2)
alternative label: Drömböcker (192.2) @sv
alternative label: Drömmar, förebådande drömmar (192.2) @sv
alternative label: Drömtolkning, paranormala fenomen (192.2) @sv
alternative label: Förebådande drömmar (192.2) @sv
alternative label: Kompatibilitet, astrologi (192.2) @sv
alternative label: Oförklarliga fenomen, drömtydningar (192.2) @sv
alternative label: Omstridda fenomen, drömböcker (192.2) @sv
alternative label: Paranormala fenomen, drömtydningar (192.2) @sv
alternative label: Sinnebilder, drömböcker (192.2) @sv
alternative label: Spådomskonst, förebådande drömmar (192.2) @sv
alternative label: Symboler, drömböcker (192.2) @sv
alternative label: Symbolik, drömböcker (192.2) @sv
broader: URN:NBN:fi:au:hklj:192
in scheme: URN:NBN:fi:au:hklj:
notation: 192.2
preferred label: Dreams @en
preferred label: Drömböcker @sv
related: Uni
related: Parapsykologia
related: Teosofia. Antroposofia. Vapaamuurarius
related: Teosofia
related: Eskatologia
related: Henkilökohtainen terveydenhoito
related: Analyyttinen psykoterapia
scope note: Ennusunet. Unien selitysteokset
scope note: Sanndrömmar. Drömförklaringar @sv

Yhdistykset. Laitokset. Kokoukset. Ekumenia
type: Class
type: Concept
subclass of: URN:NBN:fi:au:hklj:210
alternative label: Ekumeeninen liike (216)
alternative label: Ekumeeniset kirkolliskokoukset (216)
alternative label: Ekumenia (216)
alternative label: Ekumeniikka (216)
alternative label: Kirkkojen maailmanneuvosto (216)
alternative label: Kirkkojen yhteysliike (216)
alternative label: Kirkot, ekumenia (216)
alternative label: Kristilliset järjestöt (216)
alternative label: Kristilliset järjestöt, ekumeeniset järjestöt (216)
alternative label: Systemaattinen teologia, ekumeniikka (216)
alternative label: Uskontodialogi, ekumenia (216)
alternative label: Yhteistoiminnallisuus, kirkot, ekumenia (216)
alternative label: Yhteistyö, kirkot, ekumenia (216)
alternative label: Ekumenik (216) @sv
alternative label: Ekumeniska kyrkomöten (216) @sv
alternative label: Ekumeniska rörelsen (216) @sv
alternative label: Ekumenism (216) @sv
alternative label: Kristna organisationer (216) @sv
alternative label: Kristna organisationer, ekumeniska organisationer (216) @sv
alternative label: Kyrkor, ekumenik (216) @sv
alternative label: Kyrkornas ekumenik (216) @sv
alternative label: Kyrkornas världsråd (216) @sv
alternative label: Religionsdialog, ekumeni (216) @sv
alternative label: Samarbetande, kyrkor, ekumeni (216) @sv
alternative label: Samarbete, kyrkor, ekumenik (216) @sv
alternative label: Systematisk teologi, ekumenik (216) @sv
broader: URN:NBN:fi:au:hklj:210
in scheme: URN:NBN:fi:au:hklj:
notation: 216
preferred label: Associations. Institutions. Meetings. Ecumenism @en
preferred label: Föreningar. Institutioner. Möten. Ekumenik @sv
related: Museot. Arkistot. Kokoelmat. Näyttelyt
related: EVANKELIS-LUTERILAINEN KIRKKO
related: Seurakunta. Seurakuntatyö
related: Sisälähetys. Evankelioiminen
related: URN:NBN:fi:au:hklj:260
scope note: Yleiset kristilliset tai teologiset yhdistykset, laitokset ja kokoukset Ekumeenista liikettä ja kirkkojen maailmanneuvostoa koskevat yleisteokset Kristinuskon tai kristillisen teologian erikoisaloihin liittyvät yhdistykset, laitokset ja kokoukset sekä erikoisaloja koskevat ekumeeniset kysymykset alan mukaisessa luokassa
scope note: Allmänna kristna eller teologiska föreningar, institutioner och möten Allmänna verk om ekumeniska rörelsen och Kyrkornas Världsråd Föreningar, institutioner och möten som rör specialområden inom kristendom eller kristen teologi samt ekumeniska frågor inom specialområden klassificeras enligt område @sv

Kokoomateokset
type: Class
type: Concept
subclass of: URN:NBN:fi:au:hklj:210
broader: URN:NBN:fi:au:hklj:210
in scheme: URN:NBN:fi:au:hklj:
narrower: Kartat
narrower: Museot. Arkistot. Kokoelmat. Näyttelyt
notation: 218
preferred label: Compilations. Polygraphies @en
preferred label: Samlingsverk. Polygrafi @sv
related: Esseet
related: Saarnat. Postillat. Kristilliset puhe- ja päivänavauskokoelmat
related: URN:NBN:fi:au:hklj:260
scope note: Kristinuskoa tai kristillistä teologiaa koskevat yleiset tai sekasisältöiset kokoomateokset Kristinuskon tai kristillisen teologian erikoisaloja koskevat kokoomateokset alan mukaisessa luokassa
scope note: Samlingsverk med allmänt eller blandat innehåll som handlar om kristendom eller kristen teologi Samlingsverk som rör specialområden i kristendom eller kristen teologi klassificeras enligt område @sv

Ruotsi
type: Class
type: Concept
subclass of: Pohjoismaat
alternative label: Ruotsi, kirkkohistoria (279.21)
alternative label: Schartaulaisuus (279.21)
alternative label: Schartauanism (279.21) @sv
alternative label: Sverige, kyrkohistoria (279.21) @sv
broader: Pohjoismaat
in scheme: URN:NBN:fi:au:hklj:
notation: 279.21
preferred label: Sweden @en
preferred label: Sverige @sv
related: URN:NBN:fi:au:hklj:209
related: URN:NBN:fi:au:hklj:210
related: Kristillisen teologian historia
related: URN:NBN:fi:au:hklj:260
related: Protestanttiset kirkot ja yhteisöt
related: Kirkot ja muut uskonnolliset rakennukset
related: URN:NBN:fi:au:hklj:992

Germany {@e
type: Class
type: Concept
subclass of: Muu Eurooppa
alternative label: Saksa, kirkkohistoria (279.31)
alternative label: Tunnustuskirkko (279.31)
alternative label: Bekännelsekyrkan (279.31) @sv
alternative label: Tyskland, kyrkohistoria (279.31) @sv
broader: Muu Eurooppa
in scheme: URN:NBN:fi:au:hklj:
notation: 279.31
preferred label: Saksa
preferred label: Tyskland @sv
related: URN:NBN:fi:au:hklj:209
related: URN:NBN:fi:au:hklj:210
related: Kristillisen teologian historia
related: URN:NBN:fi:au:hklj:260
related: Protestanttiset kirkot ja yhteisöt
related: Kirkot ja muut uskonnolliset rakennukset
related: URN:NBN:fi:au:hklj:992

Raha. Valuutta. Pankit. Pörssit
type: Class
type: Concept
subclass of: URN:NBN:fi:au:hklj:360
alternative label: Aluetaloudelliset vaikutukset , rahapolitiikka (362)
alternative label: Arvopaperikauppa (362)
alternative label: Arvopaperimarkkinat (362)
alternative label: Arvopaperisalkut (362)
alternative label: Arvopaperistaminen, rahoitus (362)
alternative label: Arvopaperit (362)
alternative label: Bitcoin (362)
alternative label: Debentuurit (362)
alternative label: Deflaatio (362)
alternative label: Devalvaatio (362)
alternative label: Digitaalinen raha (362)
alternative label: Diskonttaus (362)
alternative label: ECU, rahayksiköt (362)
alternative label: EMU (362)
alternative label: ERM (362)
alternative label: Eettinen sijoittaminen (362)
alternative label: Eettinen sijoitustoiminta (362)
alternative label: Eettiset rahastot (362)
alternative label: Eettiset sijoitukset (362)
alternative label: Ekopankit (362)
alternative label: Elektroninen raha (362)
alternative label: Emissiot, osakeannit (362)
alternative label: Euro, rahayksiköt (362)
alternative label: Euroalue, Euro, rahayksiköt (362)
alternative label: Euroalue, rahapolitiikka (362)
alternative label: Euroopan talous- ja rahaliitto (362)
alternative label: Finanssiala (362)
alternative label: Futuurit, taloustiede (362)
alternative label: Fuusiot, pankkien fuusiot (362)
alternative label: G7-maat, kansainvälinen rahapolitiikka (362)
alternative label: Holvit, pankkiholvit (362)
alternative label: Hypoteekki (362)
alternative label: Hypoteekkipankit (362)
alternative label: IMF (362)
alternative label: Indeksiehto (362)
alternative label: Indeksisidonnaisuus (362)
alternative label: Indeksit, rahanarvo (362)
alternative label: Inflaatio (362)
alternative label: Investointipankit (362)
alternative label: Johdannaismarkkinat (362)
alternative label: Johtavat teollisuusmaat, kansainvälinen rahapolitiikka (362)
alternative label: Joukkorahoitus, rahoitus (362)
alternative label: Joukkovelkakirjat (362)
alternative label: Julkiset osakeyhtiöt, pörssitoimi (362)
alternative label: Kansainvälinen järjestelmä, kansainvälinen rahapolitiikka (362)
alternative label: Kansainvälinen maksuliike (362)
alternative label: Kansainvälinen maksuliikenne (362)
alternative label: Kansainvälinen rahatalous (362)
alternative label: Kansainvälinen valuuttarahasto (362)
alternative label: Kansainväliset luottolaitokset (362)
alternative label: Kassavaranto (362)
alternative label: Kassavirta (362)
alternative label: Kehitysluottolaitokset (362)
alternative label: Kehityspankit (362)
alternative label: Keinottelu, pörssikeinottelu (362)
alternative label: Keinottelu, valuuttakeinottelu (362)
alternative label: Keskuspankit (362)
alternative label: Kiinnitys, oikeustiede, hypoteekki (362)
alternative label: Kiinnitysluottolaitokset (362)
alternative label: Konvertointi, luottotoiminta (362)
alternative label: Korko (362)
alternative label: Korkokatto (362)
alternative label: Korkopolitiikka (362)
alternative label: Korkosuojaukset (362)
alternative label: Koronmaksut, pankkitoimi (362)
alternative label: Kortit, pankkikortit (362)
broader: URN:NBN:fi:au:hklj:360
in scheme: URN:NBN:fi:au:hklj:
notation: 362
related: Kauppaoikeus. Yhtiölainsäädäntö. Pankki- ja vakuutuslainsäädäntö
related: Osuustoiminta
related: URN:NBN:fi:au:hklj:368
related: Talouselämän kehitysilmiöt
related: Standardit. Normit. Mittayksiköt
related: Rahatiede
scope note: Raha- ja valuuttapolitiikka. Rahamarkkinat Rahateoriat. Rahajärjestelmät. Rahakannat. Rahayksiköt. Ecu. Euro Rahanarvo. Valuuttapolitiikka. Valuuttakurssit. Clearing Inflaatio. Deflaatio. Devalvaatio. Revalvaatio. Indeksisidonnaisuus yleensä Pankkitoimi. Luotto- ja korkopolitiikka yleensä. Korkokanta Pankit ja luottolaitokset sekä niiden liiketoiminta Keskuspankit. Suomen Pankki. Liikepankit. Ekopankit. Postipankki. Säästöpankit. Säästökassat. Työpaikkakassat. Panttilainaamot Säästäminen. Sekit. Luotto- ja pankkikortit Pörssit. Pörssikurssit. Pörssinvälitys. Arvopaperit. Arvopaperikauppa. Osakesäästäminen. Yksityishenkilöille tarkoitetut sijoitusoppaat Kansainvälinen raha- ja valuuttapolitiikka, kansainväliset pankit, luottolaitokset ja pörssit sekä kansainvälinen arvopaperikauppa. Maailmanpankki. EMU
scope note: Penning- och valutapolitik. Penningmarknaden Penningteorier. Penningsystem. Myntfot. Myntenheter. Ecu. Euro Penningvärde. Valutapolitik. Valutakurser. Clearing Inflation. Deflation. Devalvering. Revalvering. Indexbundenhet i allmänhet Bankväsen. Kredit- och räntepolitik i allmänhet. Räntefot Banker och kreditinrättningar och deras affärsverksamhet Centralbanker. Finlands bank. Affärsbanker. Ekobanker. Postbanken. Sparbanker. Sparkassor. Arbetsplatskassor. Pantlånekontor Sparande. Checkar. Kredit- och bankkort Börser. Börskurser. Börsförmedling. Värdepappershandel. Aktiesparande. Investeringshandböcker för privatpersoner Internationell penning- och valutapolitik, internationella banker, kreditinrättningar och börser samt internationell värdepappershandel. Världsbanken. EMU @sv

Kriminaalipolitiikka
type: Class
type: Concept
subclass of: URN:NBN:fi:au:hklj:371
alternative label: Alkoholirikokset, kriminaalipolitiikka (371.8)
alternative label: Atk-rikokset, kriminaalipolitiikka (371.8)
alternative label: Crackerointi, kriminaalipolitiikka (371.8)
alternative label: Ehdolliset rangaistukset, kriminaalipolitiikka (371.8)
alternative label: Ehdonalainen vapaus, kriminaalipolitiikka (371.8)
alternative label: Eläimeen sekaantuminen, kriminaalipolitiikka (371.8)
alternative label: Eläimiin sekaantuminen, kriminaalipolitiikka (371.8)
alternative label: Fyysinen väkivalta, kriminaalipolitiikka (371.8)
alternative label: Hakkerit, kriminaalipolitiikka (371.8)
alternative label: Hakkerointi, kriminaalipolitiikka (371.8)
alternative label: Harmaa talous, kriminaalipolitiikka (371.8)
alternative label: Henkilörekisteririkokset, kriminaalipolitiikka (371.8)
alternative label: Henkirikokset, kriminaalipolitiikka (371.8)
alternative label: Hirtto, kriminaalipolitiikka (371.8)
alternative label: Hirttäminen, kriminaalipolitiikka (371.8)
alternative label: Huliganismi, kriminaalipolitiikka (371.8)
alternative label: Huumausaineen käyttörikokset, kriminaalipolitiikka (371.8)
alternative label: Huumausainerikokset, kriminaalipolitiikka (371.8)
alternative label: Huumerikokset, kriminaalipolitiikka (371.8)
alternative label: Häpeärangaistus, kriminaalipolitiikka (371.8)
alternative label: Häpeäväkivalta, kriminaalipolitiikka (371.8)
alternative label: Identiteettivarkaus, atk-rikokset, kriminaalipolitiikka (371.8)
alternative label: Ihmiskauppa, kriminaalipolitiikka (371.8)
alternative label: Ilkivalta, kriminaalipolitiikka (371.8)
alternative label: Insesti, kriminaalipolitiikka (371.8)
alternative label: Järjestäytynyt rikollisuus, kriminaalipolitiikka (371.8)
alternative label: Kirjanpitorikokset, kriminaalipolitiikka (371.8)
alternative label: Kivittäminen, kriminaalipolitiikka (371.8)
alternative label: Kivitys, kriminaalipolitiikka (371.8)
alternative label: Konfiskaatio (371.8)
alternative label: Konkurssirikokset, kriminaalipolitiikka (371.8)
alternative label: Kontrollipolitiikka, kriminaalipolitiikka (371.8)
alternative label: Kotiaresti (371.8)
alternative label: Krakkerointi, kriminaalipolitiikka (371.8)
alternative label: Kriminaalipolitiikka (371.8)
alternative label: Kriminalisointi, kriminaalipolitiikka (371.8)
alternative label: Kuittikauppa, kriminaalipolitiikka (371.8)
alternative label: Kunniaan liittyvä väkivalta, kriminaalipolitiikka (371.8)
alternative label: Kunniamurha, kriminaalipolitiikka (371.8)
alternative label: Kunniaväkivalta, kriminaalipolitiikka (371.8)
alternative label: Kuolemanrangaistus, kriminaalipolitiikka (371.8)
alternative label: Kuolemantuomio, kriminaalipolitiikka (371.8)
alternative label: Kurinpitomenettely (371.8)
alternative label: Kurinpitorangaistus (371.8)
alternative label: Kuutamourakointi, kriminaalipolitiikka (371.8)
alternative label: Lainrikkojat, kriminaalipolitiikka (371.8)
alternative label: Lapsenmurha, kriminaalipolitiikka (371.8)
alternative label: Liikennejuopumus, kriminaalipolitiikka (371.8)
alternative label: Liikennepako, kriminaalipolitiikka (371.8)
alternative label: Liikennerikkomukset, kriminaalipolitiikka (371.8)
alternative label: Liikennerikokset, kriminaalipolitiikka (371.8)
alternative label: Menettämisseuraamus, kriminaalipolitiikka (371.8)
alternative label: Mestaus, kriminaalipolitiikka (371.8)
alternative label: Murha, kriminaalipolitiikka (371.8)
alternative label: Murhaajat, kriminaalipolitiikka (371.8)
alternative label: Murhapoltto, kriminaalipolitiikka (371.8)
alternative label: Murto, kriminaalipolitiikka (371.8)
alternative label: Musta pörssi, kriminaalipolitiikka (371.8)
alternative label: Myymälävarkaus, kriminaalipolitiikka (371.8)
alternative label: Nuoret rikoksentekijät, kriminaalipolitiikka (371.8)
alternative label: Nuorisorangaistus, kriminaalipolitiikka (371.8)
alternative label: Nuorisorikollisuus, kriminaalipolitiikka (371.8)
alternative label: Omaisuusrikokset, kriminaalipolitiikka (371.8)
alternative label: Omankädenoikeus, kriminaalipolitiikka (371.8)
alternative label: Pahoinpitely, kriminaalipolitiikka (371.8)
broader: URN:NBN:fi:au:hklj:371
in scheme: URN:NBN:fi:au:hklj:
notation: 371.8
related: Rikosoikeus
related: Vankeinhoito. Vankilat
related: Työoikeus
related: Poliisitoimi. Yleinen turvallisuus
related: Kriminologia. Kriminaalisosiologia
related: URN:NBN:fi:au:hklj:373
related: Työmarkkinajärjestöt
scope note: Yhteiskunnan suhtautuminen rikollisuuteen ja rikollisiin Rikollisuuden vastustaminen Rangaistukset ja rangaistuskäytäntö. Penologia Vapausrangaistus, sakkorangaistus ja sovittelu kriminaalipolitiikan kannalta
scope note: Samhällets inställning till brottslighet och brottslingar Att motarbeta brottslighet Straff och straffpraxis. Penologi Frihetsstraff, bötesstraff och förlikning ur kriminalpolitisk synvinkel @sv

Konservatismi
type: Class
type: Concept
subclass of: Yhteiskunnalliset aatesuunnat. Poliittiset ideologiat
alternative label: Konservatismi, poliittiset ideologiat (374.2)
alternative label: Oikeistolaisuus (374.2)
alternative label: Oikeistolaisuus, konservatismi (374.2)
alternative label: Oikeistoliikkeet (374.2)
alternative label: Oikeistoliikkeet, konservatismi (374.2)
alternative label: Porvarit, konservatismi (374.2)
alternative label: Traditionalismi, konservatismi (374.2)
alternative label: Borgare, konservatism (374.2) @sv
alternative label: Högerorientering (374.2) @sv
alternative label: Högerorientering, konservatism (374.2) @sv
alternative label: Högerrörelser (374.2) @sv
alternative label: Högerrörelser, konservatism (374.2) @sv
alternative label: Konservatism, politiska ideologier (374.2) @sv
alternative label: Traditionalism, konservatism (374.2) @sv
broader: Yhteiskunnalliset aatesuunnat. Poliittiset ideologiat
in scheme: URN:NBN:fi:au:hklj:
notation: 374.2
preferred label: Conservatism @en
preferred label: Konservatism @sv
related: URN:NBN:fi:au:hklj:320
related: Valtiofilosofia. Valtiomuodot
related: Sisäpolitiikka. Puolueet
related: Suomi
related: Yhteiskuntafilosofia
related: Talousjärjestelmät
related: URN:NBN:fi:au:hklj:371
scope note: Konservatismi poliittisena ideologiana Oikeistolaisuus yleensä
scope note: Konservatismen som politisk ideologi Högerorientering i allmänhet @sv

Liberalismi
type: Class
type: Concept
subclass of: Yhteiskunnalliset aatesuunnat. Poliittiset ideologiat
alternative label: Liberalismi (374.3)
alternative label: Porvarit, liberalismi (374.3)
alternative label: Borgare, liberalism (374.3) @sv
alternative label: Liberalism, liberalismi (374.3) @sv
broader: Yhteiskunnalliset aatesuunnat. Poliittiset ideologiat
in scheme: URN:NBN:fi:au:hklj:
notation: 374.3
preferred label: Liberalism @en
related: URN:NBN:fi:au:hklj:320
related: Valtiofilosofia. Valtiomuodot
related: Sisäpolitiikka. Puolueet
related: Suomi
related: Yhteiskuntafilosofia
related: Talousjärjestelmät
related: URN:NBN:fi:au:hklj:371
scope note: Liberalismi poliittisena ideologiana
scope note: Liberalismen som politisk ideologi @sv

Fasismi
type: Class
type: Concept
subclass of: Yhteiskunnalliset aatesuunnat. Poliittiset ideologiat
alternative label: Fasismi, ideologia (374.8)
alternative label: Fasistit, fasismi (374.8)
alternative label: Kansallissosialismi, ideologia (374.8)
alternative label: Kansallissosialistit, kansallissosialismi (374.8)
alternative label: Kirkkotaistelu, kansallissosialismi, ideologia (374.8)
alternative label: Natsismi, ideologia (374.8)
alternative label: Natsit, kansallissosialismi (374.8)
alternative label: Neofasismi, ideologia (374.8)
alternative label: Oikeistolaisuus, fasismi (374.8)
alternative label: Oikeistoliikkeet, fasismi (374.8)
alternative label: Uusfasismi, ideologia (374.8)
alternative label: Uusnatsismi, ideologia (374.8)
alternative label: Fascism, ideologi (374.8) @sv
alternative label: Fascister, fascism (374.8) @sv
alternative label: Högerorientering, fascism (374.8) @sv
alternative label: Högerrörelser, fascism (374.8) @sv
alternative label: Kyrkokamp, nationalsocialism, ideologi (374.8) @sv
alternative label: Nationalsocialism, ideologi (374.8) @sv
alternative label: Nationalsocialister, nationalsocialism (374.8) @sv
alternative label: Nazism, ideologi (374.8) @sv
alternative label: Nazister, nationalsocialism (374.8) @sv
alternative label: Neofacism, ideologi (374.8) @sv
alternative label: Nyfascism, ideologi (374.8) @sv
alternative label: Nynazism, ideologi (374.8) @sv
broader: Yhteiskunnalliset aatesuunnat. Poliittiset ideologiat
in scheme: URN:NBN:fi:au:hklj:
notation: 374.8
preferred label: Fascism @en
related: URN:NBN:fi:au:hklj:320
related: Valtiofilosofia. Valtiomuodot
related: Sisäpolitiikka. Puolueet
related: Suomi
related: Yhteiskuntafilosofia
related: Talousjärjestelmät
related: URN:NBN:fi:au:hklj:371
scope note: Fasismi, kansallissosialismi, natsismi, uusfasismi, uusnatsismi, äärinationalismi ja ulkomaalaisvastaisuus poliittisina ideologioina
scope note: Fascism, nationalsocialism, nazism, nyfascism, nynazism, ultranationalism och främlingsfientlighet som politiska ideologier @sv

Muut aatesuunnat
type: Class
type: Concept
subclass of: Yhteiskunnalliset aatesuunnat. Poliittiset ideologiat
alternative label: Agraaripuolueet, poliittiset ideologiat (374.9)
alternative label: Anarkismi (374.9)
alternative label: Anarkismi, ideologia (374.9)
alternative label: Anarkistit, anarkismi (374.9)
alternative label: Etnosentrismi, poliittiset ideologiat (374.9)
alternative label: Fundamentalismi, uskonnollis-poliittiset ideologiat (374.9)
alternative label: Islamismi, poliittiset ideologiat (374.9)
alternative label: Isänmaallisuus, nationalismi (374.9)
alternative label: Joukkoliikkeet, poliittiset vaihtoehtoliikkeet (374.9)
alternative label: Kansallinen identiteetti, poliittinen nationalismi (374.9)
alternative label: Kansallismielisyys, poliittiset ideologia (374.9)
alternative label: Kansallisuusaate, poliittinen nationalismi (374.9)
alternative label: Kansallisuusliikkeet, poliittinen nationalismi (374.9)
alternative label: Kansallisuuspolitiikka, poliittinen nationalismi (374.9)
alternative label: Keskustalaisuus, poliittiset ideologiat (374.9)
alternative label: Korporativismi (374.9)
alternative label: Monarkismi (374.9)
alternative label: Muslimit, poliittinen fundamentalismi (374.9)
alternative label: Mutualismi, talousteoriat (374.9)
alternative label: Nationalismi, poliittiset ideologiat (374.9)
alternative label: Nativistiset liikkeet, poliittiset ideologiat (374.9)
alternative label: Nihilismi (374.9)
alternative label: Nuorsuomalaisuus (374.9)
alternative label: Oikeistolaisuus, nationalismi (374.9)
alternative label: Oikeistolaisuus, uskonnollis-poliittinen fundamentalismi (374.9)
alternative label: Oikeistoliikkeet, nationalismi (374.9)
alternative label: Oikeistoliikkeet, uskonnollis-poliittinen fundamentalismi (374.9)
alternative label: Panafrikkalaisuus (374.9)
alternative label: Panslavismi (374.9)
alternative label: Poliittinen islam, poliittiset ideologiat (374.9)
alternative label: Puhdasoppisuus, uskonnollis-poliittiset aatteet (374.9)
alternative label: Radikalismi, poliittiset ideologiat (374.9)
alternative label: Radikalisoituminen, uskonnollis-poliittiset ideologiat (374.9)
alternative label: Separatismi, poliittinen nationalismi (374.9)
alternative label: Slavofiilit (374.9)
alternative label: Syndikalismi (374.9)
alternative label: Vaihtoehtoinen elämäntapa, poliittiset ideologiat (374.9)
alternative label: Vaihtoehtoliikkeet (374.9)
alternative label: Vaihtoehtoliikkeet, poliittiset ideologiat (374.9)
alternative label: Vanhasuomalaisuus (374.9)
alternative label: Vihreä liike, poliittinen ideologia (374.9)
alternative label: Ympäristöliikkeet, poliittiset ideologiat (374.9)
alternative label: Ääriliikkeet, nationalismi (374.9)
alternative label: Ääriliikkeet, uskonnollis-poliittinen fundamentalismi (374.9)
alternative label: Agrarpartier, politiska ideologier (374.9) @sv
alternative label: Alternativrörelser (374.9) @sv
alternative label: Alternativrörelser, politiska ideologier (374.9) @sv
alternative label: Alternativt levnadssätt, politiska ideologier (374.9) @sv
alternative label: Anarkism (374.9) @sv
alternative label: Anarkism, ideologi (374.9) @sv
alternative label: Anarkister, anarkism (374.9) @sv
alternative label: Centerpartism, politiska ideologier (374.9) @sv
alternative label: Etnocentrism, politiska ideologier (374.9) @sv
alternative label: Fosterländskhet, nationalism (374.9) @sv
alternative label: Fundamentalism, religiös-politiska ideologier (374.9) @sv
alternative label: Gammalfinskhet (374.9) @sv
alternative label: Gröna rörelsen, ideologi (374.9) @sv
alternative label: Högerorientering, nationalism (374.9) @sv
alternative label: Högerorientering, religiös-politisk fundamentalism (374.9) @sv
alternative label: Högerrörelser, nationalism (374.9) @sv
alternative label: Högerrörelser, religiös-politisk fundamentalism (374.9) @sv
alternative label: Islamism, politiska ideologier (374.9) @sv
alternative label: Korporativism (374.9) @sv
alternative label: Massrörelser, politiska alternativrörelser (374.9) @sv
alternative label: Miljörörelser, politiska ideologier (374.9) @sv
broader: Yhteiskunnalliset aatesuunnat. Poliittiset ideologiat
in scheme: URN:NBN:fi:au:hklj:
notation: 374.9
related: URN:NBN:fi:au:hklj:320
related: Valtiofilosofia. Valtiomuodot
related: Sisäpolitiikka. Puolueet
related: Suomi
related: Yhteiskuntafilosofia
related: Talousjärjestelmät
related: URN:NBN:fi:au:hklj:371
scope note: Anarkismi, nihilismi, syndikalismi, korporatismi, radikalismi, kansallismielisyys ja uskonnollis-poliittinen fundamentalismi poliittisina ideologioina Keskustalaisuus poliittisena ideologiana Yhteiskunnallisten vaihtoehtoliikkeiden ja vihreiden poliittiset ideologiat
scope note: Anarkism, nihilism, syndikalism, korporatism, radikalism, nationellt sinnade rörelser och religiöst-politisk fundamentalism som politiska ideologier Centertillhörighet som politisk ideologi De samhälleliga alternativrörelsernas och de grönas ideologer @sv

Partioliike
type: Class
type: Concept
subclass of: Järjestötoiminta. Kokoustekniikka
alternative label: Aatteelliset järjestöt, partioliike (377.8)
alternative label: Aatteelliset yhdistykset, partioliike (377.8)
alternative label: Järjestöt, partioliike (377.8)
alternative label: Kesäleirit, partio (377.8)
alternative label: Lippulinnat, partioliike (377.8)
alternative label: Meripartio (377.8)
alternative label: Partio (377.8)
alternative label: Partiolaiset (377.8)
alternative label: Perheleirit, partio (377.8)
alternative label: Familjeläger, scoutrörelsen (377.8) @sv
alternative label: Flaggtåg, scoutrörelsen (377.8) @sv
alternative label: Ideella föreningar, scoutrörelsen (377.8) @sv
alternative label: Ideella organisationer, scoutrörelsen (377.8) @sv
alternative label: Organisationer, järjestöt, scoutrörelsen (377.8) @sv
alternative label: Scouter (377.8) @sv
alternative label: Scoutrörelsen (377.8) @sv
alternative label: Sjöscouting (377.8) @sv
alternative label: Sommarläger, scoutrörelsen (377.8) @sv
broader: Järjestötoiminta. Kokoustekniikka
in scheme: URN:NBN:fi:au:hklj:
notation: 377.8
preferred label: Scout movement @en
preferred label: Scoutrörelsen @sv
related: URN:NBN:fi:au:hklj:060
related: URN:NBN:fi:au:hklj:061
related: URN:NBN:fi:au:hklj:063
related: Nuorisotyö
related: URN:NBN:fi:au:hklj:371
related: Nuorisoseuratoiminta
related: URN:NBN:fi:au:hklj:377.809
scope note: Partioliikkeen organisaatio. Partiolippukunnat Partiolaisen ja partionjohtajan oppaat
scope note: Scoutrörelsens organisation. Scoutkårer Handböcker för scouter och scoutledare @sv

Varsinais-Suomi. Satakunta
type: Class
type: Concept
subclass of: Suomi
alternative label: Satakunta (412.2)
alternative label: Satakunta, maantiede, matkat (412.2)
alternative label: Turun ja Porin lääni (412.2 +)
alternative label: Turun ja Porin lääni, maantiede, matkat (412.2 +)
alternative label: Varsinais-Suomi (412.2 +)
alternative label: Varsinais-Suomi, maantiede, matkat (412.2 +)
alternative label: Egentliga Finland (412.2 +) @sv
alternative label: Egentliga Finland, geografi, resor (412.2 +) @sv
alternative label: Satakunda (412.2) @sv
alternative label: Satakunda, geografi, resor (412.2) @sv
alternative label: Åbo och Björneborgs län (412.2 +) @sv
alternative label: Åbo och Björneborgs län, geografi, resor (412.2 +) @sv
broader: Suomi
in scheme: URN:NBN:fi:au:hklj:
narrower: Turku
notation: 412.2
preferred label: Egentliga Finland. Satakunda @sv
related: URN:NBN:fi:au:hklj:411
related: URN:NBN:fi:au:hklj:460
related: URN:NBN:fi:au:hklj:920
related: URN:NBN:fi:au:hklj:929
scope note: Turun ja Porin lääni
scope note: Åbo- och Björneborgs län @sv

Italia
type: Class
type: Concept
subclass of: Etelä-Eurooppa
alternative label: Italia (419.2)
alternative label: Italia, maantiede, matkat (419.2 +)
alternative label: Italialaiset (419.2 +)
alternative label: Italialaiset, maantiede, matkat (419.2 +)
alternative label: Riviera, Italia (419.2)
alternative label: San Marino (419.2)
alternative label: San Marino, maantiede, matkat (419.2)
alternative label: Sardinia (419.2)
alternative label: Sardinia, maantiede, matkat (419.2)
alternative label: Sisilia (419.2)
alternative label: Sisilia, maantiede, matkat (419.2)
alternative label: Italien (419.2) @sv
alternative label: Italien, geografi, resor (419.2 +) @sv
alternative label: Italienare (419.2 +) @sv
alternative label: Italienare, geografi, resor (419.2 +) @sv
alternative label: Riviera, Italien (419.2) @sv
alternative label: San Marino, geografi, resor (419.2) @sv
alternative label: Sardinien (419.2) @sv
alternative label: Sardinien, geografi, resor (419.2) @sv
alternative label: Sicilien (419.2) @sv
alternative label: Sicilien, geografi, resor (419.2) @sv
broader: Etelä-Eurooppa
in scheme: URN:NBN:fi:au:hklj:
narrower: Rooma
notation: 419.2
preferred label: Italy @en
preferred label: Italien @sv
related: URN:NBN:fi:au:hklj:460
related: Rooman valtakunnan historia ja arkeologia
related: URN:NBN:fi:au:hklj:979
related: Italian historia
scope note: Tässä myös San Marino
scope note: Hit också San Marino @sv

Etu-Aasia
type: Class
type: Concept
subclass of: AASIA
alternative label: Afganistan (421)
alternative label: Afganistan, maantiede, matkat (421)
alternative label: Arabia (421)
alternative label: Arabia, maantiede, matkat (421)
alternative label: Arabiemiirikunnat (421)
alternative label: Arabiemiirikunnat, maantiede, matkat (421)
alternative label: Arabit (421)
alternative label: Arabit, maantiede, matkat (421)
alternative label: Bahrain (421)
alternative label: Bahrain, maantiede, matkat (421)
alternative label: Etelä-Jemen (421)
alternative label: Etelä-Jemen, maantiede, matkat (421)
alternative label: Etu-Aasia (421 ... 422)
alternative label: Etu-Aasia, maantiede, matkat (421 ... 422)
alternative label: Irak (421)
alternative label: Irak, maantiede, matkat (421)
alternative label: Iran (421)
alternative label: Iran, maantiede, matkat (421)
alternative label: Jemen (421)
alternative label: Jemen, maantiede, matkat (421)
alternative label: Jordania (421)
alternative label: Jordania, maantiede, matkat (421)
alternative label: Kurdistan (421)
alternative label: Kurdistan, maantiede, matkat (421)
alternative label: Kurdit, Kurdistan (421)
alternative label: Kuwait (421)
alternative label: Kuwait, maantiede, matkat (421)
alternative label: Libanon (421)
alternative label: Libanon, maantiede, matkat (421)
alternative label: Lähi-Itä (421 ... 422)
alternative label: Lähi-Itä, maantiede, matkat (421 ... 422)
alternative label: Mesopotamia (421)
alternative label: Mesopotamia, maantiede, matkat (421)
alternative label: Oman (421)
alternative label: Oman, maantiede, matkat (421)
alternative label: Persia (421)
alternative label: Persia, maantiede, matkat (421)
alternative label: Qatar (421)
alternative label: Qatar, maantiede, matkat (421)
alternative label: Saudi-Arabia (421)
alternative label: Saudi-Arabia, maantiede, matkat (421)
alternative label: Syyria (421)
alternative label: Syyria, maantiede, matkat (421)
alternative label: Vähä-Aasia (421 ... 422)
alternative label: Vähä-Aasia, maantiede, matkat (421 ... 422)
alternative label: Yhdistyneet Arabiemiirikunnat (421)
alternative label: Yhdistyneet Arabiemiirikunnat, maantiede, matkat (421)
alternative label: Afghanistan (421) @sv
alternative label: Afghanistan, geografi, resor (421) @sv
alternative label: Arabemiraten (421) @sv
alternative label: Arabemiraten, geografi, resor (421) @sv
alternative label: Araber (421) @sv
alternative label: Araber, geografi, resor (421) @sv
alternative label: Arabien (421) @sv
alternative label: Arabien, geografi, resor (421) @sv
alternative label: Bahrain, geografi, resor (421) @sv
alternative label: Främre Asien (421 ... 422) @sv
alternative label: Främre Asien, geografi, resor (421 ... 422) @sv
alternative label: Förenade Arabemiraten (421) @sv
alternative label: Förenade Arabemiraten, geografi, resor (421) @sv
alternative label: Irak, geografi, resor (421) @sv
alternative label: Iran, geografi, resor (421) @sv
alternative label: Jemen, geografi, resor (421) @sv
alternative label: Jordanien (421) @sv
alternative label: Jordanien, geografi, resor (421) @sv
alternative label: Kurder, Kurdistan (421) @sv
alternative label: Kurdistan, geografi, resor (421) @sv
broader: AASIA
in scheme: URN:NBN:fi:au:hklj:
narrower: Turkki
narrower: Kypros
notation: 421
related: Egyptin ja Etu-Aasian muinaishistoria ja arkeologia
related: Etu-Aasian historia
related: Israelin ja Palestiinan historia
scope note: Afganistan. Arabiemiirikunnat. Bahrain. Irak. Iran. Jemen. Jordania. Kuwait. Libanon. Oman. Qatar. Saudi-Arabia. Syyria Tässä myös Kurdistan
scope note: Afghanistan. Bahrain. Förenade Arabemiraten. Irak. Iran. Jordanien. Kuwait. Libanon. Oman. Qatar. Saudiarabien. Syrien. Yemen Hit också Kurdistan @sv

New York
type: Class
type: Concept
subclass of: Yhdysvallat, USA
alternative label: New York (443.11)
alternative label: New York, maantiede, matkat (443.11)
alternative label: New York, geografi, resor (443.11) @sv
broader: Yhdysvallat, USA
in scheme: URN:NBN:fi:au:hklj:
notation: 443.11
related: Pohjois-Amerikka
related: Havaiji
related: Yhdysvaltojen historia
related: Yhdysvaltojen historia vuoteen 1775
related: Yhdysvaltojen historia 1775-1860
related: Yhdysvaltojen historia 1861-1938
related: Yhdysvaltojen historia 1939-

Mineralogia. Kristallografia. Petrologia
type: Class
type: Concept
subclass of: GEOLOGIA
alternative label: Alabasteri, jalokivet (493)
alternative label: Alumiinimalmit, malmigeologia (493)
alternative label: Apatiitti, mineraalit (493)
alternative label: Geologia, mineralogia (493)
alternative label: Geologia, petrologia (493)
alternative label: Gneissi, kivilajit (493)
alternative label: Graniitti, kivilajit (493)
alternative label: Hiekkakivi, kivilajit (493)
alternative label: Hopeamalmit, malmigeologia (493)
alternative label: Hydroterminen muuttuminen, mineralogia (493)
alternative label: Jade, mineralogia (493)
alternative label: Jalokivet (493)
alternative label: Jalokivet, mineralogia (493)
alternative label: Jalometallit, mineralogia (493)
alternative label: Järvimalmit, malmigeologia (493)
alternative label: Kalkki, mineralogia (493)
alternative label: Kalkkikivi, kivilajit (493)
alternative label: Kallioperä (493)
alternative label: Kalliot, kallioperätutkimus (493)
alternative label: Kidetiede, mineralogia (493)
alternative label: Kiilleliuske, kivilajit (493)
alternative label: Kiilteet, mineraalit (493)
alternative label: Kiteet, mineralogia (493)
alternative label: Kivet, kivilajit (493)
alternative label: Kivi, kivilajit (493)
alternative label: Kivikehä, mineralogia (493)
alternative label: Kivikehä, petrologia (493)
alternative label: Kivilajit (493)
alternative label: Kivitiede (493)
alternative label: Kobolttimalmit, malmigeologia (493)
alternative label: Korukivet, kivilajioppaat (493)
alternative label: Kristallografia, mineralogia (493)
alternative label: Kromimalmit, malmigeologia (493)
alternative label: Kultamalmit, malmigeologia (493)
alternative label: Kupari, kuparimalmi (493)
alternative label: Kuparimalmit, malmigeologia (493)
alternative label: Kvartsi, mineralogia (493)
alternative label: Kvartsiitti, kivilajit (493)
alternative label: Laava, laavakivilajit (493)
alternative label: Liitu, kivilajit (493)
alternative label: Limsiö (493)
alternative label: Litosfääri, mineralogia (493)
alternative label: Litosfääri, petrologia (493)
alternative label: Liuskeet (493)
alternative label: Luonnonkivi, petrologia (493)
alternative label: Lyijy, lyijymalmi (493)
alternative label: Lyijymalmit, malmigeologia (493)
alternative label: Maakuntakivet (493)
alternative label: Maasälpä, mineralogia (493)
alternative label: Magmakivilajit (493)
alternative label: Malmigeologia (493)
alternative label: Malmimineraalit, mineralogia (493)
alternative label: Malmit, malmigeologia (493)
alternative label: Mangaanimalmit, malmigeologia (493)
alternative label: Marmori, petrologia (493)
alternative label: Metallimalmit, malmigeologia (493)
alternative label: Metallit, malmigeologia (493)
alternative label: Metallogenia, malmigeologia (493)
alternative label: Metamorfiset kivilajit (493)
alternative label: Metamorfoosi, geologia (493)
alternative label: Metasomatoosi, mineralogia (493)
alternative label: Meteoriitit (493)
alternative label: Meteoroidit (493)
alternative label: Mineraalikemia, mineralogia (493)
alternative label: Mineraalit (493)
broader: GEOLOGIA
in scheme: URN:NBN:fi:au:hklj:
notation: 493
related: URN:NBN:fi:au:hklj:493.084
related: Fennoskandian geologia
related: Suomen geologia
related: Tähtijärjestelmät. Aurinkokunnat
related: Epäorgaaninen kemia
related: Kaivos- ja kaivannaisteollisuus
related: Kulta- ja hopeasepäntaide. Korutaide
scope note: Mineraalit. Kidetiede. Kivilajit ja niiden synty Jalokivet. Malmit. Malmigeologia. Jalokivigeologia Kallioperän mineraalien ja kivilajien tutkimus Kerrostuneet eli sedimenttikivilajit. Jähmettyneet kivilajit. Syväkivilajit. Pinta- eli magmakivilajit. Muuttuneet eli metamorfiset kivilajit. Meteoriitit Tässä myös Fennoskandiaa ja Suomea koskeva mineralogia ja petrologia
scope note: Mineraler. Kristallografi. Bergarter och deras uppkomst Ädelstenar. Malmer. Malmgeologi. Gemmalogisk geologi Undersökning av berggrund, mineral och bergarter Lagrade eller sedimentära bergarter. Kristallina bergarter. Djupbergarter eller plutoniska bergarter. Ytbergarter eller magmatiska bergarter. Metamorfa bergarter. Meteoriter Hit också Fennoskandiens och Finlands mineralogi och petrologi @sv

Matematiikan muut alat
type: Class
type: Concept
subclass of: MATEMATIIKKA
alternative label: Diagrammit, matematiikan graafinen esitys (519)
alternative label: Graafinen esitys, matematiikka (519)
alternative label: Graafinen laskenta (519)
alternative label: Havainnollistaminen, graafinen esitys (519)
alternative label: Nomografia (519)
alternative label: Diagram, grafisk framställning, matematik (519) @sv
alternative label: Grafisk framställning, matematik (519) @sv
alternative label: Grafisk kalkyl (519) @sv
alternative label: Nomografi (519) @sv
alternative label: Åskådliggörande, grafisk framställning (519) @sv
broader: MATEMATIIKKA
in scheme: URN:NBN:fi:au:hklj:
notation: 519
preferred label: Other areas of mathematics @en
preferred label: Övriga matematiska områden @sv
related: Logistiikka. Looginen kalkyyli
related: Teoria. Tutkimusmenetelmät. Tilastomatematiikka
related: Vakuutustoimi
related: Matematiikan taulukot ja kaavakokoelmat. Laskumenetelmät
related: Laskentatoimi. Rahoitus. Talousarviot
related: Kauppamatematiikka
scope note: Graafinen esitys. Nomografia
scope note: Grafisk framställning. Nomografi @sv

Ufot. Ilmakehän tunnistamattomat ilmiöt
type: Class
type: Concept
subclass of: Avaruustutkimus. Avaruuslennot. Avaruusteknologia
alternative label: Ekstraterrestiaalinen elämä, ufot, humanoidit (529.1)
alternative label: Ekstraterrestinen elämä, ufot, humanoidit (529.1)
alternative label: Humanoidit (529.1)
alternative label: Kokemukset, ufot (529.1)
alternative label: Lentävät lautaset (529.1)
alternative label: Maan ulkopuolinen elämä, ufot, humanoidit (529.1)
alternative label: Maapallon ulkopuolinen elämä , ufot, humanoidit (529.1)
alternative label: Maapallon ulkopuoliset kulttuurit, ufot, humanoidit (529.1)
alternative label: Paranormaalit ilmiöt, ufot ja humanoidit (529.1)
alternative label: Rajatieto, ufot, humanoidit (529.1)
alternative label: Selittämättömät ilmiöt, ufot ja humanoidit (529.1)
alternative label: Tarueläimet, humanoidit (529.1)
alternative label: Taruolennot, humanoidit (529.1)
alternative label: Ufologia (529.1)
alternative label: Ufot (529.1)
alternative label: Ufotutkimus (529.1)
alternative label: Ufouskonnot (529.1)
alternative label: Vieraat sivilisaatiot, ufot, humanoidit (529.1)
alternative label: Erfarenheter, ufon (529.1) @sv
alternative label: Flygande tefat (529.1) @sv
alternative label: Främmande civilisationer, ufon, humanoider (529.1) @sv
alternative label: Humanoider (529.1) @sv
alternative label: Oförklarliga fenomen, ufon och humanoider (529.1) @sv
alternative label: Omstridda fenomen, ufon, humanoider (529.1) @sv
alternative label: Paranormala fenomen, ufon och humanoider (529.1) @sv
alternative label: Sagodjur, humanoider (529.1) @sv
alternative label: Sagoväsen. taruolennot, humanoider (529.1) @sv
alternative label: Ufo-forskning (529.1) @sv
alternative label: Ufo-religioner (529.1) @sv
alternative label: Ufologi (529.1) @sv
alternative label: Ufon (529.1) @sv
alternative label: Utomjordiska kulturer, ufon, humanoider (529.1) @sv
alternative label: Utomjordiskt liv, ufon, humanoider (529.1) @sv
broader: Avaruustutkimus. Avaruuslennot. Avaruusteknologia
in scheme: URN:NBN:fi:au:hklj:
notation: 529.1
preferred label: UFOs. Unidentified phenomena in the atmosphere @en
preferred label: Ufon. Oidentifierade fenomen i atmosfären @sv
related: RAJATIETO
related: Astrologia. Horoskoopit
related: Ilmaliikenne. Ilmailu
related: Meteorologia. Klimatologia
related: Elämä maailmankaikkeudessa. Astrobiologia
related: Tähtijärjestelmät. Aurinkokunnat
related: Kadonneet mantereet. Maapallon ulkopuolisten kulttuurien vaikutus muinaishistoriaan
scope note: Ilmakehän tunnistamattomat ilmiöt ja niiden tutkimus Lentävät lautaset. Vieraat avaruudesta. Humanoidit Ufoihin ja humanoideihin kohdistuva skeptisismi
scope note: Oidentifierade fenomen i atmosfären och forskning kring dem Flygande tefat. Besökare från rymden. Humanoider Skepticism som rör ufon och humanoider @sv

Teoreettinen kemia
type: Class
type: Concept
subclass of: KEMIA
alternative label: Absorptio, kemia (541)
alternative label: Aine, olomuodot (541)
alternative label: Aineen olomuodon muutokset (541)
alternative label: Aineen olomuodot (541)
alternative label: Aineen ominaisuudet, kemia (541)
alternative label: Alkuaineet (541)
alternative label: Alkuaineet, jaksollinen järjestelmä (541)
alternative label: Alumiini, alkuaineiden järjestelmä (541)
alternative label: Amorfiset aineet (541)
alternative label: Argon, alkuaineet (541)
alternative label: Astatiini, halogeenit, teoreettinen kemia (541)
alternative label: Atomipainot (541)
alternative label: Atomiteoria, kemia (541)
alternative label: Boori, alkuaineet (541)
alternative label: Bromi, alkuaineet (541)
alternative label: Cesium, alkuaineet (541)
alternative label: Dispersiot, kemia (541)
alternative label: Ekvivalenssi, kemialliset yhdisteet (541)
alternative label: Elohopea, alkuaineet (541)
alternative label: Emulgaattorit, kemia (541)
alternative label: Emulgointiaineet, kemia (541)
alternative label: Emulsiot, kemia (541)
alternative label: Emäkset, kemia (541)
alternative label: Emäksisyys, kemia (541)
alternative label: Epämetallit, alkuaineet (541)
alternative label: Faasit, aineen olomuodot (541)
alternative label: Fluidit, olomuodot (541)
alternative label: Fosfori, alkuaineet (541)
alternative label: Fullereenit, kemia (541)
alternative label: Fysikaaliset ilmiöt, aineen olomuoto (541)
alternative label: Fysikaaliset ominaisuudet, aineen olomuoto (541)
alternative label: Gallium, alkuaineet, teoreettinen kemia (541)
alternative label: Geelit, kemia (541)
alternative label: Grafeeni, kemia (541)
alternative label: Grafeenioksidi, kemia (541)
alternative label: Grafiini, kemia (541)
alternative label: Haihtuminen, aineen olomuodon muutokset (541)
alternative label: Halogeenit, alkuaineet (541)
alternative label: Hapettuminen (541)
alternative label: Hapetus (541)
alternative label: Hapetus-pelkistysreaktio, hapettuminen (541)
alternative label: Hapot, kemia (541)
alternative label: Happamuus, kemia (541)
alternative label: Happi, alkuaineet (541)
alternative label: Harvinaiset maametallit, alkuaineet (541)
alternative label: Helium, alkuaineet (541)
alternative label: Hidasteet, kemialliset reaktiot (541)
alternative label: Hiili, alkuaineet (541)
alternative label: Hopea, alkuaineet (541)
alternative label: Hydrolyysi (541)
alternative label: Hyytyminen, kemia (541)
alternative label: Härmistyminen (541)
alternative label: Höyry, kemia (541)
alternative label: Höyrystyminen (541)
alternative label: Indikaattorit, kemialliset reaktiot. (541)
alternative label: Ionit (541)
alternative label: Jaksollinen järjestelmä, alkuaineet (541)
alternative label: Jalokaasut, alkuaineet (541)
alternative label: Jauheet, kemia (541)
alternative label: Jodi, alkuaineet (541)
alternative label: Jähmettyminen, olomuodon muutos (541)
alternative label: Jähmettymispiste (541)
alternative label: Jäädytys (541)
alternative label: Jäätyminen (541)
alternative label: Jäätymispiste (541)
broader: KEMIA
in scheme: URN:NBN:fi:au:hklj:
notation: 541
related: Yleinen ja teoreettinen fysiikka
related: Suhteellisuusteoria
related: Ydinfysiikka. Atomifysiikka. Molekyylifysiikka
related: Kvanttiteoria. Kvanttimekaniikka
related: Kokeellinen kemia
related: Epäorgaaninen kemia
related: FYSIKAALINEN KEMIA
scope note: Alkuaineet yleensä. Alkuaineiden järjestelmä Aineen olomuodot yleensä. Kiinteä, kaasumainen ja nestemäinen olomuoto Stökiometriset lait. Atomi- ja molekyylipaino. Valenssit Kemialliset reaktiot, rakenteet, yhdisteet, seokset, liuokset ja katalysaattorit yleensä
scope note: Grundämnen i allmänhet. Grundämnenas periodiska system Aggregationstillstånd. Fast och flytande tillstånd, gastillstånd Stokiometriska lagar. Atom- och molekylvikt. Valenser Kemiska reaktioner, föreningar, bindningar, lösningar och katalysatorer i allmänhet @sv

Kasvimorfologia. Kasvianatomia
type: Class
type: Concept
subclass of: KASVITIEDE
alternative label: Alkio, kasvit (582)
alternative label: Alkiokehitys, kasvit (582)
alternative label: Alkionkehitys, kasvit (582)
alternative label: Anatomia, kasvit (582)
alternative label: Elimet, kasvit (582)
alternative label: Elinoppi, kasvit (582)
alternative label: Embryogeneesi, kasvit (582)
alternative label: Embryologia, kasvit (582)
alternative label: Histologia, kasvit (582)
alternative label: Juuri, kasvianatomia (582)
alternative label: Juuristo, kasvianatomia (582)
alternative label: Kaksineuvoisuus, kasvitiede (582)
alternative label: Kaksivuotiset kasvit, kasvin yksilönkehitys (582)
alternative label: Kasvaminen, kasvianatomia (582)
alternative label: Kasvianatomia (582)
alternative label: Kasvimorfologia (582)
alternative label: Kasvinosat (582)
alternative label: Kasviorganologia (582)
alternative label: Kasvu, kasvianatomia (582)
alternative label: Kasvullinen lisäys, kasvitiede (582)
alternative label: Kasvullinen lisääntyminen, kasvitiede (582)
alternative label: Kloroplastit (582)
alternative label: Kudosoppi, kasvit (582)
alternative label: Lehti, kasviorganologia (582)
alternative label: Maavarsi, kasvianatomia (582)
alternative label: Mehikasvit, kasvianatomia (582)
alternative label: Mitokondriot , kasvit (582)
alternative label: Monivuotiset kasvit, kasvin yksilönkehitys (582)
alternative label: Morfologia, kasvimorfologia (582)
alternative label: Muoto-oppi, kasvimorfologia (582)
alternative label: Ontogenia, kasvit (582)
alternative label: Organologia, kasvit (582)
alternative label: Pituuskasvu, kasvianatomia (582)
alternative label: Sienijuuri, kasvianatomia (582)
alternative label: Solubiologia, kasvit (582)
alternative label: Solukalvot, kasvit (582)
alternative label: Solukot, kasvit (582)
alternative label: Soluseinät, kasvit (582)
alternative label: Solut, kasvit (582)
alternative label: Soluväliaine, solut, kasvit (582)
alternative label: Somatologia, kasvit (582)
alternative label: Sukusolut, kasvianatomia (582)
alternative label: Surkastumat, kasvianatomia (582)
alternative label: Sytologia, kasvit (582)
alternative label: Varsi, kasviorganologia (582)
alternative label: Viherhiukkaset (582)
alternative label: Yksilönkehitys, kasvit (582)
alternative label: Yksineuvoisuus, kasvitiede (582)
alternative label: Yksivuotiset kasvit, kasvin yksilönkehitys (582)
alternative label: Anatomi, växter (582) @sv
alternative label: Bienner, växtens individutveckling (582) @sv
alternative label: Blad, växtorganologi (582) @sv
alternative label: Cellbiologi, växter (582) @sv
alternative label: Celler, växter (582) @sv
alternative label: Cellmembraner, växter (582) @sv
alternative label: Cellväggar, växter (582) @sv
alternative label: Cellvävnader, växter (582) @sv
alternative label: Cytologi, växter (582) @sv
alternative label: Embryo, växter (582) @sv
alternative label: Embryogenes, växter (582) @sv
alternative label: Embryologi, växter (582) @sv
alternative label: Embryons utveckling, växter (582) @sv
alternative label: Enkönade arter, botanik (582) @sv
alternative label: Ettåriga växter, växtens individutveckling (582) @sv
alternative label: Extracellulär matrix, celler, växter (582) @sv
broader: KASVITIEDE
in scheme: URN:NBN:fi:au:hklj:
notation: 582
related: Yleisbiologia
related: Kasvifysiologia
related: Systemaattinen kasvitiede
related: Sekovartiset kasvit
related: Sienet
related: Putkilokasvit
related: Eläinmorfologia. Eläinanatomia
scope note: Kasvimorfologian ja kasvianatomian yleisteokset Kasviorganologian, -embryologian ja -ontogenian yleisteokset Kasvien yksilönkehitys yleensä Tietyn kasvilajin tai lajiryhmän morfologia ja anatomia ko. lajin tai ryhmän luokassa 587+
scope note: Allmänna verk om växtmorfologi och växtanatomi Allmänna verk om växternas organologi, embryologi och ontogeni Växternas individutveckling i allmänhet Morfologi, anatomi och fysiologi för en bestämd växtart eller artgrupp förs enligt art eller artgrupp till klass 587+ @sv

Kokoomateokset
type: Class
type: Concept
subclass of: SOVELLETUT TIETEET
broader: SOVELLETUT TIETEET
in scheme: URN:NBN:fi:au:hklj:
narrower: Tilastot. Taulukot
narrower: Kartat
narrower: Museot. Arkistot. Kokoelmat. Näyttelyt
notation: 608
preferred label: Compilations. Polygraphies @en
preferred label: Samlingsverk. Polygrafier @sv
related: Esseet
scope note: Sovellettuja tieteitä koskevat yleiset tai sekasisältöiset kokoomateokset Eri sovellettuja tieteitä koskevat kokoomateokset alan mukaisessa luokassa
scope note: Samlingsverk och polygrafier med allmänt eller blandat innehåll som rör tillämpad vetenskap Samlingsverk och polygrafier som rör olika tillämpade vetenskaper klassificeras enligt område @sv

Lääketieteen erikoisaloja
type: Class
type: Concept
subclass of: LÄÄKETIEDE. TERVEYDENHOITO
alternative label: Haavoittuneet, sotalääketiede (614)
alternative label: Henkilövahingot, sotilaslääketiede (614)
alternative label: Ilmailulääketiede (614)
alternative label: Kenttälääkintä (614)
alternative label: Kenttäsairaalat (614)
alternative label: Lääkintähuolto (614)
alternative label: Sotalääketiede (614)
alternative label: Sotasairaalat (614)
alternative label: Sotilaslääketiede (614)
alternative label: Sotilaspsykiatria, sotilaslääketiede (614)
alternative label: Sotilassairaalat (614)
alternative label: Sotilasvammat (614)
alternative label: Tanssilääketiede (614)
alternative label: Dansmedicin (614) @sv
alternative label: Flygmedicin (614) @sv
alternative label: Fältmedicin (614) @sv
alternative label: Fältsjukhus (614) @sv
alternative label: Krigsmedicin (614) @sv
alternative label: Krigssjukhus (614) @sv
alternative label: Medicinaltjänst (614) @sv
alternative label: Militära skador (614) @sv
alternative label: Militärmedicin (614) @sv
alternative label: Militärpsykiatri, militärmedicin (614) @sv
alternative label: Militärsjukhus (614) @sv
alternative label: Personskador, militärmedicin (614) @sv
alternative label: Sårade, militärmedicin (614) @sv
broader: LÄÄKETIEDE. TERVEYDENHOITO
in scheme: URN:NBN:fi:au:hklj:
narrower: Oikeuslääketiede
narrower: Urheilulääketiede
notation: 614
preferred label: Specialist areas of medicine @en
preferred label: Medicinska specialområden @sv
related: URN:NBN:fi:au:hklj:332.22
related: URN:NBN:fi:au:hklj:371.6
related: URN:NBN:fi:au:hklj:617
scope note: Teokset, jotka koskevat sekä sotilas- että oikeus- tai urheilulääketiedettä Sotalääketiede. Sotilaslääketiede Muut lääketieteen erikoisalat alan mukaisessa luokassa 610-618+
scope note: Verk som handlar om både militärmedicin, rättsmedicin och idrottsmedicin Krigsmedicin. Militärmedicin Andra medicinska specialområden förs enligt område till klasserna 610-618+ @sv

Oikeuslääketiede
type: Class
type: Concept
subclass of: Lääketieteen erikoisaloja
alternative label: Henkilövahingot, oikeuslääketiede (614.1)
alternative label: Kuolema, kuolemansyyntutkimus (614.1)
alternative label: Kuolemansyyntutkimus (614.1)
alternative label: Kuolemansyyt, kuolemansyyntutkimus (614.1)
alternative label: Kuolinsyyt, kuolemansyyntutkimus (614.1)
alternative label: Kuolleeksi julistaminen, oikeuslääketiede (614.1)
alternative label: Oikeuslääketiede (614.1)
alternative label: Oikeuslääketieteellinen antropologia (614.1)
alternative label: Ruumiinavaus, oikeuslääketiede (614.1)
alternative label: Syyt, kuolemansyyntutkimus (614.1)
alternative label: Äkkikuolema, kuolemansyyntutkimus (614.1)
alternative label: Döden, dödsorsaksutredning (614.1) @sv
alternative label: Dödförklaring, rättsmedicin (614.1) @sv
alternative label: Dödsorsaker, kuolemansyyt, dödsorsaksutredning (614.1) @sv
alternative label: Dödsorsaker, kuolinsyyt, dödsorsaksutredning (614.1) @sv
alternative label: Dödsorsaksutredning (614.1) @sv
alternative label: Obduktion, rättsmedicin (614.1) @sv
alternative label: Orsaker, dödsorsaksutredning (614.1) @sv
alternative label: Personskador, rättsmedicin (614.1) @sv
alternative label: Plötslig död, dödsorsaksutredning (614.1) @sv
alternative label: Rättsmedicin (614.1) @sv
alternative label: Rättsmedicinsk antropologi (614.1) @sv
broader: Lääketieteen erikoisaloja
in scheme: URN:NBN:fi:au:hklj:
notation: 614.1
preferred label: Forensic medicine @en
preferred label: Rättsmedicin @sv
related: URN:NBN:fi:au:hklj:330
related: Oikeussosiologia. Oikeuspolitiikka. Oikeuspsykologia
related: URN:NBN:fi:au:hklj:332.22
related: URN:NBN:fi:au:hklj:371.6
related: URN:NBN:fi:au:hklj:616.2
related: URN:NBN:fi:au:hklj:617
related: Oikeuspsykiatria
scope note: Oikeuslääketieteellinen ruumiinavaus ja kuolemansyyntutkimus
scope note: Rättsmedicinsk obduktion och utredning av dödsorsaker @sv

Tekninen mekaniikka
type: Class
type: Concept
subclass of: URN:NBN:fi:au:hklj:620
alternative label: Aerodynamiikka, tekninen mekaniikka (621)
alternative label: Aeromekaniikka, tekninen mekaniikka (621)
alternative label: Aerostatiikka, tekninen mekaniikka (621)
alternative label: Diffuusio, tekninen mekaniikka (621)
alternative label: Dynamiikka, tekninen mekaniikka (621)
alternative label: Elastisuus, tekninen mekaniikka (621)
alternative label: Fysiikka, tekninen mekaniikka (621)
alternative label: Hankauslujuus (621)
alternative label: Hauraus, tekninen lujuusoppi (621)
alternative label: Hydrodynamiikka, tekninen mekaniikka (621)
alternative label: Hydromekaniikka, tekninen mekaniikka (621)
alternative label: Hydrostatiikka, tekninen mekaniikka (621)
alternative label: Joustavuus, tekninen mekaniikka (621)
alternative label: Kapillariteetti, tekninen mekaniikka (621)
alternative label: Kestokyky, tekniikka (621)
alternative label: Kestävyys, tekniikka (621)
alternative label: Kimmoisuus, tekninen mekaniikka (621)
alternative label: Kinematiikka, tekninen mekaniikka (621)
alternative label: Kinetiikka, tekninen mekaniikka (621)
alternative label: Kitka, tekninen mekaniikka (621)
alternative label: Kriittinen kuormitus, tekniikka (621)
alternative label: Liike, tekniikka (621)
alternative label: Liike-energia, tekniikka (621)
alternative label: Liikeoppi, tekninen mekaniikka (621)
alternative label: Liikeradat, liike, tekniikka. (621)
alternative label: Liikkeet, kinematiikka, tekniikka (621)
alternative label: Lujuus (621)
alternative label: Lujuusoppi, tekniikka (621)
alternative label: Mekaaniset ominaisuudet, tekninen mekaniikka (621)
alternative label: Mekaniikka, tekniikka (621)
alternative label: Modulaarisuus, kimmo-oppi, tekniikka (621)
alternative label: Moduulit, kimmo-oppi, tekniikka (621)
alternative label: Murtolujuus (621)
alternative label: Murtolujuus, tekninen lujuusoppi (621)
alternative label: Murtuminen, lujuusoppi (621)
alternative label: Murtumismekaniikka, tekninen lujuusoppi (621)
alternative label: Osmoosi, tekninen mekaniikka (621)
alternative label: Painopiste, tekninen mekaniikka (621)
alternative label: Plastisuus, tekninen mekaniikka (621)
alternative label: Puristus (621)
alternative label: Puristuskokeet (621)
alternative label: Puristuslujuus (621)
alternative label: Sitkeys, tekninen lujuusoppi (621)
alternative label: Statiikka, tekniikka (621)
alternative label: Taipuvuus, tekninen mekaniikka (621)
alternative label: Tekninen kimmo-oppi (621)
alternative label: Tekninen lujuusoppi (621)
alternative label: Tekninen mekaniikka (621)
alternative label: Termoplastisuus, tekninen mekaniikka (621)
alternative label: Tribologia, tekniikka (621)
alternative label: Venyminen, fysiikka, tekninen mekaniikka (621)
alternative label: Vetokokeet, lujuusoppi (621)
alternative label: Vetolujuus, lujuusoppi (621)
alternative label: Väsymislujuus, lujuusoppi (621)
alternative label: Aerodynamik, teknisk mekanik (621) @sv
alternative label: Aeromekanik, teknisk mekanik (621) @sv
alternative label: Aerostatik, teknisk mekanik (621) @sv
alternative label: Bristning, hållfasthetslära (621) @sv
alternative label: Brotthållfasthet (621) @sv
alternative label: Brotthållfasthet, teknisk hållfasthetslära (621) @sv
alternative label: Brottmekanik, teknisk hållfasthetslära (621) @sv
alternative label: Böjlighet, teknisk mekanik (621) @sv
alternative label: Diffusion, teknisk mekanik (621) @sv
alternative label: Draghållfasthet, hållfasthetslära (621) @sv
alternative label: Dragprov, hållfasthetslära (621) @sv
broader: URN:NBN:fi:au:hklj:620
in scheme: URN:NBN:fi:au:hklj:
notation: 621
related: Mekaniikka
related: Lämpöoppi
related: Aineoppi. Aineenkoetus
related: Yleinen konetekniikka
related: Voimakoneet. Moottorit. Nosto- ja kuljetuslaitteet
related: URN:NBN:fi:au:hklj:631
related: Rakennusstatiikka. Rakennusaineet
scope note: Teknisen mekaniikan yleisteokset. Tekninen lujuus- ja kimmo-oppi yleensä Tekniset lujuuskokeet ja lujuuslaskelmat yleensä Erikoisaloja koskeva tekninen mekaniikka sekä lujuus- ja kimmo-oppi alan mukaisessa luokassa
scope note: Allmänna verk om teknisk mekanik. Teknisk hållfasthets- och elasticitetslära Tekniska hållfasthetsprov och hållfasthetsberäkningar i allmänhet Teknisk mekanik samt hållfasthets- och elasticitetslära inom specialområden klassificeras enligt område @sv

Sähkönmittaustekniikka. Sähkönsäätötekniikka
type: Class
type: Concept
subclass of: Sähkötekniikka
alternative label: Galvanometria (627.4)
alternative label: Oskillografia, sähkötekniikka (627.4)
alternative label: Oskilloskoopit, sähkötekniikka (627.4)
alternative label: Sähkömittarit (627.4)
alternative label: Sähkömittaustekniikka (627.4)
alternative label: Sähkönmittaustekniikka (627.4)
alternative label: Sähkönsäätötekniikka (627.4)
alternative label: Elmätare (627.4) @sv
alternative label: Elmätningsteknik (627.4) @sv
alternative label: Elmätteknik (627.4) @sv
alternative label: Elreglerteknik (627.4) @sv
alternative label: Galvanometri (627.4) @sv
alternative label: Oscillografi, elektroteknik (627.4) @sv
alternative label: Oscilloskop, elektroteknik (627.4) @sv
broader: Sähkötekniikka
in scheme: URN:NBN:fi:au:hklj:
notation: 627.4
preferred label: Electricity measuring technology. Electricity regulating technology @en
preferred label: Elmätteknik. Elreglerteknik @sv
related: Sähköoppi. Magnetismi
related: URN:NBN:fi:au:hklj:620.88
related: Säätö- ja systeemitekniikka. Teollinen automaatio
related: URN:NBN:fi:au:hklj:667.7
related: URN:NBN:fi:au:hklj:667.71
related: URN:NBN:fi:au:hklj:681
related: Toimistokoneet
scope note: Sähkönmittauksen ja sähkönsäädön menetelmät ja kojeet Sähkömittarit. Sähkönsäätimet Sähkötekniikan sovellukset eri aloille sekä erikoisalojen sähkökäyttöiset koneet ja laitteet alan mukaisessa luokassa
scope note: Metoder och instrument för elmätning och elreglering Elmätare. Elektriska reläer och regulatorer Tillämpningar av elteknik inom olika områden samt eldrivna maskiner och apparater för specialområden klassificeras enligt område @sv

Esihistoriallisen ajan arkkitehtuuri
type: Class
type: Concept
subclass of: URN:NBN:fi:au:hklj:720.9
alternative label: Esihistoriallinen taide, arkkitehtuuri (720.902)
alternative label: Förhistorisk konst, arkitektur (720.902) @sv
broader: URN:NBN:fi:au:hklj:720.9
in scheme: URN:NBN:fi:au:hklj:
notation: 720.902
preferred label: Prehistoric architecture @en
preferred label: Förhistoriska tidens arkitektur @sv
related: URN:NBN:fi:au:hklj:709
related: Esihistoriallinen taide
related: Arkkitehtuurikilpailut. Arkkitehtuurinäyttelyt. Arkkitehtuuripalkinnot
related: Eurooppa
related: Aasia
related: Afrikka
related: URN:NBN:fi:au:hklj:749.1
scope note: Maasta tai maanosasta riippumatta esihistoriallinen arkkitehtuuri yleensä Erikoisalojen esihistoriallinen arkkitehtuuri alan mukaisessa luokassa
scope note: Förhistorisk arkitektur i allmänhet oavsett land eller världsdel Specialområden inom förhistorisk arkitektur klassificeras enligt område @sv

Aasia
type: Class
type: Concept
subclass of: URN:NBN:fi:au:hklj:720.9
alternative label: Aasia, arkkitehtuuri, moderni (720.96)
alternative label: Intia, arkkitehtuuri, moderni (720.96)
alternative label: Japani, arkkitehtuuri, moderni (720.96)
alternative label: Kiina, arkkitehtuuri, moderni (720.96)
alternative label: Asien, arkitektur, modern (720.96) @sv
alternative label: Indien, arkitektur, modern (720.96) @sv
alternative label: Japan, arkitektur, modern (720.96) @sv
alternative label: Kina, arkitektur, modern (720.96) @sv
broader: URN:NBN:fi:au:hklj:720.9
in scheme: URN:NBN:fi:au:hklj:
notation: 720.96
preferred label: Asia @en
preferred label: Asien @sv
related: URN:NBN:fi:au:hklj:709
related: Arkkitehtuurikilpailut. Arkkitehtuurinäyttelyt. Arkkitehtuuripalkinnot
related: Alkuperäiskansojen arkkitehtuuri
related: Esihistoriallisen ajan arkkitehtuuri
related: Vanhan ajan arkkitehtuuri. Euroopan ulkopuolisten vanhojen kulttuurien arkkitehtuuri
related: Keskiajan arkkitehtuuri
related: URN:NBN:fi:au:hklj:749.1
scope note: Aasian maiden nykyarkkitehtuuri
scope note: De asiatiska ländernas nutidsarkitektur @sv

Afrikka
type: Class
type: Concept
subclass of: URN:NBN:fi:au:hklj:720.9
alternative label: Afrikka, arkkitehtuuri, moderni (720.97)
alternative label: Egypti, arkkitehtuuri, nykyajan (720.97)
alternative label: Afrika, arkitektur, modern (720.97) @sv
alternative label: Egypten, arkitektur, modern (720.97) @sv
broader: URN:NBN:fi:au:hklj:720.9
in scheme: URN:NBN:fi:au:hklj:
notation: 720.97
preferred label: Africa @en
preferred label: Afrika @sv
related: URN:NBN:fi:au:hklj:709
related: Arkkitehtuurikilpailut. Arkkitehtuurinäyttelyt. Arkkitehtuuripalkinnot
related: Alkuperäiskansojen arkkitehtuuri
related: Esihistoriallisen ajan arkkitehtuuri
related: Vanhan ajan arkkitehtuuri. Euroopan ulkopuolisten vanhojen kulttuurien arkkitehtuuri
related: Keskiajan arkkitehtuuri
related: URN:NBN:fi:au:hklj:749.1
scope note: Afrikan maiden nykyarkkitehtuuri
scope note: De afrikanska ländernas nutidsarkitektur @sv

Uuden ajan kuvanveistotaide
type: Class
type: Concept
subclass of: URN:NBN:fi:au:hklj:730.9
alternative label: Barokki, kuvanveisto (730.906)
alternative label: Kansallisromantiikka, kuvanveisto (730.906)
alternative label: Kertaustyylit, kuvanveisto (730.906)
alternative label: Kuvanveistäjät, elämäkerralliset hakuteokset (730.903 ... 730.9903)
alternative label: Naturalismi, kuvanveisto (730.906)
alternative label: Neoklassismi, kuvanveisto (730.906)
alternative label: Realismi, kuvanveisto (730.906 ... 730.907)
alternative label: Rokokoo, kuvanveisto (730.906)
alternative label: Romantiikka, kuvanveisto (730.906)
alternative label: Symbolismi, kuvanveisto (730.906)
alternative label: Täysromantiikka, kuvanveisto (730.906)
alternative label: Uusklassismi, kuvanveisto (730.906)
alternative label: Varhaisromantiikka, kuvanveisto (730.906)
alternative label: Barock, skulptur (730.906) @sv
alternative label: Förromantik, skulptur (730.906) @sv
alternative label: Högromantik, skulptur (730.906) @sv
alternative label: Imitationsstilar, skulptur (730.906) @sv
alternative label: Nationalromantik, skulptur (730.906) @sv
alternative label: Naturalism, skulptur (730.906) @sv
alternative label: Neoklassicism, skulptur (730.906) @sv
alternative label: Nyklassicism, skulptur (730.906) @sv
alternative label: Realism, skulptur (730.906 ... 730.907) @sv
alternative label: Rokoko, skulptur (730.906) @sv
alternative label: Romantiken, skulptur (730.906) @sv
alternative label: Skulptörer, biografiska uppslagsverk (730.903 ... 730.9903) @sv
alternative label: Symbolism, skulptur (730.906) @sv
broader: URN:NBN:fi:au:hklj:730.9
in scheme: URN:NBN:fi:au:hklj:
notation: 730.906
preferred label: Modern age sculpture @en
preferred label: Nya tidens skulptur @sv
related: URN:NBN:fi:au:hklj:709
related: Uuden ajan taidehistoria
related: Kuvanveistotaiteen materiaalit ja tekniikka
related: URN:NBN:fi:au:hklj:739
related: URN:NBN:fi:au:hklj:742
scope note: Euroopan uuden ajan kuvanveistotaide yleensä Tässä myös Euroopan ulkopuolinen länsimainen uuden ajan kuvanveistotaide yleensä Barokin, rokokoon, romantiikan, symbolismin, ja kansallisromantiikan kuvanveistotaide yleensä Kertaustyylien, kuten uusklassismin kuvanveistotaide yleensä Tietyn maan uuden ajan kuvanveistotaidetta tai kuvanveistäjiä koskevat teokset maan mukaisessa luokassa
scope note: Nya tidens europeiska skulptur i allmänhet Hit också nya tidens utomeuropeiska västerländska skulptur i allmänhet Barockens, rokokons, romantikens, symbolismens, nationalromantikens och jugendtidens skulptur i allmänhet Eklekticism såsom nyklassicistisk skulptur i allmänhet Verk som handlar om nya tidens skulptur eller skulptörer i ett bestämt land klassificeras enligt land @sv

Eurooppa
type: Class
type: Concept
subclass of: URN:NBN:fi:au:hklj:730.9
broader: URN:NBN:fi:au:hklj:730.9
in scheme: URN:NBN:fi:au:hklj:
notation: 730.91
preferred label: Europe @en
preferred label: Europa @sv
related: URN:NBN:fi:au:hklj:709
related: Alkuperäiskansojen kuvanveistotaide
related: Esihistoriallisen ajan kuvanveistotaide
related: Vanhan ajan kuvanveistotaide. Euroopan ulkopuolisten vanhojen kulttuurien kuvanveistotaide
related: Kuvanveistotaiteen materiaalit ja tekniikka
related: URN:NBN:fi:au:hklj:739
related: URN:NBN:fi:au:hklj:742
scope note: Euroopan kuvanveistotaiteen yleisteokset
scope note: Allmänna verk om europeisk skulptur @sv

Pohjoismaat. Baltian maat
type: Class
type: Concept
subclass of: URN:NBN:fi:au:hklj:730.9
alternative label: Baltia, kuvanveisto (730.92)
alternative label: Islanti, kuvanveisto (730.92)
alternative label: Latvia, kuvanveisto (730.92)
alternative label: Liettua, kuvanveisto (730.92)
alternative label: Norja, kuvanveisto (730.92)
alternative label: Pohjoismaat, kuvanveisto (730.92 +)
alternative label: Pohjola, kuvanveisto (730.92 +)
alternative label: Ruotsi, kuvanveisto (730.92)
alternative label: Tanska, kuvanveisto (730.92)
alternative label: Viro, kuvanveisto (730.92)
alternative label: Baltikum, skulptur (730.92) @sv
alternative label: Danmark, skulptur (730.92) @sv
alternative label: Estland, skulptur (730.92) @sv
alternative label: Island, skulptur (730.92) @sv
alternative label: Lettland, skulptur (730.92) @sv
alternative label: Litauen, skulptur (730.92) @sv
alternative label: Norden, skulptur (730.92 +) @sv
alternative label: Nordiska länderna, skulptur (730.92 +) @sv
alternative label: Norge, skulptur (730.92) @sv
alternative label: Sverige, skulptur (730.92) @sv
broader: URN:NBN:fi:au:hklj:730.9
in scheme: URN:NBN:fi:au:hklj:
narrower: Suomi
notation: 730.92
preferred label: Nordic countries. Baltic countries @en
preferred label: Norden. Baltikum @sv
related: URN:NBN:fi:au:hklj:709
related: Kuvanveistotaiteen materiaalit ja tekniikka
related: URN:NBN:fi:au:hklj:739
related: URN:NBN:fi:au:hklj:742
scope note: Ruotsi. Tanska. Norja. Islanti Viro. Latvia. Liettua
scope note: Sverige. Danmark. Norge. Island Estland. Lettland. Litauen @sv

Itä-Eurooppa
type: Class
type: Concept
subclass of: URN:NBN:fi:au:hklj:730.9
alternative label: Bulgaria, kuvanveisto (730.95)
alternative label: Neuvostoliitto, kuvanveisto (730.95 +)
alternative label: Puola, kuvanveisto (730.95)
alternative label: Bulgarien, skulptur (730.95) @sv
alternative label: Polen, skulptur (730.95) @sv
alternative label: Sovjetunionen, skulptur (730.95 +) @sv
broader: URN:NBN:fi:au:hklj:730.9
in scheme: URN:NBN:fi:au:hklj:
narrower: Venäjä
notation: 730.95
preferred label: Eastern Europe @en
preferred label: Östeuropa @sv
related: URN:NBN:fi:au:hklj:709
related: Kuvanveistotaiteen materiaalit ja tekniikka
related: URN:NBN:fi:au:hklj:739
related: URN:NBN:fi:au:hklj:742
scope note: Moldova. Ukraina. Valko-Venäjä Itsenäisten valtioiden yhteisö yleensä
scope note: Moldova (f.d. Moldavien). Ukraina. Vitryssland Oberoende staternas samvälde i allmänhet @sv

Aasia
type: Class
type: Concept
subclass of: URN:NBN:fi:au:hklj:730.9
alternative label: Aasia, kuvanveisto, moderni (730.96)
alternative label: Intia, kuvanveisto, moderni (730.96)
alternative label: Japani, kuvanveisto, moderni (730.96)
alternative label: Kiina, kuvanveisto, moderni (730.96)
alternative label: Asien, skulptur, modern (730.96) @sv
alternative label: Indien, skulptur, modern (730.96) @sv
alternative label: Japan, skulptur, modern (730.96) @sv
alternative label: Kina, skulptur, modern (730.96) @sv
broader: URN:NBN:fi:au:hklj:730.9
in scheme: URN:NBN:fi:au:hklj:
notation: 730.96
preferred label: Asia @en
preferred label: Asien @sv
related: URN:NBN:fi:au:hklj:709
related: Alkuperäiskansojen kuvanveistotaide
related: Esihistoriallisen ajan kuvanveistotaide
related: Vanhan ajan kuvanveistotaide. Euroopan ulkopuolisten vanhojen kulttuurien kuvanveistotaide
related: Kuvanveistotaiteen materiaalit ja tekniikka
related: URN:NBN:fi:au:hklj:739
related: URN:NBN:fi:au:hklj:742
scope note: Aasian maiden nykyajan kuvanveistotaide
scope note: De asiatiska ländernas nutida skulptur @sv

Afrikka
type: Class
type: Concept
subclass of: URN:NBN:fi:au:hklj:730.9
alternative label: Afrikka, kuvanveisto, moderni (730.97)
alternative label: Egypti, kuvanveisto, nykyajan (730.97)
alternative label: Afrika, skulptur, modern (730.97) @sv
alternative label: Egypten, skulptur, modern (730.97) @sv
broader: URN:NBN:fi:au:hklj:730.9
in scheme: URN:NBN:fi:au:hklj:
notation: 730.97
preferred label: Africa @en
preferred label: Afrika @sv
related: URN:NBN:fi:au:hklj:709
related: Alkuperäiskansojen kuvanveistotaide
related: Esihistoriallisen ajan kuvanveistotaide
related: Vanhan ajan kuvanveistotaide. Euroopan ulkopuolisten vanhojen kulttuurien kuvanveistotaide
related: Kuvanveistotaiteen materiaalit ja tekniikka
related: URN:NBN:fi:au:hklj:739
related: URN:NBN:fi:au:hklj:742
scope note: Afrikan maiden nykyajan kuvanveistotaide
scope note: De afrikanska ländernas nutida skulptur @sv

Amerikka
type: Class
type: Concept
subclass of: URN:NBN:fi:au:hklj:730.9
alternative label: Amerikka, kuvanveisto, moderni (730.98 +)
alternative label: Etelä-Amerikka, kuvanveisto, moderni (730.98)
alternative label: Pohjois-Amerikka, kuvanveisto, moderni (730.98 +)
alternative label: Amerika, skulptur, modern (730.98 +) @sv
alternative label: Nordamerika, skulptur, modern (730.98 +) @sv
alternative label: Sydamerika, skulptur, modern (730.98) @sv
broader: URN:NBN:fi:au:hklj:730.9
in scheme: URN:NBN:fi:au:hklj:
narrower: Yhdysvallat
notation: 730.98
preferred label: Americas @en
preferred label: Amerika @sv
related: URN:NBN:fi:au:hklj:709
related: Alkuperäiskansojen kuvanveistotaide
related: Kuvanveistotaiteen materiaalit ja tekniikka
related: URN:NBN:fi:au:hklj:739
related: URN:NBN:fi:au:hklj:742
scope note: Amerikan maiden nykyajan kuvanveistotaide
scope note: De amerikanska ländernas nutida skulptur @sv

Ruotsi
type: Class
type: Concept
subclass of: Pohjoismaat. Baltian maat
alternative label: Ruotsi, maalaustaide (740.922)
alternative label: Sverige, målarkonst (740.922) @sv
broader: Pohjoismaat. Baltian maat
in scheme: URN:NBN:fi:au:hklj:
notation: 740.922
preferred label: Sweden @en
preferred label: Sverige @sv
related: URN:NBN:fi:au:hklj:709
related: URN:NBN:fi:au:hklj:741
related: URN:NBN:fi:au:hklj:741.1
related: URN:NBN:fi:au:hklj:741.2
related: URN:NBN:fi:au:hklj:742
related: URN:NBN:fi:au:hklj:749
related: URN:NBN:fi:au:hklj:749.1

Tanska
type: Class
type: Concept
subclass of: Pohjoismaat. Baltian maat
alternative label: Tanska, maalaustaide (740.923)
alternative label: Danmark, målarkonst (740.923) @sv
broader: Pohjoismaat. Baltian maat
in scheme: URN:NBN:fi:au:hklj:
notation: 740.923
preferred label: Denmark @en
preferred label: Danmark @sv
related: URN:NBN:fi:au:hklj:709
related: URN:NBN:fi:au:hklj:741
related: URN:NBN:fi:au:hklj:741.1
related: URN:NBN:fi:au:hklj:741.2
related: URN:NBN:fi:au:hklj:742
related: URN:NBN:fi:au:hklj:749
related: URN:NBN:fi:au:hklj:749.1

Norja
type: Class
type: Concept
subclass of: Pohjoismaat. Baltian maat
alternative label: Norja, maalaustaide (740.924)
alternative label: Norge, målarkonst (740.924) @sv
broader: Pohjoismaat. Baltian maat
in scheme: URN:NBN:fi:au:hklj:
notation: 740.924
preferred label: Norway @en
preferred label: Norge @sv
related: URN:NBN:fi:au:hklj:709
related: URN:NBN:fi:au:hklj:741
related: URN:NBN:fi:au:hklj:741.1
related: URN:NBN:fi:au:hklj:741.2
related: URN:NBN:fi:au:hklj:742
related: URN:NBN:fi:au:hklj:749
related: URN:NBN:fi:au:hklj:749.1

Islanti
type: Class
type: Concept
subclass of: Pohjoismaat. Baltian maat
alternative label: Islanti, maalaustaide (740.925)
alternative label: Island, målarkonst (740.925) @sv
broader: Pohjoismaat. Baltian maat
in scheme: URN:NBN:fi:au:hklj:
notation: 740.925
preferred label: Iceland @en
preferred label: Island @sv
related: URN:NBN:fi:au:hklj:709
related: URN:NBN:fi:au:hklj:741
related: URN:NBN:fi:au:hklj:741.1
related: URN:NBN:fi:au:hklj:741.2
related: URN:NBN:fi:au:hklj:742
related: URN:NBN:fi:au:hklj:749
related: URN:NBN:fi:au:hklj:749.1

Viro
type: Class
type: Concept
subclass of: Baltian maat
alternative label: Viro, maalaustaide (740.9261)
alternative label: Estland, målarkonst (740.9261) @sv
broader: Baltian maat
in scheme: URN:NBN:fi:au:hklj:
notation: 740.9261
preferred label: Estonia @en
preferred label: Estland @sv
related: URN:NBN:fi:au:hklj:709
related: URN:NBN:fi:au:hklj:741
related: URN:NBN:fi:au:hklj:741.1
related: URN:NBN:fi:au:hklj:741.2
related: URN:NBN:fi:au:hklj:742
related: URN:NBN:fi:au:hklj:749
related: URN:NBN:fi:au:hklj:749.1

Latvia
type: Class
type: Concept
subclass of: Baltian maat
alternative label: Latvia, maalaustaide (740.9262)
alternative label: Lettland, målarkonst (740.9262) @sv
broader: Baltian maat
in scheme: URN:NBN:fi:au:hklj:
notation: 740.9262
preferred label: Lettland @sv
related: URN:NBN:fi:au:hklj:709
related: URN:NBN:fi:au:hklj:741
related: URN:NBN:fi:au:hklj:741.1
related: URN:NBN:fi:au:hklj:741.2
related: URN:NBN:fi:au:hklj:742
related: URN:NBN:fi:au:hklj:749
related: URN:NBN:fi:au:hklj:749.1

Liettua
type: Class
type: Concept
subclass of: Baltian maat
alternative label: Liettua, maalaustaide (740.9263)
alternative label: Litauen, målarkonst (740.9263) @sv
broader: Baltian maat
in scheme: URN:NBN:fi:au:hklj:
notation: 740.9263
preferred label: Lithuania @en
preferred label: Litauen @sv
related: URN:NBN:fi:au:hklj:709
related: URN:NBN:fi:au:hklj:741
related: URN:NBN:fi:au:hklj:741.1
related: URN:NBN:fi:au:hklj:741.2
related: URN:NBN:fi:au:hklj:742
related: URN:NBN:fi:au:hklj:749
related: URN:NBN:fi:au:hklj:749.1

Saksa
type: Class
type: Concept
subclass of: Länsi- ja Keski-Eurooppa
alternative label: Saksa, maalaustaide (740.931)
alternative label: Tyskland, målarkonst (740.931) @sv
broader: Länsi- ja Keski-Eurooppa
in scheme: URN:NBN:fi:au:hklj:
notation: 740.931
preferred label: Germany @en
preferred label: Tyskland @sv
related: URN:NBN:fi:au:hklj:709
related: URN:NBN:fi:au:hklj:741
related: URN:NBN:fi:au:hklj:741.1
related: URN:NBN:fi:au:hklj:741.2
related: URN:NBN:fi:au:hklj:742
related: URN:NBN:fi:au:hklj:749
related: URN:NBN:fi:au:hklj:749.1

Brittein saaret
type: Class
type: Concept
subclass of: Länsi- ja Keski-Eurooppa
alternative label: Britannia, maalaustaide (740.934)
alternative label: Eire, maalaustaide (740.934)
alternative label: Englanti, maalaustaide (740.934)
alternative label: Iso-Britannia, maalaustaide (740.934)
alternative label: Yhdistynyt kuningaskunta, maalaustaide (740.934)
alternative label: Britannien, målarkonst (740.934) @sv
alternative label: Eire, målarkonst (740.934) @sv
alternative label: England, målarkonst (740.934) @sv
alternative label: Förenade konungariket, målarkonst (740.934) @sv
alternative label: Storbritannien, målarkonst (740.934) @sv
broader: Länsi- ja Keski-Eurooppa
in scheme: URN:NBN:fi:au:hklj:
notation: 740.934
preferred label: British Isles @en
preferred label: Brittiska öarna @sv
related: URN:NBN:fi:au:hklj:709
related: URN:NBN:fi:au:hklj:741
related: URN:NBN:fi:au:hklj:741.1
related: URN:NBN:fi:au:hklj:741.2
related: URN:NBN:fi:au:hklj:742
related: URN:NBN:fi:au:hklj:749
related: URN:NBN:fi:au:hklj:749.1
scope note: Iso-Britannia. Irlanti
scope note: Storbritannien. Irland @sv

Espanja
type: Class
type: Concept
subclass of: Etelä-Eurooppa
alternative label: Espanja, maalaustaide (740.942)
alternative label: Spanien, målarkonst (740.942) @sv
broader: Etelä-Eurooppa
in scheme: URN:NBN:fi:au:hklj:
notation: 740.942
preferred label: Spain @en
preferred label: Spanien @sv
related: URN:NBN:fi:au:hklj:709
related: URN:NBN:fi:au:hklj:741
related: URN:NBN:fi:au:hklj:741.1
related: URN:NBN:fi:au:hklj:741.2
related: URN:NBN:fi:au:hklj:742
related: URN:NBN:fi:au:hklj:749
related: URN:NBN:fi:au:hklj:749.1
scope note: Tässä myös Gibraltar
scope note: Hit också Gibraltar @sv

Venäjä
type: Class
type: Concept
subclass of: Itä-Eurooppa
alternative label: Venäjä, maalaustaide (740.951)
alternative label: Ryssland, målarkonst (740.951) @sv
broader: Itä-Eurooppa
in scheme: URN:NBN:fi:au:hklj:
notation: 740.951
preferred label: Russia @en
preferred label: Ryssland @sv
related: URN:NBN:fi:au:hklj:709
related: URN:NBN:fi:au:hklj:741
related: URN:NBN:fi:au:hklj:741.1
related: URN:NBN:fi:au:hklj:741.2
related: URN:NBN:fi:au:hklj:742
related: URN:NBN:fi:au:hklj:749
related: URN:NBN:fi:au:hklj:749.1
scope note: Tässä myös Venäjän Aasian puoleiset alueet
scope note: Hit också de asiatiska områdena av Ryssland @sv

Baletti
type: Class
type: Concept
subclass of: Tanssitaide
alternative label: Arabeskit, baletti (775.1)
alternative label: Baletti, kokonaistaideteos (775.1)
alternative label: Baletti, tanssitaide (775.1)
alternative label: Balettiesitykset, taltioinnit (775.1)
alternative label: Balettitanssi (775.1)
alternative label: Balettitanssijat (775.1)
alternative label: Klassinen baletti (775.1)
alternative label: Koreografia, baletti (775.1)
alternative label: Liikemerkintä, baletti (775.1)
alternative label: Näytökset, balettiohjelmisto (775.1)
alternative label: Pääsyliput, baletti (775.1)
alternative label: Tanssi, baletti (775.1)
alternative label: Tanssinotaatio, baletti (775.1)
alternative label: Tanssiteokset, baletti (775.1)
alternative label: Arabesker, balett (775.1) @sv
alternative label: Balett, allkonstverk (775.1) @sv
alternative label: Balett, danskonst (775.1) @sv
alternative label: Balettdans (775.1) @sv
alternative label: Balettdansare (775.1) @sv
alternative label: Balettföreställningar, inspelningar (775.1) @sv
alternative label: Dans, balett (775.1) @sv
alternative label: Dansnotation, balett (775.1) @sv
alternative label: Dansverk, balett (775.1) @sv
alternative label: Förevisningar, balettrepertoar (775.1) @sv
alternative label: Inträdesbiljetter, balett (775.1) @sv
alternative label: Klassisk balett (775.1) @sv
alternative label: Koreografi, balett (775.1) @sv
alternative label: Rörelsenotation, balett (775.1) @sv
broader: Tanssitaide
in scheme: URN:NBN:fi:au:hklj:
notation: 775.1
preferred label: Ballet @en
preferred label: Balett @sv
related: Teatteri- ja näyttämötaiteen teoria, estetiikka ja filosofia
related: URN:NBN:fi:au:hklj:770.9
related: Elokuva. Elokuvataide
related: Ilmaisutaito. Puhetaito. Lausuntataide
related: Balettimusiikki
related: URN:NBN:fi:au:hklj:795
related: URN:NBN:fi:au:hklj:795.1
scope note: Klassinen baletti, sen historia, henkilöhistoria, tekniikka, estetiikka ja koreografia
scope note: Klassisk balett, dess historia, personhistoria, tekniker, estetik och koreografi @sv

Jazzbaletti. Moderni tanssi
type: Class
type: Concept
subclass of: Tanssitaide
alternative label: Jazzbaletti (775.2)
alternative label: Jazztanssi (775.2)
alternative label: Kokeellinen tanssi (775.2)
alternative label: Koreografia, jazzbaletti (775.2)
alternative label: Koreografia, moderni tanssi (775.2)
alternative label: Liikemerkintä, jazzbaletti (775.2)
alternative label: Liikemerkintä, moderni tanssi (775.2)
alternative label: Moderni tanssi (775.2)
alternative label: Nykytanssi (775.2)
alternative label: Tanssi, jazzbaletti (775.2)
alternative label: Tanssi, moderni tanssi (775.2)
alternative label: Tanssinotaatio, jazzbaletti (775.2)
alternative label: Tanssinotaatio, moderni tanssi (775.2)
alternative label: Tanssiteokset, jazzbaletti (775.2)
alternative label: Tanssiteokset, moderni tanssi (775.2)
alternative label: Dans, jazzbalett (775.2) @sv
alternative label: Dans, modern dans (775.2) @sv
alternative label: Dansnotation, jazzbalett (775.2) @sv
alternative label: Dansnotation, modern dans (775.2) @sv
alternative label: Dansverk, jazzbalett (775.2) @sv
alternative label: Dansverk, modern dans (775.2) @sv
alternative label: Experimentell dans (775.2) @sv
alternative label: Jazzbalett (775.2) @sv
alternative label: Jazzdans (775.2) @sv
alternative label: Koreografi, jazzbalett (775.2) @sv
alternative label: Koreografi, modern dans (775.2) @sv
alternative label: Modern dans (775.2) @sv
alternative label: Rörelsenotation, jazzbalett (775.2) @sv
alternative label: Rörelsenotation, modern dans (775.2) @sv
broader: Tanssitaide
in scheme: URN:NBN:fi:au:hklj:
notation: 775.2
preferred label: Jazz ballet. Modern dance @en
preferred label: Jazzbalett. Modern dans @sv
related: Teatteri- ja näyttämötaiteen teoria, estetiikka ja filosofia
related: URN:NBN:fi:au:hklj:770.9
related: Elokuva. Elokuvataide
related: Ilmaisutaito. Puhetaito. Lausuntataide
related: Balettimusiikki
related: URN:NBN:fi:au:hklj:795
related: URN:NBN:fi:au:hklj:795.1
scope note: Jazzbaletti ja moderni tanssi, niiden historia, henkilöhistoria, tekniikka, estetiikka ja koreografia
scope note: Jazzbalett och modern dans, deras historia, personhistoria, tekniker, estetik och koreografi @sv

Johtaminen
type: Class
type: Concept
subclass of: Musiikin teoria
alternative label: Dynamiikka, musiikin johtaminen (782.7)
alternative label: Esiintyjät, kapellimestarit (782.7)
alternative label: Esittäjät, kapellimestarit (782.7)
alternative label: Johtaminen, musiikki (782.7)
alternative label: Kapellimestarit, elämäkerrat ja muistelmat (782.7)
alternative label: Kapellimestarit, orkesterin johtaminen (782.7)
alternative label: Kuoronjohtajat (782.7)
alternative label: Musiikin johtaminen (782.7)
alternative label: Musiikinjohtajat, elämäkerrat ja muistelmat (782.7)
alternative label: Musiikinjohtajat, orkesterin johtaminen (782.7)
alternative label: Musiikkikilpailut, kapellimestarikilpailut (782.7)
alternative label: Muusikot, kapellimestarit (782.7)
alternative label: Partituurit, partituurin lukeminen (782.7)
alternative label: Taiteilijaelämäkerrat, orkesterinjohtajat (782.7)
alternative label: Taiteilijat, orkesterinjohtajat (782.7)
alternative label: Dirigenter, biografier och memoarer (782.7) @sv
alternative label: Dirigenter, dirigering (782.7) @sv
alternative label: Dirigering (782.7) @sv
alternative label: Dynamik, dirigering (782.7) @sv
alternative label: Kapellmästare, biografier och memoarer (782.7) @sv
alternative label: Kapellmästare, dirigering (782.7) @sv
alternative label: Konstnärer, kapellmästare (782.7) @sv
alternative label: Konstnärsbiografier, kapellmästare (782.7) @sv
alternative label: Körledare (782.7) @sv
alternative label: Ledande, musik (782.7) @sv
alternative label: Musiker, kapellmästare (782.7) @sv
alternative label: Musiktävlingar, kapellmästartävlingar (782.7) @sv
alternative label: Partitur, partiturläsning (782.7) @sv
alternative label: Uppträdande, esiintyjät, kapellmästare (782.7) @sv
alternative label: Uppträdande, esittäjät, kapellmästare (782.7) @sv
broader: Musiikin teoria
in scheme: URN:NBN:fi:au:hklj:
notation: 782.7
preferred label: Conducting @en
preferred label: Dirigering @sv
related: Musiikin filosofia, estetiikka, psykologia ja sosiologia Musiikkikasvatus. Musiikkiopetus
related: Musiikin estetiikka ja filosofia
related: Musiikin tulkinta. Tyylioppi
related: URN:NBN:fi:au:hklj:785
related: URN:NBN:fi:au:hklj:785.4
related: URN:NBN:fi:au:hklj:789
scope note: Johtaminen musiikin lajista riippumatta Musiikin tulkinta ja tyylioppi johtamisen kannalta Partituurin lukeminen Orkesterin- ja kuoronjohtajien henkilöhistoria
scope note: Dirigering oavsett musikslag Musikal tolkning och stillära ur dirigeringens synvinkel Partiturläsning Orkester- och kördirigenters personhistoria @sv

Lauluyhtyeet jonkin soittimen tai soitinyhtyeen säestäminä
type: Class
type: Concept
subclass of: Lauluyhtyeet (2-9 laulajaa)
broader: Lauluyhtyeet (2-9 laulajaa)
in scheme: URN:NBN:fi:au:hklj:
notation: 783.32
preferred label: Vocal groups with accompaniment of instruments or ensembles @en
preferred label: Sånggrupper till ackompanjemang av instrument eller instrumentalensemble @sv
related: URN:NBN:fi:au:hklj:770
related: URN:NBN:fi:au:hklj:784
related: URN:NBN:fi:au:hklj:784.111
related: URN:NBN:fi:au:hklj:788
related: URN:NBN:fi:au:hklj:789

Sekakuorot
type: Class
type: Concept
subclass of: Säestyksellinen kuoromusiikki
alternative label: Sekakuorot, säestykselliset (783.421)
alternative label: Blandade körer, till ackompanjemang (783.421) @sv
broader: Säestyksellinen kuoromusiikki
in scheme: URN:NBN:fi:au:hklj:
notation: 783.421
preferred label: Mixed voice choirs @en
preferred label: Blandade körer @sv
related: URN:NBN:fi:au:hklj:770
related: URN:NBN:fi:au:hklj:784
related: URN:NBN:fi:au:hklj:784.111
related: URN:NBN:fi:au:hklj:788
related: URN:NBN:fi:au:hklj:789

Mieskuorot
type: Class
type: Concept
subclass of: Säestyksellinen kuoromusiikki
alternative label: Mieskuorot, säestykselliset (783.422)
alternative label: Manskörer, till ackompanjemang (783.422) @sv
broader: Säestyksellinen kuoromusiikki
in scheme: URN:NBN:fi:au:hklj:
notation: 783.422
preferred label: Male voice choirs @en
preferred label: Manskörer @sv
related: URN:NBN:fi:au:hklj:770
related: URN:NBN:fi:au:hklj:784
related: URN:NBN:fi:au:hklj:784.111
related: URN:NBN:fi:au:hklj:788
related: URN:NBN:fi:au:hklj:789

Naiskuorot
type: Class
type: Concept
subclass of: Säestyksellinen kuoromusiikki
alternative label: Naiskuorot, säestykselliset (783.423)
alternative label: Damkörer, till ackompanjemang (783.423) @sv
broader: Säestyksellinen kuoromusiikki
in scheme: URN:NBN:fi:au:hklj:
notation: 783.423
preferred label: Female voice choirs @en
preferred label: Damkörer @sv
related: URN:NBN:fi:au:hklj:770
related: URN:NBN:fi:au:hklj:784
related: URN:NBN:fi:au:hklj:784.111
related: URN:NBN:fi:au:hklj:788
related: URN:NBN:fi:au:hklj:789

Lapsi- ja nuorisokuorot
type: Class
type: Concept
subclass of: Säestyksellinen kuoromusiikki
alternative label: Lapsikuorot, säestykselliset (783.424)
alternative label: Nuorisokuorot, säestykselliset (783.424)
alternative label: Poikakuorot, säestykselliset (783.424)
alternative label: Tyttökuorot, säestykselliset (783.424)
alternative label: Barnkörer, till ackompanjemang (783.424) @sv
alternative label: Flickkörer, till ackompanjemang (783.424) @sv
alternative label: Gosskörer, till ackompanjemang (783.424) @sv
alternative label: Ungdomskörer, till ackompanjemang (783.424) @sv
broader: Säestyksellinen kuoromusiikki
in scheme: URN:NBN:fi:au:hklj:
notation: 783.424
preferred label: Children's and young people's choirs @en
preferred label: Barn- och ungdomskörer @sv
related: URN:NBN:fi:au:hklj:770
related: URN:NBN:fi:au:hklj:784
related: URN:NBN:fi:au:hklj:784.111
related: URN:NBN:fi:au:hklj:788
related: URN:NBN:fi:au:hklj:789

Bebop. Mainstream. Latin jazz
type: Class
type: Concept
subclass of: Moderni jazz
broader: Moderni jazz
in scheme: URN:NBN:fi:au:hklj:
notation: 788.211
related: URN:NBN:fi:au:hklj:782.4
related: URN:NBN:fi:au:hklj:783
related: URN:NBN:fi:au:hklj:783.1
related: URN:NBN:fi:au:hklj:785.7
related: URN:NBN:fi:au:hklj:786.8
related: URN:NBN:fi:au:hklj:787.112
related: URN:NBN:fi:au:hklj:789
related: URN:NBN:fi:au:hklj:795
scope note: Tässä esim. afrokuubalainen jazz, bossanova jazz, cool jazz, hard bop ja soul jazz
scope note: Hät t.ex. afrokubansk jazz, bossanova jazz, cool jazz, hard bop och soul jazz @sv

Third stream jazz
type: Class
type: Concept
subclass of: Moderni jazz
broader: Moderni jazz
in scheme: URN:NBN:fi:au:hklj:
notation: 788.212
related: URN:NBN:fi:au:hklj:782.4
related: URN:NBN:fi:au:hklj:783
related: URN:NBN:fi:au:hklj:783.1
related: URN:NBN:fi:au:hklj:785.7
related: URN:NBN:fi:au:hklj:786.8
related: URN:NBN:fi:au:hklj:787.112
related: URN:NBN:fi:au:hklj:789
related: URN:NBN:fi:au:hklj:795
scope note: Tässä myös muu jazzmusiikki, jossa on toisena aineksena länsimainen taidemusiikki (esim. ns. kamarijazz)
scope note: Här också all annan jazz i vilken den andra komponenten är den västerländska konstmusiken (t.ex. s.k. kammarjazz) @sv

Free jazz. Avantgarde jazz
type: Class
type: Concept
subclass of: Moderni jazz
broader: Moderni jazz
in scheme: URN:NBN:fi:au:hklj:
notation: 788.213
related: URN:NBN:fi:au:hklj:782.4
related: URN:NBN:fi:au:hklj:783
related: URN:NBN:fi:au:hklj:783.1
related: URN:NBN:fi:au:hklj:785.7
related: URN:NBN:fi:au:hklj:786.8
related: URN:NBN:fi:au:hklj:787.112
related: URN:NBN:fi:au:hklj:789
related: URN:NBN:fi:au:hklj:795

Fuusiomusiikki. Rockjazz. Popjazz. Jazzrock
type: Class
type: Concept
subclass of: Moderni jazz
broader: Moderni jazz
in scheme: URN:NBN:fi:au:hklj:
notation: 788.214
preferred label: Fusionsmusik. Rockjazz. Popjazz. Jazzrock @sv
related: URN:NBN:fi:au:hklj:782.4
related: URN:NBN:fi:au:hklj:783
related: URN:NBN:fi:au:hklj:783.1
related: URN:NBN:fi:au:hklj:785.7
related: URN:NBN:fi:au:hklj:786.8
related: URN:NBN:fi:au:hklj:787.112
related: URN:NBN:fi:au:hklj:789
related: URN:NBN:fi:au:hklj:795

Etninen jazz
type: Class
type: Concept
subclass of: Moderni jazz
broader: Moderni jazz
in scheme: URN:NBN:fi:au:hklj:
notation: 788.215
preferred label: Ethnic jazz @en
preferred label: Etnisk jazz @sv
related: URN:NBN:fi:au:hklj:782.4
related: URN:NBN:fi:au:hklj:783
related: URN:NBN:fi:au:hklj:783.1
related: URN:NBN:fi:au:hklj:785.7
related: URN:NBN:fi:au:hklj:786.8
related: URN:NBN:fi:au:hklj:787.112
related: URN:NBN:fi:au:hklj:789
related: URN:NBN:fi:au:hklj:795

Suomi
type: Class
type: Concept
subclass of: Pohjoismaat. Baltian maat
alternative label: Karelianismi, musiikinhistoria (789.211)
alternative label: Suomi, musiikinhistoria (789.211)
alternative label: Finland, musikhistoria (789.211) @sv
alternative label: Karelianism, musikhistoria (789.211) @sv
broader: Pohjoismaat. Baltian maat
in scheme: URN:NBN:fi:au:hklj:
notation: 789.211
preferred label: Finland @en
related: URN:NBN:fi:au:hklj:709
related: URN:NBN:fi:au:hklj:782.4
related: URN:NBN:fi:au:hklj:783
related: URN:NBN:fi:au:hklj:789.1

Ruotsi
type: Class
type: Concept
subclass of: Pohjoismaat. Baltian maat
alternative label: Ruotsi, musiikinhistoria (789.212)
alternative label: Sverige, musikhistoria (789.212) @sv
broader: Pohjoismaat. Baltian maat
in scheme: URN:NBN:fi:au:hklj:
notation: 789.212
preferred label: Sweden @en
preferred label: Sverige @sv
related: URN:NBN:fi:au:hklj:709
related: URN:NBN:fi:au:hklj:782.4
related: URN:NBN:fi:au:hklj:783
related: URN:NBN:fi:au:hklj:789.1

Norja
type: Class
type: Concept
subclass of: Pohjoismaat. Baltian maat
alternative label: Norja, musiikinhistoria (789.213)
alternative label: Norge, musikhistoria (789.213) @sv
broader: Pohjoismaat. Baltian maat
in scheme: URN:NBN:fi:au:hklj:
notation: 789.213
preferred label: Norway @en
preferred label: Norge @sv
related: URN:NBN:fi:au:hklj:709
related: URN:NBN:fi:au:hklj:782.4
related: URN:NBN:fi:au:hklj:783
related: URN:NBN:fi:au:hklj:789.1
scope note: Tässä myös Huippuvuoret sekä Svalbard ja Jan Mayen
scope note: Hit också Svalbard och Jan Mayen @sv

Tanska
type: Class
type: Concept
subclass of: Pohjoismaat. Baltian maat
alternative label: Tanska, musiikinhistoria (789.214)
alternative label: Danmark, musikhistoria (789.214) @sv
broader: Pohjoismaat. Baltian maat
in scheme: URN:NBN:fi:au:hklj:
notation: 789.214
preferred label: Denmark @en
preferred label: Danmark @sv
related: URN:NBN:fi:au:hklj:709
related: URN:NBN:fi:au:hklj:782.4
related: URN:NBN:fi:au:hklj:783
related: URN:NBN:fi:au:hklj:789.1
scope note: Tässä myös Fär-saaret ja Grönlanti
scope note: Hit också Färöarna och Grönland @sv

Islanti
type: Class
type: Concept
subclass of: Pohjoismaat. Baltian maat
alternative label: Islanti, musiikinhistoria (789.215)
alternative label: Island, musikhistoria (789.215) @sv
broader: Pohjoismaat. Baltian maat
in scheme: URN:NBN:fi:au:hklj:
notation: 789.215
preferred label: Iceland @en
preferred label: Island @sv
related: URN:NBN:fi:au:hklj:709
related: URN:NBN:fi:au:hklj:782.4
related: URN:NBN:fi:au:hklj:783
related: URN:NBN:fi:au:hklj:789.1

Viro
type: Class
type: Concept
subclass of: Baltian maat
alternative label: Viro, musiikinhistoria (789.2161)
alternative label: Estland, musikhistoria (789.2161) @sv
broader: Baltian maat
in scheme: URN:NBN:fi:au:hklj:
notation: 789.2161
preferred label: Estonia @en
preferred label: Estland @sv
related: URN:NBN:fi:au:hklj:709
related: URN:NBN:fi:au:hklj:782.4
related: URN:NBN:fi:au:hklj:783
related: URN:NBN:fi:au:hklj:789.1

Latvia
type: Class
type: Concept
subclass of: Baltian maat
alternative label: Latvia, musiikinhistoria (789.2162)
alternative label: Lettland, musikhistoria (789.2162) @sv
broader: Baltian maat
in scheme: URN:NBN:fi:au:hklj:
notation: 789.2162
preferred label: Lettland @sv
related: URN:NBN:fi:au:hklj:709
related: URN:NBN:fi:au:hklj:782.4
related: URN:NBN:fi:au:hklj:783
related: URN:NBN:fi:au:hklj:789.1

Liettua
type: Class
type: Concept
subclass of: Baltian maat
alternative label: Liettua, musiikinhistoria (789.2163)
alternative label: Litauen, musikhistoria (789.2163) @sv
broader: Baltian maat
in scheme: URN:NBN:fi:au:hklj:
notation: 789.2163
preferred label: Lithuania @en
preferred label: Litauen @sv
related: URN:NBN:fi:au:hklj:709
related: URN:NBN:fi:au:hklj:782.4
related: URN:NBN:fi:au:hklj:783
related: URN:NBN:fi:au:hklj:789.1

Itävalta
type: Class
type: Concept
subclass of: Keski-Eurooppa
alternative label: Itävalta, musiikinhistoria (789.222)
alternative label: Österrike, musikhistoria (789.222) @sv
broader: Keski-Eurooppa
in scheme: URN:NBN:fi:au:hklj:
notation: 789.222
preferred label: Austria @en
preferred label: Österrike @sv
related: URN:NBN:fi:au:hklj:709
related: URN:NBN:fi:au:hklj:782.4
related: URN:NBN:fi:au:hklj:783
related: URN:NBN:fi:au:hklj:789.1

Sveitsi
type: Class
type: Concept
subclass of: Keski-Eurooppa
alternative label: Sveitsi, musiikinhistoria (789.223)
alternative label: Schweiz, musikhistoria (789.223) @sv
broader: Keski-Eurooppa
in scheme: URN:NBN:fi:au:hklj:
notation: 789.223
preferred label: Switzerland @en
preferred label: Schweiz @sv
related: URN:NBN:fi:au:hklj:709
related: URN:NBN:fi:au:hklj:782.4
related: URN:NBN:fi:au:hklj:783
related: URN:NBN:fi:au:hklj:789.1
scope note: Tässä myös Liechtenstein
scope note: Hit också Liechtenstein @sv

Belgia
type: Class
type: Concept
subclass of: Benelux-maat
alternative label: Belgia, musiikinhistoria (789.2251)
alternative label: Flaamilaiset koulukunnat, musiikinhistoria (789.2251)
alternative label: Belgien, musikhistoria (789.2251) @sv
alternative label: Flamländska skolorna, musikhistoria (789.2251) @sv
broader: Benelux-maat
in scheme: URN:NBN:fi:au:hklj:
notation: 789.2251
preferred label: Belgium @en
preferred label: Belgien @sv
related: URN:NBN:fi:au:hklj:709
related: URN:NBN:fi:au:hklj:782.4
related: URN:NBN:fi:au:hklj:783
related: URN:NBN:fi:au:hklj:789.1

Alankomaat
type: Class
type: Concept
subclass of: Benelux-maat
alternative label: Alankomaat, musiikinhistoria (789.2252)
alternative label: Alankomaiset koulukunnat, musiikinhistoria (789.2252)
alternative label: Hollanti, musiikinhistoria (789.2252)
alternative label: Holland, musikhistoria (789.2252) @sv
alternative label: Nederländerna, musikhistoria (789.2252) @sv
alternative label: Nederländska skolorna, musikhistoria (789.2252) @sv
broader: Benelux-maat
in scheme: URN:NBN:fi:au:hklj:
notation: 789.2252
preferred label: Netherlands @en
preferred label: Nederländerna @sv
related: URN:NBN:fi:au:hklj:709
related: URN:NBN:fi:au:hklj:782.4
related: URN:NBN:fi:au:hklj:783
related: URN:NBN:fi:au:hklj:789.1

Irlanti
type: Class
type: Concept
subclass of: Brittein saaret
alternative label: Eire, musiikinhistoria (789.234)
alternative label: Irlanti, musiikinhistoria (789.234)
alternative label: Eire, musikhistoria (789.234) @sv
alternative label: Irland, musikhistoria (789.234) @sv
broader: Brittein saaret
in scheme: URN:NBN:fi:au:hklj:
notation: 789.234
preferred label: Ireland @en
preferred label: Irland @sv
related: URN:NBN:fi:au:hklj:709
related: URN:NBN:fi:au:hklj:782.4
related: URN:NBN:fi:au:hklj:783
related: URN:NBN:fi:au:hklj:789.1
scope note: Irlannin tasavalta. Pohjois-Irlanti
scope note: Irländska republiken. Nordirland @sv

Ranska
type: Class
type: Concept
subclass of: Länsi- ja Lounais-Eurooppa
alternative label: Ranska, musiikinhistoria (789.241)
alternative label: Frankrike, musikhistoria (789.241) @sv
broader: Länsi- ja Lounais-Eurooppa
in scheme: URN:NBN:fi:au:hklj:
notation: 789.241
preferred label: France @en
preferred label: Frankrike @sv
related: URN:NBN:fi:au:hklj:709
related: URN:NBN:fi:au:hklj:782.4
related: URN:NBN:fi:au:hklj:783
related: URN:NBN:fi:au:hklj:789.1
scope note: Tässä myös Andorra ja Monaco
scope note: Hit också Andorra och Monaco @sv

Italia
type: Class
type: Concept
subclass of: Länsi- ja Lounais-Eurooppa
alternative label: Italia, musiikinhistoria (789.242)
alternative label: Italien, musikhistoria (789.242) @sv
broader: Länsi- ja Lounais-Eurooppa
in scheme: URN:NBN:fi:au:hklj:
notation: 789.242
preferred label: Italy @en
preferred label: Italien @sv
related: URN:NBN:fi:au:hklj:709
related: URN:NBN:fi:au:hklj:782.4
related: URN:NBN:fi:au:hklj:783
related: URN:NBN:fi:au:hklj:789.1
scope note: Tässä myös San Marino ja Vatikaanivaltio
scope note: Hit också San Marino och Vatikanstaten @sv

Malta
type: Class
type: Concept
subclass of: Länsi- ja Lounais-Eurooppa
broader: Länsi- ja Lounais-Eurooppa
in scheme: URN:NBN:fi:au:hklj:
notation: 789.245
related: URN:NBN:fi:au:hklj:709
related: URN:NBN:fi:au:hklj:782.4
related: URN:NBN:fi:au:hklj:783
related: URN:NBN:fi:au:hklj:789.1

Bulgaria
type: Class
type: Concept
subclass of: Balkanin niemimaa
alternative label: Bulgaria, musiikinhistoria (789.251)
alternative label: Bulgarien, musikhistoria (789.251) @sv
broader: Balkanin niemimaa
in scheme: URN:NBN:fi:au:hklj:
notation: 789.251
preferred label: Bulgarien @sv
related: URN:NBN:fi:au:hklj:709
related: URN:NBN:fi:au:hklj:782.4
related: URN:NBN:fi:au:hklj:783
related: URN:NBN:fi:au:hklj:789.1

Romania
type: Class
type: Concept
subclass of: Balkanin niemimaa
alternative label: Romania, musiikinhistoria (789.252)
alternative label: Rumänien, musikhistoria (789.252) @sv
broader: Balkanin niemimaa
in scheme: URN:NBN:fi:au:hklj:
notation: 789.252
preferred label: Rumania @en
preferred label: Rumänien @sv
related: URN:NBN:fi:au:hklj:709
related: URN:NBN:fi:au:hklj:782.4
related: URN:NBN:fi:au:hklj:783
related: URN:NBN:fi:au:hklj:789.1

Slovenia
type: Class
type: Concept
subclass of: Entisen Jugoslavian alue
broader: Entisen Jugoslavian alue
in scheme: URN:NBN:fi:au:hklj:
notation: 789.2531
preferred label: Slovenien @sv
related: URN:NBN:fi:au:hklj:709
related: URN:NBN:fi:au:hklj:782.4
related: URN:NBN:fi:au:hklj:783
related: URN:NBN:fi:au:hklj:789.1

Kroatia
type: Class
type: Concept
subclass of: Entisen Jugoslavian alue
broader: Entisen Jugoslavian alue
in scheme: URN:NBN:fi:au:hklj:
notation: 789.2532
preferred label: Croatia @en
preferred label: Kroatien @sv
related: URN:NBN:fi:au:hklj:709
related: URN:NBN:fi:au:hklj:782.4
related: URN:NBN:fi:au:hklj:783
related: URN:NBN:fi:au:hklj:789.1

Bosnia ja Hertsegovina
type: Class
type: Concept
subclass of: Entisen Jugoslavian alue
broader: Entisen Jugoslavian alue
in scheme: URN:NBN:fi:au:hklj:
notation: 789.2533
preferred label: Bosnia-Herzegovina @en
preferred label: Bosnien-Hercegovina @sv
related: URN:NBN:fi:au:hklj:709
related: URN:NBN:fi:au:hklj:782.4
related: URN:NBN:fi:au:hklj:783
related: URN:NBN:fi:au:hklj:789.1

Serbia ja Montenegro
type: Class
type: Concept
subclass of: Entisen Jugoslavian alue
alternative label: Serbia, musiikinhistoria (789.2534)
alternative label: Serbien, musikhistoria (789.2534) @sv
broader: Entisen Jugoslavian alue
in scheme: URN:NBN:fi:au:hklj:
notation: 789.2534
preferred label: Serbia and Montenegro @en
preferred label: Serbien och Montenegro @sv
related: URN:NBN:fi:au:hklj:709
related: URN:NBN:fi:au:hklj:782.4
related: URN:NBN:fi:au:hklj:783
related: URN:NBN:fi:au:hklj:789.1
scope note: Kosovo. Vojvodina

Makedonia
type: Class
type: Concept
subclass of: Entisen Jugoslavian alue
broader: Entisen Jugoslavian alue
in scheme: URN:NBN:fi:au:hklj:
notation: 789.2535
preferred label: Macedonia @en
preferred label: Makedonien @sv
related: URN:NBN:fi:au:hklj:709
related: URN:NBN:fi:au:hklj:782.4
related: URN:NBN:fi:au:hklj:783
related: URN:NBN:fi:au:hklj:789.1

Albania
type: Class
type: Concept
subclass of: Balkanin niemimaa
broader: Balkanin niemimaa
in scheme: URN:NBN:fi:au:hklj:
notation: 789.254
preferred label: Albanien @sv
related: URN:NBN:fi:au:hklj:709
related: URN:NBN:fi:au:hklj:782.4
related: URN:NBN:fi:au:hklj:783
related: URN:NBN:fi:au:hklj:789.1

Kreikka
type: Class
type: Concept
subclass of: Balkanin niemimaa
alternative label: Kreikka, musiikinhistoria, nykyaika (789.255)
alternative label: Grekland, musikhistoria, nutiden (789.255) @sv
broader: Balkanin niemimaa
in scheme: URN:NBN:fi:au:hklj:
notation: 789.255
preferred label: Greece @en
preferred label: Grekland @sv
related: URN:NBN:fi:au:hklj:709
related: URN:NBN:fi:au:hklj:782.4
related: URN:NBN:fi:au:hklj:783
related: URN:NBN:fi:au:hklj:789.1

Puola
type: Class
type: Concept
subclass of: Itä-Eurooppa
alternative label: Puola, musiikinhistoria (789.261)
alternative label: Polen, musikhistoria (789.261) @sv
broader: Itä-Eurooppa
in scheme: URN:NBN:fi:au:hklj:
notation: 789.261
preferred label: Poland @en
preferred label: Polen @sv
related: URN:NBN:fi:au:hklj:709
related: URN:NBN:fi:au:hklj:782.4
related: URN:NBN:fi:au:hklj:783
related: URN:NBN:fi:au:hklj:789.1

Tsekki
type: Class
type: Concept
subclass of: Tsekkoslovakian alue
alternative label: Tsekki, musiikinhistoria (789.2621)
alternative label: Tjeckien, musikhistoria (789.2621) @sv
broader: Tsekkoslovakian alue
in scheme: URN:NBN:fi:au:hklj:
notation: 789.2621
preferred label: Czech Republic @en
preferred label: Tjeckien @sv
related: URN:NBN:fi:au:hklj:709
related: URN:NBN:fi:au:hklj:782.4
related: URN:NBN:fi:au:hklj:783
related: URN:NBN:fi:au:hklj:789.1

Slovakia
type: Class
type: Concept
subclass of: Tsekkoslovakian alue
broader: Tsekkoslovakian alue
in scheme: URN:NBN:fi:au:hklj:
notation: 789.2622
preferred label: Slovakien @sv
related: URN:NBN:fi:au:hklj:709
related: URN:NBN:fi:au:hklj:782.4
related: URN:NBN:fi:au:hklj:783
related: URN:NBN:fi:au:hklj:789.1

Unkari
type: Class
type: Concept
subclass of: Itä-Eurooppa
alternative label: Unkari, musiikinhistoria (789.263)
alternative label: Ungern, musikhistoria (789.263) @sv
broader: Itä-Eurooppa
in scheme: URN:NBN:fi:au:hklj:
notation: 789.263
preferred label: Hungary @en
preferred label: Ungern @sv
related: URN:NBN:fi:au:hklj:709
related: URN:NBN:fi:au:hklj:782.4
related: URN:NBN:fi:au:hklj:783
related: URN:NBN:fi:au:hklj:789.1

Pohjois-Afrikka
type: Class
type: Concept
subclass of: Afrikka
alternative label: Egypti, musiikinhistoria, nykyajan (789.41)
alternative label: Egypten, musikhistoria, modern (789.41) @sv
broader: Afrikka
in scheme: URN:NBN:fi:au:hklj:
notation: 789.41
preferred label: North Africa @en
preferred label: Nordafrika @sv
related: URN:NBN:fi:au:hklj:709
related: URN:NBN:fi:au:hklj:782.4
related: URN:NBN:fi:au:hklj:783
related: URN:NBN:fi:au:hklj:789.1
scope note: Algeria. Egypti. Etelä-Sudan. Libya. Marokko. Sudan. Tunisia Saharan alue yleensä Tässä myös Länsi-Sahara
scope note: Algeriet. Egypten. Libyen. Marocko. Sudan. Sydsudan. Tunisien Saharaområdet i allmänhet Hit också Västsahara @sv

Länsi-Afrikka
type: Class
type: Concept
subclass of: Afrikka
broader: Afrikka
in scheme: URN:NBN:fi:au:hklj:
notation: 789.42
preferred label: West Africa @en
preferred label: Västafrika @sv
related: URN:NBN:fi:au:hklj:709
related: URN:NBN:fi:au:hklj:782.4
related: URN:NBN:fi:au:hklj:783
related: URN:NBN:fi:au:hklj:789.1
scope note: Benin. Burkina Faso. Gambia. Ghana. Guinea. Guinea-Bissau. Liberia. Mali. Mauritania. Niger. Nigeria. Norsunluurannikko. Senegal. Sierra Leone. Togo
scope note: Benin. Burkina Faso. Elfenbenskusten. Gambia. Ghana. Guinea. Guinea-Bissau. Liberia. Mali. Mauretanien. Niger. Nigeria. Senegal. Sierra Leone. Togo @sv

Keski-Afrikka
type: Class
type: Concept
subclass of: Afrikka
broader: Afrikka
in scheme: URN:NBN:fi:au:hklj:
notation: 789.43
preferred label: Central Africa @en
preferred label: Centralafrika @sv
related: URN:NBN:fi:au:hklj:709
related: URN:NBN:fi:au:hklj:782.4
related: URN:NBN:fi:au:hklj:783
related: URN:NBN:fi:au:hklj:789.1
scope note: Angola. Gabon. Kamerun. Keski-Afrikan tasavalta. Kongo. Päiväntasaajan Guinea. Tsad
scope note: Angola. Centralafrikanska republiken. Ekvatorialguinea. Gabon. Kamerun. Kongo. Tchad @sv

Itä-Afrikka
type: Class
type: Concept
subclass of: Afrikka
broader: Afrikka
in scheme: URN:NBN:fi:au:hklj:
notation: 789.44
preferred label: East Africa @en
preferred label: Östafrika @sv
related: URN:NBN:fi:au:hklj:709
related: URN:NBN:fi:au:hklj:782.4
related: URN:NBN:fi:au:hklj:783
related: URN:NBN:fi:au:hklj:789.1
scope note: Burundi. Djibouti. Eritrea. Etiopia. Kenia. Ruanda. Somalia. Tansania. Uganda Afrikan sarvi
scope note: Burundi. Djibouti. Eritrea. Etiopien. Kenya. Rwanda. Somalia. Tanzania. Uganda Afrikas horn @sv

Etelä-Afrikka
type: Class
type: Concept
subclass of: Afrikka
broader: Afrikka
in scheme: URN:NBN:fi:au:hklj:
notation: 789.45
preferred label: South Africa @en
preferred label: Sydafrika @sv
related: URN:NBN:fi:au:hklj:709
related: URN:NBN:fi:au:hklj:782.4
related: URN:NBN:fi:au:hklj:783
related: URN:NBN:fi:au:hklj:789.1
scope note: Botswana. Etelä-Afrikan tasavalta. Lesotho. Malawi. Mosambik. Namibia. Sambia. Swazimaa. Zimbabwe
scope note: Botswana. Lesotho. Malawi. Moçambique. Namibia. Swaziland. Sydafrikanska republiken. Zambia. Zimbabwe @sv

Kanada
type: Class
type: Concept
subclass of: Pohjois-Amerikka
broader: Pohjois-Amerikka
in scheme: URN:NBN:fi:au:hklj:
notation: 789.51
preferred label: Canada @en
related: URN:NBN:fi:au:hklj:709
related: URN:NBN:fi:au:hklj:782.4
related: URN:NBN:fi:au:hklj:783
related: URN:NBN:fi:au:hklj:789.1

Liikunnan ja urheilun historia
type: Class
type: Concept
subclass of: LIIKUNTA. URHEILU. LEIKIT. HUVIT
alternative label: Avajaiset, olympialaiset (790.9 +)
alternative label: Biografiat, urheilijat (790.9 ... 796 +)
alternative label: Cup-kilpailut, urheilun historia (790.9 +)
alternative label: EM-kisat, urheilun historia (790.9 +)
alternative label: Edelläkävijät, urheilijat (790.9 ... 796 +)
alternative label: Elämäkerrat, urheilijat (790.9 ... 796 +)
alternative label: Elämänhistoria, henkilöhistoria, urheilijat (790.9 ... 796 +)
alternative label: Ennätykset, urheilun historia (790.9)
alternative label: Erityisliikunta, historia (790.9)
alternative label: Esikuvat, urheilijat (790.9 +)
alternative label: Euroopan mestaruuskisat, urheilun historia (790.9 +)
alternative label: Euroopanmestarit, urheilukilpailut (790.9 +)
alternative label: Haastattelut, henkilöhistoria, urheilijat (790.9 ... 796 +)
alternative label: Henkilöhistoria, urheilijat (790.9 ... 796 +)
alternative label: Henkilökuvat, urheilijat (790.9 ... 796 +)
alternative label: Henkilöt, urheilijat (790.9 ... 796 +)
alternative label: Historia, henkilöhistoria, urheilijat (790.9 ... 796 +)
alternative label: Huippu-urheilijat, urheilun historia (790.9 +)
alternative label: Huippu-urheilu, historia (790.9 +)
alternative label: Idolit, urheilijat (790.9 +)
alternative label: Ihanteet, urheilijat (790.9 +)
alternative label: Joukkueet, urheilun historia (790.9 +)
alternative label: Julkisuuden henkilöt, urheilijat (790.9 ... 796 +)
alternative label: Jäähallit, urheilun historia (790.9 +)
alternative label: Kansalliset suurmiehet, urheilijat (790.9 ... 796 +)
alternative label: Kesäkisat, urheilu, historia (790.9 +)
alternative label: Kesäolympialaiset, urheilu, historia (790.9 +)
alternative label: Kilpailut, urheilun historia (790.9 +)
alternative label: Kilpaurheilu, urheilun historia (790.9 +)
alternative label: Kirjeet, urheilijat (790.9 ... 796 +)
alternative label: Kuuluisuus, urheilun historia (790.9 +)
alternative label: Lapsuus, urheilijat (790.9 ... 796 +)
alternative label: Liikkuminen, liikunnan historia (790.9 +)
alternative label: Liikunta, historia (790.9 +)
alternative label: Liikuntahistoria (790.9 +)
alternative label: Liikuntakeskukset, liíkunta, historia (790.9 +)
alternative label: Liikuntamuodot, liikunta, historia (790.9 +)
alternative label: Liikuntaopistot, liikunta, historia (790.9 +)
alternative label: Liikuntaseurat, liikunta, historia (790.9 +)
alternative label: Liikuntatapahtumat, liikunta, historia (790.9 +)
alternative label: Luovuttaminen, urheilun historia (790.9 +)
alternative label: Luovutus, urheilu, urheilun historia (790.9 +)
alternative label: Luovutusvoitot, urheilu, urheilun historia (790.9 +)
alternative label: MM-kisat, urheilun historia (790.9 +)
alternative label: Maailman cup-kilpailut, urheilun historia (790.9 +)
alternative label: Maailmancup, urheilun historia (790.9 +)
alternative label: Maailmanmestarit (790.9 +)
alternative label: Maailmanmestaruuskisat, urheilun historia (790.9 +)
alternative label: Maajoukkueet, urheilun historia (790.9 +)
alternative label: Maaottelut, urheilun historia (790.9 +)
alternative label: Merkkihenkilöt, urheilijat (790.9 ... 796 +)
alternative label: Muistelmat, urheilijat (790.9 ... 796 +)
alternative label: Muistokirjoitukset, urheilijat (790.9 ... 796 +)
alternative label: Naisurheilu, historia (790.9 +)
alternative label: Nekrologit, urheilijat (790.9 ... 796 +)
alternative label: Olympiakisat, urheilu, historia (790.9 +)
alternative label: Olympialaiset, urheilu, historia (790.9 +)
alternative label: Olympialiike, urheilu, historia (790.9 +)
alternative label: Olympiavoittajat (790.9 +)
alternative label: Omaelämäkerrat, urheilijat (790.9 ... 796 +)
alternative label: Ottelut, urheilun historia (790.9 +)
alternative label: Paralympialaiset, historia (790.9 +)
alternative label: Pohjoismaiden mestaruuskisat, urheilu, historia (790.9 +)
alternative label: Päiväkirjat, urheilijat (790.9 ... 796 +)
alternative label: Rakkauskirjeet, urheilijat (790.9 ... 796 +)
alternative label: Rankinglistat, urheilun historia (790.9 +)
alternative label: Ruumiinkulttuuri, liikunta, historia (790.9)
broader: LIIKUNTA. URHEILU. LEIKIT. HUVIT
in scheme: URN:NBN:fi:au:hklj:
narrower: Suomi
notation: 790.9
related: Liikunta. Urheilu
related: Uinti. Sukellus
related: Luistelu
related: Hiihto. Alppihiihto. Ampumahiihto
scope note: Kilpa-, huippu-, kunto- ja vammaisurheilun yleinen historia Urheiluvalmennuksen, urheilupaikkojen ja -tilojen sekä urheiluvälineiden yleinen historia Kesä-, talvi- ja vammaisolympialaiset, niiden yleinen historia Monialaisten urheiluseurojen ja -järjestöjen historia Moniin eri urheilun aloihin liittyvät henkilöt sekä heidän toimintansa ja henkilöhistoriansa
scope note: Tävlings-, elit-, motions- och handikappidrottens allmänna historia Idrottsträningens, tävlingsplatsernas, idrottslokalernas och sportredskapens allmänna historia Olympiska sommarspelen, olympiska vinterspelen och handikapp-OS, deras allmänna historia Historia om idrottsföreningar och idrottsorganisationer med flera sportgrenar och idrottsformer på programmet Personer verksamma inom flera av sportens olika områden samt deras aktiviteter och personhistoria @sv

Hiihto. Alppihiihto. Ampumahiihto
type: Class
type: Concept
subclass of: Liikunta. Urheilu
alternative label: Alppihiihto (791.5)
alternative label: Alppilajit (791.5)
alternative label: Alppiyhdistetty (791.5)
alternative label: Ampumahiihto (791.5)
alternative label: Aseet, ampumahiihto (791.5)
alternative label: Freestyle, hiihto (791.5)
alternative label: Hiihto (791.5)
alternative label: Hiihtoakrobatia (791.5)
alternative label: Hiihtohissit, hiihtourheilu (791.5)
alternative label: Hiihtokeskukset, hiihtourheilu (791.5)
alternative label: Hiihtolajit (791.5)
alternative label: Hiihtoputket (791.5)
alternative label: Hiihtoratsastus (791.5)
alternative label: Hiihtoreitit (791.5)
alternative label: Hiihtosuunnistus (791.5)
alternative label: Hiihtotunnelit (791.5)
alternative label: Joukkuemäenlasku (791.5)
alternative label: Kumparelasku (791.5)
alternative label: Ladut (791.5)
alternative label: Laskettelu (791.5)
alternative label: Laskettelukeskukset, hiihtourheilu (791.5)
alternative label: Leijalautailu, lumilautailu (791.5)
alternative label: Luisteluhiihto (791.5)
alternative label: Lumilaudat (791.5)
alternative label: Lumilautailu (791.5)
alternative label: Lumitykit, hiihtourheilu (791.5)
alternative label: Maastohiihto (791.5)
alternative label: Murtomaahiihto (791.5)
alternative label: Mäenlasku (791.5)
alternative label: Mäkihyppy (791.5)
alternative label: Nopeuslasku (791.5)
alternative label: Pujottelu (791.5)
alternative label: Rullahiihto (791.5)
alternative label: Rullasukset (791.5)
alternative label: Skiathlon (791.5)
alternative label: Sukset, urheiluvälineet (791.5)
alternative label: Suksivoiteet, hiihtolajit (791.5)
alternative label: Suurpujottelu (791.5)
alternative label: Syöksylasku (791.5)
alternative label: Tekolumi, hiihtourheilu (791.5)
alternative label: Telemark (791.5)
alternative label: Vapaalasku, alppilajit (791.5)
alternative label: Viestilajit, hiihto (791.5)
alternative label: Viestit, urheilu, hiihto (791.5)
alternative label: Yhdistetty hiihto (791.5)
alternative label: Alpin kombination (791.5) @sv
alternative label: Alpin skidsport (791.5) @sv
alternative label: Alpin skidåkning (791.5) @sv
alternative label: Backhoppning (791.5) @sv
alternative label: Backåkning (791.5) @sv
alternative label: Freestyle, skidåkning (791.5) @sv
alternative label: Hastighetsåkning, skidåkning (791.5) @sv
alternative label: Kitesurfing, snowboard-åkning (791.5) @sv
alternative label: Konstgjord snö, skidsport (791.5) @sv
alternative label: Lagbackhoppning (791.5) @sv
alternative label: Längdåkning (791.5) @sv
alternative label: Nordisk kombination (791.5) @sv
alternative label: Offpiståkning, alpin skidsport (791.5) @sv
alternative label: Puckelpiståkning (791.5) @sv
alternative label: Rullskidor (791.5) @sv
alternative label: Rullskidåkning (791.5) @sv
alternative label: Skidakrobati (791.5) @sv
alternative label: Skidcentra, skidsport (791.5) @sv
alternative label: Skidgrenar (791.5) @sv
alternative label: Skidleder (791.5) @sv
broader: Liikunta. Urheilu
in scheme: URN:NBN:fi:au:hklj:
notation: 791.5
related: Liikuntatiede ja -tutkimus. Liikuntapolitiikka
related: Liikunnan ja urheilun historia
related: Luistelu
related: URN:NBN:fi:au:hklj:791.509
related: Muut urheilu- ja liikuntamuodot
related: Ammunta
related: Retkeily. Ulkoilu. Vuorikiipeily. Suunnistus
scope note: Murtomaahiihto. Mäkihyppy. Yhdistetty. Ampumahiihto Laskettelu. Pujottelu. Suurpujottelu. Supersuurpujottelu. Syöksylasku. Taitohiihto eli freestyle. Nopeuslasku. Lumilautailu Hiihto, alppihiihto ja ampumahiihto kilpa-, huippu-, kunto- ja vammaisurheilun kannalta Hiihto- ampumahiihto- ja alppihiihtokilpailut, -säännöt, -valmennus ja -välineet Hiihtokeskukset. Laskettelurinteet. Hiihto- ampumahiihto- ja alppihiihtoseurat ja -järjestöt
scope note: Längdåkning. Backhoppning. Nordisk kombination. Skidskytte Utförsåkning. Slalom. Storslalom. Super-G. Störtlopp. Fristilsåkning (freestyle). Hastighetsåkning på skidor. Brädåkning (snowboard-åkning) Skidåkning, alpin skidåkning och skidskytte ur tävlings-, elit-, motions- och handikappidrottens synvinkel Tävlingar, regler, träning och redskap inom skidåkning, alpin skidåkning och skidskytte Skidcentrum. Pister. Föreningar och förbund för skidåkning, alpin skidåkning och skidskytte @sv

Itämaisperäiset lajit. Budo
type: Class
type: Concept
subclass of: Voimailu. Itsepuolustus
alternative label: Aikido (793.4)
alternative label: Budolajit (793.4)
alternative label: Bujinkan budo taijutsu (793.4)
alternative label: Fyysinen väkivalta, itsepuolustus (793.4)
alternative label: Itsepuolustus, itämaiset lajit (793.4)
alternative label: Itsepuolustusjärjestelmät, itämaiset (793.4)
alternative label: Itämaiset itsepuolustusjärjestelmät (793.4)
alternative label: Jiujitsu (793.4)
alternative label: Ju-jutsu (793.4)
alternative label: Judo (793.4)
alternative label: Jujutsu, budolajit (793.4)
alternative label: Karate (793.4)
alternative label: Kung fu (793.4)
alternative label: Ninjutsu (793.4)
alternative label: Samurait, itsepuolustus (793.4)
alternative label: Sumo (793.4)
alternative label: Taekwondo (793.4)
alternative label: Tai chi (793.4)
alternative label: Taido (793.4)
alternative label: Taiji (793.4)
alternative label: Vaaratilanteet, itsepuolustus, itämainen (793.4)
alternative label: Väkivalta, itsepuolustus, itämainen (793.4)
alternative label: Wushu (793.4)
alternative label: Budo (793.4) @sv
alternative label: Faromoment, självförsvar, orientaliskt (793.4) @sv
alternative label: Fysiskt våld, självförsvar (793.4) @sv
alternative label: Jujutsu, budo (793.4) @sv
alternative label: Samurajer, självförsvar (793.4) @sv
alternative label: Självförsvar, österländska självförsvars-metoder (793.4) @sv
alternative label: Självförsvarsmetoder, österländska (793.4) @sv
alternative label: Våld, självförsvar, orientaliskt (793.4) @sv
alternative label: Österländska självförsvarsmetoder (793.4) @sv
broader: Voimailu. Itsepuolustus
in scheme: URN:NBN:fi:au:hklj:
notation: 793.4
preferred label: Martial arts. Budo @en
preferred label: Kampsporter av österländskt ursprung. Budo @sv
related: Itämainen filosofia
related: Jooga
related: Muut urheilu- ja liikuntamuodot
related: Miekkailu
related: Ammunta
related: Paini
related: Nyrkkeily
scope note: Itämaiset itsepuolustusjärjestelmät yleensä Aikido. Judo. Ju-jutsu. Karate. Taiji. Taekwondo. Wushu eli kung fu Budolajien kilpailut, säännöt, valmennus ja välineet Budolajien seurat ja järjestöt
scope note: Österländska självförsvarsmetoder i allmänhet Aikido. Judo. Jiujiutsu. Karate. Tai-chi. Taekwondo. Wushu (kung fu, kuoshu) Tävlingar inom budogrenar, regler, träning och utrustning Klubbar och förbund för budogrenar @sv

Ruotsinkielisen kirjallisuuden historia ja tutkimus
type: Class
type: Concept
subclass of: GERMAANISTEN KIELTEN KIRJALLISUUDEN HISTORIA JA TUTKIMUS
alternative label: Riikinruotsi, kirjallisuuden historia (821 +)
alternative label: Ruotsin kieli, kirjallisuuden historia (821 +)
alternative label: Ruotsin ruotsi, kirjallisuuden historia (821 +)
alternative label: Ruotsinruotsi, kirjallisuuden historia (821 +)
alternative label: Rikssvenska, litteraturhistoria (821 +) @sv
alternative label: Svenska, litteraturhistoria (821 +) @sv
alternative label: Sverigesvenska, litteraturhistoria (821 +) @sv
broader: GERMAANISTEN KIELTEN KIRJALLISUUDEN HISTORIA JA TUTKIMUS
in scheme: URN:NBN:fi:au:hklj:
narrower: Suomenruotsalaisen kirjallisuuden historia ja tutkimus
notation: 821
preferred label: Swedish literature: history and research @en
preferred label: Svensk litteraturhistoria och forskning i svensk litteratur @sv
related: URN:NBN:fi:au:hklj:2
related: Kirjallisuuden aihepiirejä ja kirjallisuustyyppejä koskeva historia ja tutkimus
related: Lasten- ja nuortenkirjallisuuden historia ja tutkimus
related: Pohjoismaisten kielten kirjallisuuden historia ja tutkimus
related: Ruotsin kieli

Seemiläisten kielten kirjallisuuden historia ja tutkimus
type: Class
type: Concept
subclass of: MUIDEN KIELTEN KIRJALLISUUDEN HISTORIA JA TUTKIMUS
alternative label: Afroaasialaiset kielet, kirjallisuudenhistoria (845 ... 849)
alternative label: Amharan kieli, kirjallisuudenhistoria (845)
alternative label: Gilgames, folkloristiikka (845)
alternative label: Seemiläiset kielet, kirjallisuuden historia (845 +)
alternative label: Tigren kieli, kirjallisuuden historia (845)
alternative label: Tigrinjan kieli, kirjallisuuden historia (845)
alternative label: Afroasiatiska språk, litteraturhistoria (845 ... 849) @sv
alternative label: Amhara-språket, litteraturhistoria (845) @sv
alternative label: Gilgamesh, folkloristik (845) @sv
alternative label: Semitiska språk, litteraturhistoria (845 +) @sv
alternative label: Tigre, språk, litteraturhistoria (845) @sv
alternative label: Tigrinja, språk, litteraturhistoria (845) @sv
broader: MUIDEN KIELTEN KIRJALLISUUDEN HISTORIA JA TUTKIMUS
in scheme: URN:NBN:fi:au:hklj:
narrower: Hepreankielisen kirjallisuuden historia ja tutkimus
narrower: Arabiankielisen kirjallisuuden historia ja tutkimus
notation: 845
preferred label: Semitic languages' literature: history and research @en
preferred label: De semitiska språkens litteraturhistoria och forskning i de semitiska språkens litteratur @sv
related: URN:NBN:fi:au:hklj:9.5
related: URN:NBN:fi:au:hklj:9.53
related: URN:NBN:fi:au:hklj:9.54
scope note: Seemiläisten kielten kirjallisuuden historian ja tutkimuksen yleisteokset Amharan-, aramean-, guragen-, hararin-, maltan-, syyrian-, tigren- ja tigrinjankielisen kirjallisuuden historia ja tutkimus
scope note: Allmänna verk om semitisk litteraturhistoria och forskning i semitisk litteratur Litteraturhistoria och litteraturforskning som rör amhariska, arameiska, gurageiska, harari, maltesiska, syriska, tigré och tigrinja @sv

Iranilaisten kielten kirjallisuuden historia ja tutkimus
type: Class
type: Concept
subclass of: Indoiraanisten kielten kirjallisuuden historia ja tutkimus
alternative label: Afgaanin kieli, kirjallisuden historia (846.1)
alternative label: Darin kieli, kirjallisuuden historia (846.1)
alternative label: Farsin kieli, kirjallisuudenhistoria (846.1)
alternative label: Iranilaiset kielet, kirjallisuuden historia (846.1)
alternative label: Kurdin kieli, kirjallisuuden historia (846.1)
alternative label: Paston kieli, kirjallisuuden historia (846.1)
alternative label: Persian kieli, kirjallisuuden historia (846.1)
alternative label: Afghanska, litteraturhistoria (846.1) @sv
alternative label: Dari, litteraturhistoria (846.1) @sv
alternative label: Farsi, litteraturhistoria (846.1) @sv
alternative label: Iranska språk, litteraturhistoria (846.1) @sv
alternative label: Kurdiska, litteraturhistoria (846.1) @sv
alternative label: Pashto, litteraturhistoria (846.1) @sv
alternative label: Persiska, litteraturhistoria (846.1) @sv
broader: Indoiraanisten kielten kirjallisuuden historia ja tutkimus
in scheme: URN:NBN:fi:au:hklj:
notation: 846.1
preferred label: Iranian languages' literature: history and research @en
preferred label: De iranska språkens litteraturhistoria och forskning i de iranska språkens litteratur @sv
related: URN:NBN:fi:au:hklj:9.6
related: URN:NBN:fi:au:hklj:9.61
related: URN:NBN:fi:au:hklj:9.612
related: URN:NBN:fi:au:hklj:9.62
related: URN:NBN:fi:au:hklj:9.67
scope note: Belutsin-, darin-, jaghnobin-, kurdin-, osseetin-, pamirin-, persian-, paston- ja tadzikinkielisen kirjallisuuden historia ja tutkimus
scope note: Litteraturhistoria och litteraturforskning som rör baluchiska, dari, jaghnob, kurdiska, ossetiska, pamir, pashto, persiska och tadjikiska @sv

Suomen kielen yksikieliset sanakirjat
type: Class
type: Concept
subclass of: Suomen kieli
alternative label: Fraasisanakirjat, suomen kieli (884.3)
alternative label: Fraasit, sanakirjat, suomi (884.3)
alternative label: Fraseologia, sanakirjat, suomi (884.3)
alternative label: Frekvenssisanakirjat, suomen kieli (884.3)
alternative label: Idiomisanakirjat, suomen kieli (884.3)
alternative label: Kiroilu, kirosanakirjat, suomi (884.3)
alternative label: Kirosanat, kirosanakirjat, suomi (884.3)
alternative label: Riimisanakirjat, suomi (884.3)
alternative label: Sanonnat, sanakirjat, suomi (884.3)
alternative label: Suomen kieli, sanakirjat, yksikieliset (884.3)
alternative label: Suomen kieli, synonyymisanakirjat (884.3)
alternative label: Synonyymisanakirjat, suomen kieli (884.3)
alternative label: Finska, ordböcker, enspråkiga (884.3) @sv
alternative label: Finska, synonymordböcker (884.3) @sv
alternative label: Fraseologi, ordböcker, finska (884.3) @sv
alternative label: Fraser, ordböcker, finska (884.3) @sv
alternative label: Frasordböcker, finska (884.3) @sv
alternative label: Frekvensordböcker, finska (884.3) @sv
alternative label: Idiomordböcker, finska (884.3) @sv
alternative label: Rimordböcker, finska (884.3) @sv
alternative label: Svordomar, svordomsordböcker, Finland (884.3) @sv
alternative label: Svärande, svordomsordböcker, Finland (884.3) @sv
alternative label: Synonymordböcker, finska (884.3) @sv
broader: Suomen kieli
in scheme: URN:NBN:fi:au:hklj:
notation: 884.3
preferred label: Finnish dictionaries @en
preferred label: Enspråkiga finska ordböcker @sv
related: URN:NBN:fi:au:hklj:188.4
related: Sähköposti. Verkkojuttelu
related: URN:NBN:fi:au:hklj:627.7512
related: Monikieliset sanakirjat. Sivistyssanakirjat
related: Itämerensuomalaiset kielet
related: URN:NBN:fi:au:hklj:884.203
related: URN:NBN:fi:au:hklj:884.603
scope note: Suomen kielen yleiset yksikieliset sanakirjat Erikoisalojen sanakirjat alan mukaisessa luokassa
scope note: Allmänna enspråkiga ordböcker över finska Ordböcker över specialområden klassificeras enligt område @sv

Suomen kielen kielioppi ja semantiikka
type: Class
type: Concept
subclass of: Suomen kieli
alternative label: Ablatiivi, sijamuodot, suomen kieli (884.5)
alternative label: Adessiivi, sijamuodot, suomen kieli (884.5)
alternative label: Adjektiivit, suomen kieli (884.5)
alternative label: Adverbiaalit, suomen kieli (884.5)
alternative label: Adverbit, suomen kieli (884.5)
alternative label: Affiksit, suomen kieli (884.5)
alternative label: Aikamuodot, suomen kieli (884.5)
alternative label: Aktiivi, suomen kieli (884.5)
alternative label: Anagrammit, suomen kieli (884.5)
alternative label: Antonymia, suomen kieli (884.5)
alternative label: Antonyymit, suomen kieli (884.5)
alternative label: Asemosanat, suomen kieli (884.5)
alternative label: Aspekti, suomen kieli (884.5)
alternative label: Attribuutti, suomen kieli (884.5)
alternative label: Deklinaatio, suomen kieli (884.5)
alternative label: Deskriptiivisanat, sanaoppi, suomi (884.5)
alternative label: Ekspressiivisanat, sanaoppi, suomi (884.5)
alternative label: Etuliitteet, kielitiede, suomen kieli (884.5)
alternative label: Futuurit, suomen kieli (884.5)
alternative label: Homonyymit, suomen kieli (884.5)
alternative label: Infiniittirakenteet, suomen kieli (884.5)
alternative label: Interjektiot, suomen kieli (884.5)
alternative label: Johdokset, suomen kieli (884.5)
alternative label: Jälkiliitteet, suomen kieli (884.5)
alternative label: Kieltoilmaukset, suomen kieli (884.5)
alternative label: Komparaatio, suomen kieli (884.5)
alternative label: Konjugaatio, kielitiede, suomen kieli (884.5)
alternative label: Konjunktiot, suomen kieli (884.5)
alternative label: Kääntösanat, suomen kieli (884.5)
alternative label: Lainasanat, sanaoppi, suomi (884.5)
alternative label: Lauseenjäsenet, suomen kieli (884.5)
alternative label: Lauseenjäsennys, suomen kieli (884.5)
alternative label: Lauseenvastikkeet, suomen kieli (884.5)
alternative label: Lauseet, suomen kieli (884.5)
alternative label: Lauseoppi, suomen kieli (884.5)
alternative label: Lausetyypit, suomen kieli (884.5)
alternative label: Leksikologia, sanaoppi, suomi (884.5)
alternative label: Liitteet, suomen kieli (884.5)
alternative label: Loppuliitteet, suomen kieli (884.5)
alternative label: Lukusanat, suomen kieli (884.5)
alternative label: Metonymia, suomen kieli (884.5)
alternative label: Modaalisuus, suomen kieli (884.5)
alternative label: Monikko, suomen kieli (884.5)
alternative label: Neologismit, suomen kieli (884.5)
alternative label: Nimitykset, suomen kieli (884.5)
alternative label: Nominit, suomen kieli (884.5)
alternative label: Numeraalit, suomen kieli (884.5)
alternative label: Objekti, suomen kieli (884.5)
alternative label: Objektiivit, suomen kieli (884.5)
alternative label: Onomatopoeettiset sanat, sanaoppi, suomi (884.5)
alternative label: Palindromit, suomen kieli (884.5)
alternative label: Partikkelit, kielitiede, suomen kieli (884.5)
alternative label: Partisiipit, suomen kieli (884.5)
alternative label: Passiivi, suomen kieli (884.5)
alternative label: Positiivit, suomen kieli (884.5)
alternative label: Postpositiot, suomen kieli (884.5)
alternative label: Potentiaali, suomen kieli (884.5)
alternative label: Predikaatti, suomen kieli (884.5)
alternative label: Prefiksit, suomen kieli (884.5)
alternative label: Pronominit, suomi (884.5)
alternative label: Refleksiivisyys, suomen kieli (884.5)
alternative label: Rektio, suomen kieli (884.5)
alternative label: Sanajärjestys, suomen kieli (884.5)
alternative label: Sanaluokat, suomen kieli (884.5)
alternative label: Sananmuodostus, suomen kieli (884.5)
alternative label: Sananmuunnokset, suomen kieli (884.5)
broader: Suomen kieli
in scheme: URN:NBN:fi:au:hklj:
notation: 884.5
related: URN:NBN:fi:au:hklj:188.4
related: Sähköposti. Verkkojuttelu
related: URN:NBN:fi:au:hklj:627.7512
related: Kielioppi. Muoto-oppi. Sanaoppi. Semantiikka
related: Itämerensuomalaiset kielet
related: Suomen kielen murteet
scope note: Suomen kielen kielioppi, muoto-oppi, sanaoppi ja semantiikka Suomen kielen kieliopin oppi- ja harjoituskirjat Sanaluokat. Sananmuodostus. Taivutus. Lauseoppi eli syntaksi
scope note: Finsk betydelselära (semantik), formlära (morfologi), satslära (syntax) och ordlära (lexikologi) Läroböcker och övningsböcker i finsk grammatik Ordklasser. Ordbildning. Böjning. Satslära (syntax) @sv

Rahatiede
type: Class
type: Concept
subclass of: Historian aputieteet
alternative label: Juhlarahat (911.5)
alternative label: Kolikot, numismatiikka (911.5)
alternative label: Metallirahat, numismatiikka (911.5)
alternative label: Muistorahat (911.5)
alternative label: Numismatiikka (911.5)
alternative label: Raha, numismatiikka (911.5)
alternative label: Rahalöydöt, arkeologia, numismatiikka (911.5)
alternative label: Rahat, historia (911.5)
alternative label: Rahat, keräily (911.5)
alternative label: Rahatiede (911.5)
alternative label: Setelirahat, numismatiikka (911.5)
alternative label: Setelit, numismatiikka (911.5)
alternative label: Taalerit, metallirahat, numismatiikka (911.5)
alternative label: Vesileimat, numismatiikka (911.5)
alternative label: Daler, metallmynt, numismatik (911.5) @sv
alternative label: Jubileumsmynt (911.5) @sv
alternative label: Metallmynt, numismatik (911.5) @sv
alternative label: Minnespengar (911.5) @sv
alternative label: Mynt, historia (911.5) @sv
alternative label: Mynt, samlande (911.5) @sv
alternative label: Myntfynd, arkeologi, numismatik (911.5) @sv
alternative label: Myntvetenskap (911.5) @sv
alternative label: Numismatik (911.5) @sv
alternative label: Pengar, numismatik (911.5) @sv
alternative label: Sedlar, numismatik (911.5) @sv
alternative label: Slantar, numismatik (911.5) @sv
alternative label: Vattenstämplar, numismatik (911.5) @sv
broader: Historian aputieteet
in scheme: URN:NBN:fi:au:hklj:
notation: 911.5
preferred label: Numismatics @en
preferred label: Numismatik @sv
related: Raha. Valuutta. Pankit. Pörssit
related: Standardit. Normit. Mittayksiköt
related: URN:NBN:fi:au:hklj:739
related: URN:NBN:fi:au:hklj:798
related: Historian tutkimusmenetelmät
related: URN:NBN:fi:au:hklj:911.503
related: Kunniamerkit. Arvonimet. Mitalitiede
scope note: Numismatiikka. Rahojen keräily Eri maanosien, maiden, alueiden ja aikakausien rahat, niiden tutkimus ja keräily
scope note: Numismatik. Samlande av mynt och sedlar Olika världsdelars, länders, geografiska områdens och tidsperioders mynt och sedlar, forskning kring dem och samlande av dem @sv

Esi- ja varhaishistoria
type: Class
type: Concept
subclass of: URN:NBN:fi:au:hklj:930
alternative label: Arkeologia, Pohjoismaat (930.1)
alternative label: Merovingiaika, Pohjoismaiden historia (930.1)
alternative label: Pronssikausi, Pohjoismaat (930.1)
alternative label: Rautakausi, Pohjoismaat (930.1)
alternative label: Riimukivet, Pohjoismaiden historia (930.1)
alternative label: Roomalainen rautakausi, Pohjoismaiden historia (930.1)
alternative label: Varhaismetallikausi, Pohjoismaat (930.1)
alternative label: Varjagit, viikingit (930.1)
alternative label: Viikingit, historia (930.1)
alternative label: Viikinkiaika, Pohjoismaiden historia (930.1)
alternative label: Viikinkiretket, Pohjoismaiden historia (930.1)
alternative label: Arkeologi, Nordiska länderna (930.1) @sv
alternative label: Bronsåldern, Nordiska länderna (930.1) @sv
alternative label: Järnåldern, Nordiska länderna (930.1) @sv
alternative label: Merovingertiden, nordisk historia (930.1) @sv
alternative label: Romersk järnålder, Nordens historia (930.1) @sv
alternative label: Runstenar, Nordens historia (930.1) @sv
alternative label: Tidig metallålder, Norden (930.1) @sv
alternative label: Varjager, vikingar (930.1) @sv
alternative label: Vikingafärder, Nordens historia (930.1) @sv
alternative label: Vikingar, historia (930.1) @sv
alternative label: Vikingatiden, Nordens historia (930.1) @sv
broader: URN:NBN:fi:au:hklj:930
in scheme: URN:NBN:fi:au:hklj:
notation: 930.1
preferred label: Pre-history and ancient history @en
preferred label: Förhistoria och fornhistoria @sv
related: Esi- ja varhaishistoria vuoteen 1154
related: Ruotsin historia 1060-1522
related: Tanskan historia
related: Norjan historia
related: Islannin historia
related: URN:NBN:fi:au:hklj:989
scope note: Pohjoismaiden esi- ja varhaishistorian yleisteokset Pohjoismaiden arkeologian yleisteokset Viikingit ja viikinkiaika Pohjoismaissa yleensä Historiateokset, jotka koskevat useampaa kuin yhtä Pohjoismaata, myös Suomea Tietyn Pohjoismaan historia ko. maan historian luokassa
scope note: Allmänna verk om Nordens förhistoria och fornhistoria Allmänna verk om Nordens arkeologi Vikingarna och vikingatiden i Norden i allmänhet Historiska verk som handlar om fler än ett nordiskt land, också Finland Ett bestämt nordiskt lands historia förs till klassen för landets historia @sv

Venäjän vanha ja keskiaika
type: Class
type: Concept
subclass of: Venäjän historia vuoteen 1917
broader: Venäjän historia vuoteen 1917
in scheme: URN:NBN:fi:au:hklj:
notation: 971.21
preferred label: Russia’s pre-history and the middle ages @en
preferred label: Rysslands forntid och ryska medeltiden @sv
related: Menetetty Karjalan alue
related: Lappi
related: Armenia. Azerbaidzan. Georgia. Kazakstan. Kirgisia. Tadzikistan. Turkmenistan. Uzbekistan
related: URN:NBN:fi:au:hklj:909
related: URN:NBN:fi:au:hklj:919
related: Aasian historia
related: URN:NBN:fi:au:hklj:989
scope note: Tässä myös Venäjän arkeologian yleisteokset
scope note: Hit också allmänna verk om Rysslands arkeologi @sv

Venäjän historia 1682-1856
type: Class
type: Concept
subclass of: Venäjän historia vuoteen 1917
alternative label: Itämainen sota, Venäjän historia (971.22)
alternative label: Österländska kriget, Rysslands historia (971.22) @sv
broader: Venäjän historia vuoteen 1917
in scheme: URN:NBN:fi:au:hklj:
notation: 971.22
preferred label: Russia’s history 1682–1856 @en
preferred label: Rysslands historia 1682–1856 @sv
related: Menetetty Karjalan alue
related: Lappi
related: Armenia. Azerbaidzan. Georgia. Kazakstan. Kirgisia. Tadzikistan. Turkmenistan. Uzbekistan
related: URN:NBN:fi:au:hklj:909
related: URN:NBN:fi:au:hklj:919
related: Aasian historia
related: URN:NBN:fi:au:hklj:989
scope note: Pietari Suuresta Itämaisen sodan loppuun
scope note: Från Peter den store till Krimkrigets slut @sv

Venäjän historia 1857-1917
type: Class
type: Concept
subclass of: Venäjän historia vuoteen 1917
alternative label: Vallankumoukset, Venäjän (971.23)
alternative label: Venäjän vallankumous (971.23)
alternative label: Revolutioner, Ryska (971.23) @sv
alternative label: Ryska revolutionen (971.23) @sv
broader: Venäjän historia vuoteen 1917
in scheme: URN:NBN:fi:au:hklj:
notation: 971.23
preferred label: Russia’s history 1857–1917 @en
preferred label: Rysslands historia 1857–1917 @sv
related: Menetetty Karjalan alue
related: Lappi
related: Armenia. Azerbaidzan. Georgia. Kazakstan. Kirgisia. Tadzikistan. Turkmenistan. Uzbekistan
related: URN:NBN:fi:au:hklj:909
related: URN:NBN:fi:au:hklj:919
related: Aasian historia
related: URN:NBN:fi:au:hklj:989
scope note: Itämaista sotaa seuranneesta ajasta vallankumoukseen Venäjän vallankumous ja sen historia
scope note: Från tiden efter krigen i öster till revolutionen Den ryska revolutionen och dess historia @sv

Neuvostoliiton historia 1917-1938
type: Class
type: Concept
subclass of: Neuvostoliiton historia 1917-1991
alternative label: Venäjän sisällissota, historia (971.71)
alternative label: Ryska inbördeskriget, historia (971.71) @sv
broader: Neuvostoliiton historia 1917-1991
in scheme: URN:NBN:fi:au:hklj:
notation: 971.71
preferred label: History of the Soviet Union 1917–1938 @en
preferred label: Sovjetunionens historia 1917–1938 @sv
related: Menetetty Karjalan alue
related: Lappi
related: Armenia. Azerbaidzan. Georgia. Kazakstan. Kirgisia. Tadzikistan. Turkmenistan. Uzbekistan
related: URN:NBN:fi:au:hklj:909
related: URN:NBN:fi:au:hklj:919
related: Aasian historia
related: URN:NBN:fi:au:hklj:989

Neuvostoliiton historia 1939-1945
type: Class
type: Concept
subclass of: Neuvostoliiton historia 1917-1991
alternative label: Moskovan rauha, Neuvostoliiton historia (971.72)
alternative label: Moskvafreden, Sovjetunionens historia (971.72) @sv
broader: Neuvostoliiton historia 1917-1991
in scheme: URN:NBN:fi:au:hklj:
notation: 971.72
preferred label: History of the Soviet Union 1939–1945 @en
preferred label: Sovjetunionens historia 1939–1945 @sv
related: Menetetty Karjalan alue
related: Lappi
related: Armenia. Azerbaidzan. Georgia. Kazakstan. Kirgisia. Tadzikistan. Turkmenistan. Uzbekistan
related: URN:NBN:fi:au:hklj:909
related: URN:NBN:fi:au:hklj:919
related: Aasian historia
related: URN:NBN:fi:au:hklj:989

Viron historia
type: Class
type: Concept
subclass of: Baltian maiden historia
alternative label: Viro, historia (973.1)
alternative label: Virolaiset, Viron historia (973.1)
alternative label: Ester, Estland, historia (973.1) @sv
alternative label: Estland, historia (973.1) @sv
broader: Baltian maiden historia
in scheme: URN:NBN:fi:au:hklj:
notation: 973.1
preferred label: Estonia's history @en
preferred label: Estlands historia @sv
related: URN:NBN:fi:au:hklj:411
related: Baltian maat
related: Viro
related: URN:NBN:fi:au:hklj:909
related: URN:NBN:fi:au:hklj:919
related: Venäjän historia
related: Neuvostoliiton historia 1917-1991

Latvian historia
type: Class
type: Concept
subclass of: Baltian maiden historia
alternative label: Latvia, historia (973.3)
alternative label: Lettland, historia (973.3) @sv
broader: Baltian maiden historia
in scheme: URN:NBN:fi:au:hklj:
notation: 973.3
preferred label: Latvia's history @en
preferred label: Lettlands historia @sv
related: URN:NBN:fi:au:hklj:411
related: Baltian maat
related: Latvia
related: URN:NBN:fi:au:hklj:909
related: URN:NBN:fi:au:hklj:919
related: Venäjän historia
related: Neuvostoliiton historia 1917-1991

Liettuan historia
type: Class
type: Concept
subclass of: Baltian maiden historia
alternative label: Liettua, historia (973.4)
alternative label: Litauen, historia (973.4) @sv
broader: Baltian maiden historia
in scheme: URN:NBN:fi:au:hklj:
notation: 973.4
preferred label: Lithuania's history @en
preferred label: Litauens historia @sv
related: URN:NBN:fi:au:hklj:411
related: Baltian maat
related: Liettua
related: URN:NBN:fi:au:hklj:909
related: URN:NBN:fi:au:hklj:919
related: Venäjän historia
related: Neuvostoliiton historia 1917-1991

Israelin ja Palestiinan historia
type: Class
type: Concept
subclass of: Etu-Aasian historia
alternative label: Israel, historia (981.11)
alternative label: Jerusalem, Israelin nykyhistoria (981.11)
alternative label: Juutalaiset, historia, Israel (981.11)
alternative label: Palestiina, historia (981.11)
alternative label: Jerusalem, Israels nutidshistoria (981.11) @sv
alternative label: Judar, historia, Israel (981.11) @sv
alternative label: Palestina, historia (981.11) @sv
broader: Etu-Aasian historia
in scheme: URN:NBN:fi:au:hklj:
notation: 981.11
preferred label: Israel's and Palestine's history @en
preferred label: Israels och Palestinas historia @sv
related: Juutalaisten uskonto ja sen mytologia
related: Juutalaisten asema. Antisemitismi
related: URN:NBN:fi:au:hklj:323.209
related: AASIA
related: Etu-Aasia
related: Israel. Palestiina
related: Egyptin ja Etu-Aasian muinaishistoria ja arkeologia
scope note: Eri maiden ja alueiden juutalaisten historia ko. maan tai alueen luokassa
scope note: Judarnas historia inom olika geografiska områden förs till klassen för landet eller det geografiska området @sv

Kirjallisuustiede. Kielitiede
type: Class
type: Concept
subclass of: Erikoisalojen bibliografiat
broader: Erikoisalojen bibliografiat
in scheme: URN:NBN:fi:au:hklj:
notation: 015.8
preferred label: Literature. Linguistics @en
preferred label: Litteraturvetenskap. Språkvetenskap @sv
related: Valikoimaluettelot
related: Lasten- ja nuortenkirjallisuuden luettelot
related: Yleisbibliografiat. Kansallisbibliografiat
related: Suomi
related: Kirjastojen luettelot
related: Kustantajien ja kirjakauppojen luettelot
scope note: Bibliografiset julkaisut, jotka koskevat pääluokan 800 erikoisaloja, kuten kirjallisuudenhistoriaa, kirjallisuudentutkimusta tai kielitiedettä
scope note: Bibliografier över specialområden som hör till huvudklass 800, såsom litteraturhistoria, litteraturforskning eller språkvetenskap @sv

Kirjastojen tehtävä ja tarkoitus
type: Class
type: Concept
subclass of: KIRJASTOT. KIRJASTOTOIMI
alternative label: Henkinen pääoma, kirjastotoimi (020.1)
alternative label: Inhimillinen pääoma, kirjastotoimi (020.1)
alternative label: Osaamispääoma, kirjastotoimi (020.1)
alternative label: Humankapital, biblioteksverksamhet (020.1) @sv
alternative label: Mänskligt kapital, biblioteksverksamhet (020.1) @sv
broader: KIRJASTOT. KIRJASTOTOIMI
in scheme: URN:NBN:fi:au:hklj:
notation: 020.1
preferred label: Libraries' tasks and objectives @en
preferred label: Bibliotekens uppgifter och syfte @sv
related: URN:NBN:fi:au:hklj:018
related: URN:NBN:fi:au:hklj:060
related: Dokumentaatio ja informaatiopalvelu yleensä
related: Museonhoito
related: Arkistonhoito
related: URN:NBN:fi:au:hklj:061
related: URN:NBN:fi:au:hklj:063
related: Kirjallisuuden psykologia ja sosiologia
scope note: Kirjaston ja kirjastolaitoksen asema yhteiskunnassa ja kulttuurissa Kirjaston ja kirjastolaitoksen merkitys yhteiskunnalle ja kulttuurille
scope note: Bibliotekens och biblioteksinstitutionernas ställning i samhället och kulturen Bibliotekens och biblioteksinstitutionernas betydelse för samhället och kulturen @sv

YLEISET KOKOOMATEOKSET
type: Class
type: Concept
subclass of: KIRJA-ALA
alternative label: Aikakauslehtiartikkelit, kokoomateokset (040 ... 041)
alternative label: Albumit (040 ... 041)
alternative label: Albumit, sekasisältöiset kokoomateokset (040 ... 041)
alternative label: Antologiat (040 ... 041)
alternative label: Antologiat, esseet, artikkelit (040 ... 041)
alternative label: Artikkelikokoelmat (040 ... 041)
alternative label: Artikkelit, lehtiartikkelit (040 ... 041)
alternative label: Esitelmät, sekasisältöiset kokoelmat (040 ... 041)
alternative label: Esseet, sekasisältöiset kokoelmat (040 ... 041)
alternative label: Hautauspuheet (040 ... 041)
alternative label: Juhlajulkaisut (040 ... 041)
alternative label: Juhlapuheet, puhekokoelmat (040 ... 041)
alternative label: Julkaisut, yleiset kokoomateokset (040 ... 041)
alternative label: Kirjasarjat, tietokirjallisuus (040 ... 041)
alternative label: Kokoomateokset (040 ... 041)
alternative label: Kokoomateokset, tietokirjallisuus (040 ... 041)
alternative label: Kolumnit (040 ... 041)
alternative label: Kolumnit, esseet (040 ... 041)
alternative label: Kootut teokset (040 ... 041)
alternative label: Kootut teokset, tietokirjallisuus (040 ... 041)
alternative label: Kuvastot (040 ... 041)
alternative label: Kuvateokset (040 ... 041)
alternative label: Lehtiartikkelit (040 ... 041)
alternative label: Leikekokoelmat (040 ... 041)
alternative label: Luennot (040 ... 041)
alternative label: Maaseutukirjeet, lehtiartikkelit (040 ... 041)
alternative label: Muistokirjat (040 ... 041)
alternative label: Puheet (040 ... 041)
alternative label: Puheet, puhekokoelmat (040 ... 041)
alternative label: Sanomalehtiartikkelit, sekasisältöiset kokoelmat (040 ... 041)
alternative label: Seminaariesitelmät, esitelmät (040 ... 041)
alternative label: Valikoimateokset (040 ... 041)
alternative label: Valikoimateokset, tietokirjallisuus (040 ... 041)
alternative label: Valitut teokset (040 ... 041)
alternative label: Valitut teokset, tietokirjallisuus (040 ... 041)
alternative label: Album (040 ... 041) @sv
alternative label: Album, samlingsverk med blandat innehåll (040 ... 041) @sv
alternative label: Antologier (040 ... 041) @sv
alternative label: Antologier, essäer, artiklar (040 ... 041) @sv
alternative label: Artikelsamlingar (040 ... 041) @sv
alternative label: Artiklar, tidningsartiklar (040 ... 041) @sv
alternative label: Bildverk (040 ... 041) @sv
alternative label: Bokserier, facklitteratur (040 ... 041) @sv
alternative label: Essäer, samlingar med blandat innehåll (040 ... 041) @sv
alternative label: Festskrifter (040 ... 041) @sv
alternative label: Festtal, talsamlingar (040 ... 041) @sv
alternative label: Föredrag, samlingar med blandat innehåll (040 ... 041) @sv
alternative label: Föreläsningar (040 ... 041) @sv
alternative label: Griftetal (040 ... 041) @sv
alternative label: Kolumner (040 ... 041) @sv
alternative label: Kolumner, essäer (040 ... 041) @sv
alternative label: Landsbygdsbrev, tidningsartiklar (040 ... 041) @sv
alternative label: Minnesalbum (040 ... 041) @sv
alternative label: Planschverk (040 ... 041) @sv
alternative label: Publikationer, allmänna samlingsverk (040 ... 041) @sv
alternative label: Samlade verk (040 ... 041) @sv
alternative label: Samlade verk, facklitteratur (040 ... 041) @sv
alternative label: Samlingsverk (040 ... 041) @sv
alternative label: Samlingsverk, facklitteratur (040 ... 041) @sv
alternative label: Seminarieföredrag, föredrag (040 ... 041) @sv
alternative label: Tal, föredrag (040 ... 041) @sv
alternative label: Tal, föredrag, talsamlingar (040 ... 041) @sv
alternative label: Tidningsartiklar, samlingar med blandat innehåll (040 ... 041) @sv
alternative label: Tidskriftsartiklar, samlingsverk (040 ... 041) @sv
alternative label: Urklippssamlingar (040 ... 041) @sv
broader: KIRJA-ALA
in scheme: URN:NBN:fi:au:hklj:
narrower: Suomi
notation: 040
related: Johdatukset tieteisiin
related: YLEISET TIETOSANAKIRJAT
related: YLEISET KAUSIJULKAISUT
related: SANOMALEHDET
related: URN:NBN:fi:au:hklj:1
related: Mietelausekokoelmat. Sitaattikokoelmat
scope note: Aineistotyypistä riippumatta yleis- ja sekasisältöiset kokoomateokset ja juhlakirjat sekä yleiset ja sekasisältöiset essee-, artikkeli-, luento-, esitelmä- ja puhekokoelmat Tässä myös sekasisältöiset kokoomateokset, joissa on sekä kauno- että tietokirjallisia tekstejä Erikoisalojen kokoomateokset, esseekokoelmat, juhlakirjat ym. alan mukaisessa luokassa
scope note: Hit samlingsverk och festskrifter med allmänt eller blandat innehåll samt samlingar som innehåller essäer, artiklar, föreläsningar, föredrag och tal med allmänt eller blandat innehåll oavsett mediatyp Hit också samlingsverk med blandat innehåll som innehåller både skönlitterära texter och facktexter Samlingsverk som rör specialområden klassificeras enligt område @sv

Esseet
type: Class
type: Concept
subclass of: URN:NBN:fi:au:hklj:100
broader: URN:NBN:fi:au:hklj:100
in scheme: URN:NBN:fi:au:hklj:
notation: 104
preferred label: Essays @en
preferred label: Essäer @sv
related: Filosofian historia
related: Itämainen filosofia
related: Vanhan ajan filosofia
related: Keskiajan filosofia
related: Renessanssin ja uuden ajan filosofia
related: Uusimman ajan filosofia
related: Nykyajan filosofia
related: Suomi
scope note: Filosofian yleiset esseet ja esseekokoelmat Filosofian erikoisalojen esseet ja esseekokoelmat alan mukaisessa luokassa
scope note: Allmänna essäer och essäsamlingar i filosofi Essäer och essäsamlingar i specialområden inom filosofin klassificeras enligt område @sv

Ajattelu. Älykkyys. Mielikuvitus
type: Class
type: Concept
subclass of: Psyyken rakenne ja toiminnot
alternative label: Ajatteleminen, psykologia (121.1)
alternative label: Ajattelu, psykologia (121.1)
alternative label: Arvostelukyky, psykologia (121.1)
alternative label: Assosiaatio, älykkyyden psykologia (121.1)
alternative label: Erikoislahjakkuus, psykologia (121.1)
alternative label: Fantasia, psykologia (121.1)
alternative label: Fyysinen älykkyys (121.1)
alternative label: Intuitio, psykologia (121.1)
alternative label: Järki, psykologia (121.1)
alternative label: Kyvykkyys, ajattelu ja älykkyys (121.1)
alternative label: Mielikuvat, psykologia (121.1)
alternative label: Mielikuvitus, psykologia (121.1)
alternative label: Mielteet, psykologia (121.1)
alternative label: Neurolingvistiikka, psykologia (121.1)
alternative label: Ratio, psykologia (121.1)
alternative label: Tarkoitusperäisyys, älykkyyden ja ajattelun psykologia (121.1)
alternative label: Testit, älykkyystestit (121.1)
alternative label: Tunne-elämä, tunneäly (121.1)
alternative label: Tunneäly (121.1)
alternative label: Tunteet, tunneäly (121.1)
alternative label: Tyhmyys (121.1)
alternative label: Ymmärtäminen, ajattelun psykologia (121.1)
alternative label: Ympäristötekijät, älykkyyden psykologia (121.1)
alternative label: Älykkyys, psykologia (121.1)
alternative label: Älykkyysosamäärä (121.1)
alternative label: Älykkyystestit (121.1)
alternative label: Association, intelligensens psykologi (121.1) @sv
alternative label: Dumhet (121.1) @sv
alternative label: Emotionell intelligens (121.1) @sv
alternative label: Fantasi, psykologi (121.1) @sv
alternative label: Fantasy, psykologi (121.1) @sv
alternative label: Föreställningar, uppfattningar, psykologi (121.1) @sv
alternative label: Förmåga, tänkande och intelligens (121.1) @sv
alternative label: Förnimmelser, psykologi (121.1) @sv
alternative label: Förnuft, psykologi (121.1) @sv
alternative label: Förståelse, tänkandets psykologi (121.1) @sv
alternative label: Intelligens, psykologi (121.1) @sv
alternative label: Intelligenskvot (121.1) @sv
alternative label: Intelligenstest (121.1) @sv
alternative label: Intuition, psykologi (121.1) @sv
alternative label: Kroppslig intelligens (121.1) @sv
alternative label: Känsloliv, emotionell intelligens (121.1) @sv
alternative label: Känslor, emotionell intelligens (121.1) @sv
alternative label: Miljöfaktorer, intelligensens psykologi (121.1) @sv
alternative label: Målinriktning, intelligensens och tänkandets psykologi (121.1) @sv
alternative label: Neurolingvistik, psykologi (121.1) @sv
alternative label: Omdömesförmåga, psykologi (121.1) @sv
alternative label: Ratio, psykologi (121.1) @sv
alternative label: Specialbegåvning, psykologi (121.1) @sv
alternative label: Test, intelligenstest (121.1) @sv
alternative label: Tänkande, psykologi (121.1) @sv
broader: Psyyken rakenne ja toiminnot
in scheme: URN:NBN:fi:au:hklj:
notation: 121.1
preferred label: Thought. Intelligence. Imagination @en
preferred label: Tänkande. Intelligens. Fantasi @sv
related: Oppimisen psykologia
related: Kokeellinen psykologia. Psykometriikka
related: Psykologian suunnat
related: Differentiaalipsykologia. Persoonallisuuden psykologia
related: Lapsuuden ja nuoruuden psykologia
related: Muita psykologian aloja
related: Kehityspsykologia. Eri ikäkausien psykologia
related: Kasvatuspsykologia
scope note: Ajattelu, älykkyys, intuitio, mieltäminen, arvostelukyky ja mielikuvitus psykologian kannalta Älykkyystestit. Älykkyysosamäärä Jos teoksessa on sekä ajattelun tai älykkyyden että luovuuden tai lahjakkuuden psykologiaa, on etusija luokalla 126
scope note: Tänkande, intelligens, intuition, uppfattningsförmåga, omdömesförmåga och fantasi ur psykologisk synvinkel Intelligenstest. Intelligenskvot Om arbetet rör såväl tänkande och intelligens som kreativitet och begåvning ur psykologisk synvinkel, ges företräde åt klass 126 @sv

Naisen ja miehen psykologia
type: Class
type: Concept
subclass of: Muita psykologian aloja
alternative label: Aviomiehet, miehen psykologia (128.5)
alternative label: Avioparit, naisen ja miehen psykologia (128.5)
alternative label: Aviopuolisot, naisen ja miehen psykologia (128.5)
alternative label: Aviovaimot, naisen psykologia (128.5)
alternative label: Avoparit, naisen ja miehen psykologia (128.5)
alternative label: Avopuolisot, naisen ja miehen psykologia (128.5)
alternative label: Elämänodotukset, naisen ja miehen psykologia (128.5)
alternative label: Emotionaalinen kehitys, mieheksi kehitt. psykologia (128.5)
alternative label: Emotionaalinen kehitys, naiseksi kehitt. psykologia (128.5)
alternative label: Erot, naisen ja miehen psykologia (128.5)
alternative label: Feminiinisyys, psykologia (128.5)
alternative label: Gender-tutkimus, naisen ja miehen psykologia (128.5)
alternative label: Ihmistuntemus, naisen ja miehen psykologia (128.5)
alternative label: Isyys, miehen psykologia (128.5)
alternative label: Isät, sukupuolten psykologia (128.5)
alternative label: Kaveruus, sukupuolten psykologia (128.5)
alternative label: Kehonkaava, sukupuolten psykologia (128.5)
alternative label: Keski-ikä, naisen ja miehen psykologia (128.5)
alternative label: Maskuliinisuus, sukupuolten psykologia (128.5)
alternative label: Miehekkyys, sukupuolten psykologia (128.5)
alternative label: Miehet, psykologia (128.5)
alternative label: Mieheys, sukupuolten psykologia (128.5)
alternative label: Miehisyys, sukupuolten psykologia (128.5)
alternative label: Mieskuva, miehen psykologia (128.5)
alternative label: Miestutkimus, miehen psykologia (128.5)
alternative label: Miesviha, naisen ja miehen psykologia (128.5)
alternative label: Misandria, naisen ja miehen psykologia (128.5)
alternative label: Misogynia, naisen ja miehen psykologia (128.5)
alternative label: Naisellisuus, psykologia (128.5)
alternative label: Naiset, psykologia (128.5)
alternative label: Naiseus, psykologia (128.5)
alternative label: Naiskuva, naisen psykologia (128.5)
alternative label: Naiskäsitys, naisen psykologia (128.5)
alternative label: Naistutkimus, naisen psykologia (128.5)
alternative label: Naisviha, naisen ja miehen psykologia (128.5)
alternative label: Pojat, isä-poika -suhde (128.5)
alternative label: Pojat, miehen psykologia (128.5)
alternative label: Pojat, psykologia (128.5)
alternative label: Psykologia, sukupuolten psykologia (128.5)
alternative label: Puolisot, naisen ja miehen psykologia (128.5)
alternative label: Queer-tutkimus, naisen ja miehen psykologia (128.5)
alternative label: Roolimallit, naisen ja miehen psykologia (128.5)
alternative label: Ruumiinkuva, sukupuolten psykologia (128.5)
alternative label: Seksuaalinen identiteetti, naisen ja miehen psykologia (128.5)
alternative label: Sukupuoli, naisen ja miehen psykologia (128.5)
alternative label: Sukupuoli-identiteetti, naisen ja miehen psykologia (128.5)
alternative label: Sukupuolierot, naisen ja miehen psykologia (128.5)
alternative label: Sukupuoliroolit, naisen ja miehen psykologia (128.5)
alternative label: Sukupuolitutkimus, naisen ja miehen psykologia (128.5)
alternative label: Sukupuolten psykologia (128.5)
alternative label: Tunne-elämän kehitys, mieheksi kehittymisen psykologia (128.5)
alternative label: Tunne-elämän kehitys, naiseksi kehittymisen psykologia (128.5)
alternative label: Tyttäret, naisen psykologia (128.5)
alternative label: Tyttäret, äiti-tytär -suhde (128.5)
alternative label: Tyttöys, naisen psykologia (128.5)
alternative label: Tyttöys, äiti-tytär -suhde (128.5)
alternative label: Tytöt, naisen psykologia (128.5)
alternative label: Tytöt, äiti-tytär -suhde (128.5)
alternative label: Vaimot, naisen psykologia (128.5)
alternative label: Ystävyys, sukupuolten psykologia (128.5)
alternative label: Ystävät, sukupuolten psykologia (128.5)
alternative label: Äidit, sukupuolten psykologia (128.5)
alternative label: Äitiys, naisen psykologia (128.5)
alternative label: Döttrar, kvinnans psykologi (128.5) @sv
broader: Muita psykologian aloja
in scheme: URN:NBN:fi:au:hklj:
notation: 128.5
related: Differentiaalipsykologia. Persoonallisuuden psykologia
related: Psychology of expression {@en
related: Lapsuuden ja nuoruuden psykologia
related: Ihmissuhteiden psykologia
related: Kehityspsykologia. Eri ikäkausien psykologia
related: Perhesosiologia
related: Naisen ja miehen asema yhteiskunnassa
related: Seksologia
scope note: Naisen ja miehen psyykkiset ominaisuudet Naisen ja miehen psyykkinen kehitys Naiseksi tai mieheksi kehittymisen psykologia
scope note: Kvinnans och mannens psykiska egenskaper Kvinnans och mannens psykiska utveckling Att utvecklas till kvinna eller man ur psykologisk synvinkel @sv

ETIIKKA. ESTETIIKKA
type: Class
type: Concept
subclass of: URN:NBN:fi:au:hklj:100
broader: URN:NBN:fi:au:hklj:100
in scheme: URN:NBN:fi:au:hklj:
narrower: Etiikka. Moraalifilosofia
narrower: Yleinen estetiikka
notation: 160
preferred label: ETHICS. AESTHETICS @en
preferred label: ETIK. ESTETIK @sv
related: Filosofian historia
related: Elämänfilosofia
related: Elämänohjeet
related: Itsemurhat ja niiden ehkäisy
scope note: Teokset, joissa on sekä yleistä etiikkaa että estetiikkaa
scope note: Verk som innehåller både allmän etik och estetik @sv

Elämänfilosofia
type: Class
type: Concept
subclass of: ELÄMÄNFILOSOFIA. KULTTUURIFILOSOFIA
alternative label: Alastomuus, elämänfilosofia (172)
alternative label: Anakoreetit, elämänfilosofia (172)
alternative label: Arvot, elämänfilosofia (172)
alternative label: Arvottaminen, elämänfilosofia (172)
alternative label: Askeesi, elämänfilosofia (172)
alternative label: Common sense, elämänfilosofia (172)
alternative label: Elämän tarkoitus, elämänfilosofia (172)
alternative label: Elämänfilosofia (172)
alternative label: Elämänkatsomus (172)
alternative label: Elämänkatsomustieto (172)
alternative label: Elämänlaatu, elämänfilosofia (172)
alternative label: Elämäntarkoitus, elämänfilosofia (172)
alternative label: Epäily, elämänfilosofia (172)
alternative label: Epäonnistuminen, elämänfilosofia (172)
alternative label: Erakot, elämänfilosofia (172)
alternative label: Erehdys, elämänfilosofia (172)
alternative label: Eremiitit, elämänfilosofia (172)
alternative label: Esimerkillisyys, elämänfilosofia (172)
alternative label: Eskapismi, elämänfilosofia (172)
alternative label: Fatalismi, elämänfilosofia (172)
alternative label: Filantropia, elämänfilosofia (172)
alternative label: Filosofia, elämänfilosofia (172)
alternative label: Filosofia, maailmankatsomusfilosofia (172)
alternative label: Henkinen kasvu, elämänfilosofia (172)
alternative label: Henkisyys, elämänfilosofia (172)
alternative label: Humanismi, elämänfilosofia (172)
alternative label: Huolestuneisuus, elämänfilosofia (172)
alternative label: Hyvä elämä, elämänfilosofia (172)
alternative label: Ihmisarvo, elämänfilosofia (172)
alternative label: Ihmiskuva, maailmankatsomusfilosofia (172)
alternative label: Ilo, elämänfilosofia (172)
alternative label: Individualismi, elämänfilosofia (172)
alternative label: Intohimo, elämänfilosofia (172)
alternative label: Irrationaalisuus, elämänfilosfia (172)
alternative label: Järki, elämänfilosofia (172)
alternative label: Kaveruus, elämänfilosofia (172)
alternative label: Kiitollisuus, elämänfilosofia (172)
alternative label: Kohtalousko, elämänfilosofia (172)
alternative label: Kohtuus, elämänfilosofia (172)
alternative label: Kosmopoliittisuus, elämänfilosofia (172)
alternative label: Kriittisyys, elämänfilosofia (172)
alternative label: Kutsumus, elämänfilosofia (172)
alternative label: Kyseenalaistaminen, elämänfilosofia (172)
alternative label: Käytännöllinen filosofia, elämänfilosofia (172)
alternative label: Liberaalisuus, elämänfilosofia (172)
alternative label: Maailmankansalaisuus, elämänfilosofia (172)
alternative label: Maailmankatsomus (172)
alternative label: Maailmankatsomusfilosofia (172)
alternative label: Maailmankuva (172)
alternative label: Mielekkyys, elämänfilosofia (172)
alternative label: Monitoimisuus, elämänfilosofia (172)
alternative label: Myönteinen ajattelu, elämänfilosofia (172)
alternative label: Myönteisyys, elämänfilosofia (172)
alternative label: Myötätunto, elämänfilosofia (172)
alternative label: Negatiivisuus, elämänfilosofia (172)
alternative label: Nudismi, elämänfilosofia (172)
alternative label: Oikeustaju, elämänfilosofia (172)
alternative label: Onnellisuus, elämänfilosofia (172)
alternative label: Onni, elämänfilosofia (172)
alternative label: Onnistuminen, elämänfilosofia (172)
alternative label: Optimismi, elämänfilosofia (172)
alternative label: Perusturvallisuus, elämänfilosofia (172)
alternative label: Pessimismi, elämänfilosofia (172)
alternative label: Pettymys, elämänfilosofia (172)
alternative label: Positiivisuus, elämänfilosofia (172)
broader: ELÄMÄNFILOSOFIA. KULTTUURIFILOSOFIA
in scheme: URN:NBN:fi:au:hklj:
notation: 172
related: Oppikirjat. Johdatukset filosofiaan
related: Opinnot
related: Uskonto- ja maailmankatsomuspsykologia
related: ETIIKKA. ESTETIIKKA
related: Etiikka. Moraalifilosofia
related: Elämänohjeet
related: URN:NBN:fi:au:hklj:618.24
scope note: Elämänkatsomus- ja maailmankatsomusfilosofia Elämänkatsomustieto. Elämänkatsomustiedon oppikirjat Optimismi ja pessimismi elämänfilosofian kannalta
scope note: Livsåskådnings- och världsåskådningsfilosofi Livsåskådningskunskap. Vägledningar i livsåskådningskunskap Optimism och pessimism ur livsfilosofins synvinkel @sv

Kristinuskon filosofia
type: Class
type: Concept
subclass of: URN:NBN:fi:au:hklj:210
alternative label: Epäily, kristinuskon filosofia (211)
alternative label: Esoterismi, kristillinen uskonnonfilosofia (211)
alternative label: Hengellisyys, kristillinen uskonnonfilosofia (211)
alternative label: Kristillisyys, kristinuskon filosofia (211)
alternative label: Mielekkyys, kristinuskon filosofia (211)
alternative label: Mielihyvä, kristinuskon filosofia (211)
alternative label: Pyhitys, kristinuskon filosofia (211)
alternative label: Pyhyys, kristinuskon filosofia (211)
alternative label: Pyhä, kristinuskon filosofia (211)
alternative label: Uskonnollisuus, kristillinen uskonnonfilosofia (211)
alternative label: Uskonnonfilosofia, kristinuskon filosofia (211)
alternative label: Varmuus, kristinuskon filosofia (211)
alternative label: Andlighet, religion, kristlig religionsfilosofi (211) @sv
alternative label: Esoterism, kristen religionsfilosofi (211) @sv
alternative label: Helg, kristendomens filosofi (211) @sv
alternative label: Helgande, kristendomens filosofi (211) @sv
alternative label: Helighet, kristendomens filosofi (211) @sv
alternative label: Kristlighet, kristendomens filosofi (211) @sv
alternative label: Meningsfullhet, kristendomens filosofi (211) @sv
alternative label: Religionsfilosofi, kristendomens filosofi (211) @sv
alternative label: Religiositet, kristlig religionsfilosofi (211) @sv
alternative label: Säkerhet, förvissning, kristendomens filosofi (211) @sv
alternative label: Tvivel, kristendomens filosofi (211) @sv
alternative label: Vällust, kristendomens filosofi (211) @sv
broader: URN:NBN:fi:au:hklj:210
in scheme: URN:NBN:fi:au:hklj:
notation: 211
preferred label: Christian philosophy @en
preferred label: Kristendomens filosofi @sv
related: Keskiajan filosofia
related: URN:NBN:fi:au:hklj:110
related: Uskonto- ja maailmankatsomuspsykologia
related: Uskonnonfilosofia
related: Elämä. Kuolema
related: Luominen. Kehitys
related: Uskonto ja valtio
related: KRISTILLINEN DOGMATIIKKA
scope note: Kristinuskon tai kristillisen teologian yleinen filosofia Kristillinen uskonnonfilosofia yleensä Kristinuskon tai kristillisen teologian erikoiskysymyksiä koskevat filosofiset teokset alan mukaisessa luokassa
scope note: Kristendomens eller den kristna teologins allmänna filosofi Kristen religionsfilosofi i allmänhet Filosofiska verk som rör specialfrågor inom kristendom eller kristen teologi klassificeras enligt område @sv

Väestötiede. Väestöpolitiikka
type: Class
type: Concept
subclass of: Väestötilasto. Sosiaalitilasto
alternative label: Aikuiset lapset, väestötiede (312.1)
alternative label: Ammatillinen jakautuminen, väestötiede (312.1)
alternative label: Ammatinharjoittajat, väestötiede (312.1)
alternative label: Ammatissa toimimaton väestö, väestötiede (312.1)
alternative label: Ammatissa toimiva väestö, väestötiede (312.1)
alternative label: Ammattirakenne, väestötiede (312.1)
alternative label: Asuntokunnat, väestötiede (312.1)
alternative label: Avioituvuus, väestötiede (312.1)
alternative label: Demografia (312.1)
alternative label: Diginatiivit, digitaalinen kulttuuri, ikäryhmät, väestötiede (312.1)
alternative label: Elinaika, väestötiede (312.1)
alternative label: Elinajanodote, väestötiede (312.1)
alternative label: Elinikä, väestötiede (312.1)
alternative label: Elämänaika, väestötiede (312.1)
alternative label: Etniset suhteet, väestötiede (312.1)
alternative label: Hasardit, väestönkasvu (312.1)
alternative label: Henkikirjat, väestötiede (312.1)
alternative label: Ihmiset, väestötiede (312.1)
alternative label: Ihmismaantiede, väestömaantiede (312.1)
alternative label: Ikäluokat, väestötiede (312.1)
alternative label: Ikärakenne, väestötiede (312.1)
alternative label: Ikäryhmät, väestötiede (312.1)
alternative label: Kantaväestö, väestötiede (312.1)
alternative label: Kaupunkiväestö, väestötiede (312.1)
alternative label: Kotitaloudet, väestötiede (312.1)
alternative label: Kuolemansyyt, väestötiede (312.1)
alternative label: Kuolevuus, väestötiede (312.1)
alternative label: Kuolinsyyt, väestötiede (312.1)
alternative label: Kuolleisuus, väestötiede (312.1)
alternative label: Lapsikuolleisuus, väestötiede (312.1)
alternative label: Lapsiluku, väestötiede (312.1)
alternative label: Liikakansoitus (312.1)
alternative label: Liikakansoitus, väestötiede (312.1)
alternative label: Lisääntyminen, väestötiede (312.1)
alternative label: Lisääntymisoikeudet, väestöpolitiikka (312.1)
alternative label: Lähtömaa, väestötiede (312.1)
alternative label: Maahanmuutto, väestötiede (312.1)
alternative label: Maalaiset, väestötiede (312.1)
alternative label: Maallemuuttajat, väestötiede (312.1)
alternative label: Maallemuutto, väestötiede (312.1)
alternative label: Maaltamuuttajat, väestötiede (312.1)
alternative label: Maaltamuutto, väestötiede (312.1)
alternative label: Maaltapako, väestötiede (312.1)
alternative label: Maantiede, väestömaantiede (312.1)
alternative label: Maaseutuväestö, väestötiede (312.1)
alternative label: Maassamuutto, väestötiede (312.1)
alternative label: Maastamuutto, väestötiede (312.1)
alternative label: Miesvaltaisuus, väestötilastot (312.1)
alternative label: Muuttoliike, väestötiede (312.1)
alternative label: Naisvaltaisuus, väestötilastot (312.1)
alternative label: Perheet, väestötiede (312.1)
alternative label: Perhepolitiikka, väestöpolitiikka (312.1)
alternative label: Perhesuunnittelu, väestöpolitiikka (312.1)
alternative label: Perhetutkimus, väestötiede (312.1)
alternative label: Populaatiot, väestötiede (312.1)
alternative label: Ruokakunnat, väestötiede (312.1)
alternative label: Siirtolaisuus, väestötiede (312.1)
alternative label: Sisäinen muuttoliike, väestötiede (312.1)
alternative label: Sosiodemografiset tekijät, demografia (312.1)
alternative label: Sosioekonominen asema, väestötiede (312.1)
alternative label: Sosioekonomiset tekijät, väestötiede (312.1)
alternative label: Sukupolvet, väestötiede (312.1)
alternative label: Sukupuolijakauma, väestötiede (312.1)
alternative label: Sukupuolirakenne, väestötiede (312.1)
broader: Väestötilasto. Sosiaalitilasto
in scheme: URN:NBN:fi:au:hklj:
notation: 312.1
related: URN:NBN:fi:au:hklj:312.109
related: Alueellinen sosiologia. Maassamuutto
related: Perhepolitiikka. Lapsipolitiikka. Nuorisopolitiikka
related: Lastenneuvolat. Äitiysneuvolat
related: Päivähoito
related: Siirtolaisuus
related: URN:NBN:fi:au:hklj:400
related: Yleinen aluemaantiede. Yleinen kulttuurimaantiede. Yleinen poliittinen maantiede
scope note: Väestöntutkimus. Demografia. Väestönlaskennat Biologinen, sosiaalinen ja taloudellinen väestötiede Syntyvyys. Kuolleisuus. Väestönmuutokset. Väestöennusteet Väestön rakenne ja jakautuminen. Väestötiheys. Väestömaantiede Ikä- ja sukupuolijakautumat. Taloudellis-sosiaaliset jakautumat Muuttoliikkeet väestötieteen ja -politiikan kannalta Perhesuunnittelu ja syntyvyyden säännöstely väestöpolitiikan kannalta
scope note: Befolkningsundersökningar. Demografi. Folkräkningar Biologisk, social och ekonomisk demografi Nativitet. Dödlighet. Befolkningsförändringar. Befolkningsprognos Befolkningsstruktur och befolkningsindelning. Befolkningstäthet. Demografisk geografi Fördelning enligt ålder och kön. Socioekonomisk fördelning Migration ur demografisk och befolkningspolitisk synvinkel Familjeplanering och barnbegränsning ur befolkningspolitisk synvinkel @sv

Palo- ja pelastustoimi
type: Class
type: Concept
subclass of: URN:NBN:fi:au:hklj:340
alternative label: Alkusammutusvälineet (343)
alternative label: Aluehälytyskeskukset (343)
alternative label: Automaattiset turvalaitteet, palo- ja pelastustoimi (343)
alternative label: Ehkäisevä palontorjunta (343)
alternative label: Eläinpelastus, palo- ja pelastustoimi (343)
alternative label: Evakuointi, palo-ja pelastustoimi (343)
alternative label: Hälyttimet, palohälyttimet (343)
alternative label: Hälytykset (343)
alternative label: Hälytykset, palohälytykset (343)
alternative label: Hälytysajoneuvot, palo-ja pelastustoimi (343)
alternative label: Hälytysjärjestelmät (343)
alternative label: Hälytyskeskukset (343)
alternative label: Hätäilmoitukset (343)
alternative label: Hätäkeskukset (343)
alternative label: Hätälähettimet (343)
alternative label: Hätäpuhelimet, palo-ja pelastustoimi (343)
alternative label: Hätäraketit, käyttö (343)
alternative label: Ilmaisimet, hälyttimet (343)
alternative label: Itsesyttyminen, paloturvallisuus (343)
alternative label: Jauhesammuttimet (343)
alternative label: Kunnalliset palokunnat (343)
alternative label: Kypärät, palo- ja pelastustoimi (343)
alternative label: Käsisammuttimet (343)
alternative label: Leimahduspiste, paloturvallisuus (343)
alternative label: Maastopalot (343)
alternative label: Meripelastus (343)
alternative label: Noki, paloturvallisuus (343)
alternative label: Onnettomuudet, räjähdysonnettomuudet (343)
alternative label: Onnettomuudet, tulipalot (343)
alternative label: Palavat nesteet, paloturvallisuus (343)
alternative label: Paloasemat, palotoimi (343)
alternative label: Paloautot, palotoimi (343)
alternative label: Palohälyttimet (343)
alternative label: Palohälytyslaitteet (343)
alternative label: Paloilmaisimet (343)
alternative label: Paloilmoittimet (343)
alternative label: Paloilmoituskeskukset (343)
alternative label: Paloilmoituslaitteistot (343)
alternative label: Palokalusto (343)
alternative label: Palokunnat (343)
alternative label: Paloluokitukset (343)
alternative label: Palomiehet, palomiehen työ (343)
alternative label: Palonehkäisy (343)
alternative label: Palonestoaineet, palontorjunta (343)
alternative label: Palonkestävyys (343)
alternative label: Palontorjunta (343)
alternative label: Palontutkinta (343)
alternative label: Palosammuttimet (343)
alternative label: Palosuoja-aineet, ehkäisevä palontorjunta (343)
alternative label: Palosuojaus (343)
alternative label: Palosuojelu (343)
alternative label: Palotarkastus (343)
alternative label: Palotoimi (343)
alternative label: Paloturvallisuus (343)
alternative label: Palovahingot, palotoimi (343)
alternative label: Palovaroittimet (343)
alternative label: Pelastus, palo- ja pelastustoimi (343)
alternative label: Pelastusala (343)
alternative label: Pelastushenkilöstö, pelastusala (343)
alternative label: Pelastuskalusto (343)
alternative label: Pelastuslaitokset (343)
alternative label: Pelastuspalvelu (343)
alternative label: Pelastuspalvelu, palo- ja pelastustoimi (343)
alternative label: Pelastussukellus (343)
broader: URN:NBN:fi:au:hklj:340
in scheme: URN:NBN:fi:au:hklj:
notation: 343
related: URN:NBN:fi:au:hklj:332.2
related: Poliisitoimi. Yleinen turvallisuus
related: Vakuutustoimi
related: Väestönsuojelu
related: Lääkärikirjat. Ensiapuoppaat
related: URN:NBN:fi:au:hklj:613.3
related: URN:NBN:fi:au:hklj:667.71
related: Rakennuksen kunnossapito
scope note: Palo- ja pelastustoimi maasta riippumatta Palokunnat. Vapaapalokunnat. Tehdaspalokunnat. Palontorjuntatekniikka. Palosuojelu Palomiehen työ
scope note: Brand- och räddningsväsen oavsett land Brandkårer. Frivilliga brandkårer. Fabriksbrandkårer. Brandförsvarsteknik. Brandskydd Brandmännens arbete @sv

Suomen maakuntahallinto
type: Class
type: Concept
subclass of: URN:NBN:fi:au:hklj:340
alternative label: Aloitteet, hallinto, maakuntien (346)
alternative label: Alueelliset palveluyksiköt, maakuntahallinto (346)
alternative label: Aluehallinto, Suomi (346)
alternative label: Aluehallinto, maakuntien, Suomi (346)
alternative label: Alueliitokset, maakunnat, Suomi (346)
alternative label: Auevaihdot, maakunnat, Suomi (346 +)
alternative label: Esittely, maakuntahallinto (346)
alternative label: Esteellisyys, maakuntahallinto (346)
alternative label: Esteettömyys, maakuntahallinto (346)
alternative label: Esteettömyystodistukset, maakuntahallinto (346)
alternative label: Hallinnolliset palvelut, maakuntahallinto. Suomi (346)
alternative label: Hallinto, maakuntahallinto, Suomi (346)
alternative label: Hallintopalvelut, maakuntahallinto, Suomi (346)
alternative label: Hallintopäätökset, maakuntahallinto (346)
alternative label: Itsehallinto, maakunnallinen, Suomi (346)
alternative label: Julkinen hallinto, maakuntahallinto (346)
alternative label: Julkishallinto, maakuntahallinto (346)
alternative label: Julkisyhteisöt, maakunnat (346)
alternative label: Jääviys, maakuntahallinto (346)
alternative label: Keskipitkän aikavälin suunnittelu, maakunnat (346)
alternative label: Kiertokirjeet, maakuntahallinto (346)
alternative label: Konttorit, maakuntahallinto (346)
alternative label: Läpinäkyvyys, maakuntahallinto, Suomi (346)
alternative label: Maaherrat, lääninhallinto, Suomi (346)
alternative label: Maakunnalliset liitot, Suomi (346)
alternative label: Maakunnan liitot, Suomi (346)
alternative label: Maakunnat, maakuntahallinto, Suomi (346)
alternative label: Maakuntahallinto, Suomi (346)
alternative label: Maakuntaitsehallinto, Suomi (346)
alternative label: Maakuntalait, maakuntahallinto, Suomi (346)
alternative label: Maakuntaliitot, Suomi (346)
alternative label: Maakuntien liitot, Suomi (346)
alternative label: Määräaikaisuus, maakuntahallinto (346)
alternative label: Neuvostot, maakuntahallinto (346)
alternative label: Neuvottelukunnat, maakuntahallinto (346)
alternative label: Pitkän aikavälin suunnittelu, maakunnat (346)
alternative label: Poliittiset virkanimitykset, maakuntahallinto, Suomi (346)
alternative label: Päätäntävalta, maakuntahallinto (346)
alternative label: Päätökset, maakuntahallinto (346)
alternative label: Päätösvalta, maakuntahallinto (346)
alternative label: Suomi, maakuntahallinto (346)
alternative label: Suoritteet, maakuntahallinto (346)
alternative label: Sähköinen hallinto, maakuntahallinto, Suomi (346)
alternative label: Tarkastusvaliokunnat, maakuntahallinto (346)
alternative label: Toimielimet, maakuntahallinto (346)
alternative label: Toimikunnat, maakuntahallinto (346)
alternative label: Toimistot, maakuntahallinto (346)
alternative label: Toimivalta, maakuntahallinto, Suomi (346)
alternative label: Toimivaltuudet, maakuntahallinto, Suomi (346)
alternative label: Valiokunnat, maakuntahallinto (346)
alternative label: Valtaoikeudet, maakuntahallinto, Suomi (346)
alternative label: Valtuudet, maakuntahallinto, Suomi (346)
alternative label: Virallisjulkaisut, maakuntien (346)
alternative label: Virastot, maakuntahallinto (346)
alternative label: Virka-apu, maakuntahallinto (346)
alternative label: Virka-arvot, maakuntahallinto (346)
alternative label: Virkailijavaihto, maakuntahallinto (346)
alternative label: Virkakiellot, maakuntahallinto (346)
alternative label: Virkamerkit, maakuntahallinto (346)
alternative label: Virkamiesvaihto, maakuntahallinto (346)
alternative label: Virkanimikkeet, maakuntahallinto (346)
alternative label: Virkanimitykset, maakuntahallinto (346)
alternative label: Virkapuvut, maakuntahallinto (346)
alternative label: Virkasuhde, maakuntahallinto (346)
alternative label: Virkaura, maakuntahallinto (346)
alternative label: Väliportaan hallinto, Suomi (346)
alternative label: Ylennykset, maakuntahallinto (346)
alternative label: e-government, maakuntahallinto, Suomi (346)
broader: URN:NBN:fi:au:hklj:340
in scheme: URN:NBN:fi:au:hklj:
notation: 346
related: Suomen valtionhallinto
related: Muiden maiden kunnallis-, läänin- ja valtionhallinto
related: URN:NBN:fi:au:hklj:363
related: Aluepolitiikka. Ympäristöpolitiikka
scope note: Suomen maakuntahallintoa koskevat yleisteokset Väliportaan hallinto yleensä Maakuntajako. Maaherrat. Maakunnan talous yleensä Maakuntahallinnon erikoisalat alan mukaisessa luokassa
scope note: Allmänna verk som rör Finlands landskapsförvaltning Förvaltning på mellaninstansnivå i allmänhet Landskapsindelningen. Landshövdingarna. Landskapets ekonomi i allmänhet Specialområden inom landskapsförvaltningen klassificeras enligt område @sv

Tullilaitos
type: Class
type: Concept
subclass of: URN:NBN:fi:au:hklj:363
alternative label: Tullaus, tullivalvonta (363.2)
alternative label: Tullihallinto (363.2)
alternative label: Tullilaitos (363.2)
alternative label: Tullivalvonta (363.2)
alternative label: Tuontivalvonta, tullivalvonta (363.2)
alternative label: Valvonta, tullivalvonta (363.2)
alternative label: Vientivalvonta, tullivalvonta (363.2)
alternative label: Exportövervakning, tullövervakning (363.2) @sv
alternative label: Förtullning, tullövervakning (363.2) @sv
alternative label: Importövervakning, tullövervakning (363.2) @sv
alternative label: Tullförvaltning (363.2) @sv
alternative label: Tullverket (363.2) @sv
alternative label: Tullövervakning (363.2) @sv
alternative label: Övervakning, tullövervakning (363.2) @sv
broader: URN:NBN:fi:au:hklj:363
in scheme: URN:NBN:fi:au:hklj:
notation: 363.2
preferred label: Customs and Excise @en
preferred label: Tullverket @sv
related: Vero-oikeus
related: URN:NBN:fi:au:hklj:345
related: Suomen valtionhallinto
related: Suomen ulkomaankauppa
related: Maailmankauppa. Kansainväliset talousjärjestöt
related: URN:NBN:fi:au:hklj:368
related: Talouselämän kehitysilmiöt
related: Satamat. Satamatekniikka

Norja
type: Class
type: Concept
subclass of: URN:NBN:fi:au:hklj:411
alternative label: Lappi, Norjan Lappi (411.2)
alternative label: Norja (411.2 +)
alternative label: Norja, maantiede, matkat (411.2 +)
alternative label: Ruija (411.2)
alternative label: Ruija, maantiede, matkat (411.2)
alternative label: Suomalaismetsät, Norja: maantiede, matkat (411.2)
alternative label: Suomalaisseudut, Norja: maantiede, matkat (411.2)
alternative label: Tunturit, maantiede, Norja (411.2)
alternative label: Tunturivaellus, matkaoppaat, Norjan Lappi (411.2)
alternative label: Vuonot, Norjan maantiede (411.2 +)
alternative label: Finnmarken (411.2) @sv
alternative label: Finnmarken, geografi, resor (411.2) @sv
alternative label: Finnmarker, Norge: geografi, resor (411.2) @sv
alternative label: Finnskogar, Norge: geografi, resor (411.2) @sv
alternative label: Fjordar, Norges geografi (411.2 +) @sv
alternative label: Fjäll, geografi, Norge (411.2) @sv
alternative label: Fjällvandring, resehandböcker, norska Lappland (411.2) @sv
alternative label: Lappland, Norska Lappland (411.2) @sv
alternative label: Norge (411.2 +) @sv
alternative label: Norge, geografi, resor (411.2 +) @sv
broader: URN:NBN:fi:au:hklj:411
in scheme: URN:NBN:fi:au:hklj:
narrower: Oslo
notation: 411.2
preferred label: Norway @en
preferred label: Norge @sv
related: Lappi
related: Arktis, pohjoiset napamaat
related: URN:NBN:fi:au:hklj:460
related: URN:NBN:fi:au:hklj:930
related: Norjan historia
related: URN:NBN:fi:au:hklj:989

Kymenlaakso. Etelä-Karjala
type: Class
type: Concept
subclass of: Suomi
alternative label: Etelä-Karjala (412.5)
alternative label: Etelä-Karjala, maantiede, matkat (412.5)
alternative label: Karjala, Suomi (412.5 +)
alternative label: Karjala, Suomi, maantiede, matkat (412.5 +)
alternative label: Kymen lääni (412.5)
alternative label: Kymen lääni, maantiede, matkat (412.5)
alternative label: Kymenlaakso (412.5)
alternative label: Kymenlaakso, maantiede, matkat (412.5)
alternative label: Karelen, Finland (412.5 +) @sv
alternative label: Karelen, Finland, geografi, resor (412.5 +) @sv
alternative label: Kymmene län (412.5) @sv
alternative label: Kymmene län, geografi, resor (412.5) @sv
alternative label: Kymmenedalen (412.5) @sv
alternative label: Kymmenedalen, geografi, resor (412.5) @sv
alternative label: Södra Karelen (412.5) @sv
alternative label: Södra Karelen, geografi, resor (412.5) @sv
broader: Suomi
in scheme: URN:NBN:fi:au:hklj:
narrower: Menetetty Karjalan alue
notation: 412.5
preferred label: Kymmenedalen. Södra Karelen @sv
related: URN:NBN:fi:au:hklj:411
related: URN:NBN:fi:au:hklj:460
related: URN:NBN:fi:au:hklj:920
related: URN:NBN:fi:au:hklj:929
scope note: Kymen lääni Karjalaa koskevat yleisteokset
scope note: Kymmene län Allmänna verk som rör Karelen @sv

Pohjois-Pohjanmaa. Kainuu. Koillismaa
type: Class
type: Concept
subclass of: Suomi
alternative label: Kainuu (412.9)
alternative label: Kainuu, maantiede, matkat (412.9)
alternative label: Koillismaa (412.9)
alternative label: Koillismaa, maantiede, matkat (412.9)
alternative label: Oulun lääni (412.9)
alternative label: Oulun lääni, maantiede, matkat (412.9)
alternative label: Pohjalaiset, Pohjois-Pohjanmaa (412.9)
alternative label: Pohjanmaa, Pohjois-Pohjanmaa (412.9)
alternative label: Pohjois-Pohjanmaa (412.9)
alternative label: Pohjois-Pohjanmaa, maantiede, matkat (412.9)
alternative label: Kajanaland (412.9) @sv
alternative label: Kajanaland, geografi, resor (412.9) @sv
alternative label: Nordöstra Österbotten (412.9) @sv
alternative label: Nordöstra Österbotten, geografi, resor (412.9) @sv
alternative label: Norra Österbotten (412.9) @sv
alternative label: Norra Österbotten, geografi, resor (412.9) @sv
alternative label: Uleåborgs län (412.9) @sv
alternative label: Uleåborgs län, geografi, resor (412.9) @sv
alternative label: Österbotten, Norra Österbotten (412.9) @sv
alternative label: Österbottningar, Norra Österbotten (412.9) @sv
broader: Suomi
in scheme: URN:NBN:fi:au:hklj:
narrower: Lappi
notation: 412.9
preferred label: Norra Österbotten. Kajanaland. Koillismaa @sv
related: URN:NBN:fi:au:hklj:411
related: URN:NBN:fi:au:hklj:460
related: URN:NBN:fi:au:hklj:920
related: URN:NBN:fi:au:hklj:929
scope note: Oulun lääni
scope note: Uleåborgs län @sv

Benelux-maat
type: Class
type: Concept
subclass of: Keski-Eurooppa
alternative label: Benelux-maat (413.2 +)
alternative label: Benelux-maat, maantiede, matkat (413.2 +)
alternative label: Benelux-länder (413.2 +) @sv
alternative label: Benelux-länder, geografi, resor (413.2 +) @sv
broader: Keski-Eurooppa
in scheme: URN:NBN:fi:au:hklj:
narrower: Alankomaat, Hollanti
narrower: Belgia
narrower: Luxemburg
notation: 413.2
preferred label: Benelux countries @en
preferred label: Beneluxländerna @sv
related: URN:NBN:fi:au:hklj:460
related: URN:NBN:fi:au:hklj:970

Entisen Tsekkoslovakian alue
type: Class
type: Concept
subclass of: Keski-Eurooppa
broader: Keski-Eurooppa
in scheme: URN:NBN:fi:au:hklj:
narrower: Tsekki
narrower: Slovakia
notation: 413.6
preferred label: The former Czechoslovakia @en
preferred label: Det tidigare Tjeckoslovakien @sv
related: URN:NBN:fi:au:hklj:460
related: Tsekin ja slovakian historia
related: Tsekin historia
related: Slovakian historia

Iso-Britannia
type: Class
type: Concept
subclass of: Brittein saaret
alternative label: Britannia (417.1 +)
alternative label: Britannia, maantiede, matkat (417.1 +)
alternative label: Britit (417.1 +)
alternative label: Britit, maantiede, matkat (417.1 +)
alternative label: Brittiläinen kansainyhteisö (417.1)
alternative label: Brittiläinen kansainyhteisö, maantiede, matkat (417.1)
alternative label: Englanti (417.1 +)
alternative label: Englanti, maantiede, matkat (417.1 +)
alternative label: Englantilaiset (417.1 +)
alternative label: Englantilaiset, maantiede, matkat (417.1 +)
alternative label: Hebridit (417.1)
alternative label: Hebridit, maantiede, matkat (417.1)
alternative label: Iso-Britannia (417.1 +)
alternative label: Iso-Britannia, maantiede, matkat (417.1 +)
alternative label: Skotlanti (417.1)
alternative label: Skotlanti, maantiede, matkat (417.1)
alternative label: Wales (417.1)
alternative label: Wales, maantiede, matkat (417.1)
alternative label: Yhdistynyt kuningaskunta (417.1 +)
alternative label: Yhdistynyt kuningaskunta, maantiede, matkat (417.1 +)
alternative label: Britannien (417.1 +) @sv
alternative label: Britannien, geografi, resor (417.1 +) @sv
alternative label: Britter (417.1 +) @sv
alternative label: Britter, geografi, resor (417.1 +) @sv
alternative label: Brittiska samväldet (417.1) @sv
alternative label: Brittiska samväldet, geografi, resor (417.1) @sv
alternative label: Engelsmän (417.1 +) @sv
alternative label: Engelsmän, geografi, resor (417.1 +) @sv
alternative label: England (417.1 +) @sv
alternative label: England, geografi, resor (417.1 +) @sv
alternative label: Förenade konungariket (417.1 +) @sv
alternative label: Förenade konungariket, geografi, resor (417.1 +) @sv
alternative label: Hebriderna (417.1) @sv
alternative label: Hebriderna, geografi, resor (417.1) @sv
alternative label: Skottland (417.1) @sv
alternative label: Skottland, geografi, resor (417.1) @sv
alternative label: Storbritannien (417.1 +) @sv
alternative label: Storbritannien, geografi, resor (417.1 +) @sv
alternative label: Wales, geografi, resor (417.1) @sv
broader: Brittein saaret
in scheme: URN:NBN:fi:au:hklj:
narrower: Lontoo
notation: 417.1
preferred label: Great Britain @en
preferred label: Storbritannien @sv
related: Pohjois-Irlanti
related: URN:NBN:fi:au:hklj:460
related: BRITTEIN SAARTEN HISTORIA
related: Pohjois-Irlannin historia
scope note: Yhdistynyt kuningaskunta. Englanti. Skotlanti. Wales Kanaalin saaret. Man-saari Teokset, jotka koskevat Brittiläistä kansainyhteisöä kokonaisuudessaan Itsenäiset jäsenmaat ja Iso-Britannian merentakaiset alueet maantieteellisen sijaintinsa mukaisessa luokassa
scope note: Förenade kungadömet. England. Skottland. Wales Kanalöarna. Ön Man Verk som rör Brittiska samväldet i dess helhet Självständiga medlemsländer och Storbritanniens utomeuropeiska områden klassificeras enligt geografisk position @sv

Biologinen antropologia
type: Class
type: Concept
subclass of: Antropologia
alternative label: Adaptaatio, ihmisen evoluutio (479.2)
alternative label: Antropogenia (479.2)
alternative label: Antropologia, biologinen antropologia (479.2)
alternative label: Antropometria (479.2)
alternative label: Atavismi, ihmisen evoluutio (479.2)
alternative label: Biologinen antropologia (479.2)
alternative label: Darwinismi, ihmisen evoluutio (479.2)
alternative label: Elimet, ihminen, evoluutio (479.2)
alternative label: Erilaistuminen, ihmisen evoluutio (479.2)
alternative label: Esi-ihmiset (479.2)
alternative label: Etnobiologia, kulttuuriantropologia (479.2)
alternative label: Etnohistoria, kulttuuriantropologia (479.2)
alternative label: Europidit (479.2)
alternative label: Evolutionismi, ihmisen evoluutio (479.2)
alternative label: Evoluutio, ihmisen evoluutio (479.2)
alternative label: Evoluutioteoria , ihmisen evoluutio (479.2)
alternative label: Fyysinen antropologia (479.2)
alternative label: Geenivarat, ihmisen evoluutio (479.2)
alternative label: Ihminen, alkuihmiset (479.2)
alternative label: Ihminen, biologinen antropologia (479.2)
alternative label: Ihminen, evoluutio (479.2)
alternative label: Ihminen, kehitysoppi (479.2)
alternative label: Ihminen, lajiominaisuudet (479.2)
alternative label: Ihmisen evoluutio (479.2)
alternative label: Ihmiset, alkuihmiset (479.2)
alternative label: Ihmiset, biologinen antropologia (479.2)
alternative label: Ihmiset, evoluutio (479.2)
alternative label: Ihmiset, kehitysoppi (479.2)
alternative label: Ihmiset, lajiominaisuudet (479.2)
alternative label: Ihmiskunta, evoluutio (479.2)
alternative label: Ihmisrodut, antropologia (479.2)
alternative label: Jääkaudet, antropologia (479.2)
alternative label: Kehittyminen, ihmisen evoluutio (479.2)
alternative label: Kehitys, ihmisen evoluutio (479.2)
alternative label: Kehitysoppi, ihmisen evoluutio (479.2)
alternative label: Kraniologia (479.2)
alternative label: Lajinkehitys, ihmisen evoluutio (479.2)
alternative label: Lajinkehitysoppi, ihmisen evoluutio (479.2)
alternative label: Lajiutuminen, ihmisen evoluutio (479.2)
alternative label: Luuoppi, biologinen antropologia (479.2)
alternative label: Mongolidit, rodut (479.2)
alternative label: Muinaisajan ihmiset, ihmislajin evoluutio (479.2)
alternative label: Muuntelu, biologinen antropologia (479.2)
alternative label: Negridit, ihmisrodut (479.2)
alternative label: Osteologia, biologinen antropologia (479.2)
alternative label: POC (People of Colour), biologinen antropologia (479.2)
alternative label: POC-ihmiset, biologinen antropologia (479.2)
alternative label: Paleoantropologia (479.2)
alternative label: Polveutumisoppi, ihmisen evoluutio (479.2)
alternative label: Rodut, antropologia (479.2)
alternative label: Rotututkimus, antropologia (479.2)
alternative label: Ruumiinrakenne, biologinen antropologia (479.2)
alternative label: Seksuaalivalinta, ihmisen evoluutio (479.2)
alternative label: Sukupuolivalinta, ihmisen evoluutio (479.2)
alternative label: Surkastumat, ihmisen evoluutio (479.2)
alternative label: Vaihtelu, biologinen antropologia (479.2)
alternative label: Variaatio, biologinen antropologia (479.2)
alternative label: Värilliset, biologinen antropologia (479.2)
alternative label: Adaptation, människans evolution (479.2) @sv
alternative label: Antropogeni (479.2) @sv
alternative label: Antropologi, biologisk antropologi (479.2) @sv
alternative label: Antropometri (479.2) @sv
alternative label: Artbildning, människans evolution (479.2) @sv
alternative label: Artutveckling, människans evolution (479.2) @sv
broader: Antropologia
in scheme: URN:NBN:fi:au:hklj:
notation: 479.2
related: Luominen. Kehitys
related: Paleontologia
related: Kehitysoppi. Evoluutio
related: Etologia. Eläinsosiologia
related: Nisäkkäät
related: Anatomia
related: URN:NBN:fi:au:hklj:900
related: URN:NBN:fi:au:hklj:919
scope note: Ihmisen alkuperä ja biologinen kehitys Antropogenia. Ihmisen evoluutio Ihmislajin biologiset ominaisuudet yleensä. Antropometria Ihmisen morfologia ja somatologia kehitysopin kannalta Ihmisrodut ja niiden väliset biologiset erot Esi-ihmiset. Alkuihmiset. Ihmistä koskeva paleontologia
scope note: Människans ursprung och biologiska utveckling Antropogeni. Människans evolution Människoartens biologiska egenskaper i allmänhet. Antropometri Människans morfologi och somatologi ur utvecklingslärans synvinkel Människoraserna och de biologiska olikheterna dem emellan Förmänniskor. Urmänniskor. Paleontologi som rör människan @sv

Meteorologia. Klimatologia
type: Class
type: Concept
subclass of: FYYSINEN MAANTIEDE
alternative label: Aavikkoilmasto (487)
alternative label: Aavikot, ilmasto (487)
alternative label: Aerologia (487)
alternative label: Aeronomia (487)
alternative label: Akklimaatio, ilmastonmuutokset (487)
alternative label: Akklimatisaatio, ilmastonmuutokset (487)
alternative label: Akklimointi, ilmastonmuutokset (487)
alternative label: Alailmakehä (487)
alternative label: Alailmakehä, meteorologia, klimatologia (487)
alternative label: Aridiset alueet, ilmastovyöhykkeet (487)
alternative label: Arot, ilmasto (487)
alternative label: Auringon säteily, meteorologia (487)
alternative label: Auringonsäteily, meteorologia (487)
alternative label: Autiomaat, ilmasto (487)
alternative label: Barografit, meteorologia (487)
alternative label: Bioklimatologia, ilmastotiede (487)
alternative label: Biometeorologia, meteorologia (487)
alternative label: Eläinratavalo (487)
alternative label: Fyysinen maantiede, klimatologia (487)
alternative label: Fyysinen maantiede, meteorologia (487)
alternative label: Golf-virta, ilmastotiede (487)
alternative label: Halla, meteorologia (487)
alternative label: Haloilmiöt (487)
alternative label: Happi, ilmakehä (487)
alternative label: Havaintoasemat, meteorologia (487)
alternative label: Hiilidioksidi, ilmakehä (487)
alternative label: Hirmumyrskyt (487)
alternative label: Hurrikaanit (487)
alternative label: Huurre (487)
alternative label: Ikirouta, klimatologia (487)
alternative label: Ilma, ilmakehä (487)
alternative label: Ilma, ilmatiede (487)
alternative label: Ilmakehä (487)
alternative label: Ilmakehä, meteorologia, klimatologia (487)
alternative label: Ilmakehän valoilmiöt (487)
alternative label: Ilman lämpötila (487)
alternative label: Ilmankosteus (487)
alternative label: Ilmanpaine (487)
alternative label: Ilmapuntarit, meteorologia (487)
alternative label: Ilmasto (487)
alternative label: Ilmasto, ilmastotiede (487)
alternative label: Ilmastokaudet (487)
alternative label: Ilmastomallit (487)
alternative label: Ilmastomallit, ilmastotiede (487)
alternative label: Ilmastonmuutokset (487)
alternative label: Ilmastonmuutokset, ilmastotiede (487)
alternative label: Ilmastoon sopeutuminen, ilmastonmuutokset (487)
alternative label: Ilmastotiede (487)
alternative label: Ilmastotutkimus (487)
alternative label: Ilmastotutkimus, ilmastotiede (487)
alternative label: Ilmastovyöhykkeet (487)
alternative label: Ilmatiede (487)
alternative label: Jää, meteorologia (487)
alternative label: Jääkaudet, ilmastotiede (487)
alternative label: Jääpeite, sää-ja ilmastotiede (487)
alternative label: Jäätiköt, ilmastotiede (487)
alternative label: Kaasukehät , ilmakehä (487)
alternative label: Kangastukset, meteorologia (487)
alternative label: Katastrofit, myrskyt (487)
alternative label: Keitaat, ilmasto (487)
alternative label: Keli, sää (487)
alternative label: Kesä, sää- ja ilmastotiede (487)
alternative label: Kevät, sää- ja ilmastotiede (487)
alternative label: Klimatologia (487)
broader: FYYSINEN MAANTIEDE
in scheme: URN:NBN:fi:au:hklj:
notation: 487
related: URN:NBN:fi:au:hklj:487.084
related: Ilman suojelu
related: Tähtijärjestelmät. Aurinkokunnat
related: Avaruustutkimus. Avaruuslennot. Avaruusteknologia
related: Ufot. Ilmakehän tunnistamattomat ilmiöt
related: Lämpöoppi
related: BIOLOGIA
related: Ekologia. Eliömaantiede
scope note: Ilmakehä ja sen ilmiöt. Ilmatiede. Ilmastotiede Säätila. Säähavainnot. Sääennustukset. Sääpalvelu Säätilan mittauslaitteet. Sääsatelliitit Ilmanpaine. Ilman kosteus. Ilman lämpötila Tuulet. Pilvet. Sateet. Sumu. Näkyvyys Korkea- ja matalapaineet. Syklonit. Pyörremyrskyt. Myrskyt. Ukkonen. Salamat Ilmakehän optiset ilmiöt. Revontulet Ilmastot. Ilmastotyypit. Ilmaston kehitys. Alueellinen ja historiallinen ilmastotiede Vuodenajat ilmastotieteen kannalta
scope note: Atmosfären och dess fenomen. Meteorologi. Klimatologi Vädret. Väderobservationer. Väderprognoser. Vädertjänster Meteorologiska mätinstrument. Vädersatelliter Lufttryck. Luftfuktighet. Temperatur Vindar. Moln. Regn. Dimma. Sikt Hög- och lågtryck. Cykloner. Virvelstormar. Stormar. Åska. Blixtar Optiska fenomen i atmosfären. Norrsken Klimat. Klimattyper. Klimatutveckling. Regional och historisk klimatologi Årstiderna ur klimatologisk synvinkel @sv

Ydinfysiikka. Atomifysiikka. Molekyylifysiikka
type: Class
type: Concept
subclass of: Yleinen ja teoreettinen fysiikka
alternative label: Alfasäteily (531.2)
alternative label: Alkeishiukkaset (531.2)
alternative label: Alkeishiukkasfysiikka (531.2)
alternative label: Annosmittarit, säteily (531.2)
alternative label: Antihiukkaset (531.2)
alternative label: Antimateria (531.2)
alternative label: Atomifysiikka (531.2)
alternative label: Atomireaktorit, ydinfysiikka (531.2)
alternative label: Atomit (531.2)
alternative label: Atomiteoria, fysiikka (531.2)
alternative label: Beetasäteily (531.2)
alternative label: Bosonit (531.2)
alternative label: Cesium, ydinfysiikka (531.2)
alternative label: Elektronit, ydinfysiikka (531.2)
alternative label: Fissio, ydinfysiikka (531.2)
alternative label: Fissioreaktorit, ydinfysiikka (531.2)
alternative label: Fononit, alkeishiukkaset (531.2)
alternative label: Fotonit (531.2)
alternative label: Fuusio, ydinfysiikka (531.2)
alternative label: Fuusioreaktorit, ydinfysiikka (531.2)
alternative label: Fysiikka, atomifysiikka (531.2)
alternative label: Fysiikka, ydinfysiikka (531.2)
alternative label: Gammasäteily (531.2)
alternative label: Higgsin bosoni, alkeishiukkaset (531.2)
alternative label: Hiukkaset, hiukkasfysiikka (531.2)
alternative label: Hiukkasfysiikan standardimalli (531.2)
alternative label: Hiukkasfysiikka (531.2)
alternative label: Hiukkaskiihdyttimet (531.2)
alternative label: Hiukkassäteily (531.2)
alternative label: Hyperonit (531.2)
alternative label: Ionisoiva säteily (531.2)
alternative label: Isotoopit, fysiikka (531.2)
alternative label: Ketjureaktio, ydinfysiikka (531.2)
alternative label: Kidetiede, fysiikka (531.2)
alternative label: Kiinteiden aineiden fysiikka (531.2)
alternative label: Kiinteän olomuodon fysiikka (531.2)
alternative label: Kristallografia, fysiikka (531.2)
alternative label: Kvarkit (531.2)
alternative label: Leptonit (531.2)
alternative label: Luonnonsäteily, ionisoiva säteily (531.2)
alternative label: Molekyylifysiikka (531.2)
alternative label: Neutriinot (531.2)
alternative label: Neutronit (531.2)
alternative label: Nukleonit (531.2)
alternative label: Nuklidit (531.2)
alternative label: Pienhiukkaset, hiukkasfysiikka (531.2)
alternative label: Pintailmiöt, molekyylifysiikka (531.2)
alternative label: Plasmatekniikka, ydinfuusio (531.2)
alternative label: Plutonium, radioaktiivisuus (531.2)
alternative label: Positronit (531.2)
alternative label: Protonit (531.2)
alternative label: Puoliintumisaika, radioaktiivisuus (531.2)
alternative label: Radioaktiivinen säteily, fysiikka (531.2)
alternative label: Radioaktiiviset aineet, fysiikka (531.2)
alternative label: Radioaktiivisuus (531.2)
alternative label: Radioaktiivisuus, fysiikka (531.2)
alternative label: Radiofysiikka (531.2)
alternative label: Radium, radioaktiivisuus (531.2)
alternative label: Rajapintailmiöt, molekyylifysiikka (531.2)
alternative label: Reaktorifysiikka (531.2)
alternative label: Resonanssi, atomi- ja ydinfysiikka (531.2)
alternative label: Röntgensäteily, fysiikka (531.2)
alternative label: Strontium, radioaktiivisuus (531.2)
alternative label: Supersymmetria, hiukkasfysiikka (531.2)
broader: Yleinen ja teoreettinen fysiikka
in scheme: URN:NBN:fi:au:hklj:
notation: 531.2
related: Aseteknologia
related: Väestönsuojelu
related: Maailmankaikkeus. Kosmologia. Kosmogonia
related: Kokeellinen fysiikka
related: Teoreettinen kemia
related: URN:NBN:fi:au:hklj:617.1
related: Energia
related: Sähköenergian tuottaminen. Voimalatekniikka
scope note: Yleinen atomiteoria. Alkeishiukkasfysiikka. Reaktorifysiikka Atomien ja ytimien rakenne ja fysiikka. Isotoopit Ydinreaktiot. Fissio. Fuusio. Ketjureaktio Radioaktiivisuus. Radioaktiivinen säteily yleensä Alfa-, beeta- ja gammasäteily Molekyylien ja kiinteiden aineiden rakenne ja fysiikka
scope note: Allmän atomteori. Elementarpartikelfysik. Reaktorfysik Atomers och kärnors uppbyggnad och fysik. Isotoper Kärnreaktorer. Fission. Fusion. Kedjereaktion Radioaktivitet. Radioaktiv strålning i allmänhet Alfa-, beta- och gammastrålning Molekylers och fasta ämnens uppbyggnad och fysik @sv

Kehitysoppi. Evoluutio
type: Class
type: Concept
subclass of: BIOLOGIA
alternative label: Adaptaatio, evoluutioteoria (575)
alternative label: Alkusynty, kehitysoppi (575)
alternative label: Atavismi, kehitysoppi (575)
alternative label: Darwinismi (575)
alternative label: Degeneraatio, kehitysoppi (575)
alternative label: Elämä, elämän synty (575)
alternative label: Elämän synty, evoluutioteoria (575)
alternative label: Erilaistuminen, evoluutio (575)
alternative label: Evolutionismi (575)
alternative label: Evolutionismi, kehitysoppi (575)
alternative label: Evoluutio (575)
alternative label: Evoluutio, kehitysoppi (575)
alternative label: Evoluutiolaskenta (575)
alternative label: Evoluutioteoria (575)
alternative label: Evoluutioteoria , evoluutio (575)
alternative label: Fylogeneesi, lajinkehitys (575)
alternative label: Fylogenetiikka, evoluutio (575)
alternative label: Fylogenia, lajinkehitys (575)
alternative label: Geenimutaatiot, evoluutio (575)
alternative label: Geenit, evoluutio (575)
alternative label: Geenivarat, evoluutio (575)
alternative label: Kehittyminen, evoluutio (575)
alternative label: Kehitys, evoluutio (575)
alternative label: Kehitysoppi (575)
alternative label: Kehitysoppi, evoluutio (575)
alternative label: Konvergenssi, evoluutio (575)
alternative label: Lajinkehitys (575)
alternative label: Lajinkehitysoppi (575)
alternative label: Lajiristeymät, kehitysoppi (575)
alternative label: Lajit, lajinmuodostus (575)
alternative label: Lajiutuminen (575)
alternative label: Lajiutuminen, evoluutio, kehitysoppi (575)
alternative label: Lamarckismi (575)
alternative label: Luonnonvalinta (575)
alternative label: Mutaatiot, evoluutio (575)
alternative label: Muuntelu, kehitysoppi (575)
alternative label: Olemassaolon taistelu, kehitysoppi (575)
alternative label: Polveutumisoppi (575)
alternative label: Polveutumisoppi, evoluutio (575)
alternative label: Rodut, kehitysoppi (575)
alternative label: Sattuma, evoluutioteoriat (575)
alternative label: Seksuaalivalinta, evoluutio (575)
alternative label: Sukupuolivalinta, evoluutio (575)
alternative label: Sukupuutot, evoluutio (575)
alternative label: Sukupuutto, evoluutio (575)
alternative label: Sukupuuttoon kuoleminen, evoluutio (575)
alternative label: Surkastumat, evoluutio (575)
alternative label: Vaihtelu, evoluutio (575)
alternative label: Valikoituminen, luonnonvalinta (575)
alternative label: Valinta, luonnonvalinta (575)
alternative label: Variaatio, kehitysoppi (575)
alternative label: Ympäristötekijät, evoluutio (575)
alternative label: Adaptation, evolutionsteori (575) @sv
alternative label: Artbildning (575) @sv
alternative label: Artbildning, evolution, utvecklingslära (575) @sv
alternative label: Arter, artbildning (575) @sv
alternative label: Arthybrider, utvecklingslära (575) @sv
alternative label: Artutveckling (575) @sv
alternative label: Artutvecklingslära (575) @sv
alternative label: Atavism, utvecklingslära (575) @sv
alternative label: Darwinism (575) @sv
alternative label: Degeneration, utvecklingsslära (575) @sv
alternative label: Descendensslära (575) @sv
alternative label: Descendensslära, evolution (575) @sv
broader: BIOLOGIA
in scheme: URN:NBN:fi:au:hklj:
notation: 575
related: Luominen. Kehitys
related: Jumalan olemus
related: Biologinen antropologia
related: Paleontologia
related: Elämä maailmankaikkeudessa. Astrobiologia
related: Biologian filosofia
related: Yleisbiologia
related: URN:NBN:fi:au:hklj:576
scope note: Elämän synty ja kehitys. Alkusynty- ja kehitysteoriat Darwinismi. Lajinmuodostus. Evoluutioon vaikuttavat tekijät Olemassaolon taistelu, valinta, sattuma, sopeutuminen, ympäristönmuutokset, katastrofit ja maantieteellinen isolaatio evoluutiotekijöinä
scope note: Livets uppkomst och utveckling. Urpsrungs- och utvecklingsteorier Darwinism. Artbildning. Faktorer som påverkar evolutionen Kampen om tillvaron, urval, slump, anpassning, miljöförändringar, katastrofer och geografisk isolering som faktorer inom evolutionen @sv

Kasvifysiologia
type: Class
type: Concept
subclass of: KASVITIEDE
alternative label: Aineenvaihdunta, kasvit (583)
alternative label: Aineenvaihduntatuotteet, kasvit (583)
alternative label: Alkaloidit, kasvifysiologia (583)
alternative label: Allelopatia, kasvifysiologia (583)
alternative label: Biofysiikka, kasvit (583)
alternative label: Biokemia, kasvit (583)
alternative label: Biologinen typensidonta, kasvifysiologia (583)
alternative label: Biologiset rytmit, kasvifysiologia (583)
alternative label: Biomekaniikka, kasvit (583)
alternative label: Biorytmit, kasvifysiologia (583)
alternative label: Carnivorit, kasvifysiologia (583)
alternative label: Elektrofysiologia, kasvit (583)
alternative label: Entsyymit, kasvifysiologia (583)
alternative label: Feromonit, kasvifysiologia (583)
alternative label: Fotosynteesi (583)
alternative label: Fysiologia, kasvit (583)
alternative label: Fysiologiset rytmit, kasvit (583)
alternative label: Fysiologiset vaikutukset, kasvifysiologia (583)
alternative label: Fytoestrogeenit, kasvifysiologia (583)
alternative label: Haihduttaminen, kasvifysiologia (583)
alternative label: Hedelmällisyys, kasvit (583)
alternative label: Hedelmöitys, kasvit (583)
alternative label: Hengitys, kasvifysiologia (583)
alternative label: Hivenaineet, kasvifysiologia (583)
alternative label: Hormonaaliset tekijät, kasvifysiologia (583)
alternative label: Hormonaaliset vaikutukset, kasvifysiologia (583)
alternative label: Hormonit, kasvifysiologia (583)
alternative label: Hormonivaikutukset, kasvifysiologia (583)
alternative label: Horros, kasvifysiologia (583)
alternative label: Itäminen, kasvifysiologia (583)
alternative label: Itävyys, kasvifysiologia (583)
alternative label: Juuri, kasvifysiologia (583)
alternative label: Juuristo, kasvifysiologia (583)
alternative label: Karnivorit, kasvifysiologia (583)
alternative label: Kasvaminen, kasvifysiologia (583)
alternative label: Kasviestrogeenit, kasvifysiologia (583)
alternative label: Kasvifysiologia (583)
alternative label: Kasvihormonit (583)
alternative label: Kasvinravinteet, kasvifysiologia (583)
alternative label: Kasviravinteet, kasvifysiologia (583)
alternative label: Kasvu, kasvifysiologia (583)
alternative label: Kasvuhormonit, kasvifysiologia (583)
alternative label: Kasvunsääteet, kasvifysiologia (583)
alternative label: Kasvutekijät, kasvifysiologia (583)
alternative label: Klorofylli (583)
alternative label: Kronobiologia, kasvit (583)
alternative label: Kuona-aineet, kasvifysiologia (583)
alternative label: Kuonaneritys, kasvifysiologia (583)
alternative label: Lehtivihreä (583)
alternative label: Ligniini, kasvifysiologia (583)
alternative label: Lignoselluloosa, kasvifysiologia (583)
alternative label: Lihansyöjäkasvit, kasvifysiologia (583)
alternative label: Lihansyöjät, kasvifysiologia (583)
alternative label: Lisääntyminen, kasvifysiologia (583)
alternative label: Maavarsi, kasvifysiologia (583)
alternative label: Mahla, kasvifysiologia (583)
alternative label: Mehikasvit, kasvifysiologia (583)
alternative label: Metabolia, kasvit (583)
alternative label: Metaboliitit, kasvit (583)
alternative label: Mykorritsa, kasvifysiologia (583)
alternative label: Myrkkykasvit, kasvifysiologia (583)
alternative label: Nanoselluloosa, kasvifysiologia (583)
alternative label: Nestetasapaino, kasvifysiologia (583)
alternative label: Nitrifikaatio, kasvifysiologia (583)
broader: KASVITIEDE
in scheme: URN:NBN:fi:au:hklj:
notation: 583
related: BIOKEMIA
related: Yleisbiologia
related: Kasvimorfologia. Kasvianatomia
related: Systemaattinen kasvitiede
related: Sekovartiset kasvit
related: Sienet
related: Putkilokasvit
related: Eläinfysiologia
scope note: Kasvifysiologian yleisteokset Kasvisytologian ja kasvihistologian yleisteokset Kasveja koskevan biokemian yleisteokset Kasvien aineenvaihdunta yleensä Fotosynteesi eli yhteyttäminen Tietyn kasvilajin tai lajiryhmän fysiologia ko. lajin tai ryhmän luokassa 587+
scope note: Allmänna verk om växtfysiologi Allmänna verk om växternas cytologi och växternas histologi Allmänna verk om biokemi som rör växter Växternas ämnesomsättning i allmänhet Fotosyntesen Fysiologi för en bestämd växtart eller artgrupp förs enligt art eller artgrupp till klass 587+ @sv

Etologia. Eläinsosiologia
type: Class
type: Concept
subclass of: URN:NBN:fi:au:hklj:590
alternative label: Aggressiot, etologia (591)
alternative label: Aggressiot, sosiobiologia (591)
alternative label: Biologinen psykologia, etologia (591)
alternative label: Biopsykologia, etologia (591)
alternative label: Ehdolliset refleksit, etologia (591)
alternative label: Ehdollistuminen, etologia (591)
alternative label: Elinpiirit (591)
alternative label: Eläinpsykologia (591)
alternative label: Eläinsosiologia (591)
alternative label: Eläinten elintavat (591)
alternative label: Eläinten käyttäytyminen (591)
alternative label: Eläinten vaellukset (591)
alternative label: Eläinten äänet, etologia (591)
alternative label: Etologia (591)
alternative label: Evoluutiopsykologia (591)
alternative label: Haju, etologia (591)
alternative label: Houkutteet, etologia (591)
alternative label: Houkuttimet, etologia (591)
alternative label: Houkutuslinnut, etologia (591)
alternative label: Ihminen-eläinsuhde, etologia (591)
alternative label: Ilmeet, etologia (591)
alternative label: Inho, sosiobiologia (591)
alternative label: Jäljittely, etologia (591)
alternative label: Jälkeläiset, eläimet (591)
alternative label: Kauhu, sosiobiologia (591)
alternative label: Kiima (591)
alternative label: Kosketus, etologia (591)
alternative label: Käyttäytyminen, eläimet (591)
alternative label: Käyttäytymismallit, etologia (591)
alternative label: Käyttäytymistieteet, etologia (591)
alternative label: Laumat, etologia (591)
alternative label: Leimautuminen, etologia (591)
alternative label: Lisääntymiskäyttäytyminen, etologia (591)
alternative label: Moniavioisuus, etologia (591)
alternative label: Monogamia, etologia (591)
alternative label: Parinmuodostus, etologia (591)
alternative label: Pariutuminen (591)
alternative label: Parvet, etologia (591)
alternative label: Parviäly, eläinten käyttäytyminen (591)
alternative label: Parviälykkyys, eläinten käyttäytyminen (591)
alternative label: Pennut, jälkeläisten hoito (591)
alternative label: Perustarpeet, etologia (591)
alternative label: Pesintä, eläimet (591)
alternative label: Pesät, eläimet (591)
alternative label: Poikaset, jälkeläisten hoito (591)
alternative label: Poikiminen, eläintiede (591)
alternative label: Polygamia, etologia (591)
alternative label: Psykobiologia, etologia (591)
alternative label: Puolustusmekanismit, etologia (591)
alternative label: Reaktiot, etologia (591)
alternative label: Refleksit, etologia (591)
alternative label: Reviirit, etologia (591)
alternative label: Saaliseläimet, etologia (591)
alternative label: Saalistus, etologia (591)
alternative label: Seksuaalikäyttäytyminen, etologia (591)
alternative label: Seksuaalinen käyttäytyminen, etologia (591)
alternative label: Seksuaalisuus, etologia (591)
alternative label: Signaalit, etologia (591)
alternative label: Sosiobiologia (591)
alternative label: Sukupuolikäyttäytyminen, etologia (591)
alternative label: Sukupuolivietti, etologia (591)
alternative label: Suojautuminen, etologia (591)
alternative label: Swarm intelligence, eläinten käyttäytyminen (591)
alternative label: Tarpeet, etologia (591)
broader: URN:NBN:fi:au:hklj:590
in scheme: URN:NBN:fi:au:hklj:
notation: 591
related: URN:NBN:fi:au:hklj:120
related: Tunne- ja tahtotoiminnot
related: Perinnöllisyyspsykologia
related: Biologinen antropologia
related: Kulttuuriantropologia. Sosiaaliantropologia
related: Ekologia. Eliömaantiede
related: Nisäkkäät
related: Eläinlääketiede
scope note: Etologian ja eläinsosiologian yleisteokset. Eläinten käyttäytyminen. Eläinpsykologia Vaistotoiminnat. Opittu käyttäytyminen Parinmuodostus. Pesänrakennus. Jälkeläisten hoito. Suojautumis- ja puolustuskäyttäytyminen Ihmisen etologia. Sosiobiologia Ihmisen käyttäytymisen eläintieteellinen tutkimus Tietyn eläinlajin tai lajiryhmän käyttäytyminen ko. lajin tai ryhmän luokassa 597+
scope note: Allmänna verk om etologi och djursociologi. Djurens beteende. Djurpsykologi Instinkter. Inlärt beteende Parbildning. Bobygge. Vård av avkomman. Skydds- och försvarsbeteende Människans etologi. Sociobiologi Zoologisk forskning i människans beteende Enskilda djurarters eller artgruppers beteende förs enligt djurart eller artgrupp till klass 597+ @sv

Sairaanhoitajan ja terveydenhoitajan työ
type: Class
type: Concept
subclass of: Hoitotiede. Hoitotyö. Hoitohenkilökunta
alternative label: Apuhoitajat, apuhoitajan työ (610.74)
alternative label: Hoitaja-potilassuhde (610.74)
alternative label: Hoitotyö, perushoitajan työ (610.74)
alternative label: Hoitotyö, sairaanhoitajan työ (610.74)
alternative label: Hoitotyö, terveydenhoitajan työ (610.74)
alternative label: Hoitovirheet, sairaanhoitajan työ (610.74)
alternative label: Kotikäynnit, sairaanhoitajan työ (610.74)
alternative label: Kotikäynnit, terveydenhoitajat työ (610.74)
alternative label: Lähihoitajat, lähihoitajan työ (610.74)
alternative label: Lääkintävirheet, sairaanhoitajan työ (610.74)
alternative label: Omahoitajajärjestelmä (610.74)
alternative label: Omahoitajat, omahoitajan työ (610.74)
alternative label: Perushoitajat, perushoitajan työ (610.74)
alternative label: Potilas-hoitajasuhde (610.74)
alternative label: Päivystys, sairaanhoitajan työ (610.74)
alternative label: Sairaala-apulaiset, sairaala-apulaisen työ (610.74)
alternative label: Sairaanhoitajat, sairaanhoitajan työ (610.74)
alternative label: Sairaanhoito-oppilaitokset (610.74)
alternative label: Sidonta, sairaanhoitajan työ (610.74)
alternative label: Terveydenhoitajat, terveydenhoitajan työ (610.74)
alternative label: Terveydenhuolto-oppilaitokset (610.74)
alternative label: Yksilövastuinen hoitotyö (610.74)
alternative label: Behandlingsskador, sjukskötarens arbete (610.74) @sv
alternative label: Bindning, sjukskötarens arbete (610.74) @sv
alternative label: Egen skötare, egen skötarens arbete (610.74) @sv
alternative label: Egenskötarsystem (610.74) @sv
alternative label: Felbehandling, medicin, sjukskötarens arbete (610.74) @sv
alternative label: Hembesök, hälsovårdarens arbete (610.74) @sv
alternative label: Hembesök, sjukskötarens arbete (610.74) @sv
alternative label: Hjälpskötare, primärskötarens arbete (610.74) @sv
alternative label: Hälsovårdare, hälsovårdarens arbete (610.74) @sv
alternative label: Hälsovårdsläroinrättningar (610.74) @sv
alternative label: Jour, sjukskötarens arbete (610.74) @sv
alternative label: Närvårdare, närvårdarens arbete (610.74) @sv
alternative label: Patient-vårdarrelation (610.74) @sv
alternative label: Personliga skötare (610.74) @sv
alternative label: Primärskötare, primärskötarens arbete (610.74) @sv
alternative label: Sjukhusbiträden, sjukhusbiträdets arbete (610.74) @sv
alternative label: Sjukskötare, sjukskötarens arbete (610.74) @sv
alternative label: Sjukvårdsläroanstalter (610.74) @sv
alternative label: System med personlig skötare (610.74) @sv
alternative label: Vårdarbete, hälsovårdarens arbete (610.74) @sv
alternative label: Vårdarbete, primärskötarens arbete (610.74) @sv
alternative label: Vårdarbete, sjukskötarens arbete (610.74) @sv
alternative label: Vårdare-patientrelation (610.74) @sv
broader: Hoitotiede. Hoitotyö. Hoitohenkilökunta
in scheme: URN:NBN:fi:au:hklj:
notation: 610.74
preferred label: Nurses' and health-carers' work @en
preferred label: Sjukskötarens och hälsovårdarens arbete @sv
related: URN:NBN:fi:au:hklj:332.22
related: URN:NBN:fi:au:hklj:371.6
related: Lääketieteen filosofia ja etiikka
related: Terveydenhoito
related: URN:NBN:fi:au:hklj:615
related: URN:NBN:fi:au:hklj:617
related: Raskaus. Sikiönkehitys. Synnytys. Gynekologia
related: Mielisairaanhoito
scope note: Sairaanhoitajan, perushoitajan ja terveydenhoitajan työ yleensä Sairaanhoito- ja terveydenhoitoalan koulut ja opistot yleensä Erikoissairaanhoitajan työ alan mukaisessa luokassa
scope note: Sjukskötarens, primärskötarens och hälsovårdarens arbete i allmänhet Skolor och institut inom sjukvård och hälsovård i allmänhet Specialsjukötarens arbete klassificeras enligt område @sv

Lasiteollisuus. Keraaminen teollisuus. Sementtiteollisuus
type: Class
type: Concept
subclass of: KEMIAN TEOLLISUUS. KAIVOSTEOLLISUUS
alternative label: Asbestikeramiikka, teollisuus (643)
alternative label: Astiastot, keraaminen teollisuus (643)
alternative label: Astiastot, lasiteollisuus (643)
alternative label: Astiat, keraaminen teollisuus (643)
alternative label: Astiat, lasiteollisuus (643)
alternative label: Betoni, betoniteollisuus (643)
alternative label: Betoniteollisuus (643)
alternative label: Detektorit, hälyttimet (643)
alternative label: Emali, teolliset pinnoitteet (643)
alternative label: Emalointi, teollinen (643)
alternative label: Fajanssiteollisuus (643)
alternative label: Graafinen betoni, betoniteollisuus (643)
alternative label: Itsepuhdistuvuus, lasiteollisuus (643)
alternative label: Kaakelilaatat, keraaminen teollisuus (643)
alternative label: Kaakelit, keraaminen teollisuus (643)
alternative label: Kalkki, sementtiteollisuus (643)
alternative label: Kalvotekniikka, keraaminen teollisuus (643)
alternative label: Keraaminen teollisuus (643)
alternative label: Keraamiset laatat, keraaminen teollisuus (643)
alternative label: Keraamiset materiaalit (643)
alternative label: Keraamiset materiaalit, keraaminen teollisuus (643)
alternative label: Keraamiset putket (643)
alternative label: Keraamiset tuotteet (643)
alternative label: Keramiikka, keraaminen teollisuus (643)
alternative label: Keramiikkateollisuus (643)
alternative label: Keräyslasi, lasiteollisuus (643)
alternative label: Kevytbetoni, betoniteollisuus (643)
alternative label: Kivitavara, keraaminen teollisuus (643)
alternative label: Klinkkerilaatat, teollisuus (643)
alternative label: Klinkkerit, teollisuus (643)
alternative label: Kristalli, lasiteollisuus (643)
alternative label: Kristallilasi, lasiteollisuus (643)
alternative label: Laasti, laastin valmistus (643)
alternative label: Laastiteollisuus (643)
alternative label: Laatat, keraaminen teollisuus (643)
alternative label: Lasi, lasiteollisuus (643)
alternative label: Lasiesineet, lasiteollisuus (643)
alternative label: Lasiteollisuus (643)
alternative label: Lasituotteet, lasiteollisuus (643)
alternative label: Lasitus, keraaminen teollisuus (643)
alternative label: Lasityöt, lasiteollisuus (643)
alternative label: Lasivilla, lasiteollisuus (643)
alternative label: Lyijylasi, lasiteollisuus (643)
alternative label: Maljakot, keraaminen teollisuus (643)
alternative label: Maljakot, lasiteollisuus (643)
alternative label: Peilit, lasiteollisuus (643)
alternative label: Pesualtaat, keraaminen teollisuus (643)
alternative label: Pinnoitteet, keraaminen teollisuus (643)
alternative label: Pintamateriaalit, keraaminen teollisuus (643)
alternative label: Posliini, posliiniteollisuus (643)
alternative label: Posliiniteollisuus (643)
alternative label: Pullot, lasiteollisuus (643)
alternative label: Rakennusaineteollisuus (643)
alternative label: Ruoanvalmistusastiat, keraaminen ja lasiteollisuus (643)
alternative label: Ruokailuastiat, keraaminen teollisuus (643)
alternative label: Ruokailuastiat, lasiteollisuus (643)
alternative label: Ruuanvalmistusastiat, keraaminen ja lasiteollisuus (643)
alternative label: Savi, saviteollisuus (643)
alternative label: Saviastiat, saviteollisuus (643)
alternative label: Saviteollisuus (643)
alternative label: Savituotteet, saviteollisuus (643)
alternative label: Sintraus, keraaminen teollisuus (643)
alternative label: Sora, betoniteollisuus (643)
alternative label: Sprinklerilaitteistot (643)
broader: KEMIAN TEOLLISUUS. KAIVOSTEOLLISUUS
in scheme: URN:NBN:fi:au:hklj:
notation: 643
related: Rakennusstatiikka. Rakennusaineet
related: Rakennustyöt. Rakennusaineet. Rakennustarvikkeet
related: Rakenneosat
related: Uunit. Takat
related: Keramiikkataide. Posliinitaide
related: Keramiikkataide
related: Posliinitaide. Posliinimaalaus
related: Lasitaide
scope note: Lasiteollisuuden ja keraamisen teollisuuden liiketalous, tuotantomenetelmät, rationalisointi, työt, prosessit, koneet, raaka-aineet, tuotanto ja tuotteiden kauppa. Lasinvalmistus. Lasinpuhallus Lasilevyt ja lasiesineet sekä niiden teollinen valmistus Keramiikka-, posliini-, kivitavara- ja fajanssiesineet sekä niiden teollinen valmistus ja kauppa. Keraamiset laatat ja putket Tässä myös sementti-, betoni-, laasti-, kipsi-, savi-, tiili- ja kalkkiteollisuus Lasi-, keramiikka- ym. -tehtaiden tuoteluettelot 643.03 Lasi-, keramiikka- ym. -tehtaiden historia 643.09
scope note: Företagsekonomi, produktionsmetoder, rationalisering, arbete, processer, maskiner, råmaterial, produktion och handel inom glasindustri och keramisk industri. Glastillverkning. Glasblåsning Glasskivor och glasföremål samt industriell tillverkning av dem Keramik-, porslins-, stengods- och fajansföremål samt industriell tillverkning av och handel med dem. Keramiska plattor och rör Hit också cement- och betongindustri samt industriell tillverkning av murbruk, gips, lera, tegel och kalk Glasbruks, keramiska fabrikers o.dyl. produktkataloger 643.03 Glasbruks, keramiska fabrikers o.dyl. historia 643.09 @sv

Kelloteollisuus
type: Class
type: Concept
subclass of: URN:NBN:fi:au:hklj:681
alternative label: Ajanmittaus, kellot (681.1)
alternative label: Ajanottolaitteet (681.1)
alternative label: Antiikkiesineet, kellot (681.1)
alternative label: Aurinkokellot, kellot (681.1)
alternative label: Kaappikellot (681.1)
alternative label: Kaappikellot, kelloteollisuus (681.1)
alternative label: Kello- ja kultasepänliikkeet (681.1)
alternative label: Kello- ja kultasepänliikkeet, kelloliikkeet (681.1)
alternative label: Kelloliikkeet (681.1)
alternative label: Kellosepänliikkeet (681.1)
alternative label: Kellosepät, kellosepän työ (681.1)
alternative label: Kellot (681.1)
alternative label: Kellot, kellosepän työ, kelloteollisuus (681.1)
alternative label: Kelloteollisuus (681.1)
alternative label: Kronografit (681.1)
alternative label: Kronometrit (681.1)
alternative label: Kulta, kultakellot (681.1)
alternative label: Kulta- ja kelloliikkeet (681.1)
alternative label: Kulta- ja kelloliikkeet, kelloliikkeet (681.1)
alternative label: Kultakellot (681.1)
alternative label: Käyttövarmuus, kellot (681.1)
alternative label: Mittaus, ajanmittaus, kellot (681.1)
alternative label: Nestekidenäytöt, kellot (681.1)
alternative label: Sepät, kellosepän työ (681.1)
alternative label: Toimintavarmuus, kellot (681.1)
alternative label: Valkokulta, kultakellot (681.1)
alternative label: Antikviteter, klockor (681.1) @sv
alternative label: Driftsäkerhet, klockor (681.1) @sv
alternative label: Flytkristallskärmar, klockor (681.1) @sv
alternative label: Funktionssäkerhet , klockor (681.1) @sv
alternative label: Golvur (681.1) @sv
alternative label: Golvur, urindustri (681.1) @sv
alternative label: Guld, guldklockor (681.1) @sv
alternative label: Guld- och uraffärer (681.1) @sv
alternative label: Guld- och uraffärer, ursmedsaffärer (681.1) @sv
alternative label: Guldur (681.1) @sv
alternative label: Klockor (681.1) @sv
alternative label: Klockor, urmakarens arbete, klockindustri (681.1) @sv
alternative label: Kronografer (681.1) @sv
alternative label: Kronometrar (681.1) @sv
alternative label: Mätning, tidmätning, klockor (681.1) @sv
alternative label: Smeder, urmakarens arbete (681.1) @sv
alternative label: Solur, klockor (681.1) @sv
alternative label: Tidmätning, klockor (681.1) @sv
alternative label: Tidtagarapparater (681.1) @sv
alternative label: Ur- och guldsmedsbutiker (681.1) @sv
alternative label: Ur- och guldsmedsbutiker, urmakeriaffärer (681.1) @sv
alternative label: Urindustri (681.1) @sv
alternative label: Urmakare, urmakarens arbete (681.1) @sv
alternative label: Urmakeriaffärer (681.1) @sv
alternative label: Urmakerier (681.1) @sv
alternative label: Vitt guld, guldklockor (681.1) @sv
broader: URN:NBN:fi:au:hklj:681
in scheme: URN:NBN:fi:au:hklj:
notation: 681.1
preferred label: Watchmaking @en
preferred label: Urindustri @sv
related: Ajanlasku
related: Kokeellinen fysiikka
related: Kodin korjaustöiden oppaat
related: URN:NBN:fi:au:hklj:760
related: Antiikkiesineiden keräily
related: Taideteollisuuden historia
related: Kulta- ja hopeasepäntaide. Korutaide
related: URN:NBN:fi:au:hklj:798
scope note: Kellojen valmistus teollisesti ja käsityönä Kellosepän työ. Kellosepäntaide. Kelloteollisuus. Kellokauppa Rannekellot. Taskukellot. Pöytäkellot. Herätyskellot Seinäkellot. Käkikellot. Kaappikellot Kellot antiikkiesineinä ja taideteollisuuden tuotteina Jos teos koskee sekä kello- että kultasepän työtä, on etusija luokalla 681.1
scope note: Tillverkning av ur som handarbete eller på industriell väg Urmakarens arbete. Urmakeri. Urindustri. Handel med ur Armbandsur. Fickur. Bordsur. Väckarklockor Väggklockor. Gökur. Golvur Klockor som antikviteter och konstindustriella produkter Om verket handlar om både urmakarens och guldsmedens arbete ges företräde åt klass 681.1 @sv

Yhdistykset. Laitokset. Kokoukset
type: Class
type: Concept
subclass of: URN:NBN:fi:au:hklj:700
alternative label: Laitokset, taidelaitokset (706)
alternative label: Taideseurat (706)
alternative label: Taideyhdistykset (706)
alternative label: Taiteilijaseurat (706)
alternative label: Teokset, taiteilijoiden teosluettelot (703 ... 776.03)
alternative label: Institutioner, inrättningar, konstinstitutioner (706) @sv
alternative label: Konstföreningar (706) @sv
alternative label: Konstklubbar (706) @sv
alternative label: Konstnärsföreningar (706) @sv
alternative label: Verk, konstnärers opusförteckningar (703 ... 776.03) @sv
broader: URN:NBN:fi:au:hklj:700
in scheme: URN:NBN:fi:au:hklj:
notation: 706
preferred label: Associations. Institutions. Meetings @en
preferred label: Organisationer. Institutioner. Möten @sv
related: Symbolit. Koodit. Merkkijärjestelmät
related: URN:NBN:fi:au:hklj:010
related: Yleisbibliografiat. Kansallisbibliografiat
related: Kustantajien ja kirjakauppojen luettelot
related: Erikoisalojen bibliografiat
related: Taiteet. Liikunta
related: Paikallisbibliografiat. Henkilöbibliografiat
scope note: Taiteita koskevat yleiset yhdistykset, laitokset ja kokoukset Eri taiteenaloja koskevat yhdistykset, laitokset ja kokoukset alan mukaisessa luokassa
scope note: Allmänna organisationer, institutioner och möten som rör konst Allmänna organisationer, institutioner och möten som rör enskilda konstarter klassificeras enligt konstart @sv

Taidekauppa
type: Class
type: Concept
subclass of: Kokoomateokset
alternative label: Aitous, taidekauppa (708.6)
alternative label: Aitous, taideväärennökset (708.6)
alternative label: Arvoesineet, taiteen keräily (708.6)
alternative label: Autenttisuus, taidekauppa (708.6)
alternative label: Autenttisuus, taideväärennökset (708.6)
alternative label: Galleriat (708.6)
alternative label: Galleristit (708.6)
alternative label: Harrastukset, taiteen keräily (708.6)
alternative label: Huutokauppa, taidehuutokauppa (708.6)
alternative label: Hyvä maku, taiteen keräily (708.6)
alternative label: Jäljennökset, taide (708.6)
alternative label: Kehykset, taideteokset (708.6)
alternative label: Kehystys (708.6)
alternative label: Keräily, taide (708.6)
alternative label: Kopiointi, taideväärennökset (708.6)
alternative label: Lahjoittajat, taidekauppa (708.6)
alternative label: Mesenaatit, taidekauppa (708.6)
alternative label: Näyttelytilat, taidegalleriat (708.6)
alternative label: Plagiaatit, taide (708.6)
alternative label: Plagiointi, taide (708.6)
alternative label: Rahoittajat, taidekauppa (708.6)
alternative label: Sijoittajat, taidekauppa (708.6)
alternative label: Sijoitukset, taidekauppa (708.6)
alternative label: Sijoitustoiminta, taidekauppa (708.6)
alternative label: Taidegalleriat, taidekauppa (708.6)
alternative label: Taidegalleristit (708.6)
alternative label: Taidehankinnat (708.6)
alternative label: Taideharrastukset, taiteen keräily (708.6)
alternative label: Taidehuutokauppa (708.6)
alternative label: Taidejäljennökset (708.6)
alternative label: Taidekauppa (708.6)
alternative label: Taideväärennökset (708.6)
alternative label: Taiteen keräily (708.6)
alternative label: Taulut, kehystäminen (708.6)
alternative label: Tekijyys, taidekauppa (708.6)
alternative label: Tekijyys, taideväärennökset (708.6)
alternative label: Väärennökset, taidekauppa (708.6)
alternative label: Auktion, konstauktion (708.6) @sv
alternative label: Autenticitet, konstförfalskningar (708.6) @sv
alternative label: Autenticitet, konsthandel (708.6) @sv
alternative label: Donatorer, konsthandel (708.6) @sv
alternative label: Finansiärer, konsthandel (708.6) @sv
alternative label: Förfalskningar, konsthandel (708.6) @sv
alternative label: Gallerier (708.6) @sv
alternative label: Gallerister (708.6) @sv
alternative label: God smak, konstsamlande (708.6) @sv
alternative label: Hobbyer, konstsamlande (708.6) @sv
alternative label: Inramning (708.6) @sv
alternative label: Investerare, konsthandel (708.6) @sv
alternative label: Konstanskaffningar (708.6) @sv
alternative label: Konstauktioner (708.6) @sv
alternative label: Konstförfalskningar (708.6) @sv
alternative label: Konstgallerier, konsthandel (708.6) @sv
alternative label: Konstgallerister (708.6) @sv
alternative label: Konsthandel (708.6) @sv
alternative label: Konstintressen, konstsamlande (708.6) @sv
alternative label: Konstreproduktioner (708.6) @sv
alternative label: Konstsamlande (708.6) @sv
alternative label: Kopiering, reproducering, konstförfalskningar (708.6) @sv
alternative label: Mecenater, konsthandel (708.6) @sv
alternative label: Placeringar, konsthandel (708.6) @sv
alternative label: Placeringsverksamhet, konsthandel (708.6) @sv
alternative label: Plagiat, konst (708.6) @sv
alternative label: Plagiering, konst (708.6) @sv
alternative label: Ramar, konstverk (708.6) @sv
broader: Kokoomateokset
in scheme: URN:NBN:fi:au:hklj:
notation: 708.6
related: URN:NBN:fi:au:hklj:061
related: URN:NBN:fi:au:hklj:063
related: URN:NBN:fi:au:hklj:675
related: Museot. Arkistot. Kokoelmat. Näyttelyt
related: URN:NBN:fi:au:hklj:741
related: Antiikkiesineiden keräily
related: URN:NBN:fi:au:hklj:798
scope note: Taidekauppa ja taiteen keräily yleensä Taide sijoituskohteena, taiteen rahallinen arvo yleensä Taidegalleriatoiminta ja taidehuutokaupat yleensä Taidekaupat. Kehystämöt. Kehystämisen tekniikka Taiteilijatarvikkeiden kauppa Taideväärennökset taiteen alasta riippumatta Eri taiteenaloja koskeva kauppa ja keräily alan mukaisessa luokassa
scope note: Konsthandel och konstsamlande i allmänhet Konst som placeringsobjekt, konstverks finansiella värde i allmänhet Konstgallerier och konstauktioner i allmänhet Konstaffärer. Ramateljéer. Inramningsteknik Affärer för konstnärstillbehör Konstförfalskningar oberoende av konstart Handel och samlarverksamhet som rör enskilda konstarter klassificeras enligt konstart @sv

Etelä-Eurooppa
type: Class
type: Concept
subclass of: URN:NBN:fi:au:hklj:720.9
alternative label: Jugoslavian alue, arkkitehtuuri (720.94)
alternative label: Kreikka, arkkitehtuuri, nykyaika (720.94)
alternative label: Portugali, arkkitehtuuri (720.94)
alternative label: Serbia, arkkitehtuuri (720.94)
alternative label: Grekland, arkitektur, nutiden (720.94) @sv
alternative label: Jugoslaviens område, arkitektur (720.94) @sv
alternative label: Portugal, arkitektur (720.94) @sv
alternative label: Serbien, arkitektur (720.94) @sv
broader: URN:NBN:fi:au:hklj:720.9
in scheme: URN:NBN:fi:au:hklj:
narrower: Italia
narrower: Espanja
notation: 720.94
preferred label: Southern Europe @en
preferred label: Sydeuropa @sv
related: URN:NBN:fi:au:hklj:709
related: Arkkitehtuurikilpailut. Arkkitehtuurinäyttelyt. Arkkitehtuuripalkinnot
related: Vanhan ajan arkkitehtuuri. Euroopan ulkopuolisten vanhojen kulttuurien arkkitehtuuri
related: URN:NBN:fi:au:hklj:749.1
scope note: Portugali. Malta. Balkanin niemimaa. Kreikka. Bulgaria. Albania. Bosnia ja Hertsegovina. Kroatia. Makedonia. Serbia ja Montenegro. Slovenia
scope note: Portugal. Malta. Balkanhalvön. Grekland. Bulgarien. Albanien. Bosnien-Hercegovina. Kroatien. Makedonien. Serbien och Montenegro. Slovenien @sv

Esihistoriallisen ajan kuvanveistotaide
type: Class
type: Concept
subclass of: URN:NBN:fi:au:hklj:730.9
alternative label: Esihistoriallinen taide, kuvanveisto (730.902)
alternative label: Förhistorisk konst, skulptur (730.902) @sv
broader: URN:NBN:fi:au:hklj:730.9
in scheme: URN:NBN:fi:au:hklj:
notation: 730.902
preferred label: Prehistoric sculpture @en
preferred label: Förhistoriska tidens skulptur @sv
related: URN:NBN:fi:au:hklj:709
related: Esihistoriallinen taide
related: Eurooppa
related: Aasia
related: Afrikka
related: Kuvanveistotaiteen materiaalit ja tekniikka
related: URN:NBN:fi:au:hklj:739
related: URN:NBN:fi:au:hklj:742
scope note: Maasta tai maanosasta riippumatta esihistoriallinen kuvanveistotaide
scope note: Förhistorisk skulptur i allmänhet oavsett land eller världsdel @sv

Renessanssin maalaustaide
type: Class
type: Concept
subclass of: URN:NBN:fi:au:hklj:740.9
alternative label: Manierismi, maalaustaide (740.905)
alternative label: Renessanssi, maalaustaide (740.905)
alternative label: Täysrenessanssi, maalaustaide (740.905)
alternative label: Varhaisrenessanssi, maalaustaide (740.905)
alternative label: Högrenässansen, målarkonst (740.905) @sv
alternative label: Manierism, målarkonst (740.905) @sv
alternative label: Renässans, målarkonst (740.905) @sv
alternative label: Ungrenässansen, målarkonst (740.905) @sv
broader: URN:NBN:fi:au:hklj:740.9
in scheme: URN:NBN:fi:au:hklj:
notation: 740.905
preferred label: Renaissance painting @en
preferred label: Renässansens målarkonst @sv
related: URN:NBN:fi:au:hklj:709
related: Renessanssin taidehistoria
related: URN:NBN:fi:au:hklj:741
related: URN:NBN:fi:au:hklj:741.1
related: URN:NBN:fi:au:hklj:741.2
related: URN:NBN:fi:au:hklj:742
related: URN:NBN:fi:au:hklj:749
related: URN:NBN:fi:au:hklj:749.1
scope note: Euroopan renessanssin maalaustaide yleensä Tietyn maan renessanssin maalaustaidetta tai taidemaalareita koskevat teokset maan mukaisessa luokassa
scope note: Europeiska renässansens målarkonst i allmänhet Verk som handlar om renässansens målarkonst eller målare i ett bestämt land klassificeras enligt land @sv

Suomi
type: Class
type: Concept
subclass of: Pohjoismaat. Baltian maat
alternative label: Karelianismi, maalaustaide (740.921)
alternative label: Maalaustaide, henkilöhistoria, Suomi (740.921)
alternative label: Maalaustaide, historia, Suomi (740.921)
alternative label: Suomi, maalaustaide (740.921)
alternative label: Finland, målarkonst (740.921) @sv
alternative label: Karelianism, målarkonst (740.921) @sv
alternative label: Målarkonst, historia, Finland (740.921) @sv
alternative label: Målarkonst, personhistoria, Finland (740.921) @sv
broader: Pohjoismaat. Baltian maat
in scheme: URN:NBN:fi:au:hklj:
notation: 740.921
preferred label: Finland @en
related: URN:NBN:fi:au:hklj:709
related: Suomen yleinen taidehistoria
related: URN:NBN:fi:au:hklj:741
related: URN:NBN:fi:au:hklj:741.1
related: URN:NBN:fi:au:hklj:741.2
related: URN:NBN:fi:au:hklj:742
related: URN:NBN:fi:au:hklj:749
related: URN:NBN:fi:au:hklj:749.1

Alankomaat. Belgia. Luxemburg
type: Class
type: Concept
subclass of: Länsi- ja Keski-Eurooppa
alternative label: Alankomaat, maalaustaide (740.932)
alternative label: Alankomaiset koulukunnat, maalaustaide (740.932)
alternative label: Belgia, maalaustaide (740.932)
alternative label: Flaamilaiset koulukunnat, maalaustaide (740.932)
alternative label: Hollanti, maalaustaide (740.932)
alternative label: Irlanti, maalaustaide (740.932)
alternative label: Laatukuvat, Alankomaiden maalaustaide (740.932)
alternative label: Belgien, målarkonst (740.932) @sv
alternative label: Flamländska skolorna, målarkonst (740.932) @sv
alternative label: Genrebilder, nederländsk målarkonst (740.932) @sv
alternative label: Holland, målarkonst (740.932) @sv
alternative label: Irland, målarkonst (740.932) @sv
alternative label: Nederländerna, målarkonst (740.932) @sv
alternative label: Nederländska skolorna, målarkonst (740.932) @sv
broader: Länsi- ja Keski-Eurooppa
in scheme: URN:NBN:fi:au:hklj:
notation: 740.932
preferred label: The Netherlands. Belgium. Luxembourg @en
preferred label: Nederländerna. Belgien. Luxemburg @sv
related: URN:NBN:fi:au:hklj:709
related: URN:NBN:fi:au:hklj:741
related: URN:NBN:fi:au:hklj:741.1
related: URN:NBN:fi:au:hklj:741.2
related: URN:NBN:fi:au:hklj:742
related: URN:NBN:fi:au:hklj:749
related: URN:NBN:fi:au:hklj:749.1

Ranska
type: Class
type: Concept
subclass of: Länsi- ja Keski-Eurooppa
alternative label: Impressionismi, maalaustaide, Ranska (740.933)
alternative label: Ranska, maalaustaide (740.933)
alternative label: Frankrike, målarkonst (740.933) @sv
alternative label: Impressionism, målarkonst, Frankrike (740.933) @sv
broader: Länsi- ja Keski-Eurooppa
in scheme: URN:NBN:fi:au:hklj:
notation: 740.933
preferred label: France @en
preferred label: Frankrike @sv
related: URN:NBN:fi:au:hklj:709
related: URN:NBN:fi:au:hklj:741
related: URN:NBN:fi:au:hklj:741.1
related: URN:NBN:fi:au:hklj:741.2
related: URN:NBN:fi:au:hklj:742
related: URN:NBN:fi:au:hklj:749
related: URN:NBN:fi:au:hklj:749.1
scope note: Tässä myös Andorra ja Monaco
scope note: Hit också Andorra och Monaco @sv

Italia
type: Class
type: Concept
subclass of: Etelä-Eurooppa
alternative label: Italia, maalaustaide (740.941)
alternative label: Italien, målarkonst (740.941) @sv
broader: Etelä-Eurooppa
in scheme: URN:NBN:fi:au:hklj:
notation: 740.941
preferred label: Italy @en
preferred label: Italien @sv
related: URN:NBN:fi:au:hklj:709
related: Vanhan ajan maalaustaide. Euroopan ulkopuolistenvanhojen kulttuurien maalaustaide
related: URN:NBN:fi:au:hklj:741
related: URN:NBN:fi:au:hklj:741.1
related: URN:NBN:fi:au:hklj:741.2
related: URN:NBN:fi:au:hklj:742
related: URN:NBN:fi:au:hklj:749
related: URN:NBN:fi:au:hklj:749.1
scope note: Tässä myös San Marino ja Vatikaanivaltio
scope note: Hit också San Marino och Vatikanstaten @sv

Yhdysvallat
type: Class
type: Concept
subclass of: Amerikka
alternative label: USA, maalaustaide (740.981)
alternative label: Yhdysvallat, maalaustaide (740.981)
alternative label: Förenta staterna, målarkonst (740.981) @sv
alternative label: USA, målarkonst (740.981) @sv
broader: Amerikka
in scheme: URN:NBN:fi:au:hklj:
notation: 740.981
preferred label: United States of America @en
preferred label: Förenta staterna @sv
related: URN:NBN:fi:au:hklj:709
related: Alkuperäiskansojen maalaustaide
related: URN:NBN:fi:au:hklj:741
related: URN:NBN:fi:au:hklj:741.1
related: URN:NBN:fi:au:hklj:741.2
related: URN:NBN:fi:au:hklj:742
related: URN:NBN:fi:au:hklj:749
related: URN:NBN:fi:au:hklj:749.1

Australia. Oseania
type: Class
type: Concept
subclass of: URN:NBN:fi:au:hklj:740.9
alternative label: Australia, maalaustaide (740.99)
alternative label: Oseania, maalaustaide, moderni (740.99)
alternative label: Australien, målarkonst (740.99) @sv
alternative label: Oceanien, målarkonst, modern (740.99) @sv
broader: URN:NBN:fi:au:hklj:740.9
in scheme: URN:NBN:fi:au:hklj:
notation: 740.99
preferred label: Australia. Oceania @en
preferred label: Australien. Oceanien @sv
related: URN:NBN:fi:au:hklj:709
related: Alkuperäiskansojen maalaustaide
related: URN:NBN:fi:au:hklj:741
related: URN:NBN:fi:au:hklj:741.1
related: URN:NBN:fi:au:hklj:741.2
related: URN:NBN:fi:au:hklj:742
related: URN:NBN:fi:au:hklj:749
related: URN:NBN:fi:au:hklj:749.1
scope note: Australian ja Oseanian nykyajan maalaustaide
scope note: Australiens och Oceaniens nutida målarkonst @sv

Ikonimaalaus
type: Class
type: Concept
subclass of: URN:NBN:fi:au:hklj:742
alternative label: Entistäminen, ikonit (742.1)
alternative label: Ikonimaalaus (742.1)
alternative label: Ikonit, maalaustaide (742.1)
alternative label: Ikonitaide (742.1)
alternative label: Ikonostaasit, maalaustaide (742.1)
alternative label: Kirkkotaide, ikonit (742.1)
alternative label: Konservointi, ikonit (742.1)
alternative label: Kristillinen taide, ikonit (742.1)
alternative label: Kuvaseinät, maalaustaide (742.1)
alternative label: Maalaukset, ikonit (742.1)
alternative label: Maalaustaide, ikonimaalaus (742.1)
alternative label: Restaurointi, ikonit (742.1)
alternative label: Taidemaalarit, ikonimaalarit (742.1)
alternative label: Uskonnollinen taide, ikonitaide (742.1)
alternative label: Ikoner, målarkonst (742.1) @sv
alternative label: Ikonkonst (742.1) @sv
alternative label: Ikonmåleri (742.1) @sv
alternative label: Ikonmålning (742.1) @sv
alternative label: Ikonostaser, målarkonst (742.1) @sv
alternative label: Konservering, ikoner (742.1) @sv
alternative label: Kristen konst, ikoner (742.1) @sv
alternative label: Kyrklig konst, ikoner (742.1) @sv
alternative label: Målare, konstnärer, ikonmålare (742.1) @sv
alternative label: Målarkonst, ikonmåleri (742.1) @sv
alternative label: Målningar, ikoner (742.1) @sv
alternative label: Religiös konst, ikonkonst (742.1) @sv
alternative label: Restauration, ikoner (742.1) @sv
alternative label: Restaurering, ikoner (742.1) @sv
broader: URN:NBN:fi:au:hklj:742
in scheme: URN:NBN:fi:au:hklj:
notation: 742.1
preferred label: Icon painting @en
preferred label: Ikonmåleri @sv
related: Kirkolliset esineet ja symbolit
related: Maalaustaiteen teoria, estetiikka ja filosofia
related: URN:NBN:fi:au:hklj:740.9
related: URN:NBN:fi:au:hklj:741
related: URN:NBN:fi:au:hklj:741.1
related: URN:NBN:fi:au:hklj:741.2
related: URN:NBN:fi:au:hklj:749
related: URN:NBN:fi:au:hklj:749.1
scope note: Ikonit ja ikonimaalaus sekä niiden historia, henkilöhistoria ja estetiikka maasta ja aikakaudesta riippumatta Ikonimaalauksen materiaalit ja tekniikka. Ikonimaalauksen käytännön oppaat
scope note: Ikoner och ikonmåleri samt deras historia, personhistoria och estetik oavsett land eller tidsperiod Ikonmåleriets material och tekniker. Praktiska handböcker i ikonmåleri @sv

Nukketeatteri
type: Class
type: Concept
subclass of: URN:NBN:fi:au:hklj:770
alternative label: Käsinuket, nukketeatteri (774)
alternative label: Marionettiteatterit (774)
alternative label: Nukkenäytelmät, nukketeatterinäytelmät (774)
alternative label: Nukketeatteri (774)
alternative label: Nukketeatterinäytelmät (774)
alternative label: Nukketeatterit (774)
alternative label: Sorminuket, nukketeatteri (774)
alternative label: Teatteri, nukketeatteri (774)
alternative label: Teatterimuodot, nukketeatteri (774)
alternative label: Dockskådespel, dockteaterpjäser (774) @sv
alternative label: Dockteater (774) @sv
alternative label: Dockteaterpjäser (774) @sv
alternative label: Dockteatrar (774) @sv
alternative label: Fingerdockor, dockteater (774) @sv
alternative label: Handdockor, dockteater (774) @sv
alternative label: Marionetteatrar (774) @sv
alternative label: Teater, dockteater (774) @sv
alternative label: Teaterformer, dockteater (774) @sv
broader: URN:NBN:fi:au:hklj:770
in scheme: URN:NBN:fi:au:hklj:
notation: 774
preferred label: Puppet theatre @en
preferred label: Dockteater @sv
related: Teatteri- ja näyttämötaiteen teoria, estetiikka ja filosofia
related: Harrastajateatteri
related: URN:NBN:fi:au:hklj:770.9
related: Teatterityö
related: Teatteritekniikka
related: Teatterimuodot
related: Elokuva. Elokuvataide
related: Leikkikalut
scope note: Nukketeatteri, sen historia, henkilöhistoria, tekniikka ja estetiikka Nukketeatterioppaat. Nukketeatterinäytelmät
scope note: Dockteater, dess historia, personhistoria, tekniker och estetik Handböcker i dockteater. Dockteaterskådespel @sv

Koulut, harjoituskappaleet ja -etydit
type: Class
type: Concept
subclass of: Piano
alternative label: Piano, koulut ja etydit (786.111)
alternative label: Piano, skolor och etyder (786.111) @sv
broader: Piano
in scheme: URN:NBN:fi:au:hklj:
notation: 786.111
preferred label: Courses, practice pieces and studies @en
preferred label: Skolor, övningsstycken och etyder @sv
related: URN:NBN:fi:au:hklj:627.7531
related: URN:NBN:fi:au:hklj:681
related: URN:NBN:fi:au:hklj:781.5
related: URN:NBN:fi:au:hklj:782.6
related: URN:NBN:fi:au:hklj:785
related: URN:NBN:fi:au:hklj:785.11
related: URN:NBN:fi:au:hklj:788
related: URN:NBN:fi:au:hklj:789

Koulut, harjoituskappaleet ja -etydit
type: Class
type: Concept
subclass of: Cembalo
alternative label: Cembalo, koulut ja etydit (786.121)
alternative label: Kielflügel, koulut ja etydit (786.121)
alternative label: Cembalo, skolor och etyder (786.121) @sv
alternative label: Kielflügel, skolor och etyder (786.121) @sv
broader: Cembalo
in scheme: URN:NBN:fi:au:hklj:
notation: 786.121
preferred label: Courses, practice pieces and studies @en
preferred label: Skolor, övningsstycken och etyder @sv
related: URN:NBN:fi:au:hklj:627.7531
related: URN:NBN:fi:au:hklj:681
related: URN:NBN:fi:au:hklj:781.5
related: URN:NBN:fi:au:hklj:782.6
related: URN:NBN:fi:au:hklj:785
related: URN:NBN:fi:au:hklj:785.11
related: URN:NBN:fi:au:hklj:788
related: URN:NBN:fi:au:hklj:789

Koulut, harjoituskappaleet ja -etydit
type: Class
type: Concept
subclass of: Sähköurut ja muut sähköiset kosketinsoittimet
broader: Sähköurut ja muut sähköiset kosketinsoittimet
in scheme: URN:NBN:fi:au:hklj:
notation: 786.141
preferred label: Courses, practice pieces and studies @en
preferred label: Skolor, övningsstycken och etyder @sv
related: URN:NBN:fi:au:hklj:627.7531
related: URN:NBN:fi:au:hklj:681
related: URN:NBN:fi:au:hklj:781.5
related: URN:NBN:fi:au:hklj:782.6
related: URN:NBN:fi:au:hklj:785
related: URN:NBN:fi:au:hklj:785.11
related: URN:NBN:fi:au:hklj:788
related: URN:NBN:fi:au:hklj:789

Koulut, harjoituskappaleet ja -etydit
type: Class
type: Concept
subclass of: Harmoni
broader: Harmoni
in scheme: URN:NBN:fi:au:hklj:
notation: 786.151
preferred label: Courses, practice pieces and studies @en
preferred label: Skolor, övningsstycken och etyder @sv
related: URN:NBN:fi:au:hklj:627.7531
related: URN:NBN:fi:au:hklj:681
related: URN:NBN:fi:au:hklj:781.5
related: URN:NBN:fi:au:hklj:782.6
related: URN:NBN:fi:au:hklj:785
related: URN:NBN:fi:au:hklj:785.11
related: URN:NBN:fi:au:hklj:788
related: URN:NBN:fi:au:hklj:789

Koulut, harjoituskappaleet ja -etydit
type: Class
type: Concept
subclass of: Harmonikka
broader: Harmonikka
in scheme: URN:NBN:fi:au:hklj:
notation: 786.161
preferred label: Courses, practice pieces and studies @en
preferred label: Skolor, övningsstycken och etyder @sv
related: URN:NBN:fi:au:hklj:627.7531
related: URN:NBN:fi:au:hklj:681
related: URN:NBN:fi:au:hklj:781.5
related: URN:NBN:fi:au:hklj:782.6
related: URN:NBN:fi:au:hklj:785
related: URN:NBN:fi:au:hklj:785.11
related: URN:NBN:fi:au:hklj:788
related: URN:NBN:fi:au:hklj:789

Koulut, harjoituskappaleet ja -etydit
type: Class
type: Concept
subclass of: Harppu
alternative label: Harppu, koulut ja etydit (786.211)
alternative label: Harpa, skolor och etyder (786.211) @sv
broader: Harppu
in scheme: URN:NBN:fi:au:hklj:
notation: 786.211
preferred label: Courses, practice pieces and studies @en
preferred label: Skolor, övningsstycken och etyder @sv
related: URN:NBN:fi:au:hklj:627.7531
related: URN:NBN:fi:au:hklj:681
related: URN:NBN:fi:au:hklj:781.5
related: URN:NBN:fi:au:hklj:782.6
related: URN:NBN:fi:au:hklj:785
related: URN:NBN:fi:au:hklj:785.11
related: URN:NBN:fi:au:hklj:788
related: URN:NBN:fi:au:hklj:789

Koulut, harjoituskappaleet ja -etydit
type: Class
type: Concept
subclass of: Kantele
alternative label: Kantele, koulut ja etydit (786.221)
alternative label: Kantele, skolor och etyder (786.221) @sv
broader: Kantele
in scheme: URN:NBN:fi:au:hklj:
notation: 786.221
preferred label: Courses, practice pieces and studies @en
preferred label: Skolor, övningsstycken och etyder @sv
related: URN:NBN:fi:au:hklj:627.7531
related: URN:NBN:fi:au:hklj:681
related: URN:NBN:fi:au:hklj:781.5
related: URN:NBN:fi:au:hklj:782.6
related: URN:NBN:fi:au:hklj:785
related: URN:NBN:fi:au:hklj:785.11
related: URN:NBN:fi:au:hklj:788
related: URN:NBN:fi:au:hklj:789

Koulut, harjoituskappaleet ja -etydit
type: Class
type: Concept
subclass of: Kitara
alternative label: Akustinen kitara, koulut ja etydit (786.231)
alternative label: Kitara, koulut ja etydit (786.231)
alternative label: Akustisk gitarr, skolor och etyder (786.231) @sv
alternative label: Gitarr, skolor och etyder (786.231) @sv
broader: Kitara
in scheme: URN:NBN:fi:au:hklj:
notation: 786.231
preferred label: Courses, practice pieces and studies @en
preferred label: Skolor, övningsstycken och etyder @sv
related: URN:NBN:fi:au:hklj:627.7531
related: URN:NBN:fi:au:hklj:681
related: URN:NBN:fi:au:hklj:781.5
related: URN:NBN:fi:au:hklj:782.6
related: URN:NBN:fi:au:hklj:785
related: URN:NBN:fi:au:hklj:785.11
related: URN:NBN:fi:au:hklj:788
related: URN:NBN:fi:au:hklj:789

Koulut, harjoituskappaleet ja -etydit
type: Class
type: Concept
subclass of: Luuttu
broader: Luuttu
in scheme: URN:NBN:fi:au:hklj:
notation: 786.251
preferred label: Courses, practice pieces and studies @en
preferred label: Skolor, övningsstycken och etyder @sv
related: URN:NBN:fi:au:hklj:627.7531
related: URN:NBN:fi:au:hklj:681
related: URN:NBN:fi:au:hklj:781.5
related: URN:NBN:fi:au:hklj:782.6
related: URN:NBN:fi:au:hklj:785
related: URN:NBN:fi:au:hklj:785.11
related: URN:NBN:fi:au:hklj:788
related: URN:NBN:fi:au:hklj:789

Koulut, harjoituskappaleet ja -etydit
type: Class
type: Concept
subclass of: Mandoliini
broader: Mandoliini
in scheme: URN:NBN:fi:au:hklj:
notation: 786.261
preferred label: Courses, practice pieces and studies @en
preferred label: Skolor, övningsstycken och etyder @sv
related: URN:NBN:fi:au:hklj:627.7531
related: URN:NBN:fi:au:hklj:681
related: URN:NBN:fi:au:hklj:781.5
related: URN:NBN:fi:au:hklj:782.6
related: URN:NBN:fi:au:hklj:785
related: URN:NBN:fi:au:hklj:785.11
related: URN:NBN:fi:au:hklj:788
related: URN:NBN:fi:au:hklj:789

Koulut, harjoituskappaleet ja -etydit
type: Class
type: Concept
subclass of: Balalaikka
alternative label: Balalaikka, koulut ja etydit (786.271)
alternative label: Balalajka, skolor och etyder (786.271) @sv
broader: Balalaikka
in scheme: URN:NBN:fi:au:hklj:
notation: 786.271
preferred label: Courses, practice pieces and studies @en
preferred label: Skolor, övningsstycken och etyder @sv
related: URN:NBN:fi:au:hklj:627.7531
related: URN:NBN:fi:au:hklj:681
related: URN:NBN:fi:au:hklj:781.5
related: URN:NBN:fi:au:hklj:782.6
related: URN:NBN:fi:au:hklj:785
related: URN:NBN:fi:au:hklj:785.11
related: URN:NBN:fi:au:hklj:788
related: URN:NBN:fi:au:hklj:789

Koulut, harjoituskappaleet ja -etydit
type: Class
type: Concept
subclass of: Viulu
alternative label: Viulu, koulut ja etydit (786.311)
broader: Viulu
in scheme: URN:NBN:fi:au:hklj:
notation: 786.311
preferred label: Courses, practice pieces and studies @en
preferred label: Skolor, övningsstycken och etyder @sv
related: URN:NBN:fi:au:hklj:627.7531
related: URN:NBN:fi:au:hklj:681
related: URN:NBN:fi:au:hklj:781.5
related: URN:NBN:fi:au:hklj:782.6
related: URN:NBN:fi:au:hklj:785
related: URN:NBN:fi:au:hklj:785.11
related: URN:NBN:fi:au:hklj:788
related: URN:NBN:fi:au:hklj:789

Sooloviulu
type: Class
type: Concept
subclass of: Viulu
alternative label: Viulu, soolot (786.312)
alternative label: Violin, solonummer (786.312) @sv
broader: Viulu
in scheme: URN:NBN:fi:au:hklj:
notation: 786.312
preferred label: Solo violin @en
preferred label: Soloviolin @sv
related: URN:NBN:fi:au:hklj:627.7531
related: URN:NBN:fi:au:hklj:681
related: URN:NBN:fi:au:hklj:781.5
related: URN:NBN:fi:au:hklj:782.6
related: URN:NBN:fi:au:hklj:785
related: URN:NBN:fi:au:hklj:785.11
related: URN:NBN:fi:au:hklj:788
related: URN:NBN:fi:au:hklj:789

Koulut, harjoituskappaleet ja -etydit
type: Class
type: Concept
subclass of: Alttoviulu
alternative label: Alttoviulu, koulut ja etydit (786.321)
alternative label: Viola, koulut ja etydit (786.321)
alternative label: Altviolin, skolor och etyder (786.321) @sv
alternative label: Viola, skolor och etyder (786.321) @sv
broader: Alttoviulu
in scheme: URN:NBN:fi:au:hklj:
notation: 786.321
preferred label: Courses, practice pieces and studies @en
preferred label: Skolor, övningsstycken och etyder @sv
related: URN:NBN:fi:au:hklj:627.7531
related: URN:NBN:fi:au:hklj:681
related: URN:NBN:fi:au:hklj:781.5
related: URN:NBN:fi:au:hklj:782.6
related: URN:NBN:fi:au:hklj:785
related: URN:NBN:fi:au:hklj:785.11
related: URN:NBN:fi:au:hklj:788
related: URN:NBN:fi:au:hklj:789

Sooloalttoviulu
type: Class
type: Concept
subclass of: Alttoviulu
alternative label: Alttoviulu, soolot (786.322)
alternative label: Viola, soolot (786.322)
alternative label: Altviolin, solonummer (786.322) @sv
alternative label: Viola, solonummer (786.322) @sv
broader: Alttoviulu
in scheme: URN:NBN:fi:au:hklj:
notation: 786.322
preferred label: Solo viola @en
preferred label: Soloaltviolin @sv
related: URN:NBN:fi:au:hklj:627.7531
related: URN:NBN:fi:au:hklj:681
related: URN:NBN:fi:au:hklj:781.5
related: URN:NBN:fi:au:hklj:782.6
related: URN:NBN:fi:au:hklj:785
related: URN:NBN:fi:au:hklj:785.11
related: URN:NBN:fi:au:hklj:788
related: URN:NBN:fi:au:hklj:789

Koulut, harjoituskappaleet ja -etydit
type: Class
type: Concept
subclass of: Sello
alternative label: Sello, koulut ja etydit (786.331)
alternative label: Cello, skolor och etyder (786.331) @sv
broader: Sello
in scheme: URN:NBN:fi:au:hklj:
notation: 786.331
preferred label: Courses, practice pieces and studies @en
preferred label: Skolor, övningsstycken och etyder @sv
related: URN:NBN:fi:au:hklj:627.7531
related: URN:NBN:fi:au:hklj:681
related: URN:NBN:fi:au:hklj:781.5
related: URN:NBN:fi:au:hklj:782.6
related: URN:NBN:fi:au:hklj:785
related: URN:NBN:fi:au:hklj:785.11
related: URN:NBN:fi:au:hklj:788
related: URN:NBN:fi:au:hklj:789

Soolosello
type: Class
type: Concept
subclass of: Sello
alternative label: Sello, soolot (786.332)
alternative label: Cello, solonummer (786.332) @sv
broader: Sello
in scheme: URN:NBN:fi:au:hklj:
notation: 786.332
preferred label: Solo cello @en
preferred label: Solocello @sv
related: URN:NBN:fi:au:hklj:627.7531
related: URN:NBN:fi:au:hklj:681
related: URN:NBN:fi:au:hklj:781.5
related: URN:NBN:fi:au:hklj:782.6
related: URN:NBN:fi:au:hklj:785
related: URN:NBN:fi:au:hklj:785.11
related: URN:NBN:fi:au:hklj:788
related: URN:NBN:fi:au:hklj:789

Koulut, harjoituskappaleet ja -etydit
type: Class
type: Concept
subclass of: Kontrabasso
alternative label: Kontrabasso, koulut ja etydit (786.341)
alternative label: Kontrabas, skolor och etyder (786.341) @sv
broader: Kontrabasso
in scheme: URN:NBN:fi:au:hklj:
notation: 786.341
preferred label: Courses, practice pieces and studies @en
preferred label: Skolor, övningsstycken och etyder @sv
related: URN:NBN:fi:au:hklj:627.7531
related: URN:NBN:fi:au:hklj:681
related: URN:NBN:fi:au:hklj:781.5
related: URN:NBN:fi:au:hklj:782.6
related: URN:NBN:fi:au:hklj:785
related: URN:NBN:fi:au:hklj:785.11
related: URN:NBN:fi:au:hklj:788
related: URN:NBN:fi:au:hklj:789

Soolokontrabasso
type: Class
type: Concept
subclass of: Kontrabasso
alternative label: Kontrabasso, soolot (786.342)
alternative label: Kontrabas, solonummer (786.342) @sv
broader: Kontrabasso
in scheme: URN:NBN:fi:au:hklj:
notation: 786.342
preferred label: Solo double bass @en
preferred label: Solokontrabas @sv
related: URN:NBN:fi:au:hklj:627.7531
related: URN:NBN:fi:au:hklj:681
related: URN:NBN:fi:au:hklj:781.5
related: URN:NBN:fi:au:hklj:782.6
related: URN:NBN:fi:au:hklj:785
related: URN:NBN:fi:au:hklj:785.11
related: URN:NBN:fi:au:hklj:788
related: URN:NBN:fi:au:hklj:789

Koulut, harjoituskappaleet ja -etydit
type: Class
type: Concept
subclass of: Huilu. Piccolo
alternative label: Huilu, koulut ja etydit (786.411)
alternative label: Flöjt, skolor och etyder (786.411) @sv
alternative label: Violin, skolor och etyder (786.411) @sv
broader: Huilu. Piccolo
in scheme: URN:NBN:fi:au:hklj:
notation: 786.411
preferred label: Courses, practice pieces and studies @en
preferred label: Skolor, övningsstycken och etyder @sv
related: URN:NBN:fi:au:hklj:627.7531
related: URN:NBN:fi:au:hklj:681
related: URN:NBN:fi:au:hklj:781.5
related: URN:NBN:fi:au:hklj:782.6
related: URN:NBN:fi:au:hklj:785
related: URN:NBN:fi:au:hklj:785.11
related: URN:NBN:fi:au:hklj:788
related: URN:NBN:fi:au:hklj:789

Soolohuilu
type: Class
type: Concept
subclass of: Huilu. Piccolo
alternative label: Huilu, soolot (786.412)
alternative label: Flöjt, solonummer (786.412) @sv
broader: Huilu. Piccolo
in scheme: URN:NBN:fi:au:hklj:
notation: 786.412
preferred label: Solo flute @en
preferred label: Soloflöjt @sv
related: URN:NBN:fi:au:hklj:627.7531
related: URN:NBN:fi:au:hklj:681
related: URN:NBN:fi:au:hklj:781.5
related: URN:NBN:fi:au:hklj:782.6
related: URN:NBN:fi:au:hklj:785
related: URN:NBN:fi:au:hklj:785.11
related: URN:NBN:fi:au:hklj:788
related: URN:NBN:fi:au:hklj:789

Koulut, harjoituskappaleet ja -etydit
type: Class
type: Concept
subclass of: Nokkahuilu
alternative label: Nokkahuilu, koulut ja etydit (786.421)
alternative label: Blockflöjt, skolor och etyder (786.421) @sv
broader: Nokkahuilu
in scheme: URN:NBN:fi:au:hklj:
notation: 786.421
preferred label: Courses, practice pieces and studies @en
preferred label: Skolor, övningsstycken och etyder @sv
related: URN:NBN:fi:au:hklj:627.7531
related: URN:NBN:fi:au:hklj:681
related: URN:NBN:fi:au:hklj:781.5
related: URN:NBN:fi:au:hklj:782.6
related: URN:NBN:fi:au:hklj:785
related: URN:NBN:fi:au:hklj:785.11
related: URN:NBN:fi:au:hklj:788
related: URN:NBN:fi:au:hklj:789

Soolonokkahuilu
type: Class
type: Concept
subclass of: Nokkahuilu
alternative label: Nokkahuilu, soolot (786.422)
alternative label: Blockflöjt, solonummer (786.422) @sv
broader: Nokkahuilu
in scheme: URN:NBN:fi:au:hklj:
notation: 786.422
preferred label: Solo recorder @en
preferred label: Soloblockflöjt @sv
related: URN:NBN:fi:au:hklj:627.7531
related: URN:NBN:fi:au:hklj:681
related: URN:NBN:fi:au:hklj:781.5
related: URN:NBN:fi:au:hklj:782.6
related: URN:NBN:fi:au:hklj:785
related: URN:NBN:fi:au:hklj:785.11
related: URN:NBN:fi:au:hklj:788
related: URN:NBN:fi:au:hklj:789

Koulut, harjoituskappaleet -etydit
type: Class
type: Concept
subclass of: Klarinetti
alternative label: Klarinetti, koulut ja etydit (786.431)
alternative label: Oboe, koulut ja etydit (786.431)
alternative label: Klarinett, skolor och etyder (786.431) @sv
alternative label: Oboe, skolor och etyder (786.431) @sv
broader: Klarinetti
in scheme: URN:NBN:fi:au:hklj:
notation: 786.431
preferred label: Courses, practice pieces and studies @en
preferred label: Skolor, övningsstycken och etyder @sv
related: URN:NBN:fi:au:hklj:627.7531
related: URN:NBN:fi:au:hklj:681
related: URN:NBN:fi:au:hklj:781.5
related: URN:NBN:fi:au:hklj:782.6
related: URN:NBN:fi:au:hklj:785
related: URN:NBN:fi:au:hklj:785.11
related: URN:NBN:fi:au:hklj:788
related: URN:NBN:fi:au:hklj:789

Sooloklarinetti
type: Class
type: Concept
subclass of: Klarinetti
alternative label: Klarinetti, soolot (786.432)
alternative label: Oboe, soolot (786.432)
alternative label: Klarinett, solonummer (786.432) @sv
alternative label: Oboe, solonummer (786.432) @sv
broader: Klarinetti
in scheme: URN:NBN:fi:au:hklj:
notation: 786.432
preferred label: Solo clarinet @en
preferred label: Soloklarinett @sv
related: URN:NBN:fi:au:hklj:627.7531
related: URN:NBN:fi:au:hklj:681
related: URN:NBN:fi:au:hklj:781.5
related: URN:NBN:fi:au:hklj:782.6
related: URN:NBN:fi:au:hklj:785
related: URN:NBN:fi:au:hklj:785.11
related: URN:NBN:fi:au:hklj:788
related: URN:NBN:fi:au:hklj:789

Koulut, harjoituskappaleet ja -etydit
type: Class
type: Concept
subclass of: Saksofoni
alternative label: Saksofoni, koulut ja etydit (786.441)
alternative label: Saxofon, skolor och etyder (786.441) @sv
broader: Saksofoni
in scheme: URN:NBN:fi:au:hklj:
notation: 786.441
preferred label: Courses, practice pieces and studies @en
preferred label: Skolor, övningsstycken och etyder @sv
related: URN:NBN:fi:au:hklj:627.7531
related: URN:NBN:fi:au:hklj:681
related: URN:NBN:fi:au:hklj:781.5
related: URN:NBN:fi:au:hklj:782.6
related: URN:NBN:fi:au:hklj:785
related: URN:NBN:fi:au:hklj:785.11
related: URN:NBN:fi:au:hklj:788
related: URN:NBN:fi:au:hklj:789

Soolosaksofoni
type: Class
type: Concept
subclass of: Saksofoni
alternative label: Saksofoni, soolot (786.442)
alternative label: Saxofon, solonummer (786.442) @sv
broader: Saksofoni
in scheme: URN:NBN:fi:au:hklj:
notation: 786.442
preferred label: Solo saxophone @en
preferred label: Solosaxofon @sv
related: URN:NBN:fi:au:hklj:627.7531
related: URN:NBN:fi:au:hklj:681
related: URN:NBN:fi:au:hklj:781.5
related: URN:NBN:fi:au:hklj:782.6
related: URN:NBN:fi:au:hklj:785
related: URN:NBN:fi:au:hklj:785.11
related: URN:NBN:fi:au:hklj:788
related: URN:NBN:fi:au:hklj:789

Koulut, harjoituskappaleet ja -etydit
type: Class
type: Concept
subclass of: Oboe. Englannintorvi
broader: Oboe. Englannintorvi
in scheme: URN:NBN:fi:au:hklj:
notation: 786.451
preferred label: Courses, practice pieces and studies @en
preferred label: Skolor, övningsstycken och etyder @sv
related: URN:NBN:fi:au:hklj:627.7531
related: URN:NBN:fi:au:hklj:681
related: URN:NBN:fi:au:hklj:781.5
related: URN:NBN:fi:au:hklj:782.6
related: URN:NBN:fi:au:hklj:785
related: URN:NBN:fi:au:hklj:785.11
related: URN:NBN:fi:au:hklj:788
related: URN:NBN:fi:au:hklj:789

Soolo-oboe. Sooloenglannintorvi
type: Class
type: Concept
subclass of: Oboe. Englannintorvi
broader: Oboe. Englannintorvi
in scheme: URN:NBN:fi:au:hklj:
notation: 786.452
preferred label: Solo oboe. Solo English horn @en
preferred label: Solooboe. Engelskt horn i solon @sv
related: URN:NBN:fi:au:hklj:627.7531
related: URN:NBN:fi:au:hklj:681
related: URN:NBN:fi:au:hklj:781.5
related: URN:NBN:fi:au:hklj:782.6
related: URN:NBN:fi:au:hklj:785
related: URN:NBN:fi:au:hklj:785.11
related: URN:NBN:fi:au:hklj:788
related: URN:NBN:fi:au:hklj:789

Koulut, harjoituskappaleet ja -etydit
type: Class
type: Concept
subclass of: Fagotti
alternative label: Fagotti, koulut ja etydit (786.461)
alternative label: Fagott, skolor och etyder (786.461) @sv
broader: Fagotti
in scheme: URN:NBN:fi:au:hklj:
notation: 786.461
preferred label: Courses, practice pieces and studies @en
preferred label: Skolor, övningsstycken och etyder @sv
related: URN:NBN:fi:au:hklj:627.7531
related: URN:NBN:fi:au:hklj:681
related: URN:NBN:fi:au:hklj:781.5
related: URN:NBN:fi:au:hklj:782.6
related: URN:NBN:fi:au:hklj:785
related: URN:NBN:fi:au:hklj:785.11
related: URN:NBN:fi:au:hklj:788
related: URN:NBN:fi:au:hklj:789

Soolofagotti
type: Class
type: Concept
subclass of: Fagotti
alternative label: Fagotti, soolot (786.462)
alternative label: Fagott, solonummer (786.462) @sv
broader: Fagotti
in scheme: URN:NBN:fi:au:hklj:
notation: 786.462
preferred label: Solo bassoon @en
preferred label: Solofagott @sv
related: URN:NBN:fi:au:hklj:627.7531
related: URN:NBN:fi:au:hklj:681
related: URN:NBN:fi:au:hklj:781.5
related: URN:NBN:fi:au:hklj:782.6
related: URN:NBN:fi:au:hklj:785
related: URN:NBN:fi:au:hklj:785.11
related: URN:NBN:fi:au:hklj:788
related: URN:NBN:fi:au:hklj:789

Koulut, harjoituskappaleet ja -etydit
type: Class
type: Concept
subclass of: Käyrätorvi
alternative label: Käyrätorvi, koulut ja etydit (786.511)
alternative label: Valthorn, skolor och etyder (786.511) @sv
broader: Käyrätorvi
in scheme: URN:NBN:fi:au:hklj:
notation: 786.511
preferred label: Courses, practice pieces and studies @en
preferred label: Skolor, övningsstycken och etyder @sv
related: URN:NBN:fi:au:hklj:627.7531
related: URN:NBN:fi:au:hklj:681
related: URN:NBN:fi:au:hklj:781.5
related: URN:NBN:fi:au:hklj:782.6
related: URN:NBN:fi:au:hklj:785
related: URN:NBN:fi:au:hklj:785.11
related: URN:NBN:fi:au:hklj:788
related: URN:NBN:fi:au:hklj:789

Soolokäyrätorvi
type: Class
type: Concept
subclass of: Käyrätorvi
alternative label: Käyrätorvi, soolot (786.512)
alternative label: Valthorn, solonummer (786.512) @sv
broader: Käyrätorvi
in scheme: URN:NBN:fi:au:hklj:
notation: 786.512
preferred label: Solo French horn @en
preferred label: Solovalthorn @sv
related: URN:NBN:fi:au:hklj:627.7531
related: URN:NBN:fi:au:hklj:681
related: URN:NBN:fi:au:hklj:781.5
related: URN:NBN:fi:au:hklj:782.6
related: URN:NBN:fi:au:hklj:785
related: URN:NBN:fi:au:hklj:785.11
related: URN:NBN:fi:au:hklj:788
related: URN:NBN:fi:au:hklj:789

Koulut, harjoituskappaleet ja -etydit
type: Class
type: Concept
subclass of: Trumpetti
alternative label: Trumpetti, koulut ja etydit (786.521)
alternative label: Trumpet, skolor och etyder (786.521) @sv
broader: Trumpetti
in scheme: URN:NBN:fi:au:hklj:
notation: 786.521
preferred label: Courses, practice pieces and studies @en
preferred label: Skolor, övningsstycken och etyder @sv
related: URN:NBN:fi:au:hklj:627.7531
related: URN:NBN:fi:au:hklj:681
related: URN:NBN:fi:au:hklj:781.5
related: URN:NBN:fi:au:hklj:782.6
related: URN:NBN:fi:au:hklj:785
related: URN:NBN:fi:au:hklj:785.11
related: URN:NBN:fi:au:hklj:788
related: URN:NBN:fi:au:hklj:789

Soolotrumpetti
type: Class
type: Concept
subclass of: Trumpetti
alternative label: Trumpetti, soolot (786.522)
alternative label: Trumpet, solonummer (786.522) @sv
broader: Trumpetti
in scheme: URN:NBN:fi:au:hklj:
notation: 786.522
preferred label: Solo trumpet @en
preferred label: Solotrumpet @sv
related: URN:NBN:fi:au:hklj:627.7531
related: URN:NBN:fi:au:hklj:681
related: URN:NBN:fi:au:hklj:781.5
related: URN:NBN:fi:au:hklj:782.6
related: URN:NBN:fi:au:hklj:785
related: URN:NBN:fi:au:hklj:785.11
related: URN:NBN:fi:au:hklj:788
related: URN:NBN:fi:au:hklj:789

Koulut, harjoituskappaleet ja -etydit
type: Class
type: Concept
subclass of: Pasuuna
alternative label: Pasuuna, koulut ja etydit (786.531)
alternative label: Basun, skolor och etyder (786.531) @sv
broader: Pasuuna
in scheme: URN:NBN:fi:au:hklj:
notation: 786.531
preferred label: Courses, practice pieces and studies @en
preferred label: Skolor, övningsstycken och etyder @sv
related: URN:NBN:fi:au:hklj:627.7531
related: URN:NBN:fi:au:hklj:681
related: URN:NBN:fi:au:hklj:781.5
related: URN:NBN:fi:au:hklj:782.6
related: URN:NBN:fi:au:hklj:785
related: URN:NBN:fi:au:hklj:785.11
related: URN:NBN:fi:au:hklj:788
related: URN:NBN:fi:au:hklj:789

Soolopasuuna
type: Class
type: Concept
subclass of: Pasuuna
alternative label: Pasuuna, soolot (786.532)
alternative label: Basun, solonummer (786.532) @sv
broader: Pasuuna
in scheme: URN:NBN:fi:au:hklj:
notation: 786.532
preferred label: Solo trombone @en
preferred label: Solotrombon @sv
related: URN:NBN:fi:au:hklj:627.7531
related: URN:NBN:fi:au:hklj:681
related: URN:NBN:fi:au:hklj:781.5
related: URN:NBN:fi:au:hklj:782.6
related: URN:NBN:fi:au:hklj:785
related: URN:NBN:fi:au:hklj:785.11
related: URN:NBN:fi:au:hklj:788
related: URN:NBN:fi:au:hklj:789

Koulut, harjoituskappaleet ja -etydit
type: Class
type: Concept
subclass of: Tuuba
alternative label: Tuuba, koulut ja etydit (786.541)
alternative label: Tuba, skolor och etyder (786.541) @sv
broader: Tuuba
in scheme: URN:NBN:fi:au:hklj:
notation: 786.541
preferred label: Courses, practice pieces and studies @en
preferred label: Skolor, övningsstycken och etyder @sv
related: URN:NBN:fi:au:hklj:627.7531
related: URN:NBN:fi:au:hklj:681
related: URN:NBN:fi:au:hklj:781.5
related: URN:NBN:fi:au:hklj:782.6
related: URN:NBN:fi:au:hklj:785
related: URN:NBN:fi:au:hklj:785.11
related: URN:NBN:fi:au:hklj:788
related: URN:NBN:fi:au:hklj:789

Soolotuuba
type: Class
type: Concept
subclass of: Tuuba
alternative label: Tuuba, soolot (786.542)
alternative label: Tuba, solonummer (786.542) @sv
broader: Tuuba
in scheme: URN:NBN:fi:au:hklj:
notation: 786.542
preferred label: Solo tuba @en
preferred label: Solotuba @sv
related: URN:NBN:fi:au:hklj:627.7531
related: URN:NBN:fi:au:hklj:681
related: URN:NBN:fi:au:hklj:781.5
related: URN:NBN:fi:au:hklj:782.6
related: URN:NBN:fi:au:hklj:785
related: URN:NBN:fi:au:hklj:785.11
related: URN:NBN:fi:au:hklj:788
related: URN:NBN:fi:au:hklj:789

1900-luvun musiikki. 2000-luvun musiikki
type: Class
type: Concept
subclass of: URN:NBN:fi:au:hklj:789.1
alternative label: 12-säveljärjestelmä, musiikinhistoria (789.17)
alternative label: 12-säveltekniikka, musiikinhistoria (789.17)
alternative label: Aleatorinen musiikki, musiikinhistoria (789.17)
alternative label: Algoritminen musiikki, musiikin historia (789.17)
alternative label: Avant-garde, musiikin historia (789.17)
alternative label: Avantgarde, musiikin historia (789.17)
alternative label: Avantgardismi, musiikin historia (789.17)
alternative label: Dodekafonia, musiikinhistoria (789.17)
alternative label: Futurismi, musiikinhistoria (789.17)
alternative label: Impressionismi, musiikinhistoria, 1900-luku (789.17)
alternative label: Indeterminismi, musiikin historia (789.17)
alternative label: Kaksitoistasäveljärjestelmä, musiikinhistoria (789.17)
alternative label: Kaksitoistasäveltekniikka, musiikinhistoria (789.17)
alternative label: Kertaustyylit, musiikinhistoria, yl. 789.16- (789.17)
alternative label: Metamusiikki, musiikin historia (789.17)
alternative label: Minimalismi, musiikin historia (789.17)
alternative label: Moderni musiikki (789.17)
alternative label: Moderni taide, musiikinhistoria (789.17)
alternative label: Modernismi, musiikinhistoria (789.17)
alternative label: Myöhäisromantiikka, 1900-luvun mus. historia (789.17)
alternative label: Neoklassismi, musiikinhistoria (789.17)
alternative label: Nykymusiikki (789.17)
alternative label: Nykytaide, musiikinhistoria (789.17)
alternative label: Pistemusiikki, musiikin historia (789.17)
alternative label: Sanamusiikki, musiikin historia (789.17)
alternative label: Sarjallinen musiikki, musiikin historia (789.17)
alternative label: Sattumamusiikki, musiikin historia (789.17)
alternative label: Stokastinen musiikki, musiikin historia (789.17)
alternative label: Uudenaikaisuus, musiikinhistoria (789.17)
alternative label: Uusbarokki, musiikinhistoria (789.16 ... 789.17)
alternative label: Uusi aika, musiikin historia (789.13 ... 789.17)
alternative label: Uusi musiikki (789.17)
alternative label: Uusklassismi, musiikinhistoria (789.17)
alternative label: 12-tonssystem, musikhistoria (789.17) @sv
alternative label: 12-tonsteknik, musikhistoria (789.17) @sv
alternative label: Aleatorisk musik, musikhistoria (789.17) @sv
alternative label: Algoritmisk musik, musikhistoria (789.17) @sv
alternative label: Avantgarde, musikhistoria (789.17) @sv
alternative label: Avantgardism, musikhistoria (789.17) @sv
alternative label: Dodekafoni, musikhistoria (789.17) @sv
alternative label: Futurism, musikhistoria (789.17) @sv
alternative label: Imitationsstilar, musikhistoria, allm. 789.16- (789.17) @sv
alternative label: Impressionism, musikhistoria, 1900-talet (789.17) @sv
alternative label: Indeterminism, musikhistoria (789.17) @sv
alternative label: Metamusik, musikhistoria (789.17) @sv
alternative label: Minimalism, musikhistoria (789.17) @sv
alternative label: Modern konst, musikhistoria (789.17) @sv
alternative label: Modern musik (789.17) @sv
alternative label: Modernism, musikhistoria (789.17) @sv
alternative label: Modernitet, musikhistoria (789.17) @sv
alternative label: Neoklassicism, musikhistoria (789.17) @sv
alternative label: Nutida musik (789.17) @sv
alternative label: Nutidskonst, musikhistoria (789.17) @sv
alternative label: Ny musik (789.17) @sv
alternative label: Nya tiden, musikhistoria (789.13 ... 789.17) @sv
alternative label: Nybarock, musikhistoria (789.16 ... 789.17) @sv
alternative label: Nyklassicism, musikhistoria (789.17) @sv
alternative label: Ordmusik, musikhistoria (789.17) @sv
alternative label: Punktmusik, musikens historia (789.17) @sv
alternative label: Senromantiken, 1900-talets musikhistoria (789.17) @sv
alternative label: Seriell musik, musikhistoria (789.17) @sv
alternative label: Slumpmusik, musikens historia (789.17) @sv
alternative label: Stokastisk musik, musikhistoria (789.17) @sv
alternative label: Tolvtonssystem, musikhistoria (789.17) @sv
alternative label: Tolvtonsteknik, musikhistoria (789.17) @sv
broader: URN:NBN:fi:au:hklj:789.1
in scheme: URN:NBN:fi:au:hklj:
notation: 789.17
preferred label: Music of the 20th Century @en
preferred label: 1900-talets musik. 2000-talets musik @sv
related: URN:NBN:fi:au:hklj:709
related: URN:NBN:fi:au:hklj:782.4
related: Musiikin tulkinta. Tyylioppi
related: URN:NBN:fi:au:hklj:783
related: Eurooppa
scope note: Euroopan 1900- ja 2000-luvun musiikin historia yleensä Länsimaisen 1900- ja 2000-luvun taidemusiikin historia yleensä Tietyn maan 1900- ja 2000-luvun musiikin yleistä historiaa tai henkilöhistoriaa koskevat teokset maan mukaisessa luokassa Klassisen musiikin erikoisalojen historia ja henkilöhistoria alan mukaisessa luokassa
scope note: Den europeiska 1900- och 2000-talsmusikens historia i allmänhet Den västerländska konstmusikens historia under 1900- och 2000-talet i allmänhet Verk om musikens historia under 1900- och 2000-talet i allmänhet och dess personhistoria som rör ett bestämt land klassificeras enligt land Historia och personhistoria som rör specialområden inom klassisk musik klassificeras enligt område @sv

Saksa
type: Class
type: Concept
subclass of: Keski-Eurooppa
alternative label: Saksa, musiikinhistoria (789.221)
alternative label: Tyskland, musikhistoria (789.221) @sv
broader: Keski-Eurooppa
in scheme: URN:NBN:fi:au:hklj:
notation: 789.221
preferred label: Germany @en
preferred label: Tyskland @sv
related: URN:NBN:fi:au:hklj:709
related: Suomen yleinen taidehistoria
related: URN:NBN:fi:au:hklj:782.4
related: URN:NBN:fi:au:hklj:783
related: URN:NBN:fi:au:hklj:789.1

Espanja
type: Class
type: Concept
subclass of: Länsi- ja Lounais-Eurooppa
alternative label: Espanja, musiikinhistoria (789.243)
alternative label: Spanien, musikhistoria (789.243) @sv
broader: Länsi- ja Lounais-Eurooppa
in scheme: URN:NBN:fi:au:hklj:
notation: 789.243
preferred label: Spain @en
preferred label: Spanien @sv
related: URN:NBN:fi:au:hklj:709
related: URN:NBN:fi:au:hklj:782.4
related: URN:NBN:fi:au:hklj:783
related: URN:NBN:fi:au:hklj:789.1
related: Afrikan saaret

Portugali
type: Class
type: Concept
subclass of: Länsi- ja Lounais-Eurooppa
alternative label: Portugali, musiikinhistoria (789.244)
alternative label: Portugal, musikhistoria (789.244) @sv
broader: Länsi- ja Lounais-Eurooppa
in scheme: URN:NBN:fi:au:hklj:
notation: 789.244
preferred label: Portugal @en
related: URN:NBN:fi:au:hklj:709
related: URN:NBN:fi:au:hklj:782.4
related: URN:NBN:fi:au:hklj:783
related: URN:NBN:fi:au:hklj:789.1
related: Afrikan saaret

Etu-Aasia
type: Class
type: Concept
subclass of: Aasia
broader: Aasia
in scheme: URN:NBN:fi:au:hklj:
notation: 789.31
preferred label: South-West Asia @en
preferred label: Främre Asien @sv
related: URN:NBN:fi:au:hklj:709
related: URN:NBN:fi:au:hklj:782.4
related: URN:NBN:fi:au:hklj:783
related: URN:NBN:fi:au:hklj:789.1
related: Varhaiskansojen musiikki
scope note: Afganistan. Arabiemiirikunnat. Bahrain. Irak. Iran. Israel. Jemen. Jordania. Kuwait. Kypros. Libanon. Oman. Quatar. Saudi-Arabia. Syyria. Turkki Tässä myös Palestiina ja Kurdistan
scope note: Afghanistan. Bahrain. Cypern. Förenade Arabemiraten. Irak. Iran. Israel. Jordanien. Kuwait. Libanon. Oman. Qatar. Saudiarabien. Syrien. Turkiet. Yemen Hit också Palestina och Kurdistan @sv

Etelä-Aasia
type: Class
type: Concept
subclass of: Aasia
alternative label: Intia, musiikinhistoria, moderni (789.33)
alternative label: Ragat, Intian musiikin historia (789.33)
alternative label: Indien, musikhistoria, modern (789.33) @sv
alternative label: Ragor, indiska musikens historia (789.33) @sv
broader: Aasia
in scheme: URN:NBN:fi:au:hklj:
notation: 789.33
preferred label: Southern Asia @en
preferred label: Sydasien @sv
related: URN:NBN:fi:au:hklj:709
related: URN:NBN:fi:au:hklj:782.4
related: URN:NBN:fi:au:hklj:783
related: URN:NBN:fi:au:hklj:789.1
related: Varhaiskansojen musiikki
scope note: Bangladesh. Bhutan. Intia. Malediivit. Nepal. Pakistan. Sri Lanka Tässä myös Kashmir Tässä myös Andamaanit, Kookossaaret ja Nikobaarit
scope note: Bangladesh. Bhutan. Indien. Maldiverna. Nepal. Pakistan. Sri Lanka Hit också Kashmir Hit också Andamarerna, Kokosöarna och Nikobarerna @sv

Korea
type: Class
type: Concept
subclass of: Keski- ja Itä-Aasia
broader: Keski- ja Itä-Aasia
in scheme: URN:NBN:fi:au:hklj:
notation: 789.353
related: URN:NBN:fi:au:hklj:709
related: URN:NBN:fi:au:hklj:782.4
related: URN:NBN:fi:au:hklj:783
related: URN:NBN:fi:au:hklj:789.1
related: Varhaiskansojen musiikki
scope note: Korean tasavalta. Korean kansantasavalta
scope note: Republiken Korea. Demokratiska Folkrepubliken Korea @sv

Kiina
type: Class
type: Concept
subclass of: Keski- ja Itä-Aasia
alternative label: Kiina, musiikinhistoria (789.354)
alternative label: Kina, musikhistoria (789.354) @sv
broader: Keski- ja Itä-Aasia
in scheme: URN:NBN:fi:au:hklj:
notation: 789.354
preferred label: China @en
preferred label: Kina @sv
related: URN:NBN:fi:au:hklj:709
related: URN:NBN:fi:au:hklj:782.4
related: URN:NBN:fi:au:hklj:783
related: URN:NBN:fi:au:hklj:789.1
related: Varhaiskansojen musiikki
scope note: Tässä myös Hongkong, Macao, Taiwan ja Tiibet
scope note: Hit också Hongkong, Macau, Taiwan och Tibet @sv

Japani
type: Class
type: Concept
subclass of: Keski- ja Itä-Aasia
alternative label: Japani, musiikinhistoria (789.356)
alternative label: Japan, musikhistoria (789.356) @sv
broader: Keski- ja Itä-Aasia
in scheme: URN:NBN:fi:au:hklj:
notation: 789.356
preferred label: Japan @en
related: URN:NBN:fi:au:hklj:709
related: URN:NBN:fi:au:hklj:782.4
related: URN:NBN:fi:au:hklj:783
related: URN:NBN:fi:au:hklj:789.1
related: Varhaiskansojen musiikki

Australia. Uusi-Seelanti. Uusi-Guinea
type: Class
type: Concept
subclass of: Australia. Oseania
alternative label: Australia, musiikinhistoria (789.81)
alternative label: Australien, musikhistoria (789.81) @sv
broader: Australia. Oseania
in scheme: URN:NBN:fi:au:hklj:
notation: 789.81
preferred label: Australia. New Zealand. New Guinea @en
preferred label: Australien. Nya Zeeland. Nya Guinea @sv
related: URN:NBN:fi:au:hklj:709
related: URN:NBN:fi:au:hklj:782.4
related: URN:NBN:fi:au:hklj:783
related: URN:NBN:fi:au:hklj:789.1
related: Kaakkois-Aasia

Tyynen meren saaret
type: Class
type: Concept
subclass of: Australia. Oseania
broader: Australia. Oseania
in scheme: URN:NBN:fi:au:hklj:
notation: 789.84
preferred label: Pacific Ocean Islands @en
preferred label: Öarna i Stilla havet @sv
related: URN:NBN:fi:au:hklj:709
related: URN:NBN:fi:au:hklj:782.4
related: URN:NBN:fi:au:hklj:783
related: URN:NBN:fi:au:hklj:789.1
related: Yhdysvallat
scope note: Melanesia. Mikronesia. Polynesia Bismarckinsaaret. Cookinsaaret. Fidzi. Galapagossaaret. Gilbertinsaaret. Guam. Havaiji. Johnstoninsaari. Joulusaari. Karoliinit. Kiribati. Kookossaari. Mariaanit. Marquesassaaret. Marshallinsaaret. Midwaysaaret. Nauru. Niuesaari. Norfolkinsaari. Palau. Phoenixsaaret. Pitcairn. Pohjois-Mariaanit. Pääsiäissaari. Ranskan Polynesia. Salomonsaaret. Samoa. Seurasaaret. Tahiti. Tokelau. Tonga. Tuvalu. Uudet-Hebridit. Uusi-Kaledonia. Wallis- ja Futunasaaret. Vanuatu
scope note: Melanesien. Mikronesien. Polynesien Bismarcköarna. Carolinerna. Cooköarna. Fiji. Franska Polynesien. Galapagosöarna. Gilbertöarna. Guam. Johnstonöarna. Julön. Kiribati. Kokosöarna. Marianerna. Marquesasöarna. Marshallöarna. Midwayöarna. Nauru. Niue. Nordmarianerna. Norfolkön. Nya Hebriderna. Nya Kaledonien. Palau. Phoenixöarna. Pitcairn. Påskön. Salomonöarna. Samoa. Sällskapsöarna. Tahiti. Tokelau. Tonga. Tuvalu. Wallis- och Futunaöarna. Vanuatu @sv

Moottoriveneurheilu
type: Class
type: Concept
subclass of: Moottoriurheilu. Lentourheilu
alternative label: Moottoriveneurheilu (791.83)
alternative label: Offshore, moottoriveneurheilu (791.83)
alternative label: Veneily, moottoriveneurheilu (791.83)
alternative label: Båtsport, motorbåtsport (791.83) @sv
alternative label: Motorbåtssport (791.83) @sv
alternative label: Offshore, motorbåtsport (791.83) @sv
broader: Moottoriurheilu. Lentourheilu
in scheme: URN:NBN:fi:au:hklj:
notation: 791.83
preferred label: Motorboat sports @en
preferred label: Motorbåtssport @sv
related: Vesiliikenne
related: Tiet. Kadut. Tienrakennus. Kadunrakennus
related: Vesikulkuneuvot
related: URN:NBN:fi:au:hklj:625.72
related: Liikenneopetus. Liikenneturvallisuus
related: Merenkulkuoppi
related: Liikuntatiede ja -tutkimus. Liikuntapolitiikka
related: Purjehdus. Soutu. Melonta
scope note: Jos teos koskee sekä moottoriveneurheilua että moottoriveneitä, on etusija luokalla 791.83
scope note: Om verket handlar om både motorbåtssport och motorbåtar ges företräde åt klass 791.83 @sv

Tietokilpailut
type: Class
type: Concept
subclass of: URN:NBN:fi:au:hklj:798
alternative label: Ambigrammit, sanapelit, arvoitukset (798.4)
alternative label: Anagrammit, sanapelit, arvoitukset (798.4)
alternative label: Arvoitukset, ajanviete (798.4)
alternative label: Kompakysymykset, ajanviete (798.4)
alternative label: Kuva-arvoitukset (798.4)
alternative label: Kuvaristikot (798.4)
alternative label: Numeroristikot (798.4)
alternative label: Palindromit, sanapelit, arvoitukset (798.4)
alternative label: Päättelytehtävät (798.4)
alternative label: Ristisanatehtävät (798.4)
alternative label: Sanaristikot (798.4)
alternative label: Sudokut (798.4)
alternative label: Tietokilpailut (798.4)
alternative label: Trivial pursuit (798.4)
alternative label: Visailukysymykset (798.4)
alternative label: Ambigram, ordspel, gåtor (798.4) @sv
alternative label: Anagram, ordspel, gåtor (798.4) @sv
alternative label: Bildgåtor (798.4) @sv
alternative label: Bildkryss (798.4) @sv
alternative label: Frågesport (798.4) @sv
alternative label: Frågesportsfrågor (798.4) @sv
alternative label: Gåtor, tidsfördriv (798.4) @sv
alternative label: Korsord (798.4) @sv
alternative label: Korsordsgåtor (798.4) @sv
alternative label: Palindromer, ordspel, gåtor (798.4) @sv
alternative label: Skämtgåtor, tidsfördriv (798.4) @sv
alternative label: Slutledningsuppgifter (798.4) @sv
alternative label: Sudoku (798.4) @sv
broader: URN:NBN:fi:au:hklj:798
in scheme: URN:NBN:fi:au:hklj:
notation: 798.4
preferred label: Quizzes @en
preferred label: Frågesport @sv
related: URN:NBN:fi:au:hklj:1.1
related: Leikit
related: Pelit
related: Korttipelit. Pasianssit
related: Shakki
related: Roolipelit
related: URN:NBN:fi:au:hklj:798.403
related: URN:NBN:fi:au:hklj:807
scope note: Tietokilpailukysymykset. Ristisanat. Numeroristikot. Sudokut. Tietokilpailupelit, kuten Trivial pursuit. Hit även berättelsebaserade problemlösningsspel.
scope note: Frågesportsfrågor. Korsord. Sudoku. Frågesportsspel såsom Trivial pursuit. Tähän myös tarinalliset päättelytehtävät @sv

Julkiset huvit
type: Class
type: Concept
subclass of: LIIKUNTA. URHEILU. LEIKIT. HUVIT
alternative label: Ajanviete, julkiset huvit (799 +)
alternative label: Artistit, julkiset huvit (799 +)
alternative label: Biografiat, leikki, sirkus, ajanviete (797 ... 799 +)
alternative label: Diskot, huvitilaisuudet (799)
alternative label: Diskoteekit (799)
alternative label: Edelläkävijät, leikki, sirkus, ajanviete (797 ... 799 +)
alternative label: Eläinurheilu (799)
alternative label: Elämäkerrat, leikki, sirkus, ajanviete (797 ... 799 +)
alternative label: Elämänhistoria, henkilöhistoria, leikki, sirkus, ajanviete (797 ... 799 +)
alternative label: Estraditaiteilijat, julkiset huvit (799 +)
alternative label: Henkilöhistoria, leikki, sirkus, ajanviete (797 ... 799 +)
alternative label: Henkilökuvat, leikki, sirkus, ajanviete (797 ... 799 +)
alternative label: Henkilöt, leikki, sirkus, ajanviete (797 ... 799 +)
alternative label: Huvit (799)
alternative label: Huvit, iltamat (799)
alternative label: Huvit, julkiset huvit (799 +)
alternative label: Huvit, karnevaalit (799)
alternative label: Huvit, tanssiaiset (799)
alternative label: Härkätaistelut (799)
alternative label: Ilotulitukset (799)
alternative label: Ilotulitusvälineet, käyttö (799)
alternative label: Iltamat, julkiset huvit (799)
alternative label: Juhannus, julkiset huvit, tanssiaiset (799)
alternative label: Julkiset huvit (799 +)
alternative label: Julkisuuden henkilöt, leikki, sirkus, ajanviete (797 ... 799 +)
alternative label: Karnevaalit (799)
alternative label: Kirjeet, leikki, sirkus, ajanviete (797 ... 799 +)
alternative label: Kirjekyyhkyt, kyyhkysurheilu (799)
alternative label: Koiraurheilu (799)
alternative label: Koiraurheilu, eläinurheilu (799)
alternative label: Koiravaljakot, valjakkourheilu (799)
alternative label: Kukkotappelut (799)
alternative label: Kyyhkysurheilu (799)
alternative label: Lapsitähdet, julkisuuden henkilöt, leikki, sirkus, ajanviete (797 ... 799 +)
alternative label: Lapsuus, leikki, sirkus, ajanviete (797 ... 799 +)
alternative label: Lavatanssit, järjestäminen (799)
alternative label: Merkkihenkilöt, leikki, sirkus, ajanviete (797 ... 799 +)
alternative label: Muistelmat, leikki, sirkus, ajanviete (797 ... 799 +)
alternative label: Muistokirjoitukset, leikki, sirkus, ajanviete (797 ... 799 +)
alternative label: Naamiaiset (799)
alternative label: Naamiaiset, huvit (799)
alternative label: Naamiaispuvut, huvit, naamiaiset (799)
alternative label: Naamiointi, naamiaiset (799)
alternative label: Naamioituminen, naamiaiset (799)
alternative label: Nekrologit, leikki, sirkus, ajanviete (797 ... 799 +)
alternative label: Omaelämäkerrat, leikki, sirkus, ajanviete (797 ... 799 +)
alternative label: Paraatit, karnevaalit (799)
alternative label: Pääsyliput, julkiset huvit (799 +)
alternative label: Rakkauskirjeet, leikki, sirkus, ajanviete (797 ... 799 +)
alternative label: Rally-toko, koiraurheilu (799)
alternative label: Rekikoirat, valjakkourheilu (799)
alternative label: Tanssiaiset (799)
alternative label: Tanssilavat, tanssiaiset (799)
alternative label: Tanssipaikat (799)
alternative label: Uranuurtajat, leikki, sirkus, ajanviete (797 ... 799 +)
alternative label: Vahakabinetit (799)
alternative label: Valjakkourheilu, koiravaljakot (799)
alternative label: Venetsialaiset, julkiset huvit (799)
alternative label: Vetokoirat, koiraurheilu (799)
alternative label: Viihde, julkiset huvit (799 +)
alternative label: Viihdetaiteilijat, julkiset huvit (799 +)
alternative label: Yöelämä, julkiset huvit (799 +)
alternative label: Artister, offentliga nöjen (799 +) @sv
alternative label: Barndom, lek, cirkus, tidsfördriv (797 ... 799 +) @sv
alternative label: Barnstjärnor, offentliga personer, lek, cirkus, tidsfördriv (797 ... 799 +) @sv
alternative label: Bemärkta personer, lek, cirkus, tidsfördriv (797 ... 799 +) @sv
broader: LIIKUNTA. URHEILU. LEIKIT. HUVIT
in scheme: URN:NBN:fi:au:hklj:
narrower: Sirkus. Huvipuistot. Varietee
narrower: Arpajaiset. Veikkaus. Uhkapeli
notation: 799
related: Juhlien järjestäminen
related: Seksologia
related: Kemian teollisuus
related: Koirat
scope note: Yleisteokset julkisista huveista Tässä ja alaluokissa julkiset huvit ja niiden järjestäminen Ilotulitukset. Härkätaistelut. Karnevaalit. Koira- ja kyyhkysurheilu. Kukkotappelut. Naamiaiset. Tanssiaiset.
scope note: Allmänna verk om offentliga nöjen Hit och till underklasserna offentliga nöjen och anordnande av dem Baler. Fyrverkerier. Hund- och duvsport. Karnevaler. Maskerader. Tjurfäktning. Tuppfäktning @sv

Suomenkielisen kirjallisuuden historia ja tutkimus
type: Class
type: Concept
subclass of: SUOMALAIS-UGRILAISTEN KIELTEN KIRJALLISUUDEN HISTORIA JA TUTKIMUS
alternative label: Balladit, kirj.historia, suomi (811)
alternative label: Erkkola, taiteilijakodit, kirjailijat (811)
alternative label: Kansalliskirjailijat, suomi (811)
alternative label: Kansalliskirjallisuus, kirj. historia, suomi (811)
alternative label: Kirjastokorvaukset, kirjallisuuden rahoitus, Suomi (811)
alternative label: Meänkieli, kirjallisuuden historia (811)
alternative label: Suomen kieli, kirjallisuuden historia (811 ... 816 +)
alternative label: Suomenkielisen kirjallisuuden historia (811 ... 816 +)
alternative label: Suomi, kirjallisuuden historia (811 ... 816 +)
alternative label: Varoitustarinat, folkloristiikka, suomi (811)
alternative label: Ballader, litteraturhistoria, finska (811) @sv
alternative label: Biblioteksersättningar, finansiering av litteratur, Finland (811) @sv
alternative label: Erkkola, konstnärshem, författare (811) @sv
alternative label: Finland, litteraturhistoria (811 ... 816 +) @sv
alternative label: Finska, litteraturhistoria (811 ... 816 +) @sv
alternative label: Finskspråkig litteraturhistoria (811 ... 816 +) @sv
alternative label: Nationallitteratur, litt. historia, finska (811) @sv
alternative label: Nationalskalder, finska (811) @sv
alternative label: Pedagogiska sägner , folkloristik, finska (811) @sv
alternative label: Tornedalsfinska, litteraturhistoria (811) @sv
broader: SUOMALAIS-UGRILAISTEN KIELTEN KIRJALLISUUDEN HISTORIA JA TUTKIMUS
in scheme: URN:NBN:fi:au:hklj:
notation: 811
preferred label: Finnish literature: history and research @en
preferred label: Finsk litteraturhistoria och forskning i finsk litteratur @sv
related: URN:NBN:fi:au:hklj:1
related: Suomen yleinen taidehistoria
related: Suomenkielisen kansanrunouden historia ja tutkimus
related: Suomenkielisen kirjallisuuden aihepiirejä ja kirjallisuustyyppejä koskeva historia ja tutkimus
related: Suomenkielisen lasten- ja nuortenkirjallisuuden historia ja tutkimus
related: Pohjoismaisten kielten kirjallisuuden historia ja tutkimus
related: Suomenruotsalaisen kirjallisuuden historia ja tutkimus
related: Suomen kieli
scope note: Suomenkielisen runouden, näytelmäkirjallisuuden, kertomakirjallisuuden ja romaanitaiteen yleinen historia ja tutkimus Suomenkielisiä kirjailijoita ja heidän tuotantoaan koskeva tutkimus, henkilöhistoria ja elämäkerrat Suomen kirjallisuuden historian ja tutkimuksen yleisteokset, jotka koskevat sekä suomenkielistä että suomenruotsalaista kirjallisuutta
scope note: Allmän litteraturhistoria och litteraturforskning som rör den finska poesin, dramalitteraturen, episka litteraturen och romankonsten Forskning, personhistoria och biografier som rör finska författare och deras produktion Allmänna verk om finländsk litteraturhistoria och forskning som rör både finsk och finlandssvensk litteratur @sv

Englanninkielisen kirjallisuuden historia ja tutkimus
type: Class
type: Concept
subclass of: GERMAANISTEN KIELTEN KIRJALLISUUDEN HISTORIA JA TUTKIMUS
alternative label: Australia, englanninkielisen kirjallisuden historia (828)
alternative label: Beowulf, folkloristiikka (828)
alternative label: Englannin kieli, kirjallisuudenhistoria (828 ... 829)
alternative label: Australien, engelsk litteraturhistoria (828) @sv
alternative label: Beowulf, folkloristik (828) @sv
alternative label: Engelska, litteraturhistoria (828 ... 829) @sv
broader: GERMAANISTEN KIELTEN KIRJALLISUUDEN HISTORIA JA TUTKIMUS
in scheme: URN:NBN:fi:au:hklj:
notation: 828
preferred label: English literature: history and research @en
preferred label: Engelsk litteraturhistoria och forskning i engelsk litteratur @sv
related: URN:NBN:fi:au:hklj:4
related: Kirjallisuuden aihepiirejä ja kirjallisuustyyppejä koskeva historia ja tutkimus
related: Lasten- ja nuortenkirjallisuuden historia ja tutkimus
related: Hollanninkielisen kirjallisuuden historia ja tutkimus
related: Amerikan englanninkielisen kirjallisuuden historia ja tutkimus
related: Englannin kieli
scope note: Tässä esim. Brittein saarten, Australian, Uuden Seelannin, Etelä-Afrikan, Intian ym. englanninkielisen kirjallisuuden historia ja tutkimus Tässä myös englanninkielisen kirjallisuuden historian ja tutkimuksen yleisteokset, jotka koskevat sekä Amerikan että muiden alueiden englanninkielistä kirjallisuutta Tässä myös Etelä-Afrikan kirjallisuuden historian ja tutkimuksen yleisteokset
scope note: Hit t.ex. engelsk litteraturhistoria och forskning i engelsk litteratur på Brittiska öarna, i Australien, Nya Zeeland, Sydafrikanska republiken, Indien m.fl. Hit också allmänna verk om engelsk litteraturhistoria och forskning som rör engelsk litteratur i både Amerika och andra områden Hit också allmänna verk om litteraturhistoria och litteraturforskning i Sydafrikanska republiken @sv

Intialaisten kielten kirjallisuuden historia ja tutkimus
type: Class
type: Concept
subclass of: Indoiraanisten kielten kirjallisuuden historia ja tutkimus
alternative label: Bengalin kieli, kirjallisuuden historia (846.2)
alternative label: Gudzaratin kieli, kirjallisuuden historia (846.2)
alternative label: Hindin kieli, kirjallisuuden historia (846.2)
alternative label: Indoarjalaiset kielet, kirjallisuuden historia (846.2)
alternative label: Intialaiset kielet, kirjallisuuden historia (846.2)
alternative label: Mahabharata, folkloristiikka (846.2)
alternative label: Nepalin kieli, kirjallisuuden historia (846.2)
alternative label: Pandzabin kieli, kirjallisuuden historia (846.2)
alternative label: Romanikieli, kirjallisuuden historia (846.2)
alternative label: Romanikielinen kirjallisuus, kirjallisuuden historia (846.2)
alternative label: Romaninkielinen kirjallisuus, kirjallisuuden historia (846.2)
alternative label: Sanskriitin kieli, kirjallisuuden historia (846.2)
alternative label: Sindhin kieli, kirjallisuuden historia (846.2)
alternative label: Urdun kieli, kirjallisuuden historia (846.2)
alternative label: Bengali, litteraturhistoria (846.2) @sv
alternative label: Gujarati, litteraturhistoria (846.2) @sv
alternative label: Hindi, litteraturhistoria (846.2) @sv
alternative label: Indariska språk, litteraturhistoria (846.2) @sv
alternative label: Indiska språk, litteraturhistoria (846.2) @sv
alternative label: Litteratur på romani, litteraturhistoria (846.2) @sv
alternative label: Mahabharata, folkloristik (846.2) @sv
alternative label: Nepalesiska, litteraturhistoria (846.2) @sv
alternative label: Panjabi, litteraturhistoria (846.2) @sv
alternative label: Romani, litteraturhistoria (846.2) @sv
alternative label: Romsk litteratur, litteraturhistoria (846.2) @sv
alternative label: Sanskrit, litteraturhistoria (846.2) @sv
alternative label: Sindhi, litteraturhistoria (846.2) @sv
alternative label: Urdu, litteraturhistoria (846.2) @sv
broader: Indoiraanisten kielten kirjallisuuden historia ja tutkimus
in scheme: URN:NBN:fi:au:hklj:
notation: 846.2
preferred label: Indian languages' literature: history and research @en
preferred label: De indiska språkens litteraturhistoria och forskning i de indiska språkens litteratur @sv
related: URN:NBN:fi:au:hklj:9.6
related: URN:NBN:fi:au:hklj:9.63
related: URN:NBN:fi:au:hklj:9.64
related: URN:NBN:fi:au:hklj:9.65
related: URN:NBN:fi:au:hklj:9.66
related: URN:NBN:fi:au:hklj:9.68
related: URN:NBN:fi:au:hklj:9.69
related: URN:NBN:fi:au:hklj:9.974
scope note: Muinais- ja nykyintialaisten kielten kirjallisuuden historia ja tutkimus Bengalin-, biharin-, gudzaratin-, hindin-, kasmirin-, marathin-, nepalin-, orijan-, pandzabin-, rajasthanin-, sanskriitin-, sindhin-, singhalin- ja urdunkielisen kirjallisuuden historia ja tutkimus Mustalais- eli romanikielisen kirjallisuuden historia ja tutkimus
scope note: Litteraturhistoria och litteraturforskning som rör fornindiska och nutida indiska språk Litteraturhistoria och litteraturforskning som rör assamesiska, bengali, bihari, gujarati, hindi, kashmiri, marathi, nepalesiska, oriya, panjabi, rajasthani, sanskrit, sindhi, singalesiska och urdu Litteraturhistoria och forskning som rör litteratur på romani @sv

Kielifilosofia
type: Class
type: Concept
subclass of: KIELITIEDE
alternative label: Filosofia, kielifilosofia (851)
alternative label: Kielifilosofia (851)
alternative label: Kielikuvat, kielifilosofia (851)
alternative label: Matemaattinen kielitiede (851)
alternative label: Metakielet, kielifilosofia (851)
alternative label: Puheentuotto, kielipsykologia (851)
alternative label: Bildliga uttryck, språkfilosofi (851) @sv
alternative label: Filosofi, språkfilosofi (851) @sv
alternative label: Matematisk språkvetenskap (851) @sv
alternative label: Metaspråk, språkfilosofi (851) @sv
alternative label: Språkfilosofi (851) @sv
alternative label: Talproduktion, språkpsykologi (851) @sv
broader: KIELITIEDE
in scheme: URN:NBN:fi:au:hklj:
notation: 851
preferred label: Language philosophy @en
preferred label: Språkfilosofi @sv
related: Symbolit. Koodit. Merkkijärjestelmät
related: URN:NBN:fi:au:hklj:100
related: Lauselogiikka. Lausekalkyyli
related: Kielioppi. Muoto-oppi. Sanaoppi. Semantiikka
related: URN:NBN:fi:au:hklj:860
related: GERMAANISET, KELTTILÄISET, BALTTILAISET JA SLAAVILAISET KIELET
related: URALILAISET KIELET. ALTAILAISET KIELET
related: MUUT KIELET
scope note: Kielen ja kielitieteen filosofian, teorian ja tutkimusmenetelmien yleisteokset Semiotiikka kielitieteen kannalta yleensä Tiettyä kieltä tai kieliryhmää koskeva kielifilosofia ko. kielen tai kieliryhmän luokassa
scope note: Allmänna verk om språkfilosofi och språkvetenskapens teori och forskningsmetoder Semiotik ur språkvetenskaplig synvinkel i allmänhet Språkfilosofi som rör ett bestämt språk eller en bestämd språkgrupp förs till klassen för språket eller språk gruppen i fråga @sv

Etymologia. Onomastiikka
type: Class
type: Concept
subclass of: KIELITIEDE
alternative label: Deskriptiivisanat, etymologia (857)
alternative label: Ekspressiivisanat, etymologia (857)
alternative label: Erisnimet, kielitiede (857)
alternative label: Etunimet (857)
alternative label: Etymologia (857)
alternative label: Etymologia, kielitiede (857)
alternative label: Eufemismit (857)
alternative label: Henkilönnimet (857)
alternative label: Henkilönnimitutkimus (857)
alternative label: Köllinimet, kielitiede (857)
alternative label: Köllit, kielitiede (857)
alternative label: Lainasanat, etymologia (857)
alternative label: Lainautuminen, etymologia (857)
alternative label: Leksikologia, etymologia (857)
alternative label: Lempinimet, kielitiede (857)
alternative label: Liikanimet, kielitiede (857)
alternative label: Lisänimet, kielitiede (857)
alternative label: Luonnonnimistö, kielitiede (857)
alternative label: Luontonimet, kielitiede (857)
alternative label: Maantieteelliset nimet, nimistöntutkimus (857)
alternative label: Nimenanto, etymologia (857)
alternative label: Nimestäminen, etymologia (857)
alternative label: Nimet, etymologia (857)
alternative label: Nimikkeistöt, kielitiede (857)
alternative label: Nimipäivät, etymologia (857)
alternative label: Nimistö, etymologia (857)
alternative label: Nimistöntutkimus, etymologia (857)
alternative label: Onomastiikka, kielitiede (857)
alternative label: Onomatopoeettiset sanat, etymologia (857)
alternative label: Paikannimet, kielitiede (857)
alternative label: Sananselitysoppi (857)
alternative label: Sanastontutkimus, etymologia (857)
alternative label: Sanat, etymologia (857)
alternative label: Sukunimet, etymologia (857)
alternative label: Vierassanat, etymologia (857)
alternative label: Viljelysnimet, paikannimet, kielitiede (857)
alternative label: Binamn, lingvistik (857) @sv
alternative label: Deskriptiva ord, etymologi (857) @sv
alternative label: Egennamn, lingvistik (857) @sv
alternative label: Etymologi (857) @sv
alternative label: Etymologi, lingvistik (857) @sv
alternative label: Eufemismer (857) @sv
alternative label: Expressiva ord, etymologi (857) @sv
alternative label: Forskning i ordförråd, etymologi (857) @sv
alternative label: Främmande ord, etymologi (857) @sv
alternative label: Förnamn (857) @sv
alternative label: Geografiska namn, namnforskning (857) @sv
alternative label: Inlån, språk, etymologi (857) @sv
alternative label: Lexikologi, etymologi (857) @sv
alternative label: Lånord, etymologi (857) @sv
alternative label: Namn, etymologi (857) @sv
alternative label: Namnbestånd, etymologi (857) @sv
alternative label: Namnforskning, etymologi (857) @sv
alternative label: Namngivning, etymologi (857) @sv
alternative label: Namnsdagar, etymologi (857) @sv
alternative label: Namnuppteckning, etymologi (857) @sv
alternative label: Naturnamn, lingvistik (857) @sv
alternative label: Naturnamnbestånd, lingvistik (857) @sv
alternative label: Nomenklaturer, lingvistik (857) @sv
alternative label: Odlingsnamn, ortnamn, lingvistik (857) @sv
alternative label: Onomastik, lingvistik (857) @sv
alternative label: Onomatopoetiska ord, etymologi (857) @sv
alternative label: Ord, etymologi (857) @sv
alternative label: Ordförklaringslära (857) @sv
broader: KIELITIEDE
in scheme: URN:NBN:fi:au:hklj:
notation: 857
related: Kielioppi. Muoto-oppi. Sanaoppi. Semantiikka
related: Kielihistoria
related: URN:NBN:fi:au:hklj:860
related: GERMAANISET, KELTTILÄISET, BALTTILAISET JA SLAAVILAISET KIELET
related: Ruotsin kielen etymologia ja onomastiikka
related: URALILAISET KIELET. ALTAILAISET KIELET
related: Suomen kielen etymologia ja onomastiikka
related: MUUT KIELET
scope note: Etymologian ja onomastiikan yleisteokset Sananselitysoppi ja nimistötiede yleensä Sanojen alkuperä ja johtaminen yleensä Nimien alkuperä, merkitys ja johtaminen yleensä Paikan- ja henkilönnimien tutkimus yleensä Tiettyä kieltä tai kieliryhmää koskeva etymologia ja onomastiikka ko. kielen tai kieliryhmän luokassa
scope note: Allmänna verk om etymologi och onomastik Ordförklaringslära och namnforskning i allmänhet Ursprunget till och härledning av ord i allmänhet Ursprunget till, betydelsen av och härledning av namn i allmänhet Ort- och personnamnsforskning i allmänhet Verk om etymologi och onomastik som rör ett bestämt språk eller en bestämd språkgrupp förs till klassen för språket eller språkgruppen i fråga @sv

Suomen kielen etymologia ja onomastiikka
type: Class
type: Concept
subclass of: Suomen kieli
alternative label: Deskriptiivisanat, etymologia, suomi (884.2)
alternative label: Ekspressiivisanat, etymologia, suomi (884.2)
alternative label: Erisnimet, suomen kieli (884.2)
alternative label: Etunimet, suomen kieli (884.2)
alternative label: Etymologia, suomen kieli (884.2)
alternative label: Eufemismit, suomen kieli (884.2)
alternative label: Henkilönnimet, suomen kieli (884.2)
alternative label: Henkilönnimitutkimus, suomalaiset nimet (884.2)
alternative label: Köllinimet, suomen kieli (884.2)
alternative label: Köllit, suomen kieli (884.2)
alternative label: Lainasanat, etymologia, suomi (884.2)
alternative label: Leksikologia, etymologia, suomen kieli (884.2)
alternative label: Lempinimet, suomen kieli (884.2)
alternative label: Liikanimet, suomen kieli (884.2)
alternative label: Lisänimet, suomen kieli (884.2)
alternative label: Luonnonnimistö, suomen kieli (884.2)
alternative label: Luontonimet, suomen kieli (884.2)
alternative label: Maantieteelliset nimet, suomen kieli (884.2)
alternative label: Nimenanto, etymologia, suomen kieli (884.2)
alternative label: Nimestäminen, suomen kieli (884.2)
alternative label: Nimet, etymologia, suomen kieli (884.2)
alternative label: Nimikkeistöt, suomen kieli (884.2)
alternative label: Nimipäivät, etymologia, suomen kieli (884.2)
alternative label: Nimistö, etymologia, suomen kieli (884.2)
alternative label: Nimistöntutkimus, etymologia, suomen kieli (884.2)
alternative label: Onomastiikka, suomen kieli (884.2)
alternative label: Onomatopoeettiset sanat, etymologia, suomi (884.2)
alternative label: Paikannimet, suomen kieli (884.2)
alternative label: Sananselitysoppi, suomen kieli (884.2)
alternative label: Sanastontutkimus, etymologia, suomi (884.2)
alternative label: Sanat, etymologia, suomi (884.2)
alternative label: Sukunimet, suomen kieli (884.2)
alternative label: Suomen kieli, etymologia (884.2)
alternative label: Suomen kieli, nimistöntutkimus (884.2)
alternative label: Vierassanat, etymologia, suomi (884.2)
alternative label: Viljelysnimet, paikannimet, suomen kieli (884.2)
alternative label: Binamn, finska (884.2) @sv
alternative label: Deskriptiva ord, etymologi, finska (884.2) @sv
alternative label: Egennamn, finska (884.2) @sv
alternative label: Etymologi, finska (884.2) @sv
alternative label: Eufemismer, finska (884.2) @sv
alternative label: Expressiva ord, etymologi, finska (884.2) @sv
alternative label: Finska, etymologi (884.2) @sv
alternative label: Finska, namnforskning (884.2) @sv
alternative label: Forskning i ordförråd, etymologi, finska (884.2) @sv
alternative label: Främmande ord, etymologi, finska (884.2) @sv
alternative label: Förnamn, finska (884.2) @sv
alternative label: Geografiska namn, finska (884.2) @sv
alternative label: Lexikologi, etymologi, finska (884.2) @sv
alternative label: Lånord, etymologi, finska (884.2) @sv
alternative label: Namn, etymologi, finska (884.2) @sv
alternative label: Namnbestånd, etymologi, finska (884.2) @sv
alternative label: Namnforskning, etymologi, finska (884.2) @sv
alternative label: Namngivning, etymologi, finska (884.2) @sv
alternative label: Namnsdagar, etymologi, finska (884.2) @sv
alternative label: Namnuppteckning, finska (884.2) @sv
alternative label: Naturnamn, finska (884.2) @sv
alternative label: Naturnamnbestånd, finska (884.2) @sv
alternative label: Nomenklaturer, finska (884.2) @sv
alternative label: Odlingsnamn, ortnamn, finska (884.2) @sv
alternative label: Onomastik, finska (884.2) @sv
alternative label: Onomatopoetiska ord, etymologi, finska (884.2) @sv
alternative label: Ord, etymologi, finska (884.2) @sv
alternative label: Ordförklaringslära, finska (884.2) @sv
broader: Suomen kieli
in scheme: URN:NBN:fi:au:hklj:
notation: 884.2
related: URN:NBN:fi:au:hklj:188.4
related: Sähköposti. Verkkojuttelu
related: URN:NBN:fi:au:hklj:627.7512
related: Etymologia. Onomastiikka
related: Itämerensuomalaiset kielet
related: URN:NBN:fi:au:hklj:884.203
related: Suomen kielen murteet
related: Suomen kielen historia
scope note: Sananselitysoppi. Nimistöntutkimus. Sanojen alkuperä ja johtaminen Nimien alkuperä, merkitys ja johtaminen Paikannimitutkimus. Henkilönnimitutkimus
scope note: Ordförklaringslära. Namnforskning. Ursprunget till och härledning av ord Ursprunget till, betydelsen av och härledning av namn Ortnamnsforskning. Personnamnsforskning @sv

Ruotsin paikallishistoria
type: Class
type: Concept
subclass of: URN:NBN:fi:au:hklj:930
alternative label: Hollikyyti, Ruotsin historia (931 ... 936)
alternative label: Kruununkyyti, Ruotsin historia (931 ... 936)
alternative label: Kyytilaitos, Ruotsin historia (931 ... 936)
alternative label: Lappi, Ruotsin Lappi, historia (936)
alternative label: Reservikyyti, Ruotsin historia (931 ... 936)
alternative label: Ruotsalaiset, Ruotsi, historia (931 ... 936)
alternative label: Ruotsi, historia (931 ... 936)
alternative label: Ruotsi, paikallishistoria (936)
alternative label: Suomalaismetsät, Ruotsi: paikallishistoria (936)
alternative label: Suomalaisseudut, Ruotsi: paikallishistoria (936)
alternative label: Sveanmaa, historia (936)
alternative label: Tukholma, historia (936)
alternative label: Finnmarker, Sverige: lokalhistoria (936) @sv
alternative label: Finnskogar, Sverige: lokalhistoria (936) @sv
alternative label: Hållskjuts, Sveriges historia (931 ... 936) @sv
alternative label: Kronoskjuts, Sveriges historia (931 ... 936) @sv
alternative label: Lappland, Svenska Lappland, historia (936) @sv
alternative label: Skjutsväsen, Sveriges historia (931 ... 936) @sv
alternative label: Skjutsväsendet, Sveriges historia (931 ... 936) @sv
alternative label: Stockholm, historia (936) @sv
alternative label: Svealand, historia (936) @sv
alternative label: Svenskar, Sverige, historia (931 ... 936) @sv
alternative label: Sverige, historia (931 ... 936) @sv
alternative label: Sverige, lokalhistoria (936) @sv
broader: URN:NBN:fi:au:hklj:930
in scheme: URN:NBN:fi:au:hklj:
notation: 936
preferred label: Sweden’s local history @en
preferred label: Svensk lokalhistoria @sv
related: Ruotsi
related: Tukholma
related: URN:NBN:fi:au:hklj:989

Saksan historia 1914-1945
type: Class
type: Concept
subclass of: SAKSAN HISTORIA
alternative label: Fasismi, Saksan historia (946 ... 948)
alternative label: Fasistit, Saksan historia (946 ... 948)
alternative label: Kansallissosialismi, Saksan historia (946 ... 948)
alternative label: Kansallissosialistit, Saksan historia (946 ... 948)
alternative label: Kirkkotaistelu, kansallissosialismi, Saksan historia (946 ... 948)
alternative label: Kolmas valtakunta, Saksan historia (946 +)
alternative label: Natsismi, Saksan historia (946 ... 948)
alternative label: Natsit, Saksan historia (946 ... 948)
alternative label: Fascism, Tysklands historia (946 ... 948) @sv
alternative label: Fascister, Tysklands historia (946 ... 948) @sv
alternative label: Kyrkokamp, nationalsocialism, Tysklands historia (946 ... 948) @sv
alternative label: Nationalsocialism, Tysklands historia (946 ... 948) @sv
alternative label: Nationalsocialister, Tysklands historia (946 ... 948) @sv
alternative label: Nazism, Tysklands historia (946 ... 948) @sv
alternative label: Nazister, Tysklands historia (946 ... 948) @sv
alternative label: Tredje riket, Tysklands historia (946 +) @sv
broader: SAKSAN HISTORIA
in scheme: URN:NBN:fi:au:hklj:
narrower: Saksan historia 1914-1932
narrower: Saksan historia 1933-1938
narrower: Saksan historia 1939-1945
notation: 946
preferred label: Germany’s history 1914–1945 @en
preferred label: Tysklands historia 1914–1945 @sv
related: URN:NBN:fi:au:hklj:909
related: URN:NBN:fi:au:hklj:919

Seemiläisten kielten kaunokirjallisuus (Kaunoluokka)
type: Class
type: Concept
type: FormClass
subclass of: MUIDEN KIELTEN KAUNOKIRJALLISUUS (Kaunoluokka)
broader: MUIDEN KIELTEN KAUNOKIRJALLISUUS (Kaunoluokka)
in scheme: URN:NBN:fi:au:hklj:
narrower: Arabiankielinen kaunokirjallisuus (Kaunoluokka)
narrower: Hepreankielinen kaunokirjallisuus (Kaunoluokka)
narrower: Amharankielinen kaunokirjallisuus (Kaunoluokka)
narrower: Tigrinjankielinen kaunokirjallisuus (Kaunoluokka)
notation: 9.5
preferred label: Semitic fiction (Fiction class) @en
preferred label: Semitisk skönlitteratur (Skönklass) @sv
scope note: Aramean-, guragen-, hararin-, maltan-, syyrian ja tigrenkielinen kaunokirjallisuus
scope note: Skönlitteratur på amhariska, arameiska, gurageiska, harari, maltesiska, syriska, tigré och tigrinja @sv

Swahilinkielinen kaunokirjallisuus (Kaunoluokka)
type: Class
type: Concept
type: FormClass
subclass of: Afrikan kielten kaunokirjallisuus (Kaunoluokka)
broader: Afrikan kielten kaunokirjallisuus (Kaunoluokka)
in scheme: URN:NBN:fi:au:hklj:
notation: 9.984
preferred label: Swahili fiction (Fiction class) @en
preferred label: Skönlitteratur på swahili (Skönklass) @sv

Kirjan historia
type: Class
type: Concept
subclass of: KIRJA-ALA
alternative label: Ensipainokset, kirjan historia (003)
alternative label: Harvinaiskirjat, kirjan historia (003)
alternative label: Kirjaharvinaisuudet, kirjan historia (003)
alternative label: Kirjahistoria (003)
alternative label: Kirjallisuus, kirjan historia (003)
alternative label: Kirjan historia (003)
alternative label: Kirjanhistoria (003)
alternative label: Kirjat, kirjan historia (003)
alternative label: Kodikologia, kirjan historia (003)
alternative label: Koodeksit, kirjan historia (003)
alternative label: Messukirjat, kirjan historia (003)
alternative label: Paperin historia, kirjan historia (003)
alternative label: Pergamentti, kirjan historia (003)
alternative label: Pokkarit, kirjan historia (003)
alternative label: Taskukirjat, kirjan historia (003)
alternative label: Vinjetit, kirjan historia (003)
alternative label: Bokens historia (003) @sv
alternative label: Bokhistoria (003) @sv
alternative label: Bokrariteter, bokens historia (003) @sv
alternative label: Böcker, bokens historia (003) @sv
alternative label: Förstaupplagor, bokens historia (003) @sv
alternative label: Kodexar, bokens historia (003) @sv
alternative label: Kodikologi, bokens historia (003) @sv
alternative label: Litteratur, bokens historia (003) @sv
alternative label: Mässböcker, bokens historia (003) @sv
alternative label: Papprets historia, bokens historia (003) @sv
alternative label: Pergament, bokens historia (003) @sv
alternative label: Pocket, bokens historia (003) @sv
alternative label: Pocketböcker, bokens historia (003) @sv
alternative label: Sällsynta böcker, bokens historia (003) @sv
alternative label: Vinjetter, bokens historia (003) @sv
broader: KIRJA-ALA
in scheme: URN:NBN:fi:au:hklj:
notation: 003
preferred label: History of books @en
preferred label: Bokens historia @sv
related: Kirjoituksen historia. Paleografia. Epigrafia
related: Kirjapainotaito. Graafinen teollisuus
related: URN:NBN:fi:au:hklj:005.09
related: Kirjansidonta. Kirjansidontataide
related: URN:NBN:fi:au:hklj:006.09
related: YLEISET TIETOSANAKIRJAT
related: URN:NBN:fi:au:hklj:748
related: Kuvitustaide
related: URN:NBN:fi:au:hklj:800
scope note: Kirjan ja kirjoitetun sanan yleinen historia Ensyklopedian yleinen historia
scope note: Bokens och det skrivna ordets allmänna historia Encyklopedins allmänna historia @sv

Lukeminen. Lukutaito
type: Class
type: Concept
subclass of: KIRJA-ALA
alternative label: Hakuteosten käyttö, kirjojen käyttö (007)
alternative label: Informaatiolukutaito (007)
alternative label: Informaatiolukutaito, lukutaito (007)
alternative label: Lukeminen (007)
alternative label: Lukemistutkimus (007)
alternative label: Lukijat, lukututkimus (007)
alternative label: Lukijatutkimus (007)
alternative label: Lukudiplomit (007)
alternative label: Lukuharrastus (007)
alternative label: Lukukokemukset, lukemistutkimus (007)
alternative label: Lukutaidottomuus (007)
alternative label: Lukutaito (007)
alternative label: Lukutekniikka (007)
alternative label: Lukutottumukset, lukemistutkimus (007)
alternative label: Monilukutaito (007)
alternative label: Pikaluku (007)
alternative label: Uuslukutaidottomuus (007)
alternative label: Visuaalinen lukutaito, lukutaito (007)
alternative label: Yleisö, lukijat, kirjallisuus (007)
alternative label: Analfabetism (007) @sv
alternative label: Informationskompetens (007) @sv
alternative label: Informationskompetens, läsfärdighet (007) @sv
alternative label: Läsare, läsforskning (007) @sv
alternative label: Läsarundersökning (007) @sv
alternative label: Läsdiplom (007) @sv
alternative label: Läsfärdighet (007) @sv
alternative label: Läsintresse (007) @sv
alternative label: Läsning (007) @sv
alternative label: Lästeknik (007) @sv
alternative label: Läsundersökning (007) @sv
alternative label: Läsupplevelser, läsundersökning (007) @sv
alternative label: Läsvanor, läsundersökning (007) @sv
alternative label: Multilitteracitet (007) @sv
alternative label: Nyanalfabetism (007) @sv
alternative label: Publik, läsare, litteratur (007) @sv
alternative label: Snabbläsning (007) @sv
alternative label: Uppslagsverksanvändning, bokanvändning (007) @sv
alternative label: Visuell kompetens, läskunnighet (007) @sv
broader: KIRJA-ALA
in scheme: URN:NBN:fi:au:hklj:
notation: 007
preferred label: Reading. Literacy @en
preferred label: Läsning. Läskunnighet @sv
related: Kirjoitus. Kirjoitustaito
related: URN:NBN:fi:au:hklj:018
related: KIRJASTOT. KIRJASTOTOIMI
related: URN:NBN:fi:au:hklj:188.4
related: URN:NBN:fi:au:hklj:800
related: Kirjallisuuden filosofia, teoria ja estetiikka. Runousoppi
related: Kirjallisuuden psykologia ja sosiologia
scope note: Lukutaito. Lukutaidottomuus Pikaluku Lukuharrastus. Lukemistutkimukset
scope note: Läskunnighet. Lässvårigheter Snabbläsning Läsintresse. Läsundersökningar @sv

Suomi
type: Class
type: Concept
subclass of: Kirjastohistoria
alternative label: Suomi, kirjastohistoria (029.1)
alternative label: Finland, bibliotekshistoria (029.1) @sv
broader: Kirjastohistoria
in scheme: URN:NBN:fi:au:hklj:
notation: 029.1
preferred label: Finland @en
related: URN:NBN:fi:au:hklj:018
related: Yleiset kirjastot
related: Erikoiskirjastot. Yhdistysten, laitosten ja yritysten kirjastot
related: URN:NBN:fi:au:hklj:028
related: Dokumentaatio ja informaatiopalvelu yleensä
related: Museonhoito
related: Arkistonhoito
related: URN:NBN:fi:au:hklj:061
related: URN:NBN:fi:au:hklj:063

Nykyajan filosofia
type: Class
type: Concept
subclass of: Filosofian historia
alternative label: Analyyttinen filosofia (108.6)
alternative label: Dialektinen materialismi, filosofia, 1900-luku (108.6)
alternative label: Eksistentialismi, filosofian historia (108.6)
alternative label: Filosofian historia, itämainen, vuodesta 1900 (108.6)
alternative label: Filosofian historia, nykyaika (108.6)
alternative label: Hegeliläisyys, 1900-luvun filosofia (108.6)
alternative label: Historiallinen materialismi, filosofia, 1900-luku (108.6)
alternative label: Intia, filosofia vuodesta 1900 (108.6)
alternative label: Irrationalismi, filosofia, 1900-luvun filosofia (108.6)
alternative label: Itämainen filosofia, vuodesta 1900 (108.6)
alternative label: Jälkimoderni, filosofia (108.6)
alternative label: Jälkimodernismi, filosofia (108.6)
alternative label: Konstruktionismi, filosofia (108.6)
alternative label: Konstruktivismi, filosofia (108.6)
alternative label: Leninismi, filosofia (108.6)
alternative label: Marksilaisuus, 1900-luvun filosofia (108.6)
alternative label: Marksismi, 1900-luvun filosofia (108.6)
alternative label: Marksismi-leninismi, 1900-luvun filosofia (108.6)
alternative label: Marxismi, 1900-luvun filosofia (108.6)
alternative label: Marxismi-leninismi, 1900-luvun filosofia (108.6)
alternative label: Materialismi, dialektinen, filosofia 1900-l. (108.6)
alternative label: Materialistinen historiankäsitys, filosofia, 1900-luku (108.6)
alternative label: Metafilosofia, 1900-luvun filosofia (108.6)
alternative label: Moderni, filosofia (108.6)
alternative label: Modernismi, filosofia (108.6)
alternative label: Postmoderni, filosofia (108.6)
alternative label: Postmodernismi, filosofia (108.6)
alternative label: Strukturalismi, filosofia (108.6)
alternative label: Uusi aika, filosofia (108.4 ... 108.6)
alternative label: Uuskantilaisuus, 1900-luvun filosofia (108.6)
alternative label: Uusrealismi, filosofia (108.6)
alternative label: Uustomismi, 1900-luvun filosofia (108.6)
alternative label: Analytisk filosofi (108.6) @sv
alternative label: Dialektisk materialism, filosofi, 1900-talet (108.6) @sv
alternative label: Existentialism, filosofins historia (108.6) @sv
alternative label: Filosofins historia, nutiden (108.6) @sv
alternative label: Filosofins historia, österländsk, från år 1900 (108.6) @sv
alternative label: Hegelianism, 1900-talets filosofi (108.6) @sv
alternative label: Historiematerialism, filosofi, 1900-talet (108.6) @sv
alternative label: Historisk materialism, filosofi, 1900-talet (108.6) @sv
alternative label: Indien, filosofi från år 1900 (108.6) @sv
alternative label: Irrationalism, filosofi, 1900-talets filosofi (108.6) @sv
alternative label: Konstruktionism, filosofi (108.6) @sv
alternative label: Konstruktivism, filosofi (108.6) @sv
alternative label: Leninism, filosofi (108.6) @sv
alternative label: Marksism, 1900-talets filosofi (108.6) @sv
alternative label: Marksism-leninism, 1900-talets filosofi (108.6) @sv
alternative label: Marxism, 1900-talets filosofi (108.6) @sv
alternative label: Marxism-leninism, 1900-talets filosofi (108.6) @sv
alternative label: Materialism, dialektisk, filosofi 1900-l. (108.6) @sv
alternative label: Materialistisk historieuppfattning, filosofi, 1900-talet (108.6) @sv
alternative label: Metafilosofi, 1900-luvun filosofi (108.6) @sv
alternative label: Modern, filosofi (108.6) @sv
alternative label: Modernism, filosofi (108.6) @sv
alternative label: Nya tiden, filosofi (108.4 ... 108.6) @sv
alternative label: Nykantianism, 1900-talets filosofi (108.6) @sv
alternative label: Nyrealism, filosofi (108.6) @sv
alternative label: Nythomism, 1900-talets filosofi (108.6) @sv
alternative label: Postmodern, filosofi (108.6) @sv
alternative label: Postmodernism, filosofi (108.6) @sv
alternative label: Senmodern, filosofi (108.6) @sv
alternative label: Senmodernism, filosofi (108.6) @sv
alternative label: Strukturalism, filosofi (108.6) @sv
broader: Filosofian historia
in scheme: URN:NBN:fi:au:hklj:
notation: 108.6
related: Oppikirjat. Johdatukset filosofiaan
related: Esseet
related: Itämainen filosofia
related: Suomi
related: URN:NBN:fi:au:hklj:110
related: Tietoteorian historia ja suunnat
related: Sosialismi. Kommunismi
related: Nykyajan kulttuurihistoria 1914-1938
related: Nykyajan kulttuurihistoria 1939-
scope note: Looginen positivismi, analyyttinen filosofia, fenomenologia, eksistentialismi, historiallinen materialismi ja marxismi vuodesta 1900 Croce, Brentano, Husserl, Heidegger, Carnap, Habermas, Wittgenstein, Russell, Moore, Popper, Sartre ja heidän aikalaistensa filosofia Filosofian erikoisalojen kysymykset alan mukaisessa luokassa
scope note: Logisk positivism, analytisk filosofi, fenomenologi, existentialism, historisk materialism och marxism från år 1900 Croce, Brentano, Husserl, Heidegger, Carnap, Habermas, Wittgenstein, Russell, Moore, Popper, Sartre och deras samtida filosofi Specialfrågor inom filosofin klassificeras enligt område @sv

Alitajunta
type: Class
type: Concept
subclass of: Tiedostamaton sielunelämä
alternative label: Lapsukset, piilotajunta, psykologia (121.92)
alternative label: Nukkuminen, unitutkimus (121.92)
alternative label: Piilotajunta, psykologia (121.92)
alternative label: Torjunta, psykologia, alitajunta (121.92)
alternative label: Bortträngning, psykologi, undermedvetande (121.92) @sv
alternative label: Lapsusar, undermedvetna, psykologi (121.92) @sv
alternative label: Sovande, sömnforskning (121.92) @sv
alternative label: Undermedvetna, psykologi (121.92) @sv
broader: Tiedostamaton sielunelämä
in scheme: URN:NBN:fi:au:hklj:
notation: 121.92
preferred label: The subconscious @en
preferred label: Det undermedvetna @sv
related: Tunne- ja tahtotoiminnot
related: Psykologian suunnat
related: Syvyyspsykologia
related: Lapsuuden ja nuoruuden psykologia
related: Muita psykologian aloja
related: Kehityspsykologia. Eri ikäkausien psykologia
related: Parapsykologia
related: Kuolemakokemukset
related: Analyyttinen psykoterapia
scope note: Alitajuntaa koskeva psykologinen tutkimus yleensä
scope note: Psykologisk forskning om det undermedvetna i allmänhet @sv

TIETOTEORIA. TIETO-OPPI
type: Class
type: Concept
subclass of: URN:NBN:fi:au:hklj:100
alternative label: Aika, tietoteoria (140 ... 148)
alternative label: Aposteriorinen tieto (140 ... 148)
alternative label: Apriorinen tieto (140 ... 148)
alternative label: Arkitieto, tietoteoria (140 ... 148)
alternative label: Common sense, tietoteoria (140 ... 148)
alternative label: Determinismi, tietoteoria (140 ... 148)
alternative label: Dogmatismi, tietoteoria (140 ... 148)
alternative label: Eksistenssi, tietoteoria (140 ... 148)
alternative label: Eksplisiittinen tieto (140 ... 148)
alternative label: Ensitieto (140 ... 148)
alternative label: Filosofia, tietoteoria (140 ... 148)
alternative label: Gnoseologia (140 ... 148)
alternative label: Hiljainen tieto (140 ... 148)
alternative label: Hiljainen tieto, tieto-oppi (140 ... 148)
alternative label: Ilmiöt, tietoteoria (140 ... 148)
alternative label: Induktio, tietoteoria (140 ... 148)
alternative label: Intressit, tietoteoria (140 ... 148)
alternative label: Järki, tietoteoria (140 ... 148)
alternative label: Kausaalisuus, tietoteoria (140 ... 148)
alternative label: Kausaliteetti, tietoteoria (140 ... 148)
alternative label: Kokemustieto (140 ... 148)
alternative label: Käsiteanalyysi, tietoteoria (140 ... 148)
alternative label: Käsitteenmuodostus, tietoteoria (140 ... 148)
alternative label: Käsitteet, tietoteoria (140 ... 148)
alternative label: Metadata, tietoteoria (140 ... 148)
alternative label: Metatieto, tietoteoria (140 ... 148)
alternative label: Objekti, tietoteoria (140 ... 148)
alternative label: Oikeellisuus, tieto (140 ... 148)
alternative label: Piilevä tieto (140 ... 148)
alternative label: Piilevä tieto, tieto-oppi (140 ... 148)
alternative label: Piilotieto (140 ... 148)
alternative label: Piilotieto, tieto-oppi (140 ... 148)
alternative label: Rakenne, tietoteoria (140 ... 148)
alternative label: Ratio, tietoteoria (140 ... 148)
alternative label: Struktuuri, tietoteoria (140 ... 148)
alternative label: Suhteellisuus, tietoteoria (140 ... 148)
alternative label: Syysuhde, tietoteoria (140 ... 148)
alternative label: Teoreettinen filosofia, tietoteoria (140 ... 148)
alternative label: Terve järki, tietoteoria (140 ... 148)
alternative label: Tiedonkäsitys (140 ... 148)
alternative label: Tieto (140 ... 148)
alternative label: Tieto-oppi (140 ... 148)
alternative label: Tietokritiikki (140 ... 148)
alternative label: Tietokäsitys (140 ... 148)
alternative label: Tietoteoria (140 ... 148)
alternative label: Todellisuus, tietoteoria (140 ... 148)
alternative label: Todennäköisyys, tietoteoria (140 ... 148)
alternative label: Totuus, tietoteoria (140 ... 148)
alternative label: Transsendentaalifilosofia, tieto-oppi (140 ... 148)
alternative label: Transsendentalismi , tieto-oppi (140 ... 148)
alternative label: Varmuus, tietoteoria (140 ... 148)
alternative label: Ymmärtäminen, tietoteoria (140 ... 148)
alternative label: Begrepp, kunskapsteori (140 ... 148) @sv
alternative label: Begreppsanalys, kunskapsteori (140 ... 148) @sv
alternative label: Begreppsbildning, kunskapsteori (140 ... 148) @sv
alternative label: Common sense, kunskapsteori (140 ... 148) @sv
alternative label: Determinism, kunskapsteori (140 ... 148) @sv
alternative label: Dogmatism, kunskapsteori (140 ... 148) @sv
alternative label: Dold kunskap (140 ... 148) @sv
alternative label: Dold kunskap, kunskapslära (140 ... 148) @sv
alternative label: Empirisk kunskap (140 ... 148) @sv
alternative label: Existens, kunskapsteori (140 ... 148) @sv
alternative label: Explicit kunskap (140 ... 148) @sv
alternative label: Fenomen, kunskapsteori (140 ... 148) @sv
alternative label: Filosofi, kunskapsteori (140 ... 148) @sv
broader: URN:NBN:fi:au:hklj:100
in scheme: URN:NBN:fi:au:hklj:
narrower: Tietoteorian historia ja suunnat
notation: 140
related: Teoria. Tutkimusmenetelmät
related: Filosofian historia
related: URN:NBN:fi:au:hklj:110
related: LOGIIKKA
related: TIEDEOPPI
related: Tieteenfilosofia
scope note: Yleinen tietoteoria ja tieto-oppi Tiedon edellytykset, alkuperä, lähteet, olemus, lajit, rajat, kohteet, varmuus, tehtävät, kritiikki ja arvo yleisen tietoteorian kannalta Erikoisalojen tietoteoria alan mukaisessa luokassa
scope note: Allmän kunskapsteori och kunskapslära Vetandets förutsättningar, ursprung, källor, väsen, arter, gränser, objekt, säkerhet, uppgifter, kritik och värde ur den allmänna kunskapsteorins synvinkel Specialområden inom kunskapsteorin klassificeras enligt område @sv

Pohjoismaat
type: Class
type: Concept
subclass of: Eri maiden kirkkohistoria
broader: Eri maiden kirkkohistoria
in scheme: URN:NBN:fi:au:hklj:
narrower: Ruotsi
notation: 279.2
preferred label: Nordic countries @en
preferred label: Norden @sv
related: URN:NBN:fi:au:hklj:209
related: URN:NBN:fi:au:hklj:210
related: Kristillisen teologian historia
related: URN:NBN:fi:au:hklj:260
related: Protestanttiset kirkot ja yhteisöt
related: Kirkot ja muut uskonnolliset rakennukset
related: URN:NBN:fi:au:hklj:992

Muu Eurooppa
type: Class
type: Concept
subclass of: Eri maiden kirkkohistoria
broader: Eri maiden kirkkohistoria
in scheme: URN:NBN:fi:au:hklj:
narrower: Germany {@e
notation: 279.3
preferred label: Rest of Europe @en
preferred label: Övriga Europa @sv
related: URN:NBN:fi:au:hklj:209
related: URN:NBN:fi:au:hklj:210
related: Kristillisen teologian historia
related: URN:NBN:fi:au:hklj:260
related: Protestanttiset kirkot ja yhteisöt
related: Kirkot ja muut uskonnolliset rakennukset
related: URN:NBN:fi:au:hklj:992

Kokoomateokset
type: Class
type: Concept
subclass of: URN:NBN:fi:au:hklj:300
broader: URN:NBN:fi:au:hklj:300
in scheme: URN:NBN:fi:au:hklj:
narrower: Standardit
narrower: Tilastot. Taulukot
narrower: Kartat
narrower: Museot. Arkistot. Kokoelmat. Näyttelyt
notation: 308
preferred label: Compilations. Polygraphies @en
preferred label: Samlingsverk. Polygrafier @sv
related: Esseet
scope note: Yhteiskuntaa tai yhteiskuntatieteitä koskevat yleiset tai sekasisältöiset kokoomateokset Eri yhteiskuntatieteitä koskevat kokoomateokset alan mukaisessa luokassa
scope note: Samlingsverk och polygrafier med allmänt eller blandat innehåll som handlar om samhället eller samhällsvetenskaperna Samlingsverk och polygrafier som handlar om olika samhällsvetenskaper klassificeras enligt område @sv

Rotujen asema. Rotusyrjintä
type: Class
type: Concept
subclass of: URN:NBN:fi:au:hklj:323
alternative label: Aboriginaalit, Australia, rotukysymykset (323.1)
alternative label: Afroamerikkalaiset, rotukysymykset (323.1)
alternative label: Antirasismi (323.1)
alternative label: Apartheid, rotuerottelu (323.1)
alternative label: Diskriminointi, rotusyrjintä (323.1)
alternative label: Erottelu, rotuerottelu (323.1)
alternative label: Etelä-Afrikan tasavalta, rotukysymys (323.1)
alternative label: Etniset suhteet, rasismi, apartheid (323.1)
alternative label: Etnosentrismi, rasismi (323.1 ... 323.2)
alternative label: Eugeniikka, rotuhygienia (323.1)
alternative label: Ghetot (323.1)
alternative label: Ihmisrodut, rotusyrjintä (323.1)
alternative label: Kiihottaminen kansanryhmää vastaan, rasismi (323.1)
alternative label: Kiihottaminen kansanryhmää vastaan, rotusyrjintä (323.1)
alternative label: Kiintiöt, rotujen asema (323.1)
alternative label: Monikulttuurinen avioliitto, rotukysymys (323.1)
alternative label: Mustat muslimit (323.1)
alternative label: Mustat pantterit (323.1)
alternative label: POC (People of Colour), rotujen asema (323.1)
alternative label: POC-ihmiset, rotujen asema (323.1)
alternative label: Rasismi (323.1)
alternative label: Rasismi, apartheid (323.1)
alternative label: Rasismi, rotusyrjintä (323.1)
alternative label: Rasismin ehkäisy, antirasismi (323.1)
alternative label: Rasistiset rikokset, rotusyrjintä (323.1)
alternative label: Rodut, rotusyrjintä (323.1)
alternative label: Rodut, vähemmistöjen asema (323.1)
alternative label: Rotuerottelu, rasismi (323.1)
alternative label: Rotuhygienia (323.1)
alternative label: Rotusorto, rasismi (323.1)
alternative label: Rotusyrjintä (323.1)
alternative label: Rotusyrjintä, rasismi (323.1)
alternative label: Segregaatio, rotuerottelu (323.1)
alternative label: Sosiaaliset ongelmat, rotuongelmat (323.1)
alternative label: Syrjintä, rotusyrjintä (323.1)
alternative label: Tasa-arvo, rotujen välinen (323.1)
alternative label: Tasa-arvoisuus, rotujen välinen (323.1)
alternative label: Tasa-arvopolitiikka, rotujen välinen (323.1)
alternative label: Värilliset, rotujen asema (323.1)
alternative label: Yhteiskunnalliset ongelmat, rotuongelmat (323.1)
alternative label: Aboriginer, Australien, rasfrågor (323.1) @sv
alternative label: Afroamerikaner, rasfrågor (323.1) @sv
alternative label: Antirasism (323.1) @sv
alternative label: Apartheid, rasdiskriminering (323.1) @sv
alternative label: Diskrimination, rasdiskriminering (323.1) @sv
alternative label: Diskriminering, rasdiskriminering (323.1) @sv
alternative label: Etniska relationer, rasism, apartheid (323.1) @sv
alternative label: Etnocentrism, rasism (323.1 ... 323.2) @sv
alternative label: Eugenik, rashygien (323.1) @sv
alternative label: Färgade, rasernas ställning (323.1) @sv
alternative label: Förebyggande av rasism, antirasism (323.1) @sv
alternative label: Ghetton (323.1) @sv
alternative label: Hets mot folkgrupp, rasdiskriminering (323.1) @sv
alternative label: Hets mot folkgrupp, rasism (323.1) @sv
alternative label: Jämställdhet, mellan raser (323.1) @sv
alternative label: Jämställdhetspolitik, mellan raser (323.1) @sv
alternative label: Kvoter, rasernas ställning (323.1) @sv
alternative label: Människoraser, rasdiskriminering (323.1) @sv
alternative label: Mångkulturellt äktenskap, rasfrågan (323.1) @sv
alternative label: POC (People of Colour), rasernas ställning (323.1) @sv
alternative label: POC-personer, rasernas ställning (323.1) @sv
alternative label: Rasdiskriminering (323.1) @sv
alternative label: Rasdiskriminering, rasism (323.1) @sv
alternative label: Raser, minoriteternas ställning (323.1) @sv
broader: URN:NBN:fi:au:hklj:323
in scheme: URN:NBN:fi:au:hklj:
notation: 323.1
related: Valtiofilosofia. Valtiomuodot
related: URN:NBN:fi:au:hklj:323.109
related: URN:NBN:fi:au:hklj:332.1
related: URN:NBN:fi:au:hklj:357.1
related: URN:NBN:fi:au:hklj:384
related: Sotien yhteiskunnalliset vaikutukset
related: Taiteen estetiikka. Taidefilosofia. Taidepsykologia. Taidesosiologia. Taidepolitiikka
related: Etelä-Afrikan historia
scope note: Rodullisten väestöryhmien asema eri maissa Rotusyrjintä ja apartheid eri maissa
scope note: Etniska gruppers ställning i olika länder Rasdiskriminering och apartheid i olika länder @sv

Orjuus
type: Class
type: Concept
subclass of: URN:NBN:fi:au:hklj:323
alternative label: Ihmiskauppa, orjuus (323.9)
alternative label: Orjakauppa, orjuus (323.9)
alternative label: Orjat, orjuus (323.9)
alternative label: Orjuus (323.9)
alternative label: Vapautetut orjat, orjuus (323.9)
alternative label: Vapautuneet orjat, orjuus (323.9)
alternative label: Frigivna slavar, slaveri (323.9) @sv
alternative label: Människohandel, slaveri (323.9) @sv
alternative label: Slavar, slaveri (323.9) @sv
alternative label: Slaveri (323.9) @sv
alternative label: Slavhandel, slaveri (323.9) @sv
broader: URN:NBN:fi:au:hklj:323
in scheme: URN:NBN:fi:au:hklj:
notation: 323.9
preferred label: Slavery @en
preferred label: Slaveri @sv
related: Valtiofilosofia. Valtiomuodot
related: URN:NBN:fi:au:hklj:323.909
related: URN:NBN:fi:au:hklj:332.1
related: URN:NBN:fi:au:hklj:352.09
related: URN:NBN:fi:au:hklj:357.1
related: URN:NBN:fi:au:hklj:384
related: Sotien yhteiskunnalliset vaikutukset
related: Taiteen estetiikka. Taidefilosofia. Taidepsykologia. Taidesosiologia. Taidepolitiikka
scope note: Orjuus eri maissa
scope note: Slaveri i olika länder @sv

Yhdistyneet Kansakunnat
type: Class
type: Concept
subclass of: Kansainvälinen yhteistyö
alternative label: FAO (326.4)
alternative label: ILO (326.4)
alternative label: Julistukset, Yhdistyneet kansakunnat (326.4)
alternative label: Jäsenvaltiot, Yhdistyneet kansakunnat (326.4)
alternative label: Kansainvälinen työjärjestö (326.4)
alternative label: Maailmanjärjestöt, YK (326.4)
alternative label: Monikansalliset joukot, YK:n rauhanturvajoukot (326.4)
alternative label: Rauhaanpakottaminen, YK:n rauhanturvajoukot (326.4)
alternative label: Rauhanturvaaminen, YK:n rauhanturvajoukot (326.4)
alternative label: Rauhanturvajoukot, YK (326.4)
alternative label: UNESCO (326.4)
alternative label: Vaalitarkkailu, Yhdistyneet Kansakunnat, (326.4)
alternative label: Valmiusjoukot, YK:n rauhanturvajoukot (326.4)
alternative label: Veto-oikeus, Yhdistyneet Kansakunnat (326.4)
alternative label: WHO (326.4)
alternative label: YK (326.4)
alternative label: YK, alajärjestöt (326.4)
alternative label: YK, rauhanturvajoukot (326.4)
alternative label: Yhdistyneet Kansakunnat (326.4)
alternative label: Yhdistyneet Kansakunnat, alajärjestöt (326.4)
alternative label: Yhdistyneet Kansakunnat, rauhanturvajoukot (326.4)
alternative label: Beredskapsstyrkor, FN:s fredsbevarande trupper (326.4) @sv
alternative label: FN (326.4) @sv
alternative label: FN, fredsbevarande trupper (326.4) @sv
alternative label: FN, underorganisationer (326.4) @sv
alternative label: Fredsbevarande styrkor, FN (326.4) @sv
alternative label: Fredsbevarande, FN:s fredsbevarande styrkor (326.4) @sv
alternative label: Fredsframtvingande verksamhet, FN:s fredsbevarande trupper (326.4) @sv
alternative label: Förenta Nationerna (326.4) @sv
alternative label: Förenta Nationerna, fredsbevarande trupper (326.4) @sv
alternative label: Förenta Nationerna, underorganisationer (326.4) @sv
alternative label: Internationella arbetsorganisationen (326.4) @sv
alternative label: Medlemsstater, Förenta Nationerna (326.4) @sv
alternative label: Multinationella trupper, FN:s fredsbevarande trupper (326.4) @sv
alternative label: Proklamationer, Förenta Nationerna (326.4) @sv
alternative label: Valövervakning, Förenta Nationerna (326.4) @sv
alternative label: Vetorätt, Förenta Nationerna (326.4) @sv
alternative label: Världsorganisationer, FN (326.4) @sv
broader: Kansainvälinen yhteistyö
in scheme: URN:NBN:fi:au:hklj:
notation: 326.4
preferred label: United Nations @en
preferred label: Förenta nationerna @sv
related: URN:NBN:fi:au:hklj:060
related: URN:NBN:fi:au:hklj:325
related: Suomen ulkopolitiikka
related: URN:NBN:fi:au:hklj:326.409
related: Rauhankysymys. Rauhantutkimus
related: Maailmankauppa. Kansainväliset talousjärjestöt
related: Kehitysmaiden taloudelliset olot
related: URN:NBN:fi:au:hklj:390
related: Suomen puolustusvoimat
scope note: YK:n yleiskokous ja turvaneuvosto YK:n rauhanturvatoiminta, rauhanturvajoukot YK:n alajärjestöt ja niiden toiminta alasta riippumatta: ILO, UNESCO, UNICEF, WHO ym.
scope note: FN:s generalförsamling och säkerhetsråd FN:s fredsbevarande verksamhet, fredsbevarande styrkor FN:s underorganisationer och deras verksamhet oavsett område: ILO, UNESCO, UNICEF, WHO m.fl. @sv

Monikansalliset yritykset
type: Class
type: Concept
subclass of: Kansainväliset taloudelliset suhteet. Maailmantalous
alternative label: Ansiokehitys (367.3)
alternative label: Anti-Imperialismi, monikansalliset yritykset (367.3)
alternative label: Eurooppa-yhtiöt, monikansalliset yritykset (367.3)
alternative label: Eurooppalaiset osakeyhtiöt, monikansalliset yritykset (367.3)
alternative label: Eurooppayhtiöt, monikansalliset yritykset (367.3)
alternative label: Imperialismi, monikansalliset yritykset (367.3)
alternative label: Kansainväliset yritykset (367.3)
alternative label: Konsernit, monikansalliset yritykset (367.3)
alternative label: Laajeneminen, monikansalliset yritykset (367.3)
alternative label: Laajentuminen, monikansalliset yritykset (367.3)
alternative label: Liittoumat, monikansalliset yritykset (367.3)
alternative label: Liittoutumat, monikansalliset yritykset (367.3)
alternative label: Maahantuojat, monikansalliset yritykset (367.3)
alternative label: Monialayritykset, monikansalliset yritykset (367.3)
alternative label: Monikansalliset yritykset (367.3)
alternative label: Palkkakehitys (367.3)
alternative label: Sekayhtiöt, monikansalliset yritykset (367.3)
alternative label: Sisaryhtiöt, monikansalliset yritykset (367.3)
alternative label: Suuryritykset, monikansalliset yritykset (367.3)
alternative label: Ulkomaalaisomistus, monikansalliset yritykset (367.3)
alternative label: Ulkomainen omistus, monikansalliset yritykset (367.3)
alternative label: Uuskolonialismi, monikansalliset yritykset (367.3)
alternative label: Yhtiöt, monikansalliset yritykset (367.3)
alternative label: Yhtymät, monikansalliset yritykset (367.3)
alternative label: Ylikansallisuus, monikansalliset yritykset (367.3)
alternative label: Allianser, multinationella företag (367.3) @sv
alternative label: Antiimperialism, multinationella företag (367.3) @sv
alternative label: Blandbolag, multinationella företag (367.3) @sv
alternative label: Bolag, multinationella företag (367.3) @sv
alternative label: Europa-bolag, multinationella företag (367.3) @sv
alternative label: Europabolag, multinationella företag (367.3) @sv
alternative label: Europeiska aktiebolag, multinationella företag (367.3) @sv
alternative label: Expansion, multinationella företag (367.3) @sv
alternative label: Flerbranschföretag, multinationella företag (367.3) @sv
alternative label: Förtjänstutveckling (367.3) @sv
alternative label: Imperialism, multinationella företag (367.3) @sv
alternative label: Importörer, multinationella företag (367.3) @sv
alternative label: Internationella företag (367.3) @sv
alternative label: Koncerner, multinationella företag (367.3) @sv
alternative label: Konsortier, multinationella företag (367.3) @sv
alternative label: Löneutveckling (367.3) @sv
alternative label: Multinationella företag (367.3) @sv
alternative label: Nykolonialism, multinationella företag (367.3) @sv
alternative label: Storföretag, multinationella företag (367.3) @sv
alternative label: Systerbolag, multinationella företag (367.3) @sv
alternative label: Utländskt ägarslap, multinationella företag (367.3) @sv
alternative label: Utvidgning, expansion, multinationella företag (367.3) @sv
alternative label: Övernationella fenomen, multinationella företag (367.3) @sv
broader: Kansainväliset taloudelliset suhteet. Maailmantalous
in scheme: URN:NBN:fi:au:hklj:
notation: 367.3
preferred label: Multinational businesses @en
preferred label: Multinationella företag @sv
related: URN:NBN:fi:au:hklj:325
related: Kansainvälinen yhteistyö
related: Muiden maanosien valtioiden keskinäinen yhteistyö
related: Vero-oikeus
related: Talousjärjestelmät
related: Suomen ulkomaankauppa
related: Kehitysmaiden taloudelliset olot
related: URN:NBN:fi:au:hklj:368
related: URN:NBN:fi:au:hklj:675
scope note: Monikansallisia yrityksiä koskevat yleisteokset Monikansallisten yritysten asema maailmankaupassa Monikansallisten yritysten suhteet kansainvälisiin talousjärjestöihin Tietyn alan monikansalliset yritykset alan mukaisessa luokassa
scope note: Allmänna verk som rör multinationella företag De multinationella företagens ställning i världshandeln De multinationella företagens relationer till internationella ekonomiska organisationer Multinationella företag inom ett bestämt område klassificeras enligt område @sv

Hinnat. Hintapolitiikka
type: Class
type: Concept
subclass of: URN:NBN:fi:au:hklj:368
alternative label: Alennus (368.2)
alternative label: Alentaminen (368.2)
alternative label: Hinnanalennus (368.2)
alternative label: Hinnankorotus (368.2)
alternative label: Hinnanlasku (368.2)
alternative label: Hinnanmuodostus (368.2)
alternative label: Hinnannousu (368.2)
alternative label: Hinnat (368.2)
alternative label: Hinnoittelu, hintapolitiikka (368.2)
alternative label: Hintaindeksit (368.2)
alternative label: Hintakehitys (368.2)
alternative label: Hintakilpailu, hintapolitiikka (368.2)
alternative label: Hintapolitiikka (368.2)
alternative label: Hintavalvonta (368.2)
alternative label: Hintavertailu (368.2)
alternative label: Kuluttajahinnat (368.2)
alternative label: Tariffit (368.2)
alternative label: Tukkuhinnat (368.2)
alternative label: Tuottajahinnat (368.2)
alternative label: Yksikköhinnat (368.2)
alternative label: Jämförpriser (368.2) @sv
alternative label: Konsumentpriser (368.2) @sv
alternative label: Partipriser (368.2) @sv
alternative label: Prisbildning (368.2) @sv
alternative label: Priser (368.2) @sv
alternative label: Prisfalll (368.2) @sv
alternative label: Prishöjning (368.2) @sv
alternative label: Prisindex (368.2) @sv
alternative label: Prisjämförelser (368.2) @sv
alternative label: Priskonkurrens, prispolitik (368.2) @sv
alternative label: Priskontroll (368.2) @sv
alternative label: Prispolitik (368.2) @sv
alternative label: Prisstegring (368.2) @sv
alternative label: Prissänkning (368.2) @sv
alternative label: Prissättning, prispolitik (368.2) @sv
alternative label: Prisutveckling (368.2) @sv
alternative label: Producentpriser (368.2) @sv
alternative label: Rabatt (368.2) @sv
alternative label: Sänkning (368.2) @sv
alternative label: Tariffer (368.2) @sv
broader: URN:NBN:fi:au:hklj:368
in scheme: URN:NBN:fi:au:hklj:
notation: 368.2
preferred label: Prices. Pricing policy @en
preferred label: Priser. Prispolitik @sv
related: Pääoma. Työ. Luonnonvarat
related: URN:NBN:fi:au:hklj:363
related: Talousjärjestelmät
related: Elintaso. Kulutus
related: Talouselämän kehitysilmiöt
related: URN:NBN:fi:au:hklj:370
related: Markkinointi. Asiakaspalvelu
related: Mainonta. Kuluttajanvalistus
related: Kuluttajanvalistus
scope note: Hintoja ja hintapolitiikkaa koskevat yleisteokset Hinnanmuodostus. Hintaindeksit. Hintakilpailu Tiettyä tuotetta tai tuoteryhmää koskevat hinnat ja hintapolitiikka ko. tuotteen mukaisessa luokassa
scope note: Allmänna verk som rör priser och prispolitik Prisbildning, Prisindex. Priskonkurrens Priser och prispolitik som rör enskilda produkter eller produktgrupper klassificeras enligt område @sv

Siirtolaisuus
type: Class
type: Concept
subclass of: URN:NBN:fi:au:hklj:371
alternative label: Amerikanruotsalaiset (371.9)
alternative label: Amerikansuomalaiset (371.9)
alternative label: Argentiinansuomalaiset, ulkosuomalaiset (371.9)
alternative label: Australiansuomalaiset (371.9)
alternative label: Emigrantit (371.9)
alternative label: Etniset suhteet, siirtolaisten asema (371.9)
alternative label: Ihmiskauppa, siirtolaisuus (371.9)
alternative label: Ihmissalakuljetus, siirtolaisuus (371.9)
alternative label: Inkeriläiset, paluumuuttajat (371.9)
alternative label: Integraatio, maahanmuuttajat (371.9)
alternative label: Kotouttaminen (371.9)
alternative label: Kotouttaminen, maahanmuuttajat (371.9)
alternative label: Kotoutuminen (371.9)
alternative label: Kotoutuminen, maahanmuuttajat (371.9)
alternative label: Kulttuurienvälisyys, maahanmuuttajat (371.9)
alternative label: Kulttuurikosketukset, siirtolaisuus (371.9)
alternative label: Kulttuurivaikutukset, siirtolaisuus (371.9)
alternative label: Laiton maahanmuutto, maahanmuutto (371.9)
alternative label: Loikkarit, maahanmuutto (371.9)
alternative label: Lumeavioliitto, maahanmuutto (371.9)
alternative label: Maahanmuuttajat (371.9)
alternative label: Maahanmuuttajatyö (371.9)
alternative label: Maahanmuutto (371.9)
alternative label: Maahanmuutto, siirtolaisuus (371.9)
alternative label: Maahanmuuttopolitiikka (371.9)
alternative label: Maahanmuuttotyö (371.9)
alternative label: Maastamuutto, siirtolaisuus (371.9)
alternative label: Monikulttuurisuus, maahanmuuttajat (371.9)
alternative label: Muukalaisuus, maahanmuuttajat (371.9)
alternative label: Muuttoliike, siirtolaisuus (371.9)
alternative label: Norjansuomalaiset, siirtolaisuus (371.9)
alternative label: Näennäisavioliitto, maahanmuutto (371.9)
alternative label: Paluumuuttajat (371.9)
alternative label: Paluumuutto (371.9)
alternative label: Paperiavioliitto, maahanmuutto (371.9)
alternative label: Ruotsinsuomalaiset (371.9)
alternative label: Siirtokunnat, siirtolaisuus (371.9)
alternative label: Siirtolaiset (371.9)
alternative label: Siirtolaiset, siirtolaispolitiikka (371.9)
alternative label: Siirtolaispolitiikka (371.9)
alternative label: Siirtolaisuus (371.9)
alternative label: Siirtolaisuus, siirtolaispolitiikka (371.9)
alternative label: Siirtotyöläiset, siirtolaisuus (371.9)
alternative label: Sopeutuminen, maahanmuuttajat (371.9)
alternative label: Sosiaalinen asema, siirtolaiset (371.9)
alternative label: Sosiaalinen integraatio, siirtolaiset (371.9)
alternative label: Sosiaaliset verkostot, maahanmuuttajat (371.9)
alternative label: Ulkomaalaiset, siirtolaisuus (371.9)
alternative label: Ulkomaalaispolitiikka (371.9)
alternative label: Ulkomainen työvoima, siirtolaisuus (371.9)
alternative label: Ulkosuomalaiset (371.9)
alternative label: Valeavioliitto, maahanmuutto (371.9)
alternative label: Vastaanottokeskukset, siirtolaiset (371.9)
alternative label: Vierastyövoima, siirtolaisuus (371.9)
alternative label: Yhteiskunnallinen asema, siirtolaiset (371.9)
alternative label: Amerikafinländare (371.9) @sv
alternative label: Amerikasvenskar (371.9) @sv
alternative label: Anpassning, invandrare (371.9) @sv
alternative label: Australienfinländare (371.9) @sv
alternative label: Avhoppare, invandring (371.9) @sv
alternative label: Emigranter (371.9) @sv
alternative label: Emigration (371.9) @sv
alternative label: Emigration, migrationspolitik (371.9) @sv
broader: URN:NBN:fi:au:hklj:371
in scheme: URN:NBN:fi:au:hklj:
notation: 371.9
related: Väestötiede. Väestöpolitiikka
related: URN:NBN:fi:au:hklj:323
related: Poliittiset ja aatteelliset vähemmistöt
related: Työoikeus
related: Alueellinen sosiologia. Maassamuutto
related: Työllisyys. Työttömyys. Työvoimapalvelu
related: URN:NBN:fi:au:hklj:371.909
related: Työmarkkinajärjestöt
related: Sotien yhteiskunnalliset vaikutukset
scope note: Siirtolaiset ja siirtolaispolitiikka yleensä Maastamuutto. Maahanmuutto. Siirtotyöläiset Siirtolaisten asema eri maissa
scope note: Utvandrare och invandrare samt migrationspolitik i allmänhet Utvandring. Invandring. Invandrararbetskraft Utvandrarnas och invandrarnas ställning i olika länder @sv

Yksityinen avustus- ja huoltotyö
type: Class
type: Concept
subclass of: Järjestötoiminta. Kokoustekniikka
alternative label: Almut, hyväntekeväisyys (377.4)
alternative label: Alueellinen sosiaalityö, yksityinen sosiaalityö (377.4)
alternative label: Aluesosiaalityö, yksityinen sosiaalityö (377.4)
alternative label: Aluetyö, yksityinen sosiaalityö (377.4)
alternative label: Apu, vapaaehtoistyö (377.4)
alternative label: Asevelityö (377.4)
alternative label: Aseveljeys, asevelityö (377.4)
alternative label: Auttaminen, vapaaehtoistyö (377.4)
alternative label: Avunanto, vapaaehtoistyö (377.4)
alternative label: Avustajat, vapaaehtoistyö (377.4)
alternative label: Avustukset, hyväntekeväisyys (377.4)
alternative label: Avustusjärjestöt, vapaaehtoistyö (377.4)
alternative label: Avustusjärjestöt, yksityinen avustustyö (377.4)
alternative label: Avustustoiminta (377.4)
alternative label: Avustustoiminta, vapaaehtoistyö (377.4)
alternative label: Debriefing, lähimmäispalvelu (377.4)
alternative label: Elintarvikeapu, yksityinen avustustyö (377.4)
alternative label: Emmaus-liike (377.4)
alternative label: Filantropia, hyväntekeväisyys (377.4)
alternative label: Henkilöapu, vapaaehtoistyö (377.4)
alternative label: Henkilöapu, yksityinen avustustyö (377.4)
alternative label: Henkinen jälkiselvitys, lähimmäispalvelu (377.4)
alternative label: Henkinen tuki, lähimmäispalvelu (377.4)
alternative label: Humanitaarinen apu, vapaaehtoistyö (377.4)
alternative label: Humanitaarinen apu, yksityinen avustustyö (377.4)
alternative label: Humanitarismi, avustustoiminta (377.4)
alternative label: Huolenpito, vapaaehtoistyö (377.4)
alternative label: Hyväntekeväisyys (377.4)
alternative label: Hyväntekeväisyysjärjestöt (377.4)
alternative label: Itseapuryhmät (377.4)
alternative label: Joukkorahoitus, rahankeräys (377.4)
alternative label: Kansalaisosallistuminen, vapaaehtoistyö (377.4)
alternative label: Kansalaisten osallistuminen, vapaaehtoistyö (377.4)
alternative label: Kansalaistoiminta, vapaaehtoistyö (377.4)
alternative label: Katastrofiapu, vapaaehtoistyö (377.4)
alternative label: Kenttätyö, vapaaehtoistyö (377.4)
alternative label: Keruu, yksityinen avustustoiminta. (377.4)
alternative label: Keräys, yksityinen avustustoiminta. (377.4)
alternative label: Kodinhoitajat, vapaaehtoistyö (377.4)
alternative label: Kodinhoitoapu, vapaaehtoistyö (377.4)
alternative label: Kotiapu, vapaaehtoistyö (377.4)
alternative label: Kotikäynnit, vapaaehtoistyö (377.4)
alternative label: Kotikäyntityö, vapaaehtoistyö (377.4)
alternative label: Kotipalvelut, vapaaehtoistyö (377.4)
alternative label: Kriisipuhelimet, vapaaehtoistyö (377.4)
alternative label: Kriisituki, lähimmäispalvelu (377.4)
alternative label: Kummilapset, vapaaehtoistyö (377.4)
alternative label: Kummitoiminta, vapaaehtoistyö (377.4)
alternative label: Lionsjärjestöt (377.4)
alternative label: Lähimmäispalvelu (377.4)
alternative label: Lähimmäispalvelu, vapaaehtoistyö (377.4)
alternative label: Materiaaliapu, yksityinen avustustoiminta (377.4)
alternative label: Myötätunto, vapaaehtoistyö (377.4)
alternative label: Naapuriapu, yksityinen avustustoiminta (377.4)
alternative label: Naisjärjestöt, vapaaehtoistyö (377.4)
alternative label: Odd Fellow -järjestöt (377.4)
alternative label: Oma-apuryhmät (377.4)
alternative label: Omaisjärjestöt, vapaaehtoistyö (377.4)
alternative label: Osallistaminen, vapaaehtoistyö (377.4)
alternative label: Palveleva puhelin (377.4)
alternative label: Palveluntuotanto, vapaaehtoistyö (377.4)
alternative label: Palveluntuottajat, vapaaehtoistyö (377.4)
alternative label: Palvelutuotanto, vapaaehtoistyö (377.4)
broader: Järjestötoiminta. Kokoustekniikka
in scheme: URN:NBN:fi:au:hklj:
notation: 377.4
related: URN:NBN:fi:au:hklj:060
related: URN:NBN:fi:au:hklj:061
related: URN:NBN:fi:au:hklj:063
related: EVANKELIS-LUTERILAINEN KIRKKO
related: Laitokset. Järjestöt
related: Sisälähetys. Evankelioiminen
related: Poliittiset ja aatteelliset vähemmistöt
related: Kansainvälinen yhteistyö
related: URN:NBN:fi:au:hklj:371
scope note: Yksityisten järjestöjen ja henkilöiden avustus-, huolto- ja hyväntekeväisyystyö yleensä Lähimmäis- ja ystäväpalvelu. Lions-klubit. Rotaryjärjestöt. Zontakerhot. Emmaus-liike Erikoisalojen yksityinen avustus- ja huoltotyö alan mukaisessa luokassa
scope note: Privata organisationers och privatpersoners bistånds-, omsorgs- och välgörenhetsverksamhet i allmänhet Väntjänstverksamhet och väntjänst. Lionsklubbar. Rotaryorganisationer. Zontaklubbar. Emmaus-rörelsen Privat bistånds- och omsorgsverksamhet som rör specialområden klassificeras enligt område @sv

Nuorisoseuratoiminta
type: Class
type: Concept
subclass of: Järjestötoiminta. Kokoustekniikka
alternative label: Aatteelliset järjestöt, nuorisoseuratoiminta (377.7)
alternative label: Aatteelliset yhdistykset, nuorisoseuratoiminta (377.7)
alternative label: Järjestöt, nuorisoseuratoiminta (377.7)
alternative label: Nuorisojärjestöt, nuorisoseurat (377.7)
alternative label: Nuorisoseurantalot, nuorisoseuratoiminta (377.7)
alternative label: Nuorisoseurat (377.7)
alternative label: Seuraintalot, nuorisoseuratoiminta (377.7)
alternative label: Seurantalot, nuorisoseuratoiminta (377.7)
alternative label: Seurat, nuorisoseuratoiminta (377.7)
alternative label: Föreningshus, ungdomsföreningsverksamhet (377.7) @sv
alternative label: Ideella föreningar, ungdomsföreningar (377.7) @sv
alternative label: Ideella organisationer, ungdomsföreningar (377.7) @sv
alternative label: Organisationer, järjestöt, ungdomsföreningar (377.7) @sv
alternative label: Societetshus, ungdomsföreningsverksamhet (377.7) @sv
alternative label: Sällskap, ungdomsföreningsverksamhet (377.7) @sv
alternative label: Ungdomsföreningar (377.7) @sv
alternative label: Ungdomsföreningshus, ungdomsföreningsverksamhet (377.7) @sv
alternative label: Ungdomsorganisationer, ungdomsföreningar (377.7) @sv
broader: Järjestötoiminta. Kokoustekniikka
in scheme: URN:NBN:fi:au:hklj:
notation: 377.7
preferred label: Youth group work @en
preferred label: Ungdomsföreningsverksamhet @sv
related: URN:NBN:fi:au:hklj:060
related: URN:NBN:fi:au:hklj:061
related: URN:NBN:fi:au:hklj:063
related: Nuorisotyö
related: Sisäpolitiikka. Puolueet
related: Suomi
related: URN:NBN:fi:au:hklj:371
related: URN:NBN:fi:au:hklj:377.709
related: Partioliike
scope note: Nuorisoseurat ja niiden toiminta
scope note: Ungdomsföreningarna och deras verksamhet @sv

Tanska
type: Class
type: Concept
subclass of: URN:NBN:fi:au:hklj:411
alternative label: Tanska (411.4 +)
alternative label: Tanska, maantiede, matkat (411.4 +)
alternative label: Danmark (411.4 +) @sv
alternative label: Danmark, geografi, resor (411.4 +) @sv
broader: URN:NBN:fi:au:hklj:411
in scheme: URN:NBN:fi:au:hklj:
narrower: Kööpenhamina
narrower: Färsaaret
notation: 411.4
preferred label: Denmark @en
preferred label: Danmark @sv
related: Arktis, pohjoiset napamaat
related: URN:NBN:fi:au:hklj:460
related: URN:NBN:fi:au:hklj:930
related: Tanskan historia
related: URN:NBN:fi:au:hklj:989

Uusimaa
type: Class
type: Concept
subclass of: Suomi
alternative label: Itä-Uusimaa (412.1)
alternative label: Itä-Uusimaa, maantiede, matkat (412.1)
alternative label: Uudenmaan lääni (412.1 +)
alternative label: Uudenmaan lääni, maantiede, matkat (412.1 +)
alternative label: Uusimaa (412.1 +)
alternative label: Uusimaa, Itä-Uusimaa (412.1)
alternative label: Uusimaa, maantiede, matkat (412.1 +)
alternative label: Nyland (412.1 +) @sv
alternative label: Nyland, geografi, resor (412.1 +) @sv
alternative label: Nyland, Östra Nyland (412.1) @sv
alternative label: Nylands län (412.1 +) @sv
alternative label: Nylands län, geografi, resor (412.1 +) @sv
alternative label: Östra Nyland (412.1) @sv
alternative label: Östra Nyland, geografi, resor (412.1) @sv
broader: Suomi
in scheme: URN:NBN:fi:au:hklj:
narrower: Helsinki. Pääkaupunkiseutu
notation: 412.1
preferred label: Nyland @sv
related: URN:NBN:fi:au:hklj:411
related: URN:NBN:fi:au:hklj:460
related: URN:NBN:fi:au:hklj:920
related: URN:NBN:fi:au:hklj:929
related: Helsinki. Pääkaupunkiseutu
scope note: Uudenmaan lääni
scope note: Nylands län @sv

Häme. Pirkanmaa
type: Class
type: Concept
subclass of: Suomi
alternative label: Häme (412.4 +)
alternative label: Häme, maantiede, matkat (412.4 +)
alternative label: Hämeen lääni (412.4 +)
alternative label: Hämeen lääni, maantiede, matkat (412.4 +)
alternative label: Hämäläiset (412.4 +)
alternative label: Hämäläiset, maantiede, matkat (412.4 +)
alternative label: Kanta-Häme (412.4)
alternative label: Kanta-Häme, maantiede, matkat (412.4)
alternative label: Pirkanmaa (412.4 +)
alternative label: Pirkanmaa, maantiede, matkat (412.4 +)
alternative label: Päijät-Häme (412.4)
alternative label: Päijät-Häme, maantiede, matkat (412.4)
alternative label: Birkaland (412.4 +) @sv
alternative label: Birkaland, geografi, resor (412.4 +) @sv
alternative label: Centrala Tavastland (412.4) @sv
alternative label: Centrala Tavastland, geografi, resor (412.4) @sv
alternative label: Tavastland (412.4 +) @sv
alternative label: Tavastland, geografi, resor (412.4 +) @sv
alternative label: Tavastlands län (412.4 +) @sv
alternative label: Tavastlands län, geografi, resor (412.4 +) @sv
alternative label: Tavastlänningar (412.4 +) @sv
alternative label: Tavastlänningar, geografi, resor (412.4 +) @sv
alternative label: Östra Tavastland (412.4) @sv
alternative label: Östra Tavastland, geografi, resor (412.4) @sv
broader: Suomi
in scheme: URN:NBN:fi:au:hklj:
narrower: Tampere
notation: 412.4
preferred label: Tavastland. Birkaland @sv
related: URN:NBN:fi:au:hklj:411
related: URN:NBN:fi:au:hklj:460
related: URN:NBN:fi:au:hklj:920
related: URN:NBN:fi:au:hklj:929
scope note: Hämeen lääni
scope note: Tavastehus län @sv

Etelä-Pohjanmaa. Keski-Pohjanmaa
type: Class
type: Concept
subclass of: Suomi
alternative label: Etelä-Pohjanmaa (412.8)
alternative label: Etelä-Pohjanmaa, maantiede, matkat (412.8)
alternative label: Keski-Pohjanmaa (412.8)
alternative label: Keski-Pohjanmaa, maantiede, matkat (412.8)
alternative label: Pohjalaiset, Etelä-Pohjanmaa (412.8)
alternative label: Pohjanmaa (412.8)
alternative label: Pohjanmaa, Etelä-Pohjanmaa (412.8)
alternative label: Pohjanmaa, Keski-Pohjanmaa (412.8)
alternative label: Pohjanmaa, maantiede, matkat (412.8)
alternative label: Vaasan lääni (412.8)
alternative label: Vaasan lääni, maantiede, matkat (412.8)
alternative label: Mellersta Österbotten (412.8) @sv
alternative label: Mellersta Österbotten, geografi, resor (412.8) @sv
alternative label: Sydösterbotten (412.8) @sv
alternative label: Sydösterbotten, geografi, resor (412.8) @sv
alternative label: Vasa län (412.8) @sv
alternative label: Vasa län, geografi, resor (412.8) @sv
alternative label: Österbotten (412.8) @sv
alternative label: Österbotten, Mellersta Österbotten (412.8) @sv
alternative label: Österbotten, Sydösterbotten (412.8) @sv
alternative label: Österbotten, geografi, resor (412.8) @sv
alternative label: Österbottningar, Sydösterbotten (412.8) @sv
broader: Suomi
in scheme: URN:NBN:fi:au:hklj:
narrower: Keski-Suomi
notation: 412.8
preferred label: Etelä-Pohjanmaa @en
preferred label: Södra Österbotten. Mellersta Österbotten @sv
related: URN:NBN:fi:au:hklj:411
related: URN:NBN:fi:au:hklj:460
related: URN:NBN:fi:au:hklj:920
related: URN:NBN:fi:au:hklj:929
scope note: Vaasan lääni Pohjanmaata koskevat yleisteokset
scope note: Vasa län Allmänna verk som rör Österbotten @sv

Brittein saaret
type: Class
type: Concept
subclass of: EUROOPPA
alternative label: Brittein saaret (417 +)
alternative label: Brittein saaret, maantiede, matkat (417 +)
alternative label: Brittiska öarna (417 +) @sv
alternative label: Brittiska öarna, geografi, resor (417 +) @sv
broader: EUROOPPA
in scheme: URN:NBN:fi:au:hklj:
narrower: Iso-Britannia
narrower: Irlanti
notation: 417
preferred label: British Isles @en
preferred label: Brittiska öarna @sv
related: URN:NBN:fi:au:hklj:460
related: BRITTEIN SAARTEN HISTORIA
related: Irlannin historia
related: Irlannin tasavallan eli Eiren historia
related: Pohjois-Irlannin historia
scope note: Brittein saaret yleensä Teokset, jotka koskevat sekä Iso-Britanniaa että Irlantia
scope note: Brittiska öarna i allmänhet Verk som rör både Storbritannien och Irland @sv

Irlanti
type: Class
type: Concept
subclass of: Brittein saaret
alternative label: Irlanti (417.2 +)
alternative label: Irlanti, maantiede, matkat (417.2 +)
alternative label: Irland (417.2 +) @sv
alternative label: Irland, geografi, resor (417.2 +) @sv
broader: Brittein saaret
in scheme: URN:NBN:fi:au:hklj:
narrower: Irlannin tasavalta, Eire
narrower: Pohjois-Irlanti
notation: 417.2
preferred label: Ireland @en
preferred label: Irland @sv
related: URN:NBN:fi:au:hklj:460
related: BRITTEIN SAARTEN HISTORIA
related: Irlannin historia
related: Irlannin tasavallan eli Eiren historia
related: Pohjois-Irlannin historia

Geomorfologia. Geodynamiikka
type: Class
type: Concept
subclass of: GEOLOGIA
alternative label: Aapasuot, geologia (492)
alternative label: Atollit, geologia (492)
alternative label: Deglasiaatio (492)
alternative label: Deltat, geomorfologia (492)
alternative label: Drumliinit (492)
alternative label: Dyynit, geomorfologia (492)
alternative label: Eloperäinen aines, geologia (492)
alternative label: Eloperäiset maalajit, geologia (492)
alternative label: Eloperäiset maat, maalajit (492)
alternative label: Elottomat maalajit, geologia (492)
alternative label: Eroosio, geologia (492)
alternative label: Fyysinen maantiede, geomorfologia (492)
alternative label: Geodiversiteetti, geologia (492)
alternative label: Geodynamiikka (492)
alternative label: Geofysiikka (492)
alternative label: Geokemia (492)
alternative label: Geologia, geomorfologia (492)
alternative label: Geologinen monimuotoisuus, geologia (492)
alternative label: Geologiset kerrostumat, geomorfologia (492)
alternative label: Geomagnetismi (492)
alternative label: Geomorfogenia (492)
alternative label: Geomorfologia (492)
alternative label: Geotektoniikka (492)
alternative label: Geysirit, geologia (492)
alternative label: Glasiaaligeologia (492)
alternative label: Glasiologia, jäätiköntutkimus (492)
alternative label: Harjut, geomorfologia (492)
alternative label: Hasardit, luonnononnettomuudet (492)
alternative label: Havaintoasemat, seismologia (492)
alternative label: Hiekka, maalajit (492)
alternative label: Hiekkasärkät, geomorfologia (492)
alternative label: Hiesu, maalajit (492)
alternative label: Hieta, maalajit (492)
alternative label: Hiidenkirnut (492)
alternative label: Hiili, kivihiilen geologia (492)
alternative label: Humus, maaperä (492)
alternative label: Huokoisuus, maaperä (492)
alternative label: Huuhtoutuminen, maannostuminen (492)
alternative label: Ikirouta, maaperä-ja jäätikkötiede (492)
alternative label: Joenuomat, geomorfologia (492)
alternative label: Joet, geomorfologia (492)
alternative label: Jokisuistot, geomorfologia (492)
alternative label: Jyrkänteet, geomorfologia (492)
alternative label: Jäljet, jääkauden jäljet (492)
alternative label: Järvet, geomorfologia (492)
alternative label: Jää, geologia (492)
alternative label: Jääkauden jäljet (492)
alternative label: Jäätiköityminen (492)
alternative label: Jäätiköntutkimus (492)
alternative label: Jäätiköntutkimus, glasiologia (492)
alternative label: Jäätiköt, jäätiköntutkimus (492)
alternative label: Jäätutkimus, glasiologia (492)
alternative label: Jäävuoret, geologia (492)
alternative label: Kaasukentät, geologia (492)
alternative label: Kalderat, geologia (492)
alternative label: Kalliot, geomorfologia (492)
alternative label: Kanaalit, geomorfologia (492)
alternative label: Kanjonit, geomorfologia (492)
alternative label: Kannakset, geomorfologia (492)
alternative label: Karike, maannostuminen (492)
alternative label: Karit, geomorfologia (492)
alternative label: Karsti, geomorfologia (492)
alternative label: Kasautuminen, geologiset prosessit (492)
broader: GEOLOGIA
in scheme: URN:NBN:fi:au:hklj:
notation: 492
related: Fennoskandian geologia
related: Suomen geologia
related: Historiallinen geologia
related: FYSIIKKA
related: Sähköoppi. Magnetismi
related: KEMIA
related: Orgaanisen kemian teollisuus
related: Kivihiili. Turve
related: Öljy. Maakaasu
scope note: Maapallon muoto, sisäinen rakenne ja pinnanmuodostus Geomorfogenia. Mannerliikunnot. Vuorijononmuodostus Tulivuoret. Maanjäristykset. Seismologia Eroosio. Rapautuminen. Sedimentaatio. Kerrostuminen Maaperä. Maannokset. Maannostuminen Jäätikkötiede. Jääkauden jäljet maa- ja kallioperässä Harjut. Silokalliot. Moreeni. Drumliinit Suot geologian kannalta. Turve, kivi- ja ruskohiili sekä öljy ja maakaasu geologian kannalta Geofysiikka. Geokemia. Maamagnetismi Tässä myös Fennoskandian ja Suomen geomorfologia ja geodynamiikka
scope note: Jordklotets form, inre struktur och ytstruktur Geomorfogeni. Kontinentalförskjutningar. Bergskedjeveckning Vulkaner. Jordbävningar. Seismologi Erosion. Förvittring. Sedimentation. Avlagring Jord. Jordmån.Jordmånsbildning Glaciologi. Märken av istiden i jordmån och berggrund Åsar. Rundhällar. Morän. Drumliner Myrar ur geologisk synvinkel. Torv, sten- och brunkol samt olja och naturgas ur geologisk synvinkel Geofysik. Geokemi. Jordmagnetism Hit också Fennoskandiens och Finlands geomorfologi och geodynamik @sv

Yleinen ja teoreettinen fysiikka
type: Class
type: Concept
subclass of: FYSIIKKA
alternative label: Aikakoneet, teoreettinen fysiikka (531 +)
alternative label: Aikamatkat, teoreettinen fysiikka (531 +)
alternative label: Aineen ominaisuudet, fysiikka (531 +)
alternative label: Energia, teoreettinen fysiikka (531 +)
alternative label: Fysiikka, teoreettinen fysiikka (531 +)
alternative label: Gravitaatio, teoreettinen fysiikka (531 +)
alternative label: Kaiken teoria, fysiikka (531)
alternative label: Painovoima, teoreettinen fysiikka (531 +)
alternative label: Puristusvoima, teoreettinen fysiikka (531)
alternative label: Suoritusteho, fysiikka (531)
alternative label: Suuri yhtenäisteoria, fysiikka (531)
alternative label: Teho, fysiikka (531)
alternative label: Teoreettinen fysiikka (531 +)
alternative label: Tiheys (531)
alternative label: Tiiviys (531)
alternative label: Todellisuus, teoreettinen fysiikka (531 +)
alternative label: Vetovoima, teoreettinen fysiikka (531 +)
alternative label: Voima, teoreettinen fysiikka (531)
alternative label: Yhtenäisteoria, fysiikka (531)
alternative label: Densitet (531) @sv
alternative label: Dragningskraft, teoretisk fysik (531 +) @sv
alternative label: Effekt, fysik (531) @sv
alternative label: Energi, teoretisk fysik (531 +) @sv
alternative label: Fysik, teoretisk fysik (531 +) @sv
alternative label: Förenad teori, fysik (531) @sv
alternative label: Gravitation, teoretisk fysik (531 +) @sv
alternative label: Kraft, teoretisk fysik (531) @sv
alternative label: Materiens egenskaper, fysik (531 +) @sv
alternative label: Prestanda, fysik (531) @sv
alternative label: Storförenad teori, fysik (531) @sv
alternative label: Teoretisk fysik (531 +) @sv
alternative label: Teori om allt, fysik (531) @sv
alternative label: Tidsmaskiner, teoretisk fysik (531 +) @sv
alternative label: Tidsresor, teoretisk fysik (531 +) @sv
alternative label: Tryckkraft, teoretisk fysik (531) @sv
alternative label: Tyngdkraft, teoretisk fysik (531 +) @sv
alternative label: Täthet (531) @sv
alternative label: Verklighet, teoretisk fysik (531 +) @sv
broader: FYSIIKKA
in scheme: URN:NBN:fi:au:hklj:
narrower: Suhteellisuusteoria
narrower: Ydinfysiikka. Atomifysiikka. Molekyylifysiikka
narrower: Kvanttiteoria. Kvanttimekaniikka
notation: 531
preferred label: General and theoretical physics @en
preferred label: Allmän och teoretisk fysik @sv
related: Maailmankaikkeus. Kosmologia. Kosmogonia
related: Kokeellinen fysiikka
related: Teoreettinen kemia
scope note: Fysiikan peruslait
scope note: Fysikens grundlagar @sv

Orgaaninen kemia. Muovien kemia
type: Class
type: Concept
subclass of: KEMIA
alternative label: Aglykonit, orgaaninen kemia (546)
alternative label: Akrylonitriili, orgaaninen kemia (546)
alternative label: Akryylinitriili, orgaaninen kemia (546)
alternative label: Aktiivihiili (546)
alternative label: Aldehydit, orgaaninen kemia (546)
alternative label: Alkaloidit, orgaaninen kemia (546)
alternative label: Alkoholit, orgaaninen kemia (546)
alternative label: Aminohapot, orgaaninen kemia (546)
alternative label: Aromaattiset hiilivedyt, orgaaninen kemia (546)
alternative label: Aromaattiset yhdisteet (546)
alternative label: Asetyylikoliini, esterit, orgaaninen kemia (546)
alternative label: Asykliset yhdisteet (546)
alternative label: Bioaktiiviset yhdisteet, orgaaninen kemia (546)
alternative label: Biomuovi, muovien kemia (546)
alternative label: Biopolymeerit, orgaaninen kemia (546)
alternative label: Bisfenoli A, fenoliset yhdisteet, orgaaninen kemia (546)
alternative label: Diasetyyli, orgaaniset yhdisteet, orgaaninen kemia (546)
alternative label: Eetterit, orgaaniset yhdisteet (546)
alternative label: Eloperäinen aines, orgaaninen kemia (546)
alternative label: Eläinproteiinit, orgaaninen kemia (546)
alternative label: Epoksi, ogaaninen kemia (546)
alternative label: Esanssit, orgaaninen kemia (546)
alternative label: Esterit, orgaaninen kemia (546)
alternative label: Etanoli, orgaaninen kemia (546)
alternative label: Eteeni, orgaaninen kemia (546)
alternative label: Eteeriset öljyt, orgaaninen kemia (546)
alternative label: Fenoliset yhdisteet, orgaaninen kemia (546)
alternative label: Fenolit, orgaaninen kemia (546)
alternative label: Fluorihiilivedyt, orgaaninen kemia (546)
alternative label: Formaldehydi, orgaaninen kemia (546)
alternative label: Fosfaatit, orgaaniset yhdisteet (546)
alternative label: Freonit, orgaaninen kemia (546)
alternative label: Fruktoosi, orgaaninen kemia (546)
alternative label: Furfuraali, orgaaninen kemia (546)
alternative label: Geopolymeerit (546)
alternative label: HFC-yhdisteet, orgaaninen kemia (546)
alternative label: Haihtuvat orgaaniset yhdisteet, orgaaninen kemia (546)
alternative label: Hapot, orgaaninen kemia (546)
alternative label: Hartsit, orgaaninen kemia (546)
alternative label: Hedelmäsokeri, orgaaninen kemia (546)
alternative label: Hemi, orgaaninen kemia (546)
alternative label: Hemiini, orgaaninen kemia (546)
alternative label: Hiili, orgaaninen kemia (546)
alternative label: Hiilivedyt, orgaaninen kemia (546)
alternative label: Karboksyylihapot, orgaaniset yhdisteet, orgaaninen kemia (546)
alternative label: Kasviproteiinit, orgaaninen kemia (546)
alternative label: Kemia, orgaaninen kemia (546)
alternative label: Kemialliset yhdisteet, orgaaninen kemia (546)
alternative label: Keratiinit, proteiinit, orgaaninen kemia (546)
alternative label: Klooratut hiilivedyt, orgaaninen kemia (546)
alternative label: Laktoosi, orgaaninen kemia (546)
alternative label: Luonnonaineet, orgaaninen kemia (546)
alternative label: Luonnonmateriaalit, orgaaninen kemia (546)
alternative label: Luonnonpolymeerit, orgaaninen kemia (546)
alternative label: MDI, orgaaninen kemia (546)
alternative label: Maitohappo, orgaaninen kemia (546)
alternative label: Makromolekyylit, orgaaninen kemia (546)
alternative label: Malonialdehydi, aldehydit, orgaaninen kemia (546)
alternative label: Metanoli, orgaaninen kemia (546)
alternative label: Muovi, muovien kemia (546)
alternative label: Muovien kemia (546)
alternative label: Muovit, muovien kemia (546)
alternative label: Oligomeeri, kemia (546)
broader: KEMIA
in scheme: URN:NBN:fi:au:hklj:
notation: 546
related: Analyyttinen kemia
related: Sovellettu kemia
related: BIOKEMIA
related: Orgaanisen kemian teollisuus
related: Kivihiili. Turve
related: Öljy. Maakaasu
related: Muovi- ja kumiteollisuus
related: Biotekniikka
related: URN:NBN:fi:au:hklj:649.91
scope note: Orgaaniset reaktiot ja yhdisteet Hiilivedyt. Polymeerit. Asykliset ja sykliset yhdisteet Luonnonaineet orgaanisen kemian kannalta
scope note: Organiska reaktioner och föreningar Kolväten. Polymerer. Acykliska och cykliska föreningar Naturprodukter ur den organiska kemins synvinkel @sv

Sovellettu kemia
type: Class
type: Concept
subclass of: KEMIA
alternative label: Kemia, sovellettu kemia (547)
alternative label: Sovellettu kemia (547)
alternative label: Synteettinen kemia (547)
alternative label: Kemi, tillämpad kemi (547) @sv
alternative label: Syntetisk kemi (547) @sv
alternative label: Tillämpad kemi (547) @sv
broader: KEMIA
in scheme: URN:NBN:fi:au:hklj:
notation: 547
preferred label: Applied chemistry @en
preferred label: Tillämpad kemi @sv
related: Aseteknologia
related: Hydrologia
related: Kokeellinen kemia
related: Orgaaninen kemia. Muovien kemia
related: URN:NBN:fi:au:hklj:615.1
related: Lääketieteellinen kemia ja fysiikka
related: Paperi- ja selluloosateollisuus
related: Kemian teollisuus
related: Maanviljely
scope note: Soveltavan kemian yleisteokset Teokset, jotka koskevat kemian sovelluksia useille eri aloille Tietyn erikoisalan sovellukset luokitetaan alan mukaan
scope note: Allmänna verk om tillämpad kemi Verk som rör kemiska tillämpningar inom flera olika områden Kemiska tillämpningar inom ett bestämt område klassificeras enligt område @sv

FYSIKAALINEN KEMIA
type: Class
type: Concept
subclass of: LUONNONTIETEET
alternative label: Adsorptiokemia (550)
alternative label: Anionit, fysikaalinen kemia (550)
alternative label: Elektroforeesi (550)
alternative label: Elektrolyysi, fysiikka (550)
alternative label: Elektrolyytit, fysiikka (550)
alternative label: Elektronit, fysikaalinen kemia (550)
alternative label: Fysiikka, fysikaalinen kemia (550)
alternative label: Fysikaalinen kemia (550)
alternative label: Fysikaaliskemialliset analyysit (550)
alternative label: Geelikromatografia (550)
alternative label: Isotoopit, fysikaalinen kemia (550)
alternative label: Itsepuhdistuvuus, fysikaalinen kemia (550)
alternative label: Kationit, fysikaalinen kemia (550)
alternative label: Kemia, fysikaalinen kemia (550)
alternative label: Kemiallinen mekaniikka (550)
alternative label: Kemialliset analyysit, fysikaalinen kemia (550)
alternative label: Kolloidikemia (550)
alternative label: Kolloidit, kolloidikemia (550)
alternative label: Kromatografia (550)
alternative label: Luonnontieteet, kemia (540 ... 550)
alternative label: Lämpökemia (550)
alternative label: Makromolekyylit, kolloidikemia (550)
alternative label: Matemaattiset tieteet, kemia (540 ... 550)
alternative label: Molekyylit, fysikaalinen kemia (550)
alternative label: Pintakemia (550)
alternative label: Polarisaatio, sähkökemia (550)
alternative label: Radioaktiiviset aineet, fysikaalinen kemia (550)
alternative label: Radioaktiivisuus, fysikaalinen kemia (550)
alternative label: Radiokemia (550)
alternative label: Suuren erotuskyvyn nestekromatografia (550)
alternative label: Sähköiset ominaisuudet, sähkökemia (550)
alternative label: Sähköisyys, sähkökemia (550)
alternative label: Sähkökemia (550)
alternative label: Sähkökemia, luonnontieteellinen (550)
alternative label: Sähkökemialliset analyysit (550)
alternative label: Säteily, säteilykemia (550)
alternative label: Säteilykemia (550)
alternative label: Termoanalyysi (550)
alternative label: Termokemia (550)
alternative label: Valokemia (550)
alternative label: Ydinkemia (550)
alternative label: Adsorptionskemi (550) @sv
alternative label: Anjoner, fysikalisk kemi (550) @sv
alternative label: Elektricitet, laddning, elektrokemi (550) @sv
alternative label: Elektriska egenskaper, elektrokemi (550) @sv
alternative label: Elektrofores (550) @sv
alternative label: Elektrokemi (550) @sv
alternative label: Elektrokemi, naturvetenskaplig (550) @sv
alternative label: Elektrokemiska analyser (550) @sv
alternative label: Elektrolys, fysik (550) @sv
alternative label: Elektrolyter, fysik (550) @sv
alternative label: Elektroner, fysikalisk kemi (550) @sv
alternative label: Fotokemi (550) @sv
alternative label: Fysik, fysikalisk kemi (550) @sv
alternative label: Fysikalisk kemi (550) @sv
alternative label: Fysisk-kemiska analyser (550) @sv
alternative label: Gelkromatografi (550) @sv
alternative label: Högupplösande vätskekromatografi (550) @sv
alternative label: Isotoper, fysikalisk kemi (550) @sv
alternative label: Katjoner, fysikalisk kemi (550) @sv
alternative label: Kemi, fysikalisk kemi (550) @sv
alternative label: Kemisk mekanik (550) @sv
alternative label: Kemiska analyser, fysikalisk kemi (550) @sv
broader: LUONNONTIETEET
in scheme: URN:NBN:fi:au:hklj:
notation: 550
related: FYSIIKKA
related: Lämpöoppi
related: Valo-oppi. Värioppi. Säteilyoppi
related: Sähköoppi. Magnetismi
related: KEMIA
related: Teoreettinen kemia
related: Analyyttinen kemia
related: Sähkötekniikka
related: Kemian teollisuus
scope note: Termo- eli lämpökemia. Kemiallinen mekaniikka Elektro- eli sähkökemia. Ionit. Elektrolyysi Foto- eli valokemia. Radio- eli sähkökemia Pintakemia. Kolloidikemia. Adsorptiokemia. Kapillaarikemia Fysikaaliskemialliset analyysit. Radiokemiallinen analyysi. Kapillaari- ja adsorptioanalyysi. Kromatografia. Elektroforeesi. Ionoforeesi
scope note: Termokemi. Kemisk mekanik Elektrokemi. Joner. Elektrolys Fotokemi. Radiokemi Ytkemi. Kolloidkemi. Adsorptionskemi. Kapillärkemi Fysikalisk-kemiska analyser. Radiokemisk analys. Kapillär- och adsorptionsanalys. Kromatografi. Elektrofores. Jonfores @sv

Sekovartiset kasvit
type: Class
type: Concept
subclass of: Systemaattinen kasvitiede
alternative label: Aitosammalet, sammalet (587.1)
alternative label: Itiökasvit, sekovartiset kasvit (587.1)
alternative label: Itiöt, sekovartisten kasvien (587.1)
alternative label: Jäkälät (587.1)
alternative label: Kasviplankton (587.1)
alternative label: Lehtisammalet (587.1)
alternative label: Levät (587.1)
alternative label: Levät, kasvitiede (587.1)
alternative label: Makrolevät, kasvitiede (587.1)
alternative label: Maksasammalet (587.1)
alternative label: Merilevät, kasvitiede (587.1)
alternative label: Mikrolevät, kasvitiede (587.1)
alternative label: Nuotiosammalet, sammalet (587.1)
alternative label: Nuppusammal, sammalet (587.1)
alternative label: Pihtisammalet, maksasammalet (587.1)
alternative label: Plankton, kasviplankton (587.1)
alternative label: Planktonkasvit (587.1)
alternative label: Rahtusammalet, maksasammalet (587.1)
alternative label: Sammalet (587.1)
alternative label: Sarvisammalet, sammalet (587.1)
alternative label: Sekovartiset kasvit (587.1)
alternative label: Siiransammalet, maksasammalet (587.1)
alternative label: Symbioosi, jäkälät (587.1)
alternative label: Alger (587.1) @sv
alternative label: Alger, botanik (587.1) @sv
alternative label: Bladmossor (587.1) @sv
alternative label: Bålväxter (587.1) @sv
alternative label: Egentliga bladmossor, mossor (587.1) @sv
alternative label: Havsalger, botanik (587.1) @sv
alternative label: Lavar (587.1) @sv
alternative label: Levermossor (587.1) @sv
alternative label: Makroalger, botanik (587.1) @sv
alternative label: Mikroalger, botanik (587.1) @sv
alternative label: Mikromossor, levermossor (587.1) @sv
alternative label: Mossor (587.1) @sv
alternative label: Muddermossa, mossor (587.1) @sv
alternative label: Nardior, levermossor (587.1) @sv
alternative label: Nålfruktsmossor, mossor (587.1) @sv
alternative label: Plankton, växtplankton (587.1) @sv
alternative label: Planktonväxter (587.1) @sv
alternative label: Sporer, bålväxters (587.1) @sv
alternative label: Sporväxter, bålväxter (587.1) @sv
alternative label: Spåmossor, mossor (587.1) @sv
alternative label: Symbios, lavar (587.1) @sv
alternative label: Trådmossor, levermossor (587.1) @sv
alternative label: Växtplankton (587.1) @sv
broader: Systemaattinen kasvitiede
in scheme: URN:NBN:fi:au:hklj:
narrower: Sienet
notation: 587.1
preferred label: Lower plants @en
preferred label: Bålväxter @sv
related: Luonto-oppaat. Oppikirjat
related: Yleinen mikrobiologia
related: Kasvimorfologia. Kasvianatomia
related: Kasvifysiologia
related: Kasviekologia
related: Kasvimaantiede
related: Systemaattinen eläintiede
scope note: Levät. Jäkälät. Sammalet Kasviplankton Sekovartisten kasvien systematiikka ja lajinmääritysoppaat Sekovartisten kasvien morfologia, anatomia, fysiologia, ekologia ja kasvimaantiede
scope note: Alger. Lavar. Mossor Växtplankton Bålväxternas systematik och handböcker i artbestämning av bålväxter Bålväxternas morfologi, anatomi, fysiologi, ekologi och växtgeografi @sv

Selkärangattomat
type: Class
type: Concept
subclass of: Systemaattinen eläintiede
alternative label: Araknologia (597.6)
alternative label: Eläinplankton (597.6)
alternative label: Etanat (597.6)
alternative label: Hämähäkit (597.6)
alternative label: Hämähäkkieläimet (597.6)
alternative label: Hämähäkkitutkimus (597.6)
alternative label: Jokirapu, eläintiede (597.6)
alternative label: Jouhimadot (597.6)
alternative label: Juoksuhämähäkit (597.6)
alternative label: Kampamaneetit (597.6)
alternative label: Karhukaiset (597.6)
alternative label: Kasvituholaiset, eläintiede (597.6 +)
alternative label: Katkaravut, eläintiede (597.6)
alternative label: Korallieläimet (597.6)
alternative label: Korallit (597.6)
alternative label: Kotilot (597.6)
alternative label: Kuoripunkit (597.6)
alternative label: Laakamadot (597.6)
alternative label: Lehtokotilo (597.6)
alternative label: Limamadot (597.6)
alternative label: Lintuhämähäkit (597.6)
alternative label: Lonkerojalkaiset (597.6)
alternative label: Lukit (597.6)
alternative label: Madot (597.6)
alternative label: Makkaramadot (597.6)
alternative label: Meduusat (597.6)
alternative label: Meritähdet (597.6)
alternative label: Metamorfoosi, selkärangattomat (597.6 +)
alternative label: Muodonvaihdos (597.6 +)
alternative label: Mustekalat, eläintiede (597.6)
alternative label: Mätäpunkit (597.6)
alternative label: Nauhamadot (597.6)
alternative label: Nilviäiset (597.6)
alternative label: Niveljalkaiset (597.6 +)
alternative label: Nivelmadot (597.6)
alternative label: Nuolimadot (597.6)
alternative label: Okapäämadot (597.6)
alternative label: Onteloeläimet (597.6)
alternative label: Osterit, eläintiede (597.6)
alternative label: Partamadot (597.6)
alternative label: Petopunkit (597.6)
alternative label: Piikkinahkaiset (597.6)
alternative label: Piippolimakotilo (597.6)
alternative label: Plankton, eläinplankton (597.6)
alternative label: Planktoneläimet (597.6)
alternative label: Polttiaiseläimet (597.6)
alternative label: Punkit, eläintiede (597.6)
alternative label: Puutiaset (597.6)
alternative label: Pääjalkaiset (597.6)
alternative label: Rapu, eläintiede (597.6)
alternative label: Rataseläimet (597.6)
alternative label: Ravut, eläintiede (597.6)
alternative label: Ruiskumadot (597.6)
alternative label: Sammaleläimet (597.6)
alternative label: Selkäjänteiset, selkärangattomat (597.6 +)
alternative label: Selkärangattomat (597.6 +)
alternative label: Sienieläimet (597.6)
alternative label: Simpukat, eläintiede (597.6)
alternative label: Simpukat, kuoret (597.6)
alternative label: Skorpionit (597.6)
alternative label: Sukaspintaiset (597.6)
alternative label: Sukkulamadot (597.6)
alternative label: Suolinkaiset (597.6)
alternative label: Toukat, selkärangattomat eläimet (597.6 +)
broader: Systemaattinen eläintiede
in scheme: URN:NBN:fi:au:hklj:
narrower: Hyönteiset
notation: 597.6
related: Luonto-oppaat. Oppikirjat
related: Yleinen mikrobiologia
related: Systemaattinen kasvitiede
related: Eläinmorfologia. Eläinanatomia
related: Eläinfysiologia
related: Eläinekologia
related: Eläinmaantiede
scope note: Sienieläimet. Polttiaiseläimet. Kampamaneetit. Madot Nilviäiset. Piikkinahkaiset. Sammaleläimet. Karhukaiset Niveljalkaiset. Hämähäkkieläimet. Äyriäiset. Juoksujalkaiset Eläinplankton Teokset, joissa on sekä hyönteisiä että muita selkärangattomia eläimiä Selkärangattomien systematiikka ja lajinmääritysoppaat Selkärangattomien morfologia, anatomia, fysiologia, etologia, ekologia ja eläinmaantiede Selkärangattomien lisääntyminen
scope note: Svampdjur. Nässeldjur. Kammaneter. Maskar Blötdjur. Tagghudingar. Mossdjur. Trögkrypare Leddjur. Spindeldjur. Kräftdjur. Enkelfotingar Planktondjur Verk som handlar om både insekter och andra ryggradslösa djur De ryggradslösa djurens systematik och handböcker för artbestämning av ryggradslösa djur De ryggradslösa djurens morfologi, anatomi, fysiologi, etologi, ekologi och djurgeografi De ryggradslösa djurens fortplantning @sv

Urheilulääketiede
type: Class
type: Concept
subclass of: Lääketieteen erikoisaloja
alternative label: Aihiolääkkeet , doping (614.2)
alternative label: Akillesjänne, urheilulääketiede (614.2)
alternative label: Alaraajat, urheilulääketiede (614.2)
alternative label: Anaboliset steroidit, doping (614.2)
alternative label: Antidoping, urheilulääketiede (614.2)
alternative label: Doping, urheilulääketiede (614.2)
alternative label: Eturistiside, urheilulääketiede (614.2)
alternative label: Hormonaaliset tekijät, doping (614.2)
alternative label: Hormonaaliset vaikutukset, doping (614.2)
alternative label: Hormonit, doping (614.2)
alternative label: Hormonivaikutukset, doping (614.2)
alternative label: Jalat, urheilulääketiede (614.2)
alternative label: Jänteet, urheilulääketiede (614.2)
alternative label: Kantajänne, urheilulääketiede (614.2)
alternative label: Lihakset, urheilulääketiede (614.2)
alternative label: Liikuntaelimet, urheilulääketiede (614.2)
alternative label: Liikuntafysiologia, urheilulääketiede (614.2)
alternative label: Liikuntalääketiede (614.2)
alternative label: Liikuntatapaturmat, urheilulääketiede (614.2)
alternative label: Liikuntavammat, urheilulääketiede (614.2)
alternative label: Luunmurtumat , urheilulääketiede (614.2)
alternative label: Lääkeaineet, doping (614.2)
alternative label: Murtumat, urheilulääketiede (614.2)
alternative label: Nestetasapaino, urheilulääketiede (614.2)
alternative label: Nivelet, urheilulääketiede (614.2)
alternative label: Nivelsiteet, urheilulääketiede (614.2)
alternative label: Penikkatauti (rasitusvammat), urheilulääketiede (614.2)
alternative label: Piristeet, doping, urheilulääketiede (614.2)
alternative label: Polven nivelkierukat, urheilulääketiede (614.2)
alternative label: Raajat, urheilulääketiede (614.2)
alternative label: Rasitusvammat, urheilulääketiede (614.2)
alternative label: Steroidit, doping (614.2)
alternative label: Stimulanssit, doping, urheilulääketiede (614.2)
alternative label: Stimulantit, doping, urheilulääketiede (614.2)
alternative label: Säären lihasaitio-oireyhtymä, urheilulääketiede (614.2)
alternative label: Sääriluun mediaalinen rasitusoireyhtymä, ortopedia (614.2)
alternative label: Sääriluun mediaalinen rasitusoireyhtymä, urheilulääketiede (614.2)
alternative label: Tankkaus, ravinto, urheilulääketiede (614.2)
alternative label: Urheilulääketiede (614.2)
alternative label: Urheiluvammat, urheilulääketiede (614.2)
alternative label: Voimantuotto, urheilulääketiede (614.2)
alternative label: Anabola steroider, dopning (614.2) @sv
alternative label: Antidopning, idrottsmedicin (614.2) @sv
alternative label: Belastningsskador, idrottsmedicin (614.2) @sv
alternative label: Benbrott, idrottsmedicin (614.2) @sv
alternative label: Dopning, idrottsmedicin (614.2) @sv
alternative label: Extremiteterna, idrottsmedicin (614.2) @sv
alternative label: Frakturer, idrottsmedicin (614.2) @sv
alternative label: Främre korsband, idrottsmedicin (614.2) @sv
alternative label: Fötterna, idrottsmedicin (614.2) @sv
alternative label: Hormoneffekter, dopning (614.2) @sv
alternative label: Hormonella effekter, dopning (614.2) @sv
alternative label: Hormonella faktorer, dopning (614.2) @sv
alternative label: Hormoner, dopning (614.2) @sv
alternative label: Idrottsfysiologi, idrottsmedicin (614.2) @sv
alternative label: Idrottsmedicin (614.2) @sv
alternative label: Idrottsolyckor, idrottsmedicin (614.2) @sv
alternative label: Idrottsskador, idrottsmedicin (614.2) @sv
alternative label: Kraftproduktion, idrottsmedicin (614.2) @sv
alternative label: Ledband, idrottsmedicin (614.2) @sv
alternative label: Leder, idrottsmedicin (614.2) @sv
alternative label: Läkemedel, dopning (614.2) @sv
alternative label: Menisker, idrottsmedicin (614.2) @sv
broader: Lääketieteen erikoisaloja
in scheme: URN:NBN:fi:au:hklj:
notation: 614.2
related: URN:NBN:fi:au:hklj:332.22
related: URN:NBN:fi:au:hklj:371.6
related: URN:NBN:fi:au:hklj:615.1
related: Fysioterapia. Fysiologiset hoitomuodot
related: URN:NBN:fi:au:hklj:617
related: Liikuntaelimet. Liikuntaelinten taudit
related: LIIKUNTA. URHEILU. LEIKIT. HUVIT
related: Liikuntatiede ja -tutkimus. Liikuntapolitiikka
related: Liikunta. Urheilu
scope note: Urheilu- ja liikuntavammojen hoito ja ennaltaehkäisy Lääketieteen käyttö urheiluvalmennuksessa Urheilusuoritusten parantaminen lääketieteellisin keinoin Doping. Dopingtestaus. Antidoping
scope note: Vård och förebyggande av idrottsskador Medicinska tillämpningar i idrottsträning Förbättrande av idrottsprestationer på medicinsk väg Dopning. Dopningtest. Antidpning @sv

Biotekniikka
type: Class
type: Concept
subclass of: Orgaanisen kemian teollisuus
alternative label: Anaerobiset menetelmät, biotekniikka (649.9 +)
alternative label: Biologiset menetelmät, biotekniikka (649.9)
alternative label: Biopankit, biotekniikka (649.9)
alternative label: Biopiratismi, biotekniikka (649.9)
alternative label: Biotekniikka (649.9)
alternative label: Bioturvallisuus (649.9)
alternative label: DNA, biotekniikka (649.9)
alternative label: DNA-lastut, biotekniikka (649.9)
alternative label: DNA-sirut, biotekniikka (649.9)
alternative label: DNA-tekniikka, biotekniikka (649.9)
alternative label: GMO, biotekniikka (649.9)
alternative label: Geenimutaatiot, biotekniikka (649.9)
alternative label: Geenimuunnellut eliöt, biotekniikka (649.9)
alternative label: Geenimuuntelu, biotekniikka (649.9)
alternative label: Geenit, biotekniikka (649.9)
alternative label: Geenitekniikalla muunnellut eliöt, biotekniikka (649.9)
alternative label: Geenitekniikka, biotekniikka (649.9)
alternative label: Geeniteknologia, biotekniikka (649.9)
alternative label: Geenivarat, geenitekniikka (649.9 +)
alternative label: Gm-organismit, biotekniikka (649.9)
alternative label: Hybridit, biotekniikka (649.9)
alternative label: Kasvituotteet, biotekniikka (649.9)
alternative label: Kloonaus, biotekniikka (649.9)
alternative label: Kudospankit, biotekniikka (649.9)
alternative label: Kudosteknologia, biotekniikka (649.9)
alternative label: Lajiristeymät, biotekniikka (649.9)
alternative label: Luonnontuoteala, biotekniikka (649.9)
alternative label: Luonnontuotteet, biotekniikka (649.9)
alternative label: Mikrobivalmisteet, biotekniikka (649.9 +)
alternative label: Mikrosatelliitit, biotekniikka (649.9)
alternative label: Mutaatiot, biotekniikka (649.9)
alternative label: Muuntogeeniset eliöt, biotekniikka (649.9)
alternative label: Nukleosidit, biotekniikka (649.9)
alternative label: Nukleotidit, biotekniikka (649.9)
alternative label: Pitoisuus, elintarviketeollisuus (649.9)
alternative label: Probiootit, biotekniikka (649.9 +)
alternative label: RNA-tekniikka, biotekniikka (649.9)
alternative label: Siirtogeeniset eliöt, biotekniikka (649.9)
alternative label: Synteettinen biologia, biotekniikka (649.9)
alternative label: Transgeneesi, biotekniikka (649.9)
alternative label: Anaerobiska metoder, bioteknik (649.9 +) @sv
alternative label: Arthybrider, bioteknologi (649.9) @sv
alternative label: Biobanker, bioteknologi (649.9) @sv
alternative label: Biologiska metoder, bioteknologi (649.9) @sv
alternative label: Biosäkerhet (649.9) @sv
alternative label: Bioteknologi (649.9) @sv
alternative label: DNA, bioteknologi (649.9) @sv
alternative label: DNA-chips, bioteknologi (649.9) @sv
alternative label: DNA-teknik, bioteknologi (649.9) @sv
alternative label: DNAchips, bioteknologi (649.9) @sv
alternative label: GMO, bioteknik (649.9) @sv
alternative label: Gener, bioteknologi (649.9) @sv
alternative label: Genmanipulerade organismer, bioteknik (649.9) @sv
alternative label: Genmodifierade organismer, bioteknik (649.9) @sv
alternative label: Genmutationer, bioteknologi (649.9) @sv
alternative label: Genresurser, genteknik (649.9 +) @sv
alternative label: Genteknik, bioteknologi (649.9) @sv
alternative label: Gentekniskt modifierade organismer, bioteknik (649.9) @sv
alternative label: Genteknologi, bioteknologi (649.9) @sv
alternative label: Gm-organismer, bioteknik (649.9) @sv
alternative label: Halt, innehåll, livsmedelsindustri (649.9) @sv
alternative label: Hybrider, bioteknologi (649.9) @sv
alternative label: Kloning, bioteknologi (649.9) @sv
alternative label: Mikrobpreparat, bioteknik (649.9 +) @sv
broader: Orgaanisen kemian teollisuus
in scheme: URN:NBN:fi:au:hklj:
narrower: URN:NBN:fi:au:hklj:649.91
notation: 649.9
related: Orgaaninen kemia. Muovien kemia
related: BIOKEMIA
related: Biologian filosofia
related: URN:NBN:fi:au:hklj:576
related: Yleinen mikrobiologia
related: URN:NBN:fi:au:hklj:613.3
related: Kemian teollisuus
scope note: Biotekniikan ja bioteknisen teollisuuden yleisteokset Bioteknisen teollisuuden liiketalous, tuotantomenetelmät, rationalisointi, työt, prosessit, koneet, raaka-aineet, tuotanto ja tuotteiden kauppa Biologisten prosessien, geenitekniikan, kloonauksen ja mikrobiologian hyväksikäyttö teollisuudessa ja tuotannossa yleensä Biotekniikan ja bioteknisen teollisuuden raaka-aineet, menetelmät, tuotteet ja niiden kauppa yleensä Biotekniikan, geenitekniikan, kloonauksen ja mikrobiologian sovellukset tietylle teollisuuden tai tuotannon alalle alan mukaisessa luokassa
scope note: Allmänna verk som rör bioteknisk industri Företagsekonomi, produktionsmetoder, rationalisering, arbete, processer, maskiner, råmaterial, produktion och handel inom bioteknisk industri Utnyttjande av biologiska processer, genteknik, kloning och mikrobiologi inom industri och produktion i allmänhet Bioteknikens och den biotekniska industrins råvaror, metoder och produkter samt handel med dem i allmänhet Tillämpningar av bioteknik, genteknik, kloning och mikrobiologi inom en viss industrigren eller produktion klassificeras enligt område @sv

Keskiajan arkkitehtuuri
type: Class
type: Concept
subclass of: URN:NBN:fi:au:hklj:720.9
alternative label: Arkkitehdit, elämäkerralliset hakuteokset (720.903 ... 720.9903)
alternative label: Bysantti, arkkitehtuuri (720.904)
alternative label: Gotiikka, arkkitehtuuri (720.904)
alternative label: Islam, arkkitehtuuri (720.904)
alternative label: Islamilainen taide, arkkitehtuuri (720.904)
alternative label: Keskiaika, arkkitehtuuri (720.904)
alternative label: Romaaninen tyyli, arkkitehtuuri (720.904)
alternative label: Arkitekter, biografiska uppslagsverk (720.903 ... 720.9903) @sv
alternative label: Bysans, arkitektur (720.904) @sv
alternative label: Gotik, arkitektur (720.904) @sv
alternative label: Islam, arkitektur (720.904) @sv
alternative label: Islamisk konst, arkitektur (720.904) @sv
alternative label: Medeltiden, arkitektur (720.904) @sv
alternative label: Romansk stil, arkitektur (720.904) @sv
broader: URN:NBN:fi:au:hklj:720.9
in scheme: URN:NBN:fi:au:hklj:
notation: 720.904
preferred label: Medieval architecture @en
preferred label: Medeltida arkitektur @sv
related: URN:NBN:fi:au:hklj:709
related: Euroopan ulkopuolisten vanhojen kulttuurien taide
related: Keskiajan taidehistoria
related: Arkkitehtuurikilpailut. Arkkitehtuurinäyttelyt. Arkkitehtuuripalkinnot
related: Vanhan ajan arkkitehtuuri. Euroopan ulkopuolisten vanhojen kulttuurien arkkitehtuuri
related: Aasia
related: Afrikka
related: Kirkot ja muut uskonnolliset rakennukset
related: URN:NBN:fi:au:hklj:749.1
scope note: Euroopan keskiajan arkkitehtuuri yleensä Romaaninen ja goottilainen arkkitehtuuri yleensä Bysantin arkkitehtuuri yleensä Islamilainen arkkitehtuuri yleensä Keskiajan arkkitehtuurin erikoisaloja koskevat teokset alan mukaisessa luokassa Tietyn maan keskiajan arkkitehtuuria tai arkkitehteja koskevat teokset maan mukaisessa luokassa
scope note: Europeisk medeltida arkitektur i allmänhet Romansk och gotisk arkitektur i allmänhet Bysantisk arkitektur i allmänhet Islamisk arkitektur i allmänhet Verk som handlar om specialområden inom medeltida arkitektur klassificeras enligt område Verk som handlar om medeltida arkitektur eller arkitekter i ett bestämt land klassificeras enligt land @sv

Helsinki. Pääkaupunkiseutu
type: Class
type: Concept
subclass of: Kaupunkisuunnittelu. Kaupunkiarkkitehtuuri
alternative label: Helsinki, ympäristöineen, kaupunkisuunnittelu (727.11)
alternative label: Pääkaupunkiseutu, kaavoitus (727.11)
alternative label: Pääkaupunkiseutu, kaupunkisuunnittelu (727.11)
alternative label: Helsingfors, med omnejd, stadsplanering (727.11) @sv
alternative label: Huvudstadsregion, planläggning (727.11) @sv
alternative label: Huvudstadsregion, stadsplanering (727.11) @sv
broader: Kaupunkisuunnittelu. Kaupunkiarkkitehtuuri
in scheme: URN:NBN:fi:au:hklj:
notation: 727.11
preferred label: Helsinki. The metropolitan area @en
preferred label: Helsingfors. Huvudstadsregionen @sv
related: Helsinki. Pääkaupunkiseutu
related: Aluepolitiikka. Ympäristöpolitiikka
related: Asuntopolitiikka
related: Arkkitehtuurin teoria, estetiikka ja filosofia
related: Arkkitehtuurikilpailut. Arkkitehtuurinäyttelyt. Arkkitehtuuripalkinnot
related: URN:NBN:fi:au:hklj:720.9
related: URN:NBN:fi:au:hklj:721
related: Luonnon- ja kulttuurimaiseman suunnittelu
scope note: Espoo. Vantaa. Kauniainen
scope note: Esbo. Vanda. Grankulla @sv

Etelä-Eurooppa
type: Class
type: Concept
subclass of: URN:NBN:fi:au:hklj:730.9
alternative label: Jugoslavian alue, kuvanveisto (730.94)
alternative label: Kreikka, kuvanveisto, nykyaika (730.94)
alternative label: Portugali, kuvanveisto (730.94)
alternative label: Serbia, kuvanveisto (730.94)
alternative label: Grekland, skulptur, nutiden (730.94) @sv
alternative label: Jugoslaviens område, skulptur (730.94) @sv
alternative label: Portugal, skulptur (730.94) @sv
alternative label: Serbien, skulptur (730.94) @sv
broader: URN:NBN:fi:au:hklj:730.9
in scheme: URN:NBN:fi:au:hklj:
narrower: Italia
narrower: Espanja
notation: 730.94
preferred label: Southern Europe @en
preferred label: Sydeuropa @sv
related: URN:NBN:fi:au:hklj:709
related: Vanhan ajan kuvanveistotaide. Euroopan ulkopuolisten vanhojen kulttuurien kuvanveistotaide
related: Kuvanveistotaiteen materiaalit ja tekniikka
related: URN:NBN:fi:au:hklj:739
related: URN:NBN:fi:au:hklj:742
scope note: Portugali. Malta. Balkanin niemimaa. Kreikka. Bulgaria. Albania. Bosnia ja Hertsegovina. Kroatia. Makedonia. Serbia ja Montenegro. Slovenia
scope note: Portugal. Malta. Balkanhalvön. Grekland. Bulgarien. Albanien. Bosnien-Hercegovina. Kroatien. Makedonien. Serbien och Montenegro. Slovenien @sv

Keskiajan maalaustaide
type: Class
type: Concept
subclass of: URN:NBN:fi:au:hklj:740.9
alternative label: Bysantti, maalaustaide (740.904)
alternative label: Gotiikka, maalaustaide (740.904)
alternative label: Islam, maalaustaide (740.904)
alternative label: Islamilainen taide, maalaustaide (740.904)
alternative label: Keskiaika, maalaustaide (740.904)
alternative label: Romaaninen tyyli, maalaustaide (740.904)
alternative label: Bysans, målarkonst (740.904) @sv
alternative label: Gotik, målarkonst (740.904) @sv
alternative label: Islam, målarkonst (740.904) @sv
alternative label: Islamisk konst, målarkonst (740.904) @sv
alternative label: Medeltiden, målarkonst (740.904) @sv
alternative label: Romansk stil, målarkonst (740.904) @sv
broader: URN:NBN:fi:au:hklj:740.9
in scheme: URN:NBN:fi:au:hklj:
notation: 740.904
preferred label: Medieval painting @en
preferred label: Medeltida målarkonst @sv
related: URN:NBN:fi:au:hklj:709
related: Keskiajan taidehistoria
related: Vanhan ajan maalaustaide. Euroopan ulkopuolistenvanhojen kulttuurien maalaustaide
related: URN:NBN:fi:au:hklj:741
related: URN:NBN:fi:au:hklj:741.1
related: URN:NBN:fi:au:hklj:741.2
related: URN:NBN:fi:au:hklj:742
related: URN:NBN:fi:au:hklj:749
related: URN:NBN:fi:au:hklj:749.1
scope note: Euroopan keskiajan maalaustaide yleensä Romaaninen ja goottilainen maalaustaide yleensä Bysantin maalaustaide yleensä Tietyn maan keskiajan maalaustaidetta tai taidemaalareita koskevat teokset maan mukaisessa luokassa
scope note: Europeisk medeltida målarkonst i allmänhet Romansk och gotisk målarkonst i allmänhet Bysantinsk målarkonst i allmänhet Islamisk målarkonst i allmänhet Verk som handlar om medeltida målarkonst eller målare i ett bestämt land klassificeras enligt land @sv

Nykyajan maalaustaide
type: Class
type: Concept
subclass of: URN:NBN:fi:au:hklj:740.9
alternative label: Abstrakti ekspressionismi, maalaustaide (740.907)
alternative label: Abstrakti taide, maalaustaide (740.907)
alternative label: Abstraktinen taide, maalaustaide (740.907)
alternative label: Art noveau, maalaustaide (740.907)
alternative label: Arte povera, maalaustaide (740.907)
alternative label: Avant-garde, maalaustaide (740.907)
alternative label: Avantgarde, maalaustaide (740.907)
alternative label: Avantgardismi, maalaustaide (740.907)
alternative label: Dada, maalaustaide (740.907)
alternative label: Dadaismi, maalaustaide (740.907)
alternative label: Ekspressionismi, maalaustaide (740.907)
alternative label: Fauvismi, maalaustaide (740.907)
alternative label: Figuratiivinen taide, maalaustaide (740.907)
alternative label: Fotorealismi, maalaustaide. (740.907)
alternative label: Futurismi, maalaustaide (740.907)
alternative label: Hyperrealismi, maalaustaide (740.907)
alternative label: Impressionismi, maalaustaide (740.907)
alternative label: Informalismi, maalaustaide (740.907)
alternative label: Jugend, maalaustaide (740.907)
alternative label: Junk art, maalaustaide (740.907)
alternative label: Jälki-impressionismi, maalaustaide (740.907)
alternative label: Konkreettinen taide, maalaustaide (740.907)
alternative label: Konstruktionismi, maalaustaide (740.907)
alternative label: Konstruktivismi, maalaustaide (740.907)
alternative label: Kubismi, maalaustaide (740.907)
alternative label: L'art nouveau, maalaustaide (740.907)
alternative label: Minimalismi, maalaustaide (740.907)
alternative label: Moderni taide, maalaustaide (740.907)
alternative label: Modernismi, maalaustaide (740.907)
alternative label: Naivismi, maalaustaide (740.907)
alternative label: Neoimpressionismi (740.907)
alternative label: Nonfiguratiivinen taide, maalaustaide (740.907)
alternative label: Nykytaide, maalaustaide (740.907)
alternative label: Optaide (740.907)
alternative label: Optinen taide (740.907)
alternative label: Pointillismi, maalaustaide (740.907)
alternative label: Poptaide, maalaustaide (740.907)
alternative label: Postimpressionismi, maalaustaide (740.907)
alternative label: Psykedeelinen taide, maalaustaide (740.907)
alternative label: Realismi, maalaustaide (740.906 ... 740.907)
alternative label: Romutaide, maalaustaide (740.907)
alternative label: Sosialistinen realismi, maalaustaide (740.907)
alternative label: Superrealismi, maalaustaide (740.907)
alternative label: Surrealismi, maalaustaide (740.907)
alternative label: Ulkoilmamaalaus, maalaustaide (740.907)
alternative label: Undergroundtaide, maalaustaide (740.907)
alternative label: Uudenaikaisuus, maalaustaide (740.907)
alternative label: Uusasiallisuus, maalaustaide (740.907)
alternative label: Uusimpressionismi (740.907)
alternative label: Verismi, maalaustaide (740.907)
alternative label: Abstrakt expressionism, målarkonst (740.907) @sv
alternative label: Abstrakt konst, målarkonst (740.907) @sv
alternative label: Art nouveau, målarkonst (740.907) @sv
alternative label: Arte povera, målarkonst (740.907) @sv
alternative label: Avantgarde, målarkonst (740.907) @sv
alternative label: Avantgardism, målarkonst (740.907) @sv
alternative label: Dada, målarkonst (740.907) @sv
alternative label: Dadaism, målarkonst (740.907) @sv
alternative label: Expressionism, målarkonst (740.907) @sv
alternative label: Fauvism, målarkonst (740.907) @sv
alternative label: Figurativ konst, målarkonst (740.907) @sv
alternative label: Fotorealism, målarkonst (740.907) @sv
alternative label: Friluftsmåleri, målarkonst (740.907) @sv
broader: URN:NBN:fi:au:hklj:740.9
in scheme: URN:NBN:fi:au:hklj:
notation: 740.907
related: URN:NBN:fi:au:hklj:709
related: Nykyajan taidehistoria
related: URN:NBN:fi:au:hklj:710
related: URN:NBN:fi:au:hklj:741
related: URN:NBN:fi:au:hklj:741.1
related: URN:NBN:fi:au:hklj:741.2
related: URN:NBN:fi:au:hklj:742
related: URN:NBN:fi:au:hklj:749
related: URN:NBN:fi:au:hklj:749.1
scope note: Euroopan nykyajan maalaustaide yleensä - impressionismista alkaen Tässä myös Euroopan ulkopuolinen länsimainen nykyajan maalaustaide yleensä Tässä esim. impressionismi, jugend, art deco, ekspressionismi, kubismi, fauvismi, surrealismi, dadaismi ja futurismi maalaustaiteessa yleensä Modernistinen ja postmodernistinen maalaustaide yleensä Abstrakti maalaustaide yleensä Kollaasi nykyajan maalaustaiteen historiassa yleensä Tietyn maan nykyajan maalaustaidetta tai taidemaalareita koskevat teokset maan mukaisessa luokassa
scope note: Europeisk nutida målarkonst i allmänhet - med början i impressionismen Hit också utomeuropeisk västerländsk nutida målarkonst i allmänhet Hit t.ex. impressionism, jugend, art deco, expressionism, kubism, fauvism, surrealism, dadaism och futurism som målarkonst i allmänhet Modernistisk och postmodernistisk målarkonst i allmänhet Abstrakt målarkonst i allmänhet Collage inom den nutida målarkonstens historia i allmänhet Verk som handlar om nutida målarkonst eller målare i ett bestämt land klassificeras enligt land @sv

Virkkaus. Pitsinvirkkaus. Koukkuaminen. Nypläys
type: Class
type: Concept
subclass of: Neulonta
alternative label: Asusteet, virkkaus (764.61)
alternative label: Frivolitee (764.61)
alternative label: Frivoliteettipitsi (764.61)
alternative label: Huivit, virkkausohjeet (764.61)
alternative label: Isoäidinneliöt, virkkaus (764.61)
alternative label: Koukkuaminen (764.61)
alternative label: Koukut, virkkaus (764.61)
alternative label: Käpyily (764.61)
alternative label: Käpypitsi (764.61)
alternative label: Käsityöt, koukkuaminen (764.61)
alternative label: Käsityöt, nypläys (764.61)
alternative label: Käsityöt, pitsinvirkkaus (764.61)
alternative label: Käsityöt, virkkaus (764.61)
alternative label: Neulapitsi, pitsit (764.61)
alternative label: Nypläys (764.61)
alternative label: Pitsinnypläys (764.61)
alternative label: Pitsinvirkkaus (764.61)
alternative label: Pitsit (764.61)
alternative label: Pukineet, virkkaus (764.61)
alternative label: Päähineet, virkkausohjeet (764.61)
alternative label: Reunapitsit (764.61)
alternative label: Räsyvirkkaus, virkkaus (764.61)
alternative label: Saalit, virkatut (764.61)
alternative label: Shaalit, virkatut (764.61)
alternative label: Sukkulapitsi (764.61)
alternative label: Tekstiilityö, koukkuaminen (764.61)
alternative label: Tekstiilityö, nypläys (764.61)
alternative label: Tekstiilityö, pitsinvirkkaus (764.61)
alternative label: Tekstiilityö, virkkaus (764.61)
alternative label: Tykkimyssyt, virkkausohjeet (764.61)
alternative label: Virkkaus (764.61)
alternative label: Virkkaus, pitsit (764.61)
alternative label: Accessoarer, virkning (764.61) @sv
alternative label: Frivolitet (764.61) @sv
alternative label: Handarbeten, knyppling (764.61) @sv
alternative label: Handarbeten, krokning (764.61) @sv
alternative label: Handarbeten, spetsvirkning (764.61) @sv
alternative label: Handarbeten, virkning (764.61) @sv
alternative label: Huvudbonader, virkbeskrivningar (764.61) @sv
alternative label: Kantspetsar (764.61) @sv
alternative label: Klädesplagg, virkning (764.61) @sv
alternative label: Knyppling (764.61) @sv
alternative label: Krokar, virkning (764.61) @sv
alternative label: Krokning (764.61) @sv
alternative label: Mormorsrutor, virkning (764.61) @sv
alternative label: Oya, spetsar (764.61) @sv
alternative label: Schalar, virkade (764.61) @sv
alternative label: Sjalar, virkade (764.61) @sv
alternative label: Skarfar, virkbeskrivningar (764.61) @sv
alternative label: Skyttelspets (764.61) @sv
alternative label: Spetsar (764.61) @sv
alternative label: Spetsknyppling (764.61) @sv
alternative label: Spetsvirkning (764.61) @sv
alternative label: Styckemössor, virkbeskrivningar (764.61) @sv
alternative label: Textilslöjd, knyppling (764.61) @sv
alternative label: Textilslöjd, krokning (764.61) @sv
alternative label: Textilslöjd, spetsvirkning (764.61) @sv
alternative label: Textilslöjd, virkning (764.61) @sv
alternative label: Trasvirkning, virkning (764.61) @sv
alternative label: Virkning (764.61) @sv
alternative label: Virkning, spetsar (764.61) @sv
broader: Neulonta
in scheme: URN:NBN:fi:au:hklj:
notation: 764.61
preferred label: Crochet. Lace-making @en
preferred label: Virkning. Spetsvirkning. Krokning. Knyppling @sv
related: Tekstiili- ja vaatetusteollisuus
related: Kodin korjaustöiden oppaat
related: Taideteollisuuden teoria, estetiikka ja filosofia
related: Antiikkiesineiden keräily
related: Taideteollisuuden historia
related: URN:NBN:fi:au:hklj:767
related: URN:NBN:fi:au:hklj:798
related: Muodin historia
scope note: Virkkaus, pitsinvirkkaus, koukkuaminen ja nypläys sekä niiden historia, materiaalit, tekniikka ja estetiikka Virkkaus-, pitsinvirkkaus-, koukkuamis- ja nypläysohjeet ja -mallit
scope note: Virkning, spetsvirkning, krokning och knyppling samt deras historia, material, tekniker och estetik Arbetsbeskrivningar och mönster för virkning, spetsvirkning, krokning och knyppling @sv

Lasitaide
type: Class
type: Concept
subclass of: Muut taideteollisuuden alat
alternative label: Antiikkiesineet, lasi (766.1)
alternative label: Astiastot, taideteollisuus, lasi (766.1)
alternative label: Astiat, taideteollisuus, lasi (766.1)
alternative label: Esineet, taidelasi (766.1)
alternative label: Kristalli, lasitaide (766.1)
alternative label: Kristallilasi, lasitaide (766.1)
alternative label: Käsityöt, lasityöt (766.1)
alternative label: Lasi, lasinpuhallus (766.1)
alternative label: Lasi, lasitaide (766.1)
alternative label: Lasiesineet, lasitaide (766.1)
alternative label: Lasimestarit (766.1)
alternative label: Lasinpuhallus (766.1)
alternative label: Lasinpuhaltajat (766.1)
alternative label: Lasitaide (766.1)
alternative label: Lasiteollisuus, lasinpuhallus (766.1)
alternative label: Lasiteollisuus, lasitaide (766.1)
alternative label: Lasituotteet, lasitaide (766.1)
alternative label: Lasityöt, lasinpuhallus (766.1)
alternative label: Lasityöt, lasitaide (766.1)
alternative label: Lyijylasi, lasitaide (766.1)
alternative label: Maljakot, taideteollisuus, lasi (766.1)
alternative label: Pullot, lasinpuhallus (766.1)
alternative label: Pullot, lasitaide (766.1)
alternative label: Pullot, lasityöt (766.1)
alternative label: Ruokailuastiat, lasitaide (766.1)
alternative label: Taidelasi (766.1)
alternative label: Verstakot, lasinpuhallus (766.1)
alternative label: Antikviteter, glas (766.1) @sv
alternative label: Blyglas, glaskonst (766.1) @sv
alternative label: Flaskor, glasarbeten (766.1) @sv
alternative label: Flaskor, glasblåsning (766.1) @sv
alternative label: Flaskor, glaskonst (766.1) @sv
alternative label: Föremål, konstglas (766.1) @sv
alternative label: Glas, glasblåsning (766.1) @sv
alternative label: Glas, glaskonst (766.1) @sv
alternative label: Glasarbeten, glasblåsning (766.1) @sv
alternative label: Glasarbeten, glaskonst (766.1) @sv
alternative label: Glasblåsare (766.1) @sv
alternative label: Glasblåsning (766.1) @sv
alternative label: Glasföremål, glaskonst (766.1) @sv
alternative label: Glasindustri, glasblåsning (766.1) @sv
alternative label: Glasindustri, glaskonst (766.1) @sv
alternative label: Glaskonst (766.1) @sv
alternative label: Glasmästare (766.1) @sv
alternative label: Glasprodukter, glaskonst (766.1) @sv
alternative label: Handarbeten, glasarbeten (766.1) @sv
alternative label: Konstglas (766.1) @sv
alternative label: Kristall, glaskonst (766.1) @sv
alternative label: Kristallglas, glaskonst (766.1) @sv
alternative label: Kärl, konstindustri, glas (766.1) @sv
alternative label: Matkärl, glaskonst (766.1) @sv
alternative label: Serviser, konstindustri, glas (766.1) @sv
alternative label: Vaser, konstindustri, glas (766.1) @sv
alternative label: Verkstadsarbetsgrupper, glasblåsning (766.1) @sv
broader: Muut taideteollisuuden alat
in scheme: URN:NBN:fi:au:hklj:
notation: 766.1
preferred label: Glass art @en
preferred label: Glaskonst @sv
related: Lasiteollisuus. Keraaminen teollisuus. Sementtiteollisuus
related: URN:NBN:fi:au:hklj:643.03
related: Lasimaalaus. Mosaiikkitaide
related: Taideteollisuuden teoria, estetiikka ja filosofia
related: Antiikkiesineiden keräily
related: Taideteollisuuden historia
related: URN:NBN:fi:au:hklj:767
scope note: Lasitaide, sen historia ja henkilöhistoria sekä materiaalit, tekniikka ja estetiikka Lasityöohjeet ja -mallit Lasinpuhallus, lasimestarin työ ja lasiesineet taideteollisuuden ja käsityön kannalta
scope note: Glaskonst, dess historia och personhistoria samt material, tekniker och estetik Beskrivningar och modeller för glasarbeten Glasblåsning, glasmästarens arbete och glasföremål ur konstindustrins och konsthantverkets synvinkel @sv

Harrastajateatteri
type: Class
type: Concept
subclass of: URN:NBN:fi:au:hklj:770
alternative label: Amatööriteatterityö (770.2)
alternative label: Harrastajanäyttelijät (770.2)
alternative label: Harrastajateatterit (770.2)
alternative label: Harrastukset, harrastajateatteri (770.2)
alternative label: Seuranäyttämötyö (770.2)
alternative label: Taideharrastukset, harrastajateatteri (770.2)
alternative label: Teatteri, harrastajateatteri (770.2)
alternative label: Teatterimuodot, harrastajateatteri (770.2)
alternative label: Työväenteatterit, harrastajateatteri (770.2)
alternative label: Amatörscen (770.2) @sv
alternative label: Amatörskådespelare (770.2) @sv
alternative label: Amatörteaterarbete (770.2) @sv
alternative label: Amatörteatrar (770.2) @sv
alternative label: Arbetarteatrar, amatörteater (770.2) @sv
alternative label: Hobbyer, amatörteater (770.2) @sv
alternative label: Konstintressen, amatörteater (770.2) @sv
alternative label: Teater, amatörteater (770.2) @sv
alternative label: Teaterformer, amatörteater (770.2) @sv
broader: URN:NBN:fi:au:hklj:770
in scheme: URN:NBN:fi:au:hklj:
notation: 770.2
preferred label: Amateur theatre @en
preferred label: Amatörteater @sv
related: URN:NBN:fi:au:hklj:770.9
related: Teatterityö
related: Teatteritekniikka
related: Teatterimuodot
related: Nukketeatteri
related: Tanssitaide
related: Pantomiimi
related: Elokuva. Elokuvataide
related: Kirjailijan työ. Kääntäjän työ
scope note: Harrastajateatteri- ja seuranäyttämötoiminta sekä sen historia, henkilöhistoria ja estetiikka yleensä Harrastaja- ja seuranäyttämötoiminnan organisaatio ja käytännön oppaat yleensä Tiettyyn teatterimuotoon liittyvä harrastustoiminta alan mukaisessa luokassa
scope note: Amatörteaterverksamhet och teaterverksamhet inom föreningar samt deras historia, personhistoria och estetik i allmänhet Organisation av och handböcker för amatörteaterverksamhet och teaterverksamhet inom föreningar i allmänhet Amatörverksamhet inom en bestämd teaterform klassificeras enligt område @sv

Teatterityö
type: Class
type: Concept
subclass of: URN:NBN:fi:au:hklj:770
alternative label: Dramatisointi, teatteri (771)
alternative label: Dramaturgia (771)
alternative label: Elekieli, teatterinäyttelijän työ (771)
alternative label: Gestiikka, teatterinäyttelijän työ (771)
alternative label: Ilmaisutaito, teatterinäyttelijän työ (771)
alternative label: Improvisointi, näyttelijän työ (771)
alternative label: Kehonkieli, teatterinäyttelijän työ (771)
alternative label: Lapsinäyttelijät, näyttelijän työ, teatteri (771)
alternative label: Metodinäytteleminen, teatteri (771)
alternative label: Mimiikka, näyttelijän työ (771)
alternative label: Näytteleminen, teatteri (771)
alternative label: Näyttelijät, näyttelijän työ, teatteri (771)
alternative label: Näyttämöliikunta (771)
alternative label: Näyttämötaide, teatterityö (771)
alternative label: Ohjaus, teatteri (771)
alternative label: Pantomimiikka, näyttelijän työ (771)
alternative label: Roolitus, näyttelijän työ, teatteri (771 +)
alternative label: Ruumiinkieli, teatterinäyttelijän työ (771)
alternative label: Teatteri, teatterityö (771)
alternative label: Teatteridramaturgia (771)
alternative label: Teatterinäyttelijät, teatterinäyttelijän työ (771)
alternative label: Teatteriohjaajat, teatteriohjaajan työ (771)
alternative label: Teatteriohjaus (771)
alternative label: Teatterityö (771)
alternative label: Tulkinta, näyttelijän työ (771)
alternative label: Äänenkäyttö, näyttelijän työ, teatteri (771)
alternative label: Barnskådespelare, skådespelarens arbete, teater (771) @sv
alternative label: Dramatisering, teater (771) @sv
alternative label: Dramaturgi (771) @sv
alternative label: Framställningskonst, teaterskådespelarens arbete (771) @sv
alternative label: Gestik, teaterskådespelarens arbete (771) @sv
alternative label: Improvisation, skådespelarens arbete (771) @sv
alternative label: Kroppspråk, elekieli, teaterskådespelarens arbete (771) @sv
alternative label: Kroppsspråk, kehonkieli, teaterskådespelarens arbete (771) @sv
alternative label: Kroppsspråk, ruumiinkieli, teaterskådespelarens arbete (771) @sv
alternative label: Metodskådespeleri, teater (771) @sv
alternative label: Mimik, skådespelarens arbete (771) @sv
alternative label: Pantomimik, skådespelarens arbete (771) @sv
alternative label: Regi, teater (771) @sv
alternative label: Rollbesättning, skådespelarens arbete, teater (771 +) @sv
alternative label: Röstteknik, skådespelarens arbete, teater (771) @sv
alternative label: Scenkonst, teaterarbete (771) @sv
alternative label: Scenrörelse (771) @sv
alternative label: Skådespelare, skådespelarens arbete, teater (771) @sv
alternative label: Skådespelarkonst, teater (771) @sv
alternative label: Teater, teaterarbete (771) @sv
alternative label: Teaterarbete (771) @sv
alternative label: Teaterdramaturgi (771) @sv
alternative label: Teaterregi (771) @sv
alternative label: Teaterregissörer, teaterregissörens arbete (771) @sv
alternative label: Teaterskådespelare, teaterskådespelarens arbete (771) @sv
alternative label: Tolkning, uttydning, skådespelarens arbete (771) @sv
broader: URN:NBN:fi:au:hklj:770
in scheme: URN:NBN:fi:au:hklj:
notation: 771
preferred label: Theatrical work @en
preferred label: Teaterarbete @sv
related: Harrastajateatteri
related: URN:NBN:fi:au:hklj:770.9
related: Suomi
related: Teatterimuodot
related: Nukketeatteri
related: Tanssitaide
related: Pantomiimi
related: Elokuva. Elokuvataide
related: Ilmaisutaito. Puhetaito. Lausuntataide
scope note: Teatterityön tekniikka ja historia yleensä Näyttelijän työ. Ohjaus. Dramaturgia Suullinen ja liikunnallinen ilmaisutaito ja sen kehittäminen näyttelijän työn kannalta Yksittäistä näyttelijää, ohjaajaa tai dramaturgia koskevat henkilöhistorialliset teokset teatteritaiteen historiassa 770.9+ Tiettyä teatterimuotoa koskeva teatterityö, sen historia ja henkilöhistoria ko. teatterimuodon luokassa
scope note: Teaterarbetets teknik och historia i allmänhet Skådespelarens arbete. Regi. Dramaturgi Muntlig och kroppslig framställningskonst och utvecklandet av dem ur skådespelaryrkets synvinkel Verk som handlar om enskilda skådespelare, regissörer eller dramaturger förs till klass 770.9+ Teaterarbete inom en bestämd teaterform samt dess historia och personhistoria förs till klassen för teaterformen @sv

Pantomiimi
type: Class
type: Concept
subclass of: URN:NBN:fi:au:hklj:770
alternative label: Elekieli, pantomiimi (776)
alternative label: Gestiikka, pantomiimi (776)
alternative label: Kehonkieli, pantomiimi (776)
alternative label: Koreografia, pantomiimi (776)
alternative label: Liikemerkintä, pantomiimi (776)
alternative label: Miimi, pantomiimi (776)
alternative label: Mimiikka, pantomiimi (776)
alternative label: Pantomiimit, teatteri (776)
alternative label: Pantomimiikka, pantomiimiteatteri (776)
alternative label: Ruumiinkieli, pantomiimi (776)
alternative label: Teatteri, pantomiimi (776)
alternative label: Teatterimuodot, pantomiimi (776)
alternative label: Gestik, pantomim (776) @sv
alternative label: Koreografi, pantomim (776) @sv
alternative label: Kroppspråk, elekieli, pantomim (776) @sv
alternative label: Kroppsspråk, kehonkieli, pantomim (776) @sv
alternative label: Kroppsspråk, ruumiinkieli, pantomim (776) @sv
alternative label: Mim, pantomim (776) @sv
alternative label: Mimik, pantomim (776) @sv
alternative label: Pantomimer, teater (776) @sv
alternative label: Pantomimik, pantomimteater (776) @sv
alternative label: Rörelsenotation, pantomim (776) @sv
alternative label: Teater, pantomim (776) @sv
alternative label: Teaterformer, pantomim (776) @sv
broader: URN:NBN:fi:au:hklj:770
in scheme: URN:NBN:fi:au:hklj:
notation: 776
preferred label: Pantomime @en
preferred label: Pantomim @sv
related: Teatteri- ja näyttämötaiteen teoria, estetiikka ja filosofia
related: Harrastajateatteri
related: URN:NBN:fi:au:hklj:770.9
related: Teatterityö
related: Teatteritekniikka
related: Teatterimuodot
related: Tanssitaide
related: Elokuva. Elokuvataide
related: Balettimusiikki
scope note: Pantomiimi, sen historia, henkilöhistoria, tekniikka, estetiikka ja koreografia
scope note: Pantomim, dess historia, personhistoria, tekniker, estetik och koreografi @sv

Konsertit. Musiikkijuhlat. Musiikkikilpailut. Nuottien ja äänitteiden kustantaminen
type: Class
type: Concept
subclass of: MUSIIKKI
alternative label: CD-levyt, julkaiseminen (780.6)
alternative label: CD-äänilevyt, julkaiseminen (780.6)
alternative label: Encoret, konserttiohjelmat (780.6)
alternative label: Festivaalit, musiikkifestivaalit (780.6)
alternative label: Huvit, konsertit (780.6)
alternative label: Ilovaarirock (780.6)
alternative label: Juhlaviikot, musiikkijuhlat (780.6)
alternative label: Julkaisijat, nuotit, musiikkiäänitteet (780.6)
alternative label: Julkaisutoiminta, musiikkiäänitteet (780.6)
alternative label: Julkaisutoiminta, nuotit (780.6)
alternative label: Kasetit, musiikkiäänitteet, julkaiseminen (780.6)
alternative label: Kilpailut, musiikki (780.6)
alternative label: Kompaktilevyt, julkaiseminen (780.6)
alternative label: Konsertit (780.6)
alternative label: Konserttiohjelmat (780.6)
alternative label: Konserttitalot, hallinto ja organisaatio. (780.6)
alternative label: Konserttitoiminta (780.6)
alternative label: Kopimismi, piratismi, musiikin julkaiseminen (780.6)
alternative label: Kustannusala, musiikin kustantaminen (780.6)
alternative label: Kustannusala, nuottien kustantaminen (780.6)
alternative label: Kustantajat, musiikin kustantajat (780.6)
alternative label: Kustantajat, nuottien kustantajat (780.6)
alternative label: Kuuntelijatutkimukset, konsertit (780.6)
alternative label: Kävijät, konsertit (780.6)
alternative label: Kävijätutkimukset, konsertit (780.6)
alternative label: Laserlevyluettelot, musiikkibibliografiat (780.6)
alternative label: Laserlevyt, julkaiseminen (780.6)
alternative label: Levy-yhtiöt (780.6)
alternative label: Levykaupat (780.6)
alternative label: Levymerkit, musiikki (780.6)
alternative label: Levyt, julkaiseminen (780.6)
alternative label: Musiikkiarkistot, musiikkiarkistot ja niiden hoito (780.6)
alternative label: Musiikkifestivaalit (780.6)
alternative label: Musiikkijuhlat (780.6)
alternative label: Musiikkikaupat (780.6)
alternative label: Musiikkikilpailut (780.6)
alternative label: Musiikkiklubit (780.6)
alternative label: Musiikkikustantajat (780.6)
alternative label: Musiikkiliikkeet (780.6)
alternative label: Musiikkipalkinnot (780.6)
alternative label: Musiikkiteollisuus, musiikin julkaiseminen (780.6)
alternative label: Musiikkivideot, musiikin julkaiseminen (780.6)
alternative label: Nauhoitearkistot, musiikkiarkistot (780.6)
alternative label: Oopperatalot, hallinto ja organisaatio (780.6)
alternative label: Piratismi, musiikin julkaiseminen (780.6)
alternative label: Pääsyliput, konsertit (780.6)
alternative label: SACD-levyt, julkaiseminen (780.6)
alternative label: Super audio compact discs, julkaiseminen (780.6)
alternative label: Sävellyskilpailut (780.6)
alternative label: Taideharrastukset, konsertit (780.6)
alternative label: Tekijyys, musiikin kustantaminen (780.6)
alternative label: Tuottajat, musiikki (780.6)
alternative label: Yleisö, musiikkitilaisuudet (780.6)
alternative label: Ääniarkistot, musiikkiarkistot (780.6)
alternative label: Äänikasetit, musiikin julkaiseminen (780.6)
alternative label: Äänilevyarkistot, musiikkiarkistot (780.6)
alternative label: Äänilevykaupat (780.6)
alternative label: Äänilevyt, musiikin julkaiseminen (780.6)
alternative label: Äänilevytuottajat (780.6)
alternative label: Ääninauhat, mus. julkaiseminen (780.6)
alternative label: Äänitallenteet, musiikin julkaiseminen (780.6)
alternative label: Äänitallenteet, tuotanto, musiikki (780.6)
alternative label: Äänitearkistot, musiikkiarkistot (780.6)
alternative label: Ääniteteollisuus, musiikin julkaiseminen (780.6)
alternative label: Äänitteet, musiikin julkaiseminen (780.6)
broader: MUSIIKKI
in scheme: URN:NBN:fi:au:hklj:
notation: 780.6
related: Kustannustoimi. Kirjakauppa
related: Kirjapainotaito. Graafinen teollisuus
related: URN:NBN:fi:au:hklj:060
related: URN:NBN:fi:au:hklj:627.7531
related: Taiteen estetiikka. Taidefilosofia. Taidepsykologia. Taidesosiologia. Taidepolitiikka
related: Kulttuurirakennukset
related: Musiikin psykologia. Musiikin akustiikka
scope note: Konsertit, musiikkijuhlat, musiikkiviikot, musiikkikilpailut, musiikkitilaisuudet ja -tapahtumat sekä niiden järjestäminen, organisaatio ja historia yleensä Konserttitalot ja niiden organisaatio ja historia musiikin kannalta yleensä Maasta tai musiikin lajista riippumatta nuottien ja äänitteiden kustantaminen. Musiikkiliikeet Tiettyyn musiikin erikoisalaan liittyvät konsertit, musiikkijuhlat, musiikkikilpailut ym. alan mukaisessa luokassa
scope note: Konserter, musikfester, musikaliska jubileumsveckor, musiktävlingar, musiktillställningar och musikaliska evenemang, anordnande av dem samt deras organisation och historia i allmänhet Konserthus samt deras organisation och historia ur musikens synvinkel i allmänhet Utgivning av noter och ljudupptagningar oavsett land eller musikslag. Musikaffärer Konserter, musikfester, musiktävlingar o.dyl. som hänför sig till specialområden inom musiken klassificeras enligt område @sv

Nelikätinen pianomusiikki
type: Class
type: Concept
subclass of: Piano
alternative label: Nelikätinen pianomusiikki (786.113)
alternative label: Piano, nelikätinen pianomusiikki (786.113)
alternative label: Fyrhändig pianomusik (786.113) @sv
alternative label: Piano, fyrhändig pianomusik (786.113) @sv
broader: Piano
in scheme: URN:NBN:fi:au:hklj:
notation: 786.113
preferred label: Piano duets @en
preferred label: Fyrhändig pianomusik @sv
related: URN:NBN:fi:au:hklj:627.7531
related: URN:NBN:fi:au:hklj:681
related: URN:NBN:fi:au:hklj:781.5
related: URN:NBN:fi:au:hklj:782.6
related: URN:NBN:fi:au:hklj:785
related: URN:NBN:fi:au:hklj:785.11
related: Duot kosketinsoittimille
related: URN:NBN:fi:au:hklj:788
related: URN:NBN:fi:au:hklj:789

Koulut, harjoituskappaleet ja -etydit
type: Class
type: Concept
subclass of: Urut
broader: Urut
in scheme: URN:NBN:fi:au:hklj:
notation: 786.131
preferred label: Courses, practice pieces and studies @en
preferred label: Skolor, övningsstycken och etyder @sv
related: URN:NBN:fi:au:hklj:627.7531
related: URN:NBN:fi:au:hklj:681
related: URN:NBN:fi:au:hklj:781.5
related: URN:NBN:fi:au:hklj:782.6
related: URN:NBN:fi:au:hklj:785
related: URN:NBN:fi:au:hklj:785.11
related: URN:NBN:fi:au:hklj:787
related: URN:NBN:fi:au:hklj:788
related: URN:NBN:fi:au:hklj:789

Koulut, harjoituskappaleet ja -etydit
type: Class
type: Concept
subclass of: Sähkökitara
alternative label: Kitara, sähkökitara, koulut, etydit (786.241)
alternative label: Gitarr, elgitarr, skolor, etyder (786.241) @sv
broader: Sähkökitara
in scheme: URN:NBN:fi:au:hklj:
notation: 786.241
preferred label: Courses, practice pieces and studies @en
preferred label: Skolor, övningsstycken och etyder @sv
related: URN:NBN:fi:au:hklj:627.7531
related: URN:NBN:fi:au:hklj:681
related: URN:NBN:fi:au:hklj:781.5
related: URN:NBN:fi:au:hklj:782.6
related: URN:NBN:fi:au:hklj:785
related: URN:NBN:fi:au:hklj:785.11
related: Sähköbasso
related: URN:NBN:fi:au:hklj:788
related: URN:NBN:fi:au:hklj:789

Koulut, harjoituskappaleet ja -etydit
type: Class
type: Concept
subclass of: Sähköbasso
broader: Sähköbasso
in scheme: URN:NBN:fi:au:hklj:
notation: 786.281
preferred label: Courses, practice pieces and studies @en
preferred label: Skolor, övningsstycken och etyder @sv
related: URN:NBN:fi:au:hklj:627.7531
related: URN:NBN:fi:au:hklj:681
related: URN:NBN:fi:au:hklj:781.5
related: URN:NBN:fi:au:hklj:782.6
related: URN:NBN:fi:au:hklj:785
related: URN:NBN:fi:au:hklj:785.11
related: Sähkökitara
related: URN:NBN:fi:au:hklj:788
related: URN:NBN:fi:au:hklj:789

Koulut, harjoituskappaleet ja -etydit
type: Class
type: Concept
subclass of: Muut puhallinsoittimet
broader: Muut puhallinsoittimet
in scheme: URN:NBN:fi:au:hklj:
notation: 786.61
preferred label: Courses, practice pieces and studies @en
preferred label: Skolor, övningsstycken och etyder @sv
related: URN:NBN:fi:au:hklj:627.7531
related: URN:NBN:fi:au:hklj:681
related: URN:NBN:fi:au:hklj:781.5
related: URN:NBN:fi:au:hklj:782.6
related: URN:NBN:fi:au:hklj:785
related: URN:NBN:fi:au:hklj:785.11
related: URN:NBN:fi:au:hklj:788
related: URN:NBN:fi:au:hklj:789

Progressiivinen rock. Psykedeelinen rock
type: Class
type: Concept
subclass of: Rock. Pop
alternative label: Proge (788.334)
alternative label: Progressiivinen rock (788.334)
alternative label: Psykedeelinen rock (788.334)
alternative label: Progressiv rock (788.334) @sv
alternative label: Progrock (788.334) @sv
alternative label: Psykedelisk rock (788.334) @sv
broader: Rock. Pop
in scheme: URN:NBN:fi:au:hklj:
notation: 788.334
preferred label: Progressive rock. Psychedelic rock @en
preferred label: Progressiv rock. Psykedelisk rock @sv
related: URN:NBN:fi:au:hklj:782.4
related: URN:NBN:fi:au:hklj:783
related: URN:NBN:fi:au:hklj:783.1
related: URN:NBN:fi:au:hklj:785.7
related: URN:NBN:fi:au:hklj:786.8
related: URN:NBN:fi:au:hklj:787.112
related: Folk. Country
related: Aasialainen maailmanmusiikki. Aasialainen etninen pop ja viihdemusiikki
related: URN:NBN:fi:au:hklj:789
related: URN:NBN:fi:au:hklj:795
scope note: Tässä myös krautrock
scope note: Här också krautrock @sv

Punk rock. Uusi aalto. Post-punk
type: Class
type: Concept
subclass of: Rock. Pop
broader: Rock. Pop
in scheme: URN:NBN:fi:au:hklj:
notation: 788.335
preferred label: Punkrock. New wave. Post-punk @en
preferred label: Punk rock. Nya vågen. Post-punk @sv
related: URN:NBN:fi:au:hklj:782.4
related: URN:NBN:fi:au:hklj:783
related: URN:NBN:fi:au:hklj:783.1
related: URN:NBN:fi:au:hklj:785.7
related: URN:NBN:fi:au:hklj:786.8
related: URN:NBN:fi:au:hklj:787.112
related: Folk. Country
related: Aasialainen maailmanmusiikki. Aasialainen etninen pop ja viihdemusiikki
related: URN:NBN:fi:au:hklj:789
related: URN:NBN:fi:au:hklj:795

Keskiajan musiikki
type: Class
type: Concept
subclass of: URN:NBN:fi:au:hklj:789.1
alternative label: Ars antiqua, musiikinhistoria (789.12)
alternative label: Ars nova, musiikinhistoria (789.12)
alternative label: Bysantti, musiikinhistoria (789.12)
alternative label: Bysanttilainen musiikki, musiikin historia (789.12)
alternative label: Keskiaika, musiikinhistoria (789.12)
alternative label: Mensuraalimusiikki, musiikin historia (789.12)
alternative label: Minnelaulajat, musiikinhistoria (789.12)
alternative label: Trubaduurilaulu, musiikin historia (789.12)
alternative label: Trubaduurit, musiikin historia (789.12)
alternative label: Truveerit, musiikinhistoria (789.12)
alternative label: Vanha musiikki, musiikin historia (789.11 ... 789.14)
alternative label: Ars antiqua, musikhistoria (789.12) @sv
alternative label: Ars nova, musikhistoria (789.12) @sv
alternative label: Bysans, musikhistoria (789.12) @sv
alternative label: Bysantinsk musik, musikhistoria (789.12) @sv
alternative label: Gammal musik, musikhistoria (789.11 ... 789.14) @sv
alternative label: Medeltiden, musikhistoria (789.12) @sv
alternative label: Mensuralmusik, musikhistoria (789.12) @sv
alternative label: Minnesångare, musikhistoria (789.12) @sv
alternative label: Trouverer, musikhistoria (789.12) @sv
alternative label: Trubadurer, musikhistoria (789.12) @sv
alternative label: Trubadursång, musikhistoria (789.12) @sv
broader: URN:NBN:fi:au:hklj:789.1
in scheme: URN:NBN:fi:au:hklj:
notation: 789.12
preferred label: Medieval music @en
preferred label: Medeltida musik @sv
related: URN:NBN:fi:au:hklj:709
related: Keskiajan taidehistoria
related: URN:NBN:fi:au:hklj:782.4
related: Musiikin tulkinta. Tyylioppi
related: URN:NBN:fi:au:hklj:783
related: Eurooppa
scope note: Euroopan keskiajan musiikin historia yleensä Bysantin musiikin historia yleensä Keskiajan musiikkia sisältävät sekasisältöiset kokoelmat, jotka eivät sovi musiikin lajin mukaisiin luokkiin 783-787+ Tietyn maan keskiajan musiikin yleistä historiaa tai henkilöhistoriaa koskevat teokset maan mukaisessa luokassa Klassisen musiikin erikoisalojen historia ja henkilöhistoria alan mukaisessa luokassa
scope note: Den europeiska medeltidsmusikens historia i allmänhet Den romanska och gotiska musikens historia i allmänhet Den bysantinska musikens historia i allmänhet Samlingar med blandat innehåll som rör medeltidsmusikens historia och som inte passar in i klasserna för musikslag förs till klasserna 783-787+ Verk om medeltidsmusikens allmänna historia och personhistoria som rör ett bestämt land klassificeras enligt land Historia och personhistoria som rör specialområden inom klassisk musik klassificeras enligt område @sv

Renessanssimusiikki
type: Class
type: Concept
subclass of: URN:NBN:fi:au:hklj:789.1
alternative label: Galantti tyyli, musiikinhistoria (789.13)
alternative label: Renessanssi, musiikinhistoria (789.13)
alternative label: Rokokoo, musiikinhistoria (789.13)
alternative label: Täysrenessanssi, musiikinhistoria (789.13)
alternative label: Uusi aika, musiikin historia (789.13 ... 789.17)
alternative label: Vanha musiikki, musiikin historia (789.11 ... 789.14)
alternative label: Varhaisrenessanssi, musiikinhistoria (789.13)
alternative label: Galanta stilen, musikhistoria (789.13) @sv
alternative label: Gammal musik, musikhistoria (789.11 ... 789.14) @sv
alternative label: Högrenässansen, musikhistoria (789.13) @sv
alternative label: Nya tiden, musikhistoria (789.13 ... 789.17) @sv
alternative label: Renässans, musikhistoria (789.13) @sv
alternative label: Rokoko, musikhistoria (789.13) @sv
alternative label: Ungrenässansen, musikhistoria (789.13) @sv
broader: URN:NBN:fi:au:hklj:789.1
in scheme: URN:NBN:fi:au:hklj:
notation: 789.13
preferred label: Renaissance music @en
preferred label: Renässansmusik @sv
related: URN:NBN:fi:au:hklj:709
related: Renessanssin taidehistoria
related: URN:NBN:fi:au:hklj:782.4
related: Musiikin tulkinta. Tyylioppi
related: URN:NBN:fi:au:hklj:783
related: Eurooppa
scope note: Euroopan renessanssin musiikin historia yleensä Renessanssimusiikkia sisältävät sekasisältöiset kokoelmat, jotka eivät sovi musiikin lajin mukaisiin luokkiin 783-787+ Tietyn maan renessanssimusiikin yleistä historiaa tai henkilöhistoriaa koskevat teokset maan mukaisessa luokassa Klassisen musiikin erikoisalojen historia ja henkilöhistoria alan mukaisessa luokassa
scope note: Den europeiska renässansmusikens historia i allmänhet Samlingar med blandat innehåll som rör renässansmusikens historia och som inte passar in i klasserna för musikslag förs till klasserna 783-787+ Verk om renässansmusikens allmänna historia och personhistoria som rör ett bestämt land klassificeras enligt land Historia och personhistoria som rör specialområden inom klassisk musik klassificeras enligt område @sv

Barokkimusiikki
type: Class
type: Concept
subclass of: URN:NBN:fi:au:hklj:789.1
alternative label: Barokki, musiikinhistoria (789.14)
alternative label: Uusi aika, musiikin historia (789.13 ... 789.17)
alternative label: Vanha musiikki, musiikin historia (789.11 ... 789.14)
alternative label: Barock, musikhistoria (789.14) @sv
alternative label: Gammal musik, musikhistoria (789.11 ... 789.14) @sv
alternative label: Nya tiden, musikhistoria (789.13 ... 789.17) @sv
broader: URN:NBN:fi:au:hklj:789.1
in scheme: URN:NBN:fi:au:hklj:
notation: 789.14
preferred label: Baroque music @en
preferred label: Barockmusik @sv
related: URN:NBN:fi:au:hklj:709
related: Uuden ajan taidehistoria
related: URN:NBN:fi:au:hklj:782.4
related: Musiikin tulkinta. Tyylioppi
related: URN:NBN:fi:au:hklj:783
related: Eurooppa
scope note: Euroopan barokin musiikin historia yleensä Barokkimusiikkia sisältävät sekasisältöiset kokoelmat, jotka eivät sovi musiikin lajin mukaisiin luokkiin 783-787+ Tietyn maan barokkimusiikin yleistä historiaa tai henkilöhistoriaa koskevat teokset maan mukaisessa luokassa Klassisen musiikin erikoisalojen historia ja henkilöhistoria alan mukaisessa luokassa
scope note: Den europeiska barockmusikens historia i allmänhet Samlingar med blandat innehåll som rör barockmusikens historia och som inte passar in i klasserna för musikslag förs till klasserna 783-787+ Verk om barockmusikens allmänna historia och personhistoria som rör ett bestämt land klassificeras enligt land Historia och personhistoria som rör specialområden inom klassisk musik klassificeras enligt område @sv

Klassismin musiikki
type: Class
type: Concept
subclass of: URN:NBN:fi:au:hklj:789.1
alternative label: Esiklassismi, musiikinhistoria (789.15)
alternative label: Klassismi, musiikinhistoria (789.15)
alternative label: Uusi aika, musiikin historia (789.13 ... 789.17)
alternative label: Wieniläisklassismi, musiikin historia (789.15)
alternative label: Förklassicism, musikhistoria (789.15) @sv
alternative label: Klassicism, musikhistoria (789.15) @sv
alternative label: Nya tiden, musikhistoria (789.13 ... 789.17) @sv
alternative label: Wienklassicism, musikens historia (789.15) @sv
broader: URN:NBN:fi:au:hklj:789.1
in scheme: URN:NBN:fi:au:hklj:
notation: 789.15
preferred label: Classical music @en
preferred label: Klassicismens musik @sv
related: URN:NBN:fi:au:hklj:709
related: Uuden ajan taidehistoria
related: URN:NBN:fi:au:hklj:782.4
related: Musiikin tulkinta. Tyylioppi
related: URN:NBN:fi:au:hklj:783
related: Eurooppa
scope note: Euroopan klassismin musiikin historia yleensä Tietyn maan klassismin ajan musiikin yleistä historiaa tai henkilöhistoriaa koskevat teokset maan mukaisessa luokassa Klassisen musiikin erikoisalojen historia ja henkilöhistoria alan mukaisessa luokassa
scope note: Den europeiska klassicistiska musikens historia i allmänhet Den klassicistiska musikens historia i allmänhet och dess personhistoria och som rör ett bestämt land klassificeras enligt land Historia och personhistoria som rör specialområden inom klassisk musik klassificeras enligt område @sv

Romantiikan musiikki
type: Class
type: Concept
subclass of: URN:NBN:fi:au:hklj:789.1
alternative label: Impressionismi, musiikinhistoria, 1800-luku (789.16)
alternative label: Kansallisromantiikka, musiikinhistoria (789.16)
alternative label: Myöhäisromantiikka, 1800-luvun mus. historia (789.16)
alternative label: Myöhäisromantiikka, musiikin historia (789.16)
alternative label: Romantiikka, musiikinhistoria (789.16)
alternative label: Täysromantiikka, musiikinhistoria (789.16)
alternative label: Uusbarokki, musiikinhistoria (789.16 ... 789.17)
alternative label: Uusi aika, musiikin historia (789.13 ... 789.17)
alternative label: Varhaisromantiikka, musiikinhistoria (789.16)
alternative label: Förromantik, musikhistoria (789.16) @sv
alternative label: Högromantik, musikhistoria (789.16) @sv
alternative label: Impressionism, musikhistoria, 1800-talet (789.16) @sv
alternative label: Nationalromantik, musikhistoria (789.16) @sv
alternative label: Nya tiden, musikhistoria (789.13 ... 789.17) @sv
alternative label: Nybarock, musikhistoria (789.16 ... 789.17) @sv
alternative label: Romantiken, musikhistoria (789.16) @sv
alternative label: Senromantiken, 1800-talets musikhistoria (789.16) @sv
alternative label: Senromantiken, musikhistoria (789.16) @sv
broader: URN:NBN:fi:au:hklj:789.1
in scheme: URN:NBN:fi:au:hklj:
notation: 789.16
preferred label: Romantic music @en
preferred label: Romantikens musik @sv
related: URN:NBN:fi:au:hklj:709
related: Uuden ajan taidehistoria
related: URN:NBN:fi:au:hklj:782.4
related: Musiikin tulkinta. Tyylioppi
related: URN:NBN:fi:au:hklj:783
related: Eurooppa
scope note: Euroopan romantiikan musiikin historia yleensä Länsimaisen romantiikan taidemusiikin historia yleensä Tietyn maan romantiikan ajan musiikin yleistä historiaa tai henkilöhistoriaa koskevat teokset maan mukaisessa luokassa Klassisen musiikin erikoisalojen historia ja henkilöhistoria alan mukaisessa luokassa
scope note: Den europeiska romantiska musikens historia i allmänhet Den västerländska romantiska konstmusikens historia i allmänhet Verk om den romantiska musikens historia i allmänhet och dess personhistoria som rör ett bestämt land klassificeras enligt land Historia och personhistoria som rör specialområden inom klassisk musik klassificeras enligt område @sv

Karjalan tasavalta
type: Class
type: Concept
subclass of: Venäjä
broader: Venäjä
in scheme: URN:NBN:fi:au:hklj:
notation: 789.2711
preferred label: Karelian Republic @en
preferred label: Karelska republiken @sv
related: URN:NBN:fi:au:hklj:709
related: URN:NBN:fi:au:hklj:782.4
related: URN:NBN:fi:au:hklj:783
related: URN:NBN:fi:au:hklj:789.1
related: Itä-Eurooppa
related: Itsenäisten valtioiden yhteisön Aasian puoleiset maat

Ukraina
type: Class
type: Concept
subclass of: Itsenäisten valtioiden yhteisö
broader: Itsenäisten valtioiden yhteisö
in scheme: URN:NBN:fi:au:hklj:
notation: 789.272
preferred label: Ukraine @en
related: URN:NBN:fi:au:hklj:709
related: URN:NBN:fi:au:hklj:782.4
related: URN:NBN:fi:au:hklj:783
related: URN:NBN:fi:au:hklj:789.1
related: Itä-Eurooppa
related: Itsenäisten valtioiden yhteisön Aasian puoleiset maat

Valko-Venäjä
type: Class
type: Concept
subclass of: Itsenäisten valtioiden yhteisö
broader: Itsenäisten valtioiden yhteisö
in scheme: URN:NBN:fi:au:hklj:
notation: 789.273
preferred label: Belorussia @en
preferred label: Vitryssland @sv
related: URN:NBN:fi:au:hklj:709
related: URN:NBN:fi:au:hklj:782.4
related: URN:NBN:fi:au:hklj:783
related: URN:NBN:fi:au:hklj:789.1
related: Itä-Eurooppa
related: Itsenäisten valtioiden yhteisön Aasian puoleiset maat

Moldova
type: Class
type: Concept
subclass of: Itsenäisten valtioiden yhteisö
broader: Itsenäisten valtioiden yhteisö
in scheme: URN:NBN:fi:au:hklj:
notation: 789.274
preferred label: Moldova (formerly Moldavia) @en
preferred label: Moldova (f.d. Moldavien) @sv
related: URN:NBN:fi:au:hklj:709
related: URN:NBN:fi:au:hklj:782.4
related: URN:NBN:fi:au:hklj:783
related: URN:NBN:fi:au:hklj:789.1
related: Itä-Eurooppa
related: Itsenäisten valtioiden yhteisön Aasian puoleiset maat

Kaakkois-Aasia
type: Class
type: Concept
subclass of: Aasia
broader: Aasia
in scheme: URN:NBN:fi:au:hklj:
notation: 789.34
preferred label: South-East Asia @en
preferred label: Sydöstasien @sv
related: URN:NBN:fi:au:hklj:709
related: URN:NBN:fi:au:hklj:782.4
related: URN:NBN:fi:au:hklj:783
related: URN:NBN:fi:au:hklj:789.1
related: Varhaiskansojen musiikki
related: Australia. Uusi-Seelanti. Uusi-Guinea
scope note: Brunei. Burma (Myanmar). Filippiinit. Indonesia. Kamputsea. Laos. Malesia. Singapore. Thaimaa. Vietnam
scope note: Brunei. Burma (Myanmar). Filippinerna. Indonesien. Kambodja (Kampuchea). Laos. Malaysia. Singapore. Thailand. Vietnam @sv

Kaukasuksen maat
type: Class
type: Concept
subclass of: Itsenäisten valtioiden yhteisön Aasian puoleiset maat
broader: Itsenäisten valtioiden yhteisön Aasian puoleiset maat
in scheme: URN:NBN:fi:au:hklj:
notation: 789.3511
preferred label: Caucasus @en
preferred label: Kaukasus @sv
related: URN:NBN:fi:au:hklj:709
related: URN:NBN:fi:au:hklj:782.4
related: URN:NBN:fi:au:hklj:783
related: URN:NBN:fi:au:hklj:789.1
related: Varhaiskansojen musiikki
related: Itsenäisten valtioiden yhteisö
scope note: Armenia. Azerbaidzan. Georgia Tässä myös Abhasia
scope note: Armenien. Azerbajdjan. Georgien Hit också Abchazien @sv

Afrikan saaret
type: Class
type: Concept
subclass of: Afrikka
broader: Afrikka
in scheme: URN:NBN:fi:au:hklj:
notation: 789.49
preferred label: Islands around Africa @en
preferred label: Öarna kring Afrika @sv
related: URN:NBN:fi:au:hklj:709
related: URN:NBN:fi:au:hklj:782.4
related: URN:NBN:fi:au:hklj:783
related: URN:NBN:fi:au:hklj:789.1
related: Espanja
related: Portugali
scope note: Aldabrasaaret. Amirantit. Ascension. Azorit. Kanarian saaret. Kap Verde. Komorit. Madagaskar. Madeira. Mauritius. Mayotte. Réunion. Saint Helena. Sao Tomé ja Principe. Seychellit. Tristan da Cunha
scope note: Aldabrasöarna. Amiranterna. Ascension. Azorerna. Comorerna. Kanarieöarna. Kap Verde. Madagaskar. Madeira. Mauritius. Mayotte. Réunion. Saint Helena. São Tomé och Príncipe. Seychellerna. Tristan da Cunha @sv

Yhdysvallat
type: Class
type: Concept
subclass of: Pohjois-Amerikka
alternative label: USA, musiikinhistoria (789.52)
alternative label: Yhdysvallat, musiikinhistoria (789.52)
alternative label: Förenta staterna, musikhistoria (789.52) @sv
alternative label: USA, musikhistoria (789.52) @sv
broader: Pohjois-Amerikka
in scheme: URN:NBN:fi:au:hklj:
notation: 789.52
preferred label: United States of America @en
preferred label: Förenta staterna @sv
related: URN:NBN:fi:au:hklj:709
related: URN:NBN:fi:au:hklj:782.4
related: URN:NBN:fi:au:hklj:783
related: URN:NBN:fi:au:hklj:789.1
related: Karibianmeren saaret
related: Tyynen meren saaret
scope note: Tässä myös Alaska
scope note: Hit också Alaska @sv

Lentourheilu
type: Class
type: Concept
subclass of: Moottoriurheilu. Lentourheilu
alternative label: Benji-hypyt (791.84)
alternative label: Ilmailu, urheiluilmailu (791.84)
alternative label: Ilmailu-urheilu (791.84)
alternative label: Laskuvarjohypyt (791.84)
alternative label: Laskuvarjot (791.84)
alternative label: Laskuvarjourheilu (791.84)
alternative label: Lentonäytökset (791.84)
alternative label: Lentourheilu (791.84)
alternative label: Liitolento (791.84)
alternative label: Purjelento (791.84)
alternative label: Riippuliitimet (791.84)
alternative label: Riippuliito (791.84)
alternative label: Taitolento (791.84)
alternative label: Urheiluilmailu (791.84)
alternative label: base-hypyt (791.84)
alternative label: BASE-hopp (791.84) @sv
alternative label: Bungyhopp (791.84) @sv
alternative label: Fallskärmar (791.84) @sv
alternative label: Fallskärmshoppning (791.84) @sv
alternative label: Fallskärmssport (791.84) @sv
alternative label: Flygsport (791.84) @sv
alternative label: Flyguppvisningar (791.84) @sv
alternative label: Glidflygning (791.84) @sv
alternative label: Hängflygning (791.84) @sv
alternative label: Hängglidare (791.84) @sv
alternative label: Konstflygning (791.84) @sv
alternative label: Luftfart, flygsport (791.84) @sv
alternative label: Luftsport (791.84) @sv
alternative label: Segelflygning (791.84) @sv
alternative label: Sportflyg (791.84) @sv
broader: Moottoriurheilu. Lentourheilu
in scheme: URN:NBN:fi:au:hklj:
notation: 791.84
preferred label: Aviation sports @en
preferred label: Flygsport @sv
related: Ilmaliikenne. Ilmailu
related: Tiet. Kadut. Tienrakennus. Kadunrakennus
related: Ilmakulkuneuvot
related: Lentokoneet
related: Muut ilmakulkuneuvot
related: Liikenneopetus. Liikenneturvallisuus
related: Lento-opetus. Lentotaito
related: Liikuntatiede ja -tutkimus. Liikuntapolitiikka
related: URN:NBN:fi:au:hklj:798
scope note: Urheiluilmailu. Taitolento. Purje- tai liitolento. Laskuvarjot. Laskuvarjourheilu. Riippuliitimet. Riippuliito. Benji-hypyt. Kuumailmapallopurjehdus Jos teos koskee sekä lentourheilua että lentokoneita, on etusija luokalla 791.84
scope note: Sportflygning. Konstflygning (avancerad flygning). Segelflygning (glidflygning). Fallskärmar. Fallskärmshopp. Hängglidare. Hängflygning. Bungyhopp. Ballongflygning Om verket handlar om både flygsport och flygplan ges företräde åt klass 791.84 @sv

Voimailu. Itsepuolustus
type: Class
type: Concept
subclass of: LIIKUNTA. URHEILU. LEIKIT. HUVIT
alternative label: Atletiikka, voimailu (793 +)
alternative label: Bikinifitness, fitness-urheilu (793)
alternative label: Bodaus (793)
alternative label: Crossfit (793)
alternative label: Fitness-urheilu (793)
alternative label: Itsepuolustus, urheilu (793 +)
alternative label: Kamppailulajit (793 +)
alternative label: Keho, kehonrakennus (793)
alternative label: Kehonrakennus (793)
alternative label: Kuntoiluvälineet (793 +)
alternative label: Kuntosalit (793 +)
alternative label: Kuntotestit, kuntosalitoiminta (793)
alternative label: Kuntovälineet (793 +)
alternative label: Köydenveto (793)
alternative label: Lihakset, voimaharjoittelu (793 +)
alternative label: Lihaskunto, voimailu (793 +)
alternative label: Liikuntamuodot, eri liikuntamuodot (791 ... 796 +)
alternative label: MMA (793)
alternative label: Maailmanmestaruuskisat, lajeittain (791 ... 796 +)
alternative label: Maajoukkueet, eri urheilulajit (791 ... 796 +)
alternative label: Mixed martial arts (793)
alternative label: Proteiinipainotteinen ruokavalio, kehonrakennus (793)
alternative label: Puristusvoima, voimailu (793 +)
alternative label: Ruumiinkulttuuri, liikunta, eri lajit (791 ... 796 +)
alternative label: Taistelutaidot, urheilu (793 +)
alternative label: Toiminnallinen lihaskuntoharjoittelu (793)
alternative label: Toiminnallinen harjoittelu (793)
alternative label: Ultimate fighting (793)
alternative label: Urheilulajit, eri urheilulajit (791 ... 796 +)
alternative label: Vaaratilanteet, itsepuolustus (793 +)
alternative label: Vapaaottelu (793)
alternative label: Vartalo, kehonrakennus (793)
alternative label: Voimaharjoittelu (793)
alternative label: Voimailu (793 +)
alternative label: Voimailuvälineet (793 +)
alternative label: Voimamieskilpailut (793)
alternative label: Voimamiesurheilu (793)
alternative label: Voimantuotto, voimaharjoittelu (793 +)
alternative label: Väkivalta, itsepuolustus (793 +)
alternative label: Atletik, kraftsport (793 +) @sv
alternative label: Bikinifitness, fitness-sport (793) @sv
alternative label: Bodybuilding (793) @sv
alternative label: Dragkamp (793) @sv
alternative label: Faromoment, självförsvar (793 +) @sv
alternative label: Figuren, kroppsbygge (793) @sv
alternative label: Fitness-sport (793) @sv
alternative label: Funktionell träning (793) @sv
alternative label: Idrottsgrenar, olika idrottsgrenar (791 ... 796 +) @sv
alternative label: Kampidrott (793 +) @sv
alternative label: Konditionsredskap (793 +) @sv
alternative label: Konditionstest, motionssalar (793) @sv
alternative label: Kraftproduktion, styrketräning (793 +) @sv
alternative label: Kraftsport (793 +) @sv
alternative label: Kraftsport, voimamiesurheilu (793) @sv
alternative label: Kroppen, keho, bodybuilding (793) @sv
alternative label: Kroppsbyggande (793) @sv
alternative label: Kroppskultur, motion, olika grenar (791 ... 796 +) @sv
alternative label: Landslag, olika idrottsgrenar (791 ... 796 +) @sv
alternative label: Motionsformer, olika motionsformer (791 ... 796 +) @sv
alternative label: Motionsredskap (793 +) @sv
alternative label: Motionssalar (793 +) @sv
alternative label: Muskelstyrka, kraftsport (793 +) @sv
alternative label: Muskler, styrketräning (793 +) @sv
alternative label: Proteindiet, kroppsbygge (793) @sv
alternative label: Självförsvar, idrott (793 +) @sv
alternative label: Starkaste man-tävlingar (793) @sv
alternative label: Stridsförmåga, idrott (793 +) @sv
broader: LIIKUNTA. URHEILU. LEIKIT. HUVIT
in scheme: URN:NBN:fi:au:hklj:
narrower: Painonnosto
narrower: Paini
narrower: Nyrkkeily
narrower: Itämaisperäiset lajit. Budo
notation: 793
related: Muut urheilu- ja liikuntamuodot
scope note: Voimailun ja itsepuolustuksen yleisteokset Kehonrakennus. Voimamieskilpailut. Kuntosalitoiminta Tässä ja alaluokissa voimailu ja itsepuolustus kilpa-, huippu- ja kuntourheilun kannalta Tässä ja alaluokissa voimailu- ja itsepuolustuslajien kilpailut, säännöt, valmennus ja välineet Tässä ja alaluokissa voimailu- ja itsepuolustuslajien seurat ja -järjestöt
scope note: Allmänna verk om kraftsport och självförsvar Kroppsbyggande (bodybuilding). Styrketräning. Styrketävlingar. Styrketräningslokaler (gym) Hit och till underklasserna kraftsport och självförsvar ur tävlings-, elit- och motionsidrottens synvinkel Hit och till underklasserna tävlingsgrenar inom kraftsport och självförsvar, regler, träning och redskap Hit och till underklasserna klubbar och förbund för tävlingsgrenar inom kraftsport och självförsvar @sv

Shakki
type: Class
type: Concept
subclass of: Pelit
alternative label: Gambiitit, shakki (798.22)
alternative label: Pelit, shakkipeli (798.22)
alternative label: Puolustus, shakki (798.22)
alternative label: Sakkipeli (798.22)
alternative label: Shakki (798.22)
alternative label: Tietokoneshakki (798.22)
alternative label: Datorschack (798.22) @sv
alternative label: Försvar, schack (798.22) @sv
alternative label: Gambitar, schack (798.22) @sv
alternative label: Schack (798.22) @sv
alternative label: Schackspel (798.22) @sv
alternative label: Spel, schackspel (798.22) @sv
broader: Pelit
in scheme: URN:NBN:fi:au:hklj:
notation: 798.22
preferred label: Chess @en
preferred label: Schack @sv
related: URN:NBN:fi:au:hklj:627.7
related: URN:NBN:fi:au:hklj:627.73
related: Muu näyttämö- tai draamamusiikki. Pelimusiikki
related: Palloilu
related: Muut joukkuepelit
related: Muut pallopelit
related: Leikit
related: Tietokilpailut
related: Arpajaiset. Veikkaus. Uhkapeli
scope note: Shakin peliohjeet ja säännöt. Shakkitehtävät Shakkilaudat. Shakkinappulat Tässä myös tietokoneshakki
scope note: Schackregler. Schackgåtor Schackbräder. Schackpjäser Hit också datorschack @sv

Roolipelit
type: Class
type: Concept
subclass of: Pelit
alternative label: Cosplay (798.23)
alternative label: Larppaaminen (798.23)
alternative label: Larppailu (798.23)
alternative label: Larppaus (798.23)
alternative label: Liveroolipelit (798.23)
alternative label: Pelit, roolipelit (798.23)
alternative label: Rooliasut (798.23)
alternative label: Roolipelit (798.23)
alternative label: Roolivaatteet (798.23)
alternative label: LARP (798.23) @sv
alternative label: LARP-spel (798.23) @sv
alternative label: Lajv (798.23) @sv
alternative label: Levande rollspel (798.23) @sv
alternative label: Rollspel (798.23) @sv
alternative label: Rollspelsdräkter (798.23) @sv
alternative label: Spel, rollspel (798.23) @sv
broader: Pelit
in scheme: URN:NBN:fi:au:hklj:
notation: 798.23
preferred label: Role-playing games @en
preferred label: Rollspel @sv
related: URN:NBN:fi:au:hklj:627.7
related: URN:NBN:fi:au:hklj:627.73
related: Muu näyttämö- tai draamamusiikki. Pelimusiikki
related: Palloilu
related: Muut joukkuepelit
related: Muut pallopelit
related: Leikit
related: Tietokilpailut
related: Arpajaiset. Veikkaus. Uhkapeli
scope note: Tässä myös larppaus
scope note: Hit även LARP @sv

Keskiaika
type: Class
type: Concept
subclass of: Yleinen kirjallisuudenhistoria
alternative label: Keskiaika, kirjallisuudenhistoria (809.2)
alternative label: Ritarirunous, kirjallisuudenhistoria, keskiaika (809.2)
alternative label: Medeltiden, litteraturhistoria (809.2) @sv
alternative label: Riddardiktning, litteraturhistoria, medeltiden (809.2) @sv
broader: Yleinen kirjallisuudenhistoria
in scheme: URN:NBN:fi:au:hklj:
notation: 809.2
preferred label: Middle Ages @en
preferred label: Medeltiden @sv
related: URN:NBN:fi:au:hklj:709
related: URN:NBN:fi:au:hklj:770.9
related: SUOMALAIS-UGRILAISTEN KIELTEN KIRJALLISUUDEN HISTORIA JA TUTKIMUS
related: GERMAANISTEN KIELTEN KIRJALLISUUDEN HISTORIA JA TUTKIMUS
related: ROMAANISTEN, SLAAVILAISTEN JA BALTTILAISTEN KIELTEN KIRJALLISUUDEN HISTORIA JA TUTKIMUS
related: MUIDEN KIELTEN KIRJALLISUUDEN HISTORIA JA TUTKIMUS
related: Latinankielisen kirjallisuuden historia ja tutkimus
related: URN:NBN:fi:au:hklj:919
related: Keskiajan kulttuurihistoria 400-1499
scope note: Keskiajan kirjallisuuden historian ja tutkimuksen yleisteokset Euroopan ja muiden maanosien keskiajan kirjallisuuden historian ja tutkimuksen yleisteokset
scope note: Allmänna verk om medeltidens litteraturhistoria och forskning i medeltidens litteratur Allmänna verk om medeltidens litteraturhistoria och forskning i medeltidens litteratur i Europa och andra världsdelar @sv

Uusi aika
type: Class
type: Concept
subclass of: Yleinen kirjallisuudenhistoria
alternative label: Klassismi, kirjallisuudenhistoria (809.3)
alternative label: Naturalismi, kirjallisuudenhistoria (809.3)
alternative label: Realismi, kirjallisuudenhistoria (809.3 ... 809.4)
alternative label: Renessanssi, kirjallisuudenhistoria (809.3)
alternative label: Symbolismi, kirjallisuudenhistoria (809.3)
alternative label: Täysrenessanssi, kirjallisuudenhistoria (809.3)
alternative label: Uusi aika, kirjallisuudenhistoria (809.3)
alternative label: Uusromantiikka, kirjallisuudenhistoria, 1800-luku (809.3)
alternative label: Varhaisrenessanssi, kirjallisuudenhistoria (809.3)
alternative label: Vuosisadan vaihde, kirjallisuudenhistoria (809.3 ... 809.4)
alternative label: Högrenässansen, litteraturhistoria (809.3) @sv
alternative label: Klassicism, litteraturhistoria (809.3) @sv
alternative label: Naturalism, litteraturhistoria (809.3) @sv
alternative label: Nya tiden, litteraturhistoria (809.3) @sv
alternative label: Nyromantik, litteraturhistoria, 1800-talet (809.3) @sv
alternative label: Realism, litteraturhistoria (809.3 ... 809.4) @sv
alternative label: Renässans, litteraturhistoria (809.3) @sv
alternative label: Sekelskiftet, litteraturhistoria (809.3 ... 809.4) @sv
alternative label: Symbolism, litteraturhistoria (809.3) @sv
alternative label: Ungrenässansen, litteraturhistoria (809.3) @sv
broader: Yleinen kirjallisuudenhistoria
in scheme: URN:NBN:fi:au:hklj:
notation: 809.3
preferred label: Modern times @en
preferred label: Nya tiden @sv
related: URN:NBN:fi:au:hklj:709
related: URN:NBN:fi:au:hklj:770.9
related: SUOMALAIS-UGRILAISTEN KIELTEN KIRJALLISUUDEN HISTORIA JA TUTKIMUS
related: GERMAANISTEN KIELTEN KIRJALLISUUDEN HISTORIA JA TUTKIMUS
related: ROMAANISTEN, SLAAVILAISTEN JA BALTTILAISTEN KIELTEN KIRJALLISUUDEN HISTORIA JA TUTKIMUS
related: MUIDEN KIELTEN KIRJALLISUUDEN HISTORIA JA TUTKIMUS
related: URN:NBN:fi:au:hklj:919
related: Uuden ajan kulttuurihistoria 1500-1788
related: Uusimman ajan kulttuurihistoria 1789-1913
scope note: Uuden ajan kirjallisuuden historian ja tutkimuksen yleisteokset Euroopan ja muiden maanosien uuden ajan kirjallisuuden historian ja tutkimuksen yleisteokset
scope note: Allmänna verk om nya tidens litteraturhistoria och forskning i nya tidens litteratur Allmänna verk om nya tidens litteraturhistoria och forskning i nya tidens litteratur i Europa och andra världsdelar @sv

Nykyaika
type: Class
type: Concept
subclass of: Yleinen kirjallisuudenhistoria
alternative label: Dada, kirjallisuudenhistoria (809.4)
alternative label: Dadaismi, kirjallisuudenhistoria (809.4)
alternative label: Eksistentialismi, kirjallisuudenhistoria (809.4)
alternative label: Ekspressionismi, kirjallisuudenhistoria (809.4)
alternative label: Futurismi, kirjallisuudenhistoria (809.4)
alternative label: Imagismi, kirjallisuudenhistoria, Iso-Britannia (809.4)
alternative label: Jälkimoderni, kirjallisuudenhistoria (809.4)
alternative label: Jälkimodernismi, kirjallisuudenhistoria (809.4)
alternative label: Kansallisromantiikka, kirjallisuudenhistoria (809.4)
alternative label: Lettrismi, kirjallisuudenhistoria (809.4 +)
alternative label: Moderni taide, kirjallisuudenhistoria (809.4)
alternative label: Moderni, kirjallisudenhistoria (809.4)
alternative label: Modernismi, kirjallisuudenhistoria (809.4)
alternative label: Nykytaide, kirjallisuudenhistoria (809.4)
alternative label: Postmoderni, kirjallisuudenhistoria (809.4)
alternative label: Postmodernismi, kirjallisuudenhistoria (809.4)
alternative label: Realismi, kirjallisuudenhistoria (809.3 ... 809.4)
alternative label: Romantiikka, kirjallisuudenhistoria (809.4)
alternative label: Sosialistinen realismi, kirjallisuudenhistoria (809.4)
alternative label: Surrealismi, kirjallisuudenhistoria (809.4)
alternative label: Täysromantiikka, kirjallisuudenhistoria (809.4)
alternative label: Uudenaikaisuus, kirjallisuudenhistoria (809.4)
alternative label: Uusromantiikka, kirjallisuudenhistoria, 1900-luku (809.4)
alternative label: Varhaisromantiikka, kirjallisuudenhistoria (809.4)
alternative label: Vuosisadan vaihde, kirjallisuudenhistoria (809.3 ... 809.4)
alternative label: Vuosituhannen vaihde, kirjallisuudenhistoria (809.4)
alternative label: Dada, litteraturhistoria (809.4) @sv
alternative label: Dadaism, litteraturhistoria (809.4) @sv
alternative label: Existentialism, litteraturhistoria (809.4) @sv
alternative label: Expressionism, litteraturhistoria (809.4) @sv
alternative label: Futurism, litteraturhistoria (809.4) @sv
alternative label: Förromantik, litteraturhistoria (809.4) @sv
alternative label: Högromantik, litteraturhistoria (809.4) @sv
alternative label: Imagism, litteraturhistoria, Storbritannien (809.4) @sv
alternative label: Lettrism, litteraturhistoria (809.4 +) @sv
alternative label: Millennieskiftet, litteraturhistoria (809.4) @sv
alternative label: Modern konst, litteraturhistoria (809.4) @sv
alternative label: Modern, literaturhistoria (809.4) @sv
alternative label: Modernism, litteraturhistoria (809.4) @sv
alternative label: Modernitet, litteraturhistoria (809.4) @sv
alternative label: Nationalromantik, litteraturhistoria (809.4) @sv
alternative label: Nutidskonst, litteraturhistoria (809.4) @sv
alternative label: Nyromantik, litteraturhistoria, 1900-talet (809.4) @sv
alternative label: Postmodern, litteraturhistoria (809.4) @sv
alternative label: Postmodernism, litteraturhistoria (809.4) @sv
alternative label: Realism, litteraturhistoria (809.3 ... 809.4) @sv
alternative label: Romantiken, litteraturhistoria (809.4) @sv
alternative label: Sekelskiftet, litteraturhistoria (809.3 ... 809.4) @sv
alternative label: Senmodern, litteraturhistoria (809.4) @sv
alternative label: Senmodernism, litteraturhistoria (809.4) @sv
alternative label: Socialistisk realism, litteraturhistoria (809.4) @sv
alternative label: Surrealism, litteraturhistoria (809.4) @sv
broader: Yleinen kirjallisuudenhistoria
in scheme: URN:NBN:fi:au:hklj:
notation: 809.4
preferred label: Present day @en
preferred label: Nutiden @sv
related: URN:NBN:fi:au:hklj:709
related: URN:NBN:fi:au:hklj:770.9
related: SUOMALAIS-UGRILAISTEN KIELTEN KIRJALLISUUDEN HISTORIA JA TUTKIMUS
related: GERMAANISTEN KIELTEN KIRJALLISUUDEN HISTORIA JA TUTKIMUS
related: ROMAANISTEN, SLAAVILAISTEN JA BALTTILAISTEN KIELTEN KIRJALLISUUDEN HISTORIA JA TUTKIMUS
related: MUIDEN KIELTEN KIRJALLISUUDEN HISTORIA JA TUTKIMUS
related: URN:NBN:fi:au:hklj:919
related: Nykyajan kulttuurihistoria 1914-1938
related: Nykyajan kulttuurihistoria 1939-
scope note: Vuodesta 1900 Nykyajan kirjallisuuden historian ja tutkimuksen yleisteokset Euroopan ja muiden maanosien nykyajan kirjallisuuden historian ja tutkimuksen yleisteokset
scope note: Från 1900- Allmänna verk om nutidens litteraturhistoria och forskning i nutidens litteratur Allmänna verk om nutidens litteraturhistoria och forskning i nutidens litteratur i Europa och andra världsdelar @sv

Saksankielisen kirjallisuuden historia ja tutkimus
type: Class
type: Concept
subclass of: GERMAANISTEN KIELTEN KIRJALLISUUDEN HISTORIA JA TUTKIMUS
alternative label: Jiddisin kieli, kirjallisuuden historia (825)
alternative label: Minnelaulajat, kansanrunoudentutkimus (825)
alternative label: Nibelungenlied, folkloristiikka (825)
alternative label: Saksan kieli, kirjallisuuden historia (825)
alternative label: Jiddisch, litteraturhistoria (825) @sv
alternative label: Minnesångare, folkdiktsforskning (825) @sv
alternative label: Nibelungenlied, folkloristik (825) @sv
alternative label: Tyska, litteraturhistoria (825) @sv
broader: GERMAANISTEN KIELTEN KIRJALLISUUDEN HISTORIA JA TUTKIMUS
in scheme: URN:NBN:fi:au:hklj:
notation: 825
preferred label: German literature: history and research @en
preferred label: Tysk litteraturhistoria och forskning i tysk litteratur @sv
related: URN:NBN:fi:au:hklj:3
related: URN:NBN:fi:au:hklj:3.9
related: Kirjallisuuden aihepiirejä ja kirjallisuustyyppejä koskeva historia ja tutkimus
related: Lasten- ja nuortenkirjallisuuden historia ja tutkimus
related: ROMAANISTEN, SLAAVILAISTEN JA BALTTILAISTEN KIELTEN KIRJALLISUUDEN HISTORIA JA TUTKIMUS
related: Ranskankielisen kirjallisuuden historia ja tutkimus
related: Italiankielisen kirjallisuuden historia ja tutkimus
related: Saksan kieli
scope note: Tässä myös esim. Itävallan ja Sveitsin saksankielisen kirjallisuuden historia ja tutkimus Tässä myös Sveitsin kirjallisuuden historian ja tutkimuksen yleisteokset Tässä myös jiddin- ja friisinkielisen kirjallisuuden historia ja tutkimus
scope note: Hit också litteraturhistoria och forskning som rör tysk litteratur i t.ex. Österrike och Schweiz Hit också allmänna verk om schweizisk litteraturhistoria och litteraturforskning Hit också litteraturhistoria och litteraturforskning som rör jiddisch och frisiska @sv

Monikieliset sanakirjat. Sivistyssanakirjat
type: Class
type: Concept
subclass of: KIELITIEDE
alternative label: Fraasisanakirjat, monikieliset (853)
alternative label: Fraasit, sanakirjat, monikieliset (853)
alternative label: Fraseologia, sanakirjat, monikieliset (853)
alternative label: Frekvenssisanakirjat, monikieliset (853)
alternative label: Idiomisanakirjat, monikieliset (853)
alternative label: Lainasanat, sivistyssanakirjat (853)
alternative label: Lyhenteet (853)
alternative label: Monikieliset sanakirjat (853)
alternative label: Murresanakirjat (853)
alternative label: Polyglotit (853)
alternative label: Sanakirjat, monikieliset (853)
alternative label: Sanastot, monikieliset (853)
alternative label: Sanonnat, sanakirjat, monikieliset (853)
alternative label: Sanontatavat, sanakirjat, monikieliset (853)
alternative label: Sivistyssanat (853)
alternative label: Sivistyssanat, sivistyssanakirjat (853)
alternative label: Slangisanakirjat, monikieliset (853)
alternative label: Suomen kieli, sivistyssanakirjat (853)
alternative label: Syntymäpäivät, syntymäpäiväsanakirjat, monikieliset (853)
alternative label: Termipankit, sanastot, monikieliset (853)
alternative label: Vierassanat, sivistyssanakirjat (853)
alternative label: Dialektlexikon (853) @sv
alternative label: Finska, ordböcker över främmande ord (853) @sv
alternative label: Fraseologi, ordböcker, flerspråkiga (853) @sv
alternative label: Fraser, ordböcker, flerspråkiga (853) @sv
alternative label: Frasordböcker, flerspråkiga (853) @sv
alternative label: Frekvensordböcker, flerspråkiga (853) @sv
alternative label: Främmande ord, ordböcker över främmande ord (853) @sv
alternative label: Födelsedagar, födelsedagsordböcker, flerspråkiga (853) @sv
alternative label: Förkortningar (853) @sv
alternative label: Idiomordböcker, flerspråkiga (853) @sv
alternative label: Kulturord (853) @sv
alternative label: Kulturord, ordböcker över främmande ord (853) @sv
alternative label: Lånord, ordböcker över främmande ord (853) @sv
alternative label: Ordböcker, flerspråkiga (853) @sv
alternative label: Ordlistor, flerspråkiga (853) @sv
alternative label: Polyglotter (853) @sv
alternative label: Polyglottlexikon (853) @sv
alternative label: Slangordböcker, flerspråkiga (853) @sv
alternative label: Talesätt, ordböcker, flerspråkiga (853) @sv
alternative label: Termbanker, ordlistor, flerspråkiga (853) @sv
broader: KIELITIEDE
in scheme: URN:NBN:fi:au:hklj:
notation: 853
preferred label: Multi-lingual dictionaries. Uni-lingual dictionaries @en
preferred label: Flerspråkiga ordböcker. Ordböcker över främmande ord @sv
related: Mietelausekokoelmat. Sitaattikokoelmat
related: URN:NBN:fi:au:hklj:860
related: GERMAANISET, KELTTILÄISET, BALTTILAISET JA SLAAVILAISET KIELET
related: Ruotsin kielen yksikieliset sanakirjat
related: Saksan kielen yksikieliset sanakirjat
related: Englannin kielen yksikieliset sanakirjat
related: URALILAISET KIELET. ALTAILAISET KIELET
related: Suomen kielen yksikieliset sanakirjat
related: MUUT KIELET
scope note: Vähintään 3-kieliset yleiset sanakirjat Julkaisun kielestä riippumatta myös yleiset sivistyssanakirjat, vierasperäisten sanojen sanakirjat sekä yleiset lyhenneluettelot ja lyhennesanakirjat Erikoisalojen sanakirjat alan mukaisessa luokassa
scope note: Allmänna ordböcker över minst tre språk Allmänna ordböcker över främmande ord samt allmänna förkortningslistor och förkortningsordböcker oavsett publikationens språk Ordböcker för specialområden klassificeras enligt område. @sv

Äänneoppi
type: Class
type: Concept
subclass of: KIELITIEDE
alternative label: Aksentti, äänneoppi (856)
alternative label: Artikulaatio, ääntäminen (856)
alternative label: Artikuloiminen, ääntäminen (856)
alternative label: Artikulointi, ääntäminen (856)
alternative label: Assimilaatio, äänneoppi (856)
alternative label: Astevaihtelu, äänneoppi (856)
alternative label: Diftongit (856)
alternative label: Foneemit, äänneoppi (856)
alternative label: Fonetiikka, kielitiede (856)
alternative label: Fonologia (856)
alternative label: Fonotaksi (856)
alternative label: Geminaatio (856)
alternative label: Intonaatio, fonetiikka (856)
alternative label: Kadenssit, fonetiikka (856)
alternative label: Kokeellinen fonetiikka, kielitiede (856)
alternative label: Kombinaatio-oppi, kielitiede, äänneoppi (856)
alternative label: Konsonantit (856)
alternative label: Korrelaatio, kielitiede (856)
alternative label: Kvantiteetti, kielitiede (856)
alternative label: Liudennus (856)
alternative label: Lopukkeet, kielitiede (856)
alternative label: Paino, kielitiede (856)
alternative label: Palatalisaatio (856)
alternative label: Prosodiikka, kielitiede (856)
alternative label: Puheakti, äänioppi (856)
alternative label: Puhetieteet, fonetiikka (856)
alternative label: Vokaalisointu, äänneoppi (856)
alternative label: Vokaalit, äänneoppi (856)
alternative label: Äänneoppi, kielitiede (856)
alternative label: Äännevaihtelu (856)
alternative label: Äänteet (856)
alternative label: Ääntäminen, kielitiede (856)
alternative label: Accent, ljudlära (856) @sv
alternative label: Artikulation, uttal (856) @sv
alternative label: Assimilation, ljudlära (856) @sv
alternative label: Diftonger (856) @sv
alternative label: Experimentell fonetik, lingvistik (856) @sv
alternative label: Fonem, ljudlära (856) @sv
alternative label: Fonetik, lingvistik (856) @sv
alternative label: Fonologi (856) @sv
alternative label: Fonotax (856) @sv
alternative label: Geminering (856) @sv
alternative label: Intonation, fonetik (856) @sv
alternative label: Kadenser, fonetik (856) @sv
alternative label: Kombinatorik, lingvistik, ljudlära (856) @sv
alternative label: Konsonanter (856) @sv
alternative label: Korrelation, lingvistik (856) @sv
alternative label: Kvantitet, lingvistik, lingvistik (856) @sv
alternative label: Ljud, språk (856) @sv
alternative label: Ljudlära. lingvistik, lingvistik (856) @sv
alternative label: Ljudväxling (856) @sv
alternative label: Palatalisering, liudennus (856) @sv
alternative label: Palatalisering, palatalisaatio (856) @sv
alternative label: Prosodi, lingvistik (856) @sv
alternative label: Slutljud, lingvistik (856) @sv
alternative label: Stadieväxling, ljudlära (856) @sv
alternative label: Talakt, akustik (856) @sv
alternative label: Talvetenskaper, fonetik (856) @sv
alternative label: Tryck, lingvistik (856) @sv
alternative label: Uttal, lingvistik (856) @sv
alternative label: Vokaler, ljudlära (856) @sv
alternative label: Vokalharmoni, ljudlära (856) @sv
broader: KIELITIEDE
in scheme: URN:NBN:fi:au:hklj:
notation: 856
preferred label: Phonetics @en
related: Oppimisen psykologia
related: Luku-, kirjoitus- ja puhehäiriöiset
related: Ilmaisutaito. Puhetaito. Lausuntataide
related: URN:NBN:fi:au:hklj:860
related: GERMAANISET, KELTTILÄISET, BALTTILAISET JA SLAAVILAISET KIELET
related: Ruotsin kielen äänneoppi
related: URALILAISET KIELET. ALTAILAISET KIELET
related: Suomen kielen äänneoppi
related: MUUT KIELET
scope note: Äänneopin, fonetiikan ja fonologian yleisteokset Äänifysiologia, äänteet ja ääntäminen yleensä Vokaalit, konsonantit ja kombinaatio-oppi yleensä Kvantiteetti, aksenttti ja äänteenmuutokset yleensä Tiettyä kieltä tai kieliryhmää koskeva äänneoppi ko. kielen tai kieliryhmän luokassa
scope note: Allmänna verk om ljudlära, fonetik och fonologi Röstfysiologi, språkljud och uttal i allmänhet Vokaler, konsonanter och fonotax i allmänhet Kvantitet, accent och ljudförändringar i allmänhet Ljudlära som rör ett bestämt språk eller en bestämd språkgrupp förs till klassen för språket eller språkgruppen i fråga @sv

Ruotsin kielen kielioppi ja semantiikka
type: Class
type: Concept
subclass of: Ruotsin kieli
alternative label: Riikinruotsi, kielioppi (872.5)
alternative label: Ruotsin kieli, kielioppi (872.5)
alternative label: Ruotsin ruotsi, kielioppi (872.5)
alternative label: Ruotsinruotsi, kielioppi (872.5)
alternative label: Rikssvenska, grammatik (872.5) @sv
alternative label: Svenska, grammatik (872.5) @sv
alternative label: Sverigesvenska, grammatik (872.5) @sv
broader: Ruotsin kieli
in scheme: URN:NBN:fi:au:hklj:
notation: 872.5
preferred label: Swedish syntax and semantics @en
preferred label: Svensk satslära (syntax) och betydelselära (semantik) @sv
related: URN:NBN:fi:au:hklj:188.4
related: Sähköposti. Verkkojuttelu
related: URN:NBN:fi:au:hklj:627.7512
related: Kielioppi. Muoto-oppi. Sanaoppi. Semantiikka
related: URN:NBN:fi:au:hklj:860
related: Pohjoismaiset kielet
related: Ruotsin kielen murteet
related: Suomenruotsi
scope note: Ruotsin kielen kielioppi, muoto-oppi, sanaoppi ja semantiikka Ruotsin kielen kieliopin oppi- ja harjoituskirjat Sanaluokat. Sananmuodostus. Taivutus. Lauseoppi eli syntaksi
scope note: Svensk betydelselära (semantik), formlära (morfologi), satslära (syntax) och ordlära (lexikologi) Läroböcker och övningsböcker i svensk grammatik Ordklasser. Ordbildning. Böjning. Satslära (syntax) @sv

Itämerensuomalaiset kielet
type: Class
type: Concept
subclass of: URALILAISET KIELET. ALTAILAISET KIELET
alternative label: Aunuksen kieli (883)
alternative label: Inkeroismurteet (883)
alternative label: Karjala-aunuksen kieli (883)
alternative label: Karjalan kieli (883)
alternative label: Karjalan kieli, kielitiede (883)
alternative label: Liivin kieli (883)
alternative label: Liivin kieli, kielitiede (883)
alternative label: Livvin kieli (883)
alternative label: Lyydiläismurteet (883)
alternative label: Lyydin kieli (883)
alternative label: Lyydin kieli, kielitiede (883)
alternative label: Suomalais-ugrilaiset kielet (881 ... 887 +)
alternative label: Suomalais-ugrilaiset kielet, kielitiede (881 ... 887 +)
alternative label: Vatjan kieli (883)
alternative label: Vatjan kieli, kielitiede (883)
alternative label: Vepsän kieli (883)
alternative label: Vepsän kieli, kielitiede (883)
alternative label: Aunus, språket (883) @sv
alternative label: Finsk-ugriska språk (881 ... 887 +) @sv
alternative label: Finsk-ugriska språk, lingvistik (881 ... 887 +) @sv
alternative label: Ingermanländska dialekter (883) @sv
alternative label: Karelska (883) @sv
alternative label: Karelska, lingvistik (883) @sv
alternative label: Liviska (883) @sv
alternative label: Liviska, lingvistik (883) @sv
alternative label: Lydiska (883) @sv
alternative label: Lydiska dialekter (883) @sv
alternative label: Lydiska, lingvistik (883) @sv
alternative label: Olonetskarelska (883) @sv
alternative label: Vepsiska (883) @sv
alternative label: Vepsiska, lingvistik (883) @sv
alternative label: Votiska (883) @sv
alternative label: Votiska, lingvistik (883) @sv
broader: URALILAISET KIELET. ALTAILAISET KIELET
in scheme: URN:NBN:fi:au:hklj:
notation: 883
preferred label: Baltic-Finnish languages @en
preferred label: Östersjöfinska språk @sv
related: Suomen kieli
related: Suomen kielen äänneoppi
related: Suomen kielen etymologia ja onomastiikka
related: Suomen kielen yksikieliset sanakirjat
related: Suomen kielen kielioppi ja semantiikka
related: Suomen kielen murteet
related: Suomen kielen ainekirjoitusoppaat
related: Suomen kielen historia
related: Viron kieli
scope note: Inkerin, karjalan, liivin, lyydin, vatjan ja vepsän kieli
scope note: Ingermanländska, karelska, liviska, lydiska, vepsiska och votiska @sv

Itävallan ja Unkarin historia
type: Class
type: Concept
subclass of: URN:NBN:fi:au:hklj:970
alternative label: Itävalta, historia, Itävalta-Unkari (974)
alternative label: Tanssiva kongressi, Itävallan ja Unkarin historia (974)
alternative label: Wien, historia (974 +)
alternative label: Wienin kongressi, Itävallan ja Unkarin historia (974)
alternative label: Wienin tanssiva kongressi, Itävallan ja Unkarin historia (974)
alternative label: Wienkongressen, Österrikes och Ungerns historia (974) @sv
alternative label: Österrike, historia, Österrike-Ungern (974) @sv
broader: URN:NBN:fi:au:hklj:970
in scheme: URN:NBN:fi:au:hklj:
narrower: Itävallan historia
narrower: Unkarin historia
notation: 974
preferred label: History of Austria and Hungary @en
preferred label: Österrikes och Ungerns historia @sv
related: Unkari
related: Itävalta
related: Wien
related: URN:NBN:fi:au:hklj:909
related: URN:NBN:fi:au:hklj:919
scope note: Teokset, jotka koskevat sekä Itävallan että Unkarin historiaa Tähän myös Itävalta-Unkarin historian yleisteokset
scope note: Verk om både Österrikes och Ungerns historia Hit också allmänna verk om Österrike-Ungerns historia @sv

Tsekin ja slovakian historia
type: Class
type: Concept
subclass of: Muiden Keski-Euroopan maiden historia
broader: Muiden Keski-Euroopan maiden historia
in scheme: URN:NBN:fi:au:hklj:
narrower: Tsekin historia
narrower: Slovakian historia
notation: 978.1
preferred label: History of the Czech Republic and Slovakia @en
preferred label: Tjeckiens och Slovakiens historia @sv
related: Entisen Tsekkoslovakian alue
related: Tsekki
related: Slovakia
related: URN:NBN:fi:au:hklj:909
related: URN:NBN:fi:au:hklj:919
scope note: Teokset, jotka koskevat sekä Tsekin että Slovakian historiaa Tässä myös Tsekkoslovakian historian yleisteokset
scope note: Verk om både Tjeckiens och Slovakiens historia Hit också allmänna verk om Tjeckoslovakiens historia @sv

Italian historia
type: Class
type: Concept
subclass of: URN:NBN:fi:au:hklj:979
alternative label: Fasismi, Italian historia (979.3)
alternative label: Fasistit, Italian historia (979.3)
alternative label: Italia, historia (979.3)
alternative label: Riviera, Italia, historia (979.3)
alternative label: Rooma, nykyajan Rooma, historia (979.3)
alternative label: San Marino, historia (979.3)
alternative label: Sardinia, historia (979.3)
alternative label: Sisilia, nykyhistoria (979.3)
alternative label: Vatikaanivaltio, historia (979.3)
alternative label: Fascism, Italiens historia (979.3) @sv
alternative label: Fascister, Italiens historia (979.3) @sv
alternative label: Italien, historia (979.3) @sv
alternative label: Riviera, Italien, historia (979.3) @sv
alternative label: Rom, nutidens Rom, historia (979.3) @sv
alternative label: Sardinien, historia (979.3) @sv
alternative label: Sicilien, nutidshistoria (979.3) @sv
alternative label: Vatikanstaten, historia (979.3) @sv
broader: URN:NBN:fi:au:hklj:979
in scheme: URN:NBN:fi:au:hklj:
notation: 979.3
preferred label: Italy's history @en
preferred label: Italiens historia @sv
related: Etelä-Eurooppa
related: Pyreneiden niemimaa
related: Italia
related: Rooma
related: URN:NBN:fi:au:hklj:909
related: Rooman valtakunnan historia ja arkeologia
related: URN:NBN:fi:au:hklj:919
scope note: Tässä myös San Marinon ja Vatikaanivaltion historia
scope note: Hit också San Marinos och Vatikanstatens historia @sv

Länsi-, Itä- ja Keski-Afrikan historia
type: Class
type: Concept
subclass of: Afrikan historia
alternative label: Abessinia, historia (985.2)
alternative label: Angola, historia (985.2)
alternative label: Benin, historia (985.2)
alternative label: Burkina Faso, historia (985.2)
alternative label: Burundi, historia (985.2)
alternative label: Dahomey, historia (985.2)
alternative label: Djibouti, historia (985.2)
alternative label: Eritrea, historia (985.2)
alternative label: Etiopia, historia (985.2)
alternative label: Gabon, historia (985.2)
alternative label: Gambia, historia (985.2)
alternative label: Ghana, historia (985.2)
alternative label: Guinea, historia (985.2)
alternative label: Guinea-Bissau, historia (985.2)
alternative label: Itä-Afrikka, historia (985.2)
alternative label: Kamerun, historia (985.2)
alternative label: Kenia, historia (985.2)
alternative label: Keski-Afrikka, historia (985.2)
alternative label: Kongo Brazzaville, historia (985.2)
alternative label: Kongo Kinshasa, historia (985.2)
alternative label: Kongo, historia (985.2)
alternative label: Kultarannikko, historia (985.2)
alternative label: Liberia, historia (985.2)
alternative label: Länsi-Afrikka, historia (985.2)
alternative label: Mali, historia (985.2)
alternative label: Mauritania, historia (985.2)
alternative label: Niger, historia (985.2)
alternative label: Nigeria, historia (985.2)
alternative label: Norsunluurannikko, historia (985.2)
alternative label: Päiväntasaajan Guinea, historia (985.2)
alternative label: Ruanda, historia (985.2)
alternative label: Sahel, historia (985.2)
alternative label: Sambia, historia (985.2)
alternative label: Senegal, historia (985.2)
alternative label: Sierra Leone, historia (985.2)
alternative label: Somalia, historia (985.2)
alternative label: Tansania, historia (985.2)
alternative label: Togo, historia (985.2)
alternative label: Tsad, historia (985.2)
alternative label: Uganda, historia (985.2)
alternative label: Zaire, historia (985.2)
alternative label: Abessinien, historia (985.2) @sv
alternative label: Centralafrika, historia (985.2) @sv
alternative label: Ekvatorialguinea, historia (985.2) @sv
alternative label: Elfenbenskusten, historia (985.2) @sv
alternative label: Etiopien, historia (985.2) @sv
alternative label: Guldkusten, historia (985.2) @sv
alternative label: Kenya, historia (985.2) @sv
alternative label: Kongo-Brazzaville, historia (985.2) @sv
alternative label: Kongo-Kinshasa, historia (985.2) @sv
alternative label: Mauretanien, historia (985.2) @sv
alternative label: Tanzania, historia (985.2) @sv
alternative label: Tchad, historia (985.2) @sv
alternative label: Västafrika, historia (985.2) @sv
alternative label: Zambia, historia (985.2) @sv
alternative label: Östafrika, historia (985.2) @sv
broader: Afrikan historia
in scheme: URN:NBN:fi:au:hklj:
notation: 985.2
preferred label: History of West, East and Central Africa @en
preferred label: Västafrikas, Östafrikas och Centralafrikas historia @sv
related: AFRIKKA
related: Länsi-Afrikka
related: Keski-Afrikka
related: Itä-Afrikka
related: Djibouti. Eritrea. Etiopia. Somalia
related: BRITTEIN SAARTEN HISTORIA
related: RANSKAN HISTORIA
scope note: Angolan, Beninin, Burkina Fason, Burundin, Djiboutin, Eritrean, Etiopian, Gabonin, Gambian, Ghanan, Guinean, Guinea-Bissaun, Kamerunin, Kenian, Keski-Afrikan tasavallan, Kongon, Liberian, Malin, Mauritanian, Nigerin, Nigerian, Norsunluurannikon, Päiväntasaajan Guinean, Ruandan, Senegalin, Somalian, Sierra Leonen, Tansanian, Togon ja Tsadin historia
scope note: Angolas, Benins, Burkina Fasos, Burundis, Centralafrikanska republikens, Djiboutis, Elfenbenskustens, Ekvatorialguineas, Eritreas, Gabons, Etiopiens, Gambias, Ghanas, Guineas, Guinea-Bissaus, Kameruns, Kenyas, Kongos, Liberias, Malis, Mauretaniens, Nigers, Nigerias, Rwandas, Senegals, Sierra Leones, Somalias, Tanzanias, Tchads, Togos och Ugandas historia @sv

Suomen yleiset elämäkerralliset hakuteokset
type: Class
type: Concept
subclass of: Suomi
alternative label: Aateliskalenterit, Suomi (990.103)
alternative label: Henkilöhakemistot, henkiilöhakemistot, Suomi (990.103)
alternative label: Henkilöhakemistot, muut alat, Suomi (990.103 ... 997.103)
alternative label: Jääkärit, elämäkerralliset hakuteokset (990.103)
alternative label: Lotat, elämäkerralliset hakuteokset (990.103)
alternative label: Ritaristo, aateliskalenterit, Suomi (990.103)
alternative label: Ritarit, aateliskalenterit, Suomi (990.103)
alternative label: Adelskalendrar, Finland (990.103) @sv
alternative label: Jägare, armén, biografiska uppslagsverk (990.103) @sv
alternative label: Lottor, biografiska uppslagsverk (990.103) @sv
alternative label: Riddare, adelskalendrar, Finland (990.103) @sv
alternative label: Riddersdkap, adelskalendrar, Finland (990.103) @sv
broader: Suomi
in scheme: URN:NBN:fi:au:hklj:
notation: 990.103
preferred label: General biographical reference books concerning Finland @en
preferred label: Allmänna biografiska uppslagsböcker som rör Finland @sv
related: Pelastusoppi. Kristillinen antropologia
related: URN:NBN:fi:au:hklj:323
related: Poliittiset ja aatteelliset vähemmistöt
related: URN:NBN:fi:au:hklj:617
related: URN:NBN:fi:au:hklj:618.24
related: URN:NBN:fi:au:hklj:618.3
related: URN:NBN:fi:au:hklj:909
related: URN:NBN:fi:au:hklj:919
related: Sukuhistoria. Sukututkimus

Karjalankielinen kaunokirjallisuus (Kaunoluokka)
type: Class
type: Concept
type: FormClass
subclass of: Muiden suomalais-ugrilaisten kielten kaunokirjallisuus (Kaunoluokka)
broader: Muiden suomalais-ugrilaisten kielten kaunokirjallisuus (Kaunoluokka)
in scheme: URN:NBN:fi:au:hklj:
notation: 1.91
preferred label: Karelian fiction (Fiction class) @en
preferred label: Karelsk skönlitteratur (Skönklass) @sv
scope note: Lyydinkielinen kaunokirjallisuus
scope note: Lydisk skönlitteratur @sv

Saamenkielinen kaunokirjallisuus (Kaunoluokka)
type: Class
type: Concept
type: FormClass
subclass of: Muiden suomalais-ugrilaisten kielten kaunokirjallisuus (Kaunoluokka)
broader: Muiden suomalais-ugrilaisten kielten kaunokirjallisuus (Kaunoluokka)
in scheme: URN:NBN:fi:au:hklj:
notation: 1.98
preferred label: Sami fiction (Fiction class) @en
preferred label: Samisk skönlitteratur (Skönklass) @sv

Ruotsinkielinen murrekirjallisuus (Kaunoluokka)
type: Class
type: Concept
type: FormClass
subclass of: RUOTSINKIELINEN KAUNOKIRJALLISUUS (Kaunoluokka)
broader: RUOTSINKIELINEN KAUNOKIRJALLISUUS (Kaunoluokka)
in scheme: URN:NBN:fi:au:hklj:
notation: 2.5
preferred label: Dialectal literature (Fiction class) @en
preferred label: Bygdemålslitteratur på svenska (Skönklass) @sv

Grönlanninkielinen kaunokirjallisuus (Kaunoluokka)
type: Class
type: Concept
type: FormClass
subclass of: Tanskankielinen kaunokirjallisuus (Kaunoluokka)
broader: Tanskankielinen kaunokirjallisuus (Kaunoluokka)
in scheme: URN:NBN:fi:au:hklj:
notation: 2.89
preferred label: Greenlandic fiction (Fiction class) @en
preferred label: Grönländsk skönlitteratur (Skönklass) @sv

Islanninkielinen kaunokirjallisuus (Kaunoluokka)
type: Class
type: Concept
type: FormClass
subclass of: Norjankielinen kaunokirjallisuus (Kaunoluokka)
broader: Norjankielinen kaunokirjallisuus (Kaunoluokka)
in scheme: URN:NBN:fi:au:hklj:
notation: 2.98
preferred label: Icelandic fiction (Fiction class) @en
preferred label: Isländsk skönlitteratur (Skönklass) @sv

Fäärinkielinen kaunokirjallisuus (Kaunoluokka)
type: Class
type: Concept
type: FormClass
subclass of: Norjankielinen kaunokirjallisuus (Kaunoluokka)
broader: Norjankielinen kaunokirjallisuus (Kaunoluokka)
in scheme: URN:NBN:fi:au:hklj:
notation: 2.99
preferred label: Faroese fiction (Fiction class) @en
preferred label: Färöisk skönlitteratur (Skönklass) @sv

Afrikaansinkielinen kaunokirjallisuus (Kaunoluokka)
type: Class
type: Concept
type: FormClass
subclass of: Hollanninkielinen kaunokirjallisuus (Kaunoluokka)
broader: Hollanninkielinen kaunokirjallisuus (Kaunoluokka)
in scheme: URN:NBN:fi:au:hklj:
notation: 3.89
preferred label: Afrikaans fiction (Fiction class) @en
preferred label: Skönlitteratur på afrikaans (Skönklass) @sv

Jiddinkielinen kaunokirjallisuus (Kaunoluokka)
type: Class
type: Concept
type: FormClass
subclass of: SAKSANKIELINEN KAUNOKIRJALLISUUS (Kaunoluokka)
broader: SAKSANKIELINEN KAUNOKIRJALLISUUS (Kaunoluokka)
in scheme: URN:NBN:fi:au:hklj:
notation: 3.9
preferred label: Yiddish fiction (Fiction class) @en
preferred label: Skönlitteratur på jiddisch (Skönklass) @sv

Portugalinkielinen kaunokirjallisuus (Kaunoluokka)
type: Class
type: Concept
type: FormClass
subclass of: ESPANJANKIELINEN KAUNOKIRJALLISUUS (Kaunoluokka)
broader: ESPANJANKIELINEN KAUNOKIRJALLISUUS (Kaunoluokka)
in scheme: URN:NBN:fi:au:hklj:
notation: 7.8
preferred label: Portuguese fiction (Fiction class) @en
preferred label: Portugisisk skönlitteratur (Skönklass) @sv

Romaniankielinen kaunokirjallisuus (Kaunoluokka)
type: Class
type: Concept
type: FormClass
subclass of: Muiden romaanisten kielten kaunokirjallisuus (Kaunoluokka)
broader: Muiden romaanisten kielten kaunokirjallisuus (Kaunoluokka)
in scheme: URN:NBN:fi:au:hklj:
notation: 7.91
preferred label: Romanian fiction (Fiction class) @en
preferred label: Rumänsk skönlitteratur (Skönklass) @sv

Katalaaninkielinen kaunokirjallisuus (Kaunoluokka)
type: Class
type: Concept
type: FormClass
subclass of: Muiden romaanisten kielten kaunokirjallisuus (Kaunoluokka)
broader: Muiden romaanisten kielten kaunokirjallisuus (Kaunoluokka)
in scheme: URN:NBN:fi:au:hklj:
notation: 7.95
preferred label: Catalan fiction (Fiction class) @en
preferred label: Katalansk skönlitteratur (Skönklass) @sv

Puolankielinen kaunokirjallisuus (Kaunoluokka)
type: Class
type: Concept
type: FormClass
subclass of: VENÄJÄNKIELINEN KAUNOKIRJALLISUUS (Kaunoluokka)
broader: VENÄJÄNKIELINEN KAUNOKIRJALLISUUS (Kaunoluokka)
in scheme: URN:NBN:fi:au:hklj:
notation: 8.8
preferred label: Polish fiction (Fiction class) @en
preferred label: Polsk skönlitteratur (Skönklass) @sv

Tsekinkielinen kaunokirjallisuus (Kaunoluokka)
type: Class
type: Concept
type: FormClass
subclass of: Muiden slaavilaisten kielten kaunokirjallisuus (Kaunoluokka)
broader: Muiden slaavilaisten kielten kaunokirjallisuus (Kaunoluokka)
in scheme: URN:NBN:fi:au:hklj:
notation: 8.91
preferred label: Czech fiction (Fiction class) @en
preferred label: Tjeckisk skönlitteratur (Skönklass) @sv

Slovakinkielinen kaunokirjallisuus (Kaunoluokka)
type: Class
type: Concept
type: FormClass
subclass of: Muiden slaavilaisten kielten kaunokirjallisuus (Kaunoluokka)
broader: Muiden slaavilaisten kielten kaunokirjallisuus (Kaunoluokka)
in scheme: URN:NBN:fi:au:hklj:
notation: 8.92
preferred label: Slovakian fiction (Fiction class) @en
preferred label: Slovakisk skönlitteratur (Skönklass) @sv

Bulgariankielinen kaunokirjallisuus (Kaunoluokka)
type: Class
type: Concept
type: FormClass
subclass of: Muiden slaavilaisten kielten kaunokirjallisuus (Kaunoluokka)
broader: Muiden slaavilaisten kielten kaunokirjallisuus (Kaunoluokka)
in scheme: URN:NBN:fi:au:hklj:
notation: 8.93
preferred label: Bulgarian fiction (Fiction class) @en
preferred label: Bulgarisk skönlitteratur (Skönklass) @sv

Serbiankielinen kaunokirjallisuus (Kaunoluokka)
type: Class
type: Concept
type: FormClass
subclass of: Muiden slaavilaisten kielten kaunokirjallisuus (Kaunoluokka)
broader: Muiden slaavilaisten kielten kaunokirjallisuus (Kaunoluokka)
in scheme: URN:NBN:fi:au:hklj:
notation: 8.94
preferred label: Serbian fiction (Fiction class) @en
preferred label: Serbisk skönlitteratur (Skönklass) @sv

Kroatiankielinen kaunokirjallisuus (Kaunoluokka)
type: Class
type: Concept
type: FormClass
subclass of: Muiden slaavilaisten kielten kaunokirjallisuus (Kaunoluokka)
broader: Muiden slaavilaisten kielten kaunokirjallisuus (Kaunoluokka)
in scheme: URN:NBN:fi:au:hklj:
notation: 8.95
preferred label: Croatian fiction (Fiction class) @en
preferred label: Kroatisk skönlitteratur (Skönklass) @sv

Sloveeninkielinen kaunokirjallisuus (Kaunoluokka)
type: Class
type: Concept
type: FormClass
subclass of: Muiden slaavilaisten kielten kaunokirjallisuus (Kaunoluokka)
broader: Muiden slaavilaisten kielten kaunokirjallisuus (Kaunoluokka)
in scheme: URN:NBN:fi:au:hklj:
notation: 8.96
preferred label: Slovenian fiction (Fiction class) @en
preferred label: Slovensk skönlitteratur (Skönklass) @sv

Bosniankielinen kaunokirjallisuus (Kaunoluokka)
type: Class
type: Concept
type: FormClass
subclass of: Muiden slaavilaisten kielten kaunokirjallisuus (Kaunoluokka)
broader: Muiden slaavilaisten kielten kaunokirjallisuus (Kaunoluokka)
in scheme: URN:NBN:fi:au:hklj:
notation: 8.97
preferred label: Bosnian Fiction (Fiction class) @en
preferred label: Skönlitteratur i Bosnien (Skönklass) @sv

Ukrainankielinen kaunokirjallisuus (Kaunoluokka)
type: Class
type: Concept
type: FormClass
subclass of: Muiden slaavilaisten kielten kaunokirjallisuus (Kaunoluokka)
broader: Muiden slaavilaisten kielten kaunokirjallisuus (Kaunoluokka)
in scheme: URN:NBN:fi:au:hklj:
notation: 8.98
preferred label: Ukrainian fiction (Fiction class) @en
preferred label: Ukrainsk skönlitteratur (Skönklass) @sv

Valkovenäjänkielinen kaunokirjallisuus (Kaunoluokka)
type: Class
type: Concept
type: FormClass
subclass of: Muiden slaavilaisten kielten kaunokirjallisuus (Kaunoluokka)
broader: Muiden slaavilaisten kielten kaunokirjallisuus (Kaunoluokka)
in scheme: URN:NBN:fi:au:hklj:
notation: 8.99
preferred label: Belarusian fiction (Fiction class) @en
preferred label: Vitrysk skönlitteratur (Skönklass) @sv

Latviankielinen kaunokirjallisuus (Kaunoluokka)
type: Class
type: Concept
type: FormClass
subclass of: Balttilaisten kielten kaunokirjallisuus (Kaunoluokka)
broader: Balttilaisten kielten kaunokirjallisuus (Kaunoluokka)
in scheme: URN:NBN:fi:au:hklj:
notation: 9.11
preferred label: Latvian fiction (Fiction class) @en
preferred label: Lettisk skönlitteratur (Skönklass) @sv

Liettuankielinen kaunokirjallisuus (Kaunoluokka)
type: Class
type: Concept
type: FormClass
subclass of: Balttilaisten kielten kaunokirjallisuus (Kaunoluokka)
broader: Balttilaisten kielten kaunokirjallisuus (Kaunoluokka)
in scheme: URN:NBN:fi:au:hklj:
notation: 9.12
preferred label: Lithuanian fiction (Fiction class) @en
preferred label: Litauisk skönlitteratur (Skönklass) @sv

Nykykreikankielinen kaunokirjallisuus (Kaunoluokka)
type: Class
type: Concept
type: FormClass
subclass of: Kreikankielinen kaunokirjallisuus (Kaunoluokka)
broader: Kreikankielinen kaunokirjallisuus (Kaunoluokka)
in scheme: URN:NBN:fi:au:hklj:
notation: 9.21
preferred label: Modern Greek fiction (Fiction class) @en
preferred label: Nygrekisk skönlitteratur (Skönklass) @sv

Latinankielinen kaunokirjallisuus (Kaunoluokka)
type: Class
type: Concept
type: FormClass
subclass of: MUIDEN KIELTEN KAUNOKIRJALLISUUS (Kaunoluokka)
broader: MUIDEN KIELTEN KAUNOKIRJALLISUUS (Kaunoluokka)
in scheme: URN:NBN:fi:au:hklj:
notation: 9.3
preferred label: Fiction in Latin (Fiction class) @en
preferred label: Skönlitteratur på latin (Skönklass) @sv

Turkinkielinen kaunokirjallisuus (Kaunoluokka)
type: Class
type: Concept
type: FormClass
subclass of: MUIDEN KIELTEN KAUNOKIRJALLISUUS (Kaunoluokka)
broader: MUIDEN KIELTEN KAUNOKIRJALLISUUS (Kaunoluokka)
in scheme: URN:NBN:fi:au:hklj:
notation: 9.4
preferred label: Turkish fiction (Fiction class) @en
preferred label: Turkisk skönlitteratur (Skönklass) @sv

Arabiankielinen kaunokirjallisuus (Kaunoluokka)
type: Class
type: Concept
type: FormClass
subclass of: Seemiläisten kielten kaunokirjallisuus (Kaunoluokka)
broader: Seemiläisten kielten kaunokirjallisuus (Kaunoluokka)
in scheme: URN:NBN:fi:au:hklj:
notation: 9.51
preferred label: Arabic fiction (Fiction class) @en
preferred label: Arabisk skönlitteratur (Skönklass) @sv

Hepreankielinen kaunokirjallisuus (Kaunoluokka)
type: Class
type: Concept
type: FormClass
subclass of: Seemiläisten kielten kaunokirjallisuus (Kaunoluokka)
broader: Seemiläisten kielten kaunokirjallisuus (Kaunoluokka)
in scheme: URN:NBN:fi:au:hklj:
notation: 9.52
preferred label: Hebrew fiction (Fiction class) @en
preferred label: Hebreisk skönlitteratur (Skönklass) @sv

Amharankielinen kaunokirjallisuus (Kaunoluokka)
type: Class
type: Concept
type: FormClass
subclass of: Seemiläisten kielten kaunokirjallisuus (Kaunoluokka)
broader: Seemiläisten kielten kaunokirjallisuus (Kaunoluokka)
in scheme: URN:NBN:fi:au:hklj:
notation: 9.53
preferred label: Amharic fiction (Fiction class) @en
preferred label: Amharisk skönlitteratur (Skönklass) @sv

Tigrinjankielinen kaunokirjallisuus (Kaunoluokka)
type: Class
type: Concept
type: FormClass
subclass of: Seemiläisten kielten kaunokirjallisuus (Kaunoluokka)
broader: Seemiläisten kielten kaunokirjallisuus (Kaunoluokka)
in scheme: URN:NBN:fi:au:hklj:
notation: 9.54
preferred label: Tigrinyan fiction (Fiction class) @en
preferred label: Skönlitteratur på tigrinja (Skönklass) @sv

Darinkielinen kaunokirjallisuus (Kaunoluokka)
type: Class
type: Concept
type: FormClass
subclass of: Persiankielinen kaunokirjallisuus (Kaunoluokka)
broader: Persiankielinen kaunokirjallisuus (Kaunoluokka)
in scheme: URN:NBN:fi:au:hklj:
notation: 9.612
preferred label: Dari ficction (Fiction class) @en
preferred label: Skönlitteratur på dari (Skönklass) @sv

Kurmandžinkielinen kaunokirjallisuus (Kaunoluokka)
type: Class
type: Concept
type: FormClass
subclass of: Kurdinkielinen kaunokirjallisuus (Kaunoluokka)
broader: Kurdinkielinen kaunokirjallisuus (Kaunoluokka)
in scheme: URN:NBN:fi:au:hklj:
notation: 9.621
preferred label: Kurmanji fiction (Fiction class) @en
preferred label: Kurmanjisk skönlitteratur (Skönklass) @sv

Soraninkielinen kaunokirjallisuus (Kaunoluokka)
type: Class
type: Concept
type: FormClass
subclass of: Kurdinkielinen kaunokirjallisuus (Kaunoluokka)
broader: Kurdinkielinen kaunokirjallisuus (Kaunoluokka)
in scheme: URN:NBN:fi:au:hklj:
notation: 9.622
preferred label: Sorani fiction (Fiction class) @en
preferred label: Soranisk skönlitteratur (Skönklass) @sv

Bengalinkielinen kaunokirjallisuus (Kaunoluokka)
type: Class
type: Concept
type: FormClass
subclass of: Indoiraanisten kielten kaunokirjallisuus (Kaunoluokka)
broader: Indoiraanisten kielten kaunokirjallisuus (Kaunoluokka)
in scheme: URN:NBN:fi:au:hklj:
notation: 9.63
preferred label: Bengali fiction (Fiction class) @en
preferred label: Skönlitteratur på bengali (Skönklass) @sv

Gudžaratinkielinen kaunokirjallisuus (Kaunoluokka)
type: Class
type: Concept
type: FormClass
subclass of: Indoiraanisten kielten kaunokirjallisuus (Kaunoluokka)
broader: Indoiraanisten kielten kaunokirjallisuus (Kaunoluokka)
in scheme: URN:NBN:fi:au:hklj:
notation: 9.64
preferred label: Gujarati fiction (Fiction class) @en
preferred label: Skönlitteratur på gujarati (Skönklass) @sv

Hindinkielinen kaunokirjallisuus (Kaunoluokka)
type: Class
type: Concept
type: FormClass
subclass of: Indoiraanisten kielten kaunokirjallisuus (Kaunoluokka)
broader: Indoiraanisten kielten kaunokirjallisuus (Kaunoluokka)
in scheme: URN:NBN:fi:au:hklj:
notation: 9.65
preferred label: Hindi fiction (Fiction class) @en
preferred label: Skönlitteratur på hindi (Skönklass) @sv

Pandžabinkielinen kaunokirjallisuus (Kaunoluokka)
type: Class
type: Concept
type: FormClass
subclass of: Indoiraanisten kielten kaunokirjallisuus (Kaunoluokka)
broader: Indoiraanisten kielten kaunokirjallisuus (Kaunoluokka)
in scheme: URN:NBN:fi:au:hklj:
notation: 9.66
preferred label: Punjabi fiction (Fiction class) @en
preferred label: Skönlitteratur på panjabi (Skönklass) @sv

Paštunkielinen kaunokirjallisuus (Kaunoluokka)
type: Class
type: Concept
type: FormClass
subclass of: Indoiraanisten kielten kaunokirjallisuus (Kaunoluokka)
broader: Indoiraanisten kielten kaunokirjallisuus (Kaunoluokka)
in scheme: URN:NBN:fi:au:hklj:
notation: 9.67
preferred label: Pushto fiction (Fiction class) @en
preferred label: Skönlitteratur på pashto (Skönklass) @sv

Romanikielinen kaunokirjallisuus (Kaunoluokka)
type: Class
type: Concept
type: FormClass
subclass of: Indoiraanisten kielten kaunokirjallisuus (Kaunoluokka)
broader: Indoiraanisten kielten kaunokirjallisuus (Kaunoluokka)
in scheme: URN:NBN:fi:au:hklj:
notation: 9.68
preferred label: Romani fiction (Fiction class) @en
preferred label: Skönlitteratur på romani (Skönklass) @sv

Urdunkielinen kaunokirjallisuus (Kaunoluokka)
type: Class
type: Concept
type: FormClass
subclass of: Indoiraanisten kielten kaunokirjallisuus (Kaunoluokka)
broader: Indoiraanisten kielten kaunokirjallisuus (Kaunoluokka)
in scheme: URN:NBN:fi:au:hklj:
notation: 9.69
preferred label: Urdu fiction (Fiction class) @en
preferred label: Skönlitteratur på urdu (Skönklass) @sv

Kiinankielinen kaunokirjallisuus (Kaunoluokka)
type: Class
type: Concept
type: FormClass
subclass of: Tiibetiläis-burmalaisten ja austroaasialaisten kielten kaunokirjallisuus (Kaunoluokka)
broader: Tiibetiläis-burmalaisten ja austroaasialaisten kielten kaunokirjallisuus (Kaunoluokka)
in scheme: URN:NBN:fi:au:hklj:
notation: 9.71
preferred label: Chinese fiction (Fiction class) @en
preferred label: Kinesisk skönlitteratur (Skönklass) @sv

Vietnaminkielinen kaunokirjallisuus (Kaunoluokka)
type: Class
type: Concept
type: FormClass
subclass of: Tiibetiläis-burmalaisten ja austroaasialaisten kielten kaunokirjallisuus (Kaunoluokka)
broader: Tiibetiläis-burmalaisten ja austroaasialaisten kielten kaunokirjallisuus (Kaunoluokka)
in scheme: URN:NBN:fi:au:hklj:
notation: 9.72
preferred label: Vietnamese fiction (Fiction class) @en
preferred label: Vietnamesisk skönlitteratur (Skönklass) @sv

Thainkielinen kaunokirjallisuus (Kaunoluokka)
type: Class
type: Concept
type: FormClass
subclass of: Tiibetiläis-burmalaisten ja austroaasialaisten kielten kaunokirjallisuus (Kaunoluokka)
broader: Tiibetiläis-burmalaisten ja austroaasialaisten kielten kaunokirjallisuus (Kaunoluokka)
in scheme: URN:NBN:fi:au:hklj:
notation: 9.73
preferred label: Thai (Siamese) fiction (Fiction class) @en
preferred label: Thailändsk (siamesisk) skönlitteratur (Skönklass) @sv

Burmankielinen kaunokirjallisuus (Kaunoluokka)
type: Class
type: Concept
type: FormClass
subclass of: Tiibetiläis-burmalaisten ja austroaasialaisten kielten kaunokirjallisuus (Kaunoluokka)
broader: Tiibetiläis-burmalaisten ja austroaasialaisten kielten kaunokirjallisuus (Kaunoluokka)
in scheme: URN:NBN:fi:au:hklj:
notation: 9.74
preferred label: Burmese fiction (Fiction class) @en
preferred label: Burmesisk skönlitteratur (Skönklass) @sv

Khmerinkielinen kaunokirjallisuus (Kaunoluokka)
type: Class
type: Concept
type: FormClass
subclass of: Tiibetiläis-burmalaisten ja austroaasialaisten kielten kaunokirjallisuus (Kaunoluokka)
broader: Tiibetiläis-burmalaisten ja austroaasialaisten kielten kaunokirjallisuus (Kaunoluokka)
in scheme: URN:NBN:fi:au:hklj:
notation: 9.75
preferred label: Khmer fiction (Fiction class) @en
preferred label: Khmerisk skönlitteratur (Skönklass) @sv

Kareninkielinen kaunokirjallisuus (Kaunoluokka)
type: Class
type: Concept
type: FormClass
subclass of: Tiibetiläis-burmalaisten ja austroaasialaisten kielten kaunokirjallisuus (Kaunoluokka)
broader: Tiibetiläis-burmalaisten ja austroaasialaisten kielten kaunokirjallisuus (Kaunoluokka)
in scheme: URN:NBN:fi:au:hklj:
notation: 9.76
preferred label: Karen fiction (Fiction class) @en
preferred label: Karenska skönlitteratur (Skönklass) @sv

Japaninkielinen kaunokirjallisuus (Kaunoluokka)
type: Class
type: Concept
type: FormClass
subclass of: MUIDEN KIELTEN KAUNOKIRJALLISUUS (Kaunoluokka)
broader: MUIDEN KIELTEN KAUNOKIRJALLISUUS (Kaunoluokka)
in scheme: URN:NBN:fi:au:hklj:
notation: 9.8
preferred label: Japanese fiction (Fiction class) @en
preferred label: Japansk skönlitteratur (Skönklass) @sv

Baskinkielinen kaunokirjallisuus (Kaunoluokka)
type: Class
type: Concept
type: FormClass
subclass of: Muiden kielten kaunokirjallisuus (Kaunoluokka)
broader: Muiden kielten kaunokirjallisuus (Kaunoluokka)
in scheme: URN:NBN:fi:au:hklj:
notation: 9.91
preferred label: Basque fiction (Fiction class) @en
preferred label: Baskisk skönlitteratur (Skönklass) @sv

Albaniankielinen kaunokirjallisuus (Kaunoluokka)
type: Class
type: Concept
type: FormClass
subclass of: Muiden kielten kaunokirjallisuus (Kaunoluokka)
broader: Muiden kielten kaunokirjallisuus (Kaunoluokka)
in scheme: URN:NBN:fi:au:hklj:
notation: 9.92
preferred label: Albanian fiction (Fiction class) @en
preferred label: Albansk skönlitteratur (Skönklass) @sv

Kelttiläísten kielten kaunokirjallisuus (Kaunoluokka)
type: Class
type: Concept
type: FormClass
subclass of: Muiden kielten kaunokirjallisuus (Kaunoluokka)
broader: Muiden kielten kaunokirjallisuus (Kaunoluokka)
in scheme: URN:NBN:fi:au:hklj:
notation: 9.93
preferred label: Celtic fiction (Fiction class) @en
preferred label: Skönlitteratur på keltiska språk (Skönklass) @sv
scope note: Bretonin-, gaelin-, iirin-, kymrin- ja manxinkielinen kaunokirjallisuus
scope note: Skönlitteratur på bretonska, skotsk gäliska, iriska, kymriska och manx @sv

Armeniankielinen kaunokirjallisuus (Kaunoluokka)
type: Class
type: Concept
type: FormClass
subclass of: Muiden kielten kaunokirjallisuus (Kaunoluokka)
broader: Muiden kielten kaunokirjallisuus (Kaunoluokka)
in scheme: URN:NBN:fi:au:hklj:
notation: 9.94
preferred label: Armenian fiction (Fiction class) @en
preferred label: Armenisk skönlitteratur (Skönklass) @sv

Georgiankielinen kaunokirjallisuus (Kaunoluokka)
type: Class
type: Concept
type: FormClass
subclass of: Muiden kielten kaunokirjallisuus (Kaunoluokka)
broader: Muiden kielten kaunokirjallisuus (Kaunoluokka)
in scheme: URN:NBN:fi:au:hklj:
notation: 9.95
preferred label: Georgian fiction (Fiction class) @en
preferred label: Georgisk skönlitteratur (Skönklass) @sv

Koreankielinen kaunokirjallisuus (Kaunoluokka)
type: Class
type: Concept
type: FormClass
subclass of: Muiden aasialaisten, australialaisten ja oseanialaisten kielten kaunokirjallisuus (Kaunoluokka)
broader: Muiden aasialaisten, australialaisten ja oseanialaisten kielten kaunokirjallisuus (Kaunoluokka)
in scheme: URN:NBN:fi:au:hklj:
notation: 9.971
preferred label: Korean fiction (Fiction class) @en
preferred label: Koreansk skönlitteratur (Skönklass) @sv

Uzbekinkielinen kaunokirjallisuus (Kaunoluokka)
type: Class
type: Concept
type: FormClass
subclass of: Muiden aasialaisten, australialaisten ja oseanialaisten kielten kaunokirjallisuus (Kaunoluokka)
broader: Muiden aasialaisten, australialaisten ja oseanialaisten kielten kaunokirjallisuus (Kaunoluokka)
in scheme: URN:NBN:fi:au:hklj:
notation: 9.972
preferred label: Uzbek fiction (Fiction class) @en
preferred label: Uzbekisk skönlitteratur (Skönklass) @sv

Azerinkielinen kaunokirjallisuus (Kaunoluokka)
type: Class
type: Concept
type: FormClass
subclass of: Muiden aasialaisten, australialaisten ja oseanialaisten kielten kaunokirjallisuus (Kaunoluokka)
broader: Muiden aasialaisten, australialaisten ja oseanialaisten kielten kaunokirjallisuus (Kaunoluokka)
in scheme: URN:NBN:fi:au:hklj:
notation: 9.973
preferred label: Azerbaijani fiction (Fiction class) @en
preferred label: Azerbajdzjansk skönlitteratur (Skönklass) @sv

Nepalinkielinen kaunokirjallisuus (Kaunoluokka)
type: Class
type: Concept
type: FormClass
subclass of: Muiden aasialaisten, australialaisten ja oseanialaisten kielten kaunokirjallisuus (Kaunoluokka)
broader: Muiden aasialaisten, australialaisten ja oseanialaisten kielten kaunokirjallisuus (Kaunoluokka)
in scheme: URN:NBN:fi:au:hklj:
notation: 9.974
preferred label: Nepali fiction (Fiction class) @en
preferred label: Nepalesisk skönlitteratur (Skönklass) @sv

Malajalaminkielinen kaunokirjallisuus (Kaunoluokka)
type: Class
type: Concept
type: FormClass
subclass of: Dravidakielten kaunokirjallisuus (Kaunoluokka)
broader: Dravidakielten kaunokirjallisuus (Kaunoluokka)
in scheme: URN:NBN:fi:au:hklj:
notation: 9.9761
preferred label: Malayalam fiction (Fiction class) @en
preferred label: Malayalamisk skönlitteratur (Skönklass) @sv

Tamilinkielinen kaunokirjallisuus (Kaunoluokka)
type: Class
type: Concept
type: FormClass
subclass of: Dravidakielten kaunokirjallisuus (Kaunoluokka)
broader: Dravidakielten kaunokirjallisuus (Kaunoluokka)
in scheme: URN:NBN:fi:au:hklj:
notation: 9.9762
preferred label: Tamil fiction (Fiction class) @en
preferred label: Tamilisk skönlitteratur (Skönklass) @sv

Kannadankielinen kaunokirjallisuus (Kaunoluokka)
type: Class
type: Concept
type: FormClass
subclass of: Dravidakielten kaunokirjallisuus (Kaunoluokka)
broader: Dravidakielten kaunokirjallisuus (Kaunoluokka)
in scheme: URN:NBN:fi:au:hklj:
notation: 9.9763
preferred label: Kannada fiction (Fiction class) @en
preferred label: Skönlitteratur på kannada (Skönklass) @sv

Telugunkielinen kaunokirjallisuus (Kaunoluokka)
type: Class
type: Concept
type: FormClass
subclass of: Dravidakielten kaunokirjallisuus (Kaunoluokka)
broader: Dravidakielten kaunokirjallisuus (Kaunoluokka)
in scheme: URN:NBN:fi:au:hklj:
notation: 9.9765
preferred label: Telugu fiction (Fiction class) @en
preferred label: Skönlitteratur på telugu (Skönklass) @sv

Tagaloginkielinen kaunokirjallisuus (Kaunoluokka)
type: Class
type: Concept
type: FormClass
subclass of: Austronesialaisten kielten kaunokirjallisuus (Kaunoluokka)
broader: Austronesialaisten kielten kaunokirjallisuus (Kaunoluokka)
in scheme: URN:NBN:fi:au:hklj:
notation: 9.9781
preferred label: Tagalog fiction (Fiction class) @en
preferred label: Skönlitteratur på tagalog (Skönklass) @sv

Malaijinkielinen kaunokirjallisuus (Kaunoluokka)
type: Class
type: Concept
type: FormClass
subclass of: Austronesialaisten kielten kaunokirjallisuus (Kaunoluokka)
broader: Austronesialaisten kielten kaunokirjallisuus (Kaunoluokka)
in scheme: URN:NBN:fi:au:hklj:
notation: 9.9782
preferred label: Malay fictionnnn (Fiction class) @en
preferred label: Malaijisk skönlitteratur (Skönklass) @sv

Indonesiankielinen kaunokirjallisuus (Kaunoluokka)
type: Class
type: Concept
type: FormClass
subclass of: Austronesialaisten kielten kaunokirjallisuus (Kaunoluokka)
broader: Austronesialaisten kielten kaunokirjallisuus (Kaunoluokka)
in scheme: URN:NBN:fi:au:hklj:
notation: 9.9783
preferred label: Indonesian fiction (Fiction class) @en
preferred label: Skönlitteratur på indonesiska (Skönklass) @sv

Somalinkielinen kaunokirjallisuus (Kaunoluokka)
type: Class
type: Concept
type: FormClass
subclass of: Afrikan kielten kaunokirjallisuus (Kaunoluokka)
broader: Afrikan kielten kaunokirjallisuus (Kaunoluokka)
in scheme: URN:NBN:fi:au:hklj:
notation: 9.981
preferred label: Somali fiction (Fiction class) @en
preferred label: Somalisk skönlitteratur (Skönklass) @sv

Lingalankielinen kaunokirjallisuus (Kaunoluokka)
type: Class
type: Concept
type: FormClass
subclass of: Afrikan kielten kaunokirjallisuus (Kaunoluokka)
broader: Afrikan kielten kaunokirjallisuus (Kaunoluokka)
in scheme: URN:NBN:fi:au:hklj:
notation: 9.986
preferred label: Lingala fiction (Fiction class) @en
preferred label: Skönlitteratur på lingala (Skönklass) @sv

Esperantonkielinen kaunokirjallisuus (Kaunoluokka)
type: Class
type: Concept
type: FormClass
subclass of: Keinotekoisten kielten kaunokirjallisuus (Kaunoluokka)
broader: Keinotekoisten kielten kaunokirjallisuus (Kaunoluokka)
in scheme: URN:NBN:fi:au:hklj:
notation: 9.991
preferred label: Fiction in Esperanto (Fiction class) @en
preferred label: Skönlitteratur på esperanto (Skönklass) @sv

Suomi
type: Class
type: Concept
subclass of: Kirjastojen luettelot
broader: Kirjastojen luettelot
in scheme: URN:NBN:fi:au:hklj:
notation: 012.1
preferred label: Finland @en
related: Yleisbibliografiat. Kansallisbibliografiat
related: Kirjallisuustiede. Kielitiede
related: URN:NBN:fi:au:hklj:018
related: KIRJASTOT. KIRJASTOTOIMI
related: Kirjastoaineisto. Kokoelmatyö
related: Luettelointi
related: Yleiset kirjastot
related: Erikoiskirjastot. Yhdistysten, laitosten ja yritysten kirjastot
related: URN:NBN:fi:au:hklj:028

Suomi
type: Class
type: Concept
subclass of: Yleiset kirjastot
alternative label: Suomi, kirjastot, yleiset (026.1)
alternative label: Finland, bibliotek, allmänna (026.1) @sv
broader: Yleiset kirjastot
in scheme: URN:NBN:fi:au:hklj:
notation: 026.1
preferred label: Finland @en
related: URN:NBN:fi:au:hklj:018
related: Erikoiskirjastot. Yhdistysten, laitosten ja yritysten kirjastot
related: URN:NBN:fi:au:hklj:028
related: Kirjastohistoria
related: Dokumentaatio ja informaatiopalvelu yleensä
related: Museonhoito
related: Arkistonhoito
related: URN:NBN:fi:au:hklj:061
related: URN:NBN:fi:au:hklj:063

Suomi
type: Class
type: Concept
subclass of: Erikoiskirjastot. Yhdistysten, laitosten ja yritysten kirjastot
broader: Erikoiskirjastot. Yhdistysten, laitosten ja yritysten kirjastot
in scheme: URN:NBN:fi:au:hklj:
notation: 027.1
preferred label: Finland @en
related: URN:NBN:fi:au:hklj:018
related: Yleiset kirjastot
related: URN:NBN:fi:au:hklj:028
related: Kirjastohistoria
related: Dokumentaatio ja informaatiopalvelu yleensä
related: Museonhoito
related: Arkistonhoito
related: URN:NBN:fi:au:hklj:061
related: URN:NBN:fi:au:hklj:063

Suomi
type: Class
type: Concept
subclass of: URN:NBN:fi:au:hklj:028
alternative label: Suomi, kirjastot, tieteelliset (028.1)
alternative label: Finland, bibliotek, vetenskapliga (028.1) @sv
broader: URN:NBN:fi:au:hklj:028
in scheme: URN:NBN:fi:au:hklj:
notation: 028.1
preferred label: Finland @en
related: URN:NBN:fi:au:hklj:018
related: Yleiset kirjastot
related: Erikoiskirjastot. Yhdistysten, laitosten ja yritysten kirjastot
related: Kirjastohistoria
related: Dokumentaatio ja informaatiopalvelu yleensä
related: Museonhoito
related: Arkistonhoito
related: URN:NBN:fi:au:hklj:061
related: URN:NBN:fi:au:hklj:063

Kokeellinen psykologia. Psykometriikka
type: Class
type: Concept
subclass of: URN:NBN:fi:au:hklj:120
alternative label: Alisuoriutuminen, psykologiset testit (122)
alternative label: Kokeellinen psykologia (122)
alternative label: Kokeet, psykologia (122)
alternative label: Psykodiagnostiikka (122)
alternative label: Psykologia, kokeellinen psykologia (122)
alternative label: Psykologiset laboratoriot (122)
alternative label: Psykologiset testit (122)
alternative label: Psykometriikka (122)
alternative label: Soveltuvuuskokeet, psykologiset testit (122)
alternative label: Soveltuvuustestit, psykologiset testit (122)
alternative label: Suoriutuminen, psykologiset testit (122)
alternative label: Testit, psykologiset testit (122)
alternative label: Experimentell psykologi (122) @sv
alternative label: Lämplighetstest, psykologiska test (122) @sv
alternative label: Prestation, psykologiska test (122) @sv
alternative label: Prov, psykologi (122) @sv
alternative label: Psykodiagnostik (122) @sv
alternative label: Psykologi, experimentell psykologi (122) @sv
alternative label: Psykologiska laboratorier (122) @sv
alternative label: Psykologiska test (122) @sv
alternative label: Psykometrik (122) @sv
alternative label: Test, psykologiska test (122) @sv
alternative label: Underprestation, psykologiska test (122) @sv
broader: URN:NBN:fi:au:hklj:120
in scheme: URN:NBN:fi:au:hklj:
notation: 122
preferred label: Experimental psychology. Psychometry @en
preferred label: Experimentell psykologi. Psykometrik @sv
related: Ajattelu. Älykkyys. Mielikuvitus
related: Oppimisen psykologia
related: Psykologian suunnat
related: Perinnöllisyyspsykologia
related: Typologia. Karakterologia
related: Differentiaalipsykologia. Persoonallisuuden psykologia
related: Psychology of expression {@en
related: Muita psykologian aloja
related: Sovellettu psykologia
related: Kasvatuspsykologia
scope note: Tähän psykologiset kokeet ja testit, niiden selostukset ja tulkintaohjeet yleensä Psykometriikka yleensä Psykologian erikoisalojen kokeellinen tutkimus ja mittausmenetelmät alan mukaisessa luokassa
scope note: Hit psykologiska experiment och test samt beskrivningar och tolkningsanvisningar till dem i allmänhet Psykometrik i allmänhet Experimentell forskning och mätmetoder inom psykologiska specialområden klassificeras enligt område @sv

Sovellettu psykologia
type: Class
type: Concept
subclass of: URN:NBN:fi:au:hklj:120
alternative label: Alisuoriutuminen, työn psykologia (129)
alternative label: Ammatillinen identiteetti (129)
alternative label: Ammatillinen tausta, työn psykologia (129)
alternative label: Ammatinvalinnan psykologia (129)
alternative label: Ammatti-identiteetti (129)
alternative label: Ammattitausta, työn psykologia (129)
alternative label: Ammattiura, työn psykologia (129)
alternative label: Anomia, työelämä (129)
alternative label: Arvostus, työn psykologia (129)
alternative label: Bonukset, työn psykologia (129)
alternative label: Ekologinen psykologia (129)
alternative label: Ekopsykologia (129)
alternative label: Epätyypillinen työ, työn psykologia (129)
alternative label: Etätyö, työn psykologia (129)
alternative label: Freelance-työntekijät, työn psykologia (129)
alternative label: Hajautettu työ, työn psykologia (129)
alternative label: Henkinen työ, työn psykologia (129)
alternative label: Ilmapiiri, työssä viihtyminen (129)
alternative label: Inhimilliset tekijät, organisaatiopsykologia (129)
alternative label: Inhimilliset tekijät, organisaatiososiologia (129)
alternative label: Inhimilliset tekijät, työn psykologia (129)
alternative label: Itsensä johtaminen, työn psykologia (129)
alternative label: Itsenäinen työskentely, työn psykologia (129)
alternative label: Itseohjautuvuus, työn psykologia (129)
alternative label: Joustotyö, työn psykologia (129)
alternative label: Kannustimet, työn psykologia (129)
alternative label: Kannustus, työn psykologia (129)
alternative label: Kunnioittaminen, työn psykologia (129)
alternative label: Kunnioitus, työn psykologia (129)
alternative label: Kutsumus, työn psykologia (129)
alternative label: Luovat menetelmät, työnohjaus, psykologia (129)
alternative label: Lähityö, työn psykologia (129)
alternative label: Motivaatio, työn psykologia (129)
alternative label: Motivaatioilmasto, työn psykologia (129)
alternative label: Motivaatiopsykologia, työn psykologia (129)
alternative label: Motivointi, työn psykologia (129)
alternative label: Muutosvalmius, työn psykologia (129)
alternative label: Muutosvastarinta, työn psykologia (129)
alternative label: Organisaatiokäyttäytyminen, psykologia (129)
alternative label: Organisaatiopsykologia (129)
alternative label: Organisaatiot, organisaatiopsykologia (129)
alternative label: Parityöskentely, työn psykologia (129)
alternative label: Psykologia, työn psykologia (129)
alternative label: Psykologiset tekijät, työn psykologia (129)
alternative label: Psykososiaaliset tekijät, työn psykologia (129)
alternative label: Psykotekniikka (129)
alternative label: Pyrkimykset, työn psykologia (129)
alternative label: Sitoutuminen, työn psykologia (129)
alternative label: Sivutyö, työn psykologia (129)
alternative label: Soveltava psykologia (129)
alternative label: Suojatyö, työn psykologia (129)
alternative label: Suorituskyky, työn psykologia (129)
alternative label: Suoritusmotivaatio, työn psykologia (129)
alternative label: Suoriutuminen, työn psykologia (129)
alternative label: Tavoitteet, työn psykologia (129)
alternative label: Teletyö, työn psykologia (129)
alternative label: Teollisuuspsykologia (129)
alternative label: Tiimityö, työn psykologia (129)
alternative label: Toiminnalliset menetelmät, työnohjaus, psykologia (129)
alternative label: Tukityö, työn psykologia (129)
alternative label: Tyytymättömyys, työtyytyväisyys (129)
alternative label: Tyytyväisyys, työtyytyväisyys (129)
alternative label: Työ, työn psykologia (129)
broader: URN:NBN:fi:au:hklj:120
in scheme: URN:NBN:fi:au:hklj:
notation: 129
related: Kokeellinen psykologia. Psykometriikka
related: Muita psykologian aloja
related: Ammatinvalinta
related: Työn sosiologia
related: Työ sosiaalipoliittisena kysymyksenä
related: Työolot
related: URN:NBN:fi:au:hklj:618.8
related: Johtamisen tekniikka ja menetelmät
related: Henkilöstöpolitiikka
scope note: Sovelletun psykologian ja psykotekniikan yleisteokset Työn, ammattien ja ammatinvalinnan psykologia Työssä viihtyminen. Työmotivaatio Työnohjauksen psykologia Ympäristöpsykologia Psykologian ja psykotekniikan sovellukset eri aloille alan mukaisessa luokassa
scope note: Allmänna verk som rör tillämpad psykologi och psykoteknik Arbets- och yrkespsykologi. Yrkesvalets psykologi Trivsel i arbetet. Arbetsmotivation Yrkesvägledningens psykologi Miljöpsykologi Tillämpningar av psykologi och psykoteknik på olika områden klassificeras enligt område @sv

Tietoteorian historia ja suunnat
type: Class
type: Concept
subclass of: TIETOTEORIA. TIETO-OPPI
alternative label: Absolutismi, tietoteoria (148)
alternative label: Agnostisismi, tietoteoria (148)
alternative label: Empirismi, tietoteoria (148)
alternative label: Epistemologia (148)
alternative label: Epäily, skeptisismi, tietoteoria (148)
alternative label: Fallibilismi, tietoteoria (148)
alternative label: Fenomenalismi, tietoteoria (148)
alternative label: Fenomenologia, tietoteoria (148)
alternative label: Fysikalismi, tietoteoria (148)
alternative label: Hermeneutiikka, tietoteoria (148)
alternative label: Heuristiikka, tietoteoria (148)
alternative label: Holismi, tietoteoria (148)
alternative label: Holistisuus, tietoteoria (148)
alternative label: Ilmiöt, fenomenalismi (148)
alternative label: Indeterminismi, tietoteoria (148)
alternative label: Instrumentalismi (148)
alternative label: Intuitionismi, tietoteoria (148)
alternative label: Irrationalismi, filosofia, tietoteoria (148)
alternative label: Kokonaisvaltaisuus, tietoteoria (148)
alternative label: Konseptualismi (148)
alternative label: Konventionalismi, tietoteoria (148)
alternative label: Kriittinen filosofia, tietoteoria (148)
alternative label: Kritisismi, tietoteoria (148)
alternative label: Looginen empirismi, tietoteoria (148)
alternative label: Looginen positivismi, tietoteoria (148)
alternative label: Nominalismi, tietoteoria (148)
alternative label: Operationalismi (148)
alternative label: Positivismi, tietoteoria (148)
alternative label: Pragmatismi, tietoteoria (148)
alternative label: Pyrrhonilainen skeptisismi, tietoteoria (148)
alternative label: Pyrrhonismi, tietoteoria (148)
alternative label: Rationaalisuus, rationalismi (148)
alternative label: Rationalismi, tietoteoria (148)
alternative label: Reduktionismi, tietoteoria (148)
alternative label: Relativismi, tietoteoria (148)
alternative label: Skeptikot, tietoteoria (148)
alternative label: Skeptisismi (148)
alternative label: Skeptisismi, tietoteoria (148)
alternative label: Skientismi, tietoteoria (148)
alternative label: Strukturalismi, tietoteoria (148)
alternative label: Subjekti, tietoteoria (148)
alternative label: Subjektivismi, tietoteoria (148)
alternative label: Uuspositivismi, tietoteoria (148)
alternative label: Variaatioteoria, tietoteoria (148)
alternative label: Absolutism, kunskapsteori (148) @sv
alternative label: Agnosticism, kunskapsteori (148) @sv
alternative label: Empirism, kunskapsteori (148) @sv
alternative label: Epistemologi (148) @sv
alternative label: Fallibilism, kunskapsteori (148) @sv
alternative label: Fenomen, fenomenalism (148) @sv
alternative label: Fenomenalism, kunskapsteori (148) @sv
alternative label: Fenomenologi, kunskapsteori (148) @sv
alternative label: Fysikalism, kunskapsteori (148) @sv
alternative label: Helhetsbetoning, kunskapsteori (148) @sv
alternative label: Helhetsorientering, kunskapsteori (148) @sv
alternative label: Hermeneutik, kunskapsteori (148) @sv
alternative label: Heuristik, kunskapsteori (148) @sv
alternative label: Holism, kunskapsteori (148) @sv
alternative label: Indeterminism, kunskapsteori (148) @sv
alternative label: Instrumentalism (148) @sv
alternative label: Intuitionism, kunskapsteori (148) @sv
alternative label: Irrationalism, filosofi, kunskapsteori (148) @sv
broader: TIETOTEORIA. TIETO-OPPI
in scheme: URN:NBN:fi:au:hklj:
notation: 148
related: Filosofian historia
related: Itämainen filosofia
related: Vanhan ajan filosofia
related: Keskiajan filosofia
related: Renessanssin ja uuden ajan filosofia
related: Uusimman ajan filosofia
related: Nykyajan filosofia
related: Suomi
related: URN:NBN:fi:au:hklj:115
related: Tieteenhistoria. Oppihistoria
scope note: Tietoteorian suunnat, kuten agnostisismi, irrationalismi, fenomenologia, rationalismi, empirismi, kritisismi, dogmatismi, skeptisismi, positivismi, pragmatismi, strukturalismi, realismi ja subjektivismi sekä niiden historia
scope note: Riktningar inom kunskapsteorin, såsom agnosticism, irrationalism, fenomenologi, rationalism, empirism, kriticism, dogmatism, skepticism, positivism, pragmatism, strukturalism, realism och subjektivism samt deras historia @sv

Kasvatusneuvonta. Kasvatusneuvolat
type: Class
type: Concept
subclass of: Käytännön kasvatus
alternative label: Esimurrosikä, kasvatusneuvonta (181.4)
alternative label: Esipuberteetti, kasvatusneuvonta (181.4)
alternative label: Kasvatus, kasvatusneuvonta (181.4)
alternative label: Kasvatusala, kasvatusneuvonta (181.4)
alternative label: Kasvatusneuvolat (181.4)
alternative label: Kasvatusneuvonta (181.4)
alternative label: Kasvatusneuvonta, kasvatusneuvonta ja kasvatusneuvolat (181.4)
alternative label: Kasvatusoppaat, kasvatusneuvonta (181.4)
alternative label: Käyttäytymishäiriöt, kasvatusneuvonta (181.4)
alternative label: Käytännöllinen kasvatus, kasvatusneuvonta (181.4)
alternative label: Käytöshäiriöt, kasvatusneuvonta (181.4)
alternative label: Lastenkasvatus, kasvatusneuvonta (181.4)
alternative label: Leikki-ikäiset, kasvatusneuvonta (181.4)
alternative label: Murrosikä, kasvatusneuvonta (181.4)
alternative label: Murrosikäiset, kasvatusneuvonta (181.4)
alternative label: Neuvolat, kasvatusneuvolat (181.4)
alternative label: Nuoriso-ongelmat, kasvatusneuvonta (181.4)
alternative label: Nuorisopoliklinikat, kasvatusneuvolat (181.4)
alternative label: Ongelmalapset, kasvatusneuvonta (181.4)
alternative label: Ongelmanuoret, kasvatusneuvonta (181.4)
alternative label: Puberteetti, kasvatusneuvonta (181.4)
alternative label: Vanhempainkasvatus, kasvatusneuvonta (181.4)
alternative label: Barn i lekåldern, uppfostringsrådgivning (181.4) @sv
alternative label: Barnuppfostran, uppfostringsrådgivning (181.4) @sv
alternative label: Beteenderubbningar, uppfostringsrådgivning (181.4) @sv
alternative label: Beteendestörningar, uppfostringsrådgivning (181.4) @sv
alternative label: Fostran, uppfostringsrådgivning (181.4) @sv
alternative label: Förpubertet, uppfostringsrådgivning (181.4) @sv
alternative label: Föräldrafostran, uppfostringsrådgivning (181.4) @sv
alternative label: Handledningar i uppfostringsfrågor, uppfostringsrådgivning (181.4) @sv
alternative label: Praktisk fostran, uppfostringsrådgivning (181.4) @sv
alternative label: Problembarn, uppfostringsrådgivning (181.4) @sv
alternative label: Problemungdomar, uppfostringsrådgivning (181.4) @sv
alternative label: Pubertet, uppfostringsrådgivning (181.4) @sv
alternative label: Pubertetsungdomar, uppfostringsrådgivning (181.4) @sv
alternative label: Pubertetålder, uppfostringsrådgivning (181.4) @sv
alternative label: Rådgivningsbyråer, uppfostringsrådgivningsbyråer (181.4) @sv
alternative label: Tidig pubertet, uppfostringsrådgivning (181.4) @sv
alternative label: Ungdomspolikliniker, uppfostringsrådgivningsbyråer (181.4) @sv
alternative label: Ungdomsproblem, uppfostringsrådgivning (181.4) @sv
alternative label: Uppfostringsrådgivning (181.4) @sv
alternative label: Uppfostringsrådgivning, uppfostringsrådgivning och Uppfostringsrådgivningsbyråer (181.4) @sv
alternative label: Uppfostringsrådgivningsbyråer (181.4) @sv
broader: Käytännön kasvatus
in scheme: URN:NBN:fi:au:hklj:
notation: 181.4
preferred label: Advice on upbringing @en
preferred label: Uppfostringsråd. Uppfostringsrådgivning @sv
related: Kasvatusfilosofia. Kasvatustavoitteet
related: Kasvatuspsykologia
related: Perhe- ja kotikasvatus
related: URN:NBN:fi:au:hklj:181.7
related: URN:NBN:fi:au:hklj:182
related: URN:NBN:fi:au:hklj:183.5
related: URN:NBN:fi:au:hklj:183.7
related: Kristillinen etiikka
related: Perhepolitiikka. Lapsipolitiikka. Nuorisopolitiikka
related: Lastenhoito

Liikuntavammaiset
type: Class
type: Concept
subclass of: URN:NBN:fi:au:hklj:181.9
alternative label: Liikuntaesteiset, opetus ja koulut (181.94)
alternative label: Liikuntarajoitteiset, opetus ja koulut (181.94)
alternative label: Liikuntavammaiset, opetus ja koulut (181.94)
alternative label: Selkäydinvammaiset, opetus (181.94)
alternative label: Tuki- ja liikuntaelinvammaiset, opetus ja koulut (181.94)
alternative label: Ortopediskt handikappade, utbildning och skolor (181.94) @sv
alternative label: Ryggmärgshandikappade, undervisning (181.94) @sv
alternative label: Rörelsebegränsade, undervisning och skolor (181.94) @sv
alternative label: Rörelsehandikappade, undervisning och skolor (181.94) @sv
alternative label: Rörelsehindrade, undervisning och skolor (181.94) @sv
broader: URN:NBN:fi:au:hklj:181.9
in scheme: URN:NBN:fi:au:hklj:
notation: 181.94
preferred label: The physically-impaired @en
preferred label: Rörelsehindrade @sv
related: Kasvatusfilosofia. Kasvatustavoitteet
related: Kasvatuspsykologia
related: URN:NBN:fi:au:hklj:181.7
related: URN:NBN:fi:au:hklj:182
related: Peruskoulut
related: URN:NBN:fi:au:hklj:183.5
related: URN:NBN:fi:au:hklj:183.7
related: URN:NBN:fi:au:hklj:373
related: Liikuntaelimet. Liikuntaelinten taudit
related: Lapsi- ja nuorisopsykiatria
scope note: Liikuntavammaisten erityisopetus. Liikuntavammaisten koulut. Invalidikoulut
scope note: Specialundervisning för rörelsehindrade. Skolor för rörelsehindrade. Invalidskolor @sv

Kehitysvammaiset
type: Class
type: Concept
subclass of: URN:NBN:fi:au:hklj:181.9
alternative label: Aivovammaiset, kehitysvammaisten opetus (181.95)
alternative label: CP-vammaiset, erityisopetus (181.95)
alternative label: Cornelia de Langen oireyhtymä, erityisopetus (181.95)
alternative label: Downin oireyhtymä, erityisopetus (181.95)
alternative label: Erityishuolto (181.95)
alternative label: Erityishuolto, kehitysvammaisten opetus (181.95)
alternative label: Helppolukuiset kirjat, kehitysvammaisten opetus (181.95)
alternative label: Hoitopedagogiikka (181.95)
alternative label: Hoitopedagogiikka, kehitysvammaisten opetus (181.95)
alternative label: Hoitopedagogiikka, kehitysvammatyö (181.95)
alternative label: Kehitysvammahuolto (181.95)
alternative label: Kehitysvammahuolto, kehitysvammaisten opetus (181.95)
alternative label: Kehitysvammaiset, kehitysvammaisten koulut (181.95)
alternative label: Kehitysvammaiset, kehitysvammaisten opetus (181.95)
alternative label: Kehitysvammatyö (181.95)
alternative label: Kehitysvammatyö, kehitysvammaisten opetus (181.95)
alternative label: Lääkintäpedagogia (181.95)
alternative label: Lääkintäpedagogia, kehitysvammaisten opetus (181.95)
alternative label: Lääkintäpedagogia, kehitysvammatyö (181.95)
alternative label: Lääkintäpedagogiikka (181.95)
alternative label: Lääkintäpedagogiikka, kehitysvammaisten opetus (181.95)
alternative label: Lääkintäpedagogiikka, kehitysvammatyö (181.95)
alternative label: MBD-oireyhtymä, erityisopetus (181.95)
alternative label: Minimal brain dysfunction, erityisopetus (181.95)
alternative label: Mongoloidit, kehitysvammaisten opetus (181.95)
alternative label: Selkokirjat, kehitysvammaisten opetus (181.95)
alternative label: Selkolehdet, kehitysvammaisten opetus (181.95)
alternative label: Vajaamieliset, kehitysvammaisten koulut (181.95)
alternative label: Vajaamieliset, kehitysvammaisten opetus (181.95)
alternative label: Älyllisesti kehitysvammaiset, kehitysvammaisten koulut (181.95)
alternative label: Älyllisesti kehitysvammaiset, kehitysvammaisten opetus (181.95)
alternative label: Arbete med utvecklingsstörda (181.95) @sv
alternative label: Arbete med utvecklingsstörda, undervisning av utvecklings-störda (181.95) @sv
alternative label: CP-skadade, specialundervisning (181.95) @sv
alternative label: De Langes syndrom, specialundervisning (181.95) @sv
alternative label: Downs syndrom, specialundervisning (181.95) @sv
alternative label: Förståndshandikappade, skolor för utvecklingshämmade (181.95) @sv
alternative label: Förståndshandikappade, undervisning av utvecklingshämmade (181.95) @sv
alternative label: Hjärnskadade, undervisning av utvecklingsstörda (181.95) @sv
alternative label: Läkepedagogik (181.95) @sv
alternative label: Läkepedagogik, arbete med utvecklingsstörda (181.95) @sv
alternative label: Läkepedagogik, undervisning av utvecklings-störda (181.95) @sv
alternative label: Lättlästa böcker, helppolukuiset kirjat, unervisning av utvecklingsstörda (181.95) @sv
alternative label: Lättlästa böcker, selkokirjat, undervisning av utvecklingsstörda (181.95) @sv
alternative label: Lättlästa tidningar, undervisning av utvecklingsstörda (181.95) @sv
alternative label: MBD-syndrom, specialundervisning (181.95) @sv
alternative label: Minimal brain dysfunction, specialundervisning (181.95) @sv
alternative label: Mongoloider, undervisning av utvecklings-störda (181.95) @sv
alternative label: Specialvård (181.95) @sv
alternative label: Specialvård, undervisning av utvecklingsstörda (181.95) @sv
alternative label: Utvecklingshämmade, skolor för utvecklingshämmade (181.95) @sv
alternative label: Utvecklingshämmade, undervisning av utvecklingshämmade (181.95) @sv
alternative label: Vård av utvecklingsstörda (181.95) @sv
alternative label: Vård av utvecklingsstörda, undervisning av utvecklingsstörda (181.95) @sv
alternative label: Vårdpedagogik (181.95) @sv
alternative label: Vårdpedagogik, arbete med utvecklingsstörda (181.95) @sv
alternative label: Vårdpedagogik, undervisning av utvecklings-störda (181.95) @sv
broader: URN:NBN:fi:au:hklj:181.9
in scheme: URN:NBN:fi:au:hklj:
notation: 181.95
preferred label: The mentally-impaired @en
preferred label: Utvecklingsstörda @sv
related: Kasvatusfilosofia. Kasvatustavoitteet
related: Kasvatuspsykologia
related: URN:NBN:fi:au:hklj:181.7
related: URN:NBN:fi:au:hklj:182
related: Peruskoulut
related: URN:NBN:fi:au:hklj:183.5
related: URN:NBN:fi:au:hklj:183.7
related: URN:NBN:fi:au:hklj:373
related: URN:NBN:fi:au:hklj:617.2
related: Lapsi- ja nuorisopsykiatria
scope note: Kehitysvammaisten erityisopetus. Kehitysvammaisten koulut Jos teos koskee sekä kehitysvammaisten opetusta että huoltoa, on etusija luokalla 181.95
scope note: Specialundervisning för utvecklingsstörda. Skolor för utvecklingsstörda Om verket rör både undervisning och vård av utvecklingsstörda ges företräde åt klass 181.95 @sv

Ammatinvalinta
type: Class
type: Concept
subclass of: KASVATUS. OPETUS. KASVATUSTIEDE
alternative label: Ammatillinen sijoittuminen, ammatinvalinta (187)
alternative label: Ammatinvaihto, ammatinvalinta (187)
alternative label: Ammatinvalinnanohjaus (187)
alternative label: Ammatinvalinta (187)
alternative label: Ammatit, ammatinvalinta (187)
alternative label: Ammattiryhmät, ammatinvalinta (187)
alternative label: Elämänhallinta, ammatinvalinta (187)
alternative label: Henkinen työ, ammatinvalinta (187)
alternative label: Kutsumus, ammatinvalinta (187)
alternative label: Palveluala, ammatinvalinta (187)
alternative label: Palveluammatit, ammatinvalinta (187)
alternative label: Professiot, ammatinvalinta (187)
alternative label: Ruumiillinen työ, ammatinvalinta (187)
alternative label: Soveltuvuus, ammatinvalinta (187)
alternative label: Soveltuvuuskokeet, ammatinvalinta (187)
alternative label: Soveltuvuustestit, ammatinvalinta (187)
alternative label: Tehdastyö , ammatinvalinta (187)
alternative label: Teollisuusammatit, ammatinvalinta (187)
alternative label: Teollisuustyö, ammatinvalinta (187)
alternative label: Testit, ammatinvalinta (187)
alternative label: Uranvaihto (187)
alternative label: Uranvalinta (187)
alternative label: Urasuunnittelu (187)
alternative label: Ylioppilaat, ammatinvalinta (187)
alternative label: Fabriksarbete, yrkesval (187) @sv
alternative label: Industriarbete, yrkesval (187) @sv
alternative label: Industriella yrken, yrkesval (187) @sv
alternative label: Intellektuellt arbete, yrkesval (187) @sv
alternative label: Kall, yrkesval (187) @sv
alternative label: Karriärplanering (187) @sv
alternative label: Karriärval (187) @sv
alternative label: Kroppsarbete, yrkesval (187) @sv
alternative label: Livskontroll, yrkesval (187) @sv
alternative label: Lämplighet, yrkesval (187) @sv
alternative label: Lämplighetstest, yrkesval (187) @sv
alternative label: Professioner, yrkesval (187) @sv
alternative label: Servicebranschen, yrkesval (187) @sv
alternative label: Serviceyrken, yrkesval (187) @sv
alternative label: Studenter, yrkesval (187) @sv
alternative label: Test, yrkesval (187) @sv
alternative label: Yrken, yrkesval (187) @sv
alternative label: Yrkesbyte, yrkesval (187) @sv
alternative label: Yrkesgrupper, yrkesval (187) @sv
alternative label: Yrkesplacering, yrkesval (187) @sv
alternative label: Yrkesval (187) @sv
alternative label: Yrkesvägledning (187) @sv
broader: KASVATUS. OPETUS. KASVATUSTIEDE
in scheme: URN:NBN:fi:au:hklj:
notation: 187
preferred label: Career choice @en
preferred label: Yrkesval @sv
related: Sovellettu psykologia
related: URN:NBN:fi:au:hklj:181.7
related: URN:NBN:fi:au:hklj:182
related: URN:NBN:fi:au:hklj:183.5
related: Keskiasteen koulutus
related: URN:NBN:fi:au:hklj:183.7
related: URN:NBN:fi:au:hklj:185
related: Nuorisotyö
related: Asiakirjakaavat ja -ohjeet. Oikeusoppaat
related: Työllisyys. Työttömyys. Työvoimapalvelu
scope note: Eri alojen ja ammattien ammatinvalintaoppaat Eri koulujen tarjoama ammatinvalinnanohjaus Ammatinvalinnanohjaajan työ
scope note: Vägledningar i yrkesval för olika områden och yrken Yrkesvägledning i olika skolor Yrkesvägledarens arbete @sv

Itsekasvatus. Itseopiskelu
type: Class
type: Concept
subclass of: KASVATUS. OPETUS. KASVATUSTIEDE
broader: KASVATUS. OPETUS. KASVATUSTIEDE
in scheme: URN:NBN:fi:au:hklj:
narrower: Elämänohjeet
narrower: URN:NBN:fi:au:hklj:188.4
notation: 188
preferred label: Self-development. Self-education @en
preferred label: Självuppfostran. Självstudier @sv
related: Filosofian historia
related: URN:NBN:fi:au:hklj:181.7
related: URN:NBN:fi:au:hklj:182
related: URN:NBN:fi:au:hklj:183.5
related: URN:NBN:fi:au:hklj:183.7
scope note: Teokset, jotka koskevat sekä itsekasvatusta että itseopiskelua tai opiskelutekniikkaa
scope note: Verk som rör både självuppfostran och självstudier eller studieteknik @sv

Parapsykologia
type: Class
type: Concept
subclass of: RAJATIETO
alternative label: Ajatuksensiirto (191)
alternative label: Ajatusten lukeminen (191)
alternative label: Clairaudience (191)
alternative label: Clairvoyance (191)
alternative label: ESP-ilmiöt (191)
alternative label: Ennaltanäkö (191)
alternative label: Paranormaalit ilmiöt, parapsykologia (191)
alternative label: Parapsykologia (191)
alternative label: Psykokineesi (191)
alternative label: Psykokinesia (191)
alternative label: Rajatieto, parapsykologia (191)
alternative label: Selittämättömät ilmiöt, parapsykologia (191)
alternative label: Selväkuuloisuus (191)
alternative label: Selvänäkö (191)
alternative label: Telekinesia (191)
alternative label: Telepatia (191)
alternative label: Äänien kuuleminen, parapsykologia (191)
alternative label: ESP-fenomen (191) @sv
alternative label: Hörselvillor, parapsykologi (191) @sv
alternative label: Kläraudians (191) @sv
alternative label: Klärvoajans (191) @sv
alternative label: Oförklarliga fenomen, parapsykologi (191) @sv
alternative label: Omstridda fenomen, parapsykologi (191) @sv
alternative label: Paranormala fenomen, parapsykologi (191) @sv
alternative label: Parapsykologi (191) @sv
alternative label: Psykokinesi (191) @sv
alternative label: Synskhet (191) @sv
alternative label: Tankeläsning (191) @sv
alternative label: Tankeöverföring (191) @sv
alternative label: Telekinesi (191) @sv
alternative label: Telepati (191) @sv
broader: RAJATIETO
in scheme: URN:NBN:fi:au:hklj:
notation: 191
preferred label: Parapsychology @en
preferred label: Parapsykologi @sv
related: URN:NBN:fi:au:hklj:120
related: Havaintopsykologia
related: Tiedostamaton sielunelämä
related: Uni
related: Alitajunta
related: Hypnoosi. Suggestio
related: URN:NBN:fi:au:hklj:192
related: Astrologia. Horoskoopit
related: Unikirjat
related: Kuolemakokemukset
scope note: Paranormaalit psyykkiset ja psykofyysiset ilmiöt, joille ei ole tieteellisesti hyväksyttävää selitystä Ilman aisteja tapahtuva havaitseminen (ESP). Selvänäkö eli clairvoyance. Selväkuuloisuus eli clairaudience. Ajatuksensiirto eli telepatia. Parakinesia. Telekinesia Parapsykologisten ilmiöiden tieteellinen tutkimus
scope note: Paranormala psykiska och psykofysiska fenomen som inte kan förklaras vetenskapligt Utomsinnlig varseblivning (ESP). Klärvoajans. Clairaudience. Telepati. Parakinesi. Telekinesi Vetenskapliga undersökningar av parapsykologiska fenomen @sv

Yhteiskuntatieteiden historia
type: Class
type: Concept
subclass of: URN:NBN:fi:au:hklj:300
broader: URN:NBN:fi:au:hklj:300
in scheme: URN:NBN:fi:au:hklj:
notation: 309
preferred label: History of the social sciences @en
preferred label: Samhällsvetenskapernas historia @sv
related: Tieteenhistoria. Oppihistoria
related: URN:NBN:fi:au:hklj:909
related: Vanhan ajan historia
related: Keskiajan historia 400-1499
related: Uuden ajan historia 1500-1788
related: Uusimman ajan historia 1789-1913
related: Nykyajan historia 1914-1938
related: I maailmansodan historia 1914-1918
related: Nykyajan historia 1939-
related: II maailmansodan historia 1939-1945
scope note: Yhteiskuntatieteiden yleinen historia Eri yhteiskuntatieteiden historia alan mukaisessa luokassa
scope note: Samhällsvetenskapernas allmänna historia Olika samhällsvetenskapers historia klassificeras enligt område @sv

Juutalaisten asema. Antisemitismi
type: Class
type: Concept
subclass of: URN:NBN:fi:au:hklj:323
alternative label: Antisemitismi (323.2)
alternative label: Diskriminointi, juutalaiset (323.2)
alternative label: Etniset suhteet, juutalaisvastaisuus (323.2)
alternative label: Etnosentrismi, rasismi (323.1 ... 323.2)
alternative label: Joukkotuho, juutalaisvainot (323.2)
alternative label: Juutalaiset, antisemitismi (323.2)
alternative label: Rasismi, antisemitismi (323.2)
alternative label: Syrjintä, juutalaiset (323.2)
alternative label: Uskonvainot, juutalaisvainot (323.2)
alternative label: Vainot, juutalaisvainot (323.2)
alternative label: Antisemitism (323.2) @sv
alternative label: Diskrimination, judar (323.2) @sv
alternative label: Diskriminering, judar (323.2) @sv
alternative label: Etniska relationer, antisemitism (323.2) @sv
alternative label: Etnocentrism, rasism (323.1 ... 323.2) @sv
alternative label: Förföljelser, judeförföljelser (323.2) @sv
alternative label: Judar, antisemitism (323.2) @sv
alternative label: Massförstörelse, judeförföljelser (323.2) @sv
alternative label: Rasism, antisemitism (323.2) @sv
alternative label: Religiösa förföljelser, judeförföljelser (323.2) @sv
broader: URN:NBN:fi:au:hklj:323
in scheme: URN:NBN:fi:au:hklj:
notation: 323.2
preferred label: Status of the Jews. Anti-Semitism @en
preferred label: Judarnas ställning. Antisemitism @sv
related: Juutalaisten uskonto ja sen mytologia
related: Valtiofilosofia. Valtiomuodot
related: URN:NBN:fi:au:hklj:323.209
related: URN:NBN:fi:au:hklj:332.1
related: URN:NBN:fi:au:hklj:357.1
related: URN:NBN:fi:au:hklj:384
related: Sotien yhteiskunnalliset vaikutukset
related: Taiteen estetiikka. Taidefilosofia. Taidepsykologia. Taidesosiologia. Taidepolitiikka
related: Israelin ja Palestiinan historia
scope note: Juutalaisen väestöryhmän asema eri maissa Juutalaisvainot ja antisemitismi eri maissa Tässä myös juutalaisia ja juutalaisuutta koskevat yleisteokset
scope note: Den judiska befolkningsgruppens ställning i olika länder Judeförföljelser och antisemitism i olika länder Hit också allmänna verk som rör judar och judendom @sv

Muiden maanosien valtioiden keskinäinen yhteistyö
type: Class
type: Concept
subclass of: Kansainvälinen yhteistyö
alternative label: OAU (326.3)
alternative label: Organization of African Unity (326.3)
alternative label: Pan-Aasia, yhteistyö (326.3)
alternative label: Pan-Amerikka, yhteistyö (326.3)
alternative label: Pan-Amerika, samarbete (326.3) @sv
alternative label: Pan-Asien, samarbete (326.3) @sv
broader: Kansainvälinen yhteistyö
in scheme: URN:NBN:fi:au:hklj:
notation: 326.3
preferred label: Cooperation between States in other continents @en
preferred label: Samarbete mellan stater i andra världsdelar @sv
related: URN:NBN:fi:au:hklj:060
related: URN:NBN:fi:au:hklj:325
related: Suomen ulkopolitiikka
related: URN:NBN:fi:au:hklj:326.2
related: Kansainväliset taloudelliset suhteet. Maailmantalous
related: Suomen ulkomaankauppa
related: Maailmankauppa. Kansainväliset talousjärjestöt
related: Monikansalliset yritykset
related: Kehitysmaiden taloudelliset olot
scope note: Jos teos koskee sekä kansainvälistä politiikkaa että muuta kansainvälistä yhteisyötä, on etusija luokalla 326.3 Yhteistyön erikoisaloja koskevat teokset alan mukaisessa luokassa
scope note: Om verket handlar om både internationell politik och annat internationellt samarbete, ges företräde åt klass 326.3 Verk som rör specialområden för samarbete klassificeras enligt område @sv

Kiinteistöt. Tontit
type: Class
type: Concept
subclass of: URN:NBN:fi:au:hklj:360
alternative label: Asunto-osakeyhtiöt, isännöitsijän tehtävät (365)
alternative label: Halkominen, tontit, tonttipolitiikka (365)
alternative label: Huoltokirjat, kiinteistönpito (365)
alternative label: Isännöinti (365)
alternative label: Isännöitsijäntodistukset, kiinteistönpito (365)
alternative label: Isännöitsijät, isännöitsijän työ (365)
alternative label: Jakotoimitus, tontit, tonttipolitiikka (365)
alternative label: Kansallistaminen, kiinteistöt, tontit (365)
alternative label: Keinottelu, kiinteistöt, tontit (365)
alternative label: Kiinteistö- ja mittaustoimi, kiinteistötoimi (365)
alternative label: Kiinteistöala (365)
alternative label: Kiinteistöarviointi (365)
alternative label: Kiinteistöjohtaminen (365)
alternative label: Kiinteistökauppa (365)
alternative label: Kiinteistökauppa, kiinteistöpolitiikka (365)
alternative label: Kiinteistönarviointi (365)
alternative label: Kiinteistönhoito (365)
alternative label: Kiinteistönhoito, isännöitsijän tehtävät (365)
alternative label: Kiinteistönhoitoyritykset (365)
alternative label: Kiinteistönkauppa (365)
alternative label: Kiinteistönkauppa, kiinteistöpolitiikka (365)
alternative label: Kiinteistönpito (365)
alternative label: Kiinteistönvälitys (365)
alternative label: Kiinteistöosakeyhtiöt (365)
alternative label: Kiinteistöpalvelut (365)
alternative label: Kiinteistöpalvelut, isännöitsijän tehtävät (365)
alternative label: Kiinteistörahastot (365)
alternative label: Kiinteistörekisterit (365)
alternative label: Kiinteistöt (365)
alternative label: Lohkominen, tontit, tonttipolitiikka (365)
alternative label: Maakauppa, kiinteistöt, tontit (365)
alternative label: Maanarviointi (365)
alternative label: Maanarvo (365)
alternative label: Maanhankinta (365)
alternative label: Maanhinta (365)
alternative label: Maanomistajat, tontti- ja kiinteistöpolitiikka (365)
alternative label: Maanomistus, tontti- ja kiinteistöpolitiikka (365)
alternative label: Omaisuus, kiinteistöt, tontit (365)
alternative label: Omistajat, kiinteistöt ja tontit (365)
alternative label: Sijoittajat, kiinteistöt (365)
alternative label: Sijoittajat, tontit (365)
alternative label: Sijoitukset, kiinteistöt (365)
alternative label: Sijoitukset, tontit (365)
alternative label: Sijoitustoiminta, kiinteistöt (365)
alternative label: Sijoitustoiminta, tontit (365)
alternative label: Talot, kiinteistöt, tontit (365)
alternative label: Taloyhtiöt, isännöitsijän tehtävät (365)
alternative label: Tilapalvelut, kiinteistönhoitoyritykset (365)
alternative label: Toimitilajohtaminen (365)
alternative label: Toimitilapalvelut, kiinteistönhoitoyritykse (365)
alternative label: Tontit (365)
alternative label: Tontit, tonttikauppa (365)
alternative label: Tontit, tonttipolitiikka (365)
alternative label: Tonttijako (365)
alternative label: Vuokratalot, kiinteistöt, tontit (365)
alternative label: Yksityismaat, maanomistus, tontti- ja kiinteistöpolitiikka (365)
alternative label: Bildstormning, protestantiska samfund (365) @sv
alternative label: Bostadsaktiebolag, disponentens uppgihter (365) @sv
alternative label: Bostadshusbolag, disponentens uppgifter (365) @sv
alternative label: Disponenter, disponentens arbete (365) @sv
alternative label: Disponentintyg, fastighetshantering (365) @sv
alternative label: Disponentskap (365) @sv
alternative label: Egendom, fastigheter, tomter (365) @sv
broader: URN:NBN:fi:au:hklj:360
in scheme: URN:NBN:fi:au:hklj:
notation: 365
related: Asemakaava- ja rakentamislainsäädäntö
related: Esine- ja velvoiteoikeus. Immateriaalioikeudet. Huoneen- ja maanvuokralainsäädäntö
related: Maaoikeus
related: Pääoma. Työ. Luonnonvarat
related: Maapolitiikka
related: Asuntopolitiikka
related: Rakennuksen kunnossapito
related: KOTITALOUS. LAITOSTALOUS. KAUNEUDENHOITO
related: URN:NBN:fi:au:hklj:721
scope note: Kiinteistö- ja tonttipolitiikka Kiinteistöjen ja tonttien kauppa ja hoito Kiinteistöjen ja tonttien arviointi, arvo, arvonnousu, tuotto ja kannattavuus Kiinteistöjen ja tonttien omistussuhteet Kiinteistöjen ja tonttien kansallistaminen, yksityistäminen ja pakkolunastus Tässä myös isännöitsijän tehtävät
scope note: Fastighets- och tomtpolitik Fastighets- och tomtaffärer samt skötseln av fastigheter och tomter Värdering av fastigheter och tomter och deras värde, värdestegring, avkastning och lönsamhet Ägandeförhållanden i fråga om fastigheter och tomter Nationalisering, privatisering och tvångsinlösning av fastigheter och tomter Hit också disponentens uppgifter @sv

Päihdepolitiikka. Päihdehuolto
type: Class
type: Concept
subclass of: URN:NBN:fi:au:hklj:371
alternative label: Ehkäisevä päihdetyö (371.7 +)
alternative label: Ennaltaehkäisevä päihdetyö (371.7 +)
alternative label: Hoitoonohjaus, päihteiden käyttäjät (371.7 +)
alternative label: Huoltolaitokset, päihdehuoltolaitokset (371.7 +)
alternative label: Häiriökäyttäytyminen, hoitoonohjaus (371.7 +)
alternative label: Häiriökäyttäytyminen, päihdeongelmat, sosiaaliset (371.7 +)
alternative label: Itsetuho, päihteet (371.7 +)
alternative label: Itsetuhoisuus, päihteet (371.7 +)
alternative label: Kontrollipolitiikka, päihdepolitiikka (371.7 +)
alternative label: Lopetus, päihteiden käyttö, sosiaalityö (371.7 +)
alternative label: Päihdehuolto (371.7 +)
alternative label: Päihdekulttuuri, päihdeongelmat (371.7 +)
alternative label: Päihdeongelmaiset, sosiaalipolitiikka (371.7 +)
alternative label: Päihdeongelmat, sosiaalipolitiikka (371.7 +)
alternative label: Päihdepolitiikka (371.7 +)
alternative label: Päihdetyö (371.7 +)
alternative label: Päihteet, sosiaalipolitiikka (371.7 +)
alternative label: Riskikäyttäytyminen, päihteiden käyttö, sosiaaliset ongelmat (371.7 +)
alternative label: Riskit, päihteiden käyttö, sosiaaliset ongelmat (371.7 +)
alternative label: Riskitekijät, päihteiden käyttö, sosiaaliset ongelmat (371.7 +)
alternative label: Vaaratekijät, päihteiden käyttö, sosiaaliset ongelmat (371.7 +)
alternative label: Väärinkäyttö, päihteet, sosiaaliala (371.7 +)
alternative label: Ympäristötekijät, päihteiden käyttö (371.7 +)
alternative label: Drogkultur, rusmedelsproblem (371.7 +) @sv
alternative label: Förebyggande missbruksarbete (371.7 +) @sv
alternative label: Kontrollpolitik, rusmedelspolitik (371.7 +) @sv
alternative label: Miljöfaktorer, bruk av rusmedel (371.7 +) @sv
alternative label: Missbruk, rusmedel, socialsektorn (371.7 +) @sv
alternative label: Missbrukare, socialpolitik (371.7 +) @sv
alternative label: Missbrukarvård (371.7 +) @sv
alternative label: Missbruksarbete (371.7 +) @sv
alternative label: Risker, användning av rusmedel, sociala problem (371.7 +) @sv
alternative label: Riskfaktorer, användning av rusmedel, sociala problem (371.7 +) @sv
alternative label: Riskmoment, användning av rusmedel, sociala problem (371.7 +) @sv
alternative label: Risktagande, användning av rusmedel, sociala problem (371.7 +) @sv
alternative label: Rusmedel, socialpolitik (371.7 +) @sv
alternative label: Rusmedelspolitik (371.7 +) @sv
alternative label: Rusmedelsproblem, socialpolitik (371.7 +) @sv
alternative label: Självdestruktion, rusmedel (371.7 +) @sv
alternative label: Självdestruktivitet, rusmedel (371.7 +) @sv
alternative label: Slutande, bruk av rusmedel, socialarbete (371.7 +) @sv
alternative label: Störande beteende, missbruksproblem, sociala (371.7 +) @sv
alternative label: Störande beteende, vårdhänvisning (371.7 +) @sv
alternative label: Vårdanstalter, missbrukarvårdsanstalter (371.7 +) @sv
alternative label: Vårdhänvisning, brukare av rusmedel (371.7 +) @sv
broader: URN:NBN:fi:au:hklj:371
in scheme: URN:NBN:fi:au:hklj:
narrower: Alkoholipolitiikka
narrower: Huumausainepolitiikka
notation: 371.7
preferred label: Alcohol and narcotics policy. Care of abusers @en
preferred label: Alkohol- och narkotikapolitik. Missbrukarvård @sv
related: URN:NBN:fi:au:hklj:332.2
related: Työoikeus
related: Työmarkkinajärjestöt
related: Terveydenhoito
related: Henkilökohtainen terveydenhoito
related: URN:NBN:fi:au:hklj:618.3
scope note: Tässä ja alaluokissa päihteiden käyttö ja käyttäjät sosiaaliselta ja sosiaalipoliittiselta kannalta Jos teos koskee päihteitä sekä sosiaaliselta että lääketieteelliseltä kannalta, on etusija luokalla 371.7+
scope note: Hit och till underklasserna användning av rusmedel samt alkohol- och narkotikamissbrukare ur social och socialpolitisk synvinkel Om arbetet behandlar rusmedel ur både social och medicinsk synvinkel ges företräde åt klass 371.7+ @sv

Vakuutustoimi
type: Class
type: Concept
subclass of: URN:NBN:fi:au:hklj:370
alternative label: Avohoito, sosiaalinen huolto (371 ... 373)
alternative label: Avohuolto (371 ... 373)
alternative label: Avokuntoutus, sosiaalinen huolto (371 ... 373)
alternative label: Avustuskassat (372 +)
alternative label: Deprivaatio, sosiaalipolitiikka (371 ... 373)
alternative label: Edunsaajat, sosiaalietuudet (371 ... 373)
alternative label: Ehkäisevä sosiaalipolitiikka (371 ... 373)
alternative label: Ehkäisevä sosiaalityö (371 ... 373)
alternative label: Ekokatastrofit, vakuutustoimi (372)
alternative label: Elämänpolitiikka, sosiaalipolitiikka (371 ... 373)
alternative label: Empowerment, sosiaalipalvelut (371 ... 373)
alternative label: Ennaltaehkäisevä sosiaalipolitiikka (371 ... 373)
alternative label: Ennaltaehkäisevä sosiaalityö (371 ... 373)
alternative label: Erityisryhmät, sosiaalipolitiikka (371 ... 373)
alternative label: Esinevakuutukset (372)
alternative label: Henkilövahingot, vakuutus (372 +)
alternative label: Henkilövakuutus (372)
alternative label: Henkivakuutus (372)
alternative label: Hoitoala, sosiaalinen hoitotyö (371 ... 373)
alternative label: Hoitojonot, sosiaalipalvelut (371 ... 373)
alternative label: Hoitomaksut, sosiaalipalvelut (371 ... 373)
alternative label: Hoitopaikat, sosiaalipalvelut (371 ... 373)
alternative label: Hoitotakuu, sosiaalipolitiikka (371 ... 373)
alternative label: Hoitoympäristö, sosiaalitoimi (371 ... 373)
alternative label: Huolenpito, sosiaalipalvelut (371 ... 373)
alternative label: Huono-osaisuus, sosiaalipolitiikka (371 ... 373)
alternative label: Hyvinvointipalvelut, sosiaalipolitiikka (371 ... 373)
alternative label: Infrastruktuurit, sosiaalipolitiikka (371 ... 373)
alternative label: Jonot, sosiaalipalvelut (371 ... 373)
alternative label: Jälkihuolto, sosiaalihuolto (371 ... 373)
alternative label: Jälleenvakuutus (372)
alternative label: Kannustinloukut, sosiaalietuudet (371 ... 373)
alternative label: Kansainvälinen sosiaalipolitiikka (371 ... 373)
alternative label: Kansainvälinen vakuutustoiminta (372 +)
alternative label: Karenssi, työttömyysturva (372 +)
alternative label: Karenssi, vakuutukset (372 +)
alternative label: Keskeytysvakuutus (372)
alternative label: Keskinäiset yhtiöt (372 +)
alternative label: Kesäleirit, sosiaalipalvelut (371 ... 373)
alternative label: Kohderyhmät, sosiaalipolitiikka (371 ... 373)
alternative label: Kontrollipolitiikka, sosiaalipolitiikka (371 ... 373)
alternative label: Korvausvastuu, vakuutustoimi (372 +)
alternative label: Kotivakuutus (372)
alternative label: Kriisipalvelut, sosiaalipalvelut (371 ... 373)
alternative label: Kriisityö, sosiaalipalvelut (371 ... 373)
alternative label: Kroonikot, sosiaalipolitiikka (371 ... 373)
alternative label: Kuljetusvakuutukset (372)
alternative label: Kunnallinen sosiaalitoimi (371 ... 373)
alternative label: Käyttö, sosiaalipalvelut (371 ... 373)
alternative label: Käyttötutkimus, sosiaalipalvelut (371 ... 373)
alternative label: Köyhtyminen, sosiaalipolitiikka (371 ... 373)
alternative label: Köyhyys, sosiaalipolitiikka (371 ... 373)
alternative label: Köyhät, sosiaalipolitiikka (371 ... 373)
alternative label: Laitospalvelut, sosiaalipolitiikka (371 ... 373)
alternative label: Liikennevahingot, liikennevakuutukset (372)
alternative label: Liikennevakuutus (372)
alternative label: Luottovakuutukset (372)
alternative label: Marginaaliryhmät, sosiaalipolitiikka (371 ... 373)
alternative label: Matemaattiset menetelmät, vakuutusmatematiikka (372)
alternative label: Matematiikka, vakuutusmatematiikka (372)
alternative label: Matkavakuutus (372)
alternative label: Merivakuutus (372)
alternative label: Moniogelmaisuus, sosiaalityö (371 ... 373)
broader: URN:NBN:fi:au:hklj:370
in scheme: URN:NBN:fi:au:hklj:
narrower: Sosiaalivakuutus
notation: 372
related: Kauppaoikeus. Yhtiölainsäädäntö. Pankki- ja vakuutuslainsäädäntö
related: Palo- ja pelastustoimi
related: URN:NBN:fi:au:hklj:345
related: SOSIOLOGIA
related: Osuustoiminta
related: URN:NBN:fi:au:hklj:371
related: MATEMATIIKKA
related: Matematiikan muut alat
scope note: Vakuutusmatematiikka. Vakuutusehdot Vakuutuslaitokset ja -yhtiöt sekä niiden liiketoiminta Palovakuutukset. Kotivakuutukset. Varkausvakuutukset. Henkivakuutukset. Henkilövakuutukset. Luottovakuutukset. Matkavakuutukset. Liikennevakuutukset. Kuljetusvakuutukset Kansainvälinen vakuutustoiminta
scope note: Försäkringsmatematik. Försäkringsvillkor Försäkringsinrättningar, försäkringsbolag samt deras affärsverksamhet Brandförsäkringar. Hemförsäkringar. Stöldförsäkringar. Livförsäkringar. Personförsäkringar. Kreditförsäkringar. Reseförsäkringar. Trafikförsäkringar. Transportförsäkringar Internationell försäkringsverksamhet @sv

Sosialismi. Kommunismi
type: Class
type: Concept
subclass of: Yhteiskunnalliset aatesuunnat. Poliittiset ideologiat
alternative label: Antikommunismi, kommunismin kritiikki (374.1)
alternative label: Bolsevismi, yhteiskunnalliset aatteet (374.1)
alternative label: Dialektinen materialismi, poliittiset ideologiat (374.1)
alternative label: Eurokommunismi, poliittiset ideologiat (374.1)
alternative label: Historiallinen materialismi, poliittiset ideologiat (374.1)
alternative label: Internationaalit, kommunismi (374.1)
alternative label: Internationaalit, sosialismi (374.1)
alternative label: Jälkikommunismi, ideologia (374.1)
alternative label: Jälkisosialismi, ideologia (374.1)
alternative label: Kansandemokratia, poliittinen ideologia (374.1)
alternative label: Kansankommuunit, poliittiset ideologiat (374.1)
alternative label: Kollektivisointi, poliittiset ideologiat (374.1)
alternative label: Kommunismi, ideologia (374.1)
alternative label: Kristillinen sosialismi, ideologia (374.1)
alternative label: Leninismi, poliittinen ideologia (374.1)
alternative label: Luokkataistelu, kommunismin ideologia (374.1)
alternative label: Maolaisuus (374.1)
alternative label: Marksilaisuus, poliittiset ideologiat (374.1)
alternative label: Marksismi, poliittiset ideologiat (374.1)
alternative label: Marksismi-leninismi, poliittiset ideologiat (374.1)
alternative label: Marxismi, poliittiset ideologiat (374.1)
alternative label: Marxismi-leninismi, poliittiset ideologiat (374.1)
alternative label: Materialismi, poliittiset ideologiat (374.1)
alternative label: Materialistinen historiankäsitys, poliittiset ideologiat (374.1)
alternative label: Postkommunismi, ideologia (374.1)
alternative label: Revisionismi (374.1)
alternative label: Sosiaalidemokratia (374.1)
alternative label: Sosialismi, poliittinen ideologia (374.1)
alternative label: Stalinismi, kommunismin ideologia (374.1)
alternative label: Uusvasemmisto, ideologiat (374.1)
alternative label: Valtiososialismi (374.1)
alternative label: Vasemmistolaisuus (374.1)
alternative label: Vasemmistolaisuus, kommunismi (374.1)
alternative label: Vasemmistolaisuus, sosialismi (374.1)
alternative label: Vasemmistoliikkeet (374.1)
alternative label: Vasemmistoliikkeet, kommunismi (374.1)
alternative label: Vasemmistoliikkeet, sosialismi (374.1)
alternative label: Antikommunism, kritik av kommunismen (374.1) @sv
alternative label: Bolsjevism, samhälleliga idéer (374.1) @sv
alternative label: Dialektisk materialism, politiska ideologier (374.1) @sv
alternative label: Eurokommunism, politiska ideologier (374.1) @sv
alternative label: Folkdemokrati, politisk ideologi (374.1) @sv
alternative label: Folkkommuner, politiska ideologier (374.1) @sv
alternative label: Historiematerialism, politiska ideologier (374.1) @sv
alternative label: Historisk materialism, politiska ideologier (374.1) @sv
alternative label: Internationaler, kommunism (374.1) @sv
alternative label: Internationaler, socialism (374.1) @sv
alternative label: Klasskamp, kommunismens ideologi (374.1) @sv
alternative label: Kollektivisering, politiska ideologier (374.1) @sv
alternative label: Kommunism, ideologi (374.1) @sv
alternative label: Kristen socialism, ideologi (374.1) @sv
alternative label: Leninism, politisk ideologi (374.1) @sv
alternative label: Maoism (374.1) @sv
alternative label: Marksism, politiska ideologier (374.1) @sv
alternative label: Marksism-leninism, politiska ideologier (374.1) @sv
alternative label: Marxism, politiska ideologier (374.1) @sv
alternative label: Marxism-leninism, politiska ideologier (374.1) @sv
alternative label: Materialism, politiska ideologier (374.1) @sv
alternative label: Materialistisk historieuppfattning, politiska ideologier (374.1) @sv
alternative label: Nyvänster, ideologier (374.1) @sv
alternative label: Postkommunism, ideologi (374.1) @sv
alternative label: Postsocialism, ideologi (374.1) @sv
broader: Yhteiskunnalliset aatesuunnat. Poliittiset ideologiat
in scheme: URN:NBN:fi:au:hklj:
notation: 374.1
related: Uusimman ajan filosofia
related: Nykyajan filosofia
related: URN:NBN:fi:au:hklj:320
related: Valtiofilosofia. Valtiomuodot
related: Sisäpolitiikka. Puolueet
related: Suomi
related: Yhteiskuntafilosofia
related: Talousjärjestelmät
related: URN:NBN:fi:au:hklj:371
related: Työväenliike
scope note: Sosialismin, sosiaalidemokratian ja kommunismin eri suuntaukset Marxismi, leninismi, stalinismi, maolaisuus, trotskilaisuus ja revisionismi poliittisina ideologioina Vasemmistolaisuus yleensä
scope note: Olika riktningar inom socialismen, socialdemokratin och kommunismen Marxism, leninism, stalinism, maoism, trotskism och revisionism som politiska ideologier Vänsterorientering i allmänhet @sv

Ranska
type: Class
type: Concept
subclass of: EUROOPPA
alternative label: Andorra (415)
alternative label: Andorra, maantiede, matkat (415)
alternative label: Bretagne (415)
alternative label: Bretagne, maantiede, matkat (415)
alternative label: Keski-Eurooppa, Ranska (415 +)
alternative label: Korsika (415)
alternative label: Korsika, maantiede, matkat (415)
alternative label: Monaco (415)
alternative label: Monaco, maantiede, matkat (415)
alternative label: Ranska (415 +)
alternative label: Ranska, maantiede, matkat (415 +)
alternative label: Ranskan liittokunta (415 +)
alternative label: Ranskan liittokunta, maantiede, matkat (415 +)
alternative label: Riviera, Ranska (415)
alternative label: Andorra, geografi, resor (415) @sv
alternative label: Bretagne, geografi, resor (415) @sv
alternative label: Frankrike (415 +) @sv
alternative label: Frankrike, geografi, resor (415 +) @sv
alternative label: Franska samväldet (415 +) @sv
alternative label: Franska samväldet, geografi, resor (415 +) @sv
alternative label: Korsika, geografi, resor (415) @sv
alternative label: Mellaneuropa, Frankrike (415 +) @sv
alternative label: Monaco, geografi, resor (415) @sv
alternative label: Riviera, Frankrike (415) @sv
broader: EUROOPPA
in scheme: URN:NBN:fi:au:hklj:
narrower: Pariisi
notation: 415
preferred label: France @en
preferred label: Frankrike @sv
related: Keski-Eurooppa
related: Etelä-Eurooppa
related: Pyreneiden niemimaa
related: URN:NBN:fi:au:hklj:460
related: RANSKAN HISTORIA
related: Muiden Keski-Euroopan maiden historia
scope note: Tässä myös Andorra ja Monaco Ranskan merentakaiset alueet maantieteellisen sijaintinsa mukaisessa luokassa
scope note: Hit också Andorra och Monaco Frankrikes utomeuropeiska områden klassificeras enligt geografisk position @sv

Etelä-Amerikka
type: Class
type: Concept
subclass of: AMERIKKA
alternative label: Amerikkalaiset, eteläamerikkalaiset (447)
alternative label: Amerikkalaiset, latinalaisamerikkalaiset (447)
alternative label: Andit (447)
alternative label: Andit, maantiede, matkat (447)
alternative label: Bolivia (447)
alternative label: Bolivia, maantiede, matkat (447)
alternative label: Chile (447)
alternative label: Chile, maantiede, matkat (447)
alternative label: Ecuador (447)
alternative label: Ecuador, maantiede, matkat (447)
alternative label: Etelä-Amerikka (447)
alternative label: Etelä-Amerikka, maantiede, matkat (447)
alternative label: Eteläamerikkalaiset (447)
alternative label: Eteläamerikkalaiset, maantiede, matkat (447)
alternative label: Guayana (447)
alternative label: Guayana, maantiede, matkat (447)
alternative label: Guyana (447)
alternative label: Guyana, maantiede, matkat (447)
alternative label: Inkat, Etelä-Amerikka (447)
alternative label: Kolumbia (447)
alternative label: Kolumbia, maantiede, matkat (447)
alternative label: Latinalainen Amerikka (447)
alternative label: Latinalainen Amerikka, Etelä-Amerikka (447 ... 449)
alternative label: Latinalainen Amerikka, maantiede, matkat (447)
alternative label: Paraguay (447)
alternative label: Paraguay, maantiede, matkat (447)
alternative label: Peru (447)
alternative label: Peru, maantiede, matkat (447)
alternative label: Suriname (447)
alternative label: Suriname, maantiede, matkat (447)
alternative label: Tulimaa, Chile (447)
alternative label: Uruguay (447)
alternative label: Uruguay, maantiede, matkat (447)
alternative label: Venezuela (447)
alternative label: Venezuela, maantiede, matkat (447)
alternative label: Amerikaner, latinamerikaner (447) @sv
alternative label: Amerikaner, sydamerikaner (447) @sv
alternative label: Anderna (447) @sv
alternative label: Anderna, geografi, resor (447) @sv
alternative label: Bolivia, geografi, resor (447) @sv
alternative label: Chile, geografi, resor (447) @sv
alternative label: Colombia (447) @sv
alternative label: Colombia, geografi, resor (447) @sv
alternative label: Ecuador, geografi, resor (447) @sv
alternative label: Eldslandet, Chile (447) @sv
alternative label: Guayana, geografi, resor (447) @sv
alternative label: Guyana, geografi, resor (447) @sv
alternative label: Inkaindianer, Sydamerika (447) @sv
alternative label: Latinamerika (447) @sv
alternative label: Latinamerika, Sydamerika (447 ... 449) @sv
alternative label: Latinamerika, geografi, resor (447) @sv
alternative label: Paraguay, geografi, resor (447) @sv
alternative label: Peru, geografi, resor (447) @sv
alternative label: Suriname, geografi, resor (447) @sv
alternative label: Sydamerika (447) @sv
alternative label: Sydamerika, geografi, resor (447) @sv
alternative label: Sydamerikaner (447) @sv
alternative label: Sydamerikaner, geografi, resor (447) @sv
alternative label: Uruguay, geografi, resor (447) @sv
alternative label: Venezuela, geografi, resor (447) @sv
broader: AMERIKKA
in scheme: URN:NBN:fi:au:hklj:
notation: 447
preferred label: South America @en
preferred label: Sydamerika @sv
related: Meksiko
related: Keski-Amerikka
related: Karibianmeren saaret
related: Brasilia
related: Argentiina
related: Etelä-Amerikan historia
scope note: Etelä-Amerikkaa koskevat yleisteokset Latinalaista Amerikkaa koskevat yleisteokset Bolivia. Chile. Ecuador. Guyana. Kolumbia. Paraguay. Peru. Ranskan Guayana. Surinam. Uruguay. Venezuela
scope note: Allmänna verk som rör Sydamerika Allmänna verk som rör Latinamerika Bolivia. Chile. Colombia. Ecuador. Franska Guayana. Guyana Paraguay. Peru. Surinam. Uruguay. Venezuela @sv

Maailmankaikkeus. Kosmologia. Kosmogonia
type: Class
type: Concept
subclass of: TÄHTITIEDE
alternative label: Aikakoneet, kosmologia (521)
alternative label: Aikamatkat, kosmologia (521)
alternative label: Alkuaineet, synty (521)
alternative label: Alkuräjähdys (521)
alternative label: Astrofysiikka (521)
alternative label: Astrokemia (521)
alternative label: Astronomia, kosmologia (521)
alternative label: Avaruus, kosmologia (521)
alternative label: Avaruussäteily (521)
alternative label: Etäisyys, maailmankaikkeuden rakenne (521)
alternative label: Gravitaatio, kosmologia (521)
alternative label: Gravitaatioaallot, kosmologia (521)
alternative label: Kosminen inflaatio, alkuräjähdys (521)
alternative label: Kosminen säteily (521)
alternative label: Kosminen taustasäteily (521)
alternative label: Kosmogonia (521)
alternative label: Kosmografia (521)
alternative label: Kosmologia, tähtitiede (521)
alternative label: Kvasaarit (521)
alternative label: Luonnonsäteily, kosminen taustasäteily (521)
alternative label: Maailmankaikkeuden synty (521)
alternative label: Maailmankaikkeus, kosmologia (521)
alternative label: Maailmanloppu, maailmankaikkeus (521)
alternative label: Multiversumi (521)
alternative label: Mustat aukot (521)
alternative label: Painovoima, kosmologia (521)
alternative label: Pimeä aine (521)
alternative label: Pimeä energia (521)
alternative label: Säteily, kosminen (521)
alternative label: Taustasäteily (521)
alternative label: Terminen taustasäteily (521)
alternative label: Tähtienvälinen aine (521)
alternative label: Tähtienvälinen avaruus (521)
alternative label: Tähtitiede, kosmologia (521)
alternative label: Universumi, kosmologia (521)
alternative label: Vetovoima, kosmologia (521)
alternative label: Äärettömyys, kosmologia (521)
alternative label: Astrofysik (521) @sv
alternative label: Astrokemi (521) @sv
alternative label: Astronomi, kosmologi (521) @sv
alternative label: Avstånd, världsalltets struktur (521) @sv
alternative label: Bakgrundsstrålning (521) @sv
alternative label: Big bang (521) @sv
alternative label: Dragningskraft, kosmologi (521) @sv
alternative label: Gravitation, kosmologi (521) @sv
alternative label: Gravitationsvågor, kosmologi (521) @sv
alternative label: Grundämnen, uppkomst (521) @sv
alternative label: Interstellär materia (521) @sv
alternative label: Interstellär rymd (521) @sv
alternative label: Kosmisk bakgrundsstrålning (521) @sv
alternative label: Kosmisk inflation, Big bang (521) @sv
alternative label: Kosmisk strålning (521) @sv
alternative label: Kosmogoni (521) @sv
alternative label: Kosmografi (521) @sv
alternative label: Kosmologi, astronomi (521) @sv
alternative label: Kvasarer (521) @sv
alternative label: Multiversum (521) @sv
alternative label: Mörk energi (521) @sv
alternative label: Mörk materia (521) @sv
alternative label: Naturlig strålning, kosmisk bakgrundsstrålning (521) @sv
alternative label: Oändlighet, kosmologi (521) @sv
alternative label: Rymden, kosmologi (521) @sv
broader: TÄHTITIEDE
in scheme: URN:NBN:fi:au:hklj:
notation: 521
related: URN:NBN:fi:au:hklj:110
related: Astrologia. Horoskoopit
related: Elämä maailmankaikkeudessa. Astrobiologia
related: Tähtijärjestelmät. Aurinkokunnat
related: FYSIIKKA
related: Yleinen ja teoreettinen fysiikka
related: Suhteellisuusteoria
related: Ydinfysiikka. Atomifysiikka. Molekyylifysiikka
related: Kvanttiteoria. Kvanttimekaniikka
related: KEMIA
scope note: Maailmankaikkeuden alkuperä, rakenne ja kehitys Alkuräjähdysteoria. Pysyvän tilan teoria Alkuaineiden alkuperä ja muodostuminen Materia. Antimateria. Kosmiset säteet. Mustat aukot Astrokemia. Astrofysiikka
scope note: Världsalltets uppkomst, uppbyggnad och utveckling Big Bang-teorin. Steady State-teorin Grundämnenas ursprung och bildning Materia. Antimateria. Kosmisk strålning. Svarta hål Astrokemi. Astrofysik @sv

Elämä maailmankaikkeudessa. Astrobiologia
type: Class
type: Concept
subclass of: TÄHTITIEDE
alternative label: Astrobiologia (523)
alternative label: Astronomia, elämä maailmankaikkeudessa (523)
alternative label: Eksobiologia (523)
alternative label: Ekstraterrestiaalinen elämä, elämä avaruudessa, SETI (523)
alternative label: Ekstraterrestinen elämä, elämä avaruudessa, SETI (523)
alternative label: Elämä maailmankaikkeudessa (523)
alternative label: Elämä, elämä maailmankaikkeudessa (523)
alternative label: Maan ulkopuolinen elämä, elämä avaruudessa, SETI (523)
alternative label: Maapallon ulkopuolinen elämä , elämä avaruudessa, SETI (523)
alternative label: SETI-tutkimus (523)
alternative label: Tähtitiede, elämä maailmankaikkeudessa (523)
alternative label: Vieraat sivilisaatiot, elämä avaruudessa, SETI (523)
alternative label: Astrobiologi (523) @sv
alternative label: Astronomi, livet i världsalltet (523) @sv
alternative label: Exobiologi (523) @sv
alternative label: Främmande civilisationer, liv i rymden, SETI (523) @sv
alternative label: Livet i världsalltet (523) @sv
alternative label: Livet, livet i världsalltet (523) @sv
alternative label: SETI-forskning (523) @sv
alternative label: Stellarastronomi, livet i världsalltet (523) @sv
alternative label: Utomjordiskt liv, liv i rymden, SETI (523) @sv
broader: TÄHTITIEDE
in scheme: URN:NBN:fi:au:hklj:
notation: 523
preferred label: Life in the Universe. Astrobiology @en
preferred label: Liv i världsalltet. Astrobiologi @sv
related: URN:NBN:fi:au:hklj:110
related: Astrologia. Horoskoopit
related: Maailmankaikkeus. Kosmologia. Kosmogonia
related: Tähtijärjestelmät. Aurinkokunnat
related: Ufot. Ilmakehän tunnistamattomat ilmiöt
related: BIOLOGIA
related: Biologian filosofia
related: Kehitysoppi. Evoluutio
related: Kadonneet mantereet. Maapallon ulkopuolisten kulttuurien vaikutus muinaishistoriaan
scope note: Elämä maapallon ulkopuolella
scope note: Utomjordiskt liv @sv

Kokeellinen fysiikka
type: Class
type: Concept
subclass of: FYSIIKKA
alternative label: Fysiikka, kokeellinen fysiikka (532)
alternative label: Fysikaalinen mittaustekniikka (532)
alternative label: Kokeellinen fysiikka (532)
alternative label: Kokeet, fysiikka (532)
alternative label: Laboratoriokokeet, fysiikka (532)
alternative label: Laboratoriot, fysiikka (532)
alternative label: Laboratoriotekniikka, fysiikka (532)
alternative label: Laboratoriotutkimus, fysiikka (532)
alternative label: Laboratoriotyöt, fysiikka (532)
alternative label: Laboratoriovälineet, fysiikka (532)
alternative label: Experimentell fysik (532) @sv
alternative label: Fysik, experimentell fysik (532) @sv
alternative label: Fysikalisk mätteknik (532) @sv
alternative label: Laboratoriearbeten, fysik (532) @sv
alternative label: Laboratorieprov, fysik (532) @sv
alternative label: Laboratorier, fysik (532) @sv
alternative label: Laboratorieteknik, fysik (532) @sv
alternative label: Laboratorieundersökning, fysik (532) @sv
alternative label: Laboratorieutrustning, fysik (532) @sv
alternative label: Prov, fysik (532) @sv
broader: FYSIIKKA
in scheme: URN:NBN:fi:au:hklj:
notation: 532
preferred label: Experimental physics @en
preferred label: Experimentell fysik @sv
related: Fysiikka harrasteena ja ajanvietteenä
related: Yleinen ja teoreettinen fysiikka
related: Suhteellisuusteoria
related: Ydinfysiikka. Atomifysiikka. Molekyylifysiikka
related: Kvanttiteoria. Kvanttimekaniikka
related: Aineoppi. Aineenkoetus
related: URN:NBN:fi:au:hklj:681
related: Kelloteollisuus
related: Optiset ja lääketieteelliset laitteet
related: Toimistokoneet
scope note: Kokeellisen fysiikan yleisteokset Mittaukset, kojeet ja laboratoriotekniikka yleensä Tiettyyn fysiikan alaan liittyvät kokeet, mittaukset ja laboratoriotekniikka alan mukaisessa luokassa
scope note: Allmänna verk om experimentell fysik Mätningar, instrument och laboratorieteknik i allmänhet Prov, mätningar och laboratorieteknik som rör ett bestämt område inom fysiken klassificeras enligt område @sv

Valo-oppi. Värioppi. Säteilyoppi
type: Class
type: Concept
subclass of: FYSIIKKA
alternative label: 3-ulotteisuus, holografia, fysiikka (536)
alternative label: Aallonpituus, valo-oppi (536)
alternative label: Aaltoliike, valo-oppi (536)
alternative label: Absorptio, valo-oppi (536)
alternative label: Albedo, auringonsäteily (536)
alternative label: Albedo, säteilyfysiikka (536)
alternative label: Auringon säteily, säteilyoppi (536)
alternative label: Auringonsäteily, säteilyoppi (536)
alternative label: Emissio, fysiikka (536)
alternative label: Fluoresenssi (536)
alternative label: Fotoluminesenssi, fysiikka (536)
alternative label: Fotometria (536)
alternative label: Frekvenssit, valo-oppi (536)
alternative label: Fysiikka, valo-oppi (536)
alternative label: Heijastuminen, säteilyoppi (536)
alternative label: Heijastuminen, valo-oppi (536)
alternative label: Holografia, optiikka (536)
alternative label: Hologrammit, optiikka (536)
alternative label: Infrapunasäteily (536)
alternative label: Infrapunatekniikka, fysiikka (536)
alternative label: Infrapunavalo (536)
alternative label: Interferenssi, fysiikka (536)
alternative label: Jaksolliset ilmiöt, valo-oppi (536)
alternative label: Kahtaistaittuminen (536)
alternative label: Kirkkaus, valo-oppi (536)
alternative label: Kolmiulotteisuus, holografia, fysiikka (536)
alternative label: Laserit, fysiikka (536)
alternative label: Lasersäteily (536)
alternative label: Luminesenssi, fysiikka (536)
alternative label: Maserit, fysiikka (536)
alternative label: Mittaus, fotometria (536)
alternative label: Näkyvä valo (536)
alternative label: Optiikka, fysiikka (536)
alternative label: Pimeys, valo-oppi (536)
alternative label: Polarisaatio, valo-oppi (536)
alternative label: Prismat, valo-oppi (536)
alternative label: Radiometria (536)
alternative label: Sironta, valo-oppi (536)
alternative label: Spektrit, valo-oppi (536)
alternative label: Spektrometrit, valo-oppi (536)
alternative label: Säteily, infrapunasäteily (536)
alternative label: Säteily, säteilyoppi (536)
alternative label: Säteily, ultraviolettisäteily (536)
alternative label: Säteilyenergia, säteilyoppi (536)
alternative label: Säteilyfysiikka (536)
alternative label: Taajuus, valo-oppi (536)
alternative label: Taipuminen, valon (536)
alternative label: Taittuminen, valo (536)
alternative label: UV-säteily (536)
alternative label: Ultraviolettisäteily (536)
alternative label: Ultraviolettivalo (536)
alternative label: Valo, fysiikka (536)
alternative label: Valo-oppi, fysiikka (536)
alternative label: Valosähköilmiö (536)
alternative label: Valovoima, valo-oppi (536)
alternative label: Vibraatio, valo-oppi (536)
alternative label: Väriaineet, värioppi (536)
alternative label: Värimetriikka, fysiikka (536)
alternative label: Värioppi, fysiikka (536)
alternative label: Värit, fysiikka (536)
alternative label: Värähtelyt, valo-oppi (536)
alternative label: 3-dimensionalitet, holografi, fysik (536) @sv
alternative label: Absorption, optik (536) @sv
broader: FYSIIKKA
in scheme: URN:NBN:fi:au:hklj:
notation: 536
related: Analyyttinen kemia
related: FYSIKAALINEN KEMIA
related: Eläinfysiologia
related: Silmä. Silmätaudit
related: Sähkövalo
related: Elektroniikka
related: Kemian teollisuus
related: Optiset ja lääketieteelliset laitteet
related: Maalaustaiteen teoria, estetiikka ja filosofia
scope note: Valon teoriat. Optiikka. Näkyvä valo. Infrapuna- ja ultraviolettisäteet Värioppi. Väriasteikot. Värijärjestelmät. Värimetriikka. Spektri Valon eteneminen, heijastuminen, taittuminen, ja taipuminen Absorptio. Emissio. Interferenssi Peilin, prisman ja linssin fysiikka. Polarisaatio. Kahtaistaittuminen Säteilyenergia. Fotometria. Radiometria. Valosähköilmiö. Loistevalo. Luminesenssi. Holografian fysiikka. Laserin ja maserin fysiikka
scope note: Teorier om ljuset. Optik. Synligt ljus. Infraröd och ultraviolett strålning Färglära. Färgskalor. Färgsystem. Färgmetrik. Spektrum Ljusets fortplantning, reflexion och brytning Absorption. Emission. Interferens Spegelns, prismats och linsens fysik. Polarisation. Dubbelbrytning Strålningsenergi. Fotometri. Radiometri. Fotoelektriska fenomen. Luminiscens. Holografins fysik. Laser- och maserfysik @sv

Kasvimaantiede
type: Class
type: Concept
subclass of: KASVITIEDE
alternative label: Alkuperäiset kasvilajit, kasvimaantiede (588)
alternative label: Arkeofyytit, kasvimaantiede (588)
alternative label: Asutuksen seuralaislajit, kasvimaantiede (588)
alternative label: Biogeografia, kasvimaantiede (588)
alternative label: Boreaalinen vyöhyke, kasvimaantiede (588)
alternative label: Eliömaantiede, kasvimaantiede (588)
alternative label: Endeemiset kasvilajit, kasvimaantiede (588)
alternative label: Floora, kasvimaantiede (588)
alternative label: Harjukasvillisuus, kasvimaantiede (588)
alternative label: Havumetsät, kasvimaantiede (588)
alternative label: Hydrofyytit, kasvimaantiede (588)
alternative label: Ihmisen seuralaislajit, kasvimaantiede (588)
alternative label: Kalliokasvillisuus, kasvimaantiede (588)
alternative label: Kasvien levinneisyys (588)
alternative label: Kasvillisuus, kasvimaantiede (588)
alternative label: Kasvillisuustyypit, kasvimaantieteelliset (588)
alternative label: Kasvillisuusvyöhykkeet (588)
alternative label: Kasvimaantiede (588)
alternative label: Kasvisto, kasvimaantiede (588)
alternative label: Kotoperäiset kasvilajit, kasvimaantiede (588)
alternative label: Kulttuurikasvit, kasvimaantiede (588)
alternative label: Kulttuurin seuralaislajit, kasvimaantiede (588)
alternative label: Levinneisyys, kasvimaantiede (588)
alternative label: Leviäminen, kasvimaantiede (588)
alternative label: Luonnonmaantiede, kasvimaantiede (588)
alternative label: Maantiede, kasvimaantiede (588)
alternative label: Mangrovet, kasvimaantiede (588)
alternative label: Metsät, kasvimaantiede (588)
alternative label: Metsävyöhykkeet, kasvimaantiede (588)
alternative label: Muinaistulokkaat , kasvimaantiede (588)
alternative label: Pohjoinen havumetsävyöhyke, kasvimaantiede (588)
alternative label: Puuraja, kasvimaantiede (588)
alternative label: Puusto, kasvimaantiede (588)
alternative label: Ruderaattikasvit, kasvimaantiede (588)
alternative label: Satunnaiskasvit, kasvimaantiede (588)
alternative label: Sekametsät, kasvimaantiede (588)
alternative label: Siitepölyanalyysi, kasvimaantiede (588)
alternative label: Tropiikki, kasvimaantiede (588)
alternative label: Tulokaslajit, kasvimaantiede (588)
alternative label: Tunturikasvillisuus, kasvimaantiede (588)
alternative label: Vesikasvillisuus, kasvimaantiede (588)
alternative label: Vesikasvit, kasvimaantiede (588)
alternative label: Arkeofyter, växtgeografi (588) @sv
alternative label: Barrskogar, växtgeografi (588) @sv
alternative label: Biogeografi, växtgeografi (588) @sv
alternative label: Biologisk geografi, växtgeografi (588) @sv
alternative label: Blandskogar, växtgeografi (588) @sv
alternative label: Boreala zonen, växtgeografi (588) @sv
alternative label: Endemiska växtarter, endeemiset kasvilajit, växtgeografi (588) @sv
alternative label: Endemiska växtarter, kotoperäiset kasvilajit, växtgeografi (588) @sv
alternative label: Fjällvegetation, växtgeografi (588) @sv
alternative label: Flora, växtgeografi (588) @sv
alternative label: Följearter till bostättning, växtgeografi (588) @sv
alternative label: Följearter till kultur, växtgeografi (588) @sv
alternative label: Följearter till människan, växtgeografi (588) @sv
alternative label: Geografi, växtgeografi (588) @sv
alternative label: Hydrofyter, växtgeografi (588) @sv
alternative label: Klippvegetation, växtgeografi (588) @sv
alternative label: Mangrove, växtgeografi (588) @sv
alternative label: Naturgeografi, växtgeografi (588) @sv
alternative label: Norra barrskogsregionen, växtgeografi (588) @sv
alternative label: Nya arter, växtgeografi (588) @sv
broader: KASVITIEDE
in scheme: URN:NBN:fi:au:hklj:
notation: 588
related: URN:NBN:fi:au:hklj:400
related: FYYSINEN MAANTIEDE
related: Ekologia. Eliömaantiede
related: Kasviekologia
related: Systemaattinen kasvitiede
related: Sekovartiset kasvit
related: Sienet
related: Putkilokasvit
related: URN:NBN:fi:au:hklj:588.084
related: Eläinmaantiede
scope note: Kasvimaantieteen yleisteokset. Kasvien levinneisyys yleensä Kasvimaantieteelliset alueet ja niiden kasvillisuus Maantieteelliset kasvillisuusvyöhykkeet Maantieteelliset kasvillisuustyypit Tiettyä kasvilajia tai lajiryhmää koskeva kasvimaantiede ko. kasvin tai kasviryhmän luokassa 587+
scope note: Allmänna verk om växtgeografi. Växternas utbredning i allmänhet Växtgeografiska områden och deras vegetation Geografiska vegetationszoner Geografiska vegetationstyper Växtgeografi för en bestämd växtart eller artgrupp förs enligt art eller artgrupp till klass 587+ @sv

Linnut
type: Class
type: Concept
subclass of: Selkärankaiset
alternative label: Aitokanat, eläintiede (597.92)
alternative label: Albatrossit (597.92)
alternative label: Ampuhaukka (597.92)
alternative label: Avopesijät (597.92)
alternative label: Bongaus, linnut (597.92)
alternative label: Eläinten merkintä, lintujen rengastus (597.92)
alternative label: Eläinten vaellukset, lintujen muutto (597.92)
alternative label: Eläinten äänet, lintujen äänet (597.92)
alternative label: Emut (597.92)
alternative label: Fenologia, lintujen muutto (597.92)
alternative label: Flamingot (597.92)
alternative label: Haapana (597.92)
alternative label: Haarapääsky (597.92)
alternative label: Haikaralinnut (597.92)
alternative label: Haikarat (597.92)
alternative label: Hanhet, eläintiede (597.92)
alternative label: Harjalintu (597.92)
alternative label: Haudonta, lintutiede (597.92)
alternative label: Haukat, eläintiede (597.92)
alternative label: Hautominen, lintutiede (597.92)
alternative label: Heinäkurppa (597.92)
alternative label: Hietakanalinnut (597.92)
alternative label: Hiirolinnut (597.92)
alternative label: Hyönteissyöjät, linnut (597.92)
alternative label: Höyhenpeite (597.92)
alternative label: Joutsenet (597.92)
alternative label: Kahlaajalinnut (597.92)
alternative label: Kahlaajat (597.92)
alternative label: Kalkkunat, eläintiede (597.92)
alternative label: Kana, eläintiede (597.92)
alternative label: Kanalinnut, eläintiede (597.92)
alternative label: Kanat, eläintiede (597.92)
alternative label: Kasuaarilinnut (597.92)
alternative label: Kattohaikara (597.92)
alternative label: Kaukoputket, ornitologia (597.92)
alternative label: Kaulushaikara (597.92)
alternative label: Kehrääjälinnut (597.92)
alternative label: Kertut (597.92)
alternative label: Kiertolinnut (597.92)
alternative label: Kihut (597.92)
alternative label: Kiikarit, ornitologia (597.92)
alternative label: Kiivilinnut (597.92)
alternative label: Kirjekyyhkyt, lintutiede (597.92)
alternative label: Kirskulinnut (597.92)
alternative label: Kiurut (597.92)
alternative label: Kolibrit (597.92)
alternative label: Kolopesijät, linnut (597.92)
alternative label: Kondorit (597.92)
alternative label: Koskelot (597.92)
alternative label: Kotkat (597.92)
alternative label: Kottaraiset (597.92)
alternative label: Kuikat (597.92)
alternative label: Kuikkalinnut (597.92)
alternative label: Kukot, eläintiede (597.92)
alternative label: Kuningaskalastajat (597.92)
alternative label: Kurjet (597.92)
alternative label: Kurkilinnut (597.92)
alternative label: Kurmitsat (597.92)
alternative label: Kurpat (597.92)
alternative label: Kyyhkyt, lintutiede (597.92)
alternative label: Käet (597.92)
alternative label: Käkilinnut (597.92)
broader: Selkärankaiset
in scheme: URN:NBN:fi:au:hklj:
notation: 597.92
related: Luonto-oppaat. Oppikirjat
related: Uhanalaiset lajit. Luonnonsuojelualueet
related: Systemaattinen kasvitiede
related: Eläinmorfologia. Eläinanatomia
related: Eläinfysiologia
related: Eläinekologia
related: Eläinmaantiede
related: Siipikarja
related: Häkkilinnut
related: Optiset ja lääketieteelliset laitteet
scope note: Lintutiede. Ornitologia. Lintuharrastus. Bongaus Lintujen systematiikka ja lajinmääritysoppaat Lintujen morfologia, anatomia, fysiologia, ekologia ja eläinmaantiede Lintujen käyttäytyminen. Lintujen äänet Lintujen lisääntyminen ja pesimäbiologia Lintujen muutto
scope note: Ornitologi. Fåglar som hobby. Fågelskåderi Fåglarnas systematik och handböcker i artbestämning av fåglar Fåglarnas morfologi, anatomi, fysiologi, ekologi och djurgeografi Fåglarnas beteende. Fåglarnas läten Fåglarnas fortplantning och häckningsbiologi Fåglarnas flyttning @sv

Jooga
type: Class
type: Concept
subclass of: Henkilökohtainen terveydenhoito
alternative label: Chakrat, jooga (613.22)
alternative label: Hathajooga (613.22)
alternative label: Henkinen kasvu, jooga (613.22)
alternative label: Ilmajooga (613.22)
alternative label: Jooga (613.22)
alternative label: Meditaatio, jooga (613.22)
alternative label: Mietiskely, jooga (613.22)
alternative label: Retriitit, jooga (613.22)
alternative label: Tantra, jooga (613.22)
alternative label: Tsakrat, jooga (613.22)
alternative label: Aerial yoga (613.22) @sv
alternative label: Andlig tillväxt, yoga (613.22) @sv
alternative label: Chakror, tsakrat, yoga (613.22) @sv
alternative label: Chakror, yoga (613.22) @sv
alternative label: Hathayoga (613.22) @sv
alternative label: Meditation, meditaatio, yoga (613.22) @sv
alternative label: Meditation, mietiskely, yoga (613.22) @sv
alternative label: Retreater, yoga (613.22) @sv
alternative label: Tantra, yoga (613.22) @sv
alternative label: Yoga (613.22) @sv
broader: Henkilökohtainen terveydenhoito
in scheme: URN:NBN:fi:au:hklj:
notation: 613.22
preferred label: Yoga @en
related: Itämainen filosofia
related: URN:NBN:fi:au:hklj:280
related: Intian uskonnot ja mytologiat
related: URN:NBN:fi:au:hklj:332.22
related: URN:NBN:fi:au:hklj:371.6
related: Hoitotiede. Hoitotyö. Hoitohenkilökunta
related: URN:NBN:fi:au:hklj:615
related: URN:NBN:fi:au:hklj:617
related: Itämaisperäiset lajit. Budo
scope note: Jooga yleensä. Joogaa koskevat käytännön oppaat Jooga rentoutuksen, mietiskelyn, henkisen kasvun, terveyden ja liikunnan kannalta
scope note: Yoga i allmänhet. Praktiska handledningar i yoga Yoga ur avslappningens, meditationens, andliga tillväxtens, hälsans och motionens synvinkel @sv

Sähkövalo
type: Class
type: Concept
subclass of: Sähkötekniikka
alternative label: Energialamput, sähkötekniikka (627.2)
alternative label: Energiansäästölamput, sähkötekniikka (627.2)
alternative label: Energiasäästölamput, sähkötekniikka (627.2)
alternative label: Hehkulamput (627.2)
alternative label: Keinovalo, sähkötekniikka (627.2)
alternative label: Lamput, sähkötekniikka (627.2)
alternative label: Loistevalo (627.2)
alternative label: Sisävalaistus, sähkötekniikka (627.2)
alternative label: Sähkölamput, sähkötekniikka (627.2)
alternative label: Sähkövalo, sähkötekniikka (627.2)
alternative label: Ulkovalaistus (627.2)
alternative label: Valaisimet, sähkötekniikka (627.2)
alternative label: Valaistus, sähkötekniikka (627.2)
alternative label: Valaistustekniikka, sähkötekniikka (627.2)
alternative label: Valo, sähkötekniikka (627.2)
alternative label: Valonheittimet (627.2)
alternative label: Valot, sähkövalo (627.2)
alternative label: Belysning, elektroteknik (627.2) @sv
alternative label: Belysningsarmatur, elektroteknik (627.2) @sv
alternative label: Belysningsteknik, elektroteknik (627.2) @sv
alternative label: Elljus, elektroteknik (627.2) @sv
alternative label: Energisparlampor, elektroteknik (627.2) @sv
alternative label: Glödlampor (627.2) @sv
alternative label: Glödlampor, elektroteknik (627.2) @sv
alternative label: Inomhusbelysning, elektroteknik (627.2) @sv
alternative label: Konstljus, elektroteknik (627.2) @sv
alternative label: Lampor, elektroteknik (627.2) @sv
alternative label: Ljus, belysningsarmaturer, elektroteknik (627.2) @sv
alternative label: Ljus, fysik, teknik, elektroteknik (627.2) @sv
alternative label: Luminiscens, teknik (627.2) @sv
alternative label: Lågenergilampor, elektroteknik (627.2) @sv
alternative label: Strålkastare (627.2) @sv
alternative label: Utomhusbelysning (627.2) @sv
broader: Sähkötekniikka
in scheme: URN:NBN:fi:au:hklj:
notation: 627.2
preferred label: Electric light @en
preferred label: Elljus @sv
related: Valo-oppi. Värioppi. Säteilyoppi
related: Sähköoppi. Magnetismi
related: URN:NBN:fi:au:hklj:620.88
related: Tiet. Kadut. Tienrakennus. Kadunrakennus
related: URN:NBN:fi:au:hklj:667.7
related: URN:NBN:fi:au:hklj:667.71
related: URN:NBN:fi:au:hklj:681
related: Toimistokoneet
related: Sisustusoppaat
related: Sisustusarkkitehtuuri
scope note: Sähkövalon ja sähkölamppujen tekniikka. Hehkulamput. Loistevalo Sähkövalon sovellukset eri aloille alan mukaisessa luokassa
scope note: Elljus och ellampor ur teknisk synvinkel. Glödlampor. Lysrörsarmatur Tillämpningar av elljus inom olika områden klassificeras enligt område @sv

Lento-opetus. Lentotaito
type: Class
type: Concept
subclass of: Liikenneopetus. Liikenneturvallisuus
alternative label: Automaattiohjaus , lentoliikenne (677.5)
alternative label: Lennonjohto (677.5)
alternative label: Lento-onnettomuudet, lentoturvallisuus (677.5)
alternative label: Lento-opetus (677.5)
alternative label: Lentoemännät, lentoemännän työ (677.5)
alternative label: Lentoliikenneoppi (677.5)
alternative label: Lentotekniikka, lentokoneen ohjaus (677.5)
alternative label: Lentäjät, lentäjän työ (677.5)
alternative label: Lentäminen, lentokoneen ohjaus (677.5)
alternative label: Liikenneopetus, lento-opetus (677.5)
alternative label: Liikennepsykologia, lentoliikenne (677.5)
alternative label: Liikennesäännöt, lentoliikenne (677.5)
alternative label: Liikenneturvallisuus, lentoliikenne (677.5)
alternative label: Liikennevalvonta, lentoliikenteen turvallisuus (677.5)
alternative label: Liikenteen ammatit, lentoliikenne (677.5)
alternative label: Liikenteenohjaus, lentoliikenne (677.5)
alternative label: Matkustamohenkilöstö, lentoliikenne (677.5)
alternative label: Merkinantolaitteet, lentoliikenne (677.5)
alternative label: Mustat laatikot, lento-onnettomuudet, lentoturvallisuus (677.5)
alternative label: Näkyvyys, lentoliikenne (677.5)
alternative label: Ohjausautomatiikka , lentoliikenne (677.5)
alternative label: Ohjausjärjestelmät, lentoliikenne (677.5)
alternative label: Vaaratilanteet, ilmaliikenteen turvallisuus (677.5)
alternative label: Automatstyrning, flygtrafik (677.5) @sv
alternative label: Faromoment, flygtrafikens säkerhet (677.5) @sv
alternative label: Flygare, flygarens arbete (677.5) @sv
alternative label: Flygledning (677.5) @sv
alternative label: Flygning, styrning av flygplan (677.5) @sv
alternative label: Flygolyckor, flygsäkerhet (677.5) @sv
alternative label: Flygteknik, flygplan, styrning (677.5) @sv
alternative label: Flygtrafiklära (677.5) @sv
alternative label: Flygundervisning (677.5) @sv
alternative label: Flygvärdinnor, flygvärdinnans arbete (677.5) @sv
alternative label: Kabinpersonal, flygtrafik (677.5) @sv
alternative label: Signalsystem, flygtrafik (677.5) @sv
alternative label: Sikt, flygtrafik (677.5) @sv
alternative label: Styrautomatik, flygtrafik (677.5) @sv
alternative label: Styrsystem, flygtrafik (677.5) @sv
alternative label: Svarta lådor, flygolyckor, flygsäkerhet (677.5) @sv
alternative label: Trafikledning, flygtrafik (677.5) @sv
alternative label: Trafikpsykologi, flygtrafik (677.5) @sv
alternative label: Trafikregler, flygtrafik (677.5) @sv
alternative label: Trafiksäkerhet, flygtrafik (677.5) @sv
alternative label: Trafikundervisning, flygundervisning (677.5) @sv
alternative label: Trafikyrken, flygtrafik (677.5) @sv
alternative label: Trafikövervakning, flygtrafikens säkerhet (677.5) @sv
broader: Liikenneopetus. Liikenneturvallisuus
in scheme: URN:NBN:fi:au:hklj:
notation: 677.5
preferred label: Flying instruction. Flight proficiency @en
preferred label: Flygundervisning. Flygfärdighet @sv
related: URN:NBN:fi:au:hklj:332.2
related: Kriminologia. Kriminaalisosiologia
related: URN:NBN:fi:au:hklj:360
related: URN:NBN:fi:au:hklj:363
related: URN:NBN:fi:au:hklj:368
related: Vesi- ja ilmaliikenne
related: Ilmaliikenne. Ilmailu
related: Ilmakulkuneuvot
related: URN:NBN:fi:au:hklj:650.2
related: Lentourheilu
scope note: Lentoliikenneoppi. Lentokoneen ohjaus ja sen opettaminen Ilmaliikenteen säännöt ja liikenneturvallisuus Lennonjohto. Lentoliikenteen ammatit Lentäjän, lentokapteenin ja lentoemännän työ
scope note: Flygtrafiklära. Manövrering av flygplan och flygundervisning Regler och trafiksäkerhet inom flygtrafik Flygledning. Flygolyckor. Yrken inom flygtrafiken Pilotens, flygkaptenens och flygvärdinnans arbete @sv

Sanakirjat. Hakuteokset
type: Class
type: Concept
subclass of: URN:NBN:fi:au:hklj:700
alternative label: Elämäkerralliset hakuteokset, taiteilijat (703)
alternative label: Henkilöhakemistot, taiteilijat (703)
alternative label: Kuvataiteilijat, elämäkerralliset hakuteokset (703)
alternative label: Matrikkelit, taiteilijat (703)
alternative label: Nimikirjat, taiteilijat (703)
alternative label: Taidesanakirjat (703)
alternative label: Taiteilijamatrikkelit (703)
alternative label: Taiteilijanimet, taiteilijahakemistot (703)
alternative label: Teokset, taiteilijoiden teosluettelot (703 ... 776.03)
alternative label: Teosluettelot, taiteilijoiden (703)
alternative label: Bildkonstnärer, biografiska uppslagsverk (703) @sv
alternative label: Biografiska uppslagsverk, konstnärer (703) @sv
alternative label: Konstlexikon (703) @sv
alternative label: Konstnärsnamn, konstnärsregister (703) @sv
alternative label: Konstnärsregister (703) @sv
alternative label: Matriklar, matrikkelit, konstnärer (703) @sv
alternative label: Matriklar, nimikirjat, konstnärer (703) @sv
alternative label: Verk, konstnärers opusförteckningar (703 ... 776.03) @sv
alternative label: Verkförteckningar, konstnärers (703) @sv
broader: URN:NBN:fi:au:hklj:700
in scheme: URN:NBN:fi:au:hklj:
notation: 703
preferred label: Dictionaries. Reference books @en
preferred label: Ordböcker. Uppslagsböcker @sv
related: Symbolit. Koodit. Merkkijärjestelmät
related: URN:NBN:fi:au:hklj:010
related: Yleisbibliografiat. Kansallisbibliografiat
related: Kustantajien ja kirjakauppojen luettelot
related: Erikoisalojen bibliografiat
related: Taiteet. Liikunta
related: Paikallisbibliografiat. Henkilöbibliografiat
related: URN:NBN:fi:au:hklj:709.903
related: Elämäkerralliset hakuteokset
scope note: Taidetta yleensä tai useita eri taiteenaloja koskevat sanakirjat ja hakuteokset Taiteilijaluettelot ja -matrikkelit, jotka sisältävät taiteilijoita useilta eri taiteenaloilta Eri taiteenalojen sanakirjat, hakuteokset ja taiteilijaluettelot alan mukaisessa luokassa
scope note: Allmänna ordböcker och uppslagsböcker som hänför sig till konst i allmänhet eller flera olika konstformer Konstnärsförteckningar och konstnärsmatriklar som innehåller konstnärer inom flera enskilda konstarter Ordböcker, uppslagsböcker och konstnärsförteckningar som rör enskilda konstarter klassificeras enligt konstart @sv

Länsi- ja Keski-Eurooppa
type: Class
type: Concept
subclass of: URN:NBN:fi:au:hklj:720.9
alternative label: Alankomaat, arkkitehtuuri (720.93)
alternative label: Belgia, arkkitehtuuri (720.93)
alternative label: Hollanti, arkkitehtuuri (720.93)
alternative label: Itävalta, arkkitehtuuri (720.93)
alternative label: Norja, arkkitehtuuri (720.93)
alternative label: Romania, arkkitehtuuri (720.93)
alternative label: Sveitsi, arkkitehtuuri (720.93)
alternative label: Tanska, arkkitehtuuri (720.93)
alternative label: Tsekki, arkkitehtuuri (720.93)
alternative label: Unkari, arkkitehtuuri (720.93)
alternative label: Belgien, arkitektur (720.93) @sv
alternative label: Danmark, arkitektur (720.93) @sv
alternative label: Holland, arkitektur (720.93) @sv
alternative label: Nederländerna, arkitektur (720.93) @sv
alternative label: Norge, arkitektur (720.93) @sv
alternative label: Rumänien, arkitektur (720.93) @sv
alternative label: Schweiz, arkitektur (720.93) @sv
alternative label: Tjeckien, arkitektur (720.93) @sv
alternative label: Ungern, arkitektur (720.93) @sv
alternative label: Österrike, arkitektur (720.93) @sv
broader: URN:NBN:fi:au:hklj:720.9
in scheme: URN:NBN:fi:au:hklj:
narrower: Saksa
narrower: Ranska
narrower: Brittein saaret
notation: 720.93
preferred label: Western and Central Europe @en
preferred label: Västeuropa och Centraleuropa @sv
related: URN:NBN:fi:au:hklj:709
related: Arkkitehtuurikilpailut. Arkkitehtuurinäyttelyt. Arkkitehtuuripalkinnot
related: URN:NBN:fi:au:hklj:749.1
scope note: Benelux-maat. Alankomaat. Belgia. Luxemburg. Unkari. Puola. Tsekki. Slovakia. Romania. Sveitsi. Liechtenstein. Itävalta
scope note: Beneluxländerna. Nederländerna. Belgien. Luxemburg. Ungern. Polen. Tjeckien. Slovakien. Rumänien. Schweiz. Liechtenstein. Österrike @sv

Kulttuurirakennukset
type: Class
type: Concept
subclass of: URN:NBN:fi:au:hklj:726
alternative label: Amfiteatterit, arkkitehtuuri (726.5)
alternative label: Arkistorakennukset, arkkitehtuuri (726.5)
alternative label: Ateljeet, arkkitehtuuri (726.5)
alternative label: Hirvitalo, kulttuurirakennukset, arkkitehtuuri (726.5)
alternative label: Kaupunginteatterit, arkkitehtuuri (726.5)
alternative label: Kirjastorakennukset, arkkitehtuuri (726.5)
alternative label: Konserttisalit, arkkitehtuuri (726.5)
alternative label: Konserttitalot, arkkitehtuuri (726.5)
alternative label: Korkeakoulurakennukset, arkkitehtuuri (726.5)
alternative label: Koulurakennukset, arkkitehtuuri (726.5)
alternative label: Kulttuurirakennukset, arkkitehtuuri (726.5)
alternative label: Kulttuuritalot, arkkitehtuuri (726.5)
alternative label: Lukusalit, arkkitehtuuri (726.5)
alternative label: Monitoimitalot, arkkitehtuuri (726.5)
alternative label: Nuorisoseurantalot, arkkitehtuuri (726.5)
alternative label: Näyttelytilat, arkkitehtuuri (726.5)
alternative label: Oopperatalot, arkkitehtuuri (726.5)
alternative label: Oppilaitokset, arkkitehtuuri (726.5)
alternative label: Seuraintalot, arkkitehtuuri (726.5)
alternative label: Seurantalot, arkkitehtuuri (726.5)
alternative label: Taidemuseot, arkkitehtuuri (726.5)
alternative label: Teatterirakennukset, arkkitehtuuri (726.5)
alternative label: Teatterit, arkkitehtuuri (726.5)
alternative label: Televisiorakennukset, arkkitehtuuri (726.5)
alternative label: Työväentalot, arkkitehtuuri (726.5)
alternative label: Yliopistorakennukset, arkkitehtuuri (726.5)
alternative label: Allaktivitetshus, arkitektur (726.5) @sv
alternative label: Amfiteatrar, arkitektur (726.5) @sv
alternative label: Arkivbyggnader, arkitektur (726.5) @sv
alternative label: Ateljéer, arkitektur (726.5) @sv
alternative label: Biblioteksbyggnader, arkitektur (726.5) @sv
alternative label: Folkets hus, arkitektur (726.5) @sv
alternative label: Föreningshus, arkitektur (726.5) @sv
alternative label: Hirvitalo, kulturbyggnader, arkitektur (726.5) @sv
alternative label: Högskolebyggnader, arkitektur (726.5) @sv
alternative label: Konserthus, arkitektur (726.5) @sv
alternative label: Konsertsalar, arkitektur (726.5) @sv
alternative label: Konstmuseer, arkitektur (726.5) @sv
alternative label: Kulturbyggnader, arkitektur (726.5) @sv
alternative label: Kulturhus, arkitektur (726.5) @sv
alternative label: Läroinrättningar, arkitektur (726.5) @sv
alternative label: Läsesalar, arkitektur (726.5) @sv
alternative label: Operahus, arkitektur (726.5) @sv
alternative label: Skolbyggnader, arkitektur (726.5) @sv
alternative label: Societetshus, arkitektur (726.5) @sv
alternative label: Stadsteatrar, arkitektur (726.5) @sv
alternative label: TV-byggnader, arkitektur (726.5) @sv
alternative label: Teaterbyggnader, arkitektur (726.5) @sv
alternative label: Teatrar, arkitektur (726.5) @sv
alternative label: Ungdomsföreningshus, arkitektur (726.5) @sv
alternative label: Universitetsbyggnader, arkitektur (726.5) @sv
alternative label: Utställningslokaler, arkitektur (726.5) @sv
broader: URN:NBN:fi:au:hklj:726
in scheme: URN:NBN:fi:au:hklj:
notation: 726.5
preferred label: Cultural buildings @en
preferred label: Kulturbyggnader @sv
related: KIRJASTOT. KIRJASTOTOIMI
related: Kirjastojen hallinto ja suunnittelu
related: URN:NBN:fi:au:hklj:060
related: Arkkitehtuurin teoria, estetiikka ja filosofia
related: Arkkitehtuurikilpailut. Arkkitehtuurinäyttelyt. Arkkitehtuuripalkinnot
related: URN:NBN:fi:au:hklj:720.9
related: URN:NBN:fi:au:hklj:770
related: Teatteritekniikka
related: Konsertit. Musiikkijuhlat. Musiikkikilpailut. Nuottien ja äänitteiden kustantaminen
related: Oopperat
scope note: Maasta ja aikakaudesta riippumatta kulttuurirakennusten arkkitehtuuri Kulttuuri- ja monitoimitalot. Teatteri-, konsertti- ja oopperatalot. Museot. Taidemuseot. Kirjastot. Radio- ja televisiorakennukset. Oppi- ja tutkimuslaitokset. Koulut. Yliopistot. Korkeakoulut Jos teoksessa on sekä arkkitehtuuria että rakennuksen käyttöä tai käytön historiaa, on etusija käytön mukaisella luokalla
scope note: Hit kulturbyggnadernas arkitektur oavsett land och tidsperiod Kulturhus och allaktivitetshus. Teater-, konsert- och operahus. Museer. Konstmuseer. Bibliotek. Radio- och televisionsbygggnader. Läroinrättningar och forskningsinstitut. Skolor. Universitet. Högskolor Om verket handlar om såväl arkitektur som byggnadens användningsområde eller användningsområdets historia, ges företräde åt klassen för användningsområdet @sv

Uuden ajan maalaustaide
type: Class
type: Concept
subclass of: URN:NBN:fi:au:hklj:740.9
alternative label: Barokki, maalaustaide (740.906)
alternative label: Kansallisromantiikka, maalaustaide (740.906)
alternative label: Naturalismi, maalaustaide (740.906)
alternative label: Neoklassismi, maalaustaide (740.906)
alternative label: Realismi, maalaustaide (740.906 ... 740.907)
alternative label: Rokokoo, maalaustaide (740.906)
alternative label: Romantiikka, maalaustaide (740.906)
alternative label: Symbolismi, maalaustaide (740.906)
alternative label: Täysromantiikka, maalaustaide (740.906)
alternative label: Uusklassismi, maalaustaide (740.906)
alternative label: Varhaisromantiikka, maalaustaide (740.906)
alternative label: Barock, målarkonst (740.906) @sv
alternative label: Förromantik, målarkonst (740.906) @sv
alternative label: Högromantik, målarkonst (740.906) @sv
alternative label: Nationalromantik, målarkonst (740.906) @sv
alternative label: Naturalism, målarkonst (740.906) @sv
alternative label: Neoklassicism, målarkonst (740.906) @sv
alternative label: Nyklassicism, målarkonst (740.906) @sv
alternative label: Realism, målarkonst (740.906 ... 740.907) @sv
alternative label: Rokoko, målarkonst (740.906) @sv
alternative label: Romantiken, målarkonst (740.906) @sv
alternative label: Symbolism, målarkonst (740.906) @sv
broader: URN:NBN:fi:au:hklj:740.9
in scheme: URN:NBN:fi:au:hklj:
notation: 740.906
preferred label: Modern age painting @en
preferred label: Nya tidens målarkonst @sv
related: URN:NBN:fi:au:hklj:709
related: Uuden ajan taidehistoria
related: URN:NBN:fi:au:hklj:741
related: URN:NBN:fi:au:hklj:741.1
related: URN:NBN:fi:au:hklj:741.2
related: URN:NBN:fi:au:hklj:742
related: URN:NBN:fi:au:hklj:749
related: URN:NBN:fi:au:hklj:749.1
scope note: Euroopan uuden ajan maalaustaide yleensä Tässä myös Euroopan ulkopuolinen länsimainen uuden ajan maalaustaide yleensä Barokin, rokokoon, romantiikan, symbolismin ja kansallisromantiikan maalaustaide yleensä Kertaustyylien, kuten uusklassismin maalaustaide yleensä Tietyn maan uuden ajan maalaustaidetta tai taidemaalareita koskevat teokset maan mukaisessa luokassa
scope note: Nya tidens europeiska målarkonst i allmänhet Hit också nya tidens utomeuropeiska västerländska målarkonst i allmänhet Barockens, rokokons, romantikens, symbolismens, nationalromantikens och jugendtidens målarkonst i allmänhet Eklekticism såsom nyklassicistisk målarkonst i allmänhet Verk som handlar om nya tidens målarkonst eller målare i ett bestämt land klassificeras enligt land @sv

Eurooppa
type: Class
type: Concept
subclass of: URN:NBN:fi:au:hklj:740.9
broader: URN:NBN:fi:au:hklj:740.9
in scheme: URN:NBN:fi:au:hklj:
notation: 740.91
preferred label: Europe @en
preferred label: Europa @sv
related: URN:NBN:fi:au:hklj:709
related: Alkuperäiskansojen maalaustaide
related: Esihistoriallisen ajan maalaustaide
related: Vanhan ajan maalaustaide. Euroopan ulkopuolistenvanhojen kulttuurien maalaustaide
related: URN:NBN:fi:au:hklj:741
related: URN:NBN:fi:au:hklj:741.1
related: URN:NBN:fi:au:hklj:741.2
related: URN:NBN:fi:au:hklj:742
related: URN:NBN:fi:au:hklj:749
related: URN:NBN:fi:au:hklj:749.1
scope note: Euroopan maalaustaiteen yleisteokset
scope note: Allmänna verk om europeisk målarkonst @sv

Itä-Eurooppa
type: Class
type: Concept
subclass of: URN:NBN:fi:au:hklj:740.9
alternative label: Bulgaria, maalaustaide (740.95)
alternative label: Neuvostoliitto, maalaustaide (740.95 +)
alternative label: Puola, maalaustaide (740.95)
alternative label: Bulgarien, målarkonst (740.95) @sv
alternative label: Polen, målarkonst (740.95) @sv
alternative label: Sovjetunionen, målarkonst (740.95 +) @sv
broader: URN:NBN:fi:au:hklj:740.9
in scheme: URN:NBN:fi:au:hklj:
narrower: Venäjä
notation: 740.95
preferred label: Eastern Europe @en
preferred label: Östeuropa @sv
related: URN:NBN:fi:au:hklj:709
related: URN:NBN:fi:au:hklj:741
related: URN:NBN:fi:au:hklj:741.1
related: URN:NBN:fi:au:hklj:741.2
related: URN:NBN:fi:au:hklj:742
related: URN:NBN:fi:au:hklj:749
related: URN:NBN:fi:au:hklj:749.1
scope note: Moldova. Ukraina. Valko-Venäjä Itsenäisten valtioiden yhteisö yleensä
scope note: Moldova (f.d. Moldavien). Ukraina. Vitryssland Oberoende staternas samvälde i allmänhet @sv

Aasia
type: Class
type: Concept
subclass of: URN:NBN:fi:au:hklj:740.9
alternative label: Aasia, maalaustaide, moderni (740.96)
alternative label: Intia, maalaustaide, moderni (740.96)
alternative label: Japani, maalaustaide, moderni (740.96)
alternative label: Kiina, maalaustaide, moderni (740.96)
alternative label: Asien, målarkonst, modern (740.96) @sv
alternative label: Indien, målarkonst, modern (740.96) @sv
alternative label: Japan, målarkonst, modern (740.96) @sv
alternative label: Kina, målarkonst, modern (740.96) @sv
broader: URN:NBN:fi:au:hklj:740.9
in scheme: URN:NBN:fi:au:hklj:
notation: 740.96
preferred label: Asia @en
preferred label: Asien @sv
related: URN:NBN:fi:au:hklj:709
related: Alkuperäiskansojen maalaustaide
related: Esihistoriallisen ajan maalaustaide
related: Vanhan ajan maalaustaide. Euroopan ulkopuolistenvanhojen kulttuurien maalaustaide
related: URN:NBN:fi:au:hklj:741
related: URN:NBN:fi:au:hklj:741.1
related: URN:NBN:fi:au:hklj:741.2
related: URN:NBN:fi:au:hklj:742
related: URN:NBN:fi:au:hklj:749
related: URN:NBN:fi:au:hklj:749.1
scope note: Aasian maiden nykyajan maalaustaide
scope note: De asiatiska ländernas nutida målarkonst @sv

Afrikka
type: Class
type: Concept
subclass of: URN:NBN:fi:au:hklj:740.9
alternative label: Afrikka, maalaustaide, moderni (740.97)
alternative label: Egypti, maalaustaide, nykyajan (740.97)
alternative label: Afrika, målarkonst, modern (740.97) @sv
alternative label: Egypten, målarkonst, modern (740.97) @sv
broader: URN:NBN:fi:au:hklj:740.9
in scheme: URN:NBN:fi:au:hklj:
notation: 740.97
preferred label: Africa @en
preferred label: Afrika @sv
related: URN:NBN:fi:au:hklj:709
related: Alkuperäiskansojen maalaustaide
related: Esihistoriallisen ajan maalaustaide
related: Vanhan ajan maalaustaide. Euroopan ulkopuolistenvanhojen kulttuurien maalaustaide
related: URN:NBN:fi:au:hklj:741
related: URN:NBN:fi:au:hklj:741.1
related: URN:NBN:fi:au:hklj:741.2
related: URN:NBN:fi:au:hklj:742
related: URN:NBN:fi:au:hklj:749
related: URN:NBN:fi:au:hklj:749.1
scope note: Afrikan maiden nykyajan maalaustaide
scope note: De afrikanska ländernas nutida målarkonst @sv

Amerikka
type: Class
type: Concept
subclass of: URN:NBN:fi:au:hklj:740.9
alternative label: Amerikka, maalaustaide, moderni (740.98 +)
alternative label: Etelä-Amerikka, maalaustaide, moderni (740.98)
alternative label: Pohjois-Amerikka, maalaustaide, moderni (740.98 +)
alternative label: Amerika, målarkonst, modern (740.98 +) @sv
alternative label: Nordamerika, målarkonst, modern (740.98 +) @sv
alternative label: Sydamerika, målarkonst, modern (740.98) @sv
broader: URN:NBN:fi:au:hklj:740.9
in scheme: URN:NBN:fi:au:hklj:
narrower: Yhdysvallat
notation: 740.98
preferred label: Americas @en
preferred label: Amerika @sv
related: URN:NBN:fi:au:hklj:709
related: Alkuperäiskansojen maalaustaide
related: URN:NBN:fi:au:hklj:741
related: URN:NBN:fi:au:hklj:741.1
related: URN:NBN:fi:au:hklj:741.2
related: URN:NBN:fi:au:hklj:742
related: URN:NBN:fi:au:hklj:749
related: URN:NBN:fi:au:hklj:749.1
scope note: Amerikan maiden nykyajan maalaustaide
scope note: De amerikanska ländernas nutida målarkonst @sv

Lasimaalaus. Mosaiikkitaide
type: Class
type: Concept
subclass of: MAALAUSTAIDE. PIIRUSTUSTAIDE
alternative label: Bysantti, mosaiikkitaide (747)
alternative label: Lasimaalaukset (747)
alternative label: Lasimaalaus, tekniikka (747)
alternative label: Lyijylasi, lasimaalaus (747)
alternative label: Maalaukset, lasimaalaukset (747)
alternative label: Maalaustaide, lasimaalaus (747)
alternative label: Mosaiikit (747)
alternative label: Taidemaalarit, lasimaalarit (747)
alternative label: Blyglas, glasmålning (747) @sv
alternative label: Bysans, mosaikkonst (747) @sv
alternative label: Glasmålning, teknik (747) @sv
alternative label: Glasmålningar (747) @sv
alternative label: Mosaiker (747) @sv
alternative label: Målare, konstnärer, glasmålare (747) @sv
alternative label: Målarkonst, glasmåleri (747) @sv
alternative label: Målningar, glasmålningar (747) @sv
broader: MAALAUSTAIDE. PIIRUSTUSTAIDE
in scheme: URN:NBN:fi:au:hklj:
notation: 747
preferred label: Glass painting. Mosaic art @en
preferred label: Glasmålning. Mosaikkonst @sv
related: Maalaustaiteen teoria, estetiikka ja filosofia
related: URN:NBN:fi:au:hklj:740.9
related: URN:NBN:fi:au:hklj:741
related: URN:NBN:fi:au:hklj:741.1
related: URN:NBN:fi:au:hklj:741.2
related: URN:NBN:fi:au:hklj:749
related: URN:NBN:fi:au:hklj:749.1
related: Lasitaide
related: URN:NBN:fi:au:hklj:767
scope note: Lasimaalaus ja mosaiikit sekä niiden historia, henkilöhistoria ja estetiikka aihepiiristä, maasta ja aikakaudesta riippumatta Lasimaalauksen ja mosaiikkitaiteen materiaalit ja tekniikka Lasimaalauksen, mosaiikkitaiteen ja mosaiikkitöiden käytännön oppaat. Lyijylasitus
scope note: Glasmålningar och mosaiker samt deras historia, personhistoria och estetik oavsett motivkrets, land eller tidsperiod Glasmålningens och mosaikkonstens material och tekniker Praktiska handböcker i glasmålning, mosaikkonst och mosaikarbete. Blyglasyr @sv

Ryijyt
type: Class
type: Concept
subclass of: URN:NBN:fi:au:hklj:764
alternative label: Käsityöt, ryijyjen valmistus (764.1)
alternative label: Ryijyt (764.1)
alternative label: Seinätekstiilit, ryijyt (764.1)
alternative label: Seinävaatteet, ryijyt (764.1)
alternative label: Tekstiilityö, ryijyt (764.1)
alternative label: Handarbeten, ryatillverkning (764.1) @sv
alternative label: Ryor (764.1) @sv
alternative label: Textilslöjd, ryor (764.1) @sv
alternative label: Väggbonader, ryor (764.1) @sv
alternative label: Väggtextilier, ryor (764.1) @sv
broader: URN:NBN:fi:au:hklj:764
in scheme: URN:NBN:fi:au:hklj:
notation: 764.1
preferred label: Rugs @en
preferred label: Ryor @sv
related: Tekstiili- ja vaatetusteollisuus
related: Kodin korjaustöiden oppaat
related: Taideteollisuuden teoria, estetiikka ja filosofia
related: Antiikkiesineiden keräily
related: Taideteollisuuden historia
related: Kankaankudonta. Kankaanpainanta
related: URN:NBN:fi:au:hklj:767
related: URN:NBN:fi:au:hklj:798
related: Muodin historia
scope note: Ryijyt ja ryijytaide, sen historia, materiaalit, tekniikka ja estetiikka Ryijyohjeet ja -mallit
scope note: Ryor som hantverk och konst, deras historia, material, tekniker och estetik Arbetsbeskrivningar och mönster för ryor @sv

Koruompelu. Kirjonta. Nimikointi
type: Class
type: Concept
subclass of: URN:NBN:fi:au:hklj:764
alternative label: Alkukirjaimet, nimikointi (764.2)
alternative label: Anfangit, nimikointi (764.2)
alternative label: Applikaatiotyöt, kirjonta (764.2)
alternative label: Brodeeraus (764.2)
alternative label: Brodyyri (764.2)
alternative label: Initiaalit, nimikointi (764.2)
alternative label: Kirjailu (764.2)
alternative label: Kirjonta (764.2)
alternative label: Koruompelu (764.2)
alternative label: Kuviot, koruompelu, kirjonta (764.2)
alternative label: Käsityöt, kirjonta (764.2)
alternative label: Käsityöt, koruompelu (764.2)
alternative label: Käsityöt, nimikointi (764.2)
alternative label: Nimikointi (764.2)
alternative label: Ompelu, koruompelu (764.2)
alternative label: Ompelutyöt, koruompelu (764.2)
alternative label: Reikäompelu (764.2)
alternative label: Revinnäistyöt (764.2)
alternative label: Ristipistot (764.2)
alternative label: Ristipistotyöt (764.2)
alternative label: Taideompelu (764.2)
alternative label: Tekstiilityö, kirjonta (764.2)
alternative label: Tekstiilityö, koruompelu (764.2)
alternative label: Tekstiilityö, nimikointi (764.2)
alternative label: Tekstiilityö, ristipistot (764.2)
alternative label: Valkokirjonta (764.2)
alternative label: Vanukirjonta (764.2)
alternative label: Vohvelityöt (764.2)
alternative label: Anfanger, märkning (764.2) @sv
alternative label: Applikationsarbeten, broderi (764.2) @sv
alternative label: Begynnelsebokstäver, märkning (764.2) @sv
alternative label: Broderi, brodeeraus (764.2) @sv
alternative label: Broderi, kirjailu (764.2) @sv
alternative label: Broderi, kirjonta (764.2) @sv
alternative label: Broderi, koruompelu (764.2) @sv
alternative label: Brodyr (764.2) @sv
alternative label: Figurer, broderi (764.2) @sv
alternative label: Handarbeten, broderi (764.2) @sv
alternative label: Handarbeten, märkning (764.2) @sv
alternative label: Hålsömnad (764.2) @sv
alternative label: Hålsömsarbeten (764.2) @sv
alternative label: Initialer, märkning (764.2) @sv
alternative label: Konstsömnad (764.2) @sv
alternative label: Korsstygn (764.2) @sv
alternative label: Korsstygnsarbeten (764.2) @sv
alternative label: Matelasse (764.2) @sv
alternative label: Märkning, handarbete (764.2) @sv
alternative label: Sömnad, broderi (764.2) @sv
alternative label: Sömnadsarbeten, broderi (764.2) @sv
alternative label: Textilslöjd, broderi (764.2) @sv
alternative label: Textilslöjd, korsstygn (764.2) @sv
alternative label: Textilslöjd, märkning (764.2) @sv
alternative label: Textilslöjd, prydnadssömnad (764.2) @sv
alternative label: Vitbroderi (764.2) @sv
alternative label: Våffeltyger, arbeten (764.2) @sv
broader: URN:NBN:fi:au:hklj:764
in scheme: URN:NBN:fi:au:hklj:
notation: 764.2
preferred label: Decorative needlework. Embroidery. Monogramming @en
preferred label: Prydnadssömnad. Broderi. Märkning @sv
related: Tekstiili- ja vaatetusteollisuus
related: Kodin korjaustöiden oppaat
related: Taideteollisuuden teoria, estetiikka ja filosofia
related: Antiikkiesineiden keräily
related: Taideteollisuuden historia
related: Ompelu
related: URN:NBN:fi:au:hklj:767
related: URN:NBN:fi:au:hklj:798
related: Muodin historia
scope note: Koruompelu, kirjonta ja nimikointi, niiden historia, materiaalit, tekniikka ja estetiikka Koruompelu-, kirjonta- ja nimikointiohjeet ja -mallit
scope note: Prydnadssömnad, broderi och märkning, deras historia, material, tekniker och estetik Sömnadsbeskrivningar och mönster för prydnadssömnad, broderi och märkning @sv

Solmeilu. Makramee. Fransut
type: Class
type: Concept
subclass of: URN:NBN:fi:au:hklj:764
alternative label: Fransut (764.4)
alternative label: Käsityöt, fransut (764.4)
alternative label: Käsityöt, makramee (764.4)
alternative label: Käsityöt, solmeilu (764.4)
alternative label: Makramee (764.4)
alternative label: Punokset, tekstiilipunokset (764.4)
alternative label: Punontatyöt, tekstiilipunokset (764.4)
alternative label: Solmeilu (764.4)
alternative label: Tekstiilityö, fransut (764.4)
alternative label: Tekstiilityö, makramee (764.4)
alternative label: Tekstiilityö, solmeilu (764.4)
alternative label: Flätningsarbeten, textilsnoddar (764.4) @sv
alternative label: Fransar (764.4) @sv
alternative label: Handarbeten, fransar (764.4) @sv
alternative label: Handarbeten, knytning (764.4) @sv
alternative label: Handarbeten, makramé (764.4) @sv
alternative label: Knytning (764.4) @sv
alternative label: Makramé (764.4) @sv
alternative label: Snoddar, textilsnoddar (764.4) @sv
alternative label: Textilslöjd, fransar (764.4) @sv
alternative label: Textilslöjd, knytning (764.4) @sv
alternative label: Textilslöjd, makramé (764.4) @sv
broader: URN:NBN:fi:au:hklj:764
in scheme: URN:NBN:fi:au:hklj:
notation: 764.4
preferred label: Knotting. Macramé. Plaiting @en
preferred label: Knytning. Makramé. Fransflätning @sv
related: Tekstiili- ja vaatetusteollisuus
related: Merenkulkuoppi
related: Kodin korjaustöiden oppaat
related: Taideteollisuuden teoria, estetiikka ja filosofia
related: Antiikkiesineiden keräily
related: Taideteollisuuden historia
related: URN:NBN:fi:au:hklj:767
related: URN:NBN:fi:au:hklj:798
related: Muodin historia
scope note: Solmeilu, makramee ja fransut, niiden historia, materiaalit, tekniikka ja estetiikka Solmeilu-, kirjonta- ja nimikointiohjeet ja -mallit
scope note: Knytning, makramé och fransflätning, deras historia, material, tekniker och estetik Arbetsbeskrivningar och mönster för knytning, makramé och fransflätning @sv

Matot
type: Class
type: Concept
subclass of: URN:NBN:fi:au:hklj:764
alternative label: Itämaiset matot (764.5)
alternative label: Kangaspuut, matonkudonta (764.5)
alternative label: Kudonta, matonkudonta (764.5)
alternative label: Kutominen, matonkudonta (764.5)
alternative label: Käsityöt, matonkudonta (764.5)
alternative label: Matot (764.5)
alternative label: Matot, matonkudonta (764.5)
alternative label: Matot, mattotaide (764.5)
alternative label: Mattotaide (764.5)
alternative label: Räsymatot (764.5)
alternative label: Tekstiilityö, matonkudonta (764.5)
alternative label: Handarbeten, mattvävning (764.5) @sv
alternative label: Mattkonst (764.5) @sv
alternative label: Mattor (764.5) @sv
alternative label: Mattor, mattkonst (764.5) @sv
alternative label: Mattor, mattvävning (764.5) @sv
alternative label: Textilslöjd, mattvävning (764.5) @sv
alternative label: Trasmattor (764.5) @sv
alternative label: Vävnad, mattvävning (764.5) @sv
alternative label: Vävning, mattvävning (764.5) @sv
alternative label: Vävstolar, mattvävning (764.5) @sv
alternative label: Österländska mattor (764.5) @sv
broader: URN:NBN:fi:au:hklj:764
in scheme: URN:NBN:fi:au:hklj:
notation: 764.5
preferred label: Mats @en
preferred label: Mattor @sv
related: Tekstiili- ja vaatetusteollisuus
related: Kodin korjaustöiden oppaat
related: Taideteollisuuden teoria, estetiikka ja filosofia
related: Antiikkiesineiden keräily
related: Taideteollisuuden historia
related: Kankaankudonta. Kankaanpainanta
related: URN:NBN:fi:au:hklj:767
related: URN:NBN:fi:au:hklj:798
related: Muodin historia
scope note: Matot ja mattotaide, sen historia materiaalit, tekniikka ja estetiikka Matonkudontaohjeet ja -mallit Räsymatot. Itämaiset matot
scope note: Mattor som hantverk och konst, deras historia, material, tekniker och estetik Vävbeskrivningar och mönster för mattor Trasmattor. Orientaliska mattor @sv

Tilkkutyöt. Tikatut peitteet
type: Class
type: Concept
subclass of: URN:NBN:fi:au:hklj:764
alternative label: Käsityöt, tilkkutyöt (764.8)
alternative label: Peitot, tilkkutäkit (764.8)
alternative label: Peitteet, tekstiilit, tilkkutäkit (764.8)
alternative label: Tekstiilityö, tilkkutyöt (764.8)
alternative label: Tilkkutyöt (764.8)
alternative label: Vuodevaatteet, tilkkutyöt (764.8)
alternative label: Bolstrar, lapptäcken (764.8) @sv
alternative label: Handarbeten, lapptäcken (764.8) @sv
alternative label: Lapptäcksarbeten (764.8) @sv
alternative label: Sängkläder, lapptäcken (764.8) @sv
alternative label: Textilslöjd, lapptäcken (764.8) @sv
alternative label: Täcken, textilier, lapptäcken (764.8) @sv
broader: URN:NBN:fi:au:hklj:764
in scheme: URN:NBN:fi:au:hklj:
notation: 764.8
preferred label: Patchwork quilting. Patchwork quilts @en
preferred label: Lapptäcksarbete. Lapptäcken @sv
related: Tekstiili- ja vaatetusteollisuus
related: Kodin korjaustöiden oppaat
related: Taideteollisuuden teoria, estetiikka ja filosofia
related: Antiikkiesineiden keräily
related: Taideteollisuuden historia
related: Ompelu
related: URN:NBN:fi:au:hklj:767
related: URN:NBN:fi:au:hklj:798
related: Muodin historia
scope note: Tilkkutyöt ja tikatut peitteet, niiden historia, materiaalit, tekniikka ja estetiikka Tilkkutyö- ja tikkausohjeet ja -mallit
scope note: Lapptäcksarbete och lapptäcken, deras historia, material, tekniker och estetik Arbetsbeskrivningar och mönster för lapptäcksarbeten och lapptäcken @sv

Musiikkibibliografiat. Diskografiat
type: Class
type: Concept
subclass of: MUSIIKKI
alternative label: Arvostelevat luettelot, musiikki (780.15)
alternative label: Bibliografia, musiikkibibliografiat (780.15)
alternative label: Bibliografiat, musiikkibibliografiat (780.15)
alternative label: Bibliografiset tietokannat, musiikkibibliografiat (780.15)
alternative label: CD-levyt, diskografiat, musiikki (780.15)
alternative label: CD-äänilevyt, diskografiat, musiikki (780.15)
alternative label: Diskografiat, musiikki (780.15)
alternative label: Hitit, diskografiat (780.15)
alternative label: Kansallisdiskografiat (780.15)
alternative label: Kasetit, musiikkibibliografiat (780.15)
alternative label: Kasettiluettelot, musiikkibibliografiat (780.15)
alternative label: Kirjaluettelot, musiikkibibliografiat (780.15)
alternative label: Kompaktilevyt, diskografiat, musiikki (780.15)
alternative label: Kustantajien luettelot, musiikki (780.15)
alternative label: Laserlevyt, diskografiat, musiikki (780.15)
alternative label: Listat, musiikkiluettelot (780.15)
alternative label: Luettelot, diskografiat (780.15)
alternative label: Luettelot, musiikkibibliografiat (780.15)
alternative label: Musiikkiarkistot, musiikkibibliografiat (780.15)
alternative label: Musiikkibibliografiat (780.15)
alternative label: Musiikkikäsikirjoitukset, säveltäjien teosluettelot (780.15)
alternative label: Musiikkiteokset, säveltäjien teosluettelot (780.15)
alternative label: Musiikkivideot, musiikkivideoluettelot (780.15)
alternative label: Nauhoitearkistot, musiikkibibliografiat (780.15)
alternative label: Nauhoitteet, musiikkibibliografiat (780.15)
alternative label: Nuottikäsikirjoitukset, säveltäjien teosluettelot (780.15)
alternative label: Nuottiluettelot (780.15)
alternative label: Opusluettelot (780.15)
alternative label: Partituuriluettelot (780.15)
alternative label: SACD-levyt, diskografiat, musiikki (780.15)
alternative label: Super audio compact discs, diskografiat, musiikki (780.15)
alternative label: Sävellykset, säveltäjien teosluettelot (780.15)
alternative label: Sävellyskäsikirjoitukset, säveltäjien teosluettelot (780.15)
alternative label: Sävelteokset, säveltäjien teosluettelot (780.15)
alternative label: Säveltäjien teosluettelot (780.15)
alternative label: Säveltäjät, teosluettelot (780.15)
alternative label: Teemaluettelot, musiikkibibliografiat (780.15)
alternative label: Teokset, musiikkibibliografiat (780.15)
alternative label: Teosluettelot, säveltäjien teosluettelot (780.15)
alternative label: Valikoimaluettelot, musiikki (780.15)
alternative label: Ääniarkistot, musiikkibibliografiat (780.15)
alternative label: Äänilevyarkistot, musiikkibibliografiat (780.15)
alternative label: Äänilevyluettelot, musiikki (780.15)
alternative label: Äänitallenteet, bibliografiat, musiikki (780.15)
alternative label: Äänitearkistot, musiikkibibliografiat (780.15)
alternative label: Ääniteluettelot, musiikki (780.15)
alternative label: Äänitteet, bibliografiat, musiikki (780.15)
alternative label: Bandarkiv, musikbibliografier (780.15) @sv
alternative label: Bandinspelningar, musikbibliografier (780.15) @sv
alternative label: Bibliografi, musikbibliografier (780.15) @sv
alternative label: Bibliografier, musikbibliografier (780.15) @sv
alternative label: Bibliografiska databaser, musikbibliografier (780.15) @sv
alternative label: Bokkataloger, musikbibliografier (780.15) @sv
alternative label: CD-grammofonskivor, diskografier, musik (780.15) @sv
alternative label: CD-skivor, diskografier, musik (780.15) @sv
alternative label: Diskografier, musik (780.15) @sv
alternative label: Fonografarkiv, musikbibliografier (780.15) @sv
alternative label: Fonogram, bibliografier, musik (780.15) @sv
alternative label: Fonogramkataloger, musik (780.15) @sv
alternative label: Förlagskataloger, musik (780.15) @sv
alternative label: Handskrifter, kompositioner, kompositörers opusförteckningar (780.15) @sv
alternative label: Handskrifter, musik, kompositörers opusförteckningar (780.15) @sv
broader: MUSIIKKI
in scheme: URN:NBN:fi:au:hklj:
notation: 780.15
related: URN:NBN:fi:au:hklj:010
related: Valikoimaluettelot
related: Lasten- ja nuortenkirjallisuuden luettelot
related: Yleisbibliografiat. Kansallisbibliografiat
related: Kirjastojen luettelot
related: Kustantajien ja kirjakauppojen luettelot
related: Erikoisalojen bibliografiat
related: Taiteet. Liikunta
related: Paikallisbibliografiat. Henkilöbibliografiat
related: URN:NBN:fi:au:hklj:627.7531
scope note: Maasta, aikakaudesta, musiikin lajista tai bibliografian tai luettelon aineistotyypistä riippumatta kaikki musiikkibibliografiat ja muut musiikkia koskevat luettelot, kuten ääniteluettelot, diskografiat, nuottiluettelot, musiikkivideo- ja musiikki-DVD-luettelot sekä säveltäjien teosluettelot
scope note: Alla slags musikbibliografier och andra kataloger som hänför sig till musik, såsom kataloger över ljudupptagningar, diskografier, notkataloger, kataloger över musikvideor och musik-DVD-skivor samt kompositörers opusförteckningar oavsett land, tidsperiod, musikslag, bibliografins eller katalogens mediatyp @sv

Lauluyhtyeet (2-9 laulajaa)
type: Class
type: Concept
subclass of: URN:NBN:fi:au:hklj:783
alternative label: Kvartetit, lauluyhtyeet (783.3 +)
alternative label: Kvintetit, lauluyhtyeet (783.3 +)
alternative label: Laulu, lauluyhtyeet (783.3 +)
alternative label: Lauluryhmät, klassinen musiikki (783.3 +)
alternative label: Laulut, lauluyhtyeet (783.3 +)
alternative label: Lauluyhtyeet, klassinen musiikki (783.3 +)
alternative label: Sekstetit, lauluyhtyeet (783.3 +)
alternative label: Septetit, lauluyhtyeet (783.3 +)
alternative label: Tertsetit, lauluyhtyeet (783.3 +)
alternative label: Tertsetot, laulumusiikki (783.3 +)
alternative label: Triot, lauluyhtyeet (783.3 +)
alternative label: Yhteislaulu, lauluyhtyeet (783.3 +)
alternative label: Yhtyeet, lauluyhtyeet (783.3 +)
alternative label: Yhtyemusiikki, laulumusiikki (783.3 +)
alternative label: Allsång, sångensembler (783.3 +) @sv
alternative label: Ensemblemusik, sångmusik (783.3 +) @sv
alternative label: Ensembler, sångensembler (783.3 +) @sv
alternative label: Kvartetter, ensembler, sångensembler (783.3 +) @sv
alternative label: Kvintetter, ensembler, sångensembler (783.3 +) @sv
alternative label: Septetter, ensembler, sångensembler (783.3 +) @sv
alternative label: Sextetter, ensembler, sångensembler (783.3 +) @sv
alternative label: Sång, sångensembler (783.3 +) @sv
alternative label: Sångensembler, klassisk musik (783.3 +) @sv
alternative label: Sånger, sångensembler (783.3 +) @sv
alternative label: Sånggrupper, klassisk musik (783.3 +) @sv
alternative label: Tersetter, kompositioner, vokalmusik (783.3 +) @sv
alternative label: Tersetter, sångensembler (783.3 +) @sv
alternative label: Trior, sångensembler (783.3 +) @sv
broader: URN:NBN:fi:au:hklj:783
in scheme: URN:NBN:fi:au:hklj:
narrower: Lauluyhtyeet ilman säestystä
narrower: Lauluyhtyeet jonkin soittimen tai soitinyhtyeen säestäminä
notation: 783.3
preferred label: Vocal groups (2-9 singers) @en
preferred label: Sånggrupper (2-9 sångare) @sv
related: URN:NBN:fi:au:hklj:770
related: URN:NBN:fi:au:hklj:784
related: URN:NBN:fi:au:hklj:784.111
related: URN:NBN:fi:au:hklj:788
related: URN:NBN:fi:au:hklj:789
scope note: Kokoelmat, joissa on sekä säestyksellistä että säestyksetöntä lauluyhtyemusiikkia Tässä ja alaluokissa myös lauluyhtyeitä sekä niiden historiaa tai henkilöhistoriaa koskeva kirjallisuus Tässä ja alaluokissa myös yhtyelaulun oppaat
scope note: Samlingar som innehåller musik för sånggrupper med eller utan ackompanjemang Hit och till underklasserna också litteratur om sånggrupper samt deras historia eller personhistoria Hit och till underklasserna också skolor för sånggrupper @sv

Muut kosketinsoittimet
type: Class
type: Concept
subclass of: Kosketinsoittimet
alternative label: Celesta (786.19)
broader: Kosketinsoittimet
in scheme: URN:NBN:fi:au:hklj:
notation: 786.19
preferred label: Other keyboard instruments @en
preferred label: Andra klaviaturinstrument @sv
related: URN:NBN:fi:au:hklj:627.7531
related: URN:NBN:fi:au:hklj:681
related: URN:NBN:fi:au:hklj:781.5
related: URN:NBN:fi:au:hklj:782.6
related: URN:NBN:fi:au:hklj:785
related: URN:NBN:fi:au:hklj:785.11
related: URN:NBN:fi:au:hklj:788
related: URN:NBN:fi:au:hklj:789

Muut jousisoittimet
type: Class
type: Concept
subclass of: Jousisoittimet
alternative label: Arpeggione (786.39)
alternative label: Avainviulu (786.39)
alternative label: Barytoniviulu (786.39)
alternative label: Fiideli (786.39)
alternative label: Gusla (786.39)
alternative label: Gusle (786.39)
alternative label: Hurdy-gurdy (786.39)
alternative label: Jouhikko (786.39)
alternative label: Neulaviulu (786.39)
alternative label: Pochette (786.39)
alternative label: Rebec (786.39)
alternative label: Vielle, fiideli (786.39)
alternative label: Viola di bardone (786.39)
alternative label: Virsikannel (786.39)
alternative label: Virsikantele (786.39)
alternative label: Fiddla (786.39) @sv
alternative label: Nyckelharpa (786.39) @sv
alternative label: Psalmodikon (786.39) @sv
alternative label: Spikharmonika (786.39) @sv
alternative label: Stråkharpa (786.39) @sv
alternative label: Vielle, fiddla (786.39) @sv
alternative label: Viola di bordone (786.39) @sv
broader: Jousisoittimet
in scheme: URN:NBN:fi:au:hklj:
notation: 786.39
preferred label: Other bowed-string instruments @en
preferred label: Andra stråkinstrument @sv
related: URN:NBN:fi:au:hklj:627.7531
related: URN:NBN:fi:au:hklj:681
related: URN:NBN:fi:au:hklj:781.5
related: URN:NBN:fi:au:hklj:782.6
related: URN:NBN:fi:au:hklj:785
related: URN:NBN:fi:au:hklj:785.11
related: URN:NBN:fi:au:hklj:788
related: URN:NBN:fi:au:hklj:789

Koulut, harjoituskappaleet ja -etydit
type: Class
type: Concept
subclass of: Lyömä- ja hankaussoittimet
alternative label: Rudimentit (786.71)
alternative label: Rudiment, musik (786.71) @sv
broader: Lyömä- ja hankaussoittimet
in scheme: URN:NBN:fi:au:hklj:
notation: 786.71
preferred label: Courses, practice pieces and studies @en
preferred label: Skolor, övningsstycken och etyder @sv
related: URN:NBN:fi:au:hklj:627.7531
related: URN:NBN:fi:au:hklj:681
related: URN:NBN:fi:au:hklj:781.5
related: URN:NBN:fi:au:hklj:782.6
related: URN:NBN:fi:au:hklj:785
related: URN:NBN:fi:au:hklj:785.11
related: URN:NBN:fi:au:hklj:788
related: URN:NBN:fi:au:hklj:789

Reggae. Ska
type: Class
type: Concept
subclass of: Blues. Soul
alternative label: Dub (788.14)
alternative label: Reggae (788.14)
alternative label: Rock steady (788.14)
alternative label: Ska (788.14)
broader: Blues. Soul
in scheme: URN:NBN:fi:au:hklj:
notation: 788.14
related: URN:NBN:fi:au:hklj:782.4
related: URN:NBN:fi:au:hklj:783
related: URN:NBN:fi:au:hklj:783.1
related: URN:NBN:fi:au:hklj:785.7
related: URN:NBN:fi:au:hklj:786.8
related: URN:NBN:fi:au:hklj:787.112
related: URN:NBN:fi:au:hklj:789
related: URN:NBN:fi:au:hklj:795

Zydeco
type: Class
type: Concept
subclass of: Blues. Soul
alternative label: Zydeco (788.15)
broader: Blues. Soul
in scheme: URN:NBN:fi:au:hklj:
notation: 788.15
related: URN:NBN:fi:au:hklj:782.4
related: URN:NBN:fi:au:hklj:783
related: URN:NBN:fi:au:hklj:783.1
related: URN:NBN:fi:au:hklj:785.7
related: URN:NBN:fi:au:hklj:786.8
related: URN:NBN:fi:au:hklj:787.112
related: URN:NBN:fi:au:hklj:789
related: URN:NBN:fi:au:hklj:795

Swing
type: Class
type: Concept
subclass of: Swing. Traditionaalinen jazz
alternative label: Swing (788.221)
broader: Swing. Traditionaalinen jazz
in scheme: URN:NBN:fi:au:hklj:
notation: 788.221
related: URN:NBN:fi:au:hklj:782.4
related: URN:NBN:fi:au:hklj:783
related: URN:NBN:fi:au:hklj:783.1
related: URN:NBN:fi:au:hklj:785.7
related: URN:NBN:fi:au:hklj:786.8
related: URN:NBN:fi:au:hklj:787.112
related: URN:NBN:fi:au:hklj:789
related: URN:NBN:fi:au:hklj:795

Traditionaalinen jazz
type: Class
type: Concept
subclass of: Swing. Traditionaalinen jazz
alternative label: Charlestonit, jazz (788.222)
alternative label: Chicago-jazz (788.222)
alternative label: Dixieland (788.222)
alternative label: Harlem-jazz (788.222)
alternative label: New Orleans -jazz (788.222)
alternative label: Ragtime, jazzmusiikki (788.222)
alternative label: Traditionaalinen jazz (788.222)
alternative label: Charleston, jazz (788.222) @sv
alternative label: New Orleans jazz (788.222) @sv
alternative label: Ragtime, jazzmusik (788.222) @sv
alternative label: Traditionell jazz (788.222) @sv
broader: Swing. Traditionaalinen jazz
in scheme: URN:NBN:fi:au:hklj:
notation: 788.222
preferred label: Traditional jazz @en
preferred label: Traditionell jazz @sv
related: URN:NBN:fi:au:hklj:782.4
related: URN:NBN:fi:au:hklj:783
related: URN:NBN:fi:au:hklj:783.1
related: URN:NBN:fi:au:hklj:785.7
related: URN:NBN:fi:au:hklj:786.8
related: URN:NBN:fi:au:hklj:787.112
related: URN:NBN:fi:au:hklj:789
related: URN:NBN:fi:au:hklj:795
scope note: Tässä esim. Chicago jazz, dixieland, Harlem jazz, New Orleans jazz ja ragtime
scope note: Hit t.ex. Chicago jazz, dixieland, Harlem jazz, New Orleans jazz och ragtime @sv

Country
type: Class
type: Concept
subclass of: Folk. Country
alternative label: Bluegrass (788.322)
alternative label: Cajun, musiikki (788.322)
alternative label: Country (788.322)
alternative label: Country and western (788.322)
alternative label: Country rock (788.322)
alternative label: Cowboylaulut (788.322)
alternative label: Hillbilly (788.322)
alternative label: Kantri (788.322)
alternative label: Rancheramusiikki (788.322)
alternative label: Tex mex -musiikki (788.322)
alternative label: Western swing (788.322)
alternative label: Cajun, musik (788.322) @sv
alternative label: Countrymusik (788.322) @sv
alternative label: Cowboysånger (788.322) @sv
alternative label: Rancheramusik (788.322) @sv
alternative label: Tex mex-musik (788.322) @sv
broader: Folk. Country
in scheme: URN:NBN:fi:au:hklj:
notation: 788.322
related: URN:NBN:fi:au:hklj:782.4
related: URN:NBN:fi:au:hklj:783
related: URN:NBN:fi:au:hklj:783.1
related: URN:NBN:fi:au:hklj:785.7
related: URN:NBN:fi:au:hklj:786.8
related: URN:NBN:fi:au:hklj:787.112
related: URN:NBN:fi:au:hklj:789
related: URN:NBN:fi:au:hklj:795
scope note: Tässä esim. country and western, hillbilly, ranchera-musiikki, western swing, bluegrass ja cajun
scope note: Hit t.ex. country and western, hillbilly, ranchera-musik, western swing, bluegrass och cajun music @sv

Brittein saaret
type: Class
type: Concept
subclass of: Eurooppa
alternative label: Britannia, musiikinhistoria (789.23)
alternative label: Englanti, musiikinhistoria (789.23)
alternative label: Iso-Britannia, musiikinhistoria (789.23)
alternative label: Yhdistynyt kuningaskunta, musiikinhistoria (789.23)
alternative label: Britannien, musikhistoria (789.23) @sv
alternative label: England, musikhistoria (789.23) @sv
alternative label: Förenade konungariket, musikhistoria (789.23) @sv
alternative label: Storbritannien, musikhistoria (789.23) @sv
broader: Eurooppa
in scheme: URN:NBN:fi:au:hklj:
narrower: Irlanti
notation: 789.23
preferred label: British Isles @en
preferred label: Brittiska öarna @sv
related: URN:NBN:fi:au:hklj:709
related: URN:NBN:fi:au:hklj:782.4
related: URN:NBN:fi:au:hklj:783
related: URN:NBN:fi:au:hklj:789.1
related: Keski- ja Itä-Aasia
scope note: Brittein saarten, Ison Britannian tai Yhdistyneen kuningaskunnan musiikin historia Englanti. Skotlanti. Wales
scope note: Musikens historia på Brittiska öarna, i Storbritannien eller Förenade kungadömet England. Skottland. Wales @sv

Karibianmeren saaret
type: Class
type: Concept
subclass of: Väli-Amerikka
broader: Väli-Amerikka
in scheme: URN:NBN:fi:au:hklj:
notation: 789.68
preferred label: Caribbean Islands @en
preferred label: Karibiska öarna @sv
related: URN:NBN:fi:au:hklj:709
related: URN:NBN:fi:au:hklj:782.4
related: URN:NBN:fi:au:hklj:783
related: URN:NBN:fi:au:hklj:789.1
related: Pohjois-Amerikka
related: Yhdysvallat
related: Etelä-Amerikka
scope note: Isot-Antillit. Pienet Antillit Alankomaiden Antillit. Anguilla. Antigua ja Barbuda. Aruba. Bahama. Barbados. Bermuda. Caymansaaret. Dominica. Dominikaaninen tasavalta. Grenada. Guadeloupe. Haiti. Jamaika. Kuuba. Martinique. Montserrat. Neitsytsaaret. Puerto Rico. Saint Kitts ja Nevis. Saint Lucia. Saint Vincent ja Grenadiinit. Trinidad ja Tobago. Turks- ja Caicossaaret
scope note: Stora Antillerna. Små Antillerna Anguilla. Antigua och Barbuda. Aruba. Bahamaöarna. Barbados. Bermuda. Caymanöarna. Dominica. Dominikanska republiken. Grenada. Guadeloupe. Haiti. Jamaica. Jungfruöarna. Kuba. Martinique. Montserrat. Nederländska Antillerna. Puerto Rico. Saint Christopher och Nevis. Saint Lucia. Saint Vincent och Grenadinerna. Trinidad och Tobago. Turks- och Caicosöarna @sv

Etelä-Amerikka
type: Class
type: Concept
subclass of: URN:NBN:fi:au:hklj:789
alternative label: Amerikka, musiikki, historia, E-Amer. (789.7)
alternative label: Etelä-Amerikka, musiikki, historia (789.7)
alternative label: Amerika, musik, historia, Sydamerika (789.7) @sv
alternative label: Sydamerika, musik, historia (789.7) @sv
broader: URN:NBN:fi:au:hklj:789
in scheme: URN:NBN:fi:au:hklj:
notation: 789.7
preferred label: South America @en
preferred label: Sydamerika @sv
related: URN:NBN:fi:au:hklj:709
related: URN:NBN:fi:au:hklj:782.4
related: URN:NBN:fi:au:hklj:783
related: URN:NBN:fi:au:hklj:789.1
related: Pohjois-Amerikka
related: Väli-Amerikka
related: Karibianmeren saaret
scope note: Argentiina. Bolivia. Brasilia. Chile. Ecuador. Guyana. Kolumbia. Paraguay. Peru. Surinam. Uruguay. Venezuela Tässä myös Latinalaisen Amerikan musiikin historiaa koskevat yleisteokset
scope note: Argentina. Bolivia. Brasilien. Chile. Colombia. Ecuador. Franska Guayana. Guyana. Paraguay. Peru. Surinam. Uruguay. Venezuela Hit också allmänna verk som rör den latinamerikanska musikens historia @sv

Purjehdus. Soutu. Melonta
type: Class
type: Concept
subclass of: Liikunta. Urheilu
alternative label: Kanoottiretkeily (791.6)
alternative label: Kanoottiurheilu (791.6)
alternative label: Koskenlasku (791.6)
alternative label: Lainelaudat (791.6)
alternative label: Lainelautailu (791.6)
alternative label: Lautapurjehdus (791.6)
alternative label: Leijalautailu, purjelautailu (791.6)
alternative label: Melonta (791.6)
alternative label: Melontaretkeily (791.6)
alternative label: Purjeet, purjehdus (791.6)
alternative label: Purjehdus (791.6)
alternative label: Purjehdus, purjehdustaito (791.6)
alternative label: Purjehdus, purjehdusurheilu (791.6)
alternative label: Purjelaudat (791.6)
alternative label: Purjelautailu (791.6)
alternative label: Purjeveneily (791.6)
alternative label: Regatat, purjehdus (791.6)
alternative label: Soutu (791.6)
alternative label: Surfaus (791.6)
alternative label: Surffaus (791.6)
alternative label: Veneily, melonta (791.6)
alternative label: Veneily, purjehdus (791.6)
alternative label: Veneily, soutu (791.6)
alternative label: Vesihiihto (791.6)
alternative label: Vesiliikunta, purjehdus, soutu, melonta (791.6)
alternative label: Vesisukset (791.6)
alternative label: Vesiurheilu, purjehdus, soutu, melonta (791.6)
alternative label: Vuorovesi, purjehdus (791.6)
alternative label: Brädsegling (791.6) @sv
alternative label: Båtsport, paddling (791.6) @sv
alternative label: Båtsport, rodd (791.6) @sv
alternative label: Båtsport, segling (791.6) @sv
alternative label: Forsränning (791.6) @sv
alternative label: Kanotfärder (791.6) @sv
alternative label: Kanotsafarier (791.6) @sv
alternative label: Kanotsport (791.6) @sv
alternative label: Kitesurfing, brädsegling (791.6) @sv
alternative label: Paddling (791.6) @sv
alternative label: Regattor, segling (791.6) @sv
alternative label: Rodd (791.6) @sv
alternative label: Segel, segling (791.6) @sv
alternative label: Segelbräden (791.6) @sv
alternative label: Segelbåtsport (791.6) @sv
alternative label: Segling (791.6) @sv
alternative label: Segling, seglingskunskaper (791.6) @sv
alternative label: Segling, seglingssport (791.6) @sv
alternative label: Surfing (791.6) @sv
alternative label: Surfingbrädor (791.6) @sv
alternative label: Tidvatten, segling (791.6) @sv
alternative label: Vattenmotion, segling, rodd, paddling (791.6) @sv
alternative label: Vattenskidor (791.6) @sv
alternative label: Vattenskidåkning (791.6) @sv
alternative label: Vattensport, segling, rodd, paddling (791.6) @sv
alternative label: Vindsurfing (791.6) @sv
broader: Liikunta. Urheilu
in scheme: URN:NBN:fi:au:hklj:
notation: 791.6
preferred label: Sailing. Rowing. Canoeing @en
preferred label: Segling. Rodd. Kanotsport @sv
related: Vesiliikenne
related: Matkakuvaukset
related: Vesikulkuneuvot
related: URN:NBN:fi:au:hklj:625.72
related: Merenkulkuoppi
related: Liikuntatiede ja -tutkimus. Liikuntapolitiikka
related: Uinti. Sukellus
related: URN:NBN:fi:au:hklj:791.609
related: Moottoriveneurheilu
scope note: Purjehdus yleensä. Purjehdustaidot. Purjehdusoppaat Lainelautailu. Lainelaudat. Purjelautailu. Purjelaudat. Vesihiihto. Vesisukset. Jääpurjehdus. Koskenlasku Purjehdus ym. kilpa-, huippu-, kunto- ja vammaisurheilun kannalta Purjehdus- ym. -kilpailut, -säännöt ja -valmennus. Regatat Soutu- ja melontastadionit urheilun kannalta Purjehdus- ym. -seurat ja -järjestöt Jos teoksessa on sekä purjehdusta että merimatkan kuvausta, on etusija luokalla 462 Jos teoksessa on sekä purjehdusta, melontaa tai soutua että veneitä ja niiden tekniikkaa, on etusija luokalla 791.6
scope note: Segling i allmänhet. Seglingskunskap. Handböcker i segling Surfing. Surfingbrädor. Brädsegling (vindsurfing). Segelbrädor (vindsurfingbrädor). Vattenskidåkning. Vattenskidor. Issegling. Isjakter. Forsränning Segling och liknande sporter ur tävlings-, elit-, motions- och handikappidrottens synvinkel Segling och liknande sporter, regler, träning och redskap. Regattor Roddstadion och centrum för kanotsport ur sportens synvinkel Segelsällskap och segelförbund samt organisationer för relaterad sport Om verket både handlar om segling och skildrar sjöresor ges företräde åt klass 462 Om verket handlar om såväl segling, kanotsport eller rodd som båtar och deras teknik, ges företräde åt klass 791.6 @sv

Korttipelit. Pasianssit
type: Class
type: Concept
subclass of: Pelit
alternative label: Bridge (798.21)
alternative label: Canasta (798.21)
alternative label: Internet-pokeri (798.21)
alternative label: Kortit, pelikortit (798.21)
alternative label: Korttipelit (798.21)
alternative label: Nettipokeri (798.21)
alternative label: Pasianssit (798.21)
alternative label: Pelikortit (798.21)
alternative label: Pelit, korttipelit (798.21)
alternative label: Sambapeli (798.21)
alternative label: Skruuvipeli (798.21)
alternative label: Internetpoker (798.21) @sv
alternative label: Kort, spelkort (798.21) @sv
alternative label: Kortspel (798.21) @sv
alternative label: Nätpoker (798.21) @sv
alternative label: Onlinepoker (798.21) @sv
alternative label: Patienser (798.21) @sv
alternative label: Sambaspel (798.21) @sv
alternative label: Skruv, spel (798.21) @sv
alternative label: Spel, kortspel (798.21) @sv
alternative label: Spelkort (798.21) @sv
broader: Pelit
in scheme: URN:NBN:fi:au:hklj:
notation: 798.21
preferred label: Card games. Patience @en
preferred label: Kortspel. Patienser @sv
related: URN:NBN:fi:au:hklj:627.7
related: URN:NBN:fi:au:hklj:627.73
related: Muu näyttämö- tai draamamusiikki. Pelimusiikki
related: Palloilu
related: Muut joukkuepelit
related: Muut pallopelit
related: Leikit
related: Taikatemput
related: Tietokilpailut
related: Arpajaiset. Veikkaus. Uhkapeli
scope note: Korttipelien ja pasianssien peliohjeet ja säännöt Tässä esim. bridge, canasta, pokeri, samba ja skruuvi Tässä myös tietokoneelle sovelletut korttipelit ja pasianssit
scope note: Spelinstruktioner för kortspel och patienser Hit t.ex. bridge, canasta, poker, samba och skruv Hit också kortspel och patienser som spelas på dator @sv

Vanha aika
type: Class
type: Concept
subclass of: Yleinen kirjallisuudenhistoria
alternative label: Antiikki, kirjallisuudenhistoria (809.1)
alternative label: Vanha aika, kirjallisuuden historia (809.1)
alternative label: Antiken, litteraturhistoria (809.1) @sv
alternative label: Gamla tiden, litteraturhistoria (809.1) @sv
broader: Yleinen kirjallisuudenhistoria
in scheme: URN:NBN:fi:au:hklj:
notation: 809.1
preferred label: Antiquity @en
preferred label: Forntiden @sv
related: URN:NBN:fi:au:hklj:709
related: URN:NBN:fi:au:hklj:770.9
related: SUOMALAIS-UGRILAISTEN KIELTEN KIRJALLISUUDEN HISTORIA JA TUTKIMUS
related: GERMAANISTEN KIELTEN KIRJALLISUUDEN HISTORIA JA TUTKIMUS
related: ROMAANISTEN, SLAAVILAISTEN JA BALTTILAISTEN KIELTEN KIRJALLISUUDEN HISTORIA JA TUTKIMUS
related: MUIDEN KIELTEN KIRJALLISUUDEN HISTORIA JA TUTKIMUS
related: Kreikankielisen kirjallisuuden historia ja tutkimus
related: Latinankielisen kirjallisuuden historia ja tutkimus
related: URN:NBN:fi:au:hklj:919
related: Vanhan ajan kulttuurihistoria
scope note: Vanhan ajan kirjallisuuden historian ja tutkimuksen yleisteokset Euroopan vanhan ajan kirjallisuuden historian ja tutkimuksen yleisteokset Muiden maanosien vanhan ajan kirjallisuuden historian ja tutkimuksen yleisteokset Antiikin kirjallisuuden historian ja tutkimuksen yleisteokset Teokset, jotka koskevat sekä vanhan ajan kreikan- että latinankielistä kirjallisuutta
scope note: Allmänna verk om forntidens litteraturhistoria och forskning i forntidens litteratur Allmänna verk om den europeiska forntidens litteraturhistoria och forskning i den europeiska forntidens litteratur Allmänna verk om andra världsdelars forntida litteraturhistoria och forskning i deras forntida litteratur Allmänna verk om antikens litteraturhistoria och forskning i antikens litteratur Verk som handlar om både grekisk och latinsk litteratur under forntiden @sv

Ruotsin kielen etymologia ja onomastiikka
type: Class
type: Concept
subclass of: Ruotsin kieli
broader: Ruotsin kieli
in scheme: URN:NBN:fi:au:hklj:
notation: 872.2
preferred label: Swedish etymology and onomastics @en
preferred label: Svensk etymologi och onomastik @sv
related: URN:NBN:fi:au:hklj:188.4
related: Sähköposti. Verkkojuttelu
related: URN:NBN:fi:au:hklj:627.7512
related: Etymologia. Onomastiikka
related: URN:NBN:fi:au:hklj:860
related: Pohjoismaiset kielet
related: URN:NBN:fi:au:hklj:872.203
related: Ruotsin kielen murteet
related: Suomenruotsi
related: Ruotsin kielen historia
scope note: Sananselitysoppi. Nimistöntutkimus. Sanojen alkuperä ja johtaminen Nimien alkuperä, merkitys ja johtaminen Paikannimitutkimus. Henkilönnimitutkimus
scope note: Ordförklaringslära. Namnforskning. Ursprunget till och härledning av ord Ursprunget till, betydelsen av och härledning av namn Ortnamnsforskning. Personnamnsforskning @sv

Ruotsin kielen yksikieliset sanakirjat
type: Class
type: Concept
subclass of: Ruotsin kieli
alternative label: Riikinruotsi, sanakirjat, yksikieliset (872.3)
alternative label: Ruotsin kieli, sanakirjat, yksikieliset (872.3)
alternative label: Ruotsin ruotsi, sanakirjat, yksikieliset (872.3)
alternative label: Ruotsinruotsi, sanakirjat, yksikieliset (872.3)
alternative label: Rikssvenska, ordböcker, enspråkiga (872.3) @sv
alternative label: Svenska, ordböcker, enspråkiga (872.3) @sv
alternative label: Sverigesvenska, ordböcker, enspråkiga (872.3) @sv
broader: Ruotsin kieli
in scheme: URN:NBN:fi:au:hklj:
notation: 872.3
preferred label: Swedish dictionaries @en
preferred label: Enspråkiga svenska ordböcker @sv
related: URN:NBN:fi:au:hklj:188.4
related: Sähköposti. Verkkojuttelu
related: URN:NBN:fi:au:hklj:627.7512
related: Monikieliset sanakirjat. Sivistyssanakirjat
related: URN:NBN:fi:au:hklj:860
related: Pohjoismaiset kielet
related: URN:NBN:fi:au:hklj:872.03
related: URN:NBN:fi:au:hklj:872.203
related: URN:NBN:fi:au:hklj:872.603
related: URN:NBN:fi:au:hklj:872.703
scope note: Ruotsin kielen yleiset yksikieliset sanakirjat Erikoisalojen sanakirjat alan mukaisessa luokassa
scope note: Allmänna enspråkiga ordböcker över svenska Ordböcker över specialområden klassificeras enligt område @sv

Suomen kielen historia
type: Class
type: Concept
subclass of: Suomen kieli
alternative label: Alkukieli, suomen kielen historia (884.9)
alternative label: Historiallinen kielitiede, suomen kielen historia (884.9)
alternative label: Kantakieli, suomen kielen historia (884.9)
alternative label: Kantasuomi (884.9)
alternative label: Kielen kehityskaudet, suomen kielen historia (884.9)
alternative label: Kielihistoria, suomen kieli (884.9)
alternative label: Lainasanat, kielihistoria, suomi (884.9)
alternative label: Suomen kieli, kielihistoria (884.9)
alternative label: Vanha kirjasuomi (884.9)
alternative label: Finska, språkhistoria (884.9) @sv
alternative label: Historisk språkvetenskap, finska språkets historia (884.9) @sv
alternative label: Lånord, språkhistoria, finska (884.9) @sv
alternative label: Språkets utvecklingsstadier, finska språkets historia (884.9) @sv
alternative label: Språkhistoria, finska (884.9) @sv
alternative label: Urfinska (884.9) @sv
alternative label: Urspråk, alkukieli, finska språkets historia (884.9) @sv
alternative label: Urspråk, kantakieli, finska språkets historia (884.9) @sv
alternative label: Äldre finskt skriftspråk (884.9) @sv
broader: Suomen kieli
in scheme: URN:NBN:fi:au:hklj:
notation: 884.9
preferred label: Finnish language history @en
preferred label: Finsk språkhistoria @sv
related: URN:NBN:fi:au:hklj:188.4
related: Sähköposti. Verkkojuttelu
related: URN:NBN:fi:au:hklj:627.7512
related: Kielihistoria
related: URN:NBN:fi:au:hklj:872.709
related: Itämerensuomalaiset kielet
related: URN:NBN:fi:au:hklj:884.09
related: Suomen kielen etymologia ja onomastiikka
related: Suomen kielen murteet
related: URN:NBN:fi:au:hklj:884.609
scope note: Suomen kielen historian yleisteokset
scope note: Allmänna verk om finsk språkhistoria @sv

Kreikan muinaishistoria ja arkeologia
type: Class
type: Concept
subclass of: HISTORIAN TUTKIMUSMENETELMÄT. ARKEOLOGIA. KULTTUURIHISTORIA
alternative label: Aigeialainen kulttuuri (917)
alternative label: Aigeianmeren saaret, antiikin historia (917)
alternative label: Amfiteatterit, antiikin historia, Kreikka (917)
alternative label: Antiikki, arkeologia, Kreikka (917)
alternative label: Antiikki, historia, Kreikka (917)
alternative label: Antiikki, kulttuurihistoria, Kreikka (917)
alternative label: Arkeologia, antiikki, Kreikka (917)
alternative label: Ateena, antiikin historia ja arkeologia (917)
alternative label: Biografiat, hallitsijat ja kuninkaalliset (916 ... 989)
alternative label: Edelläkävijät, hallitsijat ja kuninkaalliset (916 ... 989)
alternative label: Elämäkerrat, hallitsijat ja kuninkaalliset (916 ... 989)
alternative label: Elämänhistoria, henkilöhistoria, hallitsijat ja kuninkaalliset (916 ... 989)
alternative label: Haastattelut, henkilöhistoria, hallitsijat ja kuninkaalliset (916 ... 989)
alternative label: Helleenit, Kreikan muinaishistoria (917)
alternative label: Hellenismi (917)
alternative label: Hellenistinen kulttuuri (917)
alternative label: Henkilöhistoria, hallitsijat ja kuninkaalliset (916 ... 989)
alternative label: Henkilökuvat, hallitsijat ja kuninkaalliset (916 ... 989)
alternative label: Henkilöt, hallitsijat ja kuninkaalliset (916 ... 989)
alternative label: Historia, henkilöhistoria, hallitsijat ja kuninkaalliset (916 ... 989)
alternative label: Hovit, hallitsijat ja kuninkaalliset (916 ... 989)
alternative label: Julkisuuden henkilöt, hallitsijat ja kuninkaalliset (916 ... 989)
alternative label: Kansalliset suurmiehet, hallitsijat ja kuninkaalliset (916 ... 989)
alternative label: Kaupunkivaltiot, Kreikan historia (917)
alternative label: Kirjeet, hallitsijat ja kuninkaalliset (916 ... 989)
alternative label: Klassillinen arkeologia, Kreikka (917)
alternative label: Klassinen arkeologia, Kreikka (917)
alternative label: Kreeta, antiikin historia (917)
alternative label: Kreeta, arkeologia (917)
alternative label: Kreetalais-mykeneläinen kulttuuri (917)
alternative label: Kreikka, arkeologia (917)
alternative label: Kreikka, historia, antiikki (917)
alternative label: Kykladinen kulttuuri (917)
alternative label: Lapsuus, hallitsijat ja kuninkaalliset (916 ... 989)
alternative label: Maahanmuuttajat, henkilöhistoria, hallitsijat ja kuninkaalliset (916 ... 989)
alternative label: Maanpako, henkilöhistoria, hallitsijat ja kuninkaalliset (916 ... 989)
alternative label: Makedonia, antiikin historia (917)
alternative label: Makedonia, arkeologia (917)
alternative label: Merkkihenkilöt, hallitsijat ja kuninkaalliset (916 ... 989)
alternative label: Minolainen kulttuuri (917)
alternative label: Muistelmat, hallitsijat ja kuninkaalliset (916 ... 989)
alternative label: Muistokirjoitukset, hallitsijat ja kuninkaalliset (916 ... 989)
alternative label: Mykeneläinen kulttuuri (917)
alternative label: Myöhäisantiikki, Kreikka (917)
alternative label: Nekrologit, hallitsijat ja kuninkaalliset (916 ... 989)
alternative label: Omaelämäkerrat, hallitsijat ja kuninkaalliset (916 ... 989)
alternative label: Pakolaiset, henkilöhistoria, hallitsijat ja kuninkaalliset (916 ... 989)
alternative label: Peloponnesos, antiikin historia (917)
alternative label: Päiväkirjat, hallitsijat ja kuninkaalliset (916 ... 989)
alternative label: Rakkauskirjeet, hallitsijat ja kuninkaalliset (916 ... 989)
alternative label: Rhodos, historia, antiikki (917)
alternative label: Sfinksit, Kreikan muinaishistoria (917)
alternative label: Siirtokunnat, antiikin Kreikan historia (917)
alternative label: Siirtolaiset, henkilöhistoria, hallitsijat ja kuninkaalliset (916 ... 989)
alternative label: Sisilia, antiikin historia (916 ... 917)
alternative label: Sparta, historia (917)
alternative label: Suurmiehet, hallitsijat ja kuninkaalliset (916 ... 989)
alternative label: Uranuurtajat, hallitsijat ja kuninkaalliset (916 ... 989)
alternative label: Vaihtoehtohistoria, henkilöhistoria, hallitsijat ja kuninkaalliset (916 ... 989)
alternative label: Vaihtoehtoinen historia, henkilöhistoria, hallitsijat ja kuninkaalliset (916 ... 989)
alternative label: Valtionpäämiehet, kuninkaalliset (916 ... 989)
alternative label: Varhaishistoria, antiikki, Kreikan historia (917)
broader: HISTORIAN TUTKIMUSMENETELMÄT. ARKEOLOGIA. KULTTUURIHISTORIA
in scheme: URN:NBN:fi:au:hklj:
notation: 917
related: Vanhan ajan filosofia
related: Kreikka
related: Antiikin taidehistoria
related: Kreikankielisen kirjallisuuden historia ja tutkimus
related: URN:NBN:fi:au:hklj:909
related: Vanhan ajan historia
related: URN:NBN:fi:au:hklj:919
related: Vanhan ajan kulttuurihistoria
related: Kreikan nykyhistoria
related: Makedonian historia
scope note: Antiikin Kreikan historia, arkeologia ja kulttuurihistoria Kaupunkivaltiot. Siirtokunnat Kreeta. Mykene. Ateena. Sparta. Makedonia. Hellenismi
scope note: Det antika Greklands historia, arkeologi och kulturhistoria Stadsstaterna. Kolonierna Kreta. Mykene. Aten. Sparta. Makedonien. Hellenismen @sv

Rooman valtakunnan historia ja arkeologia
type: Class
type: Concept
subclass of: HISTORIAN TUTKIMUSMENETELMÄT. ARKEOLOGIA. KULTTUURIHISTORIA
alternative label: Antiikki, arkeologia, Rooma (918)
alternative label: Antiikki, historia, Rooma (918)
alternative label: Antiikki, kulttuurihistoria, Rooma (918)
alternative label: Arkeologia, antiikki, Rooma (918)
alternative label: Biografiat, hallitsijat ja kuninkaalliset (916 ... 989)
alternative label: Edelläkävijät, hallitsijat ja kuninkaalliset (916 ... 989)
alternative label: Elämäkerrat, hallitsijat ja kuninkaalliset (916 ... 989)
alternative label: Elämänhistoria, henkilöhistoria, hallitsijat ja kuninkaalliset (916 ... 989)
alternative label: Esiroomalainen rautakausi, Rooman valtakunta (918)
alternative label: Etruskit, arkeologia (918)
alternative label: Etruskit, historia (918)
alternative label: Etruskologia (918)
alternative label: Gladiaattorit (918)
alternative label: Haastattelut, henkilöhistoria, hallitsijat ja kuninkaalliset (916 ... 989)
alternative label: Henkilöhistoria, hallitsijat ja kuninkaalliset (916 ... 989)
alternative label: Henkilökuvat, hallitsijat ja kuninkaalliset (916 ... 989)
alternative label: Henkilöt, hallitsijat ja kuninkaalliset (916 ... 989)
alternative label: Historia, henkilöhistoria, hallitsijat ja kuninkaalliset (916 ... 989)
alternative label: Hovit, hallitsijat ja kuninkaalliset (916 ... 989)
alternative label: Julkisuuden henkilöt, hallitsijat ja kuninkaalliset (916 ... 989)
alternative label: Kansalliset suurmiehet, hallitsijat ja kuninkaalliset (916 ... 989)
alternative label: Katakombit, Rooman historia (918)
alternative label: Kirjeet, hallitsijat ja kuninkaalliset (916 ... 989)
alternative label: Klassillinen arkeologia, Rooman valtakunta (918)
alternative label: Klassinen arkeologia, Rooman valtakunta (918)
alternative label: Lapsuus, hallitsijat ja kuninkaalliset (916 ... 989)
alternative label: Maahanmuuttajat, henkilöhistoria, hallitsijat ja kuninkaalliset (916 ... 989)
alternative label: Maanpako, henkilöhistoria, hallitsijat ja kuninkaalliset (916 ... 989)
alternative label: Merkkihenkilöt, hallitsijat ja kuninkaalliset (916 ... 989)
alternative label: Muistelmat, hallitsijat ja kuninkaalliset (916 ... 989)
alternative label: Muistokirjoitukset, hallitsijat ja kuninkaalliset (916 ... 989)
alternative label: Myöhäisantiikki, Rooman valtakunta (918)
alternative label: Nekrologit, hallitsijat ja kuninkaalliset (916 ... 989)
alternative label: Omaelämäkerrat, hallitsijat ja kuninkaalliset (916 ... 989)
alternative label: Pakolaiset, henkilöhistoria, hallitsijat ja kuninkaalliset (916 ... 989)
alternative label: Päiväkirjat, hallitsijat ja kuninkaalliset (916 ... 989)
alternative label: Rakkauskirjeet, hallitsijat ja kuninkaalliset (916 ... 989)
alternative label: Riemukaaret, Rooman historia (918)
alternative label: Rooma, Rooman valtakunta (918)
alternative label: Rooma, antiikin Rooma (918)
alternative label: Roomalainen rautakausi, Rooman valtakunta (918)
alternative label: Rooman valtakunta, arkeologia (918)
alternative label: Rooman valtakunta, historia (918)
alternative label: Siirtolaiset, henkilöhistoria, hallitsijat ja kuninkaalliset (916 ... 989)
alternative label: Suurmiehet, hallitsijat ja kuninkaalliset (916 ... 989)
alternative label: Uranuurtajat, hallitsijat ja kuninkaalliset (916 ... 989)
alternative label: Vaihtoehtohistoria, henkilöhistoria, hallitsijat ja kuninkaalliset (916 ... 989)
alternative label: Vaihtoehtoinen historia, henkilöhistoria, hallitsijat ja kuninkaalliset (916 ... 989)
alternative label: Valtionpäämiehet, kuninkaalliset (916 ... 989)
alternative label: Varhaishistoria, antiikki, Rooman historia (918)
alternative label: Alternativ historia, personhistoria, regenter och kungligheter (916 ... 989) @sv
alternative label: Antiken, arkeologi, Rom (918) @sv
alternative label: Antiken, historia, Rom (918) @sv
alternative label: Antiken, kulturhistoria, Rom (918) @sv
alternative label: Arkeologi, antiken, Rom (918) @sv
alternative label: Barndom, regenter och kungligheter (916 ... 989) @sv
alternative label: Bemärkta personer, regenter och kungligheter (916 ... 989) @sv
alternative label: Biografier, regenter och kungligheter (916 ... 989) @sv
alternative label: Brev, regenter och kungligheter (916 ... 989) @sv
alternative label: Dagböcker, regenter och kungligheter (916 ... 989) @sv
alternative label: Etrusker, arkeologi (918) @sv
alternative label: Etrusker, historia (918) @sv
broader: HISTORIAN TUTKIMUSMENETELMÄT. ARKEOLOGIA. KULTTUURIHISTORIA
in scheme: URN:NBN:fi:au:hklj:
notation: 918
related: Vanhan ajan filosofia
related: Italia
related: Rooma
related: Antiikin taidehistoria
related: Latinankielisen kirjallisuuden historia ja tutkimus
related: URN:NBN:fi:au:hklj:909
related: Vanhan ajan historia
related: URN:NBN:fi:au:hklj:919
related: Vanhan ajan kulttuurihistoria
related: Italian historia
scope note: Antiikin Rooman valtakunnan historia, arkeologia ja kulttuurihistoria Etruskien historia, arkeologia ja kulttuurihistoria
scope note: Det antika romarrikets historia, arkeologi och kulturhistoria Etruskernas historia, arkeologi och kulturhistoria @sv

Ruotsin historia 1810-
type: Class
type: Concept
subclass of: URN:NBN:fi:au:hklj:930
alternative label: Hollikyyti, Ruotsin historia (931 ... 936)
alternative label: Kruununkyyti, Ruotsin historia (931 ... 936)
alternative label: Kyytilaitos, Ruotsin historia (931 ... 936)
alternative label: Reservikyyti, Ruotsin historia (931 ... 936)
alternative label: Ruotsalaiset, Ruotsi, historia (931 ... 936)
alternative label: Ruotsi, historia (931 ... 936)
alternative label: Hållskjuts, Sveriges historia (931 ... 936) @sv
alternative label: Kronoskjuts, Sveriges historia (931 ... 936) @sv
alternative label: Skjutsväsen, Sveriges historia (931 ... 936) @sv
alternative label: Skjutsväsendet, Sveriges historia (931 ... 936) @sv
alternative label: Svenskar, Sverige, historia (931 ... 936) @sv
alternative label: Sverige, historia (931 ... 936) @sv
broader: URN:NBN:fi:au:hklj:930
in scheme: URN:NBN:fi:au:hklj:
narrower: Ruotsin historia 1810-1913
narrower: Ruotsin historia 1914-1938
narrower: Ruotsin historia 1939-
notation: 935
preferred label: Sweden’s history 1810– @en
preferred label: Sveriges historia 1810– @sv
related: Ruotsi
related: URN:NBN:fi:au:hklj:989

Irlannin historia
type: Class
type: Concept
subclass of: BRITTEIN SAARTEN HISTORIA
alternative label: Irlanti, historia (958 +)
alternative label: Irland, historia (958 +) @sv
broader: BRITTEIN SAARTEN HISTORIA
in scheme: URN:NBN:fi:au:hklj:
narrower: Irlannin tasavallan eli Eiren historia
narrower: Pohjois-Irlannin historia
notation: 958
preferred label: Ireland's history @en
preferred label: Irlands historia @sv
related: Brittein saaret
related: Irlanti
related: Irlannin tasavalta, Eire
related: Pohjois-Irlanti
related: URN:NBN:fi:au:hklj:909
related: URN:NBN:fi:au:hklj:919
scope note: Irlannin historian ja arkeologian yleisteokset
scope note: Allmänna verk om Irlands arkeologi och historia @sv

Ukrainan historia
type: Class
type: Concept
subclass of: Ukrainan, Valko-Venäjän ja Moldovan historia
alternative label: Ukraina, historia (971.91)
alternative label: Venäläistämispolitiikka, Ukrainan historia (971.91)
alternative label: Förryskningspolitik, Ukrainas historia (971.91) @sv
broader: Ukrainan, Valko-Venäjän ja Moldovan historia
in scheme: URN:NBN:fi:au:hklj:
notation: 971.91
preferred label: History of the Ukraine @en
preferred label: Ukrainas historia @sv
related: Menetetty Karjalan alue
related: Lappi
related: Ukraina
related: Armenia. Azerbaidzan. Georgia. Kazakstan. Kirgisia. Tadzikistan. Turkmenistan. Uzbekistan
related: URN:NBN:fi:au:hklj:909
related: URN:NBN:fi:au:hklj:919
related: Neuvostoliiton historia 1917-1991
related: Venäjän historia 1992-
related: Aasian historia
related: URN:NBN:fi:au:hklj:989
scope note: Tässä myös Krimin historia
scope note: Hit också Krims historia @sv

Valko-Venäjän historia
type: Class
type: Concept
subclass of: Ukrainan, Valko-Venäjän ja Moldovan historia
alternative label: Valko-Venäjä, historia (971.92)
alternative label: Venäläistämispolitiikka, Valko-Venäjän historia (971.92)
alternative label: Förryskningspolitik, Vitrysslands historia (971.92) @sv
alternative label: Vitryssland, historia (971.92) @sv
broader: Ukrainan, Valko-Venäjän ja Moldovan historia
in scheme: URN:NBN:fi:au:hklj:
notation: 971.92
preferred label: History of Belorussia @en
preferred label: Vitrysslands historia @sv
related: Menetetty Karjalan alue
related: Lappi
related: Valko-Venäjä
related: Armenia. Azerbaidzan. Georgia. Kazakstan. Kirgisia. Tadzikistan. Turkmenistan. Uzbekistan
related: URN:NBN:fi:au:hklj:909
related: URN:NBN:fi:au:hklj:919
related: Neuvostoliiton historia 1917-1991
related: Venäjän historia 1992-
related: Aasian historia
related: URN:NBN:fi:au:hklj:989

Moldovan historia
type: Class
type: Concept
subclass of: Ukrainan, Valko-Venäjän ja Moldovan historia
alternative label: Venäläistämispolitiikka, Moldovan historia (971.93)
alternative label: Förryskningspolitik, Moldova, historia (971.93) @sv
broader: Ukrainan, Valko-Venäjän ja Moldovan historia
in scheme: URN:NBN:fi:au:hklj:
notation: 971.93
preferred label: History of Moldova @en
preferred label: Moldovas historia @sv
related: Menetetty Karjalan alue
related: Lappi
related: Moldova
related: Armenia. Azerbaidzan. Georgia. Kazakstan. Kirgisia. Tadzikistan. Turkmenistan. Uzbekistan
related: URN:NBN:fi:au:hklj:909
related: URN:NBN:fi:au:hklj:919
related: Neuvostoliiton historia 1917-1991
related: Venäjän historia 1992-
related: Aasian historia
related: URN:NBN:fi:au:hklj:989

Etu-Aasian historia
type: Class
type: Concept
subclass of: Aasian historia
alternative label: Afganistan, historia (981.1)
alternative label: Arabia, nykyhistoria (981.1)
alternative label: Arabiemiirikunnat, historia (981.1)
alternative label: Bahrain, historia (981.1)
alternative label: Etelä-Jemen, historia (981.1)
alternative label: Etu-Aasia, historia, nykyajan (981.1 +)
alternative label: Irak, historia (981.1)
alternative label: Iran, historia (981.1)
alternative label: Jemen, historia (981.1)
alternative label: Jordania, historia (981.1)
alternative label: Kurdistan, historia (981.1)
alternative label: Kurdit, Kurdistanin historia (981.1)
alternative label: Kuwait, historia (981.1)
alternative label: Kypros, nykyhistoria (981.1)
alternative label: Laos, historia (981.1)
alternative label: Libanon, historia (981.1)
alternative label: Lähi-Itä, historia (981.1 +)
alternative label: Oman, historia (981.1)
alternative label: Osmanit, Turkki (981.1)
alternative label: Ottomaanit, Turkki (981.1)
alternative label: Persia, historia vuodesta 642 j.Kr. (981.1)
alternative label: Qatar, historia (981.1)
alternative label: Saraseenit, arabit, Etu-Aasian historia (981.1)
alternative label: Saudi-Arabia, historia (981.1)
alternative label: Syyria, historia vuodesta 636 j.Kr. (981.1)
alternative label: Turkki, historia, nykyaika (981.1)
alternative label: Vähä-Aasia, historia vuodesta 395 j.Kr. (981.1 +)
alternative label: Afghanistan, historia (981.1) @sv
alternative label: Arabemiraten, historia (981.1) @sv
alternative label: Arabien, nutidshistoria (981.1) @sv
alternative label: Cypern, nutidshistoria (981.1) @sv
alternative label: Främre Asien, historia, nutidens (981.1 +) @sv
alternative label: Jordanien, historia (981.1) @sv
alternative label: Kurder, Kurdistans historia (981.1) @sv
alternative label: Mellanöstern, historia (981.1 +) @sv
alternative label: Mindre Asien, historia från år 395 e.Kr. (981.1 +) @sv
alternative label: Osmaner, Turkiet (981.1) @sv
alternative label: Ottomaner, Turkiet (981.1) @sv
alternative label: Persien, historia från år 642 e.Kr. (981.1) @sv
alternative label: Saracener, araber, Främre Asiens historia (981.1) @sv
alternative label: Saudi-Arabien, historia (981.1) @sv
alternative label: Sydjemen, historia (981.1) @sv
alternative label: Syrien, historia från år 636 e.Kr. (981.1) @sv
alternative label: Turkiet, historia, nutiden (981.1) @sv
broader: Aasian historia
in scheme: URN:NBN:fi:au:hklj:
narrower: Israelin ja Palestiinan historia
notation: 981.1
preferred label: South-West Asia's history @en
preferred label: Främre Asiens historia @sv
related: AASIA
related: Etu-Aasia
related: Turkki
related: Kypros
related: Israel. Palestiina
related: Egyptin ja Etu-Aasian muinaishistoria ja arkeologia
scope note: Etu-Aasian historian yleisteokset Afganistanin, Arabiemiirikunnat, Bahrainin, Irakin, Iranin, Jemenin, Jordanian, Kuwaitin, Kyproksen, Libanonin, Omanin, Qatarin, Saudi-Arabian, Syyrian ja Turkin historia Tässä myös Kurdistanin historia
scope note: Allmänna verk om Främre Asiens historia Afghanistans, Bahrains, Cyperns, Förenade Arabemiratens, Iraks, Irans, Israels, Jordaniens, Kuwaits, Libanons, Omans, Qatars, Saudiarabiens, Syriens, Turkiets och Yemens historia Hit också Kurdistans historia @sv

Keski- ja Itä-Aasian historia
type: Class
type: Concept
subclass of: Aasian historia
alternative label: Etelä-Korea, historia (981.4)
alternative label: Hongkong, historia (981.4)
alternative label: Itä-Aasia, historia (981.4)
alternative label: Jaettu valtio, Korean historia (981.4)
alternative label: Kaukoitä, historia (981.4)
alternative label: Keski-Aasia, historia (981.4)
alternative label: Kiina, historia (981.4)
alternative label: Korea, historia (981.4)
alternative label: Korean kansantasavalta, historia (981.4)
alternative label: Korean tasavalta, historia (981.4)
alternative label: Macao, historia (981.4)
alternative label: Mantsuria, historia (981.4)
alternative label: Mongolia, historia (981.4)
alternative label: Pohjois-Korea, historia (981.4)
alternative label: Sinologia (981.4)
alternative label: Sinologia, Kiinan kulttuurihistoria (981.4)
alternative label: Taiwan, historia (981.4)
alternative label: Tiibet, historia (981.4)
alternative label: Toukokuun neljännen päivän liike, Kiina, historia (981.4 +)
alternative label: Turkestan, historia (981.4)
alternative label: Centralasien, historia (981.4) @sv
alternative label: Delad stat, Koreas historia (981.4) @sv
alternative label: Fjärde maj-rörelsen, Kina, historia (981.4 +) @sv
alternative label: Fjärran Östern, historia (981.4) @sv
alternative label: Folkrepubliken Korea, historia (981.4) @sv
alternative label: Kina, historia (981.4) @sv
alternative label: Manchuriet, historia (981.4) @sv
alternative label: Mongolien, historia (981.4) @sv
alternative label: Nordkorea, historia (981.4) @sv
alternative label: Ostasien, historia (981.4) @sv
alternative label: Republiken Korea, historia (981.4) @sv
alternative label: Sinologi (981.4) @sv
alternative label: Sinologi, Kina, kulturhistoria (981.4) @sv
alternative label: Sydkorea, historia (981.4) @sv
alternative label: Tibet, historia (981.4) @sv
broader: Aasian historia
in scheme: URN:NBN:fi:au:hklj:
notation: 981.4
preferred label: Central Asia's and East Asia's history @en
preferred label: Centralasiens och Ostasiens historia @sv
related: AASIA
related: Keski-Aasia
related: Korea
related: Kiina
related: Vanhan ajan historia
related: Vanhan ajan kulttuurihistoria
related: BRITTEIN SAARTEN HISTORIA
related: Japanin historia
related: Armenian, Azerbaidzanin, Georgian, Kazakstanin, Kirgisian, Tadzikistanin, Turkmenistanin ja Uzbekistanin historia
scope note: Hongongin, Kiinan, Korean, Macaon, Mongolian. Taiwanin ja Tiibetin historia Keski- ja Itä-Aasian historian yleisteokset
scope note: Hongkongs, Kinas, Koreas, Macaus, Mongoliets, Taiwans och Tibets historia Allmänna verk om Centralasiens och Ostasiens historia @sv

Amerikan historia
type: Class
type: Concept
subclass of: MUIDEN MAANOSIEN HISTORIA
alternative label: Afroamerikkalaiset, Amerikka, historia (987 ... 988)
alternative label: Amerikka, eskimot, historia (987 +)
alternative label: Amerikka, historia (987 ... 988)
alternative label: Amerikka, intiaanit, historia (987 ... 988)
alternative label: Eskimot, historia (987 +)
alternative label: Intiaanikulttuurit (987 ... 988)
alternative label: Intiaanipäälliköt, historia (987 ... 988)
alternative label: Intiaanisodat (987)
alternative label: Intiaanisodat, Pohjois-Amerikka (987)
alternative label: Intiaanit, historia (987 ... 988)
alternative label: Intiaanit, kulttuurihistoria (987 ... 988)
alternative label: Inuitit, historia (987 +)
alternative label: Maanosat, Amerikka, historia (987)
alternative label: Pawneet, intiaanit (987 ... 988)
alternative label: Pohjois-Amerikka, eskimot, historia (987 +)
alternative label: Pohjois-Amerikka, historia (987 +)
alternative label: Pohjois-Amerikka, intiaanit, historia (987 +)
alternative label: Pohjoisamerikkalaiset, historia (987 +)
alternative label: Prekolumbiaaninen aika, intiaanit, historia (987 ... 988 +)
alternative label: Uudisasukkaat, villi länsi (987 +)
alternative label: Uudisasutus, villi länsi (987 +)
alternative label: Afroamerikaner, Amerika, historia (987 ... 988) @sv
alternative label: Amerika, eskimåer, historia (987 +) @sv
alternative label: Amerika, historia (987 ... 988) @sv
alternative label: Amerika, indianer, historia (987 ... 988) @sv
alternative label: Eskimåer, historia (987 +) @sv
alternative label: Förkolumbiansk tid, indianer, historia (987 ... 988 +) @sv
alternative label: Indianer, historia (987 ... 988) @sv
alternative label: Indianer, kulturhistoria (987 ... 988) @sv
alternative label: Indianhövdingar, historia (987 ... 988) @sv
alternative label: Indiankrig (987) @sv
alternative label: Indiankrig, Nordamerika (987) @sv
alternative label: Indiankulturer (987 ... 988) @sv
alternative label: Inuiter, historia (987 +) @sv
alternative label: Nordamerika, eskimåer, historia (987 +) @sv
alternative label: Nordamerika, historia (987 +) @sv
alternative label: Nordamerika, indianer, historia (987 +) @sv
alternative label: Nordamerikaner, historia (987 +) @sv
alternative label: Nybyggare, vilda västern (987 +) @sv
alternative label: Nybyggarsamhälle, vilda västern (987 +) @sv
alternative label: Pawneer, indianer, historia (987 ... 988) @sv
alternative label: Världsdelar, Amerika, historia (987) @sv
broader: MUIDEN MAANOSIEN HISTORIA
in scheme: URN:NBN:fi:au:hklj:
narrower: Kanadan historia
narrower: Yhdysvaltojen historia
narrower: Keski-Amerikan historia
notation: 987
preferred label: History of the Americas @en
preferred label: Amerikas historia @sv
related: URN:NBN:fi:au:hklj:371.909
related: AMERIKKA
related: Pohjois-Amerikka
scope note: Amerikan historian yleisteokset. Pohjois-Amerikan historian yleisteokset Tässä ja alaluokissa myös intiaanien sekä eskimoiden eli inuiittien yleinen historia
scope note: Allmänna verk om Amerikas historia. Allmänna verk om Nordamerikas historia Hit och till underklasserna också indianernas och eskimåernas (inuiternas) allmänna historia @sv

Vironkielinen kaunokirjallisuus (Kaunoluokka)
type: Class
type: Concept
type: FormClass
subclass of: SUOMENKIELINEN KAUNOKIRJALLISUUS (Kaunoluokka)
broader: SUOMENKIELINEN KAUNOKIRJALLISUUS (Kaunoluokka)
in scheme: URN:NBN:fi:au:hklj:
narrower: Vironkieliset kansanrunot (Kaunoluokka)
narrower: Vironkieliset runot (Kaunoluokka)
narrower: Vironkieliset näytelmät ja kuunnelmat (Kaunoluokka)
narrower: Vironkieliset romaanit, novellit ja näytelmäelokuvat (Kaunoluokka)
narrower: Vironkieliset sadut, kuvakirjat ja sarjakuvat (Kaunoluokka)
notation: 1.8
preferred label: Estonian fiction (Fiction class) @en
preferred label: Estnisk skönlitteratur (Skönklass) @sv
scope note: Kaunokirjalliset sekasisältöiset kokoelmat, valikoimat, antologiat, lukemistot, lukukirjat, ohjelmistot ja aapiset Jos teos painottuu johonkin kaunokirjallisuuden lajiin, on etusija kirjallisuuden lajin mukaisella luokalla
scope note: Skönlitterära samlade verk, verk i urval, antologier, textböcker, läseböcker, program och ABC-böcker med blandat innehåll, Om någon skönlitterär genre dominerar i verket ges företräde åt klassen för den litterära genren i fråga @sv

Unkarinkielinen kaunokirjallisuus (Kaunoluokka)
type: Class
type: Concept
type: FormClass
subclass of: Muiden suomalais-ugrilaisten kielten kaunokirjallisuus (Kaunoluokka)
broader: Muiden suomalais-ugrilaisten kielten kaunokirjallisuus (Kaunoluokka)
in scheme: URN:NBN:fi:au:hklj:
narrower: Unkarinkieliset kansanrunot (Kaunoluokka)
narrower: Unkarinkieliset runot (Kaunoluokka)
narrower: Unkarinkieliset näytelmät ja kuunnelmat (Kaunoluokka)
narrower: Unkarinkieliset romaanit, novellit ja näytelmäelokuvat (Kaunoluokka)
narrower: Unkarinkieliset sadut, kuvakirjat ja sarjakuvat (Kaunoluokka)
notation: 1.94
preferred label: Hungarian fiction (Fiction class) @en
preferred label: Ungersk skönlitteratur (Skönklass) @sv
scope note: Kaunokirjalliset sekasisältöiset kokoelmat, valikoimat, antologiat, lukemistot, lukukirjat, ohjelmistot ja aapiset Jos teos painottuu johonkin kaunokirjallisuuden lajiin, on etusija kirjallisuuden lajin mukaisella luokalla
scope note: Skönlitterära samlade verk, verk i urval, antologier, textböcker, läseböcker, program och ABC-böcker med blandat innehåll, Om någon skönlitterär genre dominerar i verket ges företräde åt klassen för den litterära genren i fråga @sv

ENGLANNINKIELINEN KAUNOKIRJALLISUUS (Kaunoluokka)
type: Class
type: Concept
type: FormClass
subclass of: Kaunoluokat
broader: Kaunoluokat
in scheme: URN:NBN:fi:au:hklj:
narrower: Englanninkieliset kansanrunot (Kaunoluokka)
narrower: Englanninkieliset runot (Kaunoluokka)
narrower: Englanninkieliset näytelmät ja kuunnelmat (Kaunoluokka)
narrower: Englanninkieliset romaanit, novellit ja näytelmäelokuvat (Kaunoluokka)
narrower: Englanninkieliset sadut (Kaunoluokka)
notation: 4
preferred label: ENGLISH FICTION (Fiction class) @en
preferred label: ENGELSK SKÖNLITTERATUR (Skönklass) @sv
scope note: Kaunokirjallisuuden luokissa teokset ovat julkaisun kielen, eivät julkaisumaan tai alkuteoksen kielen mukaisessa luokassa Jos kaksikielisen teoksen toinen kieli on käännöskieli, on teos käännöskielen mukaisessa luokassa Jos kaksi- tai useampikielisen teoksen tekstit eivät ole toistensa käännöksiä, on teos julkaisun pääkielen mukaisessa luokassa Jos teoksella ei ole pääkieltä, se on julkaisun ensimmäisen kielen mukaisessa luokassa Fiktiiviset video- ja elokuvatallenteet ovat kaunokirjallisuuden luokissa, näytelmäelokuvat romaanien luokissa, näytelmäesitysten tallenteet näytelmien luokissa, satuelokuvat satujen luokissa sekä piirretyt, nukke- ja animaatioelokuvat sarjakuvien luokissa Tekstitetyt elokuva- ja videotallenteet ovat tekstityskielen mukaisessa luokassa Elokuvakäsikirjoitukset ovat elokuvan historian luokassa 777.9+ Kaunokirjalliset äänitteet ovat kaunokirjallisuuden luokissa, kuunnelmat näytelmien luokissa ja ääneen luettu kirjallisuus ko. kirjallisuudenlajin luokissa Tässä kaunokirjalliset sekasisältöiset kokoelmat, valikoimat, antologiat, lukemistot, lukukirjat, ohjelmistot ja aapiset Jos teos painottuu johonkin kaunokirjallisuuden lajiin, on etusija kirjallisuuden lajin mukaisella luokalla
scope note: I klasserna för skönlitteraturen klassificeras verken enligt publikationens språk, inte enligt klassen för utgivningslandets eller originaltitelns språk Om det ena språket i ett tvåspråkigt verk år översättningsspråk klassificeras verket enligt översättningsspråket Om texterna i ett tvåspråkigt eller flerspråkigt verk inte är översättningar av varandra klassificeras verket enligt publikationens huvudspråk Om verket inte har något huvudspråk klassificeras det enligt det första språket i publikationen Fiktiva videoinspelningar och filminspelningar förs till de skönlitteraära klasserna; spelfiler förs till klasserna för romaner, inspelningar av teaterföreställningar förs till klasserna för drama, sagofilmer förs till klasserna för sagor och tecknade filmer, dockfilmer samt animationsfilmer förs till klasserna för tecknade serier Textade videoinspelningar och filminspelningar klassificeras enligt textningens språk Filmmanus förs till klassen för filmens historia 777.9+ Ljudupptagningar med skönlitteratur förs till de skönlitterära klasserna; hörspel förs till klasserna för drama och inläst litteratur klassificeras enligt litterärt temaområde eller genre Hit skönlitterära samlade verk, verk i urval, antologier, textböcker, läseböcker, program och ABC-böcker med blandat innehåll, Om någon skönlitterär genre dominerar i verket ges företräde åt klassen för den litterära genren i fråga @sv

RANSKANKIELINEN KAUNOKIRJALLISUUS (Kaunoluokka)
type: Class
type: Concept
type: FormClass
subclass of: Kaunoluokat
broader: Kaunoluokat
in scheme: URN:NBN:fi:au:hklj:
narrower: Ranskankieliset kansanrunot (Kaunoluokka)
narrower: Ranskankieliset runot (Kaunoluokka)
narrower: Ranskankieliset näytelmät ja kuunnelmat (Kaunoluokka)
narrower: Ranskankieliset romaanit, novellit ja näytelmäelokuvat (Kaunoluokka)
narrower: Ranskankieliset sadut (Kaunoluokka)
notation: 5
preferred label: FRENCH FICTION (Fiction class) @en
preferred label: FRANSK SKÖNLITTERATUR (Skönklass) @sv
scope note: Kaunokirjallisuuden luokissa teokset ovat julkaisun kielen, eivät julkaisumaan tai alkuteoksen kielen mukaisessa luokassa Jos kaksikielisen teoksen toinen kieli on käännöskieli, on teos käännöskielen mukaisessa luokassa Jos kaksi- tai useampikielisen teoksen tekstit eivät ole toistensa käännöksiä, on teos julkaisun pääkielen mukaisessa luokassa Jos teoksella ei ole pääkieltä, se on julkaisun ensimmäisen kielen mukaisessa luokassa Fiktiiviset video- ja elokuvatallenteet ovat kaunokirjallisuuden luokissa, näytelmäelokuvat romaanien luokissa, näytelmäesitysten tallenteet näytelmien luokissa, satuelokuvat satujen luokissa sekä piirretyt, nukke- ja animaatioelokuvat sarjakuvien luokissa Tekstitetyt elokuva- ja videotallenteet ovat tekstityskielen mukaisessa luokassa Elokuvakäsikirjoitukset ovat elokuvan historian luokassa 777.9+ Kaunokirjalliset äänitteet ovat kaunokirjallisuuden luokissa, kuunnelmat näytelmien luokissa ja ääneen luettu kirjallisuus ko. kirjallisuudenlajin luokissa Tässä kaunokirjalliset sekasisältöiset kokoelmat, valikoimat, antologiat, lukemistot, lukukirjat, ohjelmistot ja aapiset Jos teos painottuu johonkin kaunokirjallisuuden lajiin, on etusija kirjallisuuden lajin mukaisella luokalla
scope note: I klasserna för skönlitteraturen klassificeras verken enligt publikationens språk, inte enligt klassen för utgivningslandets eller originaltitelns språk Om det ena språket i ett tvåspråkigt verk år översättningsspråk klassificeras verket enligt översättningsspråket Om texterna i ett tvåspråkigt eller flerspråkigt verk inte är översättningar av varandra klassificeras verket enligt publikationens huvudspråk Om verket inte har något huvudspråk klassificeras det enligt det första språket i publikationen Fiktiva videoinspelningar och filminspelningar förs till de skönlitteraära klasserna; spelfiler förs till klasserna för romaner, inspelningar av teaterföreställningar förs till klasserna för drama, sagofilmer förs till klasserna för sagor och tecknade filmer, dockfilmer samt animationsfilmer förs till klasserna för tecknade serier Textade videoinspelningar och filminspelningar klassificeras enligt textningens språk Filmmanus förs till klassen för filmens historia 777.9+ Ljudupptagningar med skönlitteratur förs till de skönlitterära klasserna; hörspel förs till klasserna för drama och inläst litteratur klassificeras enligt litterärt temaområde eller genre Hit skönlitterära samlade verk, verk i urval, antologier, textböcker, läseböcker, program och ABC-böcker med blandat innehåll, Om någon skönlitterär genre dominerar i verket ges företräde åt klassen för den litterära genren i fråga @sv

ITALIANKIELINEN KAUNOKIRJALLISUUS (Kaunoluokka)
type: Class
type: Concept
type: FormClass
subclass of: Kaunoluokat
broader: Kaunoluokat
in scheme: URN:NBN:fi:au:hklj:
narrower: Italiankieliset kansanrunot (Kaunoluokka)
narrower: Italiankieliset runot (Kaunoluokka)
narrower: Italiankieliset näytelmät ja kuunnelmat (Kaunoluokka)
narrower: Italiankieliset romaanit, novellit ja näytelmäelokuvat (Kaunoluokka)
narrower: Italiankieliset sadut (Kaunoluokka)
notation: 6
preferred label: ITALIAN FICTION (Fiction class) @en
preferred label: ITALIENSK SKÖNLITTERATUR (Skönklass) @sv
scope note: Kaunokirjallisuuden luokissa teokset ovat julkaisun kielen, eivät julkaisumaan tai alkuteoksen kielen mukaisessa luokassa Jos kaksikielisen teoksen toinen kieli on käännöskieli, on teos käännöskielen mukaisessa luokassa Jos kaksi- tai useampikielisen teoksen tekstit eivät ole toistensa käännöksiä, on teos julkaisun pääkielen mukaisessa luokassa Jos teoksella ei ole pääkieltä, se on julkaisun ensimmäisen kielen mukaisessa luokassa Fiktiiviset video- ja elokuvatallenteet ovat kaunokirjallisuuden luokissa, näytelmäelokuvat romaanien luokissa, näytelmäesitysten tallenteet näytelmien luokissa, satuelokuvat satujen luokissa sekä piirretyt, nukke- ja animaatioelokuvat sarjakuvien luokissa Tekstitetyt elokuva- ja videotallenteet ovat tekstityskielen mukaisessa luokassa Elokuvakäsikirjoitukset ovat elokuvan historian luokassa 777.9+ Kaunokirjalliset äänitteet ovat kaunokirjallisuuden luokissa, kuunnelmat näytelmien luokissa ja ääneen luettu kirjallisuus ko. kirjallisuudenlajin luokissa Tässä kaunokirjalliset sekasisältöiset kokoelmat, valikoimat, antologiat, lukemistot, lukukirjat, ohjelmistot ja aapiset Jos teos painottuu johonkin kaunokirjallisuuden lajiin, on etusija kirjallisuuden lajin mukaisella luokalla
scope note: I klasserna för skönlitteraturen klassificeras verken enligt publikationens språk, inte enligt klassen för utgivningslandets eller originaltitelns språk Om det ena språket i ett tvåspråkigt verk år översättningsspråk klassificeras verket enligt översättningsspråket Om texterna i ett tvåspråkigt eller flerspråkigt verk inte är översättningar av varandra klassificeras verket enligt publikationens huvudspråk Om verket inte har något huvudspråk klassificeras det enligt det första språket i publikationen Fiktiva videoinspelningar och filminspelningar förs till de skönlitteraära klasserna; spelfiler förs till klasserna för romaner, inspelningar av teaterföreställningar förs till klasserna för drama, sagofilmer förs till klasserna för sagor och tecknade filmer, dockfilmer samt animationsfilmer förs till klasserna för tecknade serier Textade videoinspelningar och filminspelningar klassificeras enligt textningens språk Filmmanus förs till klassen för filmens historia 777.9+ Ljudupptagningar med skönlitteratur förs till de skönlitterära klasserna; hörspel förs till klasserna för drama och inläst litteratur klassificeras enligt litterärt temaområde eller genre Hit skönlitterära samlade verk, verk i urval, antologier, textböcker, läseböcker, program och ABC-böcker med blandat innehåll, Om någon skönlitterär genre dominerar i verket ges företräde åt klassen för den litterära genren i fråga @sv

Uni
type: Class
type: Concept
subclass of: Tiedostamaton sielunelämä
alternative label: Hidasaaltouni (121.91)
alternative label: Nukkuminen (121.91)
alternative label: Painajaiset, unitutkimus (121.91)
alternative label: Päiväunet (121.91)
alternative label: REM-uni (121.91)
alternative label: Selkounet, unitutkimus (121.91)
alternative label: Unet, unitutkimus (121.91)
alternative label: Uni (121.91)
alternative label: Uni, unitutkimus (121.91)
alternative label: Unissakävely (121.91)
alternative label: Unissapuhuminen (121.91)
alternative label: Unitutkimus (121.91)
alternative label: Valvetila, unitila (121.91)
alternative label: Vilkeuni (121.91)
alternative label: Dagssömn (121.91) @sv
alternative label: Drömmar, sömnforskning (121.91) @sv
alternative label: Klardrömmar, sömnforskning (121.91) @sv
alternative label: Mardrömmar, sömnforskning (121.91) @sv
alternative label: Ortosömn (121.91) @sv
alternative label: Parasömn (121.91) @sv
alternative label: REM-sömn (121.91) @sv
alternative label: Sovande (121.91) @sv
alternative label: Sömn, uni (121.91) @sv
alternative label: Sömn, uni, sömnforskning (121.91) @sv
alternative label: Sömnforskning (121.91) @sv
alternative label: Sömngång (121.91) @sv
alternative label: Sömnprat (121.91) @sv
alternative label: Vaket tillstånd, sovande tillstånd (121.91) @sv
broader: Tiedostamaton sielunelämä
in scheme: URN:NBN:fi:au:hklj:
notation: 121.91
preferred label: Sleep and dreams @en
preferred label: Sömn och drömmar @sv
related: Tunne- ja tahtotoiminnot
related: Psykologian suunnat
related: Syvyyspsykologia
related: Lapsuuden ja nuoruuden psykologia
related: Muita psykologian aloja
related: Kehityspsykologia. Eri ikäkausien psykologia
related: Parapsykologia
related: Unikirjat
related: Kuolemakokemukset
related: Henkilökohtainen terveydenhoito
related: Analyyttinen psykoterapia
scope note: Unen tutkimus yleensä. Uni psykologisena tai psykofyysisenä ilmiönä Uni- ja valvetila ja niiden vertailu Unen vaiheet. Uniliikkeet. Unissakävely. Unissa puhuminen
scope note: Sömn- och drömforskning i allmänhet. Drömmar som psykologiskt eller psykofysiskt fenomen Jämförelser mellan dröm- och vakentillstånd Olika faser i sömnen. Sömnrörelser. Sömngång. Sömnprat @sv

Historialliset koulumuodot
type: Class
type: Concept
subclass of: URN:NBN:fi:au:hklj:183
alternative label: Katedraalikoulut (183.1)
alternative label: Kiertokoulu (183.1)
alternative label: Kinkerit (183.1)
alternative label: Pedagogiot (183.1)
alternative label: Triviaalikoulut (183.1)
alternative label: Valmistava koulu (183.1)
alternative label: Ambulerande skola (183.1) @sv
alternative label: Förberedande skola (183.1) @sv
alternative label: Katedralskolor (183.1) @sv
alternative label: Läsförhör (183.1) @sv
alternative label: Pedagogier (183.1) @sv
alternative label: Trivialskolor (183.1) @sv
broader: URN:NBN:fi:au:hklj:183
in scheme: URN:NBN:fi:au:hklj:
notation: 183.1
preferred label: Historical school types @en
preferred label: Historiska skolformer @sv
related: URN:NBN:fi:au:hklj:181.7
related: URN:NBN:fi:au:hklj:182
related: URN:NBN:fi:au:hklj:183.109
related: URN:NBN:fi:au:hklj:183.5
related: URN:NBN:fi:au:hklj:183.7
related: URN:NBN:fi:au:hklj:184
related: Oppikirjat. Oppaat. Harjoituskirjat. Tehtäväkokoelmat
related: URN:NBN:fi:au:hklj:330
related: Asiakirjakaavat ja -ohjeet. Oikeusoppaat
related: URN:NBN:fi:au:hklj:340
related: URN:NBN:fi:au:hklj:345
scope note: Kiertokoulut. Triviaalikoulut. Valmistavat koulut
scope note: Ambulerande skolor. Trivialskolor. Förberedande skolor @sv

Esikoulut
type: Class
type: Concept
subclass of: URN:NBN:fi:au:hklj:183
alternative label: Esikoulu (183.2)
alternative label: Esikouluikäiset, esikoulu (183.2)
alternative label: Esikoulukasvatus (183.2)
alternative label: Esikoululaiset (183.2)
alternative label: Esiopetus (183.2)
alternative label: Lapset, esikoulukasvatus (183.2)
alternative label: Lastenkasvatus, esikoulukasvatus (183.2)
alternative label: Leikkikoulut, esikoulu (183.2)
alternative label: Varhaiskasvatus, esikoulukasvatus (183.2)
alternative label: Barn i förskoleåldern, förskola (183.2) @sv
alternative label: Barn, förskolefostran (183.2) @sv
alternative label: Barnuppfostran, förskolefostran (183.2) @sv
alternative label: Förskola (183.2) @sv
alternative label: Förskolebarn (183.2) @sv
alternative label: Förskolefostran (183.2) @sv
alternative label: Förskoleundervisning (183.2) @sv
alternative label: Lekskolor, förskola (183.2) @sv
alternative label: Småbarnsfostran, förskolefostran (183.2) @sv
broader: URN:NBN:fi:au:hklj:183
in scheme: URN:NBN:fi:au:hklj:
notation: 183.2
preferred label: Pre-schools @en
preferred label: Förskolor @sv
related: URN:NBN:fi:au:hklj:181.7
related: URN:NBN:fi:au:hklj:182
related: URN:NBN:fi:au:hklj:183.5
related: URN:NBN:fi:au:hklj:183.7
related: URN:NBN:fi:au:hklj:184
related: Oppikirjat. Oppaat. Harjoituskirjat. Tehtäväkokoelmat
related: URN:NBN:fi:au:hklj:330
related: Asiakirjakaavat ja -ohjeet. Oikeusoppaat
related: URN:NBN:fi:au:hklj:340
related: URN:NBN:fi:au:hklj:345
related: Päivähoito
scope note: Esikoulukasvatus
scope note: Förskolefostran @sv

Turun akatemia
type: Class
type: Concept
subclass of: URN:NBN:fi:au:hklj:184
broader: URN:NBN:fi:au:hklj:184
in scheme: URN:NBN:fi:au:hklj:
notation: 184.1
preferred label: Åbo Akademi (old) @en
preferred label: Åbo Akademi (gamla) @sv
related: Tiedepolitiikka. Tieteen sosiologia
related: URN:NBN:fi:au:hklj:181.7
related: URN:NBN:fi:au:hklj:182
related: URN:NBN:fi:au:hklj:183
related: URN:NBN:fi:au:hklj:183.5
related: URN:NBN:fi:au:hklj:183.7
related: URN:NBN:fi:au:hklj:185
related: Oppikirjat. Oppaat. Harjoituskirjat. Tehtäväkokoelmat
related: URN:NBN:fi:au:hklj:330
related: Asiakirjakaavat ja -ohjeet. Oikeusoppaat
related: URN:NBN:fi:au:hklj:340

Helsingin yliopisto
type: Class
type: Concept
subclass of: URN:NBN:fi:au:hklj:184
alternative label: Helsingin yliopisto (184.2)
alternative label: Helsingfors universitet (184.2) @sv
broader: URN:NBN:fi:au:hklj:184
in scheme: URN:NBN:fi:au:hklj:
notation: 184.2
preferred label: Helsinki University @en
preferred label: Helsingfors universitet @sv
related: Tiedepolitiikka. Tieteen sosiologia
related: URN:NBN:fi:au:hklj:181.7
related: URN:NBN:fi:au:hklj:182
related: URN:NBN:fi:au:hklj:183
related: URN:NBN:fi:au:hklj:183.5
related: URN:NBN:fi:au:hklj:183.7
related: URN:NBN:fi:au:hklj:185
related: Oppikirjat. Oppaat. Harjoituskirjat. Tehtäväkokoelmat
related: URN:NBN:fi:au:hklj:330
related: Asiakirjakaavat ja -ohjeet. Oikeusoppaat
related: URN:NBN:fi:au:hklj:340

Turun yliopisto
type: Class
type: Concept
subclass of: URN:NBN:fi:au:hklj:184
alternative label: Turun yliopisto (184.3)
broader: URN:NBN:fi:au:hklj:184
in scheme: URN:NBN:fi:au:hklj:
notation: 184.3
preferred label: Turku University @en
preferred label: Åbo universitet @sv
related: Tiedepolitiikka. Tieteen sosiologia
related: URN:NBN:fi:au:hklj:181.7
related: URN:NBN:fi:au:hklj:182
related: URN:NBN:fi:au:hklj:183
related: URN:NBN:fi:au:hklj:183.5
related: URN:NBN:fi:au:hklj:183.7
related: URN:NBN:fi:au:hklj:185
related: Oppikirjat. Oppaat. Harjoituskirjat. Tehtäväkokoelmat
related: URN:NBN:fi:au:hklj:330
related: Asiakirjakaavat ja -ohjeet. Oikeusoppaat
related: URN:NBN:fi:au:hklj:340

Åbo akademi
type: Class
type: Concept
subclass of: URN:NBN:fi:au:hklj:184
alternative label: Åbo Akademi (184.4)
broader: URN:NBN:fi:au:hklj:184
in scheme: URN:NBN:fi:au:hklj:
notation: 184.4
preferred label: Åbo Akademi (now the Swedish University of Turku) @en
preferred label: Åbo Akademi (nya) @sv
related: Tiedepolitiikka. Tieteen sosiologia
related: URN:NBN:fi:au:hklj:181.7
related: URN:NBN:fi:au:hklj:182
related: URN:NBN:fi:au:hklj:183
related: URN:NBN:fi:au:hklj:183.5
related: URN:NBN:fi:au:hklj:183.7
related: URN:NBN:fi:au:hklj:185
related: Oppikirjat. Oppaat. Harjoituskirjat. Tehtäväkokoelmat
related: URN:NBN:fi:au:hklj:330
related: Asiakirjakaavat ja -ohjeet. Oikeusoppaat
related: URN:NBN:fi:au:hklj:340

Jyväskylän yliopisto
type: Class
type: Concept
subclass of: URN:NBN:fi:au:hklj:184
alternative label: Jyväskylän yliopisto (184.5)
alternative label: Jyväskylä universitet (184.5) @sv
broader: URN:NBN:fi:au:hklj:184
in scheme: URN:NBN:fi:au:hklj:
notation: 184.5
preferred label: Jyväskylä University @en
preferred label: Jyväskylä universitet @sv
related: Tiedepolitiikka. Tieteen sosiologia
related: URN:NBN:fi:au:hklj:181.7
related: URN:NBN:fi:au:hklj:182
related: URN:NBN:fi:au:hklj:183
related: URN:NBN:fi:au:hklj:183.5
related: URN:NBN:fi:au:hklj:183.7
related: URN:NBN:fi:au:hklj:185
related: Oppikirjat. Oppaat. Harjoituskirjat. Tehtäväkokoelmat
related: URN:NBN:fi:au:hklj:330
related: Asiakirjakaavat ja -ohjeet. Oikeusoppaat
related: URN:NBN:fi:au:hklj:340
scope note: Tässä myös Kasvatusopillinen korkeakoulu
scope note: Hit också Pedagogiska högskolan i Jyväskylä @sv

Oulun yliopisto
type: Class
type: Concept
subclass of: URN:NBN:fi:au:hklj:184
alternative label: Oulun yliopisto (184.6)
alternative label: Uleåborgs universitet (184.6) @sv
broader: URN:NBN:fi:au:hklj:184
in scheme: URN:NBN:fi:au:hklj:
notation: 184.6
preferred label: Oulu University @en
preferred label: Uleåborgs universitet @sv
related: Tiedepolitiikka. Tieteen sosiologia
related: URN:NBN:fi:au:hklj:181.7
related: URN:NBN:fi:au:hklj:182
related: URN:NBN:fi:au:hklj:183
related: URN:NBN:fi:au:hklj:183.5
related: URN:NBN:fi:au:hklj:183.7
related: URN:NBN:fi:au:hklj:185
related: Oppikirjat. Oppaat. Harjoituskirjat. Tehtäväkokoelmat
related: URN:NBN:fi:au:hklj:330
related: Asiakirjakaavat ja -ohjeet. Oikeusoppaat
related: URN:NBN:fi:au:hklj:340

Tampereen yliopisto
type: Class
type: Concept
subclass of: URN:NBN:fi:au:hklj:184
alternative label: Tampereen yliopisto (184.7)
alternative label: Tammerfors universitet (184.7) @sv
broader: URN:NBN:fi:au:hklj:184
in scheme: URN:NBN:fi:au:hklj:
notation: 184.7
preferred label: Tampere University @en
preferred label: Tammerfors universitet @sv
related: Tiedepolitiikka. Tieteen sosiologia
related: URN:NBN:fi:au:hklj:181.7
related: URN:NBN:fi:au:hklj:182
related: URN:NBN:fi:au:hklj:183
related: URN:NBN:fi:au:hklj:183.5
related: URN:NBN:fi:au:hklj:183.7
related: URN:NBN:fi:au:hklj:185
related: Oppikirjat. Oppaat. Harjoituskirjat. Tehtäväkokoelmat
related: URN:NBN:fi:au:hklj:330
related: Asiakirjakaavat ja -ohjeet. Oikeusoppaat
related: URN:NBN:fi:au:hklj:340
scope note: Tässä myös Yhteiskunnallinen korkeakoulu
scope note: Hit också Yhteiskunnallinen korkeakoulu @sv

Teknilliset korkeakoulut
type: Class
type: Concept
subclass of: Muut yliopistot ja korkeakoulut
alternative label: Teekkarit, teknilliset yliopistot (184.81)
alternative label: Teknilliset korkeakoulut (184.81)
alternative label: Teknilliset yliopistot (184.81)
alternative label: Tekniska högskolor (184.81) @sv
alternative label: Tekniska universitet (184.81) @sv
alternative label: Teknologer, tekniska universitet (184.81) @sv
broader: Muut yliopistot ja korkeakoulut
in scheme: URN:NBN:fi:au:hklj:
notation: 184.81
preferred label: Technical institutes @en
preferred label: Tekniska högskolor @sv
related: Tiedepolitiikka. Tieteen sosiologia
related: URN:NBN:fi:au:hklj:181.7
related: URN:NBN:fi:au:hklj:182
related: URN:NBN:fi:au:hklj:183
related: URN:NBN:fi:au:hklj:183.5
related: URN:NBN:fi:au:hklj:183.7
related: URN:NBN:fi:au:hklj:185
related: Oppikirjat. Oppaat. Harjoituskirjat. Tehtäväkokoelmat
related: URN:NBN:fi:au:hklj:330
related: Asiakirjakaavat ja -ohjeet. Oikeusoppaat
related: URN:NBN:fi:au:hklj:340

Kauppakorkeakoulut
type: Class
type: Concept
subclass of: Muut yliopistot ja korkeakoulut
alternative label: Kauppakorkeakoulut (184.82)
alternative label: Svenska handelshögskolan (184.82)
alternative label: Handelshögskolor (184.82) @sv
broader: Muut yliopistot ja korkeakoulut
in scheme: URN:NBN:fi:au:hklj:
notation: 184.82
preferred label: Business institutes @en
preferred label: Handelshögskolor @sv
related: Tiedepolitiikka. Tieteen sosiologia
related: URN:NBN:fi:au:hklj:181.7
related: URN:NBN:fi:au:hklj:182
related: URN:NBN:fi:au:hklj:183
related: URN:NBN:fi:au:hklj:183.5
related: URN:NBN:fi:au:hklj:183.7
related: URN:NBN:fi:au:hklj:185
related: Oppikirjat. Oppaat. Harjoituskirjat. Tehtäväkokoelmat
related: URN:NBN:fi:au:hklj:330
related: Asiakirjakaavat ja -ohjeet. Oikeusoppaat
related: URN:NBN:fi:au:hklj:340

Sisälähetys. Evankelioiminen
type: Class
type: Concept
subclass of: EVANKELIS-LUTERILAINEN KIRKKO
alternative label: Diaspora, ev.-lut. kirkko (258)
alternative label: Diasporatyö, ev.-lut. kirkko (258)
alternative label: Evankelioiminen (258)
alternative label: Evankelistat, evankelioiminen (258)
alternative label: Katulähetys, ev.-lut. kirkko (258)
alternative label: Kaupunkilähetys, ev.-lut. kirkko (258)
alternative label: Kenttätyö, sisälähetys, ev.-lut. (258)
alternative label: Kirkolliset laitokset, NMKY, NNKY (258)
alternative label: Kirkolliset laitokset, Pelastusarmeija (258)
alternative label: Kristilliset järjestöt, NMKY, NNKY (258)
alternative label: Kristilliset järjestöt, Pelastusarmeija (258)
alternative label: Lähetysseurat, sisälähetys, ev.-lut. (258)
alternative label: Lähetysteologia, sisälähetys, ev.-lut. (258)
alternative label: Lähetystyö, sisälähetys, ev.-lut. (258)
alternative label: Maallikkosaarnaajat, ev.-lut. kirkko (258)
alternative label: Merimieslähetys, ev.-lut. kirkko (258)
alternative label: Merimiespapit, ev.-lut. kirkko (258)
alternative label: Mustalaislähetys, ev.-lut. kirkko (258)
alternative label: NMKY (258)
alternative label: NNKY (258)
alternative label: Nuorten miesten kristillinen yhdistys (258)
alternative label: Nuorten naisten kristillinen yhdistys (258)
alternative label: Pelastusarmeija (258)
alternative label: Saarnaajat, sisälähetystyö, ev.-lut. (258)
alternative label: Sisälähetys, ev.-lut. kirkko (258)
alternative label: Ulkoseurakunnat, ev.-lut. kirkko (258)
alternative label: Uskonnolliset järjestöt, NMKY, NNKY (258)
alternative label: Uskonnolliset järjestöt, pelastusarmeija (258)
alternative label: Diaspora, ev.luth. kyrkan (258) @sv
alternative label: Diasporaarbete, ev.luth. kyrkan (258) @sv
alternative label: Evangelisation (258) @sv
alternative label: Evangelister, evangelisation (258) @sv
alternative label: Frälsningsarmén (258) @sv
alternative label: Fältarbete, inre mission, ev.luth. (258) @sv
alternative label: Gatumission, ev.luth. kyrkan (258) @sv
alternative label: Inre mission, ev.luth. kyrkan (258) @sv
alternative label: KFUK (258) @sv
alternative label: KFUM (258) @sv
alternative label: Kristliga Föreningen Unga Kvinnor (258) @sv
alternative label: Kristliga Föreningen Unga Män (258) @sv
alternative label: Kristna organisationer, Frälsningsarmén (258) @sv
alternative label: Kristna organisationer, KFUM, KFUK (258) @sv
alternative label: Kyrkliga institutioner, Frälsningsarmén (258) @sv
alternative label: Kyrkliga institutioner, KFUM, KFUK (258) @sv
alternative label: Lekmannapredikanter, ev.luth. kyrkan (258) @sv
alternative label: Missionsarbete, inre mission, ev.luth. (258) @sv
alternative label: Missionssällskap, inre mission, ev.luth. (258) @sv
alternative label: Missionsteologi, inre mission, ev.luth. (258) @sv
alternative label: Predikanter, inre mission, ev.luth. (258) @sv
alternative label: Religiösa organisationer, KFUM, KFUK (258) @sv
alternative label: Religiösa organisationer, frälsningsarmén (258) @sv
alternative label: Sjömansmission, ev.luth. kyrkan (258) @sv
alternative label: Sjömanspräster, ev.luth. kyrkan (258) @sv
alternative label: Stadsmission, ev.luth. kyrkan (258) @sv
alternative label: Zigenarmission, ev.luth. kyrkan (258) @sv
broader: EVANKELIS-LUTERILAINEN KIRKKO
in scheme: URN:NBN:fi:au:hklj:
notation: 258
preferred label: Home mission. Evangelism @en
preferred label: Inremission. Evangelisation @sv
related: Yhdistykset. Laitokset. Kokoukset. Ekumenia
related: RAAMATTU. RAAMATUNTUTKIMUS
related: Sielunhoito
related: Seurakunta. Seurakuntatyö
related: Laitokset. Järjestöt
related: Lähetystyö
related: URN:NBN:fi:au:hklj:260
related: Protestanttiset kirkot ja yhteisöt
related: KIRKKOHISTORIA
related: Järjestötoiminta. Kokoustekniikka
related: Yksityinen avustus- ja huoltotyö
scope note: Ev.-lut. kirkon sisälähetys- ja evankelioimistyö Kristillisen sanoman levittäminen kristinuskosta vieraantuneiden keskuuteen Merimieslähetys. Mustalaislähetys. Katulähetys. Diaspora- eli ulkoseurakuntatyö. NMKY. NNKY. Pelastusarmeija Sisälähetys- ja evankelioimistyön teologia, menetelmät ja työntekijät sekä heidän koulutuksensa Jos teoksessa on sekä sisälähetystä tai evankelioimista että lähetystyötä, on etusija luokalla 259
scope note: Den evangelisk-lutherska kyrkans inremission och evangelisation Spridande av det kristna budskapet till dem som fjärmats från kristendomen Sjömansmission. Zigenarmission. Gatumission. Församlingsarbete utomlands (diasporaarbete). KFUM. KFUK. Frälsningsarmén Inremissionens och evangelisationens teologi och metoder samt anställda och utbildningen av dem Om verket innehåller både inremission eller evangelisation och missionsarbete ges företräde åt klass 259 @sv

Suomi
type: Class
type: Concept
subclass of: Eri maiden kirkkohistoria
alternative label: Evankelinen liike, Suomen herätysliikkeet (279.1)
alternative label: Evankelis-luterilainen kansanlähetys, (279.1)
alternative label: Hedbergiläisyys (279.1)
alternative label: Herännäisyys, Suomi (279.1)
alternative label: Herättäjäjuhlat, Suomi (279.1)
alternative label: Karismaattinen liike, Suomi (279.1)
alternative label: Körttiläisyys, Suomi (279.1)
alternative label: Renqvistiläisyys (279.1)
alternative label: Rukoilevaisuus (279.1)
alternative label: Suomi, herätysliikkeet, ev.-lut. (279.1)
alternative label: Suomi, kirkkohistoria (279.1)
alternative label: Uuspietismi (279.1)
alternative label: Viides herätysliike (279.1)
alternative label: Bedjarrörelsen (279.1) @sv
alternative label: Evangelisk-lutherska folkmissionen (279.1) @sv
alternative label: Evangeliska rörelsen, Finlands väckelserörelser (279.1) @sv
alternative label: Femte väckelsen (279.1) @sv
alternative label: Finland, kyrkohistoria (279.1) @sv
alternative label: Finland, väckelserörelser, ev.luth. (279.1) @sv
alternative label: Hedbergianism (279.1) @sv
alternative label: Karismatiska rörelsen, Finland (279.1) @sv
alternative label: Nypietism (279.1) @sv
alternative label: Pietismen, Finland (279.1) @sv
alternative label: Renqvistianism (279.1) @sv
alternative label: Skörtism, Finland (279.1) @sv
alternative label: Väckelsemöten, Finland (279.1) @sv
broader: Eri maiden kirkkohistoria
in scheme: URN:NBN:fi:au:hklj:
notation: 279.1
preferred label: Finland @en
related: URN:NBN:fi:au:hklj:209
related: URN:NBN:fi:au:hklj:210
related: Oppikirjat
related: Kristillisen teologian historia
related: EVANKELIS-LUTERILAINEN KIRKKO
related: URN:NBN:fi:au:hklj:260
related: Protestanttiset kirkot ja yhteisöt
related: Kirkot ja muut uskonnolliset rakennukset
related: URN:NBN:fi:au:hklj:992
scope note: Suomen kirkkohistorian oppikirjat Suomen herätysliikkeet ja niiden historia
scope note: Läroböcker i Finlands kyrkohistoria Finländska väckelserörelser och deras historia @sv

TILASTOTIEDE
type: Class
type: Concept
subclass of: URN:NBN:fi:au:hklj:300
alternative label: Imputointi, tilastotiede (310)
alternative label: Kattavuus, tilastotiede (310 ... 316)
alternative label: Mittausvirheet, tilastotiede (310)
alternative label: Pieneneminen, tilastotiede (310 ... 316)
alternative label: Suureneminen, tilastotiede (310 ... 316)
alternative label: Tilastointi (310)
alternative label: Tilastointi, tilastotiede (310)
alternative label: Tilastolliset mallit, tilastotiede (310)
alternative label: Tilastotiede (310)
alternative label: Imputering, statistik (310) @sv
alternative label: Minskning, statistik (310 ... 316) @sv
alternative label: Mätfel, statistik, vetenskap (310) @sv
alternative label: Statistik, vetenskap (310) @sv
alternative label: Statistikföring (310) @sv
alternative label: Statistikföring, statistik, vetenskap (310) @sv
alternative label: Statistiska modeller, statistik (310) @sv
alternative label: Täckning, statistik (310 ... 316) @sv
alternative label: Utvidgning, statistik (310 ... 316) @sv
broader: URN:NBN:fi:au:hklj:300
in scheme: URN:NBN:fi:au:hklj:
narrower: Teoria. Tutkimusmenetelmät. Tilastomatematiikka
narrower: Väestötilasto. Sosiaalitilasto
narrower: Kansainväliset yleiset tilastot
narrower: Suomen yleiset tilastot
narrower: Muiden maiden yleiset tilastot
notation: 310
preferred label: STATISTICS @en
preferred label: STATISTIK @sv
related: Todennäköisyyslaskenta
scope note: Tilastotieteen yleisteokset. Yleiset tilasto-oppaat Erikoisaloja koskevat tilasto-oppaat alan mukaisessa luokassa
scope note: Allmänna verk som rör statistik. Allmänna handledningar i statistik Handledningar i statistikens specialområden klassificeras enligt område @sv

Poliisitoimi. Yleinen turvallisuus
type: Class
type: Concept
subclass of: URN:NBN:fi:au:hklj:340
alternative label: Agentit, poliisitoimi (344)
alternative label: Aluemeri, merivartiolaitos (344)
alternative label: Aluepoliisi (344)
alternative label: Aluevedet, merivartiolaitos (344)
alternative label: Arvoesineet, omaisuudensuoja (344)
alternative label: Automaattiset turvalaitteet, turvallisuusala (344)
alternative label: Avaimet, turvallisuus (344)
alternative label: Biometrinen tunnistus (344)
alternative label: Biotunnistus (344)
alternative label: Dekkarit, yksityisetsivät (344)
alternative label: Elektroninen valvonta, poliisitoimi (344)
alternative label: Esitutkinta, poliisitoimi (344)
alternative label: Etsintäkuulutukset (344)
alternative label: Fyysinen väkivalta, poliisi, turvallisuusala (344)
alternative label: Henkilökohtainen koskemattomuus, turvallisuus (344)
alternative label: Henkilökortit (344)
alternative label: Henkilöllisyystodistukset (344)
alternative label: Henkilöllisyystunnukset (344)
alternative label: Henkilönkatsastus (344)
alternative label: Henkilöntarkastus (344)
alternative label: Henkilösuojaus (344)
alternative label: Henkilötiedot, poliisitoimi (344)
alternative label: Henkilötodistukset (344)
alternative label: Henkilötunnukset (344)
alternative label: Henkivartijat, turvamiehen työ (344)
alternative label: Huoltopoliisi (344)
alternative label: Huumetestit, liikennevalvonta (344)
alternative label: Hälyttimet (344)
alternative label: Hälyttimet, turvallisuus (344)
alternative label: Hälytykset, poliisitoimi (344)
alternative label: Hälytysajoneuvot, poliisitoiminta (344)
alternative label: Hälytystila, turvallisuus (344)
alternative label: Hätäpuhelimet, poliisitoimi (344)
alternative label: Häätö, poliisitoimi (344)
alternative label: Identifiointi (344)
alternative label: Ilmianto, rikostutkinta (344)
alternative label: Juopumus, järjestyksenvalvonta (344)
alternative label: Järjestyksenvalvojat, poliisitoimi (344)
alternative label: Järjestyksenvalvonta, poliisitoimi (344)
alternative label: Järjestys, poliisitoimi (344)
alternative label: Järjestyshäiriöt, poliisitoimi (344)
alternative label: Järjestysmiehet, poliisitoimi (344)
alternative label: Järjestyspoliisi (344)
alternative label: Järjestystoimi (344)
alternative label: Kadonneet, rikostutkimus (344)
alternative label: Kansalaiskaartit (344)
alternative label: Katoaminen, poliisitoimi (344)
alternative label: Kaukovalvonta (344)
alternative label: Korttelipoliisi (344)
alternative label: Kotietsintä (344)
alternative label: Kriminalistiikka (344)
alternative label: Kulunvalvonta (344)
alternative label: Kuuleminen, oikeustiede, esitutkinta (344)
alternative label: Kuulustelu, esitutkinta (344)
alternative label: Kuuntelulaitteet, poliisitoimi (344)
alternative label: Käsiaseet, poliisitoimi (344)
alternative label: Liikennevalvonta, poliisi (344)
alternative label: Lukot, turvallisuus (344)
alternative label: Lähipoliisi (344)
alternative label: Löytötavarat, poliisitoimi (344)
alternative label: Matkustusasiakirjat (344)
broader: URN:NBN:fi:au:hklj:340
in scheme: URN:NBN:fi:au:hklj:
notation: 344
related: Julkisoikeus
related: URN:NBN:fi:au:hklj:332.2
related: Rikosoikeus
related: Prosessioikeus. Oikeushallinto
related: Vankeinhoito. Vankilat
related: Palo- ja pelastustoimi
related: Kriminologia. Kriminaalisosiologia
related: Kriminaalipolitiikka
related: URN:NBN:fi:au:hklj:390
related: Vesikulkuneuvot
related: Liikenneopetus. Liikenneturvallisuus
scope note: Poliisitoimi sekä meri-, raja- ja rannikkovartiolaitos maasta riippumatta Poliisilaitos. Nimismiehet. Rikostutkinta. Yleinen järjestyksen valvonta. Liikennevalvonta. Kansalaiskaartit. Yksityinen vartiointi- ja turvallisuuspalvelu. Yksityisetsivät. Perintä- ja ulosottotoimi
scope note: Polisväsen samt sjö-, gräns- och kustbevakningsväsen oavsett land Polisinrättningar. Länsmännen. Brottsutredning. Övervakning av den allmänna ordningen. Trafikövervakning. Medborgargarden. Privat övervaknings- och säkerhetstjänst. Privatdetektiver. Indrivnings- och utmätningsväsen @sv

Yhteiskunnan rakenne
type: Class
type: Concept
subclass of: SOSIOLOGIA
alternative label: Agraariyhteiskunta (352 +)
alternative label: Aikuiset, asema yhteiskunnassa (352 +)
alternative label: Akkulturaatio, yhteiskunnan rakenne (352 +)
alternative label: Aktiiviväestö, asema yhteiskunnassa (352 +)
alternative label: Ammatillinen jakautuminen, sosiologia (352 +)
alternative label: Ammatillinen liikkuvuus, yhteiskunnan rakenne (352 +)
alternative label: Ammatinharjoittajat, sosiologia (352 +)
alternative label: Ammatinvaihto, sosiaalinen liikkuvuus (352 +)
alternative label: Ammatissa toimimaton väestö, sosiologia (352 +)
alternative label: Ammatissa toimiva väestö, sosiologia (352 +)
alternative label: Ammattirakenne, yhteiskunnan rakenne (352 +)
alternative label: Aristokratia, yhteiskunnan rakenne (352 +)
alternative label: Dalit, kastit, yhteiskunnan rakenne (352 +)
alternative label: Dalitit, kastit, yhteiskunnan rakenne (352 +)
alternative label: Dekadenssi, yhteiskunnan rakenne (352 +)
alternative label: Diffuusio, sosiaalinen muutos (352 +)
alternative label: Edistys, yhteiskuntakehitys (352 +)
alternative label: Eliitit, yhteiskunnan rakenne (352 +)
alternative label: Elinkeinonharjoittajat, yhteiskunnan rakenne (352 +)
alternative label: Elitismi, yhteiskunnan rakenne (352 +)
alternative label: Erikoistuminen, yhteiskunnan rakenne (352 +)
alternative label: Etuoikeudet, yhteiskunnan rakenne (352 +)
alternative label: Feodaalilaitos (352)
alternative label: Feodaaliyhteiskunnat (352)
alternative label: Heterogeenisuus, yhteiskunnan rakenne (352 +)
alternative label: Hierarkia, yhteiskunnan rakenne (352 +)
alternative label: Homogeenisuus, yhteiskunnan rakenne (352 +)
alternative label: Hovinaiset, hovit, yhteiskunnan rakenne (352)
alternative label: Hovit, yhteiskunnan rakenne (352 +)
alternative label: Ihmisyhteisöt, yhteiskunnan rakenne (352 +)
alternative label: Interaktiivisuus, yhteiskunnan rakenne (352 +)
alternative label: Interaktio, yhteiskunnan rakenne (352 +)
alternative label: Jälkimoderni, yhteiskunnan rakenne (352 +)
alternative label: Jälkimodernismi, yhteiskunnan rakenne (352 +)
alternative label: Jälkiteollinen yhteiskunta (352 +)
alternative label: Kansa, yhteiskunnan rakenne (352 +)
alternative label: Kapitalismi, yhteiskunnan rakenne (352 +)
alternative label: Kapitalistiset yhteiskunnat (352 +)
alternative label: Kastijärjestelmä, yhteiskunnan rakenne (352 +)
alternative label: Kastit, yhteiskunnan rakenne (352 +)
alternative label: Kastittomat, yhteiskunnan rakenne (352 +)
alternative label: Keskiluokka, sosiologia (352 +)
alternative label: Klaanit, yhteiskunnan rakenne (352 +)
alternative label: Kolonialistiset yhteiskunnat (352 +)
alternative label: Luokkarakenne (352 +)
alternative label: Luokkaristiriidat, yhteiskunnan rakenne (352 +)
alternative label: Luokkataistelu, yhteiskunnan rakenne (352 +)
alternative label: Luokkateoria (352 +)
alternative label: Luokkayhteiskunta (352 +)
alternative label: Maanomistajat, yhteiskunnan rakenne (352 +)
alternative label: Makrososiologia (352 +)
alternative label: Matriarkaalisuus, yhteiskunnan rakenne (352 +)
alternative label: Matriarkaatti, yhteiskunnan rakenne (352 +)
alternative label: Mekanismit, yhteiskunnalliset mekanismit (352 +)
alternative label: Meritokratia, yhteiskunnan rakenne (352 +)
alternative label: Moderni, yhteiskunnan rakenne (352 +)
alternative label: Modernisaatio, yhteiskunnan rakenne (352 +)
alternative label: Nuoret aikuiset, asema yhteiskunnassa (352 +)
alternative label: Nykyaikaistuminen, yhteiskunnan rakenne (352 +)
alternative label: Paariat, kastit, yhteiskunnan rakenne (352 +)
alternative label: Pajarit, aristokratia, yhteiskunnan rakenne (352 +)
alternative label: Palkkatyöläiset, yhteiskuntaluokat (352 +)
broader: SOSIOLOGIA
in scheme: URN:NBN:fi:au:hklj:
narrower: Alueellinen sosiologia. Maassamuutto
notation: 352
related: Valtiofilosofia. Valtiomuodot
related: Yhteiskuntafilosofia
related: URN:NBN:fi:au:hklj:352.09
related: Talousjärjestelmät
related: Tuotanto. Tuottavuus
related: Elintaso. Kulutus
related: URN:NBN:fi:au:hklj:370
related: Työväenliike
related: Kulttuuriantropologia. Sosiaaliantropologia
scope note: Yhteiskuntien, yhteiskuntajärjestelmien ja yhteiskuntaluokkien sosiologia ja kehitys Sukulaisyhteiskunnat. Orjayhteiskunnat. Feodaaliyhteiskunnat. Kolonialistiset yhteiskunnat. Kapitalistiset yhteiskunnat. Sosialistiset yhteiskunnat Sosiaalinen kerrostuneisuus. Sosiaalinen liikkuvuus. Sosiaalinen integraatio. Kastit. Säädyt. Säätykierto. Porvaristo. Työväestö. Talonpojat. Keskiluokka
scope note: Samhällenas, samhällssystemens och samhällsklassernas sociologi och utveckling Släktsamhällen. Slavsamhällen. Feodala samhällen. Kolonialistiska samhällen. Kapitalistiska samhällen. Socialistiska samhällen Social stratifiering. Social rörlighet. Social integration. Kaster. Ständer. Ståndscirkulation. Borgerskap. Arbetarbefolkning. Bönder. Medelklassen @sv

Alueellinen sosiologia. Maassamuutto
type: Class
type: Concept
subclass of: Yhteiskunnan rakenne
alternative label: Agraariyhteiskunta, maaseudun sosiologia (352.1)
alternative label: Alue-erot, alueellinen sosiologia (352.1)
alternative label: Alueellinen identiteetti (352.1)
alternative label: Alueellinen sosiologia (352.1)
alternative label: Alueelliset erot, alueellinen sosiologia (352.1)
alternative label: Aluerakenne, alueellinen sosiologia (352.1)
alternative label: Asuinalueet, asumisen sosiologia (352.1)
alternative label: Asuinolot, asumisen sosiologia (352.1)
alternative label: Asuinpaikat, asumisen sosiologia (352.1)
alternative label: Asuinyhteisöt, asumisen sosiologia (352.1)
alternative label: Asuinympäristö, asumisen sosiologia (352.1)
alternative label: Asukasrakenne, asumisen sosiologia (352.1)
alternative label: Asukkaat, asumisen sosiologia (352.1)
alternative label: Asumalähiöt, kaupunkisosiologia (352.1)
alternative label: Asuminen, asumisen sosiologia (352.1)
alternative label: Asumistiheys, asumisen sosiologia (352.1)
alternative label: Asumisväljyys, asumisen sosiologia (352.1)
alternative label: Asunto-olot, asumisen sosiologia (352.1)
alternative label: Asutuskeskukset, asumisen sosiologia (352.1)
alternative label: Asutusrakenne, asumisen sosiologia (352.1)
alternative label: Autioituminen, maaltamuutto (352.1)
alternative label: Autiotalot, maaltamuutto (352.1)
alternative label: Autiotilat, maaltamuutto (352.1)
alternative label: Eekoyhteisöt, asumisen sosiologia (352.1)
alternative label: Ekoasuminen, asumisen sosiologia (352.1)
alternative label: Ekologinen asuminen, asumisen sosiologia (352.1)
alternative label: Elinympäristö, yhteiskunta, asumisen sosiologia (352.1)
alternative label: Haja-asutus, asumisen sosiologia (352.1)
alternative label: Hylätyt rakennukset, maaltamuutto (352.1)
alternative label: Katuelämä, kaupunkikulttuuri (352.1)
alternative label: Katuympäristö, kaupunkikulttuuri (352.1)
alternative label: Kaupunginosat, kaupunkisosiologia (352.1)
alternative label: Kaupungistuminen (352.1)
alternative label: Kaupungistuminen, kaupunkisosiologia (352.1)
alternative label: Kaupungit, kaupunkisosiologia (352.1)
alternative label: Kaupunkiarkeologia, kaupunkisosiologia (352.1)
alternative label: Kaupunkiekologia (352.1)
alternative label: Kaupunkikeskustat, kaupunkisosiologia (352.1)
alternative label: Kaupunkikulttuuri (352.1)
alternative label: Kaupunkikuva, kaupunkisosiologia (352.1)
alternative label: Kaupunkilaiset, kaupunkisosiologia (352.1)
alternative label: Kaupunkiluonto, kaupunkiekologia (352.1)
alternative label: Kaupunkirakenne, kaupunkisosiologia (352.1)
alternative label: Kaupunkisosiologia (352.1)
alternative label: Kaupunkitila, kaupunkisosiologia (352.1)
alternative label: Kaupunkitutkimus (352.1)
alternative label: Kaupunkiväestö, kaupunkisosiologia (352.1)
alternative label: Kaupunkiyhteisöt (352.1)
alternative label: Kaupunkiympäristö, kaupunkisosiologia (352.1)
alternative label: Kehitysalueet, sosiologia (352.1)
alternative label: Kerrostaloalueet, kaupunkisosiologia (352.1)
alternative label: Kerrostalot, kaupunkisosiologia (352.1)
alternative label: Keskiluokkaistuminen, sosiologia (352.1)
alternative label: Keskustat, kaupunkisosiologia (352.1)
alternative label: Kesäasukkaat, asumisen sosiologia (352.1)
alternative label: Kirkonkylät, maaseudun sosiologia (352.1)
alternative label: Konttoristuminen, kaupunkisosiologia (352.1)
alternative label: Korttelit, kaupunkisosiologia (352.1)
alternative label: Kotiseutu, kaupunkisosiologia (352.1)
alternative label: Kotiseutu, maaseudun sosiologia (352.1)
alternative label: Kyläavustajat, kylätoiminta (352.1)
broader: Yhteiskunnan rakenne
in scheme: URN:NBN:fi:au:hklj:
notation: 352.1
related: Väestötilasto. Sosiaalitilasto
related: Väestötiede. Väestöpolitiikka
related: Talousjärjestelmät
related: Tuotanto. Tuottavuus
related: URN:NBN:fi:au:hklj:370
related: Aluepolitiikka. Ympäristöpolitiikka
related: Asuntopolitiikka
related: Siirtolaisuus
related: Työväenliike
related: Kulttuuriantropologia. Sosiaaliantropologia
related: URN:NBN:fi:au:hklj:721
scope note: Yhteiskunnan alueellista rakennetta ja kehitystä koskevat sosiologiset tai sosiaaliekologiset teokset Asumisen sosiologia Maaseutusosiologia. Maaseutuyhteisöt. Kylätutkimukset Kaupunkisosiologia. Kaupunkiyhteisöt. Lähiötutkimukset Sosiaalinen kerrostuneisuus ja liikkuvuus alueelliselta kannalta. Maassamuutto, maaltamuutto, maallemuutto, maaseudun autioituminen sekä kaupungistuminen sosiologisina kysymyksinä
scope note: Sociologiska eller socialekologiska verk som rör samhällets regionala struktur och utveckling Boendets sociologi Landsbygdssociologi. Landsbygdsgemenskaper. Bystudier Stadssociologi. Stadsgemenskaper. Förortsstudier Social stratifiering och rörlighet ur regional synvinkel. Flyttning inom landet, flyttning från landsbygden, flyttning till landsbygden, flykten från landsbygden samt urbanisering som sociologiska frågor @sv

Osuustoiminta
type: Class
type: Concept
subclass of: URN:NBN:fi:au:hklj:360
alternative label: Eurooppaosuuskunnat, osuuskuntatoiminta (364)
alternative label: Kulutusosuuskunnat (364)
alternative label: Luotot, luotto-osuuskunnat (364)
alternative label: Luotot, osuuspankit (364)
alternative label: Luotto-osuuskunnat (364)
alternative label: Luottolaitokset, luotto-osuuskunnat (364)
alternative label: Luottolaitokset, osuuspankit (364)
alternative label: Osuuskaupat (364)
alternative label: Osuuskunnat, osuuskuntatoiminta (364)
alternative label: Osuusliikkeet (364)
alternative label: Osuuspankit (364)
alternative label: Osuustoiminta (364)
alternative label: Tuotanto-osuuskunnat (364)
alternative label: Työosuuskunnat (364)
alternative label: Vakuutusosuuskunnat (364)
alternative label: Ylikansallinen osuuskuntamuoto (364)
alternative label: Ylikansallinen osuuskuntamuoto, osuuskuntatoiminta (364)
alternative label: Andelsaffärer (364) @sv
alternative label: Andelsbanker (364) @sv
alternative label: Andelshandlar (364) @sv
alternative label: Andelslag, andelslagsverksamhet (364) @sv
alternative label: Arbetsandelslag (364) @sv
alternative label: Europaandelslag, andelslagsverksamhet (364) @sv
alternative label: Försäkringsandelslag (364) @sv
alternative label: Konsumentkooperativ (364) @sv
alternative label: Kooperation (364) @sv
alternative label: Kreditandelslag (364) @sv
alternative label: Krediter, andelsbanker (364) @sv
alternative label: Krediter, kreditandelslag (364) @sv
alternative label: Kreditinstitut, andelsbanker (364) @sv
alternative label: Kreditinstitut, kreditandelslag (364) @sv
alternative label: Producentandelslag (364) @sv
broader: URN:NBN:fi:au:hklj:360
in scheme: URN:NBN:fi:au:hklj:
notation: 364
preferred label: Co-operatives @en
preferred label: Kooperation @sv
related: Kauppaoikeus. Yhtiölainsäädäntö. Pankki- ja vakuutuslainsäädäntö
related: Raha. Valuutta. Pankit. Pörssit
related: Vakuutustoimi
related: Sosiaalivakuutus
related: URN:NBN:fi:au:hklj:675
related: Liiketaloudellinen kirjanpito ja tilintarkastus
related: Kauppakirjeenvaihto
related: Kauppamatematiikka
related: Materiaalitoiminnot. Logistiikka
related: Markkinointi. Asiakaspalvelu
related: Kuluttajanvalistus
scope note: Työntekijöiden osuustoiminta. Osuusliikkeet. Osuuskaupat. Kulutusosuuskunnat. Osuuspankit. Osuuskassat. Luotto-osuuskunnat. Vakuutusosuuskunnat
scope note: Arbetstagarnas kooperation. Andelslag. Andelsaffärer. Konsumentandelslag. Andelsbanker. Andelskassor. Kreditandelslag. Försäkringsandelslag @sv

Maapolitiikka
type: Class
type: Concept
subclass of: URN:NBN:fi:au:hklj:371
alternative label: Asuttaminen, asutuspolitiikka (371.2)
alternative label: Asutus, asutuspolitiikka (371.2)
alternative label: Asutuspolitiikka (371.2)
alternative label: Asutusrakenne, asutuspolitiikka (371.2)
alternative label: Asutustilat, asutuspolitiikka (371.2)
alternative label: Asutustoiminta (371.2)
alternative label: Halkominen, maapolitikka (371.2)
alternative label: Jakolaitos, maapolitiikka (371.2)
alternative label: Jakotoimitus, maapolitiikka (371.2)
alternative label: Kansallistaminen, maaomaisuus (371.2)
alternative label: Lohkominen, maapolitiikka (371.2)
alternative label: Loisväki, maapolitiikka (371.2)
alternative label: Maankäyttö, maapolitiikka (371.2)
alternative label: Maankäytön suunnittelu, maapolitiikka (371.2)
alternative label: Maanomistajat, maapolitiikka (371.2)
alternative label: Maanomistus, maapolitiikka (371.2)
alternative label: Maapolitiikka (371.2)
alternative label: Maareformi (371.2)
alternative label: Omistajat, maanomistus (371.2)
alternative label: Talolliset, maapolitiikka (371.2)
alternative label: Tilakoko, maapolitiikka (371.2)
alternative label: Tilalliset, maapolitiikka (371.2)
alternative label: Tilaton väestö, maapolitiikka (371.2)
alternative label: Tilattomat, maapolitiikka (371.2)
alternative label: Tilukset (371.2)
alternative label: Tilusjärjestelyt (371.2)
alternative label: Tilusjärjestelyt, maapolitiikka (371.2)
alternative label: Uusjako, maanjako (371.2)
alternative label: Valtionmaat, maapolitiikka (371.2)
alternative label: Viljelymaa, maapolitiikka (371.2)
alternative label: Yhteisalueet, maapolitiikka (371.2)
alternative label: Yhteismaa, maapolitiikka (371.2)
alternative label: Yhteismetsät, maapolitiikka (371.2)
alternative label: Yhteisomistus, maapolitiikka (371.2)
alternative label: Yksityismaat, maanomistus, maapolitiikka (371.2)
alternative label: Allmänning, jordpolitik (371.2) @sv
alternative label: Bebyggelse, bebyggelsepolitik (371.2) @sv
alternative label: Bebyggelsens struktur, bebyggelsepolitik (371.2) @sv
alternative label: Bebyggelsepolitik (371.2) @sv
alternative label: Gårdsägare, jordpolitik (371.2) @sv
alternative label: Hemmansstorlek, jordpolitik (371.2) @sv
alternative label: Hemmansägare, jordpolitik (371.2) @sv
alternative label: Indelningsväsen, jordpolitik (371.2) @sv
alternative label: Inhysingar, markpolitik (371.2) @sv
alternative label: Jordinnehav, markpolitik (371.2) @sv
alternative label: Jordreform (371.2) @sv
alternative label: Jordägare, markpolitik (371.2) @sv
alternative label: Klyvning, markpolitik (371.2) @sv
alternative label: Kolonisation (371.2) @sv
alternative label: Kolonisationslägenheter, kolonisationspolitik (371.2) @sv
alternative label: Kolonisering, bebyggelsepolitik (371.2) @sv
alternative label: Markanvändning, markpolitik (371.2) @sv
alternative label: Markdispositionsplanering, markpolitik (371.2) @sv
alternative label: Markpolitik (371.2) @sv
alternative label: Nationalisering, jordegendom (371.2) @sv
alternative label: Nyskifte, jorddelning (371.2) @sv
alternative label: Obesutten befolkning, jordpolitik (371.2) @sv
alternative label: Odlingsjord, jordpolitik (371.2) @sv
alternative label: Privat mark, jordinnehav, markpolitik (371.2) @sv
alternative label: Samfällda områden, jordpolitik (371.2) @sv
alternative label: Samfällda skogar, jordpolitik (371.2) @sv
broader: URN:NBN:fi:au:hklj:371
in scheme: URN:NBN:fi:au:hklj:
notation: 371.2
related: Esine- ja velvoiteoikeus. Immateriaalioikeudet. Huoneen- ja maanvuokralainsäädäntö
related: Merioikeus
related: Työoikeus
related: URN:NBN:fi:au:hklj:352.09
related: Pääoma. Työ. Luonnonvarat
related: Kiinteistöt. Tontit
related: Aluepolitiikka. Ympäristöpolitiikka
related: URN:NBN:fi:au:hklj:371.209
related: Asuntopolitiikka
related: Työmarkkinajärjestöt
related: Sotien yhteiskunnalliset vaikutukset
scope note: Asutuspolitiikka. Maanjako. Maareformit Maa ja maanomistus sosiaalisena ja taloustieteellisenä kysymyksenä Maaomaisuuden kansallistaminen ja yksityistäminen Maaomaisuuden pakkolunastus Maaomaisuuden arviointi, arvo, arvonnousu, tuotto ja kannattavuus Maakauppa. Maanvuokra
scope note: Bosättningspolitik. Jordskifte. Jordreformer Mark och markägarna som social och ekonomisk fråga Nationalisering och privatisering av jordegendom Tvångsinlösning av jordegendom Värdering av jordegendom och dess värde, värdestegring, avkastning och lönsamhet Markköp. Arrende @sv

Alkoholipolitiikka
type: Class
type: Concept
subclass of: Päihdepolitiikka. Päihdehuolto
alternative label: A-klinikat (371.71)
alternative label: A-kodit (371.71)
alternative label: AA-liike (371.71)
alternative label: Absolutismi, raittiuskysymys (371.71)
alternative label: Alkoholi, sosiaaliset vaikutukset (371.71)
alternative label: Alkoholikulttuuri, alkoholiongelmat (371.71)
alternative label: Alkoholinkäyttö, alkoholipolitiikka (371.71)
alternative label: Alkoholinkäyttö, sosiaaliset vaikutukset (371.71)
alternative label: Alkoholiongelmat, sosiaaliset (371.71)
alternative label: Alkoholipolitiikka (371.71)
alternative label: Alkoholismi, sosiaaliset vaikutukset (371.71)
alternative label: Alkoholisosiologia (371.71)
alternative label: Alkoholistihuolto (371.71)
alternative label: Alkoholistit, sosiaaliset ongelmat (371.71)
alternative label: Hoitoonohjaus, alkoholistit (371.71)
alternative label: Humalahakuisuus, juomatavat, alkoholiongelmat (371.71)
alternative label: Huoltolaitokset, A-klinikat, A-kodit (371.71)
alternative label: Juomakulttuuri, alkoholiongelmat (371.71)
alternative label: Juomaperinne, alkoholiongelmat (371.71)
alternative label: Juomatavat, alkoholiongelmat (371.71)
alternative label: Juopumus, alkoholisosiologia (371.71)
alternative label: Katkaisuasematoiminta (371.71)
alternative label: Katkaisuhoito (371.71)
alternative label: Katkaisuhoito, alkoholipolitiikka (371.71)
alternative label: Kieltolait, alkoholipolitiikka (371.71)
alternative label: Kontrollipolitiikka, alkoholipolitiikka (371.71)
alternative label: Kotipoltto, alkoholipolitiikka (371.71)
alternative label: Kotipoltto, alkoholisosiologia (371.71)
alternative label: Nuoriso-ongelmat, alkoholiongelmat (371.71)
alternative label: Raittius (371.71)
alternative label: Raittiuskasvatus (371.71)
alternative label: Raittiusliikkeet (371.71)
alternative label: Raittiusseurat (371.71)
alternative label: Raittiustyö (371.71)
alternative label: Selviämisasemat (371.71)
alternative label: Sosiaaliset ongelmat, alkoholismi (371.71)
alternative label: Vastaanottokodit, alkoholistit, sosiaalihuolto (371.71)
alternative label: Viinanpoltto, alkoholipolitiikka (371.71)
alternative label: Väkijuomien käyttö (371.71)
alternative label: Väkijuomien käyttö, sosiaalipolitiikka (371.71)
alternative label: Väkijuomien väärinkäyttö, sosiaalipolitiikka (371.71)
alternative label: Väärinkäyttö, alkoholi, sosiaaliala (371.71)
alternative label: Yhteiskunnalliset ongelmat, alkoholismi (371.71)
alternative label: A-hem (371.71) @sv
alternative label: A-kliniker (371.71) @sv
alternative label: AA-rörelsen (371.71) @sv
alternative label: Absolutism, nykterhetsfrågan (371.71) @sv
alternative label: Akutvårdstationer (371.71) @sv
alternative label: Alkohol, sociala verkningar (371.71) @sv
alternative label: Alkoholanvändning, alkoholpolitik (371.71) @sv
alternative label: Alkoholanvändning, sociala verkningar (371.71) @sv
alternative label: Alkoholdrycker, användning (371.71) @sv
alternative label: Alkoholdrycker, användning, socialpolitik (371.71) @sv
alternative label: Alkoholism, sociala verkningar (371.71) @sv
alternative label: Alkoholister, sociala problem (371.71) @sv
alternative label: Alkoholistvård (371.71) @sv
alternative label: Alkoholkultur, alkoholproblem (371.71) @sv
alternative label: Alkoholmissbruk, socialpolitik (371.71) @sv
alternative label: Alkoholpolitik (371.71) @sv
alternative label: Alkoholproblem, sociala (371.71) @sv
alternative label: Alkoholsociologi (371.71) @sv
broader: Päihdepolitiikka. Päihdehuolto
in scheme: URN:NBN:fi:au:hklj:
notation: 371.71
related: URN:NBN:fi:au:hklj:332.2
related: Rikosoikeus
related: Työoikeus
related: Kriminologia. Kriminaalisosiologia
related: URN:NBN:fi:au:hklj:373
related: Työmarkkinajärjestöt
related: URN:NBN:fi:au:hklj:612
related: Terveydenhoito
related: URN:NBN:fi:au:hklj:618.3
related: URN:NBN:fi:au:hklj:649.91
related: Juomat
scope note: Alkoholin käyttö ja alkoholismi sosiaalisena kysymyksenä. Alkoholisosiologia Alkoholistihuolto. Katkaisu- ja selviämisasematoiminta. A-klinikat. A-kodit. AA-liike Raittiuskysymys. Raittiusliike. Raittiuskasvatus Jos teos koskee alkoholismia tai alkoholin käyttöä sekä sosiaaliselta että lääketieteelliseltä kannalta, on etusija luokalla 371.71
scope note: Alkoholbruk och alkoholism som social fråga. Alkoholsociologi Alkoholistvård. Akutvårds- och tillnyktringsstationernas verksamhet. A-kliniker. A-hem. AA-rörelsen Nykterhetsfrågan. Nykterhetsrörelsen. Nykterhetsfostran Om verket handlar om alkoholism och alkoholbruk ur både social och medicinsk synvinkel ges företräde åt klass 371.71 @sv

Huumausainepolitiikka
type: Class
type: Concept
subclass of: Päihdepolitiikka. Päihdehuolto
alternative label: Aihiolääkkeet , väärinkäyttö, sosiaalityö (371.72)
alternative label: Hoitoonohjaus, huumeiden käyttäjät (371.72)
alternative label: Huumeet (371.72)
alternative label: Huumeet, sosiaalihuolto (371.72)
alternative label: Huumeet, sosiaalipolitiikka (371.72)
alternative label: Huumeiden käyttäjät, sosiaalihuolto (371.72)
alternative label: Huumeiden käyttö, huumeriippuvuus (371.72)
alternative label: Huumeiden käyttö, sosiaalipolitiikka (371.72)
alternative label: Huumeongelmat, huumeriippuvuus (371.72)
alternative label: Huumeongelmat, sosiaalipolitiikka (371.72)
alternative label: Huumepolitiikka (371.72)
alternative label: Huumetestit, huumepolitiikka (371.72)
alternative label: Huumetyö (371.72)
alternative label: Kontrollipolitiikka, huumepolitiikka (371.72)
alternative label: LSD, huumeet (371.72)
alternative label: LSD, huumeet, sosiaalihuolto (371.72)
alternative label: LSD, huumeet, sosiaalipolitiikka (371.72)
alternative label: Lääkeaineet, väärinkäyttö, sosiaalityö (371.72)
alternative label: Lääkeaineriippuvuus, sosiaalityö (371.72)
alternative label: Lääkkeiden väärinkäyttö, sosiaalityö (371.72)
alternative label: Marihuana, huumeet, sosiaalipoltiikka (371.72)
alternative label: Muuntohuumeet (371.72)
alternative label: Muutetut huumeet (371.72)
alternative label: Narkomaanihuolto (371.72)
alternative label: Narkomaanit, sosiaalihuolto (371.72)
alternative label: Nuoriso-ongelmat, huumeongelmat (371.72)
alternative label: Piristeet, päihdepolitiikka (371.72)
alternative label: Sosiaaliset ongelmat, huumeet (371.72)
alternative label: Stimulanssit, päihdepolitiikka (371.72)
alternative label: Stimulantit, päihdepolitiikka (371.72)
alternative label: Vastaanottokodit, narkomaanit, sosiaalihuolto (371.72)
alternative label: Väärinkäyttö, huumeet, sosiaaliala (371.72)
alternative label: Väärinkäyttö, lääkeaineet, sosiaaliala (371.72)
alternative label: Yhteiskunnalliset ongelmat, huumeet (371.72)
alternative label: Designdroger (371.72) @sv
alternative label: Designerdroger (371.72) @sv
alternative label: Kontrollpolitik, narkotikapolitik (371.72) @sv
alternative label: LSD, narkotika (371.72) @sv
alternative label: LSD, narkotika, socialpolitik (371.72) @sv
alternative label: LSD, narkotika, socialvård (371.72) @sv
alternative label: Läkemedel, missbruk, socialarbete (371.72) @sv
alternative label: Läkemedelsberoende, socialarbete (371.72) @sv
alternative label: Läkemedelsmissbruk, socialarbete (371.72) @sv
alternative label: Marijuana, narkotika, socialpolitik (371.72) @sv
alternative label: Missbruk, läkemedel, socialsektorn (371.72) @sv
alternative label: Missbruk, narkotika, socialsektorn (371.72) @sv
alternative label: Narkomaner, socialvård (371.72) @sv
alternative label: Narkomanvård (371.72) @sv
alternative label: Narkotika (371.72) @sv
alternative label: Narkotika, socialpolitik (371.72) @sv
alternative label: Narkotika, socialvård (371.72) @sv
alternative label: Narkotikaarbete (371.72) @sv
alternative label: Narkotikabruk, narkotikaberoende (371.72) @sv
alternative label: Narkotikabruk, socialpolitik (371.72) @sv
alternative label: Narkotikabrukare, socialvård (371.72) @sv
alternative label: Narkotikapolitik (371.72) @sv
alternative label: Narkotikaproblem, narkotikaberoende (371.72) @sv
alternative label: Narkotikaproblem, socialpolitik (371.72) @sv
alternative label: Narkotikatester, narkotikapolitik (371.72) @sv
alternative label: Prekursorer, missbruk, socialarbete (371.72) @sv
alternative label: Samhällsproblem, narkotika (371.72) @sv
broader: Päihdepolitiikka. Päihdehuolto
in scheme: URN:NBN:fi:au:hklj:
notation: 371.72
related: URN:NBN:fi:au:hklj:332.2
related: Rikosoikeus
related: Työoikeus
related: Kriminologia. Kriminaalisosiologia
related: URN:NBN:fi:au:hklj:373
related: Työmarkkinajärjestöt
related: Terveydenhoito
related: URN:NBN:fi:au:hklj:615.1
related: Apteekit
related: URN:NBN:fi:au:hklj:618.3
related: Kemian teollisuus
scope note: Huumaus- ja lääkeaineiden väärinkäyttö sosiaalisena kysymyksenä Huumeiden käyttäjien huolto. Narkomaanihuolto. Huumeiden vastainen sosiaalinen työ Jos teos koskee narkomaniaa tai huumeiden käyttöä sekä sosiaaliselta että lääketieteelliseltä kannalta, on etusija luokalla 371.72
scope note: Narkotika- och läkemedelsmissbruk som social fråga Narkomanvård. Socialt arbete i kampen mot narkotika Om verket handlar om narkomani och narkotikabruk ur både social och medicinsk synvinkel ges företräde åt klass 371.72 @sv

Asevarustelu. Asekauppa
type: Class
type: Concept
subclass of: URN:NBN:fi:au:hklj:390
alternative label: Abc-aseet, asevarustelu (391)
alternative label: Aseet, asevarustelu ja -kauppa (391)
alternative label: Aseistautuminen (391)
alternative label: Aseistautuminen, asevarustelu (391)
alternative label: Aseistus, asevarustelu ja -kauppa (391)
alternative label: Asejärjestelmät, asevarustelu ja -kauppa (391)
alternative label: Asekauppa (391)
alternative label: Asevarikot (391)
alternative label: Asevarustelu (391)
alternative label: Asevarustelu, kilpavarustelu (391)
alternative label: Atomipommit, asevarustelu (391)
alternative label: Bioaseet, asevarustelu (391)
alternative label: Biologiset aseet yl., asevarustelu (391)
alternative label: Joukkotuhoaseet, asevarustelu (391)
alternative label: Kaasuaseet, asevarustelu, asekauppa (391)
alternative label: Kemialliset aseet, asevarustelu (391)
alternative label: Kilpavarustelu (391)
alternative label: Kilpavarustelu, asevarustelu (391)
alternative label: Neutroniaseet, asevarustelu (391)
alternative label: Ohjukset, asevarustelu (391)
alternative label: Ohjuspuolustus, asevarustelu (391)
alternative label: Ohjustentorjunta, asevarustelu (391)
alternative label: Ohjustorjunta, asevarustelu (391)
alternative label: Pelotteet, asevarustelu (391)
alternative label: Pommit, asevarustelu (391)
alternative label: Risteilyohjukset, asevarustelu, asekauppa (391)
alternative label: Tavanomaiset aseet, asevarustelu (391)
alternative label: Varikot, asevarikot (391)
alternative label: Varustautuminen (391)
alternative label: Varustautuminen, asevarustelu (391)
alternative label: Varusteluteollisuus (391)
alternative label: Vetypommit, asevarustelu (391)
alternative label: Ydinaseet, asevarustelu (391)
alternative label: Abc-vapen, upprustning (391) @sv
alternative label: Antimissilförsvar, upprustning (391) @sv
alternative label: Antirobotförsvar, upprustning (391) @sv
alternative label: Atombomber, upprustning (391) @sv
alternative label: Avskräckning, upprustning (391) @sv
alternative label: Beväpning (391) @sv
alternative label: Beväpning, upprustning (391) @sv
alternative label: Beväpning, upprustning och vapenhandel (391) @sv
alternative label: Biologiska vapen allm., upprustning (391) @sv
alternative label: Biovapen, upprustning (391) @sv
alternative label: Bomber, upprustning (391) @sv
alternative label: Depåer, vapendepåer (391) @sv
alternative label: Gasvapen, upprustning, vapenhandel (391) @sv
alternative label: Kapprustning (391) @sv
alternative label: Kapprustning, upprustning (391) @sv
alternative label: Kemiska vapen, upprustning (391) @sv
alternative label: Konventionella vapen, upprustning (391) @sv
alternative label: Kryssningsmissiler, upprustning, vapenhandel (391) @sv
alternative label: Kärnvapen, upprustning (391) @sv
alternative label: Massförstörelsevapen, upprustning (391) @sv
alternative label: Missiler, upprustning (391) @sv
alternative label: Neutronvapen, upprustning (391) @sv
alternative label: Rustning (391) @sv
alternative label: Rustning, upprustning (391) @sv
alternative label: Rustningsindustri (391) @sv
alternative label: Upprustning (391) @sv
alternative label: Upprustning, kapprustning (391) @sv
alternative label: Vapen, stridsredskap, upprustning och vapenhandel (391) @sv
broader: URN:NBN:fi:au:hklj:390
in scheme: URN:NBN:fi:au:hklj:
notation: 391
related: URN:NBN:fi:au:hklj:320
related: URN:NBN:fi:au:hklj:325
related: Suomen ulkopolitiikka
related: Rauhankysymys. Rauhantutkimus
related: URN:NBN:fi:au:hklj:332.2
related: URN:NBN:fi:au:hklj:340
related: Organisaatioiden ja laitosten sosiologia
related: Aseteknologia
related: Suomen puolustusvoimat
related: Muiden maiden puolustusvoimat
related: Energia
scope note: Eri maiden armeijoiden aseistus ja asehankinnat Aseistus asevarustelun ja asekaupan kannalta Tavanomaiset, biologiset, kemialliset ja ydinaseet asekaupan ja asevarustelun kannalta Jos teoksessa on sekä asevarustelua ja asekauppaa että aseteknologiaa ja aseteollisuutta, on etusija luokalla 391
scope note: Arméernas beväpning och vapenanskaffning i olika länder Beväpning ur upprustningens och vapenhandelns synvinkel Konventionella, biologiska och kemiska vapen samt kärnvapen ur vapenhandelns och upprustningens synvinkel Om verket handlar om såväl upprustning och vapenhandel som vapenteknik och vapenindustri, ges företräde åt klass 391 @sv

Balkanin niemimaa
type: Class
type: Concept
subclass of: Etelä-Eurooppa
alternative label: Balkanin niemimaa (419.3)
alternative label: Balkanin niemimaa, maantiede, matkat (419.3)
alternative label: Kaakkois-Eurooppa (419.3 +)
alternative label: Kaakkois-Eurooppa, maantiede, matkat (419.3 +)
alternative label: Balkan (419.3) @sv
alternative label: Balkan, geografi, resor (419.3) @sv
alternative label: Sydosteuropa (419.3 +) @sv
alternative label: Sydosteuropa, geografi, resor (419.3 +) @sv
broader: Etelä-Eurooppa
in scheme: URN:NBN:fi:au:hklj:
narrower: Kreikka
narrower: Entisen Jugoslavian alue
narrower: Bulgaria
narrower: Albania
notation: 419.3
preferred label: Balkan Peninsula @en
preferred label: Balkanhalvön @sv
related: Romania
related: URN:NBN:fi:au:hklj:460
related: URN:NBN:fi:au:hklj:979
scope note: Balkanin niemimaata koskevat yleisteokset
scope note: Allmänna verk om Balkanhalvön @sv

Yhdysvallat, USA
type: Class
type: Concept
subclass of: AMERIKKA
alternative label: The United States, USA @en
alternative label: Alaska (443)
alternative label: Alaska, maantiede, matkat (443)
alternative label: Aleutit (443)
alternative label: Aleutit, maantiede, matkat (443)
alternative label: Amerikkalaiset, yhdysvaltalaiset (443 +)
alternative label: Georgia, Yhdysvallat (443 +)
alternative label: Kalliovuoret (441 ... 443)
alternative label: Osavaltiot, Yhdysvallat (443 +)
alternative label: Pohjois-Amerikka, Yhdysvallat (443 +)
alternative label: Preeriat, aluemaantiede (441 ... 443)
alternative label: Preeriat, matkakertomukset (441 ... 443)
alternative label: Reservaatit, Yhdysvallat (443)
alternative label: USA (443 +)
alternative label: USA, maantiede, matkat (443 +)
alternative label: Yhdysvallat (443 +)
alternative label: Yhdysvallat, maantiede, matkat (443 +)
alternative label: Yhdysvaltalaiset (443 +)
alternative label: Alaska, geografi, resor (443) @sv
alternative label: Aleuterna (443) @sv
alternative label: Aleuterna, geografi, resor (443) @sv
alternative label: Amerikaner, amerikanare (443 +) @sv
alternative label: Amerikanska medborgare (443 +) @sv
alternative label: Delstater, Förenta staterna (443 +) @sv
alternative label: Förenta staterna (443 +) @sv
alternative label: Förenta staterna, geografi, resor (443 +) @sv
alternative label: Georgien, Förenta staterna (443 +) @sv
alternative label: Klippiga bergen (441 ... 443) @sv
alternative label: Nordamerika, Förenta staterna (443 +) @sv
alternative label: Prärier, regionalgeografi (441 ... 443) @sv
alternative label: Prärier, reseskildringar (441 ... 443) @sv
alternative label: Reservat, Förenta staterna (443) @sv
alternative label: USA, geografi, resor (443 +) @sv
broader: AMERIKKA
in scheme: URN:NBN:fi:au:hklj:
narrower: New York
notation: 443
preferred label: North America @en
preferred label: Förenta Staterna, USA @sv
related: Pohjois-Amerikka
related: Karibianmeren saaret
related: Havaiji
related: Arktis, pohjoiset napamaat
related: Yhdysvaltojen historia
related: Yhdysvaltojen historia vuoteen 1775
related: Yhdysvaltojen historia 1775-1860
related: Yhdysvaltojen historia 1861-1938
related: Yhdysvaltojen historia 1939-
scope note: Tässä myös Alaska Yhdysvaltain merentakaiset alueet maantieteellisen sijaintinsa mukaisessa luokassa
scope note: Hit också Alaska Förenta Staternas transmarina områden klassificeras enligt geografisk position @sv

Arktis, pohjoiset napamaat
type: Class
type: Concept
subclass of: AUSTRALIA. OSEANIA. NAPAMAAT
alternative label: Arktinen alue (458)
alternative label: Arktinen alue, maantiede, matkat (458)
alternative label: Arktinen tutkimus (458)
alternative label: Arktis (458)
alternative label: Arktis, maantiede, matkat (458)
alternative label: Eskimot, arktisten alueiden maantiede (458)
alternative label: Frans Josefin maa (458)
alternative label: Frans Josefin maa, maantiede, matkat (458)
alternative label: Grönlanti (458)
alternative label: Grönlanti, maantiede, matkat (458)
alternative label: Huippuvuoret (458)
alternative label: Huippuvuoret, maantiede, matkat (458)
alternative label: Inuitit, arktiset alueet (458)
alternative label: Jan Mayen (458)
alternative label: Jan Mayen, maantiede, matkat (458)
alternative label: Jäävuoret, arktiset alueet (458)
alternative label: Kansainvälinen polaarivuosi 2007–2009, arktinen tutkimus (458)
alternative label: Karhusaari (458)
alternative label: Karhusaari, maantiede, matkat (458)
alternative label: Napa-alueet (458)
alternative label: Napa-alueet, maantiede, matkat (458)
alternative label: Napa-alueet, pohjoiset napamaat (458)
alternative label: Napapiirit, napamaat (458)
alternative label: Napapiirit, pohjoiset napamaat (458)
alternative label: Naparetket (458)
alternative label: Naparetket, maantiede, matkat (458)
alternative label: Naparetket, pohjoiset napamaat (458)
alternative label: Pohjoiset napamaat (458)
alternative label: Pohjoiset napamaat, maantiede, matkat (458)
alternative label: Pohjoisnapa (458)
alternative label: Pohjoisnapa, maantiede, matkat (458)
alternative label: Arktis, geografi, resor (458) @sv
alternative label: Arktisk forskning (458) @sv
alternative label: Arktiskt område (458) @sv
alternative label: Arktiskt område, geografi, resor (458) @sv
alternative label: Björnön (458) @sv
alternative label: Björnön, geografi, resor (458) @sv
alternative label: Eskimåer, arktiska områdens geografi (458) @sv
alternative label: Frans Josefs land (458) @sv
alternative label: Frans Josefs land, geografi, resor (458) @sv
alternative label: Grönland (458) @sv
alternative label: Grönland, geografi, resor (458) @sv
alternative label: Internationella polaråret 2007–2009, arktisk forskning (458) @sv
alternative label: Inuiter, arktiska områden (458) @sv
alternative label: Isberg, arktiska områden (458) @sv
alternative label: Jan Mayen, geografi, resor (458) @sv
alternative label: Nordliga polarländerna (458) @sv
alternative label: Nordliga polarländerna, geografi, resor (458) @sv
alternative label: Nordpolen (458) @sv
alternative label: Nordpolen, geografi, resor (458) @sv
alternative label: Polarexpeditioner (458) @sv
alternative label: Polarexpeditioner, geografi, resor (458) @sv
alternative label: Polarexpeditioner, nordliga polarländerna (458) @sv
alternative label: Polarområden (458) @sv
alternative label: Polarområden, geografi, resor (458) @sv
alternative label: Polarområden, nordliga polarländerna (458) @sv
alternative label: Polcirklar, nordliga polarländerna (458) @sv
alternative label: Polcirklar, polarländerna (458) @sv
alternative label: Svalbard (458) @sv
alternative label: Svalbard, geografi, resor (458) @sv
broader: AUSTRALIA. OSEANIA. NAPAMAAT
in scheme: URN:NBN:fi:au:hklj:
notation: 458
preferred label: The Arctic, North-polar regions @en
preferred label: Arktis, nordliga polarländerna @sv
related: EUROOPPA
related: URN:NBN:fi:au:hklj:411
related: Ruotsi
related: Norja
related: Tanska
related: Lappi
related: Venäjä
related: Yhdysvallat, USA
related: Antarktis, eteläiset napamaat
related: URN:NBN:fi:au:hklj:989
scope note: Arktisia alueita koskevat yleisteokset Tässä myös teokset, jotka koskevat sekä arktisia että antarktisia alueita tai napamaita yleensä Grönlanti. Huippuvuoret. Svalbard ja Jan Mayen. Frans Joosefin maa Pohjoinen jäämeri
scope note: Allmänna verk som rör de arktiska områdena Hit även verk som rör både arktiska och antarktiska områden eller polarländerna i allmänhet Grönland. Svalbard (Spetsbergen) och Jan Mayen. Franz Josefs land Norra ishavet @sv

Paleontologia
type: Class
type: Concept
subclass of: GEOLOGIA
alternative label: Aikakaudet, paleontologia (499)
alternative label: Ajoitus, paleontologia (499)
alternative label: Alkuliskot (499)
alternative label: Antroposeeni, kvartäärikausi, paleontologia (499)
alternative label: Arkeeinen kausi, paleontologia (499)
alternative label: Biokronologia (499)
alternative label: C14-menetelmä, paleontologia (499)
alternative label: Dendrokronologia, paleontologia (499)
alternative label: Dinosaurukset (499)
alternative label: Eläinfossiilit (499)
alternative label: Eläinhistoria (499)
alternative label: Fossiilit (499)
alternative label: Geologiset kerrostumat, paleontologia (499)
alternative label: Geotieteet, paleontologia (499)
alternative label: Hirmuliskot (499)
alternative label: Isotooppigeologia, iänmääritys, paleontologia (499)
alternative label: Iänmääritys, paleontologia (499)
alternative label: Jäljet, paleontologia (499)
alternative label: Jääkaudet, paleontologia (499)
alternative label: Kasvifossiilit (499)
alternative label: Kasvihistoria (499)
alternative label: Kenotsooinen maailmankausi, paleontologia (499)
alternative label: Kerrostumat, paleontologia (499)
alternative label: Kivettymät (499)
alternative label: Kronologia, paleontologia (499)
alternative label: Kvartäärikausi, paleontologia (499)
alternative label: Liskot, dinosaurukset (499)
alternative label: Luonnontieteelliset museot, paleontologiset museot (499)
alternative label: Luonnontieteet, paleontologia (499)
alternative label: Luulöydöt, paleontologia (499)
alternative label: Luuoppi, paleontologia (499)
alternative label: Maailmankaudet, paleontologia (499)
alternative label: Mammutit (499)
alternative label: Meripihka, paleontologia (499)
alternative label: Mesotsooinen maailmankausi, paleontologia (499)
alternative label: Muinaiseläimet (499)
alternative label: Muinaiskasvit (499)
alternative label: Munat, eläintiede, dinosaurukset (499)
alternative label: Neotsooinen maailmankausi, paleontologia (499)
alternative label: Osteologia, paleontologia (499)
alternative label: Paleobiologia (499)
alternative label: Paleobotaniikka (499)
alternative label: Paleoekologia (499)
alternative label: Paleontologia (499)
alternative label: Paleontologiset aikakaudet (499)
alternative label: Paleotsooinen maailmankausi, paleontologia (499)
alternative label: Paleozoologia (499)
alternative label: Pihka, meripihka, fossiilit (499)
alternative label: Prekambrinen maailmankausi, paleontologia (499)
alternative label: Proterotsooinen kausi, paleontologia (499)
alternative label: Radiohiiliajoitus, paleontologia (499)
alternative label: Sedimentit, paleontologia (499)
alternative label: Siitepölyanalyysi, paleontologia (499)
alternative label: Stratigrafia, paleontologia (499)
alternative label: Sukupuutot, paleontologia (499)
alternative label: Sukupuutto, paleontologia (499)
alternative label: Sukupuuttoon kuoleminen, paleontologia (499)
alternative label: Sukupuuttoon kuolleet eläimet, paleontologia (499)
alternative label: Sukupuuttoon kuolleet kasvit, paleontologia (499)
alternative label: Tertiäärikausi, paleontologia (499)
alternative label: pterosaurukset, paleontologia (499 +)
broader: GEOLOGIA
in scheme: URN:NBN:fi:au:hklj:
notation: 499
related: Biologinen antropologia
related: Historiallinen geologia
related: Ekologia. Eliömaantiede
related: Kehitysoppi. Evoluutio
related: KASVITIEDE
related: Kasviekologia
related: Systemaattinen kasvitiede
related: URN:NBN:fi:au:hklj:590
related: Eläinekologia
related: Systemaattinen eläintiede
related: Selkärankaiset
scope note: Fossiilit. Paleontologiset aikakaudet. Paleobiologia. Paleoekologia Paleobotaniikka. Muinaiskasvit. Paleozoologia. Muinaiseläimet. Dinosaurukset Stratigrafia paleontologian kannalta. Fossiililöytöjen ajoitus
scope note: Fossiler. Paleontologiska perioder. Paleobiologi. Paleoekologi Paleobotanik. Urtidsväxter. Paleozoologi. Urtidsdjur. Dinosaurier Stratigrafi ur paleontologins synvinkel. Datering av fossila fynd @sv

Yleinen mikrobiologia
type: Class
type: Concept
subclass of: BIOLOGIA
alternative label: Aineenvaihdunta, mikrobit (579)
alternative label: Aineenvaihduntatuotteet, mikrobit (579)
alternative label: Aitotumaiset eliöt, alkueliöt (579)
alternative label: Aitotumaiset, alkueliöt (579)
alternative label: Aitotumalliset, alkueliöt (579)
alternative label: Alkueliöt (579)
alternative label: Alkueläimet (579)
alternative label: Anaerobiset menetelmät, mikrobiologia (579)
alternative label: Arkkibakteerit (579)
alternative label: Arkkieliöt (579)
alternative label: Bakteerisolut, yleinen mikrobiologia (579)
alternative label: Bakteerit, yleinen mikrobiologia (579)
alternative label: Bakteriologia, yleinen mikrobiologia (579)
alternative label: Bakterioplankton (579)
alternative label: Basillit, yleinen mikrobiologia (579)
alternative label: Benthos, mikrobit (579)
alternative label: Biofilmit, biologia (579)
alternative label: Biofysiikka, mikrobit (579)
alternative label: Biohajoaminen, mikrobiologia (579)
alternative label: Biokemia, mikrobit (579)
alternative label: Biologia, mikrobiologia (579)
alternative label: Biologinen hajoaminen, mikrobiologia (579)
alternative label: Biotestit, mikrobiologia (579)
alternative label: Bokavirukset, mikrobiologia (579)
alternative label: Denitrifikaatio, mikrobitoiminta (579)
alternative label: Eliökunta, mikrobisystematiikka (579)
alternative label: Eliöt, mikrobit (579)
alternative label: Endosytoosi, mikrobiologia (579)
alternative label: Eristys (mikrobiologia) (579)
alternative label: Eukaryootit, alkueliöt (579)
alternative label: Fagosytoosi, mikrobiologia (579)
alternative label: Fytotoksisuus, mikrobiologia (579)
alternative label: Hajottajat, mikrobit (579)
alternative label: Hepatiitti B -virus, mikrobiologia (579)
alternative label: Herpesvirukset, mikrobiologia (579)
alternative label: Hiivasienet, mikrobiologia (579)
alternative label: Homemyrkyt, homesienet (579)
alternative label: Homesienet, mikrobiologia (579)
alternative label: Isäntäsolut, virukset, mikrobiologia (579)
alternative label: Kapsidi, virukset, mikrobiologia (579)
alternative label: Kasvualustat, mikrobiologia (579)
alternative label: Koronavirukset, mikrobiologia (579)
alternative label: Lahoaminen, lahottajat, mikrobit (579)
alternative label: Laktobasillit, mikrobiologia (579)
alternative label: Levät, sinilevät, biologia (579)
alternative label: Ljungan-virus, mikrobiologia (579)
alternative label: Luonnontieteet, mikrobiologia (579)
alternative label: Maaperäeliöstö, mikrobit (579)
alternative label: Maatuminen, mikrobiologia (579)
alternative label: Maitohappobakteerit, mikrobiologia (579)
alternative label: Metabolia, mikrobit (579)
alternative label: Metaboliitit, mikrobit (579)
alternative label: Mikro-organismit (579)
alternative label: Mikro-organismit, biologia (579)
alternative label: Mikrobiologia (579)
alternative label: Mikrobiologia, biologia (579)
alternative label: Mikrobisto, biologia (579)
alternative label: Mikrobit (579)
alternative label: Mikrobit, biologia (579)
alternative label: Mikrobivalmisteet, mikrobiologia (579)
alternative label: Mykotoksiinit, homesienet (579)
broader: BIOLOGIA
in scheme: URN:NBN:fi:au:hklj:
notation: 579
related: Yleisbiologia
related: URN:NBN:fi:au:hklj:576
related: Sekovartiset kasvit
related: Sienet
related: Selkärangattomat
related: URN:NBN:fi:au:hklj:613.3
related: URN:NBN:fi:au:hklj:613.31
related: URN:NBN:fi:au:hklj:616.3
related: Biotekniikka
related: URN:NBN:fi:au:hklj:649.91
related: Optiset ja lääketieteelliset laitteet
scope note: Mikrobiologian yleisteokset Mikrobit. Arkkieliöt. Bakteerit. Virukset. Sinilevät. Alkueläimet Virologia ja bakteriologia biologian kannalta Mikrobien systematiikka, morfologia, fysiologia, molekyylibiologia, biofysiikka ja ekologia
scope note: Allmänna verk om mikrobiologi Mikrober. Arkebakterier. Bakterier. Virus. Blågrönalger. Urdjur Virologi och bakteriologi ur biologisk synvinkel Mikrobernas systematik, morfologi, fysiologi, molekylbiologi, biofysik och ekologi @sv

Kasviekologia
type: Class
type: Concept
subclass of: KASVITIEDE
alternative label: Aapasuot, kasviekologia (584)
alternative label: Aavikot, kasvillisuus (584)
alternative label: Aluskasvillisuus, kasviekologia (584)
alternative label: Alvarit, kasviekologia (584)
alternative label: Arot, kasvillisuus (584)
alternative label: Autiomaat, kasvillisuus (584)
alternative label: Avosuot, suotyypit, kasviekologia (584)
alternative label: Biokenoosit, kasviekologia (584)
alternative label: Biotooppi, kasviekologia (584)
alternative label: Carnivorit, kasviekologia (584)
alternative label: Ekologia, kasvit (584)
alternative label: Elinympäristö, biologia, kasviekologia (584)
alternative label: Eliöyhteisöt, kasviekologia (584)
alternative label: Endofyytit, kasviekologia (584)
alternative label: Epifyytit, kasviekologia (584)
alternative label: Etnobotaniikka (584)
alternative label: Floora, kasviekologia (584)
alternative label: Habitaatti, kasviekologia (584)
alternative label: Harjukasvillisuus, kasviekologia (584)
alternative label: Havumetsät, metsien kasviekologia (584)
alternative label: Hydrofyytit, kasviekologia (584)
alternative label: Isäntäkasvit, kasvitaudit (584)
alternative label: Isäntäkasvit, parasitismi, kasvitiede (584)
alternative label: Jäljittely, kasviekologia (584)
alternative label: Kalliokasvillisuus, kasviekologia (584)
alternative label: Kannanvaihtelut, kasviekologia (584)
alternative label: Karnivorit, kasviekologia (584)
alternative label: Kasviekologia (584)
alternative label: Kasvillisuus, kasviekologia (584)
alternative label: Kasvillisuustyypit, ekologiset (584)
alternative label: Kasvipatologia, luonnonkasvit (584)
alternative label: Kasvisosiologia (584)
alternative label: Kasvisto, kasviekologia (584)
alternative label: Kasviyhdyskunnat (584)
alternative label: Kasvukausi, luonnonkasvit (584)
alternative label: Kasvupaikat, kasviekologia (584)
alternative label: Kasvupaikkatekijät, kasviekologia (584)
alternative label: Kasvupaikkatyypit, kasviekologia (584)
alternative label: Kasvusto, kasviekologia (584)
alternative label: Kedot, kasviekologia (584)
alternative label: Keidassuot , suot, kasviekologia (584)
alternative label: Keitaat, kasvillisuus (584)
alternative label: Korvet, kasviekologia (584)
alternative label: Kylmänkestävyys, kasviekologia (584)
alternative label: Letot, kasviekologia (584)
alternative label: Leviäminen, kasviekologia (584)
alternative label: Leväkukinta, kasviekologia (584)
alternative label: Lihansyöjäkasvit, kasviekologia (584)
alternative label: Lihansyöjät, kasviekologia (584)
alternative label: Loiset, kasviekologia (584)
alternative label: Loisinta, kasviekologia (584)
alternative label: Loiskasvit, kasviekologia (584)
alternative label: Loisoppi, kasvitiede (584)
alternative label: Loistaudit, kasviekologia (584)
alternative label: Mangrovekasvit, kasviekologia (584)
alternative label: Marraskasvit, kasviekologia (584)
alternative label: Mehikasvit, kasviekologia (584)
alternative label: Merilevät, kasviekologia (584)
alternative label: Metsäkasvillisuus, kasviekologia (584)
alternative label: Metsäpatologia, kasvitiede (584)
alternative label: Metsätyypit, kasviekologia (584)
broader: KASVITIEDE
in scheme: URN:NBN:fi:au:hklj:
notation: 584
related: Paleontologia
related: Uhanalaiset lajit. Luonnonsuojelualueet
related: Maaperän, metsien ja soiden suojelu
related: Ekologia. Eliömaantiede
related: Systemaattinen kasvitiede
related: Sekovartiset kasvit
related: Sienet
related: Putkilokasvit
related: Kasvimaantiede
related: Eläinekologia
related: URN:NBN:fi:au:hklj:657
scope note: Kasviekologian yleisteokset Kasvien suhde ympäristöönsä. Kasvupaikkavaatimukset Kasvien populaatio- ja energiaekologia. Kasviyhdyskunnat Symbioosi, parasitismi ja kasvien taudit kasviekologian kannalta Luonnonvaraisia kasveja koskeva parasitologia Teokset, jotka kuvailevat tietyn elinympäristön kasvillisuutta, mutta joita ei ole tarkoitettu lajinmääritysoppaiksi Metsien, soiden, kosteikkojen, vesistöjen, vuoristojen, kulttuuriympäristöjen ym. kasvillisuutta kuvailevat teokset Tietyn kasvilajin tai lajiryhmän ekologia ko. lajin tai ryhmän luokassa 587+
scope note: Allmänna verk om växtekologi Växternas förhållande till omgivningen. Artspecifika krav för växtplatsen Växternas populations- och energiekologi. Växtsamhällen Symbios, parasitism och växtsjukdomar ur växtekologins synvinkel Parasitologi med hänsyn till vilda växter Verk som beskriver vegetationen i en bestämd livsmiljö och som inte är avsedda som handböcker i artbestämning Verk som beskriver skogarnas, myrarnas, våtmarkernas, sjöarnas, vattendragens, bergstrakternas, kulturmiljöernas osv. vegetation Ekologi för en bestämd växtart eller artgrupp förs enligt art eller artgrupp till klass 587+ @sv

Eläinmorfologia. Eläinanatomia
type: Class
type: Concept
subclass of: URN:NBN:fi:au:hklj:590
alternative label: Aistimet, eläinanatomia (592)
alternative label: Aistinelimet, eläinanatomia (592)
alternative label: Aistit, eläinanatomia (592)
alternative label: Aivokuori, eläinanatomia (592)
alternative label: Aivot, eläinanatomia (592)
alternative label: Akillesjänne, eläinanatomia (592)
alternative label: Alaraajat, eläinanatomia (592)
alternative label: Alkio, eläimet (592)
alternative label: Alkiokehitys, eläimet (592)
alternative label: Alkionkehitys, eläimet (592)
alternative label: Anatomia, eläimet (592)
alternative label: Elimet, eläimet (592)
alternative label: Elimistö, eläimet (592)
alternative label: Elinoppi, eläimet (592)
alternative label: Eläinanatomia (592)
alternative label: Eläinmorfologia (592)
alternative label: Eläinorganologia (592)
alternative label: Eläinsytologia (592)
alternative label: Embryogeneesi, eläimet (592)
alternative label: Embryologia, eläimet (592)
alternative label: Hampaat, eläinanatomia (592)
alternative label: Hengityselimet, eläinanatomia (592)
alternative label: Hengitystiet, eläinanatomia (592)
alternative label: Hermokudokset, eläinanatomia (592)
alternative label: Hermosolut, eläimet (592)
alternative label: Hermosto, eläinanatomia (592)
alternative label: Histologia, eläimet (592)
alternative label: Isoaivokuori, eläinanatomia (592)
alternative label: Istukka, eläinanatomia (592)
alternative label: Jalat, eläinanatomia (592)
alternative label: Jänteet, eläinanatomia (592)
alternative label: Kaksineuvoisuus, eläintiede (592)
alternative label: Kallo, eläinanatomia (592)
alternative label: Kallonpohja, eläinanatomia (592)
alternative label: Kantajänne, eläinanatomia (592)
alternative label: Karvapeite, eläinanatomia (592)
alternative label: Karvat, eläinanatomia (592)
alternative label: Karvat, eläinfysiologia (592)
alternative label: Kasvaminen, eläinanatomia (592)
alternative label: Kasvu, eläinanatomia (592)
alternative label: Keskushermosto, eläinanatomia (592)
alternative label: Keuhkot, eläinanatomia (592)
alternative label: Kohtu, eläinanatomia (592)
alternative label: Korteksi, eläinanatomia (592)
alternative label: Kudokset, eläimet (592)
alternative label: Kudosoppi, eläimet (592)
alternative label: Kudosviljely, eläinfysiologia (592)
alternative label: Käpälät, eläinanatomia (592)
alternative label: Liikuntaelimet, eläinanatomia (592)
alternative label: Luu, eläinanatomia (592)
alternative label: Luukudokset, eläinanatomia (592)
alternative label: Luuoppi, eläinanatomia (592)
alternative label: Luuranko, eläinanatomia (592)
alternative label: Luusto, eläinanatomia (592)
alternative label: Lysosomit, solubiologia, eläimet (592)
alternative label: Lämmönsäätely, eläinfysiologia (592)
alternative label: Mahalaukku, eläinanatomia (592)
alternative label: Maitorauhanen, eläinanatomia (592)
alternative label: Maksa, eläinanatomia (592)
alternative label: Mitokondriot , eläimet (592)
alternative label: Morfologia, eläinmorfologia (592)
broader: URN:NBN:fi:au:hklj:590
in scheme: URN:NBN:fi:au:hklj:
notation: 592
related: Yleisbiologia
related: Kasvimorfologia. Kasvianatomia
related: Eläinfysiologia
related: Systemaattinen eläintiede
related: Selkärangattomat
related: Hyönteiset
related: Selkärankaiset
related: Kalat
related: Linnut
related: Nisäkkäät
related: Anatomia
scope note: Eläinmorfologian ja eläinanatomian yleisteokset Eläinorganologian, -embryologian ja -ontogenian yleisteokset Eläinten yksilönkehitys yleensä Tietyn eläinlajin tai lajiryhmän morfologia ja anatomia ko. lajin tai ryhmän luokassa 597+
scope note: Allmänna verk om djurmorfologi och djuranatomi Allmänna verk om djurens organologi, embryologi och ontogeni Djurens individutveckling i allmänhet Morfologi och anatomi för en bestämd djurart eller artgrupp förs enligt art eller artgrupp till klass 597+ @sv

Apteekit
type: Class
type: Concept
subclass of: URN:NBN:fi:au:hklj:615.1
alternative label: Aihiolääkkeet , apteekkitoiminta (615.11)
alternative label: Apteekit (615.11)
alternative label: Farmaseutit, farmaseutin työ (615.11)
alternative label: Farmaseuttinen teknologia (615.11)
alternative label: Farmasia (615.11)
alternative label: Farmasian teknologia (615.11)
alternative label: Geneeriset lääkkeet, apteekkitoiminta (615.11)
alternative label: Geneeriset valmisteet, apteekkitoiminta (615.11)
alternative label: Kopiolääkkeet, apteekkitoiminta (615.11)
alternative label: Lääkeaineet, apteekkitoiminta (615.11)
alternative label: Lääkeala (615.11)
alternative label: Lääkeala, farmasia (615.11)
alternative label: Lääkekaapit, apteekkitoiminta (615.11)
alternative label: Lääkemääräykset (615.11)
alternative label: Lääkeneuvonta (615.11)
alternative label: Lääkevalvonta (615.11)
alternative label: Lääkkeiden valvonta (615.11)
alternative label: Rinnakkaislääkkeet, apteekkitoiminta (615.11)
alternative label: Rinnakkaisvalmisteet, apteekkitoiminta (615.11)
alternative label: Sähköiset lääkemääräykset (615.11)
alternative label: Sähköiset reseptit (615.11)
alternative label: Valvonta, lääkevalvonta (615.11)
alternative label: e- lääkemääräykset (615.11)
alternative label: e- reseptit (615.11)
alternative label: Apotek (615.11) @sv
alternative label: Elektroniska recept (615.11) @sv
alternative label: Farmaceuter, farmaceutens arbete (615.11) @sv
alternative label: Farmaceutisk teknologi (615.11) @sv
alternative label: Farmaci (615.11) @sv
alternative label: Generiska läkemedel, apotek (615.11) @sv
alternative label: Generiska preparat, apotek (615.11) @sv
alternative label: Kopieläkemedel, apotek (615.11) @sv
alternative label: Läkemedel, apotek (615.11) @sv
alternative label: Läkemedelsbranschen (615.11) @sv
alternative label: Läkemedelsbranschen, farmaci (615.11) @sv
alternative label: Läkemedelskontroll (615.11) @sv
alternative label: Läkemedelskopior, apotek (615.11) @sv
alternative label: Läkemedelsordinationer (615.11) @sv
alternative label: Medicinkontroll (615.11) @sv
alternative label: Medicinrådgivning (615.11) @sv
alternative label: Medicinskåp, apoteksverksamhet (615.11) @sv
alternative label: Prekursorer, apotek (615.11) @sv
alternative label: Synonympreparat, apotek (615.11) @sv
alternative label: e-recept (615.11) @sv
alternative label: Övervakning, läkemedelskontroll (615.11) @sv
broader: URN:NBN:fi:au:hklj:615.1
in scheme: URN:NBN:fi:au:hklj:
notation: 615.11
preferred label: Pharmacy @en
preferred label: Apotek @sv
related: URN:NBN:fi:au:hklj:332.2
related: URN:NBN:fi:au:hklj:332.22
related: URN:NBN:fi:au:hklj:371.6
related: Huumausainepolitiikka
related: Hoitolaitokset. Sairaalatekniikka
related: Terveydenhoito
related: Henkilökohtainen terveydenhoito
related: URN:NBN:fi:au:hklj:616
related: URN:NBN:fi:au:hklj:617
related: URN:NBN:fi:au:hklj:617.7
related: Kemian teollisuus
scope note: Apteekkitoiminta. Lääkkeiden jakelu ja myynti Farmasia. Farmaseutin työ. Proviisorin työ Lääkemääräykset. Reseptit. Lääkkeiden annostelu Lääkevalvonta
scope note: Apoteksverksamhet. Distribution och försäljning av medicin Farmaci. Farmaceutens arbete. Provisorns arbete Läkemedelsordinationer. Recept. Dosering av mediciner Läkemedelsövervakning @sv

Muut maakulkuneuvot
type: Class
type: Concept
subclass of: URN:NBN:fi:au:hklj:624
alternative label: Asuntovaunut (624.9)
alternative label: Karavaanarit, asuntovaunut (624.9)
alternative label: Kelkat, moottorikelkat (624.9)
alternative label: Kelkkailu, moottorikelkat (624.9)
alternative label: Kärryt (624.9)
alternative label: Lastenrattaat (624.9)
alternative label: Lastenvaunut (624.9)
alternative label: Moottoriajoneuvot, moottorikelkat (624.9)
alternative label: Moottorikelkat (624.9)
alternative label: Vaunut, lastenvaunut (624.9)
alternative label: Barnkärror (624.9) @sv
alternative label: Barnvagnar (624.9) @sv
alternative label: Husvagnar (624.9) @sv
alternative label: Karavanare, husvagnar (624.9) @sv
alternative label: Kälkar, snöskotrar (624.9) @sv
alternative label: Kälkåkning, snöskotrar (624.9) @sv
alternative label: Kärror (624.9) @sv
alternative label: Motorfordon, snöskotrar (624.9) @sv
alternative label: Snöskotrar (624.9) @sv
alternative label: Vagnar, barnvagnar (624.9) @sv
broader: URN:NBN:fi:au:hklj:624
in scheme: URN:NBN:fi:au:hklj:
notation: 624.9
preferred label: Other land vehicles @en
preferred label: Andra landfordon @sv
related: URN:NBN:fi:au:hklj:380
related: Maaliikenne
related: URN:NBN:fi:au:hklj:460
related: Liikuntaelimet. Liikuntaelinten taudit
related: Yleinen konetekniikka
related: Koneenrakennus. Pneumatiikka. Hydrauliikka
related: Voimakoneet. Moottorit. Nosto- ja kuljetuslaitteet
related: URN:NBN:fi:au:hklj:631
related: Moottoriurheilu. Lentourheilu
scope note: Asuntovaunut. Matkailuperävaunut. Moottorikelkat Lastenvaunut
scope note: Husvagnar. Campingvagnar. Snöskotrar Barnvagnar @sv

Kaupan historia
type: Class
type: Concept
subclass of: LIIKETALOUS. KAUPPA. MARKKINOINTI. LIIKENNEOPETUS
alternative label: Hallit, kaupan historia (670.9)
alternative label: Hansa, kaupan historia (670.9)
alternative label: Idäntiet, kaupan historia (670.9)
alternative label: Karavaanit, kaupan historia (670.9)
alternative label: Kaupan ala, kaupan historia (670.9)
alternative label: Kaupankäynti, historia (670.9)
alternative label: Kaupat, historia (670.9)
alternative label: Kauppa, historia (670.9)
alternative label: Kauppa-ala, kaupan historia (670.9)
alternative label: Kauppahallit, historia (670.9)
alternative label: Kauppahuoneet, historia (670.9)
alternative label: Kauppakamarit, kaupan historia (670.9)
alternative label: Kauppakeskukset, historia (670.9)
alternative label: Kauppakillat, historia (670.9)
alternative label: Kauppakomppaniat, historia (670.9)
alternative label: Kauppaseurat, historia (670.9)
alternative label: Kauppatiet, historia (670.9)
alternative label: Komissio, historia (670.9)
alternative label: Komissiokauppa, historia (670.9)
alternative label: Kulkukauppa, kaupan historia (670.9)
alternative label: Kulkukauppiaat, kaupan historia (670.9)
alternative label: Maahantuojat, kauppa, historia (670.9)
alternative label: Markkinat, kaupan historia (670.9)
alternative label: Silkkitie, kaupan historia (670.9)
alternative label: Tapulikaupungit, kaupan historia (670.9)
alternative label: Torikauppa, kaupan historia (670.9)
alternative label: Torit, kaupan historia (670.9)
alternative label: Vaihtokauppa, kaupan historia (670.9)
alternative label: Vapaakaupungit, kaupan historia (670.9)
alternative label: Vapaasatamat, kaupan historia (670.9)
alternative label: Yrityshistoriikit, kaupan historia (670.9)
alternative label: Butiker, historia (670.9) @sv
alternative label: Byteshandel, handelns historia (670.9) @sv
alternative label: Frihamnar, handelns historia (670.9) @sv
alternative label: Fristäder, handelns historia (670.9) @sv
alternative label: Företagshistoriker, handelns historia (670.9) @sv
alternative label: Gårdfarihandel, handelns historia (670.9) @sv
alternative label: Gårdfarihandlare, handelns historia (670.9) @sv
alternative label: Hallar, handelns historia (670.9) @sv
alternative label: Handel, historia (670.9) @sv
alternative label: Handelsbranschen, handelns historia (670.9) @sv
alternative label: Handelscentra, historia (670.9) @sv
alternative label: Handelsgillen, historia (670.9) @sv
alternative label: Handelshus, historia (670.9) @sv
alternative label: Handelskamrar, handelns historia (670.9) @sv
alternative label: Handelsklubbar, historia (670.9) @sv
alternative label: Handelskompanier, historia (670.9) @sv
alternative label: Handelsvägar, handelns historia (670.9) @sv
alternative label: Handelsvägar, historia (670.9) @sv
alternative label: Hansa, handelns historia (670.9) @sv
alternative label: Importörer, handel, historia (670.9) @sv
alternative label: Karavaner, handelns historia (670.9) @sv
alternative label: Kommers, historia (670.9) @sv
alternative label: Kommission, historia (670.9) @sv
alternative label: Kommissionshandel, historia (670.9) @sv
alternative label: Marknaden, handelns historia (670.9) @sv
alternative label: Saluhallar, historia (670.9) @sv
alternative label: Sidenvägen, handelns historia (670.9) @sv
alternative label: Stapelstäder, handelns historia (670.9) @sv
alternative label: Torg, handelns historia (670.9) @sv
alternative label: Torghandel, handelns historia (670.9) @sv
broader: LIIKETALOUS. KAUPPA. MARKKINOINTI. LIIKENNEOPETUS
in scheme: URN:NBN:fi:au:hklj:
notation: 670.9
related: URN:NBN:fi:au:hklj:360
related: URN:NBN:fi:au:hklj:363
related: URN:NBN:fi:au:hklj:368
related: URN:NBN:fi:au:hklj:650.2
related: URN:NBN:fi:au:hklj:670.09
related: URN:NBN:fi:au:hklj:675
related: Liiketaloudellinen kirjanpito ja tilintarkastus
related: Kauppakirjeenvaihto
related: Kauppamatematiikka
related: Materiaalitoiminnot. Logistiikka
related: Markkinointi. Asiakaspalvelu
scope note: Kaupan historiaa ja kehitystä koskevat yleisteokset Erikoisalojen kauppa ja sen historia alan mukaisessa luokassa
scope note: Allmänna verk om handelns historia och utveckling Handel och handelns historia inom specialområden klassificeras enligt område @sv

Kauppakirjeenvaihto
type: Class
type: Concept
subclass of: URN:NBN:fi:au:hklj:675
alternative label: Hotellikirjeenvaihto (675.3)
alternative label: Kaupankäynti, kauppakirjeenvaihto (675.3)
alternative label: Kauppa, kauppakirjeenvaihto (675.3)
alternative label: Kauppakirjeenvaihto (675.3)
alternative label: Kirjeenvaihto, hotellikirjeenvaihto (675.3)
alternative label: Kirjeenvaihto, kauppakirjeenvaihto (675.3)
alternative label: Liikekirjeenvaihto (675.3)
alternative label: Affärskorrespondens (675.3) @sv
alternative label: Handel, handelskorrespondens (675.3) @sv
alternative label: Handelskorrespondens (675.3) @sv
alternative label: Hotellkorrespondens (675.3) @sv
alternative label: Kommers, handelskorrespondens (675.3) @sv
alternative label: Korrespondens, handelskorrespondens (675.3) @sv
alternative label: Korrespondens, hotellkorrespondens (675.3) @sv
broader: URN:NBN:fi:au:hklj:675
in scheme: URN:NBN:fi:au:hklj:
notation: 675.3
preferred label: Business correspondence @en
preferred label: Affärskorrespondens @sv
related: Kauppaoikeus. Yhtiölainsäädäntö. Pankki- ja vakuutuslainsäädäntö
related: URN:NBN:fi:au:hklj:360
related: URN:NBN:fi:au:hklj:363
related: Osuustoiminta
related: URN:NBN:fi:au:hklj:368
related: URN:NBN:fi:au:hklj:627.751
related: URN:NBN:fi:au:hklj:650.2
related: Kaupan historia
related: Liiketalouden hallinto ja organisaatio
related: Mainonta. Kuluttajanvalistus
related: Hotelli- ja ravintolatalous
scope note: Kielestä ja alasta riippumatta kauppa- ja liikekirjemallit sekä kauppa- ja liikekirjeoppaat Hotellikirjeenvaihto kielestä riippumatta
scope note: Mallar för handels- och affärsbrev samt handböcker i att skriva handels- och affärsbrev oavsett språk Hotellkorrespondens oavsett språk @sv

Esseet. Taidearvostelut
type: Class
type: Concept
subclass of: URN:NBN:fi:au:hklj:700
alternative label: Arvostelut, taide (704)
alternative label: Kritiikki, taidearvostelut (704)
alternative label: Kuvataidearvostelut (704)
alternative label: Taidearvostelut (704)
alternative label: Taidekritiikki, taidearvostelut (704)
alternative label: Teokset, taiteilijoiden teosluettelot (703 ... 776.03)
alternative label: Bildkonstrecensioner (704) @sv
alternative label: Konstkritik, konstrecensioner (704) @sv
alternative label: Konstrecensioner (704) @sv
alternative label: Kritik, konstrecensioner (704) @sv
alternative label: Recensioner, konst (704) @sv
alternative label: Verk, konstnärers opusförteckningar (703 ... 776.03) @sv
broader: URN:NBN:fi:au:hklj:700
in scheme: URN:NBN:fi:au:hklj:
notation: 704
preferred label: Essays. Art criticism @en
preferred label: Essäer. Konstkritik @sv
related: Symbolit. Koodit. Merkkijärjestelmät
related: URN:NBN:fi:au:hklj:010
related: Yleisbibliografiat. Kansallisbibliografiat
related: Kustantajien ja kirjakauppojen luettelot
related: Erikoisalojen bibliografiat
related: Taiteet. Liikunta
related: Paikallisbibliografiat. Henkilöbibliografiat
related: Taiteen estetiikka. Taidefilosofia. Taidepsykologia. Taidesosiologia. Taidepolitiikka
related: Kokoomateokset
related: Musiikin estetiikka ja filosofia
related: Esseet. Kirjallisuusarvostelut
scope note: Yleiset tai sekasisältöiset taidetta koskevat essee-, puhe-, kirjoitus- ja taidearvostelukokoelmat Eri taiteenaloja koskevat essee-, puhe-, kirjoitus- ja taidearvostelukokoelmat alan mukaisessa luokassa
scope note: Essäsamlingar samt samlingar av tal och skrifter med allmänt eller blandat innehåll som handlar om konst och samlingar av konstrecensioner med allmänt eller blandat innehåll Essäsamlingar samt samlingar med tal, skrifter och konstrecensioner som rör enskilda konstarter klassificeras enligt konstart @sv

Kausijulkaisut
type: Class
type: Concept
subclass of: URN:NBN:fi:au:hklj:700
alternative label: Taidelehdet (705)
alternative label: Teokset, taiteilijoiden teosluettelot (703 ... 776.03)
alternative label: Konsttidskrifter (705) @sv
alternative label: Verk, konstnärers opusförteckningar (703 ... 776.03) @sv
broader: URN:NBN:fi:au:hklj:700
in scheme: URN:NBN:fi:au:hklj:
notation: 705
preferred label: Serial publications @en
preferred label: Seriella publikationer @sv
related: Symbolit. Koodit. Merkkijärjestelmät
related: URN:NBN:fi:au:hklj:010
related: Yleisbibliografiat. Kansallisbibliografiat
related: Kustantajien ja kirjakauppojen luettelot
related: Erikoisalojen bibliografiat
related: Taiteet. Liikunta
related: Paikallisbibliografiat. Henkilöbibliografiat
scope note: Taiteita koskevat yleiset kausijulkaisut Eri taiteenaloja koskevat kausijulkaisut alan mukaisessa luokassa
scope note: Allmänna seriella publikationer som handlar om konst Seriella publikationer som rör enskilda konstarter klassificeras enligt konstart @sv

Esihistoriallinen taide
type: Class
type: Concept
subclass of: URN:NBN:fi:au:hklj:709
alternative label: Esihistoriallinen taide (709.02)
alternative label: Kivikausi, taidehistoria (709.02)
alternative label: Kivikautiset kulttuurit, taidehistoria (709.02)
alternative label: Muinaisajan ihmiset, taide (709.02)
alternative label: Muinaiskansat, taide (709.02)
alternative label: Taidehistoria, esihistoriallinen aika (709.02)
alternative label: Vanha aika, taidehistoria, esi historia (709.02)
alternative label: Forntidens människor, konst (709.02) @sv
alternative label: Forntidsfolk, konst (709.02) @sv
alternative label: Förhistorisk konst (709.02) @sv
alternative label: Gamla tiden, konsthistoria, förhistoria (709.02) @sv
alternative label: Konsthistoria, förhistorisk tid (709.02) @sv
alternative label: Stenåldern, konsthistoria (709.02) @sv
alternative label: Stenålderskulturer, konsthistoria (709.02) @sv
broader: URN:NBN:fi:au:hklj:709
in scheme: URN:NBN:fi:au:hklj:
notation: 709.02
preferred label: Prehistoric art @en
preferred label: Förhistorisk konst @sv
related: Alkuperäiskansojen taide
related: Esihistoriallisen ajan arkkitehtuuri
related: URN:NBN:fi:au:hklj:730.9
related: Esihistoriallisen ajan kuvanveistotaide
related: URN:NBN:fi:au:hklj:740.9
related: Esihistoriallisen ajan maalaustaide
related: URN:NBN:fi:au:hklj:770.9
related: URN:NBN:fi:au:hklj:789
related: URN:NBN:fi:au:hklj:789.1
related: URN:NBN:fi:au:hklj:919
related: Vanhan ajan kulttuurihistoria
scope note: Esihistoriallinen taide yleensä Eri alojen esihistoriallinen taide alan mukaisessa luokassa
scope note: Förhistorisk konst i allmänhet Den förhistoriska konstens konstarter klassificeras enligt konstart @sv

Arkkitehtuurin teoria, estetiikka ja filosofia
type: Class
type: Concept
subclass of: URN:NBN:fi:au:hklj:720
alternative label: Elementtirakentaminen, arkkitehtuuri, filosofia, teoria ja estetiikka (720.1)
alternative label: Muunneltavuus, arkkitehtuurin filosofia (720.1)
alternative label: Rakenne, arkkitehtuurin filosofia (720.1)
alternative label: Rakennuskulttuuri, arkkitehtuuri, filosofia (720.1)
alternative label: Rakennussuunnittelu, arkkitehtuuri, teoria (720.1)
alternative label: Struktuuri, arkkitehtuurin filosofia (720.1)
alternative label: Tila, arkkitehtuurin teoria (720.1)
alternative label: Tilasuunnittelu, arkkitehtuuri, teoria (720.1)
alternative label: Valosuunnittelu, arkkitehtuuri (720.1)
alternative label: Värioppi, arkkitehtuuri (720.1)
alternative label: Värit, arkkitehtuuri (720.1)
alternative label: Byggnadskultur, arkitektur, filosofi (720.1) @sv
alternative label: Byggnadsplanering, teknisk, arkitektur, teori (720.1) @sv
alternative label: Elementbyggnad, arkkitehtuuri, filosofi, teori och estetik (720.1) @sv
alternative label: Färger, arkitektur (720.1) @sv
alternative label: Färglära, arkitektur (720.1) @sv
alternative label: Ljussättning, arkitektur (720.1) @sv
alternative label: Rumsgestaltning, arkitektur, teori (720.1) @sv
alternative label: Struktur, rakenne, arkitekturens filosofi (720.1) @sv
alternative label: Struktur, struktuuri, arkitekturens filosofi (720.1) @sv
alternative label: Utrymme, arkitekturens teori (720.1) @sv
alternative label: Variabilitet, arkitekturens filosofi (720.1) @sv
broader: URN:NBN:fi:au:hklj:720
in scheme: URN:NBN:fi:au:hklj:
notation: 720.1
preferred label: Theory, aesthetics and philosophy of architecture @en
preferred label: Arkitekturens teori, estetik och filosofi @sv
related: URN:NBN:fi:au:hklj:721
related: Rakennuksen koristelu
related: URN:NBN:fi:au:hklj:726
related: Asuinrakennukset
related: Linnat. Linnoitukset. Palatsit. Kartanot
related: Kirkot ja muut uskonnolliset rakennukset
related: Kulttuurirakennukset
related: Kaupunkisuunnittelu. Kaupunkiarkkitehtuuri
related: Helsinki. Pääkaupunkiseutu
related: Sisustusarkkitehtuuri
related: Luonnon- ja kulttuurimaiseman suunnittelu
scope note: Arkkitehtuurin teoria, estetiikka ja filosofia yleensä Arkkitehtuurin asema, merkitys ja tehtävä yleensä Tiettyyn arkkitehtuurin erikoisalaan liittyvä teoria, estetiikka ja filosofia alan mukaisessa luokassa
scope note: Arkitekturens teori, estetik och filosofi i allmänhet Arkitekturens ställning, betydelse och uppgift i allmänhet Teori, estetik och filosofi som rör ett bestämt specialområde inom arkitektur klassificeras enligt område @sv

Sisustusarkkitehtuuri
type: Class
type: Concept
subclass of: URN:NBN:fi:au:hklj:720
alternative label: Arkkitehtuuri, sisustustaide (728)
alternative label: Arkkitehtuuripiirustukset, sisustustaide (728)
alternative label: Art deco, sisustustaide (728)
alternative label: Art noveau, sisustustaide (728)
alternative label: Asuinhuoneistot, sisustustaide (728)
alternative label: Asunnot, sisustustaide (728)
alternative label: Avokonttorit, sisustus (728)
alternative label: Avotoimistot, sisustus (728)
alternative label: Biedermeier, sisustustyylit (728)
alternative label: Bonkei, sisustus (728)
alternative label: Bonkei, sisustustaide (728)
alternative label: Edustustilat, sisustus (728)
alternative label: Entistäminen, sisustustaide (728)
alternative label: Etniset ravintolat, sisustustaide (728)
alternative label: Funktionalismi, sisustustaide (728)
alternative label: Henkilöstötilat, suunnittelu (728)
alternative label: Huoneet, sisustustaide (728)
alternative label: Huoneistot, sisustustaide (728)
alternative label: Huonekalut, sisustustaide (728)
alternative label: Hygieniatilat, sisustustaide (728)
alternative label: Hyllyt, sisustustaide (728)
alternative label: Hyvä maku, sisustustaide (728)
alternative label: Ikkunaverhot, sisustustaide (728)
alternative label: Interiöörit, sisustustaide (728)
alternative label: Istuimet, sisustustaide (728)
alternative label: Jugend, sisustustaide (728)
alternative label: Julkiset tilat, sisustus (728)
alternative label: Kaapit, sisustustaide (728)
alternative label: Kaihtimet, sisustustaide (728)
alternative label: Kakkosasunnot, sisustustaide (728)
alternative label: Kalusteet, sisustustaide (728)
alternative label: Kaupat, sisustus (728)
alternative label: Kauppahallit, sisustus (728)
alternative label: Kauppakeskukset, sisustus (728)
alternative label: Keittiökalusteet, sisustustaide (728)
alternative label: Keittiöt, sisustustaide (728)
alternative label: Kiinteä sisustus (728)
alternative label: Kodinsisustus, sisustustaide (728)
alternative label: Kokoustilat, sisustus (728)
alternative label: Konttorikalusteet, sisustustaide (728)
alternative label: Koti, sisustustaide (728)
alternative label: Kulttuurihistorialliset suojelukohteet, sisätilat (728)
alternative label: Kustavilainen tyyli, sisustustyylit (728)
alternative label: Kylpyhuoneet, sisustustaide (728)
alternative label: Lampunvarjostimet, sisustustaide (728)
alternative label: Lamput, sisustustaide (728)
alternative label: Lastenhuoneet, sisustustaide (728)
alternative label: Liikehuoneistot, sisustus (728)
alternative label: Loft-asunnot, sisustustaide (728)
alternative label: Lukusalit, sisustustaide (728)
alternative label: Lyhdyt, sisustustaide (728)
alternative label: Maisemakonttorit (728)
alternative label: Makuuhuoneet, sisustustaide (728)
alternative label: Monitoimitalot, sisustus (728)
alternative label: Myymäläkalusteet, sisustus (728)
alternative label: Näyttelytilat, sisustus (728)
alternative label: Olohuoneet, sisustustaide (728)
alternative label: Opetustilat, sisustus (728)
alternative label: Parvekkeet, sisustustaide (728)
alternative label: Patsaat, sisustustaide (728)
alternative label: Peilit, sisustustaide (728)
broader: URN:NBN:fi:au:hklj:720
in scheme: URN:NBN:fi:au:hklj:
notation: 728
related: Sähkövalo
related: Puuteollisuus
related: Paperi- ja selluloosateollisuus
related: Sisustusoppaat
related: Arkkitehtuurin teoria, estetiikka ja filosofia
related: Arkkitehtuurikilpailut. Arkkitehtuurinäyttelyt. Arkkitehtuuripalkinnot
related: URN:NBN:fi:au:hklj:720.9
related: URN:NBN:fi:au:hklj:760
related: Taideteollisuuden historia
related: Taidepuutyöt
related: Huonekalutaide
scope note: Sisustusarkkitehtuuri ja sisustustyylit sekä niiden historia Sisustusarkkitehtuurin henkilöhistoria Asuntoja koskeva sisustusarkkitehtuuri Julkisia tiloja koskeva sisustusarkkitehtuuri ja sisustusoppaat Sisustusarkkitehtuurin estetiikka Jos teoksessa on sekä kodinsisustamisen ohjeita että sisustusarkkitehtuuria, on etusija luokalla 695
scope note: Inredningsarkitektur och inredningsstilar samt deras historia Inredningsarkitekturens personhistoria Inredningsarkitektur som hänför sig till bostäder Inredningsarkitektur och inredningshandböcker som hänför sig till offentliga lokaler Inredningsarkitekturens estetik Om verket innehåller både inredningsråd och inredningsarkitektur ges företräde åt klass 695 @sv

Länsi- ja Keski-Eurooppa
type: Class
type: Concept
subclass of: URN:NBN:fi:au:hklj:730.9
alternative label: Alankomaat, kuvanveisto (730.93)
alternative label: Belgia, kuvanveisto (730.93)
alternative label: Hollanti, kuvanveisto (730.93)
alternative label: Itävalta, kuvanveisto (730.93)
alternative label: Romania, kuvanveisto (730.93)
alternative label: Sveitsi, kuvanveisto (730.93)
alternative label: Tsekki, kuvanveisto (730.93)
alternative label: Unkari, kuvanveisto (730.93)
alternative label: Belgien, skulptur (730.93) @sv
alternative label: Holland, skulptur (730.93) @sv
alternative label: Nederländerna, skulptur (730.93) @sv
alternative label: Rumänien, skulptur (730.93) @sv
alternative label: Schweiz, skulptur (730.93) @sv
alternative label: Tjeckien, skulptur (730.93) @sv
alternative label: Ungern, skulptur (730.93) @sv
alternative label: Österrike, skulptur (730.93) @sv
broader: URN:NBN:fi:au:hklj:730.9
in scheme: URN:NBN:fi:au:hklj:
narrower: Saksa
narrower: Ranska
narrower: Brittein saaret
notation: 730.93
preferred label: Western and central Europe @en
preferred label: Västeuropa och Centraleuropa @sv
related: URN:NBN:fi:au:hklj:709
related: Kuvanveistotaiteen materiaalit ja tekniikka
related: URN:NBN:fi:au:hklj:739
related: URN:NBN:fi:au:hklj:742
scope note: Benelux-maat. Alankomaat. Belgia. Luxemburg. Unkari. Puola. Tsekki. Slovakia. Romania. Sveitsi. Liechtenstein. Itävalta
scope note: Beneluxländerna. Nederländerna. Belgien. Luxemburg. Ungern. Polen. Tjeckien. Slovakien. Rumänien. Schweiz. Liechtenstein. Österrike @sv

Esihistoriallisen ajan maalaustaide
type: Class
type: Concept
subclass of: URN:NBN:fi:au:hklj:740.9
alternative label: Esihistoriallinen taide, kalliotaide (740.902)
alternative label: Esihistoriallinen taide, luolamaalaukset (740.902)
alternative label: Esihistoriallinen taide, maalaustaide (740.902)
alternative label: Kalliomaalaukset (740.902)
alternative label: Kalliopiirrokset (740.902)
alternative label: Kalliotaide (740.902)
alternative label: Kivikausi, luolamaalaukset (740.902)
alternative label: Luolamaalaukset, esihistorialliset (740.902)
alternative label: Bergskonst (740.902) @sv
alternative label: Förhistorisk konst, bergskonst (740.902) @sv
alternative label: Förhistorisk konst, grottmålningar (740.902) @sv
alternative label: Förhistorisk konst, målarkonst (740.902) @sv
alternative label: Grottmålningar, förhistoriska (740.902) @sv
alternative label: Hällristningar (740.902) @sv
alternative label: Klippmålningar (740.902) @sv
alternative label: Stenåldern, grottmålningar (740.902) @sv
broader: URN:NBN:fi:au:hklj:740.9
in scheme: URN:NBN:fi:au:hklj:
notation: 740.902
preferred label: Prehistoric painting @en
preferred label: Förhistoriska tidens målarkonst @sv
related: URN:NBN:fi:au:hklj:709
related: Esihistoriallinen taide
related: Eurooppa
related: Aasia
related: Afrikka
related: URN:NBN:fi:au:hklj:741
related: URN:NBN:fi:au:hklj:741.1
related: URN:NBN:fi:au:hklj:741.2
related: URN:NBN:fi:au:hklj:742
related: URN:NBN:fi:au:hklj:749
related: URN:NBN:fi:au:hklj:749.1
scope note: Maasta tai maanosasta riippumatta esihistoriallinen maalaustaide Luolamaalaukset. Kalliotaide. Kalliopiirrokset
scope note: Förhistorisk målarkonst i allmänhet oavsett land eller världsdel Grottmålningar, hällmålningar och hällristningar @sv

Keramiikkataide
type: Class
type: Concept
subclass of: Keramiikkataide. Posliinitaide
alternative label: Astiastot, taideteollisuus, keramiikka (765.1)
alternative label: Astiat, taideteollisuus, keramiikka (765.1)
alternative label: Esineet, taidekeramiikka (765.1)
alternative label: Keraamikot, elämäkerrat ja muistelmat (765.1)
alternative label: Keraamiset materiaalit, keramiikkataide (765.1)
alternative label: Keramiikka, keramiikkataide (765.1)
alternative label: Keramiikkataide (765.1)
alternative label: Keramiikkataiteilijat, elämäkerrat ja muistelmat (765.1)
alternative label: Kivitavara, keramiikkataide (765.1)
alternative label: Kynttilänjalat, keramiikkataide (765.1)
alternative label: Käsityöt, keramiikkatyöt (765.1)
alternative label: Lasitus, keramiikkataide (765.1)
alternative label: Maljakot, taideteollisuus, keramiikka (765.1)
alternative label: Muovailu, keramiikkatyöt (765.1)
alternative label: Poltto, keramiikka (765.1)
alternative label: Raku, keramiikkataide (765.1)
alternative label: Ruokailuastiat, keramiikkataide (765.1)
alternative label: Terrakotta, keramiikka (765.1)
alternative label: Bränning, keramik (765.1) @sv
alternative label: Föremål, konstkeramik (765.1) @sv
alternative label: Glasering, keramikkonst (765.1) @sv
alternative label: Handarbeten, keramikarbeten (765.1) @sv
alternative label: Keramer, keramikkonst (765.1) @sv
alternative label: Keramik, keramikkonst (765.1) @sv
alternative label: Keramiker, biografier och memoarer (765.1) @sv
alternative label: Keramikkonst (765.1) @sv
alternative label: Keramikkonstnärer, biografier och memoarer (765.1) @sv
alternative label: Kärl, konstindustri, keramik (765.1) @sv
alternative label: Ljusstakar, keramikkonst (765.1) @sv
alternative label: Matkärl, keramikkonst (765.1) @sv
alternative label: Modellering, konst, keramikarbeten (765.1) @sv
alternative label: Raku, keramikkonst (765.1) @sv
alternative label: Serviser, konstindustri, keramik (765.1) @sv
alternative label: Stengods, keramikkonst (765.1) @sv
alternative label: Terrakotta, keramik (765.1) @sv
alternative label: Vaser, konstindustri, keramik (765.1) @sv
broader: Keramiikkataide. Posliinitaide
in scheme: URN:NBN:fi:au:hklj:
notation: 765.1
preferred label: Ceramic art @en
preferred label: Keramikkonst @sv
related: Lasiteollisuus. Keraaminen teollisuus. Sementtiteollisuus
related: URN:NBN:fi:au:hklj:643.03
related: KUVANVEISTOTAIDE
related: URN:NBN:fi:au:hklj:730.9
related: Kuvanveistotaiteen materiaalit ja tekniikka
related: Taideteollisuuden teoria, estetiikka ja filosofia
related: Antiikkiesineiden keräily
related: Taideteollisuuden historia
related: Posliinitaide. Posliinimaalaus
related: URN:NBN:fi:au:hklj:767
scope note: Keramiikkataide, sen historia materiaalit, tekniikka ja estetiikka Keramiikkatyöohjeet ja -mallit Keramiikkaveistokset Keramiikkaesineet taideteollisuuden ja käsityön kannalta
scope note: Keramikkonst, dess historia, material, tekniker och estetik Beskrivningar och modeller för keramikkonst Keramikskulpturer Keramikföremål ur konstindustrins och konsthantverkets synvinkel @sv

Paperitaide
type: Class
type: Concept
subclass of: Muut taideteollisuuden alat
alternative label: Japaninpaperi, paperi, valmistus käsityönä (766.2)
alternative label: Kirigamit, paperitaide (766.2)
alternative label: Käsityöt, paperityöt (766.2)
alternative label: Liimaus, paperityöt (766.2)
alternative label: Lyhdyt, paperilyhdyt (766.2)
alternative label: Marmorointi, paperityöt (766.2)
alternative label: Origamit (766.2)
alternative label: Paperi, paperitaide (766.2)
alternative label: Paperi, paperityöt (766.2)
alternative label: Paperi, valmistus käsityönä (766.2)
alternative label: Paperimassatyöt (766.2)
alternative label: Paperinleikkaustaide (766.2)
alternative label: Paperintaittelu (766.2)
alternative label: Paperinvalmistus, käsityönä (766.2)
alternative label: Paperitaide (766.2)
alternative label: Paperityöt (766.2)
alternative label: Siluetit (766.2)
alternative label: Tekokukat, paperintaittelu (766.2)
alternative label: Viuhkat, paperitaide, paperityöt (766.2)
alternative label: Värjäys, paperitaide, paperityöt (766.2)
alternative label: Färgning, papperskonst, pappersarbeten (766.2) @sv
alternative label: Handarbeten, pappersdekor (766.2) @sv
alternative label: Japanskt papper, papper, tillverkning för hand (766.2) @sv
alternative label: Kirigam, papperskonst (766.2) @sv
alternative label: Konstgjorda blommor, pappersarbeten (766.2) @sv
alternative label: Limning, pappersdekor (766.2) @sv
alternative label: Lyktor, papperslyktor (766.2) @sv
alternative label: Marmorering, pappersdekor (766.2) @sv
alternative label: Origami (766.2) @sv
alternative label: Papier-maché (766.2) @sv
alternative label: Papper, pappersarbeten (766.2) @sv
alternative label: Papper, papperskonst (766.2) @sv
alternative label: Papper, tillverkning för hand (766.2) @sv
alternative label: Pappersarbeten (766.2) @sv
alternative label: Pappersklippskonst (766.2) @sv
alternative label: Papperskonst (766.2) @sv
alternative label: Papperstillverkning, som hantverk (766.2) @sv
alternative label: Pappersvikning (766.2) @sv
alternative label: Siluetter (766.2) @sv
alternative label: Solfjädrar, papperskonst, pappersarbeten (766.2) @sv
broader: Muut taideteollisuuden alat
in scheme: URN:NBN:fi:au:hklj:
notation: 766.2
preferred label: Paper art @en
preferred label: Papperskonst @sv
related: Paperi- ja selluloosateollisuus
related: URN:NBN:fi:au:hklj:710
related: URN:NBN:fi:au:hklj:749
related: URN:NBN:fi:au:hklj:749.1
related: Piirustuksen materiaalit ja tekniikka
related: Pilapiirrokset. Karikatyyrit
related: Taideteollisuuden teoria, estetiikka ja filosofia
related: Taideteollisuuden historia
related: Kulta- ja hopeasepäntaide. Korutaide
related: URN:NBN:fi:au:hklj:767
scope note: Paperitaide, sen historia, henkilöhistoria ja estetiikka Paperitaiteen materiaalit ja tekniikka Origami. Origamiohjeet ja -mallit Siluetit ja siluettitaide, niiden ohjeet ja mallit Paperin valmistus käsityönä Paperiesineet taideteollisuuden ja käsityön kannalta
scope note: Papperskonst, dess historia, personhistoria och estetik Papperskonstens material och tekniker Origami. Arbetsbeskrivningar och modeller för origami Silhuetter och silhuettkonst, beskrivningar och modeller för dem Pappersframställning som hantverk Pappersföremål som konstindustri och hobby @sv

Triot
type: Class
type: Concept
subclass of: Kamariyhtyeet (2-9 soittajaa)
alternative label: Triosonaatit (785.12 +)
alternative label: Triot, soitinyhtyeet (785.12 +)
alternative label: Trior, instrumentalensembler (785.12 +) @sv
alternative label: Triosonater (785.12 +) @sv
broader: Kamariyhtyeet (2-9 soittajaa)
in scheme: URN:NBN:fi:au:hklj:
narrower: Pianotriot
narrower: Näppäintriot
narrower: Jousitriot
narrower: Puhallintriot
narrower: Muut triot
notation: 785.12
preferred label: Trios @en
preferred label: Trio @sv
related: URN:NBN:fi:au:hklj:789

Kvartetit
type: Class
type: Concept
subclass of: Kamariyhtyeet (2-9 soittajaa)
alternative label: Kvartetit, soitinyhtyeet (785.13 +)
alternative label: Kvartetot (785.13 +)
alternative label: Kvartetter, ensembler, instrumentalensembler (785.13 +) @sv
alternative label: Kvartetter, kompositioner (785.13 +) @sv
broader: Kamariyhtyeet (2-9 soittajaa)
in scheme: URN:NBN:fi:au:hklj:
narrower: Pianokvartetit
narrower: Näppäinkvartetit
narrower: Jousikvartetit
narrower: Puhallinkvartetit
narrower: Muut kvartetit
notation: 785.13
preferred label: Quartets @en
preferred label: Kvartetter @sv
related: URN:NBN:fi:au:hklj:789

Kvintetit
type: Class
type: Concept
subclass of: Kamariyhtyeet (2-9 soittajaa)
alternative label: Kvintetit, soitinyhtyeet (785.14 +)
alternative label: Kvintetot (785.14 +)
alternative label: Kvintetter, ensembler, instrumentalensembler (785.14 +) @sv
alternative label: Kvintetter, kompositioner (785.14 +) @sv
broader: Kamariyhtyeet (2-9 soittajaa)
in scheme: URN:NBN:fi:au:hklj:
narrower: Pianokvintetit
narrower: Näppäinkvintetit
narrower: Jousikvintetit
narrower: Puhallinkvintetit
narrower: Muut kvintetit
notation: 785.14
preferred label: Quintets @en
preferred label: Kvintetter @sv
related: URN:NBN:fi:au:hklj:789

Konsertot yhdelle kosketinsoittimelle
type: Class
type: Concept
subclass of: Konsertot
broader: Konsertot
in scheme: URN:NBN:fi:au:hklj:
narrower: Pianokonsertot
narrower: Cembalokonsertot
narrower: Urkukonsertot
narrower: Konsertot muille kosketinsoittimille
notation: 785.624
preferred label: Concerti for a single keyboard instrument @en
preferred label: Konserter för ett klaviaturinstrument @sv
related: URN:NBN:fi:au:hklj:785.4
related: URN:NBN:fi:au:hklj:786
related: URN:NBN:fi:au:hklj:789

Muut puupuhaltimet
type: Class
type: Concept
subclass of: Puupuhaltimet
alternative label: Aulos (786.49)
alternative label: Bombard, soitin (786.49)
alternative label: Cornamusa (786.49)
alternative label: Cromorne (786.49)
alternative label: Flageoletti (786.49)
alternative label: Krummhorn (786.49)
alternative label: Panhuilu (786.49)
alternative label: Pommeri, soitin (786.49)
alternative label: Ranketti (786.49)
alternative label: Rauschpfeife (786.49)
alternative label: Bombard, instrument (786.49) @sv
alternative label: Flageolett (786.49) @sv
alternative label: Panflöjt (786.49) @sv
alternative label: Pommer, instrument (786.49) @sv
alternative label: Rackett (786.49) @sv
broader: Puupuhaltimet
in scheme: URN:NBN:fi:au:hklj:
notation: 786.49
preferred label: Other woodwind instruments @en
preferred label: Andra träblåsinstrument @sv
related: URN:NBN:fi:au:hklj:627.7531
related: URN:NBN:fi:au:hklj:681
related: URN:NBN:fi:au:hklj:781.5
related: URN:NBN:fi:au:hklj:782.6
related: URN:NBN:fi:au:hklj:785
related: URN:NBN:fi:au:hklj:785.11
related: URN:NBN:fi:au:hklj:788
related: URN:NBN:fi:au:hklj:789

Muut soittimet
type: Class
type: Concept
subclass of: URN:NBN:fi:au:hklj:786
alternative label: Automaattisoittimet (786.9)
alternative label: Automaattiurut (786.9)
alternative label: Kampiliira (786.9)
alternative label: Kampiviulu (786.9)
alternative label: Lasiharmonikka (786.9)
alternative label: Mekaaniset soittimet (786.9)
alternative label: Mekaaniset urut (786.9)
alternative label: Munniharppu (786.9)
alternative label: Pianola (786.9)
alternative label: Posetiivi (786.9)
alternative label: Rasiat, soittorasiat, musiikki (786.9)
alternative label: Saha, soittimena (786.9)
alternative label: Soittorasiat, musiikki (786.9)
alternative label: Suhistuspuu (786.9)
alternative label: Theremin (786.9)
alternative label: Trautonium (786.9)
alternative label: Askar, speldosor, musik (786.9) @sv
alternative label: Automatisk orgel (786.9) @sv
alternative label: Automatiska instrument (786.9) @sv
alternative label: Bull-roarer (786.9) @sv
alternative label: Glasharmonika (786.9) @sv
alternative label: Lira vielle (786.9) @sv
alternative label: Mekanisk orgel (786.9) @sv
alternative label: Mekaniska instrument (786.9) @sv
alternative label: Mungiga (786.9) @sv
alternative label: Speldosor, musik (786.9) @sv
alternative label: Såg, som musikinstrument (786.9) @sv
alternative label: Vevlira (786.9) @sv
alternative label: Vevpositiv (786.9) @sv
broader: URN:NBN:fi:au:hklj:786
in scheme: URN:NBN:fi:au:hklj:
notation: 786.9
preferred label: Other instruments @en
preferred label: Andra instrument @sv
related: URN:NBN:fi:au:hklj:627.7531
related: URN:NBN:fi:au:hklj:681
related: URN:NBN:fi:au:hklj:781.5
related: URN:NBN:fi:au:hklj:782.6
related: URN:NBN:fi:au:hklj:785
related: URN:NBN:fi:au:hklj:785.11
related: URN:NBN:fi:au:hklj:788
related: URN:NBN:fi:au:hklj:789
scope note: Automaattisoittimet, kuten posetiivi, soittorasia ja pianola
scope note: Mekaniska instrument såsom positiv, speldosor och pianola @sv

Soul. Funk. R&B
type: Class
type: Concept
subclass of: Blues. Soul
alternative label: Acid jazz (788.12)
alternative label: Funk (788.12)
alternative label: Soul (788.12)
broader: Blues. Soul
in scheme: URN:NBN:fi:au:hklj:
notation: 788.12
preferred label: Soul. Funk @en
related: URN:NBN:fi:au:hklj:782.4
related: URN:NBN:fi:au:hklj:783
related: URN:NBN:fi:au:hklj:783.1
related: URN:NBN:fi:au:hklj:785.7
related: URN:NBN:fi:au:hklj:786.8
related: URN:NBN:fi:au:hklj:787.112
related: URN:NBN:fi:au:hklj:789
related: URN:NBN:fi:au:hklj:795

Rap. Hip hop
type: Class
type: Concept
subclass of: Blues. Soul
alternative label: Hip hop, musiikki (788.13)
alternative label: Rap (788.13)
alternative label: Hip hop, musik (788.13) @sv
broader: Blues. Soul
in scheme: URN:NBN:fi:au:hklj:
notation: 788.13
related: URN:NBN:fi:au:hklj:782.4
related: URN:NBN:fi:au:hklj:783
related: URN:NBN:fi:au:hklj:783.1
related: URN:NBN:fi:au:hklj:785.7
related: URN:NBN:fi:au:hklj:786.8
related: URN:NBN:fi:au:hklj:787.112
related: URN:NBN:fi:au:hklj:789
related: URN:NBN:fi:au:hklj:795

Folk. Hootenanny
type: Class
type: Concept
subclass of: Folk. Country
alternative label: Folk (788.321)
alternative label: Folk rock (788.321)
alternative label: Folkmusiikki (788.321)
alternative label: Hootenanny (788.321)
alternative label: Folk musik (788.321) @sv
alternative label: Folk, populärmusik (788.321) @sv
broader: Folk. Country
in scheme: URN:NBN:fi:au:hklj:
notation: 788.321
preferred label: Folk. Hootenanny. Folk rock @en
related: URN:NBN:fi:au:hklj:782.4
related: URN:NBN:fi:au:hklj:783
related: URN:NBN:fi:au:hklj:783.1
related: URN:NBN:fi:au:hklj:785.7
related: URN:NBN:fi:au:hklj:786.8
related: URN:NBN:fi:au:hklj:787.112
related: Eurooppalainen maailmanmusiikki. Europpalainen etninen pop ja viihdemusikki
related: URN:NBN:fi:au:hklj:789
related: URN:NBN:fi:au:hklj:795

Arabialainen maailmanmusiikki. Arabialainen etninen pop ja viihdemusiikki
type: Class
type: Concept
subclass of: URN:NBN:fi:au:hklj:788.8
alternative label: Arabialainen musiikki, maailmanmusiikki (788.82)
alternative label: Arabialainen musiikki, populaarimusiikki (788.82)
alternative label: Arabialainen musiikki, viihdemusiikki (788.82)
alternative label: Etnopop, arabialainen maailmanmusiikki (788.82)
alternative label: Itämainen tanssi, maailmanmusiikki (788.82)
alternative label: Maailmanmusiikki, arabialainen maailmanmusiikki (788.82)
alternative label: Napatanssi, maailmanmusiikki (788.82)
alternative label: Rai, maailmanmusiikki (788.82)
alternative label: Vatsatanssi, maailmanmusiikki (788.82)
alternative label: Arabisk musik, populärmusik (788.82) @sv
alternative label: Arabisk musik, underhållningsmusik (788.82) @sv
alternative label: Arabisk musik, världsmusik (788.82) @sv
alternative label: Etnopop, arbisk världsmusik (788.82) @sv
alternative label: Magdans, världsmusik (788.82) @sv
alternative label: Orientalisk dans, världsmusik (788.82) @sv
alternative label: Rai, världsmusik (788.82) @sv
alternative label: Världsmusik, arbisk världsmusik (788.82) @sv
alternative label: Österländsk dans, världsmusik (788.82) @sv
broader: URN:NBN:fi:au:hklj:788.8
in scheme: URN:NBN:fi:au:hklj:
notation: 788.82
preferred label: Arabian world music. Arabian ethnic pop and light music. @en
preferred label: Arabisk världsmusik. Arabisk etnisk pop och underhållningsmusik @sv
related: URN:NBN:fi:au:hklj:782.4
related: URN:NBN:fi:au:hklj:783
related: URN:NBN:fi:au:hklj:783.1
related: URN:NBN:fi:au:hklj:785.7
related: URN:NBN:fi:au:hklj:786.8
related: URN:NBN:fi:au:hklj:787.112
related: URN:NBN:fi:au:hklj:789
related: URN:NBN:fi:au:hklj:795
scope note: Tässä esim. arabipop, rai ja vatsatanssimusiikki sekä muut Lähi-Idän ja Pohjois-Afrikan populaarityylit Tässä myös esim. turkkilainen ja iranilainen populaarimusiikki
scope note: Här till exepel arabisk pop, rai-musik och magdansmusik samt andra popularmusikstilar från Mellanöstern och Nordafrika Här också till exempel turkisk och iransk populärmusik @sv

Afrikkalainen maailmanmusiikki. Afrikkalainen etninen pop ja viihdemusiikki
type: Class
type: Concept
subclass of: URN:NBN:fi:au:hklj:788.8
alternative label: Afro, maailmanmusiikki (788.83)
alternative label: Afro-rock (788.83)
alternative label: Benga, maailmanmusiikki (788.83)
alternative label: Etnopop, afrikkalainen maailmanmusiikki (788.83)
alternative label: Juju (788.83)
alternative label: Maailmanmusiikki, afrikkalainen maailmanmusiikki (788.83)
alternative label: Makossa (788.83)
alternative label: Mbalax (788.83)
alternative label: Mbaqanga (788.83)
alternative label: Soukous (788.83)
alternative label: Taarab, maailmanmusiikki (788.83)
alternative label: Zouk, maailmanmusiikki (788.83)
alternative label: Afro, världsmusik (788.83) @sv
alternative label: Benga, världsmusik (788.83) @sv
alternative label: Etnopop, afrikansk världsmusik (788.83) @sv
alternative label: Taarab, världsmusik (788.83) @sv
alternative label: Världsmusik, afrikansk världsmusik (788.83) @sv
alternative label: Zouk, världsmusik (788.83) @sv
broader: URN:NBN:fi:au:hklj:788.8
in scheme: URN:NBN:fi:au:hklj:
notation: 788.83
preferred label: Arfrican world music. African ethnic pop and light music. @en
preferred label: Afrikansk världsmusik. Afrikansk etnisk pop och underhållningsmusik @sv
related: URN:NBN:fi:au:hklj:782.4
related: URN:NBN:fi:au:hklj:783
related: URN:NBN:fi:au:hklj:783.1
related: URN:NBN:fi:au:hklj:785.7
related: URN:NBN:fi:au:hklj:786.8
related: URN:NBN:fi:au:hklj:787.112
related: URN:NBN:fi:au:hklj:789
related: URN:NBN:fi:au:hklj:795
scope note: Tässä esim. afro, afro-rock, benga, highlife, juju, makossa, mbalax, mbaqanga, soukous, taarab ja zouk
scope note: Här till exempel afro, afro-rock, benga, highlife, juju, makossa, mbalax, mbaqanga, soukous, taarab ja zouk @sv

Benelux-maat
type: Class
type: Concept
subclass of: Keski-Eurooppa
broader: Keski-Eurooppa
in scheme: URN:NBN:fi:au:hklj:
narrower: Belgia
narrower: Alankomaat
notation: 789.225
preferred label: Benelux countries @en
preferred label: Beneluxländerna @sv
related: URN:NBN:fi:au:hklj:709
related: URN:NBN:fi:au:hklj:782.4
related: URN:NBN:fi:au:hklj:783
related: URN:NBN:fi:au:hklj:789.1
scope note: Benelux-maiden musiikin historian yleisteokset Tässä myös Luxemburg
scope note: Allmänna verk som rör musikens historia i Beneluxländernas Hit också Luxemburg @sv

Tsekkoslovakian alue
type: Class
type: Concept
subclass of: Itä-Eurooppa
broader: Itä-Eurooppa
in scheme: URN:NBN:fi:au:hklj:
narrower: Tsekki
narrower: Slovakia
notation: 789.262
preferred label: The former Czechoslovakia @en
preferred label: Det tidigare Tjeckoslovakien @sv
related: URN:NBN:fi:au:hklj:709
related: URN:NBN:fi:au:hklj:782.4
related: URN:NBN:fi:au:hklj:783
related: URN:NBN:fi:au:hklj:789.1
scope note: Tsekkoslovakian alueen musiikin historian yleisteokset
scope note: Allmänna verk som rör musikens historia i det tidigare Tjeckoslovakien @sv

Venäjä
type: Class
type: Concept
subclass of: Itsenäisten valtioiden yhteisö
alternative label: Venäjä, musiikinhistoria (789.271 +)
alternative label: Ryssland, musikhistoria (789.271 +) @sv
broader: Itsenäisten valtioiden yhteisö
in scheme: URN:NBN:fi:au:hklj:
narrower: Karjalan tasavalta
notation: 789.271
preferred label: Russia @en
preferred label: Ryssland @sv
related: URN:NBN:fi:au:hklj:709
related: URN:NBN:fi:au:hklj:782.4
related: URN:NBN:fi:au:hklj:783
related: URN:NBN:fi:au:hklj:789.1
related: Itä-Eurooppa
related: Itsenäisten valtioiden yhteisön Aasian puoleiset maat
scope note: Venäjä yleensä. Venäjän Euroopan ja Aasian puoleiset alueet
scope note: Ryssland i allmänhet. De asiatiska och europeiska områdena av Ryssland @sv

Väli-Amerikka
type: Class
type: Concept
subclass of: URN:NBN:fi:au:hklj:789
alternative label: Amerikka, musiikki, historia, Väli-Amer. (789.6 +)
alternative label: Amerika, musik, historia, Mellanamerika (789.6 +) @sv
broader: URN:NBN:fi:au:hklj:789
in scheme: URN:NBN:fi:au:hklj:
narrower: Karibianmeren saaret
notation: 789.6
preferred label: Central America @en
preferred label: Centralamerika @sv
related: URN:NBN:fi:au:hklj:709
related: URN:NBN:fi:au:hklj:782.4
related: URN:NBN:fi:au:hklj:783
related: URN:NBN:fi:au:hklj:789.1
related: Pohjois-Amerikka
related: Etelä-Amerikka
scope note: Väli-Amerikka yleensä. Keski-Amerikka Belize. Costa Rica. El Salvador. Guatemala. Honduras. Meksiko. Nicaragua. Panama
scope note: Centralamerika i allmänhet. Mellanamerika Belize. Costa Rica. El Salvador. Guatemala. Honduras. Mexico. Nicaragua. Panama @sv

Australia. Oseania
type: Class
type: Concept
subclass of: URN:NBN:fi:au:hklj:789
alternative label: Oseania, musiikinhistoria (789.8 +)
alternative label: Oceanien, musikhistoria (789.8 +) @sv
broader: URN:NBN:fi:au:hklj:789
in scheme: URN:NBN:fi:au:hklj:
narrower: Australia. Uusi-Seelanti. Uusi-Guinea
narrower: Tyynen meren saaret
notation: 789.8
preferred label: Australia. Oceania @en
preferred label: Australien. Oceanien @sv
related: URN:NBN:fi:au:hklj:709
related: URN:NBN:fi:au:hklj:782.4
related: URN:NBN:fi:au:hklj:783
related: URN:NBN:fi:au:hklj:789.1
scope note: Yleisteokset, jotka koskevat sekä Australian että Oseanian musiikin historiaa
scope note: Allmänna verk som rör både den australiska och oceaniska musikens historia @sv

Retkeily. Ulkoilu. Vuorikiipeily. Suunnistus
type: Class
type: Concept
subclass of: LIIKUNTA. URHEILU. LEIKIT. HUVIT
alternative label: Alppikiipeily (794)
alternative label: Boulderointi, kiipeily (794)
alternative label: Camping, erätaidot (794)
alternative label: Eloonjääminen (794)
alternative label: Eräelämä, retkeilyoppaat (794)
alternative label: Eräretkeily (794)
alternative label: Erätaidot (794)
alternative label: Erätaidot, retkeily (794)
alternative label: Eväät, retkeily (794)
alternative label: Henkiinjääminen (794)
alternative label: Henkiinjäämispeli (794)
alternative label: Huviretket, retkeily (794)
alternative label: Kalliokiipeily (794)
alternative label: Kiipeily (794)
alternative label: Kompassit, suunnistaminen (794)
alternative label: Kävelyreitit, retkeily, vaellus (794 +)
alternative label: Leirielämä (794)
alternative label: Leirikeskukset (794)
alternative label: Leirintä, erätaidot (794)
alternative label: Leirit (794)
alternative label: Liikuntamuodot, eri liikuntamuodot (791 ... 796 +)
alternative label: Lumikengät (794)
alternative label: Luonnon virkistyskäyttö, retkeily, ulkoilu (794)
alternative label: Luonto-oppaat, retkeily, erätaidot (794)
alternative label: Luontoliikunta (794)
alternative label: Luontoretkioppaat, retkeily, erätaidot (794)
alternative label: Maailmanmestaruuskisat, lajeittain (791 ... 796 +)
alternative label: Maajoukkueet, eri urheilulajit (791 ... 796 +)
alternative label: Maastoliikunta (794)
alternative label: Makuupussit, retkeily, erätaidot (794)
alternative label: Nuotiot (794)
alternative label: Patikointi, retkeily, vaellus (794)
alternative label: Piknikit, retkeily (794)
alternative label: Ratsastusreitit, ulkoilureitit, ulkoilu (794)
alternative label: Reput, retkeily (794)
alternative label: Retkeily, erätaidot, retkeily, ulkoilu (794)
alternative label: Retkeilyvarusteet (794)
alternative label: Retket, erätaidot, retkeily, ulkoilu (794)
alternative label: Rinkat, retkeily (794)
alternative label: Ruumiinkulttuuri, liikunta, eri lajit (791 ... 796 +)
alternative label: Seikkailu, henkiinjäämisoppaat (794)
alternative label: Seinäkiipeily (794)
alternative label: Selviytyminen (794)
alternative label: Selviytymispeli (794)
alternative label: Sprinttisuunnistus (794)
alternative label: Survival game (794)
alternative label: Suunnistus (794)
alternative label: Teltat (794)
alternative label: Tulisijat, retkeily (794)
alternative label: Tunturivaellus, erätaidot (794)
alternative label: Ulkoilu (794)
alternative label: Ulkoilualueet, ulkoilu, retkeily (794)
alternative label: Ulkoilumajat, retkeily (794)
alternative label: Ulkoilureitit, ulkoilu, retkeily (794)
alternative label: Ulkoiluvaatteet, ulkoilu, retkeily (794)
alternative label: Urheilulajit, eri urheilulajit (791 ... 796 +)
alternative label: Vaellus, retkeily, vaellus (794)
alternative label: Vuoret, vuorikiipeilyn tekniikka (794)
alternative label: Vuorikiipeily (794)
alternative label: Vuorikiipeily, vuorikiipeilyn tekniikka (794)
alternative label: Vuoristoretkeily, erätaidot (794)
alternative label: Yösuunnistus (794)
alternative label: Alpinism (794) @sv
broader: LIIKUNTA. URHEILU. LEIKIT. HUVIT
in scheme: URN:NBN:fi:au:hklj:
notation: 794
related: URN:NBN:fi:au:hklj:460
related: Yleiset matkaoppaat
related: Luonto-oppaat. Oppikirjat
related: URN:NBN:fi:au:hklj:657
related: Metsästys. Kalastus
related: Merenkulkuoppi
related: Hiihto. Alppihiihto. Ampumahiihto
related: Autourheilu
related: URN:NBN:fi:au:hklj:794.09
scope note: Erä-, vaellus- ja leiriytymistaidot. Retkeilyvälineet Erätaitoihin liittyvät henkiinjäämisoppaat Vuoristokiipeily. Vuoristokiipeilijän välineet Suunnistus. Suunnistuskilpailut. Suunnistustaidot Kartan ja kompassin käyttö suunnistuksessa Suunnistus ym. kilpa-, huippu- ja kuntourheilun kannalta Suunnistuskilpailut, -säännöt, -valmennus ja -välineet Retkeilyn ym. seurat ja järjestöt
scope note: Vildmarkskunskap, kunskap i vandring och camping. Utrustning för utflykter Överlevnadsguider som hänför sig till vildmarkskunskap Bergbestigning. Utrustning för bergbestigning Orientering. Orienteringstävlingar. Orienteringskunnande Användning av karta och kompass i orientering Orientering osv. ur tävlings-, elit- och motionsidrottens synvinkel Orienteringstävlingar, regler, träning och utrustning Klubbar och föreningar för utflykter m.m. @sv

Kirjallisuuden psykologia ja sosiologia
type: Class
type: Concept
subclass of: URN:NBN:fi:au:hklj:800
alternative label: Autenttisuus, kirjallisuuden psykologia (802)
alternative label: Ennakkosensuuri, kirjallisuus (802)
alternative label: Esikoiskirjailijat, kirjallisuuden sosiologia (802)
alternative label: Esikoisteokset, kirjallisuuden sosiologia (802)
alternative label: Kielletyt kirjat (802)
alternative label: Kilpailut, kirjallisuus (802)
alternative label: Kirjallinen viestintä, kirjallisuuden psykologia (802)
alternative label: Kirjallinen viestintä, kirjallisuuden sosiologia (802)
alternative label: Kirjallisuuden psykologia (802)
alternative label: Kirjallisuuden sosiologia (802)
alternative label: Kirjallisuudentutkimus, kirjallisuuden sosiologia (802)
alternative label: Kirjallisuuspalkinnot (802)
alternative label: Kirjallisuuspiirit, kirjallisuuden sosiologia (802)
alternative label: Kirjallisuuspolitiikka (802)
alternative label: Kirjallisuussensuuri (802)
alternative label: Kirjallisuussosiologia (802)
alternative label: Kirjallisuustapahtumat (802)
alternative label: Kirjallisuustiede, kirjallisuuden sosiologia (802)
alternative label: Kirjasensuuri (802)
alternative label: Kirjoitettu sana, sensuuri (802)
alternative label: Kirjoituskilpailut (802)
alternative label: Lempäälän runomaraton, kirjallisuustapahtumat (802)
alternative label: Lukupiirit, kirjallisuuden sosiologia (802)
alternative label: Plagiaatit, kirjallisuus (802)
alternative label: Plagiointi, kirjallisuus (802)
alternative label: Sensuuri, kirjallisuus (802)
alternative label: Taiteilijakodit, kirjallisuuspolitiikka (802)
alternative label: Taiteilijatalot, kirjallisuuspolitiikka (802)
alternative label: Autenticitet, litteraturpsykologi (802) @sv
alternative label: Bokcensur (802) @sv
alternative label: Bokcirklar, litteraturens sociologi (802) @sv
alternative label: Censur, litteratur (802) @sv
alternative label: Debutförfattare, litteraturens sociologi (802) @sv
alternative label: Debutverk, litteraturens sociologi (802) @sv
alternative label: Förbjudna böcker (802) @sv
alternative label: Förhandscensur, litteratur (802) @sv
alternative label: Konstnärshem, litteraturpolitik (802) @sv
alternative label: Konstnärshus, litteraturpolitik (802) @sv
alternative label: Lempäälän runomaraton, litteraturevenemang (802) @sv
alternative label: Litteraturcensur (802) @sv
alternative label: Litteraturcirklar, litteraturens sociologi (802) @sv
alternative label: Litteraturens sociologi (802) @sv
alternative label: Litteraturevenemang (802) @sv
alternative label: Litteraturforskning, litteraturens sociologi (802) @sv
alternative label: Litteraturpolitik (802) @sv
alternative label: Litteraturpris (802) @sv
alternative label: Litteraturpsykologi (802) @sv
alternative label: Litteratursociologi (802) @sv
alternative label: Litteraturvetenskap, litteraturens sociologi (802) @sv
alternative label: Plagiat, litteratur (802) @sv
alternative label: Plagiering, litteratur (802) @sv
alternative label: Skriftlig kommunikation, litteraturens sociologi (802) @sv
alternative label: Skriftlig kommunikation, litteraturpsykologi (802) @sv
alternative label: Skrivartävlingar (802) @sv
alternative label: Skrivna ordet, censur (802) @sv
alternative label: Tävlingar, litteratur (802) @sv
broader: URN:NBN:fi:au:hklj:800
in scheme: URN:NBN:fi:au:hklj:
notation: 802
preferred label: Psychology and sociology of literature @en
preferred label: Litteraturpsykologi och litteratursociologi @sv
related: Symbolit. Koodit. Merkkijärjestelmät
related: Lukeminen. Lukutaito
related: Kirjastojen tehtävä ja tarkoitus
related: URN:NBN:fi:au:hklj:060
related: URN:NBN:fi:au:hklj:061
related: URN:NBN:fi:au:hklj:063
related: URN:NBN:fi:au:hklj:120
related: URN:NBN:fi:au:hklj:323
related: Taiteen estetiikka. Taidefilosofia. Taidepsykologia. Taidesosiologia. Taidepolitiikka
related: Kirjallisuuden filosofia, teoria ja estetiikka. Runousoppi
related: Kielipsykologia. Kielisosiologia. Kielipolitiikka
scope note: Kirjallisuuden psykologia ja sosiologia yleensä Kirjallisuuspolitiikka yleensä Kirjallisuuden asema yhteiskunnassa yleensä Kirjallisuuden vapaus ja sensuuri yleensä Kirjallisuuden rahoitus ja apurahat yleensä Kirjallisuutta koskeva taidepolitiikka yleensä Jos teos koskee tiettyä kirjallisuustyyppiä tai aihepiiriä, tietyn kielen tai tietyn aikakauden kirjallisuutta, on etusija järjestyksessä: kirjallisuustyyppi tai aihepiiri, kieli, aikakausi
scope note: Litteraturpsykologi och litteratursociologi i allmänhet Litteraturpolitik i allmänhet Litteraturens ställning i samhället i allmänhet Frihet och censur inom litteraturen i allmänhet Finansiering av litteratur och litteraturstipendier i allmänhet Konstpolitik som hänför sig till litteratur i allmänhet Om verket representerar en bestämd genre eller ett bestämt temaområde inom litteraturen eller om det hänför sig till litteraturen på ett bestämt språk eller under en bestämd tidsperiod, är prioritetsordningen följande: litterär genre eller temaområde, språk, tidsperiod @sv

Pohjoismaisten kielten kirjallisuuden historia ja tutkimus
type: Class
type: Concept
subclass of: GERMAANISTEN KIELTEN KIRJALLISUUDEN HISTORIA JA TUTKIMUS
alternative label: Pohjoisgermaaniset kielet, kirjallisuudenhistoria (820.1 ... 824)
alternative label: Pohjoismaiset kielet, kirjallisuuden historia (820.1 ... 824)
alternative label: Skandinaaviset kielet, kirjallisuuden historia (820.1 ... 824)
alternative label: Nordgermanska språk, litteraturhistoria (820.1 ... 824) @sv
alternative label: Nordiska språk, litteraturhistoria (820.1 ... 824) @sv
alternative label: Skandinaviska språk, litteraturhistoria (820.1 ... 824) @sv
broader: GERMAANISTEN KIELTEN KIRJALLISUUDEN HISTORIA JA TUTKIMUS
in scheme: URN:NBN:fi:au:hklj:
notation: 820.1
preferred label: Nordic literature: history and research @en
preferred label: Nordisk litteraturhistoria och forskning i nordisk litteratur @sv
related: Kirjallisuuden aihepiirejä ja kirjallisuustyyppejä koskeva historia ja tutkimus
related: Lasten- ja nuortenkirjallisuuden historia ja tutkimus
related: Suomenkielisen kirjallisuuden historia ja tutkimus
related: Suomenkielisen kansanrunouden historia ja tutkimus
related: Suomenkielisen kirjallisuuden aihepiirejä ja kirjallisuustyyppejä koskeva historia ja tutkimus
related: Suomenkielisen lasten- ja nuortenkirjallisuuden historia ja tutkimus
related: Ruotsinkielisen kirjallisuuden historia ja tutkimus
related: Suomenruotsalaisen kirjallisuuden historia ja tutkimus
related: Tanskankielisen kirjallisuuden historia ja tutkimus
related: Norjankielisen kirjallisuuden historia ja tutkimus
related: Islanninkielisen kirjallisuuden historia ja tutkimus
scope note: Pohjoismaisten, pohjoisgermaanisten tai skandinaavisten kielten kirjallisuuden historian ja tutkimuksen yleisteokset Pohjoismaiden kirjallisuuden historia ja tutkimus yleensä Tässä myös teokset, jotka koskevat sekä Suomen että muiden Pohjoismaiden kirjallisuuden historiaa ja tutkimusta
scope note: Allmänna verk om nordisk, nordgermansk eller skandinavisk litteraturhistoria och forskning i nordisk litteratur Nordisk litteraturhistoria och litteraturforskning i allmänhet Hit också verk som handlar om både finländsk och annan nordisk litteraturhistoria och forskning i både finländsk och annan nordisk litteratur @sv

Ruotsin kielen äänneoppi
type: Class
type: Concept
subclass of: Ruotsin kieli
broader: Ruotsin kieli
in scheme: URN:NBN:fi:au:hklj:
notation: 872.1
preferred label: Swedish phonetics @en
preferred label: Svensk ljudlära @sv
related: Oppimisen psykologia
related: Luku-, kirjoitus- ja puhehäiriöiset
related: URN:NBN:fi:au:hklj:188.4
related: Sähköposti. Verkkojuttelu
related: URN:NBN:fi:au:hklj:627.7512
related: Ilmaisutaito. Puhetaito. Lausuntataide
related: Äänneoppi
related: URN:NBN:fi:au:hklj:860
related: Pohjoismaiset kielet
related: Ruotsin kielen murteet
related: Suomenruotsi
scope note: Äänneoppi. Fonetiikka. Fonologia Äänteet. Ääntäminen. Vokaalit. Konsonantit. Kombinaatio-oppi Kvantiteetti. Aksentti. Äänteenmuutokset yleensä
scope note: Ljudlära. Fonetik. Fonologi Språkljud. Uttal. Vokaler. Konsonanter. Fonotax Kvantitet. Accent. Ljudförändringar i allmänhet @sv

Suomen kielen äänneoppi
type: Class
type: Concept
subclass of: Suomen kieli
alternative label: Aksentti, suomen kieli (884.1)
alternative label: Artikulaatio, suomen kieli (884.1)
alternative label: Artikuloiminen, suomen kieli (884.1)
alternative label: Artikulointi, suomen kieli (884.1)
alternative label: Assimilaatio, suomen kieli (884.1)
alternative label: Astevaihtelu, suomen kieli (884.1)
alternative label: Diftongit, suomen kieli (884.1)
alternative label: Foneemit, suomen kieli (884.1)
alternative label: Fonetiikka, suomen kieli (884.1)
alternative label: Fonologia, suomen kieli (884.1)
alternative label: Intonaatio, suomen kieli (884.1)
alternative label: Kadenssit, suomen kieli (884.1)
alternative label: Kokeellinen fonetiikka, suomen kieli (884.1)
alternative label: Kombinaatio-oppi, kielitiede, suomen kieli (884.1)
alternative label: Konsonantit, suomen kieli (884.1)
alternative label: Korrelaatio, suomen kieli (884.1)
alternative label: Kvantiteetti, suomen kieli (884.1)
alternative label: Prosodiikka, suomen kieli (884.1)
alternative label: Puhetieteet, fonetiikka, suomen kieli (884.1)
alternative label: Suomen kieli, fonetiikka (884.1)
alternative label: Vokaalisointu, suomen kieli (884.1)
alternative label: Vokaalit, suomen kieli (884.1)
alternative label: Äänneoppi, suomen kieli (884.1)
alternative label: Äännevaihtelu, suomen kieli (884.1)
alternative label: Äänteet, suomen kieli (884.1)
alternative label: Ääntäminen, suomen kieli (884.1)
alternative label: Accent, finska språket (884.1) @sv
alternative label: Artikulation, finska (884.1) @sv
alternative label: Assimilation, finska språket (884.1) @sv
alternative label: Diftonger, finska (884.1) @sv
alternative label: Experimentell fonetik, finska (884.1) @sv
alternative label: Finska, fonetik (884.1) @sv
alternative label: Fonem, finska (884.1) @sv
alternative label: Fonetik, finska (884.1) @sv
alternative label: Fonologi, finska (884.1) @sv
alternative label: Intonation, finska (884.1) @sv
alternative label: Kadenser, finska (884.1) @sv
alternative label: Kombinatorik, lingvistik, finska (884.1) @sv
alternative label: Konsonanter, finska (884.1) @sv
alternative label: Korrelation, finska (884.1) @sv
alternative label: Kvantitet, lingvistik, finska (884.1) @sv
alternative label: Ljud, språk, finska (884.1) @sv
alternative label: Ljudlära. lingvistik, finska (884.1) @sv
alternative label: Ljudväxling, finska (884.1) @sv
alternative label: Prosodi, finska (884.1) @sv
alternative label: Stadieväxling, finska språket (884.1) @sv
alternative label: Talvetenskaper, fonetik, finska (884.1) @sv
alternative label: Uttal, finska (884.1) @sv
alternative label: Vokaler, finska (884.1) @sv
alternative label: Vokalharmoni, finska (884.1) @sv
broader: Suomen kieli
in scheme: URN:NBN:fi:au:hklj:
notation: 884.1
preferred label: Finnish phonetics @en
preferred label: Finsk ljudlära @sv
related: Oppimisen psykologia
related: Luku-, kirjoitus- ja puhehäiriöiset
related: URN:NBN:fi:au:hklj:188.4
related: Sähköposti. Verkkojuttelu
related: URN:NBN:fi:au:hklj:627.7512
related: Ilmaisutaito. Puhetaito. Lausuntataide
related: Äänneoppi
related: Ruotsin kielen murteet
related: Suomenruotsi
related: Itämerensuomalaiset kielet
related: Suomen kielen murteet
scope note: Äänneoppi. Fonetiikka. Fonologia Äänteet. Ääntäminen. Vokaalit. Konsonantit. Kombinaatio-oppi Kvantiteetti. Aksentti. Äänteenmuutokset yleensä
scope note: Ljudlära. Fonetik. Fonologi Språkljud. Uttal. Vokaler. Konsonanter. Fonotax Kvantitet. Accent. Ljudförändringar i allmänhet @sv

Erotiikan historia
type: Class
type: Concept
subclass of: URN:NBN:fi:au:hklj:919
alternative label: Bordellit, erotiikan kulttuurihistoria (919.8)
alternative label: Erotiikka, kulttuurihistoria (919.8)
alternative label: Ilotalot, erotiikan kulttuurihistoria (919.8)
alternative label: Intohimo, erotiikan kulttuurihistoria (919.8)
alternative label: Kauneus, erotiikan historia (919.8)
alternative label: Kauneusihanteet, erotiikan historia (919.8)
alternative label: Keho, erotiikan historia (919.8)
alternative label: Porno, erotiikan kulttuurihistoria (919.8)
alternative label: Pornografia, erotiikan kulttuurihistoria (919.8)
alternative label: Prostituoidut, erotiikan kulttuurihistoria (919.8)
alternative label: Prostituutio, erotiikan kulttuurihistoria (919.8)
alternative label: Rakastajat, erotiikan kulttuurihistoria (919.8)
alternative label: Rakastajattaret, erotiikan kulttuurihistoria (919.8)
alternative label: Rakkaussuhde, erotiikan kulttuurihistoria (919.8)
alternative label: Rinnat, erotiikan historia (919.8)
alternative label: Seksi, erotiikan kulttuurihistoria (919.8)
alternative label: Suutelu, erotiikan kulttuurihistoria (919.8)
alternative label: Tabut, erotiikan historia (919.8)
alternative label: Vartalo, erotiikan historia (919.8)
alternative label: Viettely, erotiikan kulttuurihistoria (919.8)
alternative label: Bordeller, erotikens kulturhistoria (919.8) @sv
alternative label: Brösten, erotikens historia (919.8) @sv
alternative label: Erotik, kulturhistoria (919.8) @sv
alternative label: Figuren, erotikens historia (919.8) @sv
alternative label: Förförelse, erotikens kulturhistoria (919.8) @sv
alternative label: Glädjehus, erotikens kulturhistoria (919.8) @sv
alternative label: Kroppen, keho, erotikens historia (919.8) @sv
alternative label: Kyssande, erotikens kulturhistoria (919.8) @sv
alternative label: Kärleksförhållande, erotikens kulturhistoria (919.8) @sv
alternative label: Passion, erotikens kulturhistoria (919.8) @sv
alternative label: Pornografi, erotikens kulturhistoria (919.8) @sv
alternative label: Porr, erotikens kulturhistoria (919.8) @sv
alternative label: Prostituerade, erotikens kulturhistoria (919.8) @sv
alternative label: Prostitution, erotikens kulturhistoria (919.8) @sv
alternative label: Sex, erotikens kulturhistoria (919.8) @sv
alternative label: Skönhet, erotikens historia (919.8) @sv
alternative label: Skönhetsideal, erotikens historia (919.8) @sv
alternative label: Tabun, erotikens historia (919.8) @sv
alternative label: Älskare, erotikens kulturhistoria (919.8) @sv
alternative label: Älskarinnor, erotikens kulturhistoria (919.8) @sv
broader: URN:NBN:fi:au:hklj:919
in scheme: URN:NBN:fi:au:hklj:
notation: 919.8
preferred label: History of eroticism @en
preferred label: Erotikens historia @sv
related: Itämainen filosofia
related: Kulttuurifilosofia
related: Käytös- ja tapatieto
related: Juhlien järjestäminen
related: Esineellinen kulttuuri
related: URN:NBN:fi:au:hklj:473
related: Seksologia
related: URN:NBN:fi:au:hklj:649.91
related: URN:NBN:fi:au:hklj:909
related: Historian tutkimusmenetelmät
related: Historian aputieteet
scope note: Erotiikan ja seksuaalisuuden historia ja kulttuurihistoria eri maanosissa ja maissa sekä eri aikakausina Pornografia ja prostituutio historian ja kulttuurihistorian kannalta
scope note: Erotikens och sexualitetens historia och kulturhistoria i olika världsdelar och länder samt under olika tidsperioder Pornografin och prostitutionen ur historisk och kulturhistorisk synvinkel @sv

Keskiaika 1155-1522
type: Class
type: Concept
subclass of: URN:NBN:fi:au:hklj:920
alternative label: Ristiretket, Suomen historia (922)
alternative label: Ristiretkiaika, Suomen historia (922)
alternative label: Ruotsin vallan aika, aikakausittain (922 ... 925)
alternative label: Suomen historia, 1155-1523 (922)
alternative label: Vanha viha 1495-1497, keskiaika, Suomen historia (922)
alternative label: Finlands historia, 1155-1523 (922) @sv
alternative label: Korståg, Finlands historia (922) @sv
alternative label: Korstågstiden, Finlands historia (922) @sv
alternative label: Svensk-ryska kriget 1495-1497, medeltiden, Finlands historia (922) @sv
alternative label: Svenska tiden, enligt tidsålder (922 ... 925) @sv
broader: URN:NBN:fi:au:hklj:920
in scheme: URN:NBN:fi:au:hklj:
notation: 922
preferred label: Middle ages 1155–1522 @en
preferred label: Medeltiden 1155–1522 @sv
related: URN:NBN:fi:au:hklj:061
related: Suomi
related: Suomen ulkopolitiikka
related: URN:NBN:fi:au:hklj:411
related: Suomenruotsalaisten asuma-alueet
related: Suomen yleinen taidehistoria
related: URN:NBN:fi:au:hklj:909
related: URN:NBN:fi:au:hklj:919
related: URN:NBN:fi:au:hklj:930
related: Neuvostoliiton historia 1945-1991
scope note: Ensimmäisestä ristiretkestä Kalmarin Unionin loppuun
scope note: Från det första korståget till Kalmarunionens slut @sv

Reformaation aika 1523-1617
type: Class
type: Concept
subclass of: URN:NBN:fi:au:hklj:920
alternative label: Nuijasota, Suomen historia (923)
alternative label: Ruotsin vallan aika, aikakausittain (922 ... 925)
alternative label: Suomen historia, 1524-1617 (923)
alternative label: Finlands historia, 1524-1617 (923) @sv
alternative label: Klubbekriget, Finlands historia (923) @sv
alternative label: Svenska tiden, enligt tidsålder (922 ... 925) @sv
broader: URN:NBN:fi:au:hklj:920
in scheme: URN:NBN:fi:au:hklj:
notation: 923
preferred label: Reformation 1523–1617 @en
preferred label: Reformationstiden 1523–1617 @sv
related: URN:NBN:fi:au:hklj:061
related: Suomi
related: Suomen ulkopolitiikka
related: URN:NBN:fi:au:hklj:411
related: Suomenruotsalaisten asuma-alueet
related: Suomen yleinen taidehistoria
related: URN:NBN:fi:au:hklj:909
related: URN:NBN:fi:au:hklj:919
related: URN:NBN:fi:au:hklj:930
related: Neuvostoliiton historia 1945-1991
scope note: Kustaa Vaasan valtaistuimelle noususta Stolbovan rauhaan
scope note: Från Gustav Vasas tronbestigning till freden i Stolbova @sv

Ruotsin suurvalta-aika 1618-1721
type: Class
type: Concept
subclass of: URN:NBN:fi:au:hklj:920
alternative label: Hakkapeliitat, Suomen historia (924)
alternative label: Isoviha, Suomen historia (924)
alternative label: Kolmikymmenvuotinen sota, Suomen historia (924)
alternative label: Ruotsin vallan aika, aikakausittain (922 ... 925)
alternative label: Suomen historia, 1618-1721 (924)
alternative label: Suurvalta-aika, Suomen historia (924)
alternative label: Finlands historia, 1618-1721 (924) @sv
alternative label: Hakkapeliter, Finlands historia (924) @sv
alternative label: Stora ofreden, Finlands historia (924) @sv
alternative label: Stormaktstiden, Finlands historia (924) @sv
alternative label: Svenska tiden, enligt tidsålder (922 ... 925) @sv
alternative label: Trettioåriga kriget, Finlands historia (924) @sv
broader: URN:NBN:fi:au:hklj:920
in scheme: URN:NBN:fi:au:hklj:
notation: 924
preferred label: Sweden’s period as a great power 1618–1721 @en
preferred label: Sveriges stormaktstid 1618–1721 @sv
related: URN:NBN:fi:au:hklj:061
related: Suomi
related: Suomen ulkopolitiikka
related: URN:NBN:fi:au:hklj:411
related: Suomenruotsalaisten asuma-alueet
related: Suomen yleinen taidehistoria
related: URN:NBN:fi:au:hklj:909
related: URN:NBN:fi:au:hklj:919
related: URN:NBN:fi:au:hklj:930
related: Neuvostoliiton historia 1945-1991
scope note: Stolbovan rauhaa seuranneesta ajasta Uudenkaupungin rauhaan
scope note: Tiden efter freden i Stolbova fram till freden i Nystad @sv

Vapauden aika ja kustavilainen aika 1722-1809
type: Class
type: Concept
subclass of: URN:NBN:fi:au:hklj:920
alternative label: Anjalan liitto (925)
alternative label: Haminan rauha (925)
alternative label: Kustavilainen aika, Suomen historia (925)
alternative label: Pikkuviha, Suomen historia (925)
alternative label: Ruotsin vallan aika, aikakausittain (922 ... 925)
alternative label: Suomen historia, 1722-1809 (925)
alternative label: Suomen sota 1808-1809, historia (925)
alternative label: Vapauden aika, Suomen historia (925)
alternative label: Anjalaförbundet (925) @sv
alternative label: Finlands historia, 1722-1809 (925) @sv
alternative label: Finska kriget 1808-1809, historia (925) @sv
alternative label: Freden i Fredrikshamn (925) @sv
alternative label: Frihetstiden, Finlands historia (925) @sv
alternative label: Gustavianska tiden, Finlands historia (925) @sv
alternative label: Lilla ofreden, Finlands historia (925) @sv
alternative label: Svenska tiden, enligt tidsålder (922 ... 925) @sv
broader: URN:NBN:fi:au:hklj:920
in scheme: URN:NBN:fi:au:hklj:
notation: 925
preferred label: The Age of Freedom and the Gustavian period 1722–1809 @en
preferred label: Frihetstiden och den gustavianska tiden 1722–1809 @sv
related: URN:NBN:fi:au:hklj:061
related: Suomi
related: Suomen ulkopolitiikka
related: URN:NBN:fi:au:hklj:411
related: Suomenruotsalaisten asuma-alueet
related: Suomen yleinen taidehistoria
related: URN:NBN:fi:au:hklj:909
related: URN:NBN:fi:au:hklj:919
related: URN:NBN:fi:au:hklj:930
related: Neuvostoliiton historia 1945-1991
scope note: Uudenkaupungin rauhaa seuranneesta ajasta Haminan rauhaan
scope note: Från tiden efter freden i Nystad till freden i Fredrikshamn @sv

Keski-Amerikan historia
type: Class
type: Concept
subclass of: Amerikan historia
alternative label: Alankomaiden Antillit, historia (987.3)
alternative label: Anguilla, historia (987.3)
alternative label: Antigua ja Barbuda, historia (987.3)
alternative label: Antillit, historia (987.3)
alternative label: Aruba, historia (987.3)
alternative label: Asteekit, arkeologia ja historia (987.3)
alternative label: Atsteekit, arkeologia ja historia (987.3)
alternative label: Bahama, historia (987.3)
alternative label: Barbados, historia (987.3)
alternative label: Barbuda, historia (987.3)
alternative label: Belize, historia (987.3)
alternative label: Bermuda, historia (987.3)
alternative label: Caicos, historia (987.3)
alternative label: Caymansaaret, historia (987.3)
alternative label: Costa Rica, historia (987.3)
alternative label: Dominica, historia (987.3)
alternative label: Dominikaaninen tasavalta, historia (987.3)
alternative label: El Salvador, historia (987.3)
alternative label: Grenada, historia (987.3)
alternative label: Grenadiinit, historia (987.3)
alternative label: Guadeloupe, historia (987.3)
alternative label: Guatemala, historia (987.3)
alternative label: Haiti, historia (987.3)
alternative label: Honduras, historia (987.3)
alternative label: Intiaanisodat, Keski-Amerikka (987.3)
alternative label: Isot Antillit, historia (987.3)
alternative label: Jamaika, historia (987.3)
alternative label: Karibianmeren saaret, historia (987.3)
alternative label: Keski-Amerikka, historia (987.3)
alternative label: Konkistadorit, Keski-Amerikka, historia (987.3)
alternative label: Kuuba, historia (987.3)
alternative label: Länsi-Intian saaristo, historia (987.3)
alternative label: Martinique, historia (987.3)
alternative label: Mayat, arkeologia ja historia (987.3)
alternative label: Meksiko, historia (987.3)
alternative label: Montserrat, historia (987.3)
alternative label: Neitsytsaaret, historia (987.3)
alternative label: Nevis, historia (987.3)
alternative label: Nicaragua, historia (987.3)
alternative label: Panama, historia (987.3)
alternative label: Pienet Antillit, historia (987.3)
alternative label: Pohjois-Amerikka, Meksiko, historia (987.3)
alternative label: Puerto Rico, historia (987.3)
alternative label: Pyramidit, Keski-Amerikan historia (987.3)
alternative label: Saint Kitts-Nevis, historia (987.3)
alternative label: Saint Lucia, historia (987.3)
alternative label: Saint Vincent ja Grenadiinit, historia (987.3)
alternative label: Salvador, historia (987.3)
alternative label: Tobago, historia (987.3)
alternative label: Tolteekit, arkeologia ja historia (987.3)
alternative label: Trinidad ja Tobago, historia (987.3)
alternative label: Turks ja Caicos, historia (987.3)
alternative label: Väli-Amerikka, historia (987.3)
alternative label: Antigua och Barbuda, historia (987.3) @sv
alternative label: Antillerna, historia (987.3) @sv
alternative label: Azteker, asteekit, arkeologi och historia (987.3) @sv
alternative label: Azteker, atsteekit, arkeologi och historia (987.3) @sv
alternative label: Caymanöarna, historia (987.3) @sv
alternative label: Centralamerika, historia (987.3) @sv
alternative label: Conquistadorer, Centralamerika, historia (987.3) @sv
alternative label: Dominikanska republiken, historia (987.3) @sv
alternative label: Grenadinerna, historia (987.3) @sv
alternative label: Indiankrig, Centralamerika (987.3) @sv
alternative label: Jungfruöarna, historia (987.3) @sv
broader: Amerikan historia
in scheme: URN:NBN:fi:au:hklj:
notation: 987.3
related: Pohjois-Amerikka
related: Meksiko
related: Keski-Amerikka
related: Karibianmeren saaret
related: Brasilia
related: Argentiina
related: Yhdysvaltojen historia
related: Etelä-Amerikan historia
scope note: Väli-Amerikan historia. Karibianmeren saarten historia Alankomaiden Antillien, Anguillan, Antiguan ja Barbudan, Aruban, Bahaman, Barbadoksen, Belizen, Bermudan, Caymansaarten, Costa Rican, Dominican, Dominikaanisen tasavallan, El Salvadorin, Grenadan, Guadeloupen, Guatemalan, Haitin, Hondurasin, Jamaikan, Kuuban, Martiniquen, Meksikon, Montserratin, Neitsytsaarten, Nicaraguan, Panaman, Puerto Ricon, Saint-Kittsin ja Nevisin, Saint Lucian, Saint Vincentin ja Grenadiinien, Trinidadin ja Tobagon sekä Turks- ja Caicossaarten historia
scope note: Mellanamerikas historia. Karibiska öarnas historia Anguillas, Antigua och Barbudas, Arubas, Bahamaöarnas, Barbados, Belizes, Bermudas, Caymanöarnas, Costa Ricas, Dominicas, Dominikanska republikens, El Salvadors, Grenadas, Guadeloupes, Guatemalas, Haitis, Honduras, Jamaicas, Jungfruöarnas, Kubas, Martiniques, Mexicos, Montserrats, Nederländska Antillernas, Nicaraguas, Panamas, Puerto Ricos, Saint Christopher och Nevis, Saint Lucias, Saint Vincents och Grenadinernas, Trinidad och Tobagos samt Turks- och Caicosöarnas historia @sv

Etelä-Amerikan historia
type: Class
type: Concept
subclass of: MUIDEN MAANOSIEN HISTORIA
alternative label: Afroamerikkalaiset, Amerikka, historia (987 ... 988)
alternative label: Amazonas, historia (988)
alternative label: Amerikka, historia (987 ... 988)
alternative label: Amerikka, intiaanit, historia (987 ... 988)
alternative label: Andit, historia (988)
alternative label: Argentiina, historia (988)
alternative label: Bolivia, historia (988)
alternative label: Brasilia, historia (988)
alternative label: Chile, historia (988)
alternative label: Ecuador, historia (988)
alternative label: Etelä-Amerikka, historia (988)
alternative label: Etelä-Amerikka, intiaanit, historia (988)
alternative label: Falklandinsaaret, historia (988)
alternative label: Guayana, historia (988)
alternative label: Guyana, historia (988)
alternative label: Inkat, arkeologia ja historia (988)
alternative label: Intiaanikulttuurit (987 ... 988)
alternative label: Intiaanipäälliköt, historia (987 ... 988)
alternative label: Intiaanisodat, Etelä-Amerikka (988)
alternative label: Intiaanit, historia (987 ... 988)
alternative label: Intiaanit, kulttuurihistoria (987 ... 988)
alternative label: Kolumbia, historia (988)
alternative label: Konkistadorit, Etelä-Amerikka, historia (988)
alternative label: Latinalainen Amerikka, historia (988)
alternative label: Malvinassaaret, historia (988)
alternative label: Paraguay, historia (988)
alternative label: Pawneet, intiaanit (987 ... 988)
alternative label: Peru, historia (988)
alternative label: Prekolumbiaaninen aika, intiaanit, historia (987 ... 988 +)
alternative label: Suriname, historia (988)
alternative label: Tulimaa, historia (988)
alternative label: Uruguay, historia (988)
alternative label: Venezuela, historia (988)
alternative label: Afroamerikaner, Amerika, historia (987 ... 988) @sv
alternative label: Amerika, historia (987 ... 988) @sv
alternative label: Amerika, indianer, historia (987 ... 988) @sv
alternative label: Anderna, historia (988) @sv
alternative label: Argentina, historia (988) @sv
alternative label: Brasilien, historia (988) @sv
alternative label: Colombia, historia (988) @sv
alternative label: Conquistadorer, Sydamerika, historia (988) @sv
alternative label: Eldslandet, historia (988) @sv
alternative label: Falklandsöarna, historia (988) @sv
alternative label: Förkolumbiansk tid, indianer, historia (987 ... 988 +) @sv
alternative label: Indianer, historia (987 ... 988) @sv
alternative label: Indianer, kulturhistoria (987 ... 988) @sv
alternative label: Indianhövdingar, historia (987 ... 988) @sv
alternative label: Indiankrig, Sydamerika (988) @sv
alternative label: Indiankulturer (987 ... 988) @sv
alternative label: Inkaindianer, arkeologi och historia (988) @sv
alternative label: Latinamerika, historia (988) @sv
alternative label: Malvinasöarna, historia (988) @sv
alternative label: Pawneer, indianer, historia (987 ... 988) @sv
alternative label: Sydamerika, historia (988) @sv
alternative label: Sydamerika, indianer, historia (988) @sv
alternative label: Trojanska kriget, arkeologi och historia (988) @sv
broader: MUIDEN MAANOSIEN HISTORIA
in scheme: URN:NBN:fi:au:hklj:
notation: 988
preferred label: History of South America @en
preferred label: Sydamerikas historia @sv
related: AMERIKKA
related: Etelä-Amerikka
related: Brasilia
related: Argentiina
related: Keski-Amerikan historia
scope note: Etelä-Amerikan ja latinalaisen Amerikan historian yleisteokset Argentiinan, Bolivian, Brasilian, Chilen, Ecuadorin, Guyanan, Kolumbian, Paraguayn, Perun, Ranskan Guayanan, Surinamin, Uruguayn ja Venezualan historia Tässä myös Falklandin saarten historia
scope note: Allmänna verk om Sydamerikas och Latinamerikas historia Argentinas, Bolivias, Brasiliens, Chiles, Colombias, Ecuadors, Franska Guyanas, Guyanas, Paraguays, Perus, Surinams, Uruguays och Venezuelas historia Hit också Falklandsöarnas historia @sv

Suomi
type: Class
type: Concept
subclass of: Luonnontieteilijät. Matemaatikot
broader: Luonnontieteilijät. Matemaatikot
in scheme: URN:NBN:fi:au:hklj:
notation: 995.1
preferred label: Finland @en
related: Pelastusoppi. Kristillinen antropologia
related: URN:NBN:fi:au:hklj:323
related: Poliittiset ja aatteelliset vähemmistöt
related: URN:NBN:fi:au:hklj:617
related: URN:NBN:fi:au:hklj:618.24
related: URN:NBN:fi:au:hklj:618.3
related: URN:NBN:fi:au:hklj:909
related: URN:NBN:fi:au:hklj:919
related: URN:NBN:fi:au:hklj:995.103
related: Sukuhistoria. Sukututkimus

Hollanninkielinen kaunokirjallisuus (Kaunoluokka)
type: Class
type: Concept
type: FormClass
subclass of: SAKSANKIELINEN KAUNOKIRJALLISUUS (Kaunoluokka)
broader: SAKSANKIELINEN KAUNOKIRJALLISUUS (Kaunoluokka)
in scheme: URN:NBN:fi:au:hklj:
narrower: Afrikaansinkielinen kaunokirjallisuus (Kaunoluokka)
notation: 3.8
preferred label: Dutch fiction (Fiction class) @en
preferred label: Nederländsk skönlitteratur (Skönklass) @sv
scope note: Tässä myös flaaminkielinen kaunokirjallisuus
scope note: Här även flamländsk skönlitteratur @sv

Kreikankielinen kaunokirjallisuus (Kaunoluokka)
type: Class
type: Concept
type: FormClass
subclass of: MUIDEN KIELTEN KAUNOKIRJALLISUUS (Kaunoluokka)
broader: MUIDEN KIELTEN KAUNOKIRJALLISUUS (Kaunoluokka)
in scheme: URN:NBN:fi:au:hklj:
narrower: Nykykreikankielinen kaunokirjallisuus (Kaunoluokka)
notation: 9.2
preferred label: Greek fiction (Fiction class) @en
preferred label: Grekisk skönlitteratur (Skönklass) @sv
scope note: Muinaiskreikankielinen kaunokirjallisuus
scope note: Forngrekisk skönlitteratur @sv

Persiankielinen kaunokirjallisuus (Kaunoluokka)
type: Class
type: Concept
type: FormClass
subclass of: Indoiraanisten kielten kaunokirjallisuus (Kaunoluokka)
broader: Indoiraanisten kielten kaunokirjallisuus (Kaunoluokka)
in scheme: URN:NBN:fi:au:hklj:
narrower: Darinkielinen kaunokirjallisuus (Kaunoluokka)
notation: 9.61
preferred label: Persian fiction (Fiction class) @en
preferred label: Persisk skönlitteratur (Skönklass) @sv

Muotoluokat
type: Class
type: Concept
type: FormClass
in scheme: URN:NBN:fi:au:hklj:
narrower: Sanakirjat. Hakuteokset (Muotoluokka)
narrower: Kausijulkaisut (Muotoluokka)
narrower: Standardit. Normit (Muotoluokka)
narrower: Taulukot. Tilastot (Muotoluokka)
narrower: Kartat. Kartastot (Muotoluokka)
narrower: Historia (Muotoluokka)
preferred label: Form tags @en
preferred label: Formtillägg @sv
top concept of: URN:NBN:fi:au:hklj:

Kirjastoautomaatio
type: Class
type: Concept
subclass of: Kirjastojen hallinto ja suunnittelu
alternative label: Digitaaliset kirjastot (021.1)
alternative label: Elektroniset kirjastot (021.1)
alternative label: Kirjastoautomaatio (021.1)
alternative label: Verkkokirjastot (021.1)
alternative label: Virtuaalikirjastot (021.1)
alternative label: Biblioteksautomation (021.1) @sv
alternative label: Digitala bibliotek (021.1) @sv
alternative label: Elektroniska bibliotek (021.1) @sv
alternative label: Virtuella bibliotek (021.1) @sv
alternative label: Webb-bibliotek (021.1) @sv
broader: Kirjastojen hallinto ja suunnittelu
in scheme: URN:NBN:fi:au:hklj:
notation: 021.1
preferred label: Library automation @en
preferred label: Biblioteksautomation @sv
related: URN:NBN:fi:au:hklj:018
related: Yleiset kirjastot
related: Erikoiskirjastot. Yhdistysten, laitosten ja yritysten kirjastot
related: URN:NBN:fi:au:hklj:028
related: Dokumentaatio ja informaatiopalvelu yleensä
related: Museonhoito
related: Arkistonhoito
related: URN:NBN:fi:au:hklj:061
related: URN:NBN:fi:au:hklj:063
related: URN:NBN:fi:au:hklj:340
related: URN:NBN:fi:au:hklj:345
related: URN:NBN:fi:au:hklj:627.7
scope note: Yleisten, tieteellisten, yksityisten ja erikoiskirjastojen kirjastoautomaatiota tai atk-järjestelmiä koskevat yleisteokset Tiettyä kirjaston erikoisalan toimintaa koskeva automatisointi tai atk-järjestelmä alan mukaan luokissa 021 ja 022-025
scope note: Allmänna verk som rör biblioteksautomation eller datasystem i allmänna, vetenskapliga och privata bibliotek samt specialbibliotek Automation eller datasystem för specialområden som rör biblioteksverksamheten förs enligt område till klasserna 021 och 022-025 @sv

Oppikirjat. Johdatukset filosofiaan
type: Class
type: Concept
subclass of: URN:NBN:fi:au:hklj:100
broader: URN:NBN:fi:au:hklj:100
in scheme: URN:NBN:fi:au:hklj:
notation: 102
preferred label: Textbooks. Introductions to philosophy @en
preferred label: Läroböcker. Inledningar till filosofin @sv
related: Opinnot
related: Filosofian historia
related: Itämainen filosofia
related: Vanhan ajan filosofia
related: Keskiajan filosofia
related: Renessanssin ja uuden ajan filosofia
related: Uusimman ajan filosofia
related: Nykyajan filosofia
related: Suomi
related: Elämänfilosofia
related: Filosofian ja psykologian opetusoppi
scope note: Filosofian yleiset oppikirjat. Yleiset johdatukset filosofiaan Filosofian peruskäsitteet ja -ongelmat Filosofian erikoisalojen oppikirjat ja johdatukset filosofian erikoisaloihin alan mukaisessa luokassa
scope note: Allmänna läroböcker i filosofi. Allmänna inledningar till filosofin Grundbegrepp och fundamentala problem i filosofin Läroböcker i och inledningar till specialområden inom filosofin klassificeras enligt område @sv

Vanhan ajan filosofia
type: Class
type: Concept
subclass of: Filosofian historia
alternative label: Alisuoriutuminen, kasvatuspsykologia (108.2)
alternative label: Antiikki, filosofia (108.2)
alternative label: Aristoteelilaisuus, antiikin filosofia (108.2)
alternative label: Aristotelismi, antiikin filosofia (108.2)
alternative label: Atomistit, antiikin filosofia (108.2)
alternative label: Epikurolaisuus (108.2)
alternative label: Esisokraattisuus (108.2)
alternative label: Filosofian historia, antiikki (108.2)
alternative label: Filosofian historia, vanha aika (108.2)
alternative label: Katarsis, antiikin filosofia (108.2)
alternative label: Katharsis, antiikin filosofia (108.2)
alternative label: Neljä elementtiä, filosofian historia, antiikki (108.2)
alternative label: Platonismi, antiikin filosofia (108.2)
alternative label: Pyrrhonilainen skeptisismi, antiikin filosofia (108.2)
alternative label: Pyrrhonismi, antiikin filosofia (108.2)
alternative label: Pythagoralaisuus, filosofia (108.2)
alternative label: Uusplatonismi (108.2)
alternative label: Antiken, filosofi (108.2) @sv
alternative label: Aristotelianism, antikens filosofi (108.2) @sv
alternative label: Aristotelism, antikens filosofi (108.2) @sv
alternative label: Atomister, antikens filosofi (108.2) @sv
alternative label: Epikurism (108.2) @sv
alternative label: Filosofins historia, antiken (108.2) @sv
alternative label: Filosofins historia, gamla tiden (108.2) @sv
alternative label: Fyra elementen, filosofins historia, antiken (108.2) @sv
alternative label: Försokratiska filosofer (108.2) @sv
alternative label: Katharsis, antikens filosofi (108.2) @sv
alternative label: Nyplatonism (108.2) @sv
alternative label: Platonism, antikens filosofi (108.2) @sv
alternative label: Pyrrhonism, antikens filosofi (108.2) @sv
alternative label: Pytagoreismen, filosofi (108.2) @sv
alternative label: Tillgivenhet, pedagogisk psykologi (108.2) @sv
alternative label: Underprestation, pedagogisk psykologi (108.2) @sv
broader: Filosofian historia
in scheme: URN:NBN:fi:au:hklj:
notation: 108.2
preferred label: Ancient philosophy @en
preferred label: Forntidens filosofi @sv
related: Oppikirjat. Johdatukset filosofiaan
related: Esseet
related: Itämainen filosofia
related: URN:NBN:fi:au:hklj:110
related: Tietoteorian historia ja suunnat
related: Muinais-Egyptin ja Etu-Aasian uskonnot ja mytologiat
related: Antiikin Kreikan ja Rooman uskonnot ja mytologiat
related: Persian uskonnot ja mytologiat
related: Egyptin ja Etu-Aasian muinaishistoria ja arkeologia
related: Kreikan muinaishistoria ja arkeologia
related: Rooman valtakunnan historia ja arkeologia
related: Vanhan ajan kulttuurihistoria
scope note: Antiikin Kreikan ja Rooman filosofia ja sen historia Esisokraattisen, klassisen ja hellenistisen kauden kreikkalainen filosofia Esisokraatikot. Pythagoralaiset. Atomistit Skeptikot. Kyynikot. Sofistit Sokrates. Platon. Platonistit. Aristoteles Epikurolaiset. Stoalaiset. Uusplatonistit. Plotinos Filosofian erikoisalojen kysymykset alan mukaisessa luokassa
scope note: Filosofi i det antika Grekland och Rom och dess historia Grekisk filosofi under den försokratiska, klassiska och hellenistiska tiden Försokrater. Pythagoréer. Atomister Skeptiker. Kyniker. Sofister Sokrates. Platon. Platoniker. Aristoteles Epikuréer. Stoiker. Nyplatoniker. Plotinos Specialfrågor inom filosofin klassificeras enligt område @sv

Uskonto- ja maailmankatsomuspsykologia
type: Class
type: Concept
subclass of: Muita psykologian aloja
alternative label: Aatteellisuus, psykologia (128.2)
alternative label: Fanaattisuus, maailmankatsomuspsykologia (128.2)
alternative label: Fanaattisuus, uskontopsykologia (128.2)
alternative label: Fanatismi, maailmankatsomuspsykologia (128.2)
alternative label: Fanatismi, uskontopsykologia (128.2)
alternative label: Hengellisyys, uskontopsykologia (128.2)
alternative label: Ihmiskuva, maailmankatsomuspsykologia (128.2)
alternative label: Ihmiskuva, uskontopsykologia (128.2)
alternative label: Maailmankatsomuspsykologia (128.2)
alternative label: Meditaatio, uskontopsykologia (128.2)
alternative label: Mietiskely, uskontopsykologia (128.2)
alternative label: Mystiikka, uskontopsykologia (128.2)
alternative label: Retriitit, uskontopsykologia (128.2)
alternative label: Stigmatisaatio, uskontopsykologia (128.2)
alternative label: Traditionalismi, maailmankatsomuspsykologia (128.2)
alternative label: Transsi, uskontopsykologia (128.2)
alternative label: Uskonnollinen käyttäytyminen, uskontopsykologia (128.2)
alternative label: Uskonnolliset kokemukset, uskontopsykologia (128.2)
alternative label: Uskonnollisuus, uskontopsykologia (128.2)
alternative label: Uskonto, uskontopsykologia (128.2)
alternative label: Uskontopsykologia (128.2)
alternative label: Vakaumus, maailmankatsomuspsykologia (128.2)
alternative label: Andlighet, religion, religionspsykologi (128.2) @sv
alternative label: Fanatism, livsåskådningspsykologi (128.2) @sv
alternative label: Fanatism, religionspsykologi (128.2) @sv
alternative label: Idealitet, psykologi (128.2) @sv
alternative label: Meditation, meditaatio, religionspsykologi (128.2) @sv
alternative label: Meditation, mietiskely, religionspsykologi (128.2) @sv
alternative label: Mystik, religionspsykologi (128.2) @sv
alternative label: Människosyn, religionspsykologi (128.2) @sv
alternative label: Människosyn, världsåskådningspsykologi (128.2) @sv
alternative label: Religion, religionspsykologi (128.2) @sv
alternative label: Religionspsykologi (128.2) @sv
alternative label: Religiositet, religionspsykologi (128.2) @sv
alternative label: Religiösa upplevelser, religionspsykologi (128.2) @sv
alternative label: Religiöst beteende, religionspsykologi (128.2) @sv
alternative label: Retreater, religionspsykologi (128.2) @sv
alternative label: Stigmatisation, religionspsykologi (128.2) @sv
alternative label: Traditionalism, världsåskådningspsykologi (128.2) @sv
alternative label: Trance, religionspsykologi (128.2) @sv
alternative label: Världsåskådningspsykologi (128.2) @sv
alternative label: Övertygelse, världsåskådningspsykologi (128.2) @sv
broader: Muita psykologian aloja
in scheme: URN:NBN:fi:au:hklj:
notation: 128.2
preferred label: Psychology of religion and life-philosophy @en
preferred label: Religions- och livsåskådningspsykologi @sv
related: Psykologian suunnat
related: Sosiaalipsykologia. Kulttuuripsykologia
related: Elämänfilosofia
related: Kulttuurifilosofia
related: Uskonnonfilosofia
related: Uskontososiologia
related: URN:NBN:fi:au:hklj:209
related: URN:NBN:fi:au:hklj:210
related: Kristinuskon filosofia
related: Henkilökohtainen hartaudenharjoitus
related: Intian uskonnot ja mytologiat
related: Buddhalaisuus ja sen mytologia
scope note: Uskontojen ja maailmankatsomusten psykologinen tarkastelu
scope note: Religioner och livsåskådningar ur psykologiskt perspektiv @sv

TIEDEOPPI
type: Class
type: Concept
subclass of: URN:NBN:fi:au:hklj:100
alternative label: Atomismi, tiedeoppi (150 ... 159)
alternative label: Dialogi, tiede (150 ... 159)
alternative label: Digitaaliset ihmistieteet, tiede (150 ... 159 +)
alternative label: Humanismi, tiede (150 ... 159)
alternative label: Humanistiset alat (150 ... 159)
alternative label: Humanistiset tieteet, tiede (150 ... 159 +)
alternative label: Ihmistieteet, tiede (150 ... 159 +)
alternative label: Informaatioala, tiede (150 ... 159)
alternative label: Kohorttitutkimus, tiede (150 ... 159)
alternative label: Monitieteisyys (150 ... 159)
alternative label: Nanotieteet (150 ... 159)
alternative label: Pitkittäistutkimus, tiede (150 ... 159)
alternative label: Poikittaistutkimus (150 ... 159)
alternative label: Poikkitieteisyys (150 ... 159)
alternative label: Relevanssi (150 ... 159)
alternative label: Sosiaalinen vastuu, tiede (150 ... 152)
alternative label: Suuntaukset, tiedeoppi (150 ... 159)
alternative label: Teoreettinen tutkimus (150 ... 159)
alternative label: Teoria, tiedeoppi (150 ... 159)
alternative label: Teoriat, tiedeoppi (150 ... 159)
alternative label: Tiede (150 ... 159)
alternative label: Tiedeoppi (150)
alternative label: Tieteenalat (150 ... 159)
alternative label: Tieteentutkimus (150 ... 159)
alternative label: Tieteet (150 ... 159)
alternative label: Tieteidenvälisyys (150 ... 159)
alternative label: Totuus, tiedeoppi (150 ... 159)
alternative label: Traditionalismi, tiede (150 ... 159)
alternative label: Triangulaatio (150 ... 159)
alternative label: Tutkimus, tiedeoppi (150)
alternative label: Tutkimustieto, tiede (150 ... 159)
alternative label: Väittely, tiede (150 ... 159)
alternative label: Yhteiskunnallinen vastuu, tiede (150 ... 152)
alternative label: Yhteiskuntavastuu, tiede (150 ... 152)
alternative label: Yhteisvaikutukset, tieteellinen tutkimus (150 ... 159)
alternative label: Ymmärtäminen, tiede (150 ... 159)
alternative label: Atomism, vetenskapslära (150 ... 159) @sv
alternative label: Dialog, vetenskap (150 ... 159) @sv
alternative label: Digital humaniora, vetenskap (150 ... 159 +) @sv
alternative label: Disputation, vetenskap (150 ... 159) @sv
alternative label: Forskning om vetenskapen (150 ... 159) @sv
alternative label: Forskning, vetenskapslära (150) @sv
alternative label: Forskningsdata, vetenskap (150 ... 159) @sv
alternative label: Förståelse, vetenskap (150 ... 159) @sv
alternative label: Humanism, vetenskap (150 ... 159) @sv
alternative label: Humanistiska branscher (150 ... 159) @sv
alternative label: Humanistiska vetenskaper, vetenskap (150 ... 159 +) @sv
alternative label: Humanvetenskaper, vetenskap (150 ... 159 +) @sv
alternative label: Informationsbranschen, vetenskap (150 ... 159) @sv
alternative label: Inriktningar, vetenskapslära (150 ... 159) @sv
alternative label: Kohortundersökning, vetenskap (150 ... 159) @sv
alternative label: Longitudinell undersökning, vetenskap (150 ... 159) @sv
alternative label: Multidisciplin (150 ... 159) @sv
alternative label: Nanovetenskaper (150 ... 159) @sv
alternative label: Relevans (150 ... 159) @sv
alternative label: Samhälleligt ansvar, vetenskap (150 ... 152) @sv
alternative label: Samhällsansvar, vetenskap (150 ... 152) @sv
alternative label: Samverkan, vetenskaplig undersökning (150 ... 159) @sv
alternative label: Sanning, vetenskapslära (150 ... 159) @sv
alternative label: Socialt ansvar, vetenskap (150 ... 152) @sv
alternative label: Teoretisk forskning (150 ... 159) @sv
alternative label: Teori, vetenskapslära (150 ... 159) @sv
alternative label: Teorier, vetenskapslära (150 ... 159) @sv
alternative label: Traditionalism, vetenskap (150 ... 159) @sv
broader: URN:NBN:fi:au:hklj:100
in scheme: URN:NBN:fi:au:hklj:
narrower: Tieteenfilosofia. Metodologia
narrower: Tiedepolitiikka. Tieteen sosiologia
narrower: Tieteenhistoria. Oppihistoria
notation: 150
related: Teoria. Tutkimusmenetelmät
related: Filosofian historia
related: LOGIIKKA
related: TIETOTEORIA. TIETO-OPPI
related: Luonnontieteiden historia
scope note: Tässä ja alaluokissa tiedettä tai tiedeoppia koskevat yleisteokset Tässä ja alaluokissa myös humanististen tieteiden yleinen tiedeoppi Erikoisalojen tiede ja tiedeoppi alan mukaisessa luokassa
scope note: Hit och till underklasserna allmänna verk som rör vetenskap eller vetenskapsteori Hit och till underklasserna också allmän vetenskapsteori inom de humanistiska vetenskaperna Specialområden inom vetenskap och vetenskapsteori klassificeras enligt område @sv

Kokeellinen kasvatus
type: Class
type: Concept
subclass of: Käytännön kasvatus
alternative label: Dynaaminen pedagogiikka (181.2)
alternative label: Elämyspedagogiikka (181.2)
alternative label: Innovatiivisuus, luovuuskasvatus (181.2)
alternative label: Kasvatus, kokeellinen kasvatus (181.2)
alternative label: Kasvatusala, kokeellinen kasvatus (181.2)
alternative label: Kasvatusoppaat, kokeellinen kasvatus (181.2)
alternative label: Kokeellinen kasvatusoppi (181.2)
alternative label: Kokeellinen pedagogiikka (181.2)
alternative label: Leikit, leikkipedagogiikka (181.2)
alternative label: Leikki, leikkipedagogiikka (181.2)
alternative label: Leikkipedagogiikka (181.2)
alternative label: Luova toiminta, luovuuskasvatus (181.2)
alternative label: Luovuus, luovuuskasvatus (181.2)
alternative label: Luovuuskasvatus (181.2)
alternative label: Roolileikit, leikkikasvatus (181.2)
alternative label: Saduttaminen (181.2)
alternative label: Sadutus (181.2)
alternative label: Työkasvatus (181.2)
alternative label: Työkoulu (181.2)
alternative label: Työpedagogiikka (181.2)
alternative label: Virikekasvatus (181.2)
alternative label: Virikkeet, virikekasvatus (181.2)
alternative label: Arbetspedagogik (181.2) @sv
alternative label: Arbetsskola (181.2) @sv
alternative label: Dynamisk pedagogik (181.2) @sv
alternative label: Experimentell pedagogik (181.2) @sv
alternative label: Experimentell uppfostringslära (181.2) @sv
alternative label: Fostran till arbete (181.2) @sv
alternative label: Fostran, experimentell fostran (181.2) @sv
alternative label: Handledningar i uppfostringsfrågor, experimentell fostran (181.2) @sv
alternative label: Impulser, stimulerande fostran (181.2) @sv
alternative label: Innovativitet, kreativitetsfostran (181.2) @sv
alternative label: Kreativitet, kreativitetsfostran (181.2) @sv
alternative label: Kreativitetsfostran (181.2) @sv
alternative label: Lek, barnlek, lekpedagogik (181.2) @sv
alternative label: Lekar, lekpedagogik (181.2) @sv
alternative label: Lekpedagogik (181.2) @sv
alternative label: Rollekar, lekfostran (181.2) @sv
alternative label: Sagoterande (181.2) @sv
alternative label: Sagotering (181.2) @sv
alternative label: Skapande verksamhet, kreativitetsfostran (181.2) @sv
alternative label: Stimulerande fostran (181.2) @sv
alternative label: Upplevelsepedagogik (181.2) @sv
broader: Käytännön kasvatus
in scheme: URN:NBN:fi:au:hklj:
notation: 181.2
preferred label: Experimental pedagogy @en
preferred label: Experimentell pedagogik @sv
related: Lapsuuden ja nuoruuden psykologia
related: Kasvatusfilosofia. Kasvatustavoitteet
related: Kasvatuspsykologia
related: URN:NBN:fi:au:hklj:181.7
related: URN:NBN:fi:au:hklj:182
related: URN:NBN:fi:au:hklj:183.5
related: URN:NBN:fi:au:hklj:183.7
related: Erikoiskoulut. Kokeilukoulut
related: Leikit
related: Leikkikalut
related: URN:NBN:fi:au:hklj:797.2
scope note: Luovuus-, leikki- ja työkasvatus
scope note: Kreativitetsfostran, lek- och arbetspedagogik @sv

Teosofia. Antroposofia. Vapaamuurarius
type: Class
type: Concept
subclass of: YLEINEN USKONTOTIEDE. YLEINEN USKONNONFILOSOFIA
alternative label: Swedenborgilaisuus (204)
alternative label: Swedenborgianism (204) @sv
broader: YLEINEN USKONTOTIEDE. YLEINEN USKONNONFILOSOFIA
in scheme: URN:NBN:fi:au:hklj:
narrower: Teosofia
narrower: Antroposofia
narrower: Vapaamuurarius
notation: 204
preferred label: Theosophy. Anthroposophy. Freemasonry @en
preferred label: Teosofi. Antroposofi. Frimurarna @sv
related: RAJATIETO
related: URN:NBN:fi:au:hklj:192
related: Astrologia. Horoskoopit
related: Unikirjat
related: Uskonnonfilosofia
related: URN:NBN:fi:au:hklj:280
scope note: Teokset, jotka koskevat sekä teosofiaa että antroposofiaa tai vapaamuurariutta yleensä Teosofisesta tai antroposofisesta näkökulmasta kirjoitetut erikoisaloja koskevat teokset alan mukaisessa luokassa
scope note: Verk som både rör teosofi och antroposofi eller frimurarna i allmänhet Verk som rör specialområden ur teosofisk eller antroposofisk synvinkel klassificeras enligt område @sv

Antroposofia
type: Class
type: Concept
subclass of: Teosofia. Antroposofia. Vapaamuurarius
alternative label: Antroposofia (204.2)
alternative label: Antroposofiset valmisteet, antroposofia (204.2)
alternative label: Esoterismi, teosofia (204.2)
alternative label: Hoitopedagogiikka, antroposofia (204.2)
alternative label: Jälleensyntyminen, antroposofia (204.2)
alternative label: Karma, antroposofia (204.2)
alternative label: Lääkintäpedagogia, antroposofia (204.2)
alternative label: Lääkintäpedagogiikka, antroposofia (204.2)
alternative label: Reinkarnaatio, antroposofia (204.2)
alternative label: Sielunvaellus, antroposofia (204.2)
alternative label: Steinerilaisuus (204.2)
alternative label: Uudelleensyntyminen, antroposofia (204.2)
alternative label: Värioppi, antroposofia (204.2)
alternative label: Antroposofi (204.2) @sv
alternative label: Antroposofiska produkter, antroposofi (204.2) @sv
alternative label: Esoterism, teosofi (204.2) @sv
alternative label: Färglära, antroposofi (204.2) @sv
alternative label: Karma, antroposofi (204.2) @sv
alternative label: Läkepedagogik, antroposofi (204.2) @sv
alternative label: Pånyttfödelse, övriga religioner och ockultism, antroposofi (204.2) @sv
alternative label: Reinkarnation, antroposofi (204.2) @sv
alternative label: Själavandring, antroposofi (204.2) @sv
alternative label: Steinerism (204.2) @sv
alternative label: Vårdpedagogik, antroposofi (204.2) @sv
alternative label: Återfödelse, antroposofi (204.2) @sv
broader: Teosofia. Antroposofia. Vapaamuurarius
in scheme: URN:NBN:fi:au:hklj:
notation: 204.2
preferred label: Anthroposophy @en
preferred label: Antroposofi @sv
related: Erikoiskoulut. Kokeilukoulut
related: RAJATIETO
related: URN:NBN:fi:au:hklj:192
related: Uskonnonfilosofia
related: URN:NBN:fi:au:hklj:280
related: Maanviljely
related: Puutarhanhoito. Hyötykasvit. Huone- ja koristekasvit
related: Koristekasvit
related: Hyötykasvit
related: Yrtti- ja maustekasvit
related: Hedelmä-, marja- ja vihanneskasvit
related: Huonekasvit
scope note: Antroposofia ja steinerilaisuus yleensä Antroposofisesta tai steinerilaisesta näkökulmasta kirjoitetut erikoisaloja koskevat teokset alan mukaisessa luokassa
scope note: Antroposofi och Steiners lära i allmänhet Verk som rör specialområden ur antroposofisk synvinkel eller med aspekter av Steiners lära klassificeras enligt område @sv

Kristillisen teologian historia
type: Class
type: Concept
subclass of: URN:NBN:fi:au:hklj:210
alternative label: Kirkkokunnat, ekumenia (219)
alternative label: Uskontohistoria, teologian historia (219)
alternative label: Kyrkosamfund, ekumenik (219) @sv
alternative label: Religionshistoria, teologins historia (219) @sv
broader: URN:NBN:fi:au:hklj:210
in scheme: URN:NBN:fi:au:hklj:
notation: 219
preferred label: History of Christian theology @en
preferred label: Kristna teologins historia @sv
related: URN:NBN:fi:au:hklj:209
related: KIRKKOHISTORIA
related: Vanha aika
related: Keskiaika
related: Uusi aika
related: Uusin aika. Nykyaika
related: Eri maiden kirkkohistoria
related: Suomi
related: Pohjoismaat
related: Ruotsi
related: Muu Eurooppa
related: Germany {@e
scope note: Kristillisen teologian yleinen historia Kristillisen teologian erikoisaloja koskeva historia alan mukaisessa luokassa
scope note: Kristna teologins allmänna historia Specialområden som rör den kristna teologins historia klassificeras enligt område @sv

Saarnat. Postillat. Kristilliset puhe- ja päivänavauskokoelmat
type: Class
type: Concept
subclass of: EVANKELIS-LUTERILAINEN KIRKKO
alternative label: Aamunavaukset, kristilliset, ev.-lut. (257)
alternative label: Hartauspuheet, kristilliset, ev.-lut. (257)
alternative label: Kirkolliset puheet, ev.-lut. kirkko (257)
alternative label: Postillat, ev.-lut. (257)
alternative label: Päivänavaukset, kristilliset, ev.-lut. (257)
alternative label: Ruumissaarnat, ev.-lut. (257)
alternative label: Saarnakokoelmat, ev.-lut. (257)
alternative label: Saarnat, ev.-lut. (257)
alternative label: Synodaalipuheet, ev.-lut. kirkko (257)
alternative label: Synodaalisaarnat, ev.-lut. kirkko (257)
alternative label: Uskonnolliset päivänavaukset, ev.-lut. (257)
alternative label: Andakter, kristna, ev.luth. (257) @sv
alternative label: Kyrkliga tal, ev.luth. kyrkan (257) @sv
alternative label: Likpredikningar, ev.luth. (257) @sv
alternative label: Morgonsamlingar, kristna, ev.luth (257) @sv
alternative label: Morgonöppningar, kristna, ev.luth. (257) @sv
alternative label: Postillor, ev.luth. (257) @sv
alternative label: Predikningar, ev.luth. (257) @sv
alternative label: Predikosamlingar, ev.luth. (257) @sv
alternative label: Religiösa morgonsamlingar, ev.luth. (257) @sv
alternative label: Synodalpredikningar, ev.luth. kyrkan (257) @sv
alternative label: Synodaltal, ev.luth. kyrkan (257) @sv
broader: EVANKELIS-LUTERILAINEN KIRKKO
in scheme: URN:NBN:fi:au:hklj:
notation: 257
preferred label: Sermons. Homilies. Christian gatherings. Morning assemblies @en
preferred label: Predikningar. Postillor. Kristna samlingar med tal och morgonsamlingar @sv
related: URN:NBN:fi:au:hklj:181.7
related: Esseet
related: Kokoomateokset
related: Uskontunnustukset. Katekismukset
related: Hartauskirjat
related: Rukouskirjat
related: Virsikirjat ja hengelliset laulukirjat
related: Sakramentit. Kirkolliset toimitukset
related: Kirkolliset juhlat ja juhlapäivät
related: Saarnaoppi
related: URN:NBN:fi:au:hklj:260
scope note: Ev.-lut. saarnat ja postillat sekä puhe- ja päivänavauskokoelmat
scope note: Evangelisk-lutherska predikningar och postillor samt samlingar med tal och morgonsamlingar @sv

Perhe- ja holhousoikeus
type: Class
type: Concept
subclass of: Siviili- ja kauppaoikeus. Sopimusoikeus
alternative label: Adoptio, lainsäädäntö (333.2)
alternative label: Adoptiolaki (333.2)
alternative label: Adoptiolapset, lainsäädäntö (333.2)
alternative label: Adoptiovanhemmat, lainsäädäntö (333.2)
alternative label: Asumusero, lainsäädäntö (333.2)
alternative label: Au-lapset, lainsäädäntö (333.2)
alternative label: Au-äidit, lainsäädäntö (333.2)
alternative label: Avio-oikeus (333.2)
alternative label: Avioehto (333.2)
alternative label: Avioero, lainsäädäntö (333.2)
alternative label: Avioesteet (333.2)
alternative label: Avioliitto, lainsäädäntö (333.2)
alternative label: Avioliitto-oikeus (333.2)
alternative label: Avioparit, lainsäädäntö (333.2)
alternative label: Aviopuolisot, lainsäädäntö (333.2)
alternative label: Aviottomat lapset, lainsäädäntö (333.2)
alternative label: Aviottomat äidit, lainsäädäntö (333.2)
alternative label: Avoero, lainsäädäntö (333.2)
alternative label: Avoin adoptio, adoptiolaki (333.2)
alternative label: Avoin adoptio, lainsäädäntö (333.2)
alternative label: Avoliitto, lainsäädäntö (333.2)
alternative label: Avoparit, lainsäädäntö (333.2)
alternative label: Avopuolisot, lainsäädäntö (333.2)
alternative label: Avustettu lisääntyminen, lainsäädäntö (333.2)
alternative label: Elatus, lainsäädäntö (333.2)
alternative label: Elatusapu, lainsäädäntö (333.2)
alternative label: Elatusturva, lainsäädäntö (333.2)
alternative label: Elatusvelvollisuus (333.2)
alternative label: Esteet, avioesteet (333.2)
alternative label: Henkilönnimet, lainsäädäntö (333.2)
alternative label: Holhous, lainsäädäntö (333.2)
alternative label: Holhousoikeus (333.2)
alternative label: Huoltajuus, lainsäädäntö (333.2)
alternative label: Huoltajuuskiistat, lainsäädäntö (333.2)
alternative label: Isyys, lainsäädäntö (333.2)
alternative label: Kansainvälinen adoptio, lainsäädäntö (333.2)
alternative label: Kasvattilapset, lainsäädäntö (333.2)
alternative label: Kasvatuskodit, lainsäädäntö (333.2)
alternative label: Kasvatusvanhemmat, lainsäädäntö (333.2)
alternative label: Keinoalkuiset lisääntymismenetelmät, lainsäädäntö (333.2)
alternative label: Kihlaus, lainsäädäntö (333.2)
alternative label: Lapseksiottaminen, lainsäädäntö (333.2)
alternative label: Lapseksiotto, lainsäädäntö (333.2)
alternative label: Lapsen asema, lapsen oikeudet (333.2)
alternative label: Lapsen elatus (333.2)
alternative label: Lapsen etu, lapsen asema, lapsen oikeudet (333.2)
alternative label: Lapsen huolto, lainsäädäntö (333.2)
alternative label: Lapsen oikeudet (333.2)
alternative label: Lapsen tapaamisoikeus, lainsäädäntö (333.2)
alternative label: Lapsenhuolto, lainsäädäntö (333.2)
alternative label: Lapset, lainsäädäntö (333.2)
alternative label: Lapsiperheet, perhe- ja holhousoikeus (333.2)
alternative label: Lapsipuolet, perheoikeus (333.2)
alternative label: Lasten asema, lapsen oikeudet (333.2)
alternative label: Lastenhuolto, lainsäädäntö (333.2)
alternative label: Lesket, perhe- ja holhousoikeus (333.2)
alternative label: Leskeys, perhe- ja holhousoikeus (333.2)
alternative label: Leskeys, perhe-eläkkeet (333.2)
alternative label: Naimattomuus, lainsäädäntö (333.2)
alternative label: Nimilainsäädäntö (333.2)
broader: Siviili- ja kauppaoikeus. Sopimusoikeus
in scheme: URN:NBN:fi:au:hklj:
notation: 333.2
related: Perhe- ja kotikasvatus
related: URN:NBN:fi:au:hklj:326.2
related: URN:NBN:fi:au:hklj:332.22
related: Kansainvälinen oikeus
related: Suomen ja Euroopan Unionin laki- ja asetuskokoelmat
related: Muiden maiden lait
related: Perhesosiologia
related: Perhepolitiikka. Lapsipolitiikka. Nuorisopolitiikka
related: Lastenneuvolat. Äitiysneuvolat
related: Päivähoito
related: URN:NBN:fi:au:hklj:624
related: LIIKETALOUS. KAUPPA. MARKKINOINTI. LIIKENNEOPETUS
scope note: Avio- ja avoliittoa sekä avioeroa koskeva lainsäädäntö Lapsen asemaa koskeva lainsäädäntö Isyys-, ottolapsi-, elatus- ja lapsenhuoltolainsäädäntö Nimilainsäädäntö
scope note: Lagstiftning om äktenskap, samboende och äktenskapsskillnad Lagstiftning om barnets ställning Faderskapslagstiftning, adoptionslagstiftning, lagstiftning om underhåll och vårdnad av barn Namnlagstiftning @sv

Valtionverotus. Veropolitiikka
type: Class
type: Concept
subclass of: URN:NBN:fi:au:hklj:363
alternative label: Ajoneuvovero, verotus (363.1)
alternative label: Arvioverotus (363.1)
alternative label: Arvonlisävero, verotus (363.1)
alternative label: Autovero, verotus (363.1)
alternative label: Dieselvero, verotus (363.1)
alternative label: Edut, verotus (363.1)
alternative label: Ehdotukset, veroehdotukset (363.1)
alternative label: Elinkeinolupamaksut, veroluonteiset (363.1)
alternative label: Elinkeinoverotus (363.1)
alternative label: Eläkemaksut, verotus (363.1)
alternative label: Eläkevakuutusmaksut, verotus (363.1)
alternative label: Energiavero, verotus (363.1)
alternative label: Ennakkoperintä, verotus (363.1)
alternative label: Ennakkovero, verotus (363.1)
alternative label: Ennakonpidätys, verotus (363.1)
alternative label: Erillisverotus, verotus (363.1)
alternative label: Haittavero, verotus (363.1)
alternative label: Harkintaverotus (363.1)
alternative label: Harmaa talous, verotus (363.1)
alternative label: Henkilökuntaedut, verotus (363.1)
alternative label: Henkilöverotus (363.1)
alternative label: Henkilöverotus, valtion (363.1)
alternative label: Ilmoitukset, veroilmoitukset (363.1)
alternative label: Jälkiverotus (363.1)
alternative label: Kaksinkertainen verotus, verotus (363.1)
alternative label: Kaksoisverotus, verotus (363.1)
alternative label: Kiinteistövero, verotus (363.1)
alternative label: Koiravero (363.1)
alternative label: Kuittikauppa, verotus (363.1)
alternative label: Kulttuurisetelit , verotus (363.1)
alternative label: Kulutusverotus (363.1)
alternative label: Kuutamourakointi, verotus (363.1)
alternative label: Käännetty arvonlisävero, verotus (363.1)
alternative label: Käännetty arvonlisäverovelvollisuus, verotus (363.1)
alternative label: Käänteinen arvonlisävero, verotus (363.1)
alternative label: Leimamerkit, verotus (363.1)
alternative label: Leimavero (363.1)
alternative label: Liiketoimintasiirto, verotus (363.1)
alternative label: Liikevaihtovero (363.1)
alternative label: Liikeverotus (363.1)
alternative label: Liikuntasetelit , verotus (363.1)
alternative label: Lounassetelit , verotus (363.1)
alternative label: Luontaisedut, verotus (363.1)
alternative label: Luontoisedut, verotus (363.1)
alternative label: Luovutusvoitot, verotus (363.1)
alternative label: Lähdevero (363.1)
alternative label: Maatalousverotus (363.1)
alternative label: Marginaalivero (363.1)
alternative label: Metsänhoitomaksut, verotus (363.1)
alternative label: Metsäverotus (363.1)
alternative label: Moottoriajoneuvovero, verotus (363.1)
alternative label: Offshore-yhtiöt, verotus (363.1)
alternative label: Omaisuus, verotus (363.1)
alternative label: Omaisuusvero (363.1)
alternative label: Omaisuusvero, verotus (363.1)
alternative label: Perintövero, verotus (363.1)
alternative label: Piilotalous, verotus (363.1)
alternative label: Polttoainevero, verotus (363.1)
alternative label: Progressiivinen verotus (363.1)
alternative label: Pääomaverotus (363.1)
broader: URN:NBN:fi:au:hklj:363
in scheme: URN:NBN:fi:au:hklj:
notation: 363.1
related: EVANKELIS-LUTERILAINEN KIRKKO
related: Kirkko-oikeus
related: Vero-oikeus
related: Rikosoikeus
related: URN:NBN:fi:au:hklj:345
related: Helsinki. Pääkaupunkiseutu
related: Suomen valtionhallinto
related: Muiden maiden kunnallis-, läänin- ja valtionhallinto
related: Kriminologia. Kriminaalisosiologia
related: URN:NBN:fi:au:hklj:368
related: Elintaso. Kulutus
related: Talouselämän kehitysilmiöt
scope note: Valtionverotus. Teokset, jotka koskevat sekä valtionverotusta että kunnallisverotusta Tulovero. Omaisuusvero. Liikevaihtovero. Arvonlisävero. Kulutusverot. Haittaverot. Veronluonteiset käyttömaksut ja elinkeinolupamaksut Verohelpotukset. Verovähennykset. Yksityisten ja yritysten vero-oppaat. Verosuunnittelu
scope note: Statsbeskattning. Verk som rör både statsbeskattning och kommunalbeskattning Inkomstskatt. Förmögenhetsskatt. Omsättningsskatt. Mervärdesskatt. Konsumtionsskatter. Miljöskatter. Bruksavgifter och näringstillstånd av skattekaraktär Skattelättnader. Skatteavdrag. Information om beskattning för privatpersoner och företag. Skatteplanering @sv

Talouselämän kehitysilmiöt
type: Class
type: Concept
subclass of: URN:NBN:fi:au:hklj:368
alternative label: Elvytys, talouspolitiikka (368.4)
alternative label: Elvytyspolitiikka (368.4)
alternative label: Finanssikriisit (368.4)
alternative label: Kasvu, talouskasvu (368.4)
alternative label: Katovuodet, pulakaudet (368.4)
alternative label: Kausivaihtelut, talouselämä (368.4)
alternative label: Korkeasuhdanne (368.4)
alternative label: Kriisit, talouselämän kriisit (368.4)
alternative label: Lama (368.4)
alternative label: Lamakausi (368.4)
alternative label: Laskusuhdanne (368.4)
alternative label: Matalasuhdanne (368.4)
alternative label: Nollakasvu (368.4)
alternative label: Noususuhdanne (368.4)
alternative label: Nälkävuodet, pulakaudet (368.4)
alternative label: Ostokortit, pula-aika (368.4)
alternative label: Poikkeusolot, pulakaudet (368.4)
alternative label: Pula-ajat (368.4)
alternative label: Puskurirahastot, taloussuhdanteet (368.4)
alternative label: Rakennerahastot, taloussuhdanteet (368.4)
alternative label: Stabilointi, talous (368.4)
alternative label: Suhdannerahastot, taloussuhdanteet (368.4)
alternative label: Suhdannevaihtelut (368.4)
alternative label: Säännöstely, pula-aika (368.4)
alternative label: Taantuma, talous (368.4)
alternative label: Taloudellinen kehitys (368.4)
alternative label: Taloudellinen lama (368.4)
alternative label: Taloudellinen taantuma (368.4)
alternative label: Taloudellinen tilanne, suhdanteet (368.4)
alternative label: Taloudelliset ennusteet (368.4)
alternative label: Taloudelliset kriisit (368.4)
alternative label: Talouskasvu (368.4)
alternative label: Talouslama (368.4)
alternative label: Trendit, taloudelliset suhdanteet (368.4)
alternative label: Vakauttaminen, talous (368.4)
alternative label: Valuuttakriisit, taloudelliset kriisit (368.4)
alternative label: Bufferfonder, ekonomiska konjunkturer (368.4) @sv
alternative label: Depressionsperiod, ekonomisk (368.4) @sv
alternative label: Ekonomisk depression (368.4) @sv
alternative label: Ekonomisk tillbakagång (368.4) @sv
alternative label: Ekonomisk tillväxt (368.4) @sv
alternative label: Ekonomisk utveckling (368.4) @sv
alternative label: Ekonomiska kriser (368.4) @sv
alternative label: Ekonomiska prognoser (368.4) @sv
alternative label: Ekonomiskt läge, konjunkturer (368.4) @sv
alternative label: Finanskriser (368.4) @sv
alternative label: Hungerår, kristider (368.4) @sv
alternative label: Högkonjunktur (368.4) @sv
alternative label: Konjunkturfonder, ekonomiska konjunkturer (368.4) @sv
alternative label: Konjunkturuppgång (368.4) @sv
alternative label: Konjunkturväxlingar (368.4) @sv
alternative label: Konsolidering, ekonomi (368.4) @sv
alternative label: Kriser, näringslivets kriser (368.4) @sv
alternative label: Kristider (368.4) @sv
alternative label: Lågkonjunktur (368.4) @sv
alternative label: Nolltillväxt (368.4) @sv
alternative label: Nödår, kristider (368.4) @sv
alternative label: Ransonering, kristid (368.4) @sv
alternative label: Ransoneringskort, kristid (368.4) @sv
alternative label: Recession (368.4) @sv
broader: URN:NBN:fi:au:hklj:368
in scheme: URN:NBN:fi:au:hklj:
notation: 368.4
related: URN:NBN:fi:au:hklj:345
related: Helsinki. Pääkaupunkiseutu
related: Muiden maiden kunnallis-, läänin- ja valtionhallinto
related: Raha. Valuutta. Pankit. Pörssit
related: URN:NBN:fi:au:hklj:363
related: Valtionverotus. Veropolitiikka
related: Tullilaitos
related: Talousjärjestelmät
related: Hinnat. Hintapolitiikka
related: Elintaso. Kulutus
related: Talousmaantiede. Taloushistoria
related: URN:NBN:fi:au:hklj:370
scope note: Suhdanteet. Suhdannekehitys. Taloudellinen kasvu ja taantuma Nousukaudet. Talouskriisit. Talouslamat. Pulakaudet Talouden elvytys. Talouden ylikuumeneminen
scope note: Konjunkturer. Konjunkturutveckling. Ekonomisk tillväxt och recession Högkonjunkturer. Ekonomiska kriser. Ekonomisk depression Kristider Ekonomisk stimulans. Ekonomisk överhettning @sv

Työsuojelu
type: Class
type: Concept
subclass of: Työ sosiaalipoliittisena kysymyksenä
alternative label: Ammattientarkastus (371.12)
alternative label: Ammattijalkineet, työsuojelu (371.12)
alternative label: Automaattiset turvalaitteet, työsuojelutekniikka (371.12)
alternative label: Fyysinen kuormittavuus, työsuojelu (371.12)
alternative label: Fyysinen rasitus, työsuojelu (371.12)
alternative label: Fyysinen työsuojelu (371.12)
alternative label: Henkilökohtaiset suojaimet, työsuojelutekniikka (371.12)
alternative label: Henkilönsuojaimet, työsuojelutekniikka (371.12)
alternative label: Henkilöstötilat, työsuojelu (371.12)
alternative label: Henkilösuojaimet, työsuojelutekniikka (371.12)
alternative label: Henkinen työsuojelu (371.12)
alternative label: Hyväksikäyttö, työsuojelu (371.12)
alternative label: Hyvät käytännöt, työsuojelu (371.12)
alternative label: Ihmissuhdetyö, työsuojelu (371.12)
alternative label: Istumatyö, työsuojelu (371.12)
alternative label: Istuminen, työsuojelu (371.12)
alternative label: Kantaminen, työsuojelu (371.12)
alternative label: Kasvojensuojaimet, työsuojelutekniikka (371.12)
alternative label: Kasvosuojaimet, työsuojelutekniikka (371.12)
alternative label: Kuumuus, työsuojelu (371.12)
alternative label: Kylmä työ, työsuojelu (371.12)
alternative label: Kypärät, työsuojelutekniikka (371.12)
alternative label: Käsiensuojaimet, työsuojelutekniikka (371.12)
alternative label: Nostaminen, työsuojelu (371.12)
alternative label: Nostotyö, työsuojelu (371.12)
alternative label: Näyttöpäätetyö, työsuojelu (371.12)
alternative label: Palveluammatit, työsuojelu (371.12)
alternative label: Psyykkinen kuormittavuus, työsuojelu (371.12)
alternative label: Psyykkinen työsuojelu (371.12)
alternative label: Psyykkinen ympäristö, työsuojelu (371.12)
alternative label: Päänsuojaimet, työsuojelutekniikka (371.12)
alternative label: Päätetyö, työsuojelu (371.12)
alternative label: Ruumiillinen työ, työsuojelu (371.12)
alternative label: Seisomatyö, työsuojelu (371.12)
alternative label: Sosiaalitilat, työsuojelu (371.12)
alternative label: Suojaimet, työsuojelutekniikka (371.12)
alternative label: Suojakypärät, työsuojelutekniikka (371.12)
alternative label: Suojakäsineet, työsuojelutekniikka (371.12)
alternative label: Suojalaitteet, työsuojelutekniikka (371.12)
alternative label: Suojanaamarit, työsuojelutekniikka (371.12)
alternative label: Suojaus, työsuojelu (371.12)
alternative label: Suojautuminen, työsuojelu (371.12)
alternative label: Suojavaatteet, työsuojelutekniikka (371.12)
alternative label: Suojelu, työsuojelu (371.12)
alternative label: Tarkastus, työsuojelutarkastus (371.12)
alternative label: Taukotilat, työsuojelu (371.12)
alternative label: Tehdastyö , työsuojelu (371.12)
alternative label: Teollisuustyö, työsuojelu (371.12)
alternative label: Toisto, toistotyö, työsuojelu (371.12)
alternative label: Toistotyö, työsuojelu (371.12)
alternative label: Turvalaitteet, työsuojelutekniikka (371.12)
alternative label: Turvallisuus, työsuojelu (371.12)
alternative label: Turvallisuusanalyysi, työsuojelu (371.12)
alternative label: Turvallisuuskulttuuri, työsuojelu (371.12)
alternative label: Turvallisuusmääräykset, työsuojelu (371.12)
alternative label: Turvallisuusohjeet, työsuojelu (371.12)
alternative label: Turvavarusteet, työsuojelutekniikka (371.12)
alternative label: Turvavälineet, työsuojelutekniikka (371.12)
alternative label: Työ, työsuojelu (371.12)
alternative label: Työasut, työsuojelu (371.12)
alternative label: Työjalkineet, työsuojelu (371.12)
broader: Työ sosiaalipoliittisena kysymyksenä
in scheme: URN:NBN:fi:au:hklj:
notation: 371.12
related: Työoikeus
related: Työn sosiologia
related: Pääoma. Työ. Luonnonvarat
related: Elintaso. Kulutus
related: Työolot
related: Naisen ja miehen asema yhteiskunnassa
related: Työväenliike
related: Työmarkkinajärjestöt
related: URN:NBN:fi:au:hklj:613.31
related: Työntutkimukset. Työanalyysi
related: Henkilöstöpolitiikka
scope note: Työsuojelun yleisteokset Henkinen työsuojelu. Fyysinen työsuojelu. Työsuojelutekniikka Eri aloja, ammatteja ja työpaikkoja koskeva työsuojelu ja työturvallisuus Työsuojeluhallinto. Työsuojeluvalvonta. Työsuojelunormit. Työsuojeluvaltuutetut. Työsuojelutoimikunnat
scope note: Allmänna arbeten om arbetarskydd Psykiskt arbetarskydd. Fysiskt arbetarskydd. Arbetarskyddsteknik Arbetarskydd och arbetssäkerhet som rör olika yrkesområden, yrken och arbetsplatser Arbetarskyddsförvaltning. Övervakning av arbetarskydd. Arbetarskyddsnormer. Arbetarskyddsfullmäktige. Arbetarskyddskommittéer @sv

Ruotsi
type: Class
type: Concept
subclass of: URN:NBN:fi:au:hklj:411
alternative label: Lappi, Ruotsin Lappi (411.1)
alternative label: Ruotsalaiset, Ruotsi (411.1 +)
alternative label: Ruotsi (411.1 +)
alternative label: Ruotsi, maantiede, matkat (411.1 +)
alternative label: Suomalaismetsät, Ruotsi: maantiede, matkat (411.1)
alternative label: Suomalaisseudut, Ruotsi: maantiede, matkat (411.1)
alternative label: Sveanmaa (411.1)
alternative label: Sveanmaa, maantiede, matkat (411.1)
alternative label: Tunturit, maantiede, Ruotsi (411.1)
alternative label: Tunturivaellus, matkaoppaat, Ruotsin Lappi (411.1)
alternative label: Finnmarker, Sverige: geografi, resor (411.1) @sv
alternative label: Finnskogar, Sverige: geografi, resor (411.1) @sv
alternative label: Fjäll, geografi, Sverige (411.1) @sv
alternative label: Fjällvandring, resehandböcker, svenska Lappland (411.1) @sv
alternative label: Lappland, Svenska Lappland (411.1) @sv
alternative label: Svealand (411.1) @sv
alternative label: Svealand, geografi, resor (411.1) @sv
alternative label: Svenskar, Sverige (411.1 +) @sv
alternative label: Sverige (411.1 +) @sv
alternative label: Sverige, geografi, resor (411.1 +) @sv
broader: URN:NBN:fi:au:hklj:411
in scheme: URN:NBN:fi:au:hklj:
narrower: Tukholma
notation: 411.1
preferred label: Sweden @en
preferred label: Sverige @sv
related: Lappi
related: Arktis, pohjoiset napamaat
related: URN:NBN:fi:au:hklj:460
related: URN:NBN:fi:au:hklj:930
related: Ruotsin historia
related: Ruotsin historia 1060-1522
related: Ruotsin historia 1523-1718
related: Ruotsin historia 1719-1809
related: Ruotsin historia 1810-
related: Ruotsin paikallishistoria

Baltian maat
type: Class
type: Concept
subclass of: URN:NBN:fi:au:hklj:411
alternative label: Baltia (411.5 +)
alternative label: Baltia, maantiede, matkat (411.5 +)
alternative label: Balttilaiset kansat (411.5 +)
alternative label: Balttilaiset kansat, maantiede, matkat (411.5 +)
alternative label: Baltikum (411.5 +) @sv
alternative label: Baltikum, geografi, resor (411.5 +) @sv
alternative label: Baltiska folk (411.5 +) @sv
alternative label: Baltiska folk, geografi, resor (411.5 +) @sv
broader: URN:NBN:fi:au:hklj:411
in scheme: URN:NBN:fi:au:hklj:
narrower: Viro
narrower: Latvia
narrower: Liettua
notation: 411.5
preferred label: Baltic countries @en
preferred label: Baltikum @sv
related: URN:NBN:fi:au:hklj:460
related: URN:NBN:fi:au:hklj:930
related: Baltian maiden historia
related: Viron historia
related: Latvian historia
related: Liettuan historia
scope note: Baltian maita koskevat yleisteokset
scope note: Allmänna verk om de baltiska länderna @sv

Itä-Eurooppa
type: Class
type: Concept
subclass of: EUROOPPA
alternative label: Kasakat, Eurooppa (418 +)
alternative label: Neuvostoliitto (418 +)
alternative label: Neuvostoliitto, Euroopan puoleiset maat (418 +)
alternative label: Neuvostoliitto, maantiede, matkat (418 +)
alternative label: Kosacker, Europa (418 +) @sv
alternative label: Sovjetunionen (418 +) @sv
alternative label: Sovjetunionen, europeiska länder (418 +) @sv
alternative label: Sovjetunionen, geografi, resor (418 +) @sv
broader: EUROOPPA
in scheme: URN:NBN:fi:au:hklj:
narrower: Venäjä
narrower: Ukraina
narrower: Valko-Venäjä
narrower: Moldova
notation: 418
preferred label: Eastern Europe @en
preferred label: Östeuropa @sv
related: Lappi
related: Armenia. Azerbaidzan. Georgia. Kazakstan. Kirgisia. Tadzikistan. Turkmenistan. Uzbekistan
related: URN:NBN:fi:au:hklj:460
related: URN:NBN:fi:au:hklj:970

Venäjä
type: Class
type: Concept
subclass of: Itä-Eurooppa
alternative label: Aunus (418.2)
alternative label: Aunus, maantiede, matkat (418.2)
alternative label: Inkeri (418.2)
alternative label: Inkeri, maantiede, matkat (418.2)
alternative label: Itä-Karjala (418.2)
alternative label: Itä-Karjala, maantiede, matkat (418.2)
alternative label: Karjala, Suomi, menetetty alue v:sta 1945 (418.2)
alternative label: Karjala, Venäjä (418.2)
alternative label: Karjala, Venäjä, Itä-Karjala (418.2)
alternative label: Karjala, Venäjä, Karjalan tasavalta (418.2)
alternative label: Karjala, Venäjä, maantiede, matkat (418.2)
alternative label: Karjalan kannas, vuodesta 1945 (418.2)
alternative label: Karjalankannas, vuodesta 1945 (418.2)
alternative label: Kuolan niemimaa (418.2)
alternative label: Kuolan niemimaa, maantiede, matkat (418.2)
alternative label: Luovutettu Karjala, vuodesta 1945 (418.2)
alternative label: Luovutetut alueet, vuodesta 1945 (418.2)
alternative label: Murmanskin alue (418.2)
alternative label: Murmanskin alue, maantiede, matkat (418.2)
alternative label: Novaja Zemlja (418.2)
alternative label: Novaja Zemlja, maantiede, matkat (418.2)
alternative label: Petsamo, vuodesta 1944 (418.2)
alternative label: Sallan alue, vuodesta 1944 (418.2)
alternative label: Venäjä (418.2 +)
alternative label: Venäjä, Euroopan puoleiset alueet (418.2 +)
alternative label: Venäjä, maantiede, matkat (418.2 +)
alternative label: Venäjä-kuva (418.2 +)
alternative label: Venäläiset, Venäjä (418.2 +)
alternative label: Venäläiset, Venäjä, Euroopan puoleinen (418.2 +)
alternative label: Viipuri, vuodesta 1945 (418.2)
alternative label: Viipurin lääni, vuodesta 1945 (418.2)
alternative label: Avträdda Karelen, från år 1945 (418.2) @sv
alternative label: Avträdda områden, från år 1945 (418.2) @sv
alternative label: Ingermanland (418.2) @sv
alternative label: Ingermanland, geografi, resor (418.2) @sv
alternative label: Karelen, Finland, förlorat område från år 1945 (418.2) @sv
alternative label: Karelen, Ryssland (418.2) @sv
alternative label: Karelen, Ryssland, Karelska republiken (418.2) @sv
alternative label: Karelen, Ryssland, geografi, resor (418.2) @sv
alternative label: Karelen, Ryssland, Östkarelen (418.2) @sv
alternative label: Karelska näset, från år 1945 (418.2) @sv
alternative label: Kolahalvön (418.2) @sv
alternative label: Kolahalvön, geografi, resor (418.2) @sv
alternative label: Murmanskområdet (418.2) @sv
alternative label: Murmanskområdet, geografi, resor (418.2) @sv
alternative label: Novaja Zemlja, geografi, resor (418.2) @sv
alternative label: Olonetskarelen (418.2) @sv
alternative label: Olonetskarelen, geografi, resor (418.2) @sv
alternative label: Petsamo, från år 1944 (418.2) @sv
alternative label: Ryssar, Ryssland (418.2 +) @sv
alternative label: Ryssar, Ryssland, europeiska (418.2 +) @sv
alternative label: Ryssland (418.2 +) @sv
alternative label: Ryssland, europeiska områden (418.2 +) @sv
alternative label: Ryssland, geografi, resor (418.2 +) @sv
alternative label: Rysslandsbilden (418.2 +) @sv
alternative label: Sallaområdet, från år 1944 (418.2) @sv
alternative label: Viborg, från år 1945 (418.2) @sv
alternative label: Viborgs län, från år 1945 (418.2) @sv
alternative label: Östkarelen (418.2) @sv
alternative label: Östkarelen, geografi, resor (418.2) @sv
broader: Itä-Eurooppa
in scheme: URN:NBN:fi:au:hklj:
narrower: Moskova
narrower: Pietari
notation: 418.2
preferred label: Russia @en
preferred label: Ryssland @sv
related: Menetetty Karjalan alue
related: Lappi
related: Armenia. Azerbaidzan. Georgia. Kazakstan. Kirgisia. Tadzikistan. Turkmenistan. Uzbekistan
related: Arktis, pohjoiset napamaat
related: URN:NBN:fi:au:hklj:460
related: URN:NBN:fi:au:hklj:970
related: Venäjän historia
scope note: Venäjää tai Venäjän federaatiota koskevat yleisteokset Venäjän tai Venäjän federaation Euroopan puoleinen alue Karjalan tasavalta. Murmanskin alue Menetetyt Karjalan, Sallan ja Petsamon alueet vuodesta 1945
scope note: Allmänna verk om Ryssland eller Ryska federationen De europeiska områdena av Ryssland eller Ryska federationen Karelska republiken. Murmanskområdet Det avträdda Karelen, de avträdda Petsamo- och Sallaområdena från 1945 @sv

Pohjois-Amerikka
type: Class
type: Concept
subclass of: AMERIKKA
alternative label: Amerikkalaiset, pohjoisamerikkalaiset (441)
alternative label: Kalliovuoret (441 ... 443)
alternative label: Pohjois-Amerikka (441)
alternative label: Pohjois-Amerikka, maantiede, matkat (441)
alternative label: Pohjoisamerikkalaiset, Pohjois-Amerikka (441)
alternative label: Preeriat, aluemaantiede (441 ... 443)
alternative label: Preeriat, matkakertomukset (441 ... 443)
alternative label: Amerikaner, nordamerikaner (441) @sv
alternative label: Klippiga bergen (441 ... 443) @sv
alternative label: Nordamerika (441) @sv
alternative label: Nordamerika, geografi, resor (441) @sv
alternative label: Nordamerikaner, Nordamerika (441) @sv
alternative label: Prärier, regionalgeografi (441 ... 443) @sv
alternative label: Prärier, reseskildringar (441 ... 443) @sv
broader: AMERIKKA
in scheme: URN:NBN:fi:au:hklj:
notation: 441
preferred label: North America @en
preferred label: Nordamerika @sv
related: Kanada
related: Yhdysvallat, USA
related: New York
related: Meksiko
related: Amerikan historia
related: Kanadan historia
related: Yhdysvaltojen historia
related: Yhdysvaltojen historia vuoteen 1775
related: Yhdysvaltojen historia 1775-1860
related: Yhdysvaltojen historia 1861-1938
related: Yhdysvaltojen historia 1939-
related: Keski-Amerikan historia
scope note: Pohjois-Amerikkaa koskevat yleisteokset
scope note: Allmänna verk som rör Nordamerika @sv

Kokoomateokset
type: Class
type: Concept
subclass of: LUONNONTIETEET
alternative label: Efektit, luonnonäänet (508)
alternative label: Luonnonäänet, kokoelmat (508)
alternative label: Tehosteet, luonnonäänet (508)
alternative label: Äänet, luonnonäänet (508)
alternative label: Äänimaisema, luonnonäänikokoelmat (508)
alternative label: Ääniympäristö, luonnonäänikokoelmat (508)
alternative label: Effekter, naturljud (508) @sv
alternative label: Effektmedel, naturljud (508) @sv
alternative label: Ljudlandskap, naturljudsamlingar (508) @sv
alternative label: Ljudmiljö, naturljudsamlingar (508) @sv
alternative label: Läten, naturljud (508) @sv
alternative label: Naturljud, samlingar (508) @sv
broader: LUONNONTIETEET
in scheme: URN:NBN:fi:au:hklj:
narrower: Standardit
narrower: Tilastot. Taulukot
narrower: Kartat
narrower: Museot. Arkistot. Kokoelmat. Näyttelyt
narrower: Ympäristönsuojelu. Luonnonsuojelu
notation: 508
preferred label: Compilations. Polygraphies @en
preferred label: Samlingsverk. Polygrafier @sv
related: Luonto-oppaat. Oppikirjat
related: Esseet
scope note: Luontoa tai luonnontieteitä koskevat yleiset tai sekasisältöiset kokoomateokset Epäselvissä tapauksissa on etusija luokilla 502 ja 504 Eri luonnontieteen aloja koskevat kokoomateokset ja alan mukaisessa luokassa
scope note: Samlingsverk och polygrafier med allmänt eller blandat innehåll som handlar om naturen eller naturvetenskaperna I oklara fall ges företräde åt klasserna 502 och 504 Samlingsverk och polygrafier som handlar om olika områden inom naturvetenskaperna klassificeras enligt område @sv

Tähtijärjestelmät. Aurinkokunnat
type: Class
type: Concept
subclass of: TÄHTITIEDE
alternative label: Asteroidit (528)
alternative label: Astronomia, tähtijoukot (528)
alternative label: Auringon säteily, tähtitiede (528)
alternative label: Auringonpilkut (528)
alternative label: Auringonpimennykset (528)
alternative label: Auringonpurkaukset (528)
alternative label: Auringonsäteily, tähtitiede (528)
alternative label: Auringot (528)
alternative label: Aurinko (528)
alternative label: Aurinkokunnan synty (528)
alternative label: Aurinkokunnat (528)
alternative label: Aurinkotuuli (528)
alternative label: Avaruusilmasto (528)
alternative label: Avaruusmyrskyt (528)
alternative label: Avaruussää (528)
alternative label: Eksosfääri (528)
alternative label: Galaksit (528)
alternative label: Galaktiset halot (528)
alternative label: Heliosfääri (528)
alternative label: Ionosfääri (528)
alternative label: Jupiter, tähtitiede (528)
alternative label: Kaasukehät (528)
alternative label: Kaasukehät , planeetat (528)
alternative label: Kaksoistähdet (528)
alternative label: Kiertotähdet (528)
alternative label: Kiintotähdet (528)
alternative label: Komeetat (528)
alternative label: Kraatterit, kuun kraatterit (528)
alternative label: Kraatterit, meteorit (528)
alternative label: Kuu (528)
alternative label: Kuu, aurinkokunta (528)
alternative label: Kuunpimennykset (528)
alternative label: Kuut (528)
alternative label: Kuututkimus (528)
alternative label: Kääpiöplaneetat (528)
alternative label: Linnunrata (528)
alternative label: Lähiavaruus (528)
alternative label: Maa, planeetta, aurinkokunta (528)
alternative label: Maa, planeetta, tähtitiede (528)
alternative label: Maapallo, aurinkokunta (528)
alternative label: Maapallo, tähtitiede (528)
alternative label: Magnetosfääri (528)
alternative label: Mars, tähtitiede (528)
alternative label: Merkurius, tähtitiede (528)
alternative label: Mesosfääri (528)
alternative label: Meteorit (528)
alternative label: Muuttuvat tähdet (528)
alternative label: Napapiirit, maa tähtitieteen kannalta (528)
alternative label: Neptunus, tähtitiede (528)
alternative label: Neutronitähdet (528)
alternative label: Novat (528)
alternative label: Pikkuplaneetat (528)
alternative label: Planeetat (528)
alternative label: Planetaariset sumut (528)
alternative label: Planetoidit (528)
alternative label: Pluto, tähtitiede (528)
alternative label: Plutoidit, kääpiöplaneetat (528)
alternative label: Pulsarit (528)
alternative label: Pyrstötähdet (528)
alternative label: Saturnus, tähtitiede (528)
alternative label: Stratosfääri (528)
broader: TÄHTITIEDE
in scheme: URN:NBN:fi:au:hklj:
notation: 528
related: Astrologia. Horoskoopit
related: URN:NBN:fi:au:hklj:400
related: FYYSINEN MAANTIEDE
related: Meteorologia. Klimatologia
related: GEOLOGIA
related: Mineralogia. Kristallografia. Petrologia
related: URN:NBN:fi:au:hklj:520.084
related: Maailmankaikkeus. Kosmologia. Kosmogonia
related: Elämä maailmankaikkeudessa. Astrobiologia
related: Avaruustutkimus. Avaruuslennot. Avaruusteknologia
related: Ufot. Ilmakehän tunnistamattomat ilmiöt
scope note: Tähtisumut. Galaksit. Tähtijoukot. Linnunrata Kiintotähdet. Auringot. Auringonpimennykset Planeetat. Kuut. Kuunpimennykset. Pyrstötähdet. Komeetat. Meteorit Aurinkokunta. Aurinko. Auringon rakenne ja aktiivisuus. Auringonpilkut. Aurinkotuuli Merkurius. Venus. Mars. Jupiter. Saturnus. Uranus. Neptunus. Pluto. Pikkuplaneetat. Asteroidit Maa tähtitieteelliseltä kannalta. Lähiavaruus Ionosfääri. Stratosfääri. Magnetosfääri
scope note: Nebulosor. Galaxer. Stjärnhopar. Vintergatan Fixstjärnor. Solar. Solförmörkelser Planeter. Månar. Månförmörkelser. Kometer. Meteoriter Solsystemet. Solen. Solens uppbyggnad och aktivitet. Solfläckar. Solvind Merkurius. Venus. Mars. Jupiter. Saturnus. Uranus. Neptunus. Pluto. Småplaneter. Asteroider Jorden ur astronomisk synvinkel. Den närmaste rymden Jonosfären. Stratosfären. Magnetosfären @sv

BIOKEMIA
type: Class
type: Concept
subclass of: LUONNONTIETEET
alternative label: Aineenvaihdunta, biokemia (560)
alternative label: Aineenvaihduntatuotteet, biokemia (560)
alternative label: Aktiinit, proteiinit, biokemia (560)
alternative label: Aminohapot, biokemia (560)
alternative label: Bioenergetiikka, biokemia (560)
alternative label: Biokemia (560)
alternative label: Biologia, biokemia (560)
alternative label: Biomolekyylit, biokemia (560)
alternative label: Biopolymeerit, biokemia (560)
alternative label: Biosynteettiset prosessit, biokemia (560)
alternative label: DNA, biokemia (560)
alternative label: Deoksiribonukleiinihappo, biokemia (560)
alternative label: Eläinproteiinit, biokemia (560)
alternative label: Entsyymit (560)
alternative label: Entsyymit, biokemia (560)
alternative label: Fermentaatio (560)
alternative label: Fermentointi, metabolia, biokemia (560)
alternative label: Fosforylaatio, biokemia (560)
alternative label: Gliadiinit, proteiinit, biokemia (560)
alternative label: Glukokortikoidit, kortikosteroidit, biokemia (560)
alternative label: Hajotusprosessit, biokemia (560)
alternative label: Happo-emästasapaino, biokemia (560 +)
alternative label: Hordeiinit, proteiinit, biokemia (560)
alternative label: Kahdentuminen, biologia, biokemia (560)
alternative label: Kasviproteiinit, biokemia (560)
alternative label: Kemia, biokemia (560)
alternative label: Keratiinit, proteiinit, biokemia (560)
alternative label: Kollageenit, biokemia (560)
alternative label: Käyminen (560)
alternative label: Lipidit, biokemia (560)
alternative label: Luonnonaineet, biokemia (560)
alternative label: Luonnonmateriaalit, biokemia (560)
alternative label: Luonnonpolymeerit, biokemia (560)
alternative label: Luonnontieteet, biokemia (560)
alternative label: Lysofosfolipidit, lipidit, biokemia (560)
alternative label: Lähetti-RNA, biokemia (560)
alternative label: Maitohappo, biokemia (560)
alternative label: Maitohappokäyminen, biokemia (560)
alternative label: Metabolia, biokemia (560)
alternative label: Metaboliitit, biokemia (560)
alternative label: Molekyylit, biokemia (560)
alternative label: Nestiini, biokemia (560)
alternative label: Nukleiiinihapot, biokemia (560)
alternative label: Nukleosidit, biokemia (560)
alternative label: Nukleotidit, biokemia (560)
alternative label: Oksidoreduktaasit, biokemia (560)
alternative label: Profiliinit, proteiinit, biokemia (560)
alternative label: Proteiinit, biokemia (560)
alternative label: Proteolyysi, biokemia (560)
alternative label: RNA, biokemia (560)
alternative label: Replikaatio, biokemia (560)
alternative label: Ribonukleiinihappo, biokemia (560)
alternative label: SUMO-1-proteiini, biokemia (560)
alternative label: Sieniproteiinit, biokemia (560)
alternative label: Sirtuiinit, biokemia (560)
alternative label: Sokerit, biokemia (560)
alternative label: Steroidit, biokemia (560)
alternative label: Triterpeenit, biokemia (560)
alternative label: Tärkkelys, biokemia (560)
alternative label: Ubikitiinit, proteiinit, biokemia (560)
broader: LUONNONTIETEET
in scheme: URN:NBN:fi:au:hklj:
notation: 560
related: KEMIA
related: Orgaaninen kemia. Muovien kemia
related: BIOLOGIA
related: Yleisbiologia
related: Kasvifysiologia
related: Eläinfysiologia
related: URN:NBN:fi:au:hklj:612
related: URN:NBN:fi:au:hklj:613.1
related: Lääketieteellinen kemia ja fysiikka
related: Kemian teollisuus
related: Biotekniikka
related: URN:NBN:fi:au:hklj:649.91
scope note: Biokemian yleisteokset, jotka koskevat sekä eläinten että kasvien biokemiaa Biopolymeerien, proteiinien, nukleiinihappojen, hiilihydraattien, rasvojen, lipidien, hivenaineiden, vitamiinien ja hormonien biokemia ja aineenvaihdunta Aineenvaihdunnan biokemia yleensä. Biosynteettiset prosessit. Hajotusprosessit. Entsyymikemia. Biokatalyytit. Käymiskemia Biokemian sovellukset alan mukaisessa luokassa
scope note: Allmänna verk om biokemi och verk som rör både djurens och växternas biokemi Biopolymerernas, proteinernas, nukleinsyrornas, kolhydraternas, fetternas, lipidernas, spårämnenas, vitaminernas och hormonernas biokemi och ämnesomsättning som rör dem Ämnesomsättningens biokemi i allmänhet. Biosyntetiska processer. Nedbrytningsprocesser. Enzymkemi. Biokatalysatorer. Jäsningskemi Biokemiska tillämpningar klassificeras enligt område @sv

Sienet
type: Class
type: Concept
subclass of: Sekovartiset kasvit
alternative label: Aitotumaiset eliöt, sienet (587.11)
alternative label: Aitotumaiset, sienet (587.11)
alternative label: Aitotumalliset, sienet (587.11)
alternative label: Eliökunta, sienisystematiikka (587.11)
alternative label: Eliöt, sienet (587.11)
alternative label: Eukaryootit, sienet (587.11)
alternative label: Hajottajat, sienet (587.11)
alternative label: Helttasienet, sienestys (587.11)
alternative label: Helttasienet, sienitiede (587.11)
alternative label: Herkkusienet, sienestys (587.11)
alternative label: Herkkusienet, sienitiede (587.11)
alternative label: Itiöt, sienten (587.11)
alternative label: Kaitakorvasieni, sienet (587.11)
alternative label: Kantasienet , sienestys (587.11)
alternative label: Kantasienet , sienitiede (587.11)
alternative label: Kauppasienet (587.11)
alternative label: Keruu, sienestys (587.11)
alternative label: Keräilytalous, sienestys (587.11)
alternative label: Keräilytuotteet, sienet (587.11)
alternative label: Kesäkorvasieni, sienet (587.11)
alternative label: Korvasieni, sienet (587.11)
alternative label: Kotitarve, sienestys (587.11)
alternative label: Kuusilahokka, sienet (587.11)
alternative label: Käävät (587.11)
alternative label: Laakakorvasieni, sienet (587.11)
alternative label: Lahoaminen, lahottajat, sienet (587.11)
alternative label: Lajimääritys, sienet (587.11)
alternative label: Lajinmääritys, sienet (587.11)
alternative label: Lajit, sienilajit (587.11)
alternative label: Lehtokorvasieni, sienet (587.11)
alternative label: Limasienet (587.11)
alternative label: Luonnon virkistyskäyttö, sienestys (587.11)
alternative label: Luonnonsienet, kasvitiede (587.11)
alternative label: Luonnontuoteala, sienestys (587.11)
alternative label: Luonnontuotteet, sienestys (587.11)
alternative label: Luontaiselinkeinot, sienestys (587.11)
alternative label: Luonto-oppaat, sienestys, sienioppaat (587.11)
alternative label: Metsäntuotteet, sienestys (587.11)
alternative label: Metsätuotteet, sienestys (587.11)
alternative label: Mykologia (587.11)
alternative label: Mykorritsa, sienitiede (587.11)
alternative label: Mykotoksiinit, myrkkysienet (587.11)
alternative label: Myrkkysienet, sienitiede (587.11)
alternative label: Pakurikääpä, sienet (587.11)
alternative label: Poiminta, sienten poiminta (587.11)
alternative label: Ruokasienet, sienestys, sienioppaat (587.11)
alternative label: Sienestys (587.11)
alternative label: Sienet, kasvitiede (587.11)
alternative label: Sienijuuri, sienitiede (587.11)
alternative label: Sienikauppa (587.11)
alternative label: Sienimyrkyt, myrkkysienet (587.11)
alternative label: Sienineuvonta (587.11)
alternative label: Sienioppaat (587.11)
alternative label: Sienirihmastot (587.11)
alternative label: Sienitiede (587.11)
alternative label: Siitake, sienitiede (587.11)
alternative label: Systematiikka, sienisystematiikka (587.11)
alternative label: Taksonomia, sienisystematiikka (587.11)
alternative label: Tieteelliset nimet, sienisystematiikka (587.11)
alternative label: Tryffelit, sienet, kasvitiede (587.11)
alternative label: Tuntomerkit, lajinmääritys, sienet (587.11)
broader: Sekovartiset kasvit
in scheme: URN:NBN:fi:au:hklj:
notation: 587.11
related: Luonto-oppaat. Oppikirjat
related: Yleinen mikrobiologia
related: Kasvimorfologia. Kasvianatomia
related: Kasvifysiologia
related: Kasviekologia
related: Kasvimaantiede
related: Systemaattinen eläintiede
related: Hyötykasvit
related: URN:NBN:fi:au:hklj:657
related: URN:NBN:fi:au:hklj:691.12
related: Säilöntä
scope note: Sienestys. Sienten tunnistaminen, keräily, kauppa ja taloudellinen merkitys Sienineuvonta. Ruokasienet. Kauppasienet. Myrkkysienet Sienitiede. Mykologia. Tässä myös limasienet Sienten systematiikka ja lajinmääritysoppaat Sienten morfologia, anatomia, fysiologia, ekologia ja kasvimaantiede Jos teoksessa on sekä ruokasienten esittelyä että ruoanvalmistusohjeita, on etusija luokalla 691.12
scope note: Svampplockning. Svampkännedom, svampsamlande, handel med svamp och svamparnas ekonomiska betydelse Svamprådgivning. Matsvampar. Handelssvampar. Giftiga svampar Mykologi. Hit också slemsvampar Svamparnas systematik och handböcker för artbestämning av svamp Svamparnas morfologi, anatomi, fysiologi, ekologi och växtgeografi Om verket innehåller både presentationer av matsvamp och recept på svamprätter ges företräde åt klass 691.12 @sv

Kalat
type: Class
type: Concept
subclass of: Selkärankaiset
alternative label: Ahven, eläintiede (597.91)
alternative label: Ahvenkalat, eläintiede (597.91)
alternative label: Ankerias, eläintiede (597.91)
alternative label: Ankeriaskalat, eläintiede (597.91)
alternative label: Haikalat (597.91)
alternative label: Hait (597.91)
alternative label: Harjus, eläintiede (597.91)
alternative label: Hauki, eläintiede (597.91)
alternative label: Hopeakylkikalat (597.91)
alternative label: Iktyologia (597.91)
alternative label: Kalakannat, eläintiede (597.91)
alternative label: Kalasto, eläintiede (597.91)
alternative label: Kalat, eläintiede (597.91)
alternative label: Kalataudit, eläintiede (597.91)
alternative label: Kalatiede (597.91)
alternative label: Kampela, eläintiede (597.91)
alternative label: Kampelakalat (597.91)
alternative label: Karppikalat (597.91)
alternative label: Kilohaili, eläintiede (597.91)
alternative label: Kirjolohi, eläintiede (597.91)
alternative label: Kuha, eläintiede (597.91)
alternative label: Kuore, eläintiede (597.91)
alternative label: Kutu, eläintiede (597.91)
alternative label: Lahna, eläintiede (597.91)
alternative label: Lohi, eläintiede (597.91)
alternative label: Lohikalat (597.91)
alternative label: Luukalat (597.91)
alternative label: Made, eläintiede (597.91)
alternative label: Merikalat, eläintiede (597.91)
alternative label: Monnikalat, eläintiede (597.91)
alternative label: Muikku, eläintiede (597.91)
alternative label: Mäti, eläintiede (597.91)
alternative label: Nahkiainen, eläintiede (597.91)
alternative label: Nahkiaiskalat (597.91)
alternative label: Nieriä, eläintiede (597.91)
alternative label: Petokalat (597.91)
alternative label: Piikkikalat (597.91)
alternative label: Putkisuukalat (597.91)
alternative label: Rustokalat (597.91)
alternative label: Sampikalat, eläintiede (597.91)
alternative label: Siika, eläintiede (597.91)
alternative label: Silakka, eläintiede (597.91)
alternative label: Sillikalat, eläintiede (597.91)
alternative label: Simppukalat (597.91)
alternative label: Sisävesikalat, eläintiede (597.91)
alternative label: Suutari, eläintiede (597.91)
alternative label: Syvänmeren kalat (597.91)
alternative label: Sähköankerias, eläintiede (597.91)
alternative label: Särki, eläintiede (597.91)
alternative label: Särkikalat (597.91)
alternative label: Taimen, eläintiede (597.91)
alternative label: Turska, eläintiede (597.91)
alternative label: Turskakalat (597.91)
alternative label: Vaelluskalat, eläintiede (597.91)
alternative label: Veitsikalat, kalat, eläintiede (597.91)
alternative label: Abborre, zoologi (597.91) @sv
alternative label: Abborrfiskar, zoologi (597.91) @sv
alternative label: Benfiskar (597.91) @sv
alternative label: Braxen, zoologi (597.91) @sv
alternative label: Broskfiskar (597.91) @sv
broader: Selkärankaiset
in scheme: URN:NBN:fi:au:hklj:
notation: 597.91
related: URN:NBN:fi:au:hklj:1.4
related: Luonto-oppaat. Oppikirjat
related: Systemaattinen kasvitiede
related: Eläintarhat
related: Eläinmorfologia. Eläinanatomia
related: Eläinfysiologia
related: Eläinekologia
related: Nisäkkäät
related: Eläinmaantiede
related: Akvaariot
related: Kalastus
related: Kalaruoat
scope note: Ympyräsuiset. Rustokalat. Luukalat Kalojen systematiikka ja lajinmääritysoppaat Kalojen morfologia, anatomia, fysiologia, ekologia, etologia ja eläinmaantiede Kalojen lisääntyminen
scope note: Rundmunnar. Broskfiskar. Benfisk Fiskarnas systematik och handböcker i artbestämning av fiskar Fiskarnas morfologi, anatomi, fysiologi, etologi, ekologi och djurgeografi Fiskarnas fortplantning @sv

Lääkärikirjat. Ensiapuoppaat
type: Class
type: Concept
subclass of: LÄÄKETIEDE. TERVEYDENHOITO
alternative label: Akuuttihoito, ensiapu (610.2)
alternative label: Alilämpöisyys, ensiapu (610.2)
alternative label: Ambulanssilentokoneet, sairaankuljetus (610.2)
alternative label: Ambulanssit, sairaankuljetus (610.2)
alternative label: Ambulanssitoiminta (610.2)
alternative label: Arvet (610.2)
alternative label: Asfyksia, ensiapu (610.2)
alternative label: Auringonpistos, ensiapu (610.2)
alternative label: Auto-onnettomuudet, ensiapu (610.2)
alternative label: Automaattiset turvalaitteet, tapaturmantorjunta (610.2)
alternative label: Ehkäiseminen, tapaturmat (610.2)
alternative label: Elvytys, ensiapu (610.2)
alternative label: Ensiapu (610.2)
alternative label: Ensihoito (610.2)
alternative label: Ensivaste (610.2)
alternative label: Haavanhoito, ensiapu (610.2)
alternative label: Haavat, ensiapu (610.2)
alternative label: Hapenpuute, lääketiede, ensiapu (610.2)
alternative label: Hengenpelastus (610.2)
alternative label: Henkilökohtaiset suojaimet, tapaturmantorjunta (610.2)
alternative label: Henkilönsuojaimet, tapaturmantorjunta (610.2)
alternative label: Henkilösuojaimet, tapaturmantorjunta (610.2)
alternative label: Henkilövahingot, ensiapu (610.2)
alternative label: Hukkuminen, ensiapu (610.2)
alternative label: Hypotermia, ensiapu (610.2)
alternative label: Häkämyrkytys, ensiapu (610.2)
alternative label: Hälytykset, sairaankuljetus (610.2)
alternative label: Hälytysajoneuvot, sairaankuljetustoiminta (610.2)
alternative label: Hätäpuhelimet, sairaankuljetus (610.2)
alternative label: Kasvojensuojaimet, tapaturmantorjunta (610.2)
alternative label: Kasvosuojaimet, tapaturmantojunta (610.2)
alternative label: Katastrofilääketiede, ensiapu (610.2)
alternative label: Kemikaalionnettomuudet, ensiapu (610.2)
alternative label: Komorbiditeetti , lääkärikirjat (610.2)
alternative label: Kotitapaturmat (610.2)
alternative label: Kriisikeskukset, ensiapu (610.2)
alternative label: Kriisipalvelut, ensiapu (610.2)
alternative label: Kriisipuhelimet, ensiapu (610.2)
alternative label: Kriisit, ensiapu (610.2)
alternative label: Kriisityö, ensiapu (610.2)
alternative label: Kypärät (610.2)
alternative label: Kypärät, tapaturmantorjunta (610.2)
alternative label: Käsiensuojaimet, tapaturmantorjunta (610.2)
alternative label: Liikenneonnettomuudet, ensiapu (610.2)
alternative label: Liikennevahingot, ensiapu (610.2)
alternative label: Liikuntatapaturmat, ensiapu (610.2)
alternative label: Luonnononnettomuudet, ensiapu (610.2)
alternative label: Lämpöhalvaus, ensiapu (610.2)
alternative label: Lääkekaapit, ensiapu (610.2)
alternative label: Lääkäriambulanssitoiminta (610.2)
alternative label: Lääkärikirjat (610.2)
alternative label: Monihäiriöisyys , lääkärikirjat (610.2)
alternative label: Mykotoksiinit, ensiapu (610.2)
alternative label: Myrkkykasvit, myrkytykset, ensiapu (610.2)
alternative label: Myrkkysienet, myrkytykset, ensiapu (610.2)
alternative label: Myrkylliset aineet, myrkytykset (610.2)
alternative label: Myrkyt, myrkytykset (610.2)
alternative label: Myrkytykset, ensiapu (610.2)
alternative label: Myrkytyskeskukset (610.2)
alternative label: Onnettomuudet, ensiapu (610.2)
alternative label: Paarit (610.2)
broader: LÄÄKETIEDE. TERVEYDENHOITO
in scheme: URN:NBN:fi:au:hklj:
notation: 610.2
related: URN:NBN:fi:au:hklj:332.22
related: Palo- ja pelastustoimi
related: URN:NBN:fi:au:hklj:371.6
related: Väestönsuojelu
related: URN:NBN:fi:au:hklj:613.3
related: URN:NBN:fi:au:hklj:613.31
related: URN:NBN:fi:au:hklj:615.1
related: URN:NBN:fi:au:hklj:617
related: Tartuntataudit
related: URN:NBN:fi:au:hklj:617.7
related: Liikuntaelimet. Liikuntaelinten taudit
scope note: Yleiset lääkärikirjat Tapaturmat, tapaturmantorjunta ja ensiapu yleensä Hengenpelastus. Elvytys Ensiapuvälineet. Suojautuminen ja suojavarusteet yleensä Ambulanssitoiminta, ensiapu- ja tapaturma-asemat sekä myrkytyskeskukset ja niiden henkilökunta Haavat ja haavojen hoito Hukkuminen, myrkytykset, palo- ja säteilyvammat sekä räjähdys- ja liikenneonnettomuudet ensiavun kannalta Erikoisaloja koskevat lääkärikirjat, ensiapuoppaat ja tapaturmantorjunta alan mukaisessa luokassa
scope note: Allmänna läkarböcker Olycksfall, förebyggande av olycksfall och första hjälpen i allmänhet Livräddning. Återupplivning Utrustning för första hjälpen. Skydd mot olyckor, skyddsmaterial i allmänhet Ambulanser, olycksfallsstationer och akutmottagningar samt giftcentraler och deras personal Sår och sårvård Drunkningar, förgiftningar, brand- och strålningsskador samt spräng- och bilolyckor ur förstahjälpssynvinkel Läkarböcker, handledningar i första hjälpen och olycksförebyggande verksamhet som rör specialområden klassificeras enligt område @sv

Seerumihoito. Rokotukset. Verensiirto
type: Class
type: Concept
subclass of: URN:NBN:fi:au:hklj:615
alternative label: Immunoterapia (615.5)
alternative label: Injektiot, rokotus (615.5)
alternative label: Matkailijat, rokotukset (615.5)
alternative label: Plasma, verensiirrot (615.5)
alternative label: Rokotteet (615.5)
alternative label: Rokotus (615.5)
alternative label: Seerumihoito (615.5)
alternative label: Verenluovutus (615.5)
alternative label: Verensiirto (615.5)
alternative label: Veri, verenluovutus (615.5)
alternative label: Veripalvelu (615.5)
alternative label: Veriplasma, verensiirrot (615.5)
alternative label: Verituotteet (615.5)
alternative label: Verivalmisteet (615.5)
alternative label: Blod, blodgivning (615.5) @sv
alternative label: Blodgivning (615.5) @sv
alternative label: Blodplasma, blodtransfusioner (615.5) @sv
alternative label: Blodprodukter (615.5) @sv
alternative label: Blodtjänst (615.5) @sv
alternative label: Blodtransfusion (615.5) @sv
alternative label: Immunoterapi (615.5) @sv
alternative label: Injektioner, vaccinering (615.5) @sv
alternative label: Plasma, blodtransfusioner (615.5) @sv
alternative label: Resenärer, turism, vaccineringar (615.5) @sv
alternative label: Serumbehandling (615.5) @sv
alternative label: Vaccin (615.5) @sv
alternative label: Vaccinering (615.5) @sv
broader: URN:NBN:fi:au:hklj:615
in scheme: URN:NBN:fi:au:hklj:
notation: 615.5
preferred label: Serum treatments. Vaccinations. Blood transfusions @en
preferred label: Serumbehandling. Vaccineringar. Blodtransfusioner @sv
related: URN:NBN:fi:au:hklj:332.22
related: URN:NBN:fi:au:hklj:371.6
related: Hoitolaitokset. Sairaalatekniikka
related: Terveydenhoito
related: Henkilökohtainen terveydenhoito
related: URN:NBN:fi:au:hklj:616
related: Immunologia. Serologia. Verioppi
related: URN:NBN:fi:au:hklj:617
related: Sydän- ja verenkiertoelimet. Sydän- ja verenkiertoelinten taudit. Veri. Veritaudit
related: Tartuntataudit
related: URN:NBN:fi:au:hklj:617.7
scope note: Seerumihoito, rokotukset ja verensiirto hoitomuotoina Immunoterapia. Verenluovutus. Veripalvelu Jos teos koskee sekä seerumihoitoa, rokotuksia tai verensiirtoja että immunologista, serologista tai veriopillista tutkimusta, on etusija luokalla 616.4
scope note: Serumbehandling, vaccineringar och blodtransfusioner som behandlingsmetoder Immunterapi. Blodgivning. Blodtjänst Om verket handlar om såväl serumbehandling, vaccineringar och blodtransfusioner som forskning i immunologi, serologi och hematologi, ges företräde åt klass 616.4 @sv

Polkupyörät
type: Class
type: Concept
subclass of: URN:NBN:fi:au:hklj:624
alternative label: Ajo-ominaisuudet, polkupyörät (624.6)
alternative label: Huolto, polkupyörät (624.6)
alternative label: Jarrut, polkupyörät (624.6)
alternative label: Kilpapyörät (624.6)
alternative label: Korjaamot, polkupyöräkorjaamot (624.6)
alternative label: Kuntopyörät, tekniikka (624.6)
alternative label: Lastenpyörät (624.6)
alternative label: Maastopyörät (624.6)
alternative label: Nojapyörät, polkupyörät (624.6)
alternative label: Ohjekirjat, moottoripyörän korjaus (624.6)
alternative label: Ohjekirjat, polkupyörän korjaus (624.6)
alternative label: Polkupyörät (624.6)
alternative label: Renkaat, polkupyörät (624.6)
alternative label: Retkipyörät (624.6)
alternative label: Soutupyörät, polkupyörät (624.6)
alternative label: Tandem-pyörät (624.6)
alternative label: Vaihteet, polkupyörät (624.6)
alternative label: Barncyklar (624.6) @sv
alternative label: Bromsar, cyklar (624.6) @sv
alternative label: Cyklar (624.6) @sv
alternative label: Däck, cyklar (624.6) @sv
alternative label: Instruktionsböcker, cykelreparation (624.6) @sv
alternative label: Instruktionsböcker, motorcykelreparation (624.6) @sv
alternative label: Köregenskaper, cyklar (624.6) @sv
alternative label: Liggcyklar, cyklar (624.6) @sv
alternative label: Långfärdscyklar (624.6) @sv
alternative label: Motionscyklar, teknik (624.6) @sv
alternative label: Reparationsverkstäder, cykelverkstäder (624.6) @sv
alternative label: Roddcyklar, cyklar (624.6) @sv
alternative label: Skötsel, teknisk, cyklar (624.6) @sv
alternative label: Tandemcyklar (624.6) @sv
alternative label: Terrängcyklar (624.6) @sv
alternative label: Tävlingscyklar (624.6) @sv
alternative label: Växlar, teknik, cyklar (624.6) @sv
broader: URN:NBN:fi:au:hklj:624
in scheme: URN:NBN:fi:au:hklj:
notation: 624.6
preferred label: Cycles @en
preferred label: Cyklar @sv
related: URN:NBN:fi:au:hklj:380
related: Maaliikenne
related: Paikallisliikenne
related: URN:NBN:fi:au:hklj:460
related: Yleinen konetekniikka
related: Koneenrakennus. Pneumatiikka. Hydrauliikka
related: Voimakoneet. Moottorit. Nosto- ja kuljetuslaitteet
related: URN:NBN:fi:au:hklj:624.609
related: URN:NBN:fi:au:hklj:631
related: Liikenneopetus. Liikenneturvallisuus
related: Pyöräily
related: Moottoriurheilu. Lentourheilu
scope note: Polkupyörien suunnittelu, tekniikka, rakenne ja osat, huolto, viat, korjaus ja varaosat. Polkupyörämerkit ja -mallit, niiden ajo-ominaisuudet Polkupyörän ostajan oppaat Retkipyörät. Kilpapyörät. Maastopyörät. Lastenpyörät. Tandem-pyörät. Kuntopyörät Jos teos koskee sekä polkupyöriä että liikennettä, on etusija luokalla 387+ Jos teos koskee sekä polkupyöriä että kilpapyöräilyä tai pyöräretkeilyä, on etusija luokalla 791.3
scope note: Konstruktion, service och reparation av cyklar, deras teknik, konstruktion, delar, fel och reservdelar. Cykelmärken och cykelmodeller, deras köregenskaper Handledningar för cykelköpare Långfärdscyklar. Tävlingscyklar. Terrängcyklar. Barncyklar. Tandemcyklar. Trehjulingar. Motionscyklar Om verket rör både cyklar och trafik ges företräde åt klass 387+ Om verket rör både cyklar och cykeltävlingar eller cykelutfärder ges företräde åt klass 791.3 @sv

Puuteollisuus
type: Class
type: Concept
subclass of: METALLITEOLLISUUS. PUUNJALOSTUSTEOLLISUUSSÄHKÖTEKNINEN TEOLLISUUS TEKSTIILI- JA NAHKATEOLLISUUS
alternative label: Ainespuu , puuteollisuus (634)
alternative label: Aurinkotuolit, huonekaluteollisuus (634)
alternative label: Haapa, puunjalostusteollisuus (634 ... 636)
alternative label: Hake, metsäteollisuus (634 ... 636)
alternative label: Haketus, metsäteollisuus (634 ... 636)
alternative label: Harvennuspuu, metsäteollisuus (634 ... 636)
alternative label: Havupuut, puuteollisuus (634 ... 636)
alternative label: Hirret, sahateollisuus (634)
alternative label: Huonekaluliikkeet (634)
alternative label: Huonekalut, huonekaluteollisuus (634)
alternative label: Huonekaluteollisuus (634)
alternative label: Hyllyt, huonekaluteollisuus (634)
alternative label: Höyläkoneet, puuteollisuus (634)
alternative label: Höyläys, puuteollisuus (634)
alternative label: Höyläämöt, puuteollisuus (634)
alternative label: Istuimet, huonekaluteollisuus (634)
alternative label: Jalava, puuteollisuus (634)
alternative label: Jalopuut, puuteollisuus (634)
alternative label: Jalustat, huonekalut (634)
alternative label: Jyrsimet, puun työstö (634)
alternative label: Jyrsintä, puun työstö (634)
alternative label: Jätepuu, puuteollisuus (634 ... 636)
alternative label: Kaapit, huonekaluteollisuus (634)
alternative label: Kaiverrus, puun työstö (634)
alternative label: Kalusteet, huonekaluteollisuus (634)
alternative label: Kalvotekniikka, puuteollisuus (634)
alternative label: Kataja, puuteollisuus (634)
alternative label: Katkaisu, puun työstö (634)
alternative label: Keittiökalusteet, huonekaluteollisuus (634)
alternative label: Kelat, puuteollisuus (634)
alternative label: Kiillotus, puuteollisuus (634)
alternative label: Kiinnitys, tekniikka, puun työstö (634)
alternative label: Kiinnitystarvikkeet, puun työstö (634)
alternative label: Kiinnitystekniikka, puun työstö (634)
alternative label: Kimpilevyt (634)
alternative label: Koivu, puunjalostusteollisuus (634 ... 636)
alternative label: Koneistus, puun työstö (634)
alternative label: Konttorikalusteet, huonekaluteollisuus (634)
alternative label: Korkki, korkkiteollisuus (634)
alternative label: Kovalevyt, puuteollisuus (634)
alternative label: Kuidut, puuteollisuus (634)
alternative label: Kuitulevyt, kuitulevyteollisuus (634)
alternative label: Kuitupuu, metsäteollisuus (634 ... 636)
alternative label: Kuivaamot, puuteollisuus (634)
alternative label: Kuusi, puunjalostusteollisuus (634 ... 636)
alternative label: Kyllästeet, puun käsittely (634)
alternative label: Kyllästys (634)
alternative label: Kyllästäminen (634)
alternative label: Kyllästämöt (634)
alternative label: Laatikot, puulaatikot (634)
alternative label: Laminointi, huonekaluteollisuus (634)
alternative label: Lastuava työstö, puun työstö (634)
alternative label: Lastulevyt, lastulevyteollisuus (634)
alternative label: Lastulevyteollisuus (634)
alternative label: Lastuvilla, lastuvillateollisuus (634)
alternative label: Laudat, sahateollisuus (634)
alternative label: Lehmus, puunjalostusteollisuus (634 ... 636)
alternative label: Lehtipuut, puunjalostusteollisuus (634 ... 636)
alternative label: Leppä, puunjalostusteollisuus (634 ... 636)
alternative label: Liimapuu, metsäteollisuus (634)
alternative label: Liimapuurakenteet, puuteollisuus (634)
alternative label: Liimaus, puuteollisuus (634)
broader: METALLITEOLLISUUS. PUUNJALOSTUSTEOLLISUUSSÄHKÖTEKNINEN TEOLLISUUS TEKSTIILI- JA NAHKATEOLLISUUS
in scheme: URN:NBN:fi:au:hklj:
notation: 634
related: Paperi- ja selluloosateollisuus
related: Kemian teollisuus
related: URN:NBN:fi:au:hklj:657
related: Rakennusstatiikka. Rakennusaineet
related: Rakennustyöt. Rakennusaineet. Rakennustarvikkeet
related: Puutyö. Huonekalut. Verhoilu
related: Sisustusoppaat
related: Sisustusarkkitehtuuri
related: Taidepuutyöt
related: Huonekalutaide
scope note: Puuteollisuuden liiketalous, tuotantomenetelmät, rationalisointi, työt, prosessit, koneet, raaka-aineet, tuotanto ja tuotteiden kauppa Mekaaninen puunjalostusteollisuus. Puun työstö ja käsittely Puulaadut puuteollisuuden ja puun työstön kannalta Puun sahaus, höyläys, kuivaus, kyllästys ja pintakäsittely Sahateollisuus. Sahat. Höyläämöt. Vaneritehtaat. Puusepänteollisuus. Rakennuspuusepänteollisuus. Puuvalmisteteollisuus. Puutaloteollisuus. Korkkiteollisuus. Huonekaluteollisuus raaka-aineesta riippumatta. Verhoomot Laudat. Vanerit. Kuitu- ja lastulevyt. Lastuvilla Huonekalut. Puuesineet teollisuustuotteina Teokset, joissa on sekä puuteollisuutta että paperi- tai selluloosateollisuutta Tässä myös metsäteollisuutta yleensä koskevat teokset Huonekalutehtaiden tuoteluottelot 634.03 Huonekalu- ym. -tehtaiden historia 634.09
scope note: Företagsekonomi, produktionsmetoder, rationalisering, arbete, processer, maskiner, råmaterial, produktion och handel inom trävaruindustri Mekanisk träförädlingsindustri. Bearbetning och hantering av trä Träslag med hänsyn till trävaruindustri och bearbetning Sågning, hyvling, torkning, impregnering och ytbehandling av trä Sågverksindustri. Sågar. Hyvlerier. Plywoodfabriker. Snickeriindustri. Byggnadssnickeriindustri. Träproduktindustri. Trähusindustri. Korkindustri. Möbelindustri oavsett råmaterial. Tapetserarverkstäder Bräder. Faner och plywood. Fiberskivor. Spånskivor. Träull Möbler. Träföremål som industriella produkter Verk som handlar om såväl trävaruindustri som pappers- eller massaindustri Hir även verk om skogsindustri i allmänhet Möbelfabrikernas produktkataloger 634.03 Möbelfabrikernas och andra liknande fabrikers historia 634.09 @sv

Huoneakustiikka
type: Class
type: Concept
subclass of: Talonrakennus
alternative label: Akustiikka, talonrakennus (667.8)
alternative label: Eristeet, äänieristys (667.8)
alternative label: Eristimet, äänieristys (667.8)
alternative label: Eristys, äänieristys (667.8)
alternative label: Huoneakustiikka (667.8)
alternative label: Kaiku, huoneakustiikka (667.8)
alternative label: Kivivilla, äänieristys (667.8)
alternative label: Kuonavilla, äänieristys (667.8)
alternative label: Mineraalivilla, äänieristys (667.8)
alternative label: Rakennusakustiikka (667.8)
alternative label: Vuorivilla, äänieristys (667.8)
alternative label: Ääneneristys, talonrakennus (667.8)
alternative label: Äänieristys, talonrakennus (667.8)
alternative label: Äänisuunnittelu, huoneakustiikka (667.8)
alternative label: Akustik, husbyggnad (667.8) @sv
alternative label: Bergull, ljudisolering (667.8) @sv
alternative label: Byggnadsakustik (667.8) @sv
alternative label: Eko, rumsakustik (667.8) @sv
alternative label: Isolatorer, ljudisolering (667.8) @sv
alternative label: Isolering, ljudisolering (667.8) @sv
alternative label: Isoleringar, ljudisolering (667.8) @sv
alternative label: Ljudisolation, husbyggnad (667.8) @sv
alternative label: Ljudisolering, husbyggnad (667.8) @sv
alternative label: Ljudplanering, rumsakustik (667.8) @sv
alternative label: Mineralull, ljudisolering (667.8) @sv
alternative label: Rumsakustik (667.8) @sv
alternative label: Slaggull, ljudisolering (667.8) @sv
alternative label: Stenull, ljudisolering (667.8) @sv
broader: Talonrakennus
in scheme: URN:NBN:fi:au:hklj:
notation: 667.8
preferred label: Room acoustics @en
preferred label: Rumsakustik @sv
related: Äänioppi. Mekaaniset värähtelyt
related: Energia
related: Raideliikenneväylät. Junat. Raitiovaunut. Metro
related: Rakennusstatiikka. Rakennusaineet
related: Tekninen rakennussuunnittelu
related: Rakenneosat
related: Sisustusoppaat
related: URN:NBN:fi:au:hklj:720
related: URN:NBN:fi:au:hklj:721
related: URN:NBN:fi:au:hklj:726
related: Teatteritekniikka
related: Musiikin psykologia. Musiikin akustiikka
scope note: Sisätilojen akustiset ominaisuudet ja niiden rakennustekninen suunnittelu ja korjaus Äänieristys
scope note: Akustiska egenskaper i rum och byggnadsteknisk planering och reparation av dem Ljudisolering @sv

Tavaraoppi
type: Class
type: Concept
subclass of: LIIKETALOUS. KAUPPA. MARKKINOINTI. LIIKENNEOPETUS
alternative label: Aistinvarainen arviointi, laadunvalvonta, laadunvalvonta (672)
alternative label: Arviointi, laadunvalvonta (672)
alternative label: EAN-koodit, tavaraoppi (672)
alternative label: Elinkaari, tuotteiden (672)
alternative label: Elinkaarianalyysi (672)
alternative label: Elinkaariarviointi (672)
alternative label: Elinkaarimallit (672)
alternative label: Energiamerkintä, tuotetieto (672)
alternative label: Etätunnistaminen, tavaraoppi (672)
alternative label: Etätunnistus, tavaraoppi (672)
alternative label: Evaluaatio, laadunvalvonta (672)
alternative label: Hajukokeet, laadunvalvonta (672)
alternative label: Kaupankäynti, tavaraoppi (672)
alternative label: Kauppa, tavaraoppi (672)
alternative label: Kauppakemia (672)
alternative label: Kauppatavarat (672)
alternative label: Käyttöikä, tavaraoppi (672)
alternative label: Käyttövarmuus (672)
alternative label: Laadunarviointi (672)
alternative label: Laadunhallinta, tavaraoppi (672)
alternative label: Laadunvalvonta, tavaraoppi (672)
alternative label: Laadunvarmistus, tavaraoppi (672)
alternative label: Laatu, tavaraoppi (672)
alternative label: Laatuluokitukset, tavaraoppi (672)
alternative label: Laatupalkinnot, tuotteet (672)
alternative label: Lajittelu, tavaraoppi (672)
alternative label: Lajittelusäännöt, tavaraoppi (672)
alternative label: Lopputuotteet, tavaraoppi (672)
alternative label: Makukokeet, laadunvalvonta (672)
alternative label: PPP (672)
alternative label: Privat Public Partnership (672)
alternative label: Puolivalmisteet (672)
alternative label: QR-koodit, tavaraoppi (672)
alternative label: RFID, tavaraoppi (672)
alternative label: RFID-tunnistus, tavaraoppi (672)
alternative label: Radio frequency identification, tavaraoppi (672)
alternative label: Radiotaajuinen tunnistus, tavaraoppi (672)
alternative label: Sertifiointi (672)
alternative label: Tavarakoodit, tavaraoppi (672)
alternative label: Tavaraoppi (672)
alternative label: Tavaraselosteet (672)
alternative label: Tavarat (672)
alternative label: Tavarat, tavaraoppi (672)
alternative label: Toimintavarmuus (672)
alternative label: Tuoteryhmäjako (672)
alternative label: Tuoteselosteet, tavaraoppi (672)
alternative label: Tuotetiedot (672)
alternative label: Tuotteet, tuotetieto (672)
alternative label: Valvonta, laadunvalvonta, tavaraoppi (672)
alternative label: Viivakoodit, tavaraoppi (672)
alternative label: Användningstid, varukunskap (672) @sv
alternative label: Automatisk identifiering, varukunskap (672) @sv
alternative label: Automatisk igenkänning, varukunskap (672) @sv
alternative label: Certifiering (672) @sv
alternative label: Driftsäkerhet (672) @sv
alternative label: EAN-koder, varukunskap (672) @sv
alternative label: Energimärkning, varulära (672) @sv
alternative label: Evaluering, kvalitetskontroll (672) @sv
alternative label: Funktionssäkerhet (672) @sv
alternative label: Halvfabrikat (672) @sv
broader: LIIKETALOUS. KAUPPA. MARKKINOINTI. LIIKENNEOPETUS
in scheme: URN:NBN:fi:au:hklj:
notation: 672
related: Kauppaoikeus. Yhtiölainsäädäntö. Pankki- ja vakuutuslainsäädäntö
related: URN:NBN:fi:au:hklj:360
related: URN:NBN:fi:au:hklj:363
related: URN:NBN:fi:au:hklj:368
related: Aineoppi. Aineenkoetus
related: URN:NBN:fi:au:hklj:649.91
related: URN:NBN:fi:au:hklj:650.2
related: Materiaalitoiminnot. Logistiikka
related: Mainonta. Kuluttajanvalistus
related: Mainonta
related: URN:NBN:fi:au:hklj:676.103
related: Kuluttajanvalistus
scope note: Tavaraopin ja tuotetiedon yleisteokset ja yleiset oppikirjat Kauppatavarat yleensä Raaka-aineet, puolivalmisteet ja lopputuotteet yleisen tavaraopin kannalta Tuoteryhmäjako yleensä Tiettyyn tuotteeseen tai tuoteryhmään liittyvä tavaraoppi alan mukaisessa luokassa
scope note: Allmänna verk och läroböcker om varukunskap och produktkännedom Handelsvaror i allmänhet Råmaterial, halvfabrikat och slutprodukter ur den allmänna varukunskapens synvinkel Produktgruppsindelning i allmänhet Varukunskap som rör enskilda produkter eller produktgrupper klassificeras enligt område @sv

Pukeutuminen. Kauneudenhoito
type: Class
type: Concept
subclass of: KOTITALOUS. LAITOSTALOUS. KAUNEUDENHOITO
alternative label: Alusvaatteet, pukeutumisohjeet (696)
alternative label: Farkut, pukeutumisoppaat (696)
alternative label: Farmarihousut, pukeutumisoppaat (696)
alternative label: Hyvä maku, pukeutuminen (696)
alternative label: Jalkineet, pukeutumisohjeet (696)
alternative label: Juhlapuvut, pukeutumisohjeet (696)
alternative label: Juhlavaatteet, pukeutumisohjeet (696)
alternative label: Kengät, pukeutumisohjeet (696)
alternative label: Käsineet, pukeutumisohjeet (696)
alternative label: Lapaset, pukeutumisohjeet (696)
alternative label: Mallin työ, muoti (696 +)
alternative label: Mallit, mallin työ, muoti (696 +)
alternative label: Mallit, mallitoimistot (696)
alternative label: Mallitoimistot (696)
alternative label: Mannekiinit, mannekiinin työ (696 +)
alternative label: Muoti, pukeutumisohjeet (696)
alternative label: Muotivalokuvaus, mallin työ (696 +)
alternative label: Muotivalokuvaus, muoti (696 +)
alternative label: Pukeutuminen, kauneudenhoito (696 +)
alternative label: Vaatteet, pukeutumisoppaat (696)
alternative label: Vapaa-ajanvaatteet, pukeutumisohjeet (696)
alternative label: Villavaatteet, pukeutumisohjeet (696)
alternative label: Värianalyysi (696)
alternative label: Värianalyysi, pukeutuminen (696)
alternative label: Värit, pukeutuminen (696)
alternative label: Festdräkter, klädetikett (696) @sv
alternative label: Festkläder, klädetikett (696) @sv
alternative label: Fritidskläder, klädetikett (696) @sv
alternative label: Färganalys (696) @sv
alternative label: Färganalys, klädsel (696) @sv
alternative label: Färger, klädsel (696) @sv
alternative label: God smak, klädsel (696) @sv
alternative label: Handskar, klädetikett (696) @sv
alternative label: Jeans, klädguider (696) @sv
alternative label: Kläder, klädguider (696) @sv
alternative label: Klädsel, skönhetsvård (696 +) @sv
alternative label: Mannekänger, mannekängens arbete (696 +) @sv
alternative label: Mode, klädetikett (696) @sv
alternative label: Modefotografering, mode (696 +) @sv
alternative label: Modefotografering, modellens arbete (696 +) @sv
alternative label: Modellagenturer (696) @sv
alternative label: Modellens arbete, mode (696 +) @sv
alternative label: Modeller, modellagenturer (696) @sv
alternative label: Modeller, modellens arbete, mode (696 +) @sv
alternative label: Skodon, klädetikett (696) @sv
alternative label: Skor, klädetikett (696) @sv
alternative label: Underkläder, klädetikett (696) @sv
alternative label: Vantar, klädetikett (696) @sv
alternative label: Yllekläder, klädetikett (696) @sv
broader: KOTITALOUS. LAITOSTALOUS. KAUNEUDENHOITO
in scheme: URN:NBN:fi:au:hklj:
narrower: Kauneudenhoito
notation: 696
preferred label: Clothing. Beauty care @en
preferred label: Klädsel. Skönhetsvård @sv
related: Käytös- ja tapatieto
related: Juhlien järjestäminen
related: Tekstiili- ja vaatetusteollisuus
related: Nahka- ja jalkineteollisuus
related: Siivous. Pesu- ja puhdistustyöt
related: Ompelu
related: Neulonta
related: Teatteritekniikka
related: Muodin historia
scope note: Yleisteokset, jotka koskevat sekä pukeutumista että kauneudenhoitoa Pukeutumisohjeet. Pukeutumiseen liittyvä värianalyysi Värianalyysi, joka liittyy sekä pukeutumiseen että kauneudenhoitoon Mallin työ
scope note: Allmänna verk som rör både klädsel och skönhetsvård Klädselråd. Färganalys som hänför sig till klädsel Färganalys som hänför sig till både klädsel och skönhetsvård Mannekängens arbete @sv

Kauneudenhoito
type: Class
type: Concept
subclass of: Pukeutuminen. Kauneudenhoito
alternative label: Alaraajat, jalkahoito (696.1)
alternative label: Auringonsuoja-aineet, ihonhoito, kauneudenhoito (696.1)
alternative label: Azzalure-hoito, kauneudenhoito (696.1)
alternative label: Botox-hoito, kauneudenhoito (696.1)
alternative label: Botuliinihoito, kauneudenhoito (696.1)
alternative label: Deodorantit, kauneudenhoito (696.1)
alternative label: Ehostus, kauneudenhoito-ohjeet (696.1)
alternative label: Esanssit, hajuvesien käyttö (696.1)
alternative label: Eteeriset öljyt, hajuvesien käyttö (696.1)
alternative label: Fyysiset ominaisuudet, kauneudenhoito (696.1)
alternative label: Hajuaineet, kauneudenhoito-ohjeet (696.1)
alternative label: Hajuvedet, kauneudenhoito-ohjeet (696.1)
alternative label: Hampaidenvalkaisu (696.1)
alternative label: Hilse, hiustenhoito (696.1)
alternative label: Hilse, ihonhoito (696.1)
alternative label: Hiukset, kauneudenhoito-ohjeet (696.1)
alternative label: Hiusala (696.1)
alternative label: Hiustenhoito, kauneudenhoito (696.1)
alternative label: Hiustenleikkaus (696.1)
alternative label: Hiustenlähtö, kauneudenhoito-ohjeet (696.1)
alternative label: Hyvä maku, kauneudenhoito (696.1)
alternative label: Iho, ihonhoito (696.1)
alternative label: Ihokarvojen poisto (696.1)
alternative label: Ihonhoito, kauneudenhoito (696.1)
alternative label: Jalat, jalkahoito (696.1)
alternative label: Jalkahoito (696.1)
alternative label: Jalkojenhoito (696.1)
alternative label: Kaljuuntuminen, kauneudenhoito-ohjeet (696.1)
alternative label: Kampaajamestarit, kampaajan työ (696.1)
alternative label: Kampaajat, kampaajan työ (696.1)
alternative label: Kampaamot (696.1)
alternative label: Kampaukset, kampaajan työ (696.1)
alternative label: Karvanpoisto (696.1)
alternative label: Karvat, karvanpoisto (696.1)
alternative label: Kasvohoito (696.1)
alternative label: Kasvot, kauneudenhoito (696.1)
alternative label: Kauneudenhoito (696.1)
alternative label: Kauneudenhoito, henkilökohtainen (696.1)
alternative label: Kauneudenhoitoaineet, kauneudenhoito (696.1)
alternative label: Kauneudenhoitoala (696.1)
alternative label: Kauneudenhoitokasvit, kauneudenhoito (696.1)
alternative label: Kauneus, kauneudenhoito (696.1)
alternative label: Kauneushoitolat (696.1)
alternative label: Kauneusihanteet, kauneudenhoito (696.1)
alternative label: Keho, kauneudenhoito (696.1)
alternative label: Kosmetiikka, kosmetologia (696.1)
alternative label: Kosmetologia (696.1)
alternative label: Kosmetologit, kosmetologin työ (696.1)
alternative label: Kädet, käsienhoito (696.1)
alternative label: Kähertäjäala (696.1)
alternative label: Käsienhoito (696.1)
alternative label: Luomet, kauneudenhoito (696.1)
alternative label: Lävistys, kauneudenhoito (696.1)
alternative label: Make up, kauneudenhoito-ohjeet (696.1)
alternative label: Manikyyri (696.1)
alternative label: Meikkaus, kauneudenhoito-ohjeet (696.1)
alternative label: Meikkitaiteilijat, ehostus (696.1)
alternative label: Muoti, kauneudenhoito-ohjeet (696.1)
alternative label: Nenä, kauneudenhoito (696.1)
alternative label: Parfyymit, kauneudenhoito-ohjeet (696.1)
broader: Pukeutuminen. Kauneudenhoito
in scheme: URN:NBN:fi:au:hklj:
notation: 696.1
related: URN:NBN:fi:au:hklj:357.1
related: Käytös- ja tapatieto
related: Juhlien järjestäminen
related: Henkilökohtainen terveydenhoito
related: Iho. Ihotaudit. Sukupuolielimet. Sukupuolitaudit
related: URN:NBN:fi:au:hklj:617.7
related: Kemian teollisuus
related: Yrtti- ja maustekasvit
related: HIENOMEKANIIKKA. KÄSI- JA KOTITEOLLISUUS
related: Tatuointi. Kehotaide
related: Teatteritekniikka
related: Muodin historia
scope note: Kasvojen-, käsien-, jalkojen-, ihon- ja hiustenhoito kauneudenhoidon kannalta Pedikyyri. Manikyyri Meikkaus. Kosmetologia. Kosmetologin työ. Kauneushoitolat Kampaajan työ. Kampaamot. Parturin työ. Parturit Värianalyysi meikkauksen ja kauneudenhoidon kannalta Yrttien käyttö kauneudenhoidossa
scope note: Ansikts-, hand-, fot-, hud- och hårvård ur skönhetsvårdens synvinkel Pedikyr. Manikyr Make-up. Kosmetologi. Kosmetologens arbete. Skönhetssalonger Frisörskans arbete. Damfrisering. Frisörens arbete. Herrfrisering Färganalys ur skönhetsvårdens synvinkel Örter i skönhetsvården @sv

Kokoomateokset
type: Class
type: Concept
subclass of: URN:NBN:fi:au:hklj:700
alternative label: Teokset, taiteilijoiden teosluettelot (703 ... 776.03)
alternative label: Verk, konstnärers opusförteckningar (703 ... 776.03) @sv
broader: URN:NBN:fi:au:hklj:700
in scheme: URN:NBN:fi:au:hklj:
narrower: Museot. Arkistot. Kokoelmat. Näyttelyt
narrower: Taidekauppa
notation: 708
preferred label: Compilations. Polygraphies @en
preferred label: Samlingsverk. Polygrafier @sv
related: Symbolit. Koodit. Merkkijärjestelmät
related: URN:NBN:fi:au:hklj:010
related: Yleisbibliografiat. Kansallisbibliografiat
related: Kustantajien ja kirjakauppojen luettelot
related: Erikoisalojen bibliografiat
related: Taiteet. Liikunta
related: Paikallisbibliografiat. Henkilöbibliografiat
related: Esseet. Taidearvostelut
scope note: Taiteita koskevat yleiset tai sekasisältöiset kokoomateokset Eri taiteenaloja koskevat kokoomateokset alan mukaisessa luokassa
scope note: Samlingsverk och polygrafier med allmänt eller blandat innehåll som rör konst Samlingsverk och polygrafier som rör enskilda konstarter klassificeras enligt konstart @sv

Etelä-Eurooppa
type: Class
type: Concept
subclass of: URN:NBN:fi:au:hklj:740.9
alternative label: Kreikka, maalaustaide, nykyaika (740.94)
alternative label: Portugali, maalaustaide (740.94)
alternative label: Grekland, målarkonst, nutiden (740.94) @sv
alternative label: Portugal, målarkonst (740.94) @sv
broader: URN:NBN:fi:au:hklj:740.9
in scheme: URN:NBN:fi:au:hklj:
narrower: Italia
narrower: Espanja
notation: 740.94
preferred label: Southern Europe @en
preferred label: Sydeuropa @sv
related: URN:NBN:fi:au:hklj:709
related: Vanhan ajan maalaustaide. Euroopan ulkopuolistenvanhojen kulttuurien maalaustaide
related: URN:NBN:fi:au:hklj:741
related: URN:NBN:fi:au:hklj:741.1
related: URN:NBN:fi:au:hklj:741.2
related: URN:NBN:fi:au:hklj:742
related: URN:NBN:fi:au:hklj:749
related: URN:NBN:fi:au:hklj:749.1
scope note: Portugali. Malta. Balkanin niemimaa. Kreikka. Bulgaria. Albania. Bosnia ja Hertsegovina. Kroatia. Makedonia Serbia ja Montenegro. Slovenia
scope note: Portugal. Malta. Balkanhalvön. Grekland. Bulgarien. Albanien. Bosnien-Hercegovina. Kroatien. Makedonien. Serbien och Montenegro. Slovenien @sv

Graafisen taiteen teoria, estetiikka ja filosofia
type: Class
type: Concept
subclass of: GRAAFINEN TAIDE. VALOKUVAUS
broader: GRAAFINEN TAIDE. VALOKUVAUS
in scheme: URN:NBN:fi:au:hklj:
notation: 750.1
preferred label: Theory, aesthetics and philosophy of graphic art @en
preferred label: Den grafiska konstens teori, estetik och filosofi @sv
related: Taiteen estetiikka. Taidefilosofia. Taidepsykologia. Taidesosiologia. Taidepolitiikka
related: MAALAUSTAIDE. PIIRUSTUSTAIDE
related: URN:NBN:fi:au:hklj:740.9
related: URN:NBN:fi:au:hklj:749.1
related: Kuvitustaide
related: Käyttögrafiikka
related: Taidegrafiikka
related: Taidegrafiikan materiaalit ja tekniikka
related: URN:NBN:fi:au:hklj:756
related: Valokuvataide
related: Valokuvauksen materiaalit ja tekniikka. Valokuvausoppaat
scope note: Graafisen taiteen yleinen teoria, estetiikka ja filosofia Teokset, jotka koskevat sekä graafisen taiteen että valokuvauksen teoriaa, estetiikkaa tai filosofiaa Graafisen taiteen erikoisalojen teoria, estetiikka ja filosofia alan mukaisessa luokassa
scope note: Den grafiska konstens allmänna teori, estetik och filosofi Verk som handlar om både den grafiska konstens och fotografins teori, estetik eller filosofi Specialområden inom den grafiska konstens teori, estetik och filosofi klassificeras enligt område @sv

Muut taideteollisuuden alat
type: Class
type: Concept
subclass of: URN:NBN:fi:au:hklj:760
alternative label: Emalityöt (766)
alternative label: Kivi, taideteollisuus (766)
alternative label: Kivituotteet, taideteolliset (766)
alternative label: Koralliesineet (766)
alternative label: Käsityöt, emalityöt (766)
alternative label: Käsityöt, kivityöt (766)
alternative label: Käsityöt, luutyöt (766)
alternative label: Käsityöt, muovityöt (766)
alternative label: Lakkatyöt, taidelakkatyöt (766)
alternative label: Luuesineet, taideteollisuus (766)
alternative label: Luutyöt (766)
alternative label: Muotoilijat, eri alat (761 ... 768)
alternative label: Muotoilu, eri alat (761 ... 768)
alternative label: Muoviesineet, taideteolliset (766)
alternative label: Muovit, muovityöt (766)
alternative label: Muovituotteet, taideteolliset (766)
alternative label: Muovityöt (766)
alternative label: Norsunluu, norsunluutyöt (766)
alternative label: Paju, taideteollisuus (766)
alternative label: Sarvityöt (766)
alternative label: Benarbeten (766) @sv
alternative label: Benföremål, konstindustri (766) @sv
alternative label: Elfenben, elfenbensarbeten (766) @sv
alternative label: Emaljarbeten (766) @sv
alternative label: Formgivare, olika branscher (761 ... 768) @sv
alternative label: Formgivning, olika branscher (761 ... 768) @sv
alternative label: Handarbeten, benarbeten (766) @sv
alternative label: Handarbeten, emaljarbeten (766) @sv
alternative label: Handarbeten, plastarbeten (766) @sv
alternative label: Handarbeten, stenarbeten (766) @sv
alternative label: Hornarbete (766) @sv
alternative label: Korallföremål (766) @sv
alternative label: Lackarbeten, konstlackarbeten (766) @sv
alternative label: Plastarbeten (766) @sv
alternative label: Plaster, plastarbeten (766) @sv
alternative label: Plastföremål, konstindustriella (766) @sv
alternative label: Plastprodukter, konstindustriella (766) @sv
alternative label: Sten, konstindustri (766) @sv
alternative label: Stenprodukter, konstindustriella (766) @sv
alternative label: Vide, konstindustri (766) @sv
broader: URN:NBN:fi:au:hklj:760
in scheme: URN:NBN:fi:au:hklj:
narrower: Lasitaide
narrower: Paperitaide
narrower: Nahkatyöt. Turkistyöt
notation: 766
preferred label: Other areas of industrial art @en
preferred label: Andra konstindustriella områden @sv
related: Kulta- ja hopeasepäntaide. Korutaide
related: URN:NBN:fi:au:hklj:767
related: URN:NBN:fi:au:hklj:798
scope note: Muut taideteollisuuden alat sekä niiden historia, materiaalit, tekniikka ja estetiikka Muita taideteollisuuden aloja koskevat ohjeet ja mallit Emalitaide. Emalityöt Muovi taideteollisuuden ja taidekäsityön raaka-aineena Luu- ja norsunluutyöt. Luu- ja norsunluuveistokset
scope note: Andra konstindustriella områden samt deras historia, material, tekniker och estetik Beskrivningar samt modeller, mallar och mönster som rör andra konstindustriella områden Emaljkonst. Emaljarbeten Plast som råmaterial inom konstindustri och konsthantverk Arbeten i ben och elfenben. Ben- och elfenbensskulpturer @sv

Musiikin psykologia. Musiikin akustiikka
type: Class
type: Concept
subclass of: Musiikin filosofia, estetiikka, psykologia ja sosiologia Musiikkikasvatus. Musiikkiopetus
alternative label: Absoluuttinen sävelkorva , musiikkipsykologia (781.3)
alternative label: Akustiikka, musiikki (781.3)
alternative label: Autenttisuus, musiikin psykologia (781.3)
alternative label: Elektroakustiikka, musiikki (781.3)
alternative label: Esittäminen, musiikkipsykologia (781.3)
alternative label: Kaiku, musiikin akustiikka (781.3)
alternative label: Konserttisalit, akustiikka (781.3)
alternative label: Kuunteleminen, musiikin psykologia (781.3)
alternative label: Musiikin psykologia (781.3)
alternative label: Musiikkipsykologia (781.3)
alternative label: Musikaalisuus, musiikkipsykologia (781.3)
alternative label: Sähköakustiikka, musiikki (781.3)
alternative label: Taideharrastukset, musiikin kuuntelu (781.3)
alternative label: Taustamusiikki, musiikin psykologia (781.3)
alternative label: Äänisuunnittelu, musiikin akustiikka (781.3)
alternative label: Absolut gehör, musikpsykologi (781.3) @sv
alternative label: Akustik, musik (781.3) @sv
alternative label: Autenticitet, musikpsykologi (781.3) @sv
alternative label: Bakgrundsmusik, musikpsykologi (781.3) @sv
alternative label: Eko, musikakustik (781.3) @sv
alternative label: Elektroakustik, musik (781.3) @sv
alternative label: Elektronisk akustik, musik (781.3) @sv
alternative label: Framförande, musikpsykologi (781.3) @sv
alternative label: Konsertsalar, akustik (781.3) @sv
alternative label: Konstintressen, musik, lyssnarvanor (781.3) @sv
alternative label: Ljudplanering, musikakustik (781.3) @sv
alternative label: Lyssnande, musikpsykologi (781.3) @sv
alternative label: Musikalitet, musikpsykologi (781.3) @sv
alternative label: Musikens psykologi (781.3) @sv
alternative label: Musikpsykologi (781.3) @sv
broader: Musiikin filosofia, estetiikka, psykologia ja sosiologia Musiikkikasvatus. Musiikkiopetus
in scheme: URN:NBN:fi:au:hklj:
notation: 781.3
preferred label: Psychology of music. Music acoustics @en
preferred label: Musikpsykologi. Musikakustik @sv
related: Äänioppi. Mekaaniset värähtelyt
related: Huoneakustiikka
related: Taiteen estetiikka. Taidefilosofia. Taidepsykologia. Taidesosiologia. Taidepolitiikka
related: Konsertit. Musiikkijuhlat. Musiikkikilpailut. Nuottien ja äänitteiden kustantaminen
related: Musiikin estetiikka ja filosofia
related: URN:NBN:fi:au:hklj:781.2
related: Musiikin sosiologia. Musiikkipolitiikka
related: Musiikin teoria
scope note: Musiikin psykologia ja akustiikka yleensä Tiettyyn musiikin erikoisalaan liittyvä musiikkipsykologia ja akustiikka alan mukaisessa luokassa
scope note: Musikpsykologi och musikakustik i allmänhet Musikpsykologi och akustik som rör ett bestämt specialområde inom musiken klassificeras enligt område @sv

Musiikin tulkinta. Tyylioppi
type: Class
type: Concept
subclass of: Musiikin teoria
alternative label: Agogiikka (782.8)
alternative label: Artikulaatio, musiikin tulkinta (782.8)
alternative label: Artikuloiminen, musiikin tulkinta (782.8)
alternative label: Artikulointi, musiikin tulkinta (782.8)
alternative label: Dynamiikka, musiikin tulkinta (782.8)
alternative label: Esiintymistaito, musiikin esittäminen (782.8)
alternative label: Esittäminen, musiikin tulkinta (782.8)
alternative label: Esityskäytäntö, musiikki (782.8)
alternative label: Fraseeraus, musiikki (782.8)
alternative label: Improvisointi (782.8)
alternative label: Improvisointi, musiikki (782.8)
alternative label: Intonaatio, musiikin tulkinta (782.8)
alternative label: Intonaatioteoria, musiikin tulkinta (782.8)
alternative label: Kadenssit, improvisointi (782.8)
alternative label: Kantaesitykset, musiikki (782.8 +)
alternative label: Musiikin esittäminen (782.8)
alternative label: Musiikin tulkinta (782.8)
alternative label: Musiikkiesitykset, esityspraksis (782.8)
alternative label: Ornamentiikka, musiikki (782.8)
alternative label: Stilistiikka, musiikki (782.8)
alternative label: Säestäminen (782.8)
alternative label: Tulkinta, musiikin tulkinta (782.8)
alternative label: Tyyli, musiikki (782.8)
alternative label: Tyylintutkimus, musiikki (782.8)
alternative label: Vapaa säestys (782.8)
alternative label: Ackompanjemang (782.8) @sv
alternative label: Agogik (782.8) @sv
alternative label: Artikulation, musiktolkning (782.8) @sv
alternative label: Dynamik, musiktolkning (782.8) @sv
alternative label: Framförande, musiktolkning (782.8) @sv
alternative label: Frasering, musik (782.8) @sv
alternative label: Fritt ackompanjemang (782.8) @sv
alternative label: Förmåga att uppträda, musikuppförande (782.8) @sv
alternative label: Improvisation (782.8) @sv
alternative label: Improvisation, musik (782.8) @sv
alternative label: Intonation, musiktolkning (782.8) @sv
alternative label: Intonationsteori, musikens tolkning (782.8) @sv
alternative label: Kadenser, improvisation (782.8) @sv
alternative label: Musikframföranden, framförandepraxis (782.8) @sv
alternative label: Musiktolkning (782.8) @sv
alternative label: Ornamentik, musik (782.8) @sv
alternative label: Stil, musik (782.8) @sv
alternative label: Stilforskning, musik (782.8) @sv
alternative label: Stilistik, musik (782.8) @sv
alternative label: Tolkning, uttydning, musiktolkning (782.8) @sv
alternative label: Uppförandepraxis, musik (782.8) @sv
alternative label: Urpremiärer, musik (782.8 +) @sv
broader: Musiikin teoria
in scheme: URN:NBN:fi:au:hklj:
notation: 782.8
preferred label: Musical interpretation. Stylistics @en
preferred label: Musikal tolkning. Stillära @sv
related: Musiikin filosofia, estetiikka, psykologia ja sosiologia Musiikkikasvatus. Musiikkiopetus
related: Musiikin estetiikka ja filosofia
related: URN:NBN:fi:au:hklj:782.4
related: Johtaminen
related: URN:NBN:fi:au:hklj:789.1
related: Varhaiskansojen musiikki
related: Keskiajan musiikki
related: Renessanssimusiikki
related: Barokkimusiikki
related: Klassismin musiikki
related: Romantiikan musiikki
related: 1900-luvun musiikki. 2000-luvun musiikki
scope note: Musiikin tulkinta ja tyylioppi musiikin lajista riippumatta Agogiikka. Artikulaatio. Dynamiikka. Fraseeraus. Intonaatio. Improvisointi. Ornamentiikka. Vapaa säestys Esityspraksis
scope note: Musikal tolkning och stillära oavsett musikslag Agogik. Artikulation. Dynamik. Frasering. Intonation. Improvisation. Ornamentik. Fritt ackompanjemang Uppförandepraxis @sv

Harmonikka
type: Class
type: Concept
subclass of: Kosketinsoittimet
alternative label: Accordeon (786.16 +)
alternative label: Bandoneon (786.16 +)
alternative label: Concertina (786.16 +)
alternative label: Haitari (786.16 +)
alternative label: Hanuri (786.16 +)
alternative label: Harmonikka (786.16 +)
alternative label: Musette, harmonikka (786.16 +)
alternative label: Musetteharmonikka (786.16 +)
alternative label: Näppäinharmonikka (786.16 +)
alternative label: Pianohanuri (786.16 +)
alternative label: Pianoharmonikka (786.16 +)
alternative label: Dragharmonika (786.16 +) @sv
alternative label: Dragspel (786.16 +) @sv
alternative label: Harmonika (786.16 +) @sv
alternative label: Musettdragspel (786.16 +) @sv
alternative label: Musette, harmonika (786.16 +) @sv
alternative label: Pianodragspel (786.16 +) @sv
alternative label: Pianoharmonika (786.16 +) @sv
broader: Kosketinsoittimet
in scheme: URN:NBN:fi:au:hklj:
narrower: Koulut, harjoituskappaleet ja -etydit
notation: 786.16
preferred label: Accordion @en
preferred label: Dragspel @sv
related: URN:NBN:fi:au:hklj:627.7531
related: URN:NBN:fi:au:hklj:681
related: URN:NBN:fi:au:hklj:781.5
related: URN:NBN:fi:au:hklj:782.6
related: URN:NBN:fi:au:hklj:785
related: URN:NBN:fi:au:hklj:785.11
related: URN:NBN:fi:au:hklj:788
related: URN:NBN:fi:au:hklj:789

Harppu
type: Class
type: Concept
subclass of: Näppäinsoittimet
alternative label: Harppu (786.21 +)
alternative label: Harppusoittimet (786.21 +)
alternative label: Harpa (786.21 +) @sv
alternative label: Harpinstrument (786.21 +) @sv
broader: Näppäinsoittimet
in scheme: URN:NBN:fi:au:hklj:
narrower: Koulut, harjoituskappaleet ja -etydit
notation: 786.21
preferred label: Harp @en
preferred label: Harpa @sv
related: URN:NBN:fi:au:hklj:627.7531
related: URN:NBN:fi:au:hklj:681
related: URN:NBN:fi:au:hklj:781.5
related: URN:NBN:fi:au:hklj:782.6
related: URN:NBN:fi:au:hklj:785
related: URN:NBN:fi:au:hklj:785.11
related: URN:NBN:fi:au:hklj:788
related: URN:NBN:fi:au:hklj:789

Kantele
type: Class
type: Concept
subclass of: Näppäinsoittimet
alternative label: Kantele (786.22 +)
alternative label: Viisikielinen kantele (786.22 +)
alternative label: Femsträngad kantele (786.22 +) @sv
broader: Näppäinsoittimet
in scheme: URN:NBN:fi:au:hklj:
narrower: Koulut, harjoituskappaleet ja -etydit
notation: 786.22
related: URN:NBN:fi:au:hklj:627.7531
related: URN:NBN:fi:au:hklj:681
related: URN:NBN:fi:au:hklj:781.5
related: URN:NBN:fi:au:hklj:782.6
related: URN:NBN:fi:au:hklj:785
related: URN:NBN:fi:au:hklj:785.11
related: URN:NBN:fi:au:hklj:788
related: URN:NBN:fi:au:hklj:789

Kitara
type: Class
type: Concept
subclass of: Näppäinsoittimet
alternative label: Akustinen kitara (786.23)
alternative label: Archiliuto (786.23 +)
alternative label: Chitarra (786.23 +)
alternative label: Ilmakitara, kitara (786.23)
alternative label: Kitara (786.23)
alternative label: Lyyrakitara (786.23 +)
alternative label: Vihuela (786.23 +)
alternative label: Akustisk gitarr (786.23) @sv
alternative label: Gitarr (786.23) @sv
alternative label: Luftgitarr, gitarr (786.23) @sv
alternative label: Lyragitarr (786.23 +) @sv
broader: Näppäinsoittimet
in scheme: URN:NBN:fi:au:hklj:
narrower: Koulut, harjoituskappaleet ja -etydit
notation: 786.23
preferred label: Guitar @en
preferred label: Gitarr @sv
related: URN:NBN:fi:au:hklj:627.7531
related: URN:NBN:fi:au:hklj:681
related: URN:NBN:fi:au:hklj:781.5
related: URN:NBN:fi:au:hklj:782.6
related: URN:NBN:fi:au:hklj:785
related: URN:NBN:fi:au:hklj:785.11
related: URN:NBN:fi:au:hklj:788
related: URN:NBN:fi:au:hklj:789
scope note: Tässä ja alaluokassa myös vihuela
scope note: Hit och till underklasserna också vihuela @sv

Luuttu
type: Class
type: Concept
subclass of: Näppäinsoittimet
alternative label: Laute (786.25 +)
alternative label: Luuttu (786.25 +)
alternative label: Luuttusoittimet (786.25 +)
alternative label: Teorbi (786.25 +)
alternative label: Luta (786.25 +) @sv
alternative label: Lutinstrument (786.25 +) @sv
alternative label: Teorb (786.25 +) @sv
broader: Näppäinsoittimet
in scheme: URN:NBN:fi:au:hklj:
narrower: Koulut, harjoituskappaleet ja -etydit
notation: 786.25
preferred label: Lute @en
preferred label: Luta @sv
related: URN:NBN:fi:au:hklj:627.7531
related: URN:NBN:fi:au:hklj:681
related: URN:NBN:fi:au:hklj:781.5
related: URN:NBN:fi:au:hklj:782.6
related: URN:NBN:fi:au:hklj:785
related: URN:NBN:fi:au:hklj:785.11
related: URN:NBN:fi:au:hklj:788
related: URN:NBN:fi:au:hklj:789

Mandoliini
type: Class
type: Concept
subclass of: Näppäinsoittimet
alternative label: Mandola (786.26 +)
alternative label: Mandoliini (786.26 +)
alternative label: Mandolin (786.26 +) @sv
broader: Näppäinsoittimet
in scheme: URN:NBN:fi:au:hklj:
narrower: Koulut, harjoituskappaleet ja -etydit
notation: 786.26
preferred label: Mandolin @en
related: URN:NBN:fi:au:hklj:627.7531
related: URN:NBN:fi:au:hklj:681
related: URN:NBN:fi:au:hklj:781.5
related: URN:NBN:fi:au:hklj:782.6
related: URN:NBN:fi:au:hklj:785
related: URN:NBN:fi:au:hklj:785.11
related: URN:NBN:fi:au:hklj:788
related: URN:NBN:fi:au:hklj:789

Balalaikka
type: Class
type: Concept
subclass of: Näppäinsoittimet
alternative label: Balalaikka (786.27 +)
alternative label: Balalajka (786.27 +) @sv
broader: Näppäinsoittimet
in scheme: URN:NBN:fi:au:hklj:
narrower: Koulut, harjoituskappaleet ja -etydit
notation: 786.27
preferred label: Balalaika @en
preferred label: Balalajka @sv
related: URN:NBN:fi:au:hklj:627.7531
related: URN:NBN:fi:au:hklj:681
related: URN:NBN:fi:au:hklj:781.5
related: URN:NBN:fi:au:hklj:782.6
related: URN:NBN:fi:au:hklj:785
related: URN:NBN:fi:au:hklj:785.11
related: URN:NBN:fi:au:hklj:788
related: URN:NBN:fi:au:hklj:789

Muut vaskipuhaltimet
type: Class
type: Concept
subclass of: Vaskipuhaltimet
alternative label: Baritone, baritonitorvi (786.59)
alternative label: Eufonium (786.59)
alternative label: Mellofoni (786.59)
alternative label: Serpentti (786.59)
alternative label: Signaalitorvi (786.59)
alternative label: Sinkki, puhallinsoitin (786.59)
alternative label: Sousafoni (786.59)
alternative label: Baritone, baritonhorn (786.59) @sv
alternative label: Mellofon (786.59) @sv
alternative label: Serpent (786.59) @sv
alternative label: Signalhorn (786.59) @sv
alternative label: Zink, blåsinstrument (786.59) @sv
broader: Vaskipuhaltimet
in scheme: URN:NBN:fi:au:hklj:
notation: 786.59
preferred label: Other brass instruments @en
preferred label: Andra bleckblåsinstrument @sv
related: URN:NBN:fi:au:hklj:627.7531
related: URN:NBN:fi:au:hklj:681
related: URN:NBN:fi:au:hklj:781.5
related: URN:NBN:fi:au:hklj:782.6
related: URN:NBN:fi:au:hklj:785
related: URN:NBN:fi:au:hklj:785.11
related: URN:NBN:fi:au:hklj:788
related: URN:NBN:fi:au:hklj:789

Heavy rock. Hard rock
type: Class
type: Concept
subclass of: Rock. Pop
alternative label: Hard rock (788.332)
alternative label: Heavy (788.332)
alternative label: Heavy metal (788.332)
alternative label: Heavy rock (788.332)
alternative label: Heavyrock (788.332)
alternative label: Hevi (788.332)
alternative label: Hevimetalli (788.332)
alternative label: Hip hop -metal (788.332)
alternative label: Metallimusiikki (788.332)
alternative label: Speed metal (788.332)
alternative label: Thrash metal (788.332)
alternative label: Metalmusik (788.332) @sv
broader: Rock. Pop
in scheme: URN:NBN:fi:au:hklj:
notation: 788.332
related: URN:NBN:fi:au:hklj:782.4
related: URN:NBN:fi:au:hklj:783
related: URN:NBN:fi:au:hklj:783.1
related: URN:NBN:fi:au:hklj:785.7
related: URN:NBN:fi:au:hklj:786.8
related: URN:NBN:fi:au:hklj:787.112
related: Folk. Country
related: Aasialainen maailmanmusiikki. Aasialainen etninen pop ja viihdemusiikki
related: URN:NBN:fi:au:hklj:789
related: URN:NBN:fi:au:hklj:795
scope note: Tässä esim. speed metal ja thrash metal
scope note: Hit t.ex. speed metal och thrash metal @sv

Uinti. Sukellus
type: Class
type: Concept
subclass of: Liikunta. Urheilu
alternative label: Avantouinti (791.2)
alternative label: Kellunta, uinti (791.2)
alternative label: Kuviouinti (791.2)
alternative label: Laitesukellus (791.2)
alternative label: Laitesukeltaminen (791.2)
alternative label: Maauimalat, uinti (791.2)
alternative label: Räpyläuinti, sukeltaminen (791.2)
alternative label: Snorkkelisukellus (791.2)
alternative label: Snorkkelisukeltaminen (791.2)
alternative label: Sukellus (791.2)
alternative label: Sukelluslaitteet (791.2)
alternative label: Sukeltajat, sukellus (791.2)
alternative label: Sukeltaminen (791.2)
alternative label: Taitouinti (791.2)
alternative label: Uimahallit, urheilu (791.2)
alternative label: Uimahypyt (791.2)
alternative label: Uimakoulut (791.2)
alternative label: Uimalaitokset, uinti (791.2)
alternative label: Uimalat, uinti (791.2)
alternative label: Uimapuvut, uinti (791.2)
alternative label: Uimarannat, uinti (791.2)
alternative label: Uimataito (791.2)
alternative label: Uimavalvojat (791.2)
alternative label: Uiminen (791.2)
alternative label: Uinninvalvojat (791.2)
alternative label: Uinti (791.2)
alternative label: Urheilusukellus (791.2)
alternative label: Vauvauinti (791.2)
alternative label: Vesiliikunta, uinti, sukellus (791.2)
alternative label: Vesiurheilu, uinti, sukellus (791.2)
alternative label: Viestilajit, uinti (791.2)
alternative label: Viestit, urheilu, uinti (791.2)
alternative label: Apparatdykning (791.2) @sv
alternative label: Babysim (791.2) @sv
alternative label: Baddräkter, simning (791.2) @sv
alternative label: Badinrättningar, simning (791.2) @sv
alternative label: Badstränder, simning (791.2) @sv
alternative label: Badvakter (791.2) @sv
alternative label: Dykare, dykning (791.2) @sv
alternative label: Dykarutrustning (791.2) @sv
alternative label: Dykning med andningsutrustning (791.2) @sv
alternative label: Dykning, sukellus (791.2) @sv
alternative label: Dykning, sukeltaminen (791.2) @sv
alternative label: Fensimning, dykning (791.2) @sv
alternative label: Figursimning (791.2) @sv
alternative label: Flytande, simning (791.2) @sv
alternative label: Friluftsbad, simning (791.2) @sv
alternative label: Konstsimning (791.2) @sv
alternative label: Sim (791.2) @sv
alternative label: Simhallar, idrott (791.2) @sv
alternative label: Simhopp (791.2) @sv
alternative label: Siminrättningar, simning (791.2) @sv
alternative label: Simkunnighet (791.2) @sv
alternative label: Simning (791.2) @sv
alternative label: Simskolor (791.2) @sv
alternative label: Simövervakare (791.2) @sv
alternative label: Snorkeldykning (791.2) @sv
alternative label: Sportdykning (791.2) @sv
alternative label: Stafett, simning (791.2) @sv
alternative label: Stafettgrenar, simning (791.2) @sv
broader: Liikunta. Urheilu
in scheme: URN:NBN:fi:au:hklj:
notation: 791.2
related: URN:NBN:fi:au:hklj:386.109
related: Hydrologia
related: Lastenhoito
related: Raskaus. Sikiönkehitys. Synnytys. Gynekologia
related: Muut vesikulkuneuvot
related: Kalastus
related: Liikuntatiede ja -tutkimus. Liikuntapolitiikka
related: Liikunnan ja urheilun historia
related: URN:NBN:fi:au:hklj:791.209
related: Purjehdus. Soutu. Melonta
related: Muut joukkuepelit
related: Yleinen arkeologia
scope note: Uinti. Uimahypyt. Taitouinti. Sukellus Uinti ja sukellus kilpa-, huippu-, kunto- ja vammaisurheilun kannalta Uimakoulut. Uimaopetus. Vauvauinti Uinti-, ym. -kilpailut, -säännöt, -valmennus ja -välineet Uimahallit ja maauimalat uinnin kannalta Sukeltajan työ. Urheilusukellus. Sukellusoppaat. Sukelluslaitteet. Sukelluskellot. Happilaiteet. Snorkkelit. Märkäpuvut Sukellusta eri näkökulmista koskevat yleisteokset Uinti- ja sukellusseurat ja -järjestöt
scope note: Simning. Simhopp. Konstsim. Dykning Simning och dykning ur tävlings-, elit-, motions- och handikappidrottens synvinkel Simskolor. Simundervisning. Babysim Tävlingssim och liknande tävlingar, regler, träning och redskap inom dem Simhallar och friluftsbad ur simningens synvinkel Dykarens arbete. Sportdykning. Handledningar i dykning. Dykarutrustning. Dykarklockor. Syrgasapparter. Snorklar. Våtdräkter Allmänna verk som rör dykning ur olika synvinklar Sim- och dykarklubbar samt sim- och dykarförbund @sv

Muut joukkuepelit
type: Class
type: Concept
subclass of: Palloilu
alternative label: Amerikkalainen jalkapallo (796.3)
alternative label: Australialainen jalkapallo (796.3)
alternative label: Baseball (796.3)
alternative label: Boccia (796.3)
alternative label: Curling (796.3)
alternative label: Estäminen, koripallo (796.3)
alternative label: Estäminen, pesäpallo (796.3)
alternative label: Estäminen, vesipallo (796.3)
alternative label: Futsal (796.3)
alternative label: Haavipallo (796.3)
alternative label: Hevospoolo (796.3)
alternative label: Hockey, maahockey (796.3)
alternative label: Istumalentopallo (796.3)
alternative label: Jai-alai (796.3)
alternative label: Jääpallo (796.3)
alternative label: Kaukalopallo (796.3)
alternative label: Koripallo (796.3)
alternative label: Kriketti (796.3)
alternative label: Kyykkä (796.3)
alternative label: Käsipallo (796.3)
alternative label: Lacrosse (796.3)
alternative label: Lentopallo (796.3)
alternative label: Luutapallo (796.3)
alternative label: Maahockey (796.3)
alternative label: Maalivahdit, muut palloilulajit (796.3)
alternative label: Nurmipallo (796.3)
alternative label: Pelota (796.3)
alternative label: Pesäpallo (796.3)
alternative label: Ringette (796.3)
alternative label: Rugby (796.3)
alternative label: Salamapallo (796.3)
alternative label: Salibandy (796.3)
alternative label: Salijalkapallo (796.3)
alternative label: Sisäjalkapallo (796.3)
alternative label: Sähly (796.3)
alternative label: Uppopallo (796.3)
alternative label: Vesipallo (796.3)
alternative label: Amerikansk fotboll (796.3) @sv
alternative label: Australisk fotboll (796.3) @sv
alternative label: Blixtboll (796.3) @sv
alternative label: Boboll (796.3) @sv
alternative label: Broomball (796.3) @sv
alternative label: Cricket (796.3) @sv
alternative label: Förhindrande, boboll (796.3) @sv
alternative label: Förhindrande, korgboll (796.3) @sv
alternative label: Förhindrande, vattenpolo (796.3) @sv
alternative label: Handboll (796.3) @sv
alternative label: Hockey, landhockey (796.3) @sv
alternative label: Hästpolo (796.3) @sv
alternative label: Innebandy, salibandy (796.3) @sv
alternative label: Innebandy, sähly (796.3) @sv
alternative label: Innefotboll (796.3) @sv
alternative label: Inomhusfotboll (796.3) @sv
alternative label: Isboll (796.3) @sv
alternative label: Korgboll (796.3) @sv
alternative label: Lacrosse, haavipallo (796.3) @sv
alternative label: Lacrosse, lacrosse (796.3) @sv
alternative label: Landhockey, maahockey (796.3) @sv
alternative label: Landhockey, nurmipallo (796.3) @sv
alternative label: Målvakter, andra bollgrenar (796.3) @sv
alternative label: Poppi (796.3) @sv
alternative label: Rinkbandy (796.3) @sv
alternative label: Sittvolleyboll (796.3) @sv
broader: Palloilu
in scheme: URN:NBN:fi:au:hklj:
notation: 796.3
related: Uinti. Sukellus
related: Muut urheilu- ja liikuntamuodot
related: Jalkapallo
related: Jääkiekko
related: Muut pallopelit
related: Pelit
related: Korttipelit. Pasianssit
related: Shakki
related: Roolipelit
scope note: Amerikkalainen jalkapallo. Australialainen jalkapallo. Baseball. Hevospoolo. Irlantilainen jalkapallo eli hurling. Jääpallo. Kaukalopallo. Koripallo. Kriketti. Käsipallo. Lentopallo. Liitokiekko. Lippupallo. Maahockey. Pesäpallo. Ringette. Rugby. Salamapallo. Salijalkapallo. Salibandy. Vesipallo.
scope note: Amerikansk fotboll. Australisk fotboll. Bandy. Baseball. Basketboll. Blixtboll. Boboll. Crickett. Flaggfotboll. Frisbee. Handboll. Hästpolo. Innebandy. Innefotboll. Irländsk fotboll (hurling). Landhockey. Ringette. Rinkbandy. Rugby. Volleyboll. Vattenpolo @sv

Kirjallisuuden filosofia, teoria ja estetiikka. Runousoppi
type: Class
type: Concept
subclass of: URN:NBN:fi:au:hklj:800
alternative label: Absurdi, kirjallisuudenfilosofia (801)
alternative label: Absurdismi, kirjallisuudenfilosofia (801)
alternative label: Aikarakenne, narratologia, kirjallisuudentutkimus (801)
alternative label: Alkusointu, kirjallisuuden estetiikka (801)
alternative label: Allegoriat, kirjallisuuden estetiikka (801)
alternative label: Allitteraatio, kirjallisuuden estetiikka (801)
alternative label: Anapesti, runousoppi (801)
alternative label: Autenttisuus, kirjallisuuden filosofia (801)
alternative label: Cut up -tekniikka, kirjallisuuden estetiikka (801)
alternative label: Daktyyli, runousoppi (801)
alternative label: Dekonstruktio, kirjallisuuden estetiikka (801)
alternative label: Dialogi, kirjallisuuden estetiikka (801)
alternative label: Dokumentaarisuus, kirjallisuuden estetiikka (801)
alternative label: Dokumentit, kirjallisuudentutkimus (801)
alternative label: Draama, kirjallisuuden teoria ja estetiikka (801)
alternative label: Dramatiikka, näytelmäkirjallisuuden (801)
alternative label: Ekfrasis, narratologia (801)
alternative label: Elegiat, runousoppi (801)
alternative label: Epäluotettava kertoja, narratologia, kirjallisuuden estetiikka (801)
alternative label: Epäsuora esitys, narratologia, kirjallisuudentutkimus (801)
alternative label: Estetiikka, kirjallisuus (801)
alternative label: Filosofia, kirjallisuusfilosofia (801)
alternative label: Fokalisaatio, narratologia (801)
alternative label: Formalismi, kirjallisuuden estetiikka (801)
alternative label: Genreteoria, kirjallisuuden teoria (801)
alternative label: Heksametri, runousoppi (801)
alternative label: Henkilökuvaus, kirjallisuuden estetiikka (801)
alternative label: Hermeneutiikka, kirjallisuuden teoria (801)
alternative label: Huumori, kirjallisuuden estetiikka (801)
alternative label: Huvinäytelmät, kirjallisuuden estetiikka (801)
alternative label: Ilmaukset, kirjallisuuden estetikka (801)
alternative label: Inspiraatio, kirjallisuusfilosofia (801)
alternative label: Intertekstuaalisuus, kirjallisuudentutkimus (801)
alternative label: Intuitio, kirjallisuusfilosofia (801)
alternative label: Ironia, kirjallisuuden estetiikka (801)
alternative label: Jambi, runousoppi (801)
alternative label: Juoni, kirjallisuuden estetiikka (801)
alternative label: Jälkimoderni, kirjallisuuden filosofia (801)
alternative label: Jälkimodernismi, kirjallisuuden filosofia (801)
alternative label: Kaikkitietävä kertoja, kirjallisuuden estetiikka (801)
alternative label: Katarsis, kirjallisuustiede (801)
alternative label: Katharsis, kirjallisuustiede (801)
alternative label: Kauneus, kirjallisuuden estetiikka (801)
alternative label: Kauneusihanteet, kirjallisuuden estetiikka (801)
alternative label: Kaunistelu, kerronta, kirjallisuuden estetiikka (801)
alternative label: Kerronnallisuus, kirjallisuuden estetiikka (801)
alternative label: Kerronta, kirjallisuuden estetiikka (801)
alternative label: Kertoja, kirjallisuuden estetiikka (801)
alternative label: Kertominen, kirjallisuuden estetiikka (801)
alternative label: Keskeislyriikka, runousoppi (801)
alternative label: Kielikuvat, kirjallisuuden estetiikka (801)
alternative label: Kirja-arvostelu, teoria (801)
alternative label: Kirjallinen viestintä, kirjallisuuden teoria (801)
alternative label: Kirjalliset lähteet, kirjallisuudentutkimus (801)
alternative label: Kirjallisuuden filosofia (801)
alternative label: Kirjallisuuden kieli (801)
alternative label: Kirjallisuuden lajit, kirjallisuuden estetiikka (801)
alternative label: Kirjallisuuden tyylit, kirjallisuuden estetiikka (801)
alternative label: Kirjallisuudenteoria (801)
alternative label: Kirjallisuudentutkimus, kirjallisuuden estetiikka (801)
broader: URN:NBN:fi:au:hklj:800
in scheme: URN:NBN:fi:au:hklj:
notation: 801
related: Symbolit. Koodit. Merkkijärjestelmät
related: Lukeminen. Lukutaito
related: URN:NBN:fi:au:hklj:063
related: URN:NBN:fi:au:hklj:100
related: URN:NBN:fi:au:hklj:120
related: Yleinen estetiikka
related: Kulttuurifilosofia
related: Poliittiset ja aatteelliset vähemmistöt
related: Taiteen estetiikka. Taidefilosofia. Taidepsykologia. Taidesosiologia. Taidepolitiikka
related: Teatteri- ja näyttämötaiteen teoria, estetiikka ja filosofia
related: Kirjallisuuden psykologia ja sosiologia
related: Esseet. Kirjallisuusarvostelut
scope note: Kirjallisuuden filosofia, teoria ja estetiikka yleensä Kirjallisuustieteen ja kirjallisuusarvostelun filosofia ja teoria yleensä Kirjallisuustieteen tutkimusmenetelmät yleensä Tyylioppi kirjallisuustieteen kannalta yleensä Jos teos koskee tiettyä kirjallisuustyyppiä tai aihepiiriä, tietyn kielen tai tietyn aikakauden kirjallisuutta, on etusija järjestyksessä: kirjallisuustyyppi tai aihepiiri, kieli, aikakausi
scope note: Litteraturfilosofi samt litteraturens teori och estetik i allmänhet Litteraturvetenskapens och litteraturkritikens filosofi och teori i allmänhet Litteraturvetenskapliga forskningsmetoder i allmänhet Stilistik ur litteraturvetenskaplig synvinkel i allmänhet Om verket representerar en bestämd genre eller ett bestämt temaområde inom litteraturen eller om det hänför sig till litteraturen på ett bestämt språk eller under en bestämd tidsperiod, är prioritetsordningen följande: litterär genre eller temaområde, språk, tidsperiod @sv

Suomenruotsalaisen kirjallisuuden historia ja tutkimus
type: Class
type: Concept
subclass of: Ruotsinkielisen kirjallisuuden historia ja tutkimus
alternative label: Ruotsin kieli, suomenruotsi, kirjallisuudenhistoria (821.1)
alternative label: Suomenruotsalainen kirjallisuus, kirjallisuudenhistoria (821.1)
alternative label: Finlandssvensk litteratur, litteraturhistoria (821.1) @sv
alternative label: Svenska, finlandssvenska, litteraturhistoria (821.1) @sv
broader: Ruotsinkielisen kirjallisuuden historia ja tutkimus
in scheme: URN:NBN:fi:au:hklj:
notation: 821.1
preferred label: Finnish-Swedish literature: history and research @en
preferred label: Finlandssvensk litteraturhistoria och forskning i finlandssvensk litteratur @sv
related: URN:NBN:fi:au:hklj:2
related: KANSATIEDE. ANTROPOLOGIA
related: URN:NBN:fi:au:hklj:473
related: URN:NBN:fi:au:hklj:784.111
related: Kirjallisuuden aihepiirejä ja kirjallisuustyyppejä koskeva historia ja tutkimus
related: Lasten- ja nuortenkirjallisuuden historia ja tutkimus
related: Suomenkielisen kirjallisuuden historia ja tutkimus
related: Suomenkielisen kansanrunouden historia ja tutkimus
related: Suomenkielisen kirjallisuuden aihepiirejä ja kirjallisuustyyppejä koskeva historia ja tutkimus
related: Suomenkielisen lasten- ja nuortenkirjallisuuden historia ja tutkimus
related: Pohjoismaisten kielten kirjallisuuden historia ja tutkimus
related: Ruotsin kieli

Ruotsin kielen historia
type: Class
type: Concept
subclass of: Ruotsin kieli
alternative label: Riikinruotsi, kielihistoria (872.9)
alternative label: Ruotsin kieli, kielihistoria (872.9)
alternative label: Ruotsin ruotsi, kielihistoria (872.9)
alternative label: Ruotsinruotsi, kielihistoria (872.9)
alternative label: Rikssvenska, språkhistoria (872.9) @sv
alternative label: Svenska, språkhistoria (872.9) @sv
alternative label: Sverigesvenska, språkhistoria (872.9) @sv
broader: Ruotsin kieli
in scheme: URN:NBN:fi:au:hklj:
notation: 872.9
preferred label: Swedish language history @en
preferred label: Svensk språkhistoria @sv
related: URN:NBN:fi:au:hklj:188.4
related: Sähköposti. Verkkojuttelu
related: URN:NBN:fi:au:hklj:627.7512
related: Kielihistoria
related: URN:NBN:fi:au:hklj:860
related: Pohjoismaiset kielet
related: URN:NBN:fi:au:hklj:872.09
related: Ruotsin kielen etymologia ja onomastiikka
related: Ruotsin kielen murteet
related: URN:NBN:fi:au:hklj:872.609
related: Suomenruotsi
related: URN:NBN:fi:au:hklj:872.709
scope note: Ruotsin kielen historian yleisteokset
scope note: Allmänna verk om svensk språkhistoria @sv

Suomen kielen murteet
type: Class
type: Concept
subclass of: Suomen kieli
alternative label: Aluelingvistiikka, suomen kieli, murteet (884.6)
alternative label: Amerikansuomi (884.6)
alternative label: Areaalilingvistiikka, suomen kieli, murteet (884.6)
alternative label: Dialektologia, suomen kieli (884.6)
alternative label: Eteläpohjalaismurteet, suomen kielen murteet (884.6)
alternative label: Hämäläismurteet (884.6)
alternative label: Itämurteet (884.6)
alternative label: Kaakkoismurteet (884.6)
alternative label: Keski- ja pohjoispohjalaiset murteet, suomen kielen murteet (884.6)
alternative label: Kielennäytteet, suomen kieli, murteet (884.6)
alternative label: Kielimaantiede, suomen kieli, murteet (884.6)
alternative label: Lounaiset välimurteet (884.6)
alternative label: Lounaismurteet (884.6)
alternative label: Länsimurteet (884.6)
alternative label: Meänkieli (884.6)
alternative label: Meänkieli, kielitiede (884.6)
alternative label: Meänkieli, suomen kielen murteet (884.6)
alternative label: Murrealueet, suomen kieli (884.6)
alternative label: Murremaantiede, suomen kieli (884.6)
alternative label: Murrenäytekokoelmat, suomen kieli (884.6)
alternative label: Murresanat, suomen kieli (884.6)
alternative label: Murteet, suomen kieli (884.6)
alternative label: Peräpohjalaismurteet, suomen kielen murteet (884.6)
alternative label: Pohjalaismurteet (884.6)
alternative label: Puhekieli, suomen kieli, murteet (884.6)
alternative label: Ruotsin suomi (884.6)
alternative label: Ruotsinsuomi (884.6)
alternative label: Savolaismurteet (884.6)
alternative label: Slangi, suomen kieli (884.6)
alternative label: Slanginäytekokoelmat, suomen kieli (884.6)
alternative label: Sosiaaliset murteet, suomen kieli (884.6)
alternative label: Suomen kieli, murteet (884.6)
alternative label: Suomen kieli, slangit (884.6)
alternative label: Amerikafinska (884.6) @sv
alternative label: Areal lingvistik, finska, dialekter (884.6) @sv
alternative label: Areallingvistik, finska, dialekter (884.6) @sv
alternative label: Dialekter, finska (884.6) @sv
alternative label: Dialektgeografi, finska (884.6) @sv
alternative label: Dialektologi, finska (884.6) @sv
alternative label: Dialektområden, finska (884.6) @sv
alternative label: Dialektord, finska (884.6) @sv
alternative label: Dialektprovssamlingar, finska (884.6) @sv
alternative label: Finska, dialekter (884.6) @sv
alternative label: Finska, slang (884.6) @sv
alternative label: Mellan- och nordösterbottniska dialekter, finska dialekter (884.6) @sv
alternative label: Nordbottniska dialekter, finska dialekter (884.6) @sv
alternative label: Savolaxiska dialekter (884.6) @sv
alternative label: Slang, finska (884.6) @sv
alternative label: Slangexempelsamlingar, finska (884.6) @sv
alternative label: Sociolekter, finska (884.6) @sv
alternative label: Språkgeografi, finska, dialekter (884.6) @sv
alternative label: Språkprov, finska, dialekter (884.6) @sv
alternative label: Sverigefinska (884.6) @sv
alternative label: Sydostfinska dialekter (884.6) @sv
alternative label: Sydvästfinska dialekter (884.6) @sv
alternative label: Sydvästfinska övergångsdialekter (884.6) @sv
alternative label: Sydösterbottniska dialekter, finska dialekter (884.6) @sv
alternative label: Talspråk, finska, dialekter (884.6) @sv
alternative label: Tavastländska dialekter (884.6) @sv
alternative label: Tornedalsfinska (884.6) @sv
broader: Suomen kieli
in scheme: URN:NBN:fi:au:hklj:
notation: 884.6
related: URN:NBN:fi:au:hklj:1.5
related: URN:NBN:fi:au:hklj:188.4
related: Sähköposti. Verkkojuttelu
related: URN:NBN:fi:au:hklj:627.7512
related: KIELITIEDE
related: Itämerensuomalaiset kielet
related: Suomen kielen äänneoppi
related: Suomen kielen etymologia ja onomastiikka
related: Suomen kielen kielioppi ja semantiikka
related: URN:NBN:fi:au:hklj:884.603
related: URN:NBN:fi:au:hklj:884.609
related: Suomen kielen historia
scope note: Murretutkimus. Murrealueet. Slangit. Slangitutkimus Maantieteelliset slangit. Eri ammattien ja alojen slangit Murteiden äänne-, kieli-, muoto- ja sanaoppi Murteiden semantiikka. Murteiden etymologia ja onomastiikka Kielipsykologia, -sosiologia ja -politiikka murteiden kannalta Murrenäytteet. Murrenäytekokoelmat
scope note: Dialektforskning. Dialektområden. Slang. Slangforskning Regional och lokal slang. Yrkesjargong och jargong inom olika branscher Ljudlära, satslära, formlära och ordlära i dialekterna Betydelselära (semantik) i dialekterna. Etymologi och onomastik i dialekterna Språkpsykologi, språksociologi och språkpolitik i dialekterna Dialektprov. Dialektarkiv @sv

Autonomian aika 1810-1917
type: Class
type: Concept
subclass of: URN:NBN:fi:au:hklj:920
alternative label: Aktivismi, Suomen historia (926)
alternative label: Aktivistit, Suomen historia (926)
alternative label: Autonomian aika (926)
alternative label: Fennofiilit, autonomian aika (926)
alternative label: Fennomania, autonomian aika (926)
alternative label: Itsenäistyminen, Suomen historia (926)
alternative label: Itsenäisyys, itsenäistyminen, Suomi (926)
alternative label: Itsenäisyysliikkeet, Suomi (926)
alternative label: Jääkäriliike, Suomen historia (926)
alternative label: Jääkärit, Suomen historia (926)
alternative label: Kansallisromantiikka, kulttuurihistoria, Suomi (926)
alternative label: Karelianismi, kulttuurihistoria (926)
alternative label: Myöntyväisyyssuunta, Suomen historia (926)
alternative label: Oolannin sota (926)
alternative label: Passiivinen vastarinta, Suomen historia (926)
alternative label: Perustuslailliset, Suomen historia (926)
alternative label: Routavuodet, Suomen historia (926)
alternative label: Ruotsinmielisyys, autonomian aika (926)
alternative label: Sortokaudet; Suomen historia (926)
alternative label: Sortovuodet, Suomen historia (926)
alternative label: Suomalaisuusliike, autonomian aika (926)
alternative label: Suomen historia, 1810-1917 (926)
alternative label: Suomenmielisyys, autonomian aika (926)
alternative label: Venäläistämispolitiikka, Suomen historia (926 +)
alternative label: Aktivism, Finlands historia (926) @sv
alternative label: Aktivister, Finlands historia (926) @sv
alternative label: Autonoma tiden (926) @sv
alternative label: Fennofiler, autonomitiden (926) @sv
alternative label: Fennofili, autonomtiden (926) @sv
alternative label: Fennomani, autonomtiden (926) @sv
alternative label: Finlands historia, 1810-1917 (926) @sv
alternative label: Finskhetsrörelsen, autonomitiden (926) @sv
alternative label: Förryskningspolitik, Finlands historia (926 +) @sv
alternative label: Förtrycksperioderna, Finlands historia (926) @sv
alternative label: Jägare, armén, Finlands historia (926) @sv
alternative label: Jägarrörelsen, Finlands historia (926) @sv
alternative label: Karelianism, kulturhistoria (926) @sv
alternative label: Konstitutionella, Finlands historia (926) @sv
alternative label: Krimkriget, Åland (926) @sv
alternative label: Nationalromantik, kulturhistoria, Finland (926) @sv
alternative label: Ofärdsperioderna, Finlands historia (926) @sv
alternative label: Ofärdsåren, Finlands historia (926) @sv
alternative label: Passivt motstånd, Finlands historia (926) @sv
alternative label: Självständighet, självständighet, Finland (926) @sv
alternative label: Självständighetsprocess, Finlands historia (926) @sv
alternative label: Självständighetsrörelser, Finland (926) @sv
alternative label: Svekomani, autonomitiden (926) @sv
alternative label: Undfallenhetsriktningen, Finlands historia (926) @sv
broader: URN:NBN:fi:au:hklj:920
in scheme: URN:NBN:fi:au:hklj:
notation: 926
preferred label: Autonomy 1810-1917 @en
preferred label: Autonomins tid 1810-1917 @sv
related: URN:NBN:fi:au:hklj:061
related: Suomi
related: Suomen ulkopolitiikka
related: URN:NBN:fi:au:hklj:411
related: Suomenruotsalaisten asuma-alueet
related: Suomen yleinen taidehistoria
related: URN:NBN:fi:au:hklj:909
related: URN:NBN:fi:au:hklj:919
related: URN:NBN:fi:au:hklj:930
related: Neuvostoliiton historia 1945-1991
scope note: Haminan rauhaa seuranneesta ajasta vuoteen 1917 Itsenäisyysliikkeen ja itsenäistymisen historia
scope note: Från freden i Fredrikshamn till 1917 Självständighetsrörelsens historia och historien om vägen till självständighet @sv

Tanskankielinen kaunokirjallisuus (Kaunoluokka)
type: Class
type: Concept
type: FormClass
subclass of: RUOTSINKIELINEN KAUNOKIRJALLISUUS (Kaunoluokka)
broader: RUOTSINKIELINEN KAUNOKIRJALLISUUS (Kaunoluokka)
in scheme: URN:NBN:fi:au:hklj:
narrower: Tanskankieliset kansanrunot (Kaunoluokka)
narrower: Tanskankieliset runot (Kaunoluokka)
narrower: Tanskankieliset näytelmät ja kuunnelmat (Kaunoluokka)
narrower: Tanskankieliset romaanit, novellit ja näytelmäelokuvat (Kaunoluokka)
narrower: Tanskankieliset sadut (Kaunoluokka)
narrower: Grönlanninkielinen kaunokirjallisuus (Kaunoluokka)
notation: 2.8
preferred label: Danish fiction (Fiction class) @en
preferred label: Dansk skönlitteratur (Skönklass) @sv
scope note: Kaunokirjalliset sekasisältöiset kokoelmat, valikoimat, antologiat, lukemistot, lukukirjat, ohjelmistot ja aapiset Jos teos painottuu johonkin kaunokirjallisuuden lajiin, on etusija kirjallisuuden lajin mukaisella luokalla
scope note: Skönlitterära samlade verk, verk i urval, antologier, textböcker, läseböcker, program och ABC-böcker med blandat innehåll, Om någon skönlitterär genre dominerar i verket ges företräde åt klassen för den litterära genren i fråga @sv

Tiibetiläis-burmalaisten ja austroaasialaisten kielten kaunokirjallisuus (Kaunoluokka)
type: Class
type: Concept
type: FormClass
subclass of: MUIDEN KIELTEN KAUNOKIRJALLISUUS (Kaunoluokka)
broader: MUIDEN KIELTEN KAUNOKIRJALLISUUS (Kaunoluokka)
in scheme: URN:NBN:fi:au:hklj:
narrower: Kiinankielinen kaunokirjallisuus (Kaunoluokka)
narrower: Vietnaminkielinen kaunokirjallisuus (Kaunoluokka)
narrower: Thainkielinen kaunokirjallisuus (Kaunoluokka)
narrower: Burmankielinen kaunokirjallisuus (Kaunoluokka)
narrower: Khmerinkielinen kaunokirjallisuus (Kaunoluokka)
narrower: Kareninkielinen kaunokirjallisuus (Kaunoluokka)
notation: 9.7
preferred label: Fiction in Tibeto-Burman languages (Fiction class) @en
preferred label: Skönlitteratur på tibeto-burmanska och austroasiatiska språk (Skönklass) @sv
scope note: Laon- ja tiibetinkielinen kaunokirjallisuus
scope note: Skönlitteratur på laotiska och tibetanska @sv

Muiden aasialaisten, australialaisten ja oseanialaisten kielten kaunokirjallisuus (Kaunoluokka)
type: Class
type: Concept
type: FormClass
subclass of: Muiden kielten kaunokirjallisuus (Kaunoluokka)
broader: Muiden kielten kaunokirjallisuus (Kaunoluokka)
in scheme: URN:NBN:fi:au:hklj:
narrower: Koreankielinen kaunokirjallisuus (Kaunoluokka)
narrower: Uzbekinkielinen kaunokirjallisuus (Kaunoluokka)
narrower: Azerinkielinen kaunokirjallisuus (Kaunoluokka)
narrower: Nepalinkielinen kaunokirjallisuus (Kaunoluokka)
narrower: Dravidakielten kaunokirjallisuus (Kaunoluokka)
narrower: Austronesialaisten kielten kaunokirjallisuus (Kaunoluokka)
notation: 9.97
preferred label: Fiction in other Asian, Australian and Oceanic languages (Fiction class) @en
preferred label: Skönlitteratur på övriga asiatiska, australiska och oceaniska språk (Skönklass) @sv
scope note: Uralilaisten ja altailaisten kielten kaunokirjallisuus Samojedikielten ja turkkilaisten kielten kaunokirjallisuus Mongolikielten ja tunguusikielten kaunokirjallisuus Baskiirin-, gagauzin-, jakuutin-, kazakin-, kirgiisin-, tataarin-, tsuvassin-, turkmeenin-, uiguurin- kaunokirjallisuus Burjatin-, dahurin-, kalmukin-, mongolin- ja oiraatinkielinen kaunokirjallisuus Tunguusin- ja mantsunkielinen kaunokirjallisuus. Khmerinkielinen kaunokirjallisuus
scope note: Skönlitteratur på uraliska och altaiska språk Skönlitteratur på samojedspråk och turkiska språk Skönlitteratur på mongoliska språk och tungusspråk Skönlitteratur på basjkiriska, gagauziska, jakutiska, kazakiska, kirgisiska, tatariska, tuvinska, turkmenska, uiguriska och Skönlitteratur på burjatiska, daguriska, kalmuckiska, mongoliska och oiratiska Skönlitteratur på evenki(tungusiska) och manchu. Skönlitteratur på khmer @sv

Kirjoituksen historia. Paleografia. Epigrafia
type: Class
type: Concept
subclass of: Kirjoitus. Kirjoitustaito
alternative label: Aakkoset, historia (001.09)
alternative label: Alkukirjaimet, kirjoitusmerkit, historia (001.09)
alternative label: Anfangit, kirjoitusmerkit, historia (001.09)
alternative label: Epigrafia (001.09)
alternative label: Hieroglyfit (001.09)
alternative label: Initiaalit, kirjoitusmerkit, historia (001.09)
alternative label: Inskriptiot (001.09)
alternative label: Kalligrafia, paleografia (001.09)
alternative label: Kaunokirjoitus, paleografia (001.09)
alternative label: Kirjaimet, paleografia (001.09)
alternative label: Kirjaimistot, paleografia (001.09)
alternative label: Kirjainkirjoitus, paleografia (001.09)
alternative label: Kirjoittaminen, kirjoitustaito, historia (001.09)
alternative label: Kirjoitus, kirjoitustaito, historia (001.09)
alternative label: Kirjoitusjärjestelmät, kirjoitustaito, historia (001.09)
alternative label: Kirjoitusmerkit, kirjoitustaito, historia (001.09)
alternative label: Kirjoitustaito, kirjoitustaito, historia (001.09)
alternative label: Kirjoitustyylit, kirjoitustaito, historia (001.09)
alternative label: Kirjoitusvälineet, kirjoitustaito, historia (001.09)
alternative label: Kuvakirjoitus, historia (001.09)
alternative label: Kynät, kirjoitustaito, historia (001.09)
alternative label: Kyrillinen kirjaimisto, historia (001.09)
alternative label: Käsiala, paleografia (001.09)
alternative label: Latinalainen kirjaimisto, historia (001.09)
alternative label: Lineaari A (001.09)
alternative label: Lineaari B (001.09)
alternative label: Lineaari-A (001.09)
alternative label: Lineaari-A-kirjoitusjärjestelmä (001.09)
alternative label: Lineaari-B (001.09)
alternative label: Lineaari-B-kirjoitusjärjestelmä (001.09)
alternative label: Lineaarikirjoitus (001.09)
alternative label: Merkit, kirjoitusmerkit, historia (001.09)
alternative label: Musteet, kirjoitusvälineiden historia (001.09)
alternative label: Nimikirjoitukset, vanhat käsialat (001.09)
alternative label: Nuolenpääkirjoitus (001.09)
alternative label: Paleografia (001.09)
alternative label: Papyrologia, paleografia (001.09)
alternative label: Papyrukset, paleografia (001.09)
alternative label: Piirtokirjoitukset, historia (001.09)
alternative label: Piktografia, historia (001.09)
alternative label: Puumerkit, historia (001.09)
alternative label: Riimukirjoitus, kirjoituksen historia (001.09)
alternative label: Riimukivet, riimukirjoitus (001.09)
alternative label: Signeeraus, vanhojen käsialojen tutkimus (001.09)
alternative label: Tavukirjoitus, historia (001.09)
alternative label: Tavumerkistöt, historia (001.09)
alternative label: Tyylit, käsialojen historia (001.09)
alternative label: Vanhat käsialat (001.09)
alternative label: Abc, historia (001.09) @sv
alternative label: Alfabet, paleografi (001.09) @sv
alternative label: Anfanger, skrivtecken, historia (001.09) @sv
alternative label: Autografer, gamla handstilar (001.09) @sv
alternative label: Begynnelsebokstäver, skrivtecken, historia (001.09) @sv
alternative label: Bildskrift, historia (001.09) @sv
alternative label: Bläck, skrivredskapens historia (001.09) @sv
alternative label: Bokstavsskrift, paleografi (001.09) @sv
alternative label: Bokstäver, paleografi (001.09) @sv
alternative label: Bomärken, historia (001.09) @sv
alternative label: Epigrafi (001.09) @sv
broader: Kirjoitus. Kirjoitustaito
in scheme: URN:NBN:fi:au:hklj:
notation: 001.09
related: URN:NBN:fi:au:hklj:002.09
related: Kirjan historia
related: URN:NBN:fi:au:hklj:004.09
related: Psychology of expression {@en
related: Tekstaus. Kalligrafia
related: Notaatio
related: KIELITIEDE
related: MUUT KIELET
related: Seemiläiset kielet. Haamilaiset kielet
related: Japanin kieli
related: Tiibetiläis-burmalaiset kielet
related: Historian tutkimusmenetelmät
related: Historian aputieteet
scope note: Kirjoitustaidon, kirjoitusmerkkien ja -järjestelmien historia Kirjoitusvälineiden, -aineiden, -tyylien ja käsialojen historia Muinaiset kirjoitusjärjestelmät Hieroglyfit. Papyrologia. Piirtokirjoitus. Nuolenpääkirjoitus. Riimukirjoitus Puumerkit
scope note: Skrivkonstens, skrivtecknens och skriftsystemens historia Skrivredskapens, skrivmaterialens, stilarternas och handstilarnas historia Forntida skriftsystem Hieroglyfer. Papyrologi. Piktografisk skrift. Kilskrift. Runskrift Bomärken @sv

Lasten- ja nuortenkirjallisuuden luettelot
type: Class
type: Concept
subclass of: URN:NBN:fi:au:hklj:010
alternative label: Abstraktijulkaisut (010.5 ... 016)
alternative label: Aikakauslehti-indeksit (010.5 ... 016)
alternative label: Aikakauslehtiartikkelit, indeksit (010.5 ... 016)
alternative label: Arvostelevat luettelot (010.5 ... 016)
alternative label: Kaunokirjallisuusluettelot, lastenkirjaluettelot (010.6)
alternative label: Kaunokirjallisuusluettelot, nuortenkirjaluettelot (010.6)
alternative label: Lastenkirjallisuus, bibliografiat (010.6)
alternative label: Nuorisoromaanit, bibliografiat (010.6)
alternative label: Nuortenkirjallisuus, bibliografiat (010.6)
alternative label: Referaattijulkaisut (010.5 ... 016)
alternative label: Teemaluettelot, lasten- ja nuortenkirjaluettelot (010.6)
alternative label: Tiivistelmäjulkaisut (010.5 ... 016)
alternative label: Valikoimaluettelot, lasten- ja nuortenkirjaluettelot (010.6)
alternative label: Abstraktpublikationer (010.5 ... 016) @sv
alternative label: Barnlitteratur, bibliografier (010.6) @sv
alternative label: Recenserande kataloger (010.5 ... 016) @sv
alternative label: Referatpublikationer, referaattijulkaisut (010.5 ... 016) @sv
alternative label: Referatpublikationer, tiivistelmäjulkaisut (010.5 ... 016) @sv
alternative label: Skönlitteraturkataloger, barnböckers kataloger (010.6) @sv
alternative label: Skönlitteraturkataloger, ungdomsböckers kataloger (010.6) @sv
alternative label: Temakataloger, kataloger över barn- och ungdomsböcker (010.6) @sv
alternative label: Tidskriftsartiklar, index (010.5 ... 016) @sv
alternative label: Tidskriftsindex (010.5 ... 016) @sv
alternative label: Ungdomslitteratur, bibliografier (010.6) @sv
alternative label: Ungdomsromaner, bibliografier (010.6) @sv
alternative label: Urvalskataloger, kataloger över barn- och ungdomsböcker (010.6) @sv
broader: URN:NBN:fi:au:hklj:010
in scheme: URN:NBN:fi:au:hklj:
notation: 010.6
preferred label: Catalogues of literature for childrenand young people @en
preferred label: Kataloger över barn- och ungdomslitteratur @sv
related: Yleisbibliografiat. Kansallisbibliografiat
related: Erikoisalojen bibliografiat
related: Filosofia. Psykologia. Kasvatustiede
related: Uskonto
related: Yhteiskunta
related: Maantiede. Matkat. Kansatiede
related: Luonnontieteet. Matematiikka
related: Lääketiede. Tekniikka. Teollisuus. Maa- ja metsätalous. Liiketalous. Kotitalous. Käsityö
related: Taiteet. Liikunta
related: Kirjallisuustiede. Kielitiede
related: Historia
related: Musiikkibibliografiat. Diskografiat
scope note: Yleis- ja sekasisältöiset lasten ja nuorten tietokirjaluettelot luettelon aineistotyypistä riippumatta Lasten ja nuorten kaunokirjaluettelot luettelon aineistotyypistä riippumatta Lasten ja nuorten aikakausjulkaisujen ja sanomalehtien luettelot samassa luokassa kuin vastaavat kirjaluettelot
scope note: Förteckningar över facklitteratur av allmänt och varierande innehåll för barn och ungdom oavsett katalogens mediatyp Förteckningar över skönlitteratur av allmänt och varierande innehåll för barn och ungdom oavsett katalogens mediatyp Förteckningar över seriella publikationer och dagstidningar för barn och ungdom förs till samma klass som litteraturförteckningarna över barn- och ungdomsböcker @sv

Muu kirjastotoiminta
type: Class
type: Concept
subclass of: Yleisönpalvelu
alternative label: Kirjallisuustilaisuudet, kirjastotoiminta (024.9)
alternative label: Kirjanäyttelyt, kirjastotoiminta (024.9)
alternative label: Laajennettu kirjastotoiminta (024.9)
alternative label: Laajennettu kirjastotoiminta, kirjastotoiminta (024.9)
alternative label: Opintokerhot, kirjastot (024.9)
alternative label: Bokutställningar, biblioteksverksamhet (024.9) @sv
alternative label: Litterära tillställningar, biblioteksverksamhet (024.9) @sv
alternative label: Studiecirklar, bibliotek (024.9) @sv
alternative label: Utvidgad biblioteksverksamhet (024.9) @sv
alternative label: Utvidgad biblioteksverksamhet, biblioteksverksamhet (024.9) @sv
broader: Yleisönpalvelu
in scheme: URN:NBN:fi:au:hklj:
notation: 024.9
preferred label: Other library activities @en
preferred label: Annan biblioteksverksamhet @sv
related: URN:NBN:fi:au:hklj:018
related: Muu kuin kirja-aineisto kirjastossa
related: Tietopalvelu. Informaatiopalvelu
related: Musiikkikirjastot
related: Yleiset kirjastot
related: Erikoiskirjastot. Yhdistysten, laitosten ja yritysten kirjastot
related: URN:NBN:fi:au:hklj:028
related: Dokumentaatio ja informaatiopalvelu yleensä
related: Museonhoito
related: Arkistonhoito
related: URN:NBN:fi:au:hklj:061
related: URN:NBN:fi:au:hklj:063
related: Opintokerhotoiminta
scope note: Laajennettu kirjastotoiminta yleensä Yleisötilaisuuksien järjestäminen kirjastossa Opintokerhojen, luentojen, juhlien, näyttelyiden, elokuva-, video- ja teatteriesitysten sekä kirjallisuustilaisuuksien järjestäminen kirjastossa Kirjaston PR- ja tiedotustoiminta
scope note: Utvidgad biblioteksverksamhet i allmänhet Tillställningar för allmänheten i bibliotek Anordnande av studiecirklar, föredrag, fester, utställningar, film- och videoförevisningar, teaterföreställningar och bokpresentationer i bibliotek PR- och informationsverksamhet i bibliotek @sv

ELÄMÄNFILOSOFIA. KULTTUURIFILOSOFIA
type: Class
type: Concept
subclass of: URN:NBN:fi:au:hklj:100
broader: URN:NBN:fi:au:hklj:100
in scheme: URN:NBN:fi:au:hklj:
narrower: Mietelausekokoelmat. Sitaattikokoelmat
narrower: Elämänfilosofia
narrower: Kulttuurifilosofia
notation: 170
preferred label: PHILOSOPHY OF LIFE. PHILOSOPHY OF CULTURE @en
preferred label: LIVSFILOSOFI. KULTURFILOSOFI @sv
related: Filosofian historia
related: Etiikka. Moraalifilosofia
related: Elämänohjeet
related: Elämäntapojen sosiologia. Kulttuurisosiologia
related: URN:NBN:fi:au:hklj:357.1
related: URN:NBN:fi:au:hklj:900
scope note: Teokset, joissa on sekä elämänfilosofiaa että kulttuurifilosofiaa
scope note: Verk som innehåller både livsfilosofi och kulturfilosofi @sv

Kuulovammaiset
type: Class
type: Concept
subclass of: URN:NBN:fi:au:hklj:181.9
alternative label: Huuliltaluku (181.92)
alternative label: Huulioluku (181.92)
alternative label: Kuulovammaiset, erityisopetus (181.92)
alternative label: Kuulovammaisten koulut (181.92)
alternative label: Kuuromykät, erityisopetus (181.92)
alternative label: Kuurot, erityisopetus (181.92)
alternative label: Döva, specialundervisning (181.92) @sv
alternative label: Dövstumma, specialundervisning (181.92) @sv
alternative label: Hörselskadade, specialundervisning (181.92) @sv
alternative label: Läppavläsning (181.92) @sv
alternative label: Munavläsning (181.92) @sv
alternative label: Skolor för hörselskadade (181.92) @sv
broader: URN:NBN:fi:au:hklj:181.9
in scheme: URN:NBN:fi:au:hklj:
notation: 181.92
preferred label: The aurally-impaired @en
preferred label: Hörselskadade @sv
related: Symbolit. Koodit. Merkkijärjestelmät
related: Kasvatusfilosofia. Kasvatustavoitteet
related: Kasvatuspsykologia
related: URN:NBN:fi:au:hklj:181.7
related: URN:NBN:fi:au:hklj:182
related: Peruskoulut
related: URN:NBN:fi:au:hklj:183.5
related: URN:NBN:fi:au:hklj:183.7
related: URN:NBN:fi:au:hklj:373
related: Korva. Nenäontelo. Kurkku. Korva-, nenä- ja kurkkutaudit
related: Lapsi- ja nuorisopsykiatria
related: Keinotekoiset kielet
related: Viittomakieli
scope note: Kuulovammaisten erityisopetus. Kuuromykkien erityisopetus. Kuulovammaisten koulut
scope note: Specialundervisning för hörselskadade. Specialundervisning för dövstumma. Skolor för hörselskadade @sv

Näkövammaiset
type: Class
type: Concept
subclass of: URN:NBN:fi:au:hklj:181.9
alternative label: Braille, sokeainkirjoitus (181.93)
alternative label: Isotekstiset kirjat, näkövammaisten opetus (181.93)
alternative label: Kuvailutulkkaus (181.93)
alternative label: Näkövammaiset, erityisopetus (181.93)
alternative label: Näkövammaisten koulut (181.93)
alternative label: Pistekirjat (181.93)
alternative label: Pistekirjoitus (181.93)
alternative label: Sokeainkirjoitus (181.93)
alternative label: Sokeainkoulut (181.93)
alternative label: Sokeat, erityisopetus (181.93)
alternative label: Bildtolkning för synskadade (181.93) @sv
alternative label: Blinda, specialundervisning (181.93) @sv
alternative label: Blindskolor (181.93) @sv
alternative label: Blindskrift (181.93) @sv
alternative label: Braille, blindskrift (181.93) @sv
alternative label: Punktskrift (181.93) @sv
alternative label: Punktskriftsböcker (181.93) @sv
alternative label: Skolor för synskadade (181.93) @sv
alternative label: Storstilsböcker, synskadade, undervisning (181.93) @sv
alternative label: Synskadade, specialundervisning (181.93) @sv
broader: URN:NBN:fi:au:hklj:181.9
in scheme: URN:NBN:fi:au:hklj:
notation: 181.93
preferred label: The visually-impaired @en
preferred label: Synskadade @sv
related: Kirjoitus. Kirjoitustaito
related: Symbolit. Koodit. Merkkijärjestelmät
related: Kasvatusfilosofia. Kasvatustavoitteet
related: Kasvatuspsykologia
related: URN:NBN:fi:au:hklj:181.7
related: URN:NBN:fi:au:hklj:182
related: Peruskoulut
related: URN:NBN:fi:au:hklj:183.5
related: URN:NBN:fi:au:hklj:183.7
related: URN:NBN:fi:au:hklj:373
related: Silmä. Silmätaudit
related: Lapsi- ja nuorisopsykiatria
related: Keinotekoiset kielet
scope note: Näkövammaisten erityisopetus. Kuurosokeiden erityisopetus. Näkövammaisten koulut Tässä myös sokeainkirjoitus ja sen opetus
scope note: Specialundervisning för synskadade. Specialundervisning för dövblinda. Skolor för synskadade Hit också blindskrift och dess inlärning @sv

Astrologia. Horoskoopit
type: Class
type: Concept
subclass of: URN:NBN:fi:au:hklj:192
alternative label: Astrologia (192.1)
alternative label: Ennustaminen, astrologia (192.1)
alternative label: Horoskoopit (192.1)
alternative label: Jupiter, astrologia (192.1)
alternative label: Mars, astrologia (192.1)
alternative label: Merkurius, astrologia (192.1)
alternative label: Neptunus, astrologia (192.1)
alternative label: Paranormaalit ilmiöt, astrologia (192.1)
alternative label: Persoonallisuuden piirteet, astrologia (192.1)
alternative label: Pluto, astrologia (192.1)
alternative label: Rajatieto, astrologia (192.1)
alternative label: Saturnus, astrologia (192.1)
alternative label: Selittämättömät ilmiöt, astrologia (192.1)
alternative label: Tähdistä ennustaminen (192.1)
alternative label: Tähtimerkit (192.1)
alternative label: Venus, astrologia (192.1)
alternative label: Astrologi (192.1) @sv
alternative label: Horoskop (192.1) @sv
alternative label: Jupiter, astrologi (192.1) @sv
alternative label: Mars, astrologi (192.1) @sv
alternative label: Merkurius, astrologi (192.1) @sv
alternative label: Neptunus, astrologi (192.1) @sv
alternative label: Oförklarliga fenomen, astrologi (192.1) @sv
alternative label: Omstridda fenomen, astrologi (192.1) @sv
alternative label: Paranormala fenomen, astrologi (192.1) @sv
alternative label: Personlighetsdrag, astrologi (192.1) @sv
alternative label: Pluto, astrologi (192.1) @sv
alternative label: Saturnus, astrologi (192.1) @sv
alternative label: Spådomskonst, astrologi (192.1) @sv
alternative label: Stjärntecken (192.1) @sv
alternative label: Stjärntydning (192.1) @sv
alternative label: Venus, astrologi (192.1) @sv
broader: URN:NBN:fi:au:hklj:192
in scheme: URN:NBN:fi:au:hklj:
notation: 192.1
preferred label: Astrology. Horoscopes @en
preferred label: Astrologi. Horoskop @sv
related: Parapsykologia
related: Teosofia. Antroposofia. Vapaamuurarius
related: Teosofia
related: Eskatologia
related: TÄHTITIEDE
related: Maailmankaikkeus. Kosmologia. Kosmogonia
related: Tähtitieteelliset kojeet. Ajanlasku
related: Tähtitieteelliset kojeet
related: Ajanlasku
related: Elämä maailmankaikkeudessa. Astrobiologia
related: Tähtijärjestelmät. Aurinkokunnat
related: Avaruustutkimus. Avaruuslennot. Avaruusteknologia
related: Ufot. Ilmakehän tunnistamattomat ilmiöt
scope note: Tähdistä ennustaminen. Tähtimerkit. Horoskoopit Itämaiset horoskoopit. Kiinalainen horoskooppi
scope note: Att spå i stjärnorna. Stjärntecken. Horoskop Österländska horoskop. Kinesiska horoskop @sv

Sielunhoito
type: Class
type: Concept
subclass of: KÄYTÄNNÖLLINEN TEOLOGIA
alternative label: Debriefing, kristillinen sielunhoito (247)
alternative label: Elämänmuutokset, surutyö, kristillinen sielunhoito (247)
alternative label: Erehdys, sielunhoito (247)
alternative label: Hengellinen ohjaus, kristillinen sielunhoito (247)
alternative label: Henkinen jälkiselvitys, kristillinen sielunhoito (247)
alternative label: Henkinen tuki, kristillinen sielunhoito (247)
alternative label: Kliininen teologia (247)
alternative label: Kriisipuhelimet, kristilliset (247)
alternative label: Kriisit, sielunhoito (247)
alternative label: Kriisituki, kristillinen sielunhoito (247)
alternative label: Kristillinen kirjallisuus, sielunhoito (247)
alternative label: Kuolema, sielunhoito (247)
alternative label: Kuolemanpelko, kristillinen sielunhoito (247)
alternative label: Kärsimys, sielunhoito (247)
alternative label: Leskeys, kristillinen sielunhoito (247)
alternative label: Lohduttaminen, sielunhoito, kristillinen (247)
alternative label: Lohdutus, sielunhoito, kristillinen (247)
alternative label: Luopuminen, henkinen, kristillinen sielunhoito (247)
alternative label: Menetys, kristillinen sielunhoito (247)
alternative label: Mielenrauha, kristillinen sielunhoito (247)
alternative label: Onnellisuus, kristillinen sielunhoito (247)
alternative label: Onni, kristillinen sielunhoito (247)
alternative label: Palveleva puhelin, kristillinen (247)
alternative label: Pastoraaliteologia (247)
alternative label: Pastoraalityöt, pastoraaliteologia (247)
alternative label: Pelko, sielunhoito (247)
alternative label: Pelot, sielunhoito (247)
alternative label: Perusturvallisuus, sielunhoito (247)
alternative label: Psyykkinen kriisiapu, kristillinen sielunhoito (247)
alternative label: Psyykkinen tuki, kristillinen sielunhoito (247)
alternative label: Sairaalasielunhoito (247)
alternative label: Sairaalateologia (247)
alternative label: Sielunhoito, kristillinen (247)
alternative label: Suru, sielunhoito (247)
alternative label: Suru, surutyö, kristinusko (247)
alternative label: Surutyö, kristillinen sielunhoito (247)
alternative label: Syyllisyydentunne, sielunhoito (247)
alternative label: Syyllisyydentunne, surutyö, kristinusko (247)
alternative label: Uskonelämä, sielunhoito, kristillinen (247)
alternative label: Uskonnollinen kehitys, sielunhoito (247)
alternative label: Uskonnollinen kirjallisuus, sielunhoito (247)
alternative label: Yksinäisyys, sielunhoito (247)
alternative label: Andlig vägledning, kristen själavård (247) @sv
alternative label: Debriefing, kristen själavård (247) @sv
alternative label: Döden, själavård (247) @sv
alternative label: Dödsfruktan, kristen själavård (247) @sv
alternative label: Ensamhet, själavård (247) @sv
alternative label: Förlust, kristen själavård (247) @sv
alternative label: Försakelse, kristen själavård (247) @sv
alternative label: Grundtrygghet, psykologi, själavård (247) @sv
alternative label: Klinisk teologi (247) @sv
alternative label: Kriser, själavård (247) @sv
alternative label: Krisstöd, kristen själavård (247) @sv
alternative label: Kristelefoner, kristliga (247) @sv
alternative label: Kristen litteratur, själavård (247) @sv
alternative label: Lidande, själavård (247) @sv
alternative label: Livsförändringar, sorgearbete, kristen själavård (247) @sv
alternative label: Lycka, kristen själavård (247) @sv
alternative label: Mentalt stöd, kristen själavård (247) @sv
broader: KÄYTÄNNÖLLINEN TEOLOGIA
in scheme: URN:NBN:fi:au:hklj:
notation: 247
related: Sosiaalipsykologia. Kulttuuripsykologia
related: Perhe- ja kotikasvatus
related: Kristillinen etiikka
related: Hartauskirjat
related: Rukouskirjat
related: Seurakunta. Seurakuntatyö
related: Sisälähetys. Evankelioiminen
related: URN:NBN:fi:au:hklj:260
related: Perhepolitiikka. Lapsipolitiikka. Nuorisopolitiikka
related: URN:NBN:fi:au:hklj:615
related: URN:NBN:fi:au:hklj:618.24
related: Itsemurhat ja niiden ehkäisy
related: URN:NBN:fi:au:hklj:618.85
scope note: Pastoraaliteologia Kristillinen perhe- ja avioliittoneuvonta. Palveleva puhelin. Kotikäyntityö. Sairaalasielunhoito. Sairaalateologia. Kuolema ja surutyö kristillisen sielunhoidon kannalta Sielunhoidon teologia, menetelmät, työntekijät ja heidän koulutuksensa
scope note: Pastoralteologi Kristen familjerådgivning och kristen äktenskapsrådgivning. Själavårdstelefon. Hembesöksverksamhet. Sjukhussjälavård. Sjukhusteologi. Död och sorgearbete ur den kristna själavårdens synvinkel Själavårdens teologi, metoder, själavårdsdiakonerna och deras utbildning @sv

Seurakunta. Seurakuntatyö
type: Class
type: Concept
subclass of: EVANKELIS-LUTERILAINEN KIRKKO
alternative label: Almut, ev.-lut kirkko (254)
alternative label: Eettinen kasvatus, kristillinen kasvatus, ev.lut. kirkko (254)
alternative label: Esimurrosikä, kasvatusneuvonta, kristillinen (254)
alternative label: Esipuberteetti, kasvatusneuvonta, kristillinen (254)
alternative label: Hartaustilaisuudet, seurakuntatyö, ev.-lut. (254)
alternative label: Isostoiminta (254)
alternative label: Jengityö, kirkon, ev.-lut. (254)
alternative label: Kasvatus, kristillinen, ev.-lut. (254)
alternative label: Kasvatusala, kristillinen, ev.-lut. (254)
alternative label: Kasvatusneuvonta, kristillinen (254)
alternative label: Kateketiikka, ev.-lut. kirkko (254)
alternative label: Kesäleirit, seurakuntatyö, ev.-lut. kirkko (254)
alternative label: Kirkon aikuiskasvatus, ev.-lut. kirkko (254)
alternative label: Kirkon avioliittoneuvonta, ev.-lut. kirkko (254)
alternative label: Kirkon kasvatustoiminta, ev.-lut. kirkko (254)
alternative label: Kirkon nuorisotyö, ev.-lut. kirkko (254)
alternative label: Kirkon opetustoiminta, ev.-lut. kirkko (254)
alternative label: Kirkon perheneuvonta, ev.-lut. kirkko (254)
alternative label: Kirkon yhteiskunnallinen työ, ev.-lut. kirkko (254)
alternative label: Kristillinen kasvatus, ev.-lut. kirkko (254)
alternative label: Kristillinen nuorisotyö, ev.-lut. kirkko (254)
alternative label: Kristillinen opetus, ev.-lut. kirkko (254)
alternative label: Maallikot, seurakunta, ev.-lut. (254)
alternative label: Moraalikasvatus, kristillinen kasvatus, ev.-lut. kirkko (254)
alternative label: Murrosikä, kasvatusneuvonta, kristillinen (254)
alternative label: Murrosikäiset, kasvatusneuvonta, kristillinen (254)
alternative label: Nuorisotyö, ev.-lut. kirkko (254)
alternative label: Nuorisotyöntekijät, nuorisotyö, ev.-lut. (254)
alternative label: Perheleirit, seurakuntatyö, ev.-lut. kirkko (254)
alternative label: Perhetyö, ev.-lut. kirkko (254)
alternative label: Pienryhmät, seurakuntatyö, ev.-lut. (254)
alternative label: Puberteetti, kasvatusneuvonta, kristillinen (254)
alternative label: Pyhäkoulu, ev.-lut. kirkko (254)
alternative label: Päiväkerhot, seurakuntien (254)
alternative label: Raamattupiirit, ev.-lut. kirkko (254)
alternative label: Rippikoulu, ev.-lut. kirkko (254)
alternative label: Rippikoululeirit, ev.-lut. kirkko (254)
alternative label: Rippileirit, ev.-lut. kirkko (254)
alternative label: Seurakunnat, ev.-lut. kirkko (254)
alternative label: Seurakunta, ev.-lut. kirkko (254)
alternative label: Seurakuntahallinto, ev.-lut. kirkko (254)
alternative label: Seurakuntalaiset, ev.-lut. kirkko (254)
alternative label: Seurakuntaliitokset, ev.-lut. kirkko (254)
alternative label: Seurakuntasuunnitelmat, ev.-lut. kirkko (254)
alternative label: Seurakuntatyö, ev.-lut. kirkko (254)
alternative label: Seurakuntavaalit, ev.-lut. kirkko (254)
alternative label: Seurakuntayhtymät , ev.-lut. kirkko (254)
alternative label: Seurakuntien päiväkerhot, ev.-lut. kirkko (254)
alternative label: Siirtoseurakunnat, seurakunnat, ev.-lut. kirkko (254)
alternative label: Uskonelämä, seurakuntatyö, ev.-lut. (254)
alternative label: Uskonnollinen kasvatus, kristillinen, ev.-lut. (254)
alternative label: Uskonnonpedagogiikka, kristillinen kasvatus, ev.-lut. (254)
alternative label: Uskontokasvatus, kristillinen, ev.-lut. (254)
alternative label: Uskontopedagogiikka, kristillinen kasvatus, ev.-lut. (254)
alternative label: Yhteiskunnallinen työ, kirkon, ev.-lut. kirkko (254)
alternative label: Yhteiskuntatyö, kirkon, ev.-lut. kirkko (254)
alternative label: Ystävyysseurakunnat, ev.-lut. kirkko (254)
alternative label: Allmosor, ev.luth. kyrkan (254) @sv
alternative label: Andaktsstunder, församlingsarbete, ev.luth. (254) @sv
alternative label: Bibelkretsar, ev.luth. kyrkan (254) @sv
broader: EVANKELIS-LUTERILAINEN KIRKKO
in scheme: URN:NBN:fi:au:hklj:
notation: 254
related: KASVATUS. OPETUS. KASVATUSTIEDE
related: Kasvatusfilosofia. Kasvatustavoitteet
related: URN:NBN:fi:au:hklj:185
related: Nuorisotyö
related: Yhdistykset. Laitokset. Kokoukset. Ekumenia
related: Uskontunnustukset. Katekismukset
related: Kristillinen etiikka
related: Sielunhoito
related: Laitokset. Järjestöt
related: Sisälähetys. Evankelioiminen
related: URN:NBN:fi:au:hklj:260
related: Päivähoito
scope note: Seurakunta ja seurakuntatyö sekä kristillinen opetus ja kasvatus ev.-lut. kirkon kannalta Seurakunnat. Seurakuntien talous, organisaatio ja suunnittelu Kateketiikka. Kirkon ja seurakuntien kasvatustoiminta Seurakunnallinen lapsi-, koululais- ja nuorisotyö. Pyhäkoulu. Rippikoulu. Seurakuntien päiväkerhot. Kirkon ja seurakuntien aikuiskasvatus. Raamattupiirit Kirkollisen ja seurakunnallisen opetus- ja kasvatustyön teologia, menetelmät ja opetusohjelmistot sekä työntekijät ja heidän koulutuksensa
scope note: Församlingen och församlingsarbetet samt kristen undervisning och fostran ur den evangelisk-lutherska kyrkans synvinkel Församlingarna. Församlingarnas ekonomi, organisation och planering Kateketik. Kyrkans och församlingarnas fostran Barn-, skolungdoms- och ungdomsarbete i församlingarna. Söndagsskolan. Skriftskolan. Församlingarnas dagklubbar. Kyrkans och församlingarnas vuxenundervisning. Bibelcirklar Undervisningens och fostrans teologi, metoder och undervisningsprogram inom kyrkan och församlingarna samt församlingsanställda och utbildningen av dem @sv

Protestanttiset kirkot ja yhteisöt
type: Class
type: Concept
subclass of: URN:NBN:fi:au:hklj:260
alternative label: Adventismi (265)
alternative label: Amishit (265)
alternative label: Amissit (265)
alternative label: Anglikaaninen kirkko (265)
alternative label: Ashram-liike (265)
alternative label: Baptismi (265)
alternative label: Episkopaalinen kirkko (265)
alternative label: Evankelikalismi (265)
alternative label: Helluntaiherätys (265)
alternative label: Helluntailaisuus (265)
alternative label: Helluntailiike (265)
alternative label: Herrnhutilaisuus (265)
alternative label: Hugenotit, protestantit (265)
alternative label: Ikonoklasmi, protestanttiset yhteisöt (265)
alternative label: Kalvinismi (265)
alternative label: Kastajaliikkeet, protestanttiset yhteisöt (265)
alternative label: Kirkkokunnat, protestanttiset kirkot (265)
alternative label: Kongregationalistit (265)
alternative label: Korkeakirkollisuus, anglikaaninen kirkko (265)
alternative label: Kuvainraasto, protestanttiset yhteisöt (265)
alternative label: Mennoniitat (265)
alternative label: Metodismi (265)
alternative label: Presbyteeriset kirkot (265)
alternative label: Presbyteerit (265)
alternative label: Protestantismi (265)
alternative label: Protestantismi, muut protestanttiset yhteisöt (265)
alternative label: Protestantit (265)
alternative label: Protestantit, muiden protestanttisten yhteisöjen jäsenet (265)
alternative label: Protestanttiset herätysliikkeet (265)
alternative label: Protestanttiset herätysliikkeet, muut protestanttiset herätysliikkeet (265)
alternative label: Protestanttiset kirkot (265)
alternative label: Protestanttiset kirkot, muut protestanttiset kirkot (265)
alternative label: Protestanttiset lahkot (265)
alternative label: Protestanttiset lahkot, muut protestanttiset herätysliikkeet (265)
alternative label: Puritaanit (265)
alternative label: Puritanismi (265)
alternative label: Reformoidut kirkot (265)
alternative label: Rukouspäivät, muut protestanttiset kirkot (265)
alternative label: Seitsemännen päivän adventistit (265)
alternative label: Uudestikastajat, protestanttiset yhteisöt (265)
alternative label: Vapaakirkot (265)
alternative label: Adventism (265) @sv
alternative label: Amish (265) @sv
alternative label: Anglikanska kyrkan (265) @sv
alternative label: Ashram-rörelsen (265) @sv
alternative label: Baptism (265) @sv
alternative label: Böndagar, andra protestantiska kyrkor (265) @sv
alternative label: Döparrörelser, protestantiska samfund (265) @sv
alternative label: Episkopalkyrkan (265) @sv
alternative label: Evangelikalism (265) @sv
alternative label: Frikyrkor (265) @sv
alternative label: Herrnhutism (265) @sv
alternative label: Hugenotter, protestanter (265) @sv
alternative label: Högkyrklighet, anglikanska kyrkan (265) @sv
alternative label: Ikonoklasm, protestantiska samfund (265) @sv
alternative label: Kalvinism (265) @sv
alternative label: Kongregationalister (265) @sv
alternative label: Kyrkosamfund, protestantiska kyrkor (265) @sv
alternative label: Mennoniter (265) @sv
broader: URN:NBN:fi:au:hklj:260
in scheme: URN:NBN:fi:au:hklj:
notation: 265
related: RAAMATTU. RAAMATUNTUTKIMUS
related: KRISTILLINEN DOGMATIIKKA
related: KÄYTÄNNÖLLINEN TEOLOGIA
related: EVANKELIS-LUTERILAINEN KIRKKO
related: Sisälähetys. Evankelioiminen
related: URN:NBN:fi:au:hklj:265.09
related: Eri maiden kirkkohistoria
related: Suomi
related: Pohjoismaat
related: Ruotsi
related: Muu Eurooppa
related: Germany {@e
related: Protestanttinen musiikki
scope note: Protestanttisia kirkkoja tai yhteisöjä, niiden organisaatiota tai toimintaa koskevat yleisteokset Adventistit. Anglikaaninen kirkko. Ashram-liike. Baptistit. Episkopaalinen kirkko. Helluntailaiset. Herrnhutilaiset. Kalvinilaiset. Kongregationalistit. Mennoniitat. Metodistit. Presbyteerit. Puritaanit. Reformoidut kirkot. Vapaakirkot Protestanttisten kirkkojen ja yhteisöjen erikoisaloja koskevat teokset alan mukaan luokissa 220-248
scope note: Allmänna verk som rör de protestantiska kyrkorna och samfunden, deras organisation eller verksamhet Adventister. Den anglikanska kyrkan. Ashramrörelsen. Baptister. Den episkopala kyrkan. Pingstvänner. Herrnhuter. Kalvinister. Kongregationalister. Mennoniter. Metodister. Presbyteraner. Puritaner. De reformerta kyrkorna. Frikyrkor Frågor som rör specialområden inom de protestantiska kyrkorna och samfunden klassificeras enligt område i klasserna 220-248 @sv

Eri maiden kirkkohistoria
type: Class
type: Concept
subclass of: KIRKKOHISTORIA
alternative label: Aneet, kirkkohistoria (279 +)
alternative label: Kerjäläismunkistot, kirkkohistoria (279 +)
alternative label: Kerjäläisveljeskunnat, kirkkohistoria (279 +)
alternative label: Kerjäläisveljestöt, kirkkohistoria (279 +)
alternative label: Lestadiolaisuus (279 +)
alternative label: Reformaatio, eri maat (279 +)
alternative label: Reformaatio, kirkkohistoria, eri maat (279+)
alternative label: Reformaation aika, kirkkohistoria, eri maat (279+)
alternative label: Uskonpuhdistus, kirkkohistoria, eri maat (279 +)
alternative label: Uskonpuhdistusaika, kirkkohistoria, eri maat (279 +)
alternative label: Uusiherätys (279 +)
alternative label: Uuslestadiolaisuus (279 +)
alternative label: Vanhalestadiolaisuus (279 +)
alternative label: Vanhoillislestadiolaisuus (279 +)
alternative label: Avlat, kyrkohistoria (279 +) @sv
alternative label: Gammallaestadianism (279 +) @sv
alternative label: Konservativ laestadianism (279 +) @sv
alternative label: Laestadianism (279 +) @sv
alternative label: Nya väckelsen (279 +) @sv
alternative label: Nylaestadianism (279 +) @sv
alternative label: Reformation, olika länder (279 +) @sv
alternative label: Reformationen, kyrkohistoria, olika länder (279 +) @sv
alternative label: Reformationstiden, kyrkohistoria, olika länder (279 +) @sv
alternative label: Tiggarmunkar, kyrkohistoria (279 +) @sv
alternative label: Tiggarmunkordnar, kyrkohistoria (279 +) @sv
alternative label: Tiggarorden, kyrkohistoria (279 +) @sv
broader: KIRKKOHISTORIA
in scheme: URN:NBN:fi:au:hklj:
narrower: Suomi
narrower: Pohjoismaat
narrower: Muu Eurooppa
notation: 279
preferred label: Different countries’ church history @en
preferred label: Olika länders kyrkohistoria @sv
related: URN:NBN:fi:au:hklj:209
related: URN:NBN:fi:au:hklj:210
related: Kristillisen teologian historia
related: URN:NBN:fi:au:hklj:260
related: Protestanttiset kirkot ja yhteisöt
related: Kirkot ja muut uskonnolliset rakennukset
related: URN:NBN:fi:au:hklj:992
scope note: Tässä Euroopan ulkopuolisten maiden kirkkohistoria
scope note: Hit de länders kyrkohistoria som ligger utanför Europa @sv

Vankeinhoito. Vankilat
type: Class
type: Concept
subclass of: Julkisoikeus
alternative label: Aluevankilat (332.9)
alternative label: Avolaitokset, vankeinhoito (332.9)
alternative label: Avovankilat (332.9)
alternative label: Keskusvankilat (332.9)
alternative label: Kuritushuoneet (332.9)
alternative label: Laitospalvelut, vankilat (332.9)
alternative label: Lääninvankilat (332.9)
alternative label: Nuoret rikoksentekijät, vankilat, vankeinhoito (332.9)
alternative label: Nuorisovankilat (332.9)
alternative label: Pakkolaitokset (332.9)
alternative label: Pakkotyö, vankeinhoito (332.9)
alternative label: Pakkotyölaitokset (332.9)
alternative label: Pako, vangit (332.9)
alternative label: Rangaistuksen täytäntöönpano, vankilat, vankeinhoito (332.9)
alternative label: Rangaistuslaitokset (332.9)
alternative label: Rikoksentekijät, vankilat, vankeinhoito (332.9)
alternative label: Rikoksentorjunta, vankilat (332.9)
alternative label: Rikollishuolto, vankilat, vankeinhuolto (332.9)
alternative label: Rikosseuraamusala, vankeinhoito, vankilat (332.9)
alternative label: Rikosten torjunta, vankilat (332.9)
alternative label: Toimeenpano, vankeinhoito (332.9)
alternative label: Tutkintavankeus, vankeinhoito (332.9)
alternative label: Tutkintavankilat (332.9)
alternative label: Työlaitokset (332.9)
alternative label: Työsiirtolat (332.9)
alternative label: Täytäntöönpano, vankeinhoito (332.9)
alternative label: Vanginvartijat, vankilat (332.9)
alternative label: Vangit, vankilat (332.9)
alternative label: Vankeinhoito (332.9)
alternative label: Vankeus, vankeinhoito (332.9)
alternative label: Vankilahallinto (332.9)
alternative label: Vankilahenkilökunta, vankeinhoito (332.9)
alternative label: Vankilasosiologia (332.9)
alternative label: Vankilasäännökset (332.9)
alternative label: Vankilat (332.9)
alternative label: Vankilat, vankeinhoito (332.9)
alternative label: Vankileirit, vankeinhoito (332.9)
alternative label: Vapautus, vankeinhoito (332.9)
alternative label: Arbetsinrättningar (332.9) @sv
alternative label: Arbetskolonier (332.9) @sv
alternative label: Befrielse, fångvård (332.9) @sv
alternative label: Brottsbekämpning, fängelser (332.9) @sv
alternative label: Brottslighetsbekämpning, fängelser (332.9) @sv
alternative label: Brottspåföljdsbranschen, fångvård, fängelser (332.9) @sv
alternative label: Centralfängelser (332.9) @sv
alternative label: Flykt, fångar (332.9) @sv
alternative label: Fängelseadministration (332.9) @sv
alternative label: Fängelsepersonal, fångvård (332.9) @sv
alternative label: Fängelser (332.9) @sv
alternative label: Fängelser, fångvård (332.9) @sv
alternative label: Fängelsesociologi (332.9) @sv
alternative label: Fängelsestadgar (332.9) @sv
alternative label: Fångar, fängelser (332.9) @sv
alternative label: Fångenskap, fångvård (332.9) @sv
alternative label: Fångläger, fångvård (332.9) @sv
alternative label: Fångvaktare, fängelser (332.9) @sv
alternative label: Fångvård (332.9) @sv
alternative label: Förbrytare, omsorg, fängelser, fångvård (332.9) @sv
alternative label: Gärningsmän, fängelser, fångvård (332.9) @sv
broader: Julkisoikeus
in scheme: URN:NBN:fi:au:hklj:
notation: 332.9
related: URN:NBN:fi:au:hklj:326.2
related: Rikosoikeus
related: Prosessioikeus. Oikeushallinto
related: Kansainvälinen oikeus
related: Suomen ja Euroopan Unionin laki- ja asetuskokoelmat
related: Muiden maiden lait
related: URN:NBN:fi:au:hklj:340
related: Poliisitoimi. Yleinen turvallisuus
related: Suomen valtionhallinto
related: Organisaatioiden ja laitosten sosiologia
related: Kriminologia. Kriminaalisosiologia
related: URN:NBN:fi:au:hklj:359.083
related: Kriminaalipolitiikka
scope note: Vankeinhoito ja vankilat maasta riippumatta Vankilat. Kuritushuoneet. Työlaitokset. Vankilahallinto. Vankilahenkilökunta. Vankilasäännökset. Vankilaolot. Vankilasosiologia
scope note: Fångvård och fängelser oavsett land Fängelser. Tukthus. Arbetsinrättningar. Fängelseadministration. Fängelsepersonal. Fängelsestadgar. Fängelseförhållanden. Fängelsesociologi @sv

Yhteiskuntafilosofia
type: Class
type: Concept
subclass of: SOSIOLOGIA
alternative label: Antiutopiat, yhteiskuntafilosofia (351)
alternative label: Antroposofiset valmisteet, maatalous (351)
alternative label: Dystopiat, yhteiskuntafilosofia (351)
alternative label: Filosofia, yhteiskuntafilosofia (351)
alternative label: Individualismi, yhteiskuntafilosofia (351)
alternative label: Kansalaisyhteiskunta, yhteiskuntafilosofia (351)
alternative label: Konsensus, yhteiskuntafilosofia (351)
alternative label: Moniarvoisuus, yhteiskuntafilosofia (351)
alternative label: Pluralismi, yhteiskuntafilosofia (351)
alternative label: Politisoituminen, yhteiskuntafilosofia (351)
alternative label: Reformismi, yhteiskuntafilosofia (351)
alternative label: Riisto, yhteiskuntafilosofia (351)
alternative label: Riistäminen, yhteiskuntafilosofia (351)
alternative label: Sosiaalifilosofia (351)
alternative label: Sosiaalinen oikeudenmukaisuus, yhteiskuntafilosofia (351)
alternative label: Teknologiakritiikki, yhteiskuntafilosofia (351)
alternative label: Utopiat, yhteiskuntafilosofia (351)
alternative label: Valinnanvapaus, yhteiskuntafilosofia (351)
alternative label: Valistuksen aika, yhteiskuntafilosofia (351)
alternative label: Valistus, yhteiskuntafilosofia (351)
alternative label: Valtarakenteet, yhteiskuntafilosofia (351)
alternative label: Vapaus, yhteiskuntafilosofia (351)
alternative label: Vapautuminen, yhteiskuntafilosofia (351)
alternative label: Yhteiskunnallinen kehitys, yhteiskuntafilosofia (351)
alternative label: Yhteiskunnallinen muutos, yhteiskuntafilosofia (351)
alternative label: Yhteiskunta, yhteiskuntafilosofia (351)
alternative label: Yhteiskuntafilosofia (351)
alternative label: Yhteiskuntakritiikki, yhteiskuntafilosofia (351)
alternative label: Yhteiskuntasopimus, yhteiskuntafilosofia (351)
alternative label: Yhteiskuntateoriat (351)
alternative label: Yksilö, yhteiskuntafilosofia (351)
alternative label: Yksilöllistäminen, yhteiskuntafilosofia (351)
alternative label: Antiutopier, samhällsfilosofi (351) @sv
alternative label: Antroposofiska produkter, lantbruk (351) @sv
alternative label: Berövande, samhällsfilosofi (351) @sv
alternative label: Dystopier, samhällsfilosofi (351) @sv
alternative label: Filosofi, samhällsfilosofi (351) @sv
alternative label: Frigörelse, samhällsfilosofi (351) @sv
alternative label: Frihet, samhällsfilosofi (351) @sv
alternative label: Individen, samhällsfilosofi (351) @sv
alternative label: Individualisering, yksilöllistäminen, samhällsfilosofi (351) @sv
alternative label: Individualism, samhällsfilosofi (351) @sv
alternative label: Konsensus, samhällsfilosofi (351) @sv
alternative label: Maktstrukturer, samhällsfilosofi (351) @sv
alternative label: Medborgarsamhälle, samhällsfilosofi (351) @sv
alternative label: Pluralism, samhällsfilosofi (351) @sv
alternative label: Politisering, samhällsfilosofi (351) @sv
alternative label: Reformism, samhällsfilosofi (351) @sv
alternative label: Samhälle, samhällsfilosofi (351) @sv
alternative label: Samhällelig utveckling, samhällsfilosofi (351) @sv
alternative label: Samhällsfilosofi (351) @sv
alternative label: Samhällsfördrag, samhällsfilosofi (351) @sv
alternative label: Samhällsförändring, samhällsfilosofi (351) @sv
alternative label: Samhällskritik, samhällsfilosofi (351) @sv
alternative label: Samhällsteorier (351) @sv
alternative label: Social rättvisa, samhällsfilosofi (351) @sv
alternative label: Socialfilosofi (351) @sv
alternative label: Teknologikritik, samhällsfilosofi (351) @sv
alternative label: Upplysning, samhällsfilosofi (351) @sv
broader: SOSIOLOGIA
in scheme: URN:NBN:fi:au:hklj:
notation: 351
related: URN:NBN:fi:au:hklj:100
related: Filosofia. Teoria. Tutkimusmenetelmät
related: URN:NBN:fi:au:hklj:320
related: Valtiofilosofia. Valtiomuodot
related: Yhteiskunnan rakenne
related: Talousjärjestelmät
related: Yhteiskunnallinen futurologia
related: Yhteiskunnalliset aatesuunnat. Poliittiset ideologiat
related: Sosialismi. Kommunismi
related: Konservatismi
related: Liberalismi
related: Fasismi
related: Muut aatesuunnat
scope note: Yleinen yhteiskuntafilosofia. Yhteiskunnalliset utopiat. Ihanneyhteiskunnat
scope note: Allmän samhällsfilosofi. Samhällsutopier. Idealsamhällen @sv

Työllisyys. Työttömyys. Työvoimapalvelu
type: Class
type: Concept
subclass of: Työ sosiaalipoliittisena kysymyksenä
alternative label: Akateeminen työvoima, työllisyys, työttömyys (371.13)
alternative label: Ammatillinen tausta, työttömyys, työllisyys (371.13)
alternative label: Ammatinharjoittajat, työllisyys (371.13)
alternative label: Ammatissa toimimaton väestö, työttömyys (371.13)
alternative label: Ammatissa toimiva väestö, työllisyys (371.13)
alternative label: Ammattikurssit, työllisyyskoulutus (371.13)
alternative label: Ammattitaidoton työvoima, työttömyys, työllisyys (371.13)
alternative label: Ammattitausta, työttömyys, työllisyys (371.13)
alternative label: Ammattiura, työttömyys, työllisyys (371.13)
alternative label: Harjoittelu, työharjoittelu (371.13)
alternative label: Harjoittelupaikat, työharjoittelu (371.13)
alternative label: Joustoturva (371.13)
alternative label: Kannustinloukut, työttömyys (371.13)
alternative label: Kausityöttömyys (371.13)
alternative label: Kausivaihtelut, työttömyys (371.13)
alternative label: Koulutettavuus, työllistämiskoulutus (371.13)
alternative label: Kouluttautuminen, työllistämiskoulutus (371.13)
alternative label: Koulutushalukkuus, työllistämiskoulutus (371.13)
alternative label: Koulutusjärjestelmät, työllistämiskoulutus (371.13)
alternative label: Koulutussuunnittelu, työllistämiskoulutus (371.13)
alternative label: Koulutustarve, työllistämiskoulutus (371.13)
alternative label: Lomautus (371.13)
alternative label: Muutosturva (371.13)
alternative label: Nuorisotakuu, työllistäminen (371.13)
alternative label: Nuorisotyöttömyys (371.13)
alternative label: Ohjaava koulutus, työllistäminen (371.13)
alternative label: Osatyökykyiset, työllistäminen (371.13)
alternative label: Pakkolomat (371.13)
alternative label: Palkkatuki, tuettu työllistyminen (371.13)
alternative label: Piilotyöttömyys (371.13)
alternative label: Pitkäaikaistyöttömyys (371.13)
alternative label: Pitkäaikaistyöttömät, työttömyys (371.13)
alternative label: Rakennetyöttömyys (371.13)
alternative label: Sijaiset, työvoimapalvelu (371.13)
alternative label: Sosiaaliset ongelmat, työttömyys (371.13)
alternative label: Sosiaaliset yritykset, työllistäminen (371.13)
alternative label: Syrjäytyminen, työttömyys (371.13)
alternative label: Syrjäytyneet, työttömyys (371.13)
alternative label: Tuettu työllistyminen (371.13)
alternative label: Työ, työllisyys (371.13)
alternative label: Työ, työttömyys (371.13)
alternative label: Työ- ja elinkeinotoimistot (371.13)
alternative label: Työelämä, työttömyys (371.13)
alternative label: Työharjoittelu (371.13)
alternative label: Työkokemus, työllisyys, työttömyys (371.13)
alternative label: Työlliset (371.13)
alternative label: Työllistetyt (371.13)
alternative label: Työllistyminen (371.13)
alternative label: Työllistäminen (371.13)
alternative label: Työllistämistuki (371.13)
alternative label: Työllisyys (371.13)
alternative label: Työllisyyskoulutus (371.13)
alternative label: Työllisyyspolitiikka (371.13)
alternative label: Työllisyysturva (371.13)
alternative label: Työllisyysvaikutukset (371.13)
alternative label: Työnhakijat, työttömyys (371.13)
alternative label: Työnhakijat, työvoimapalvelu (371.13)
alternative label: Työnvälitys (371.13)
alternative label: Työpaikat, työvoimapalvelu (371.13)
broader: Työ sosiaalipoliittisena kysymyksenä
in scheme: URN:NBN:fi:au:hklj:
notation: 371.13
related: URN:NBN:fi:au:hklj:185
related: Ammatinvalinta
related: Asiakirjakaavat ja -ohjeet. Oikeusoppaat
related: Työoikeus
related: Työn sosiologia
related: Pääoma. Työ. Luonnonvarat
related: Elintaso. Kulutus
related: Siirtolaisuus
related: Naisen ja miehen asema yhteiskunnassa
related: Työväenliike
related: Työmarkkinajärjestöt
related: Työntutkimukset. Työanalyysi
related: Henkilöstöpolitiikka
scope note: Nuoriso-, kausi-, pitkäaikais- ja rakennetyöttömyys Lomautukset. Irtisanomiset. Irtisanomissuoja Täystyöllisyys. Työvoimapula. Siirto- ja vierastyöläiset Työllistämisohjelmat. Työharjoittelu. Työllistämiskoulutus. Ammattikurssitoiminta. Työnvälitystoiminta. Työvoimatoimistot
scope note: Ungdoms-, säsong- och långtidsarbetslöshet och strukturell arbetslöshet Permitteringar. Uppsägningar. Uppsägningsskydd Full sysselsättning. Brist på arbetskraft. Invandrararbetskraft och gästarbetare Sysselsättningsprogram. Praktik Sysselsättningfrämjande utbildning. Yrkeskursverksamhet. Arbetskraftsförsörjning. Arbetsförmedling. Arbetskraftsbyråer @sv

Lastenneuvolat. Äitiysneuvolat
type: Class
type: Concept
subclass of: Perhepolitiikka. Lapsipolitiikka. Nuorisopolitiikka
alternative label: Lastenneuvolat (371.51)
alternative label: Neuvolat, lastenneuvolat (371.51)
alternative label: Neuvolat, äitiysneuvolat (371.51)
alternative label: Äidit, äitiysneuvolat (371.51)
alternative label: Äitiys, äitiysneuvolat (371.51)
alternative label: Äitiysneuvolat (371.51)
alternative label: Barnrådgivningsbyråer (371.51) @sv
alternative label: Moderskap, rådgivningsbyråer för mödravård (371.51) @sv
alternative label: Mödrar, rådgivningsbyråer för mödravård (371.51) @sv
alternative label: Rådgivningsbyråer för mödravård (371.51) @sv
alternative label: Rådgivningsbyråer, rådgivningsbyråer för barnavård (371.51) @sv
alternative label: Rådgivningsbyråer, rådgivningsbyråer för mödravård (371.51) @sv
broader: Perhepolitiikka. Lapsipolitiikka. Nuorisopolitiikka
in scheme: URN:NBN:fi:au:hklj:
notation: 371.51
preferred label: Pre- and post-natal care @en
preferred label: Barnrådgivning. Mödrarådgivning @sv
related: Väestötiede. Väestöpolitiikka
related: Perhe- ja holhousoikeus
related: Työoikeus
related: URN:NBN:fi:au:hklj:345
related: URN:NBN:fi:au:hklj:357.1
related: Perhesosiologia
related: URN:NBN:fi:au:hklj:373
related: Naisen ja miehen asema yhteiskunnassa
related: Työmarkkinajärjestöt
related: Lastenhoito
related: URN:NBN:fi:au:hklj:617.4
related: Raskaus. Sikiönkehitys. Synnytys. Gynekologia

Kulttuuriantropologia. Sosiaaliantropologia
type: Class
type: Concept
subclass of: Antropologia
alternative label: Afrosentrismi, kulttuuriantropologia (479.3)
alternative label: Alkuperäiskansat, kulttuurikehitys (479.3)
alternative label: Alkuperäiskansat, yhteiskuntaelämä (479.3)
alternative label: Antropologia, kulttuuriantropologia (479.3)
alternative label: Antropologia, sosiaaliantropologia (479.3)
alternative label: Arktiset kulttuurit, kulttuuriantropologia (479.3)
alternative label: Dialoginen antropologia (479.3)
alternative label: Diversiteetti, kulttuuriantropologia (479.3)
alternative label: Etnofarmakologia, kulttuuriantropologia (479.3)
alternative label: Etnofilosofia, kulttuuriantropologia (479.3)
alternative label: Etnosemantiikka, kulttuuriantropologia (479.3)
alternative label: Fenomenologinen antropologia (479.3)
alternative label: Filosofinen antropologia, antropologia (479.3)
alternative label: Ihminen, kulttuuriantropologia (479.3)
alternative label: Ihminen, sosiaaliantropologia (479.3)
alternative label: Ihmiset, kulttuuriantropologia (479.3)
alternative label: Ihmiset, sosiaaliantropologia (479.3)
alternative label: Ihmiskunta, kulttuuriantropologia (479.3)
alternative label: Ihmissyönti, kulttuuriantropologia (479.3)
alternative label: Ihmisyhteisöt, kulttuuriantropologia (479.3)
alternative label: Ihmisyhteisöt, sosiaaliantropologia (479.3)
alternative label: Initiaatiot, antropologia (479.3)
alternative label: Kannibalismi, kulttuuriantropologia (479.3)
alternative label: Kaukasialaisuus, kulttuuriantropologia (479.3)
alternative label: Kaukasialaisuus, sosiaaliantropologia (479.3)
alternative label: Kauneusihanteet, kulttuuriantropologia (479.3)
alternative label: Keräilykulttuurit, antropologia (479.3)
alternative label: Kivikautiset kulttuurit, kulttuuriantropologia (479.3)
alternative label: Klaanit, kulttuuriantropologia (479.3)
alternative label: Kulttuuri, kulttuuriantropologia (479.3)
alternative label: Kulttuuriantropologia (479.3)
alternative label: Kulttuuriekologia, kulttuuriantropologia. (479.3)
alternative label: Kulttuurienvälinen tutkimus, kulttuuriantropologia (479.3)
alternative label: Kulttuurienvälisyys, kulttuuriantropologia (479.3)
alternative label: Kulttuurierot, kulttuuriantropologia (479.3)
alternative label: Kulttuuriesineet, kulttuuriantropologia (479.3)
alternative label: Kulttuurijärjestelmät, kulttuuriantropologia (479.3)
alternative label: Kulttuurikehitys, kulttuuriantropologia (479.3)
alternative label: Kulttuurikosketukset, kulttuuriantropologia (479.3)
alternative label: Kulttuurimuodot, kulttuuriantropologia (479.3 +)
alternative label: Kulttuurinormit, kulttuuriantropologia (479.3)
alternative label: Kulttuurintutkimus, kulttuuriantropologia (479.3)
alternative label: Kulttuuriperintö, kulttuuriantropologia (479.3)
alternative label: Kulttuuriristiriidat, kulttuuriantropologia (479.3)
alternative label: Kulttuurishokki, kulttuuriantropologia (479.3)
alternative label: Kulttuurisidonnaisuus, kulttuuriantropologia (479.3)
alternative label: Kulttuurisokki, kulttuuriantropologia (479.3)
alternative label: Kulttuurit, kulttuuriantropologia (479.3)
alternative label: Kulttuuriteoriat, kulttuuriantropologia (479.3)
alternative label: Kulttuuritulkkaus, kulttuuriantropologia (479.3)
alternative label: Kulttuurivaikutukset, kulttuuriantropologia (479.3)
alternative label: Kulttuuriyhteiskunta, kulttuuriantropologia (479.3)
alternative label: Liminaalisuus, siirtymäriitit, kulttuuriantropologia (479.3)
alternative label: Luonnonkansat, antropologia (479.3)
alternative label: Luonnonkansat, kulttuurikehitys (479.3)
alternative label: Luonnonkansat, yhteiskuntaelämä (479.3)
alternative label: Maanviljelyskulttuurit, antropologia (479.3)
alternative label: Marxilainen antropologia, kulttuuriantropologia (479.3)
alternative label: Matriarkaalisuus, kulttuuriantropologia (479.3)
broader: Antropologia
in scheme: URN:NBN:fi:au:hklj:
notation: 479.3
related: URN:NBN:fi:au:hklj:209
related: SOSIOLOGIA
related: Yhteiskunnan rakenne
related: Alueellinen sosiologia. Maassamuutto
related: Elämäntapojen sosiologia. Kulttuurisosiologia
related: URN:NBN:fi:au:hklj:357.1
related: Käytös- ja tapatieto
related: Juhlien järjestäminen
related: Etologia. Eläinsosiologia
related: URN:NBN:fi:au:hklj:807
related: URN:NBN:fi:au:hklj:900
related: Yleinen arkeologia
related: URN:NBN:fi:au:hklj:919
scope note: Kulttuuri- ja sosiaaliantropologian yleisteokset Ihmisyhteisöjä ja kulttuureja, niiden kehitystä ja käyttäytymistä sekä kulttuurivaihtoa koskevat yleiset kulttuuri- ja sosiaaliantropologiset teokset Varhaiskantaisia kulttuureja ja niiden kehitystä koskevat yleiset teokset Tiettyä kansaa koskevat teokset 475-476+
scope note: Allmänna verk som rör kultur- och socialantropologi Allmänna kulturantropologiska och socialantropologiska verk som handlar om mänskliga gemenskaper och kulturer, utvecklingen av dem och beteendet inom dem samt kulturutbytet mellan dem Allmänna verk om primitiva kulturer och deras utveckling Verk som rör enskilda folk förs till klasserna 475-476+ @sv

Eläinekologia
type: Class
type: Concept
subclass of: URN:NBN:fi:au:hklj:590
alternative label: Aapasuot, eläinekologia (594)
alternative label: Aavikot, eläimistö (594)
alternative label: Arot, eläimistö (594)
alternative label: Autiomaat, eläimistö (594)
alternative label: Benthos, eläinekologia (594)
alternative label: Biokenoosit, eläinekologia (594)
alternative label: Biotooppi, eläinekologia (594)
alternative label: Carnivorit, eläinekologia (594)
alternative label: Ekologia, eläimet (594)
alternative label: Elinympäristö, biologia, eläinekologia (594)
alternative label: Eliöyhteisöt, eläinekologia (594)
alternative label: Eläimistö, eläinekologia (594)
alternative label: Eläinekologia (594)
alternative label: Eläinkannat, eläinekologia (594)
alternative label: Eläinten elinympäristöt, ekologia (594)
alternative label: Endofyytit, eläinekologia (594)
alternative label: Fauna, eläinekologia (594)
alternative label: Habitaatti, eläinekologia (594)
alternative label: Havumetsät, metsien eläinekologia (594)
alternative label: Herbivorit, eläinekologia (594)
alternative label: Isäntäeläimet, parasitismi, eläintiede (594)
alternative label: Isäntäkasvit, parasitismi, eläintiede (594)
alternative label: Jäljittely, eläinekologia (594)
alternative label: Kannanvaihtelut, eläinekologia (594)
alternative label: Karnivorit, eläinekologia (594)
alternative label: Kasvinsyöjät, eläinekologia (594)
alternative label: Keidassuot , suot, eläinekologia (594)
alternative label: Keitaat, eläimistö (594)
alternative label: Korvet, eläinekologia (594)
alternative label: Letot, eläinekologia (594)
alternative label: Leviäminen, eläinekologia (594)
alternative label: Lihansyöjät, eläinekologia (594)
alternative label: Loiseläimet, eläinekologia (594)
alternative label: Loiset, eläinekologia (594)
alternative label: Loisinta, eläinekologia (594)
alternative label: Loisoppi, eläintiede (594)
alternative label: Loistaudit, eläinekologia (594)
alternative label: Maaperäeläimistö, eläinekologia (594)
alternative label: Meret, merieläimet, ekologia (594)
alternative label: Merieläimistö, eläinekologia (594)
alternative label: Mutualismi, eläinekologia (594)
alternative label: Mykoosit, eläinten sienitaudit (594)
alternative label: Nevat, eläinekologia (594)
alternative label: Pampat, eläimistö (594)
alternative label: Parasiitit, eläinekologia (594)
alternative label: Parasitismi, eläinekologia (594)
alternative label: Parasitologia, eläintiede (594)
alternative label: Pedot, eläinekologia (594)
alternative label: Perifyton, eläinekologia (594)
alternative label: Petoeläimet, eläinekologia (594)
alternative label: Pienpedot, eläinekologia (594)
alternative label: Pohjaeliöstö, eläinekologia (594)
alternative label: Pohjaeläimistö, eläinekologia (594)
alternative label: Populaatiodynamiikka , eläinekologia (594)
alternative label: Populaatioekologia, eläinekologia (594)
alternative label: Preeriat, eläimistö (594)
alternative label: Päällyskasvusto, eläinekologia (594)
alternative label: Ravintoketjut, eläinekologia (594)
alternative label: Ravintoverkot, eläinekologia (594)
broader: URN:NBN:fi:au:hklj:590
in scheme: URN:NBN:fi:au:hklj:
notation: 594
related: Paleontologia
related: Uhanalaiset lajit. Luonnonsuojelualueet
related: Maaperän, metsien ja soiden suojelu
related: Ekologia. Eliömaantiede
related: Kasviekologia
related: Systemaattinen eläintiede
related: Selkärangattomat
related: Hyönteiset
related: Selkärankaiset
related: Kalat
related: Linnut
related: Nisäkkäät
related: Eläinmaantiede
scope note: Eläinekologian yleisteokset. Eläinten suhde ympäristöönsä Eläinten populaatio- ja energiaekologia Symbioosi, parasitismi ja eläinsairaudet eläinekologian kannalta Parasitologia eläinekologian kannalta Vuodenaikojen vaikutukset eläinten elämään Teokset, jotka kuvailevat eri elinympäristöjen eläimistöä ja joita ei ole tarkoitettu lajinmääritysoppaiksi. Metsien, soiden, kosteikkojen, vesistöjen, vuoristojen, kulttuuriympäristöjen ym. elinympäristöjen eläimistöt Tietyn eläinlajin tai lajiryhmän ekologia ko. lajin tai ryhmän luokassa 597+
scope note: Allmänna verk om djurekologi. Djurens förhållande till omgivningen Djurens populations- och energiekologi Symbios, parasitism och djursjukdomar ur djurekologisk synvinkel Parasitologi ur djurekologisk synvinkel Årstidernas inverkan på djurens liv Verk som beskriver faunan i olika livsmiljöer och som inte är avsedda som handböcker i artbestämning Verk som beskriver skogarnas, myrarnas, våtmarkernas, sjöarnas, vattendragens, bergstrakternas, kulturmiljöernas osv. fauna Ekologi för en bestämd djurart eller artgrupp förs enligt art eller artgrupp till klass 597+ @sv

Eläinmaantiede
type: Class
type: Concept
subclass of: URN:NBN:fi:au:hklj:590
alternative label: Alkuperäiset eläinlajit, eläinmaantiede (598)
alternative label: Asutuksen seuralaislajit, eläinmaantiede (598)
alternative label: Biogeografia, eläinmaantiede (598)
alternative label: Eliömaantiede, eläinmaantiede (598)
alternative label: Eläimistö, eläinmaantiede (598)
alternative label: Eläinmaantiede (598)
alternative label: Eläinten levinneisyys (598)
alternative label: Endeemiset eläinlajit, eläinmaantiede (598)
alternative label: Fauna, eläinmaantiede (598)
alternative label: Ihmisen seuralaislajit, eläinmaantiede (598)
alternative label: Kotoperäiset eläinlajit, eläinmaantiede (598)
alternative label: Kulttuurin seuralaislajit, eläinmaantiede (598)
alternative label: Levinneisyys, eläinmaantiede (598)
alternative label: Leviäminen, eläinmaantiede (598)
alternative label: Luonnonmaantiede, eläinmaantiede (598)
alternative label: Maantiede, eläinmaantiede (598)
alternative label: Merieläimistö, eläinmaantiede (598)
alternative label: Tropiikki, eläinmaantiede (598)
alternative label: Tulokaslajit, eläinmaantiede (598)
alternative label: Vesieläimistö, eläinmaantiede (598)
alternative label: Biogeografi, djurgeografi (598) @sv
alternative label: Biologisk geografi, djurgeografi (598) @sv
alternative label: Djurens utbredning (598) @sv
alternative label: Djurgeografi (598) @sv
alternative label: Djurvärld, djurgeografi (598) @sv
alternative label: Endemiska djurarter, endeemiset eläinlajit, djurgeografi (598) @sv
alternative label: Endemiska djurarter, kotoperäiset eläinlajit, djurgeografi (598) @sv
alternative label: Fauna, djurgeografi (598) @sv
alternative label: Följearter till bostättning, djurgeografi (598) @sv
alternative label: Följearter till kultur, djurgeografi (598) @sv
alternative label: Följearter till människan, djurgeografi (598) @sv
alternative label: Geografi, djurgeografi (598) @sv
alternative label: Havsfauna, djurgeografi (598) @sv
alternative label: Naturgeografi, djurgeografi (598) @sv
alternative label: Nya arter, djurgeografi (598) @sv
alternative label: Spridning, biologi, djurgeografi (598) @sv
alternative label: Tropikerna, djurgeografi (598) @sv
alternative label: Ursprungliga djurarter, djurgeografi (598) @sv
alternative label: Utbredning, djurgeografi (598) @sv
alternative label: Vattenfauna, djurgeografi (598) @sv
broader: URN:NBN:fi:au:hklj:590
in scheme: URN:NBN:fi:au:hklj:
notation: 598
preferred label: Animal geography @en
preferred label: Djurgeografi @sv
related: URN:NBN:fi:au:hklj:400
related: FYYSINEN MAANTIEDE
related: Ekologia. Eliömaantiede
related: Kasvimaantiede
related: Eläinekologia
related: Systemaattinen eläintiede
related: Selkärangattomat
related: Hyönteiset
related: Selkärankaiset
related: Kalat
related: Linnut
related: Nisäkkäät
related: URN:NBN:fi:au:hklj:598.084
scope note: Eläinmaantieteen yleisteokset. Eläinten levinneisyys yleensä Eläinmaantieteelliset alueet ja niiden eläimistö Tiettyä eläinlajia tai lajiryhmää koskeva eläinmaantiede ko. eläimen tai eläinryhmän luokassa 597+
scope note: Allmänna verk om djurgeografi. Djurens utbredning i allmänhet Djurgeografiska områden och deras fauna Djurgeografi för en bestämd djurart eller artgrupp förs enligt art eller artgrupp till klass 597+ @sv

Moottoripyörät. Mopedit
type: Class
type: Concept
subclass of: URN:NBN:fi:au:hklj:624
alternative label: ABS-jarrut, moottoripyörät (624.7)
alternative label: Ajo-ominaisuudet, moottoripyörät (624.7)
alternative label: Huolto, moottoripyörät (624.7)
alternative label: Huolto, mopot (624.7)
alternative label: Jarrut, moottoripyörät (624.7)
alternative label: Jousitus, moottoripyörät (624.7)
alternative label: Jääspeedway, speedway-pyörät (624.7)
alternative label: Kolmipyöräiset moottoripyörät (624.7)
alternative label: Lukkiutumattomat jarrut, moottoripyörät (624.7)
alternative label: Moottoriajoneuvot, moottoripyörät (624.7)
alternative label: Moottoriajoneuvot, mopedit (624.7)
alternative label: Moottoripyörämerkit (624.7)
alternative label: Moottoripyörät (624.7)
alternative label: Mopedit (624.7)
alternative label: Mopomerkit (624.7)
alternative label: Mopot (624.7)
alternative label: Pakokaasut, moottoripyörätekniikka (624.7)
alternative label: Poliisiajoneuvot, moottoripyörät (624.7)
alternative label: Rekisteröinti, moottoripyörät (624.7)
alternative label: Renkaat, moottoripyörät (624.7)
alternative label: Sivuvaunut, moottoripyörät (624.7)
alternative label: Skootterit (624.7)
alternative label: Speedway-pyörät (624.7)
alternative label: Talvirenkaat, moottoripyörät (624.7)
alternative label: Trial-pyörät (624.7)
alternative label: Triket, moottoripyörät (624.7)
alternative label: Vaihteet, moottoripyörät (624.7)
alternative label: ABS-bromsar, motorcyklar (624.7) @sv
alternative label: Avgaser, motorcykelteknik (624.7) @sv
alternative label: Bromsar, motorcyklar (624.7) @sv
alternative label: Däck, motorcyklar (624.7) @sv
alternative label: Fjädring, motorcyklar (624.7) @sv
alternative label: Isracing, speedwaycyklar (624.7) @sv
alternative label: Köregenskaper, motorcyklar (624.7) @sv
alternative label: Låsningsfria bromsar, motorcyklar (624.7) @sv
alternative label: Mopeder (624.7) @sv
alternative label: Mopedmärken (624.7) @sv
alternative label: Motorcykelmärken (624.7) @sv
alternative label: Motorcyklar (624.7) @sv
alternative label: Motorfordon, mopeder (624.7) @sv
alternative label: Motorfordon, motorcyklar (624.7) @sv
alternative label: Polisfordon, motorcyklar (624.7) @sv
alternative label: Registrering, motorcyklar (624.7) @sv
alternative label: Sidovagnar, motorcyklar (624.7) @sv
alternative label: Skotrar (624.7) @sv
alternative label: Skötsel, teknisk, mopeder (624.7) @sv
alternative label: Skötsel, teknisk, motorcyklar (624.7) @sv
alternative label: Speedwaycyklar (624.7) @sv
alternative label: Trehjuliga motorcyklar, motorcyklar (624.7) @sv
alternative label: Trialcyklar (624.7) @sv
alternative label: Trikar, motorcyklar (624.7) @sv
alternative label: Vinterdäck, motorcyklar (624.7) @sv
alternative label: Växlar, teknik, motorcyklar (624.7) @sv
broader: URN:NBN:fi:au:hklj:624
in scheme: URN:NBN:fi:au:hklj:
notation: 624.7
preferred label: Motorcycles. Mopeds @en
preferred label: Motorcyklar. Mopeder @sv
related: URN:NBN:fi:au:hklj:380
related: Maaliikenne
related: Paikallisliikenne
related: URN:NBN:fi:au:hklj:460
related: URN:NBN:fi:au:hklj:620.88
related: Yleinen konetekniikka
related: Koneenrakennus. Pneumatiikka. Hydrauliikka
related: Voimakoneet. Moottorit. Nosto- ja kuljetuslaitteet
related: URN:NBN:fi:au:hklj:624.709
related: URN:NBN:fi:au:hklj:631
related: Liikenneopetus. Liikenneturvallisuus
related: Moottoriurheilu. Lentourheilu
related: Moottoripyöräurheilu
scope note: Moottoripyörien ja mopedien suunnittelu, tekniikka, rakenne ja osat, asennus, huolto, viat, korjaus, varaosat ja varustelu Moottoripyörä- ja mopedimerkit ja -mallit, niiden ajo-ominaisuudet Moottoripyörän ostajan oppaat Trial- ja motocross-pyörät. Skootterit. Moottoripyörien sivu- ja perävaunut Jos teos koskee sekä moottoripyöriä tai mopedeja että liikennettä, on etusija luokilla 385 ja 387+ Jos teos koskee sekä moottoripyöriä että moottoripyöräurheilua, on etusija luokalla 791.82
scope note: Konstruktion, montering, service, reparation och utrustning av motorcyklar och mopeder, deras teknik, konstruktion, delar, fel och reservdelar Motorcykel- och mopedmärken samt motorcykel- och mopedmodeller, deras köregenskaper Handledningar för motorcykelköpare Trial- och motocrosscyklar. Skotrar. Sidvagnar och släpvagnar för motorcyklar Om verket rör såväl motorcyklar och mopeder som trafik ges företräde åt klass 385 och 387+ Om verket rör både motorcyklar och motorcykelsport ges företräde åt klass 791.82 @sv

Autot
type: Class
type: Concept
subclass of: URN:NBN:fi:au:hklj:624
alternative label: ABS-jarrut, autot (624.8)
alternative label: Ajo-ominaisuudet, autot (624.8)
alternative label: Ajoneuvoyhdistelmät (624.8)
alternative label: Ajonhallintajärjestelmät (624.8)
alternative label: Ajonvakauden hallintajärjestelmät (624.8)
alternative label: Ajonvakaudenhallintajärjestelmät (624.8)
alternative label: Ajonvakautusjärjestelmät (624.8)
alternative label: Ajopiirturit, kuorma-autot (624.8)
alternative label: Ajopiirturit, linja-autot (624.8)
alternative label: Ajovakauden hallintajärjestelmät (624.8)
alternative label: Ajovakaudenhallintajärjestelmät (624.8)
alternative label: Ajovakautusjärjestelmät (624.8)
alternative label: Akselit, autot (624.8)
alternative label: Akut, autot (624.8)
alternative label: Alustat, autotekniikka (624.8)
alternative label: Ambulanssit, autotekniikka (624.8)
alternative label: Amfibioautot (624.8)
alternative label: Asennus, autonasennus (624.8)
alternative label: Asuntoautot (624.8)
alternative label: Autoala (624.8)
alternative label: Automallit (624.8)
alternative label: Automerkit (624.8)
alternative label: Autonrenkaat (624.8)
alternative label: Autonäyttelyt (624.8)
alternative label: Autot (624.8)
alternative label: Autot, ajo-ominaisuudet (624.8)
alternative label: Autot, huolto, viat ja korjaus (624.8)
alternative label: Autot, kori, sisustus ja varustelu (624.8)
alternative label: Autot, moottorit (624.8)
alternative label: Autot, tekniikka (624.8)
alternative label: Autotekniikka (624.8)
alternative label: Avoautot (624.8)
alternative label: Bussit (624.8)
alternative label: Dieselautot (624.8)
alternative label: Entistäminen, autot (624.8)
alternative label: Henkilöautot (624.8)
alternative label: Hot rod (624.8)
alternative label: Huolto, autot (624.8)
alternative label: Huoltokirjat, autot (624.8)
alternative label: Hybridiautot (624.8)
alternative label: Hälytysajoneuvot (624.8)
alternative label: Hälytysajoneuvot, autotekniikka (624.8)
alternative label: Invataksit, autot (624.8)
alternative label: Jarrut, autot (624.8)
alternative label: Johdinautot (624.8)
alternative label: Jouset, autot (624.8)
alternative label: Jousitus, autot (624.8)
alternative label: Jäteautot, autotekniikka (624.8)
alternative label: Kaasuttimet, autot (624.8)
alternative label: Kampiakselit, autot (624.8)
alternative label: Katalysaattorit, autot (624.8)
alternative label: Kauppa-autot, autot (624.8)
alternative label: Kesärenkaat, tekniikka (624.8)
alternative label: Kiihdytysajo, kilpa-autot (624.8)
alternative label: Kiihtyvyys, autot (624.8)
alternative label: Kilpa-autot (624.8)
alternative label: Kirjastoautot, autotekniikka (624.8)
alternative label: Kitkarenkaat (624.8)
alternative label: Kojelaudat, autot (624.8)
alternative label: Korjaamot, autokorjaamot (624.8)
broader: URN:NBN:fi:au:hklj:624
in scheme: URN:NBN:fi:au:hklj:
notation: 624.8
related: URN:NBN:fi:au:hklj:380
related: Maaliikenne
related: URN:NBN:fi:au:hklj:460
related: Yleinen konetekniikka
related: Koneenrakennus. Pneumatiikka. Hydrauliikka
related: Voimakoneet. Moottorit. Nosto- ja kuljetuslaitteet
related: Tiet. Kadut. Tienrakennus. Kadunrakennus
related: Sähkötekniikka
related: Sähköenergian muuttaminen, muuntaminen, jakelu ja siirto
related: URN:NBN:fi:au:hklj:631
related: Moottoriurheilu. Lentourheilu
related: Autourheilu
scope note: Autot yleensä. Autotekniikka. Autojen suunnittelu. Automerkit ja -mallit. Autokauppa Autotestit. Auton ostajan oppaat. Autojen ajo-ominaisuudet Autojen korjausoppaat. Autonasennus. Autojen huolto, viat, korjaus ja varaosat Auton rakenne ja osat. Auton moottori ja sen osat. Autojen varustelu. Turvaistuimet. Turvavyöt Henkilöautot. Kilpa-autot. Mikroautot. Linja-autot. Pakettiautot. Kuorma-autot. Rekat. Säiliöautot. Sähköautot. Hybridiautot Ambulanssit sekä palo-, poliisi-, myymälä- ja kirjastoautot tekniikan kannalta Jos teos koskee sekä autoja että autoilua tai autoliikennettä, on etusija luokilla 385 ja 387+ Jos teos koskee sekä autoja että autourheilua, on etusija luokalla 791.81
scope note: Bilar i allmänhet. Bilteknik. Konstruktion av bilar. Bilmärken och bilmodeller. Bilhandel Biltest. Handledningar för bilköpare. Olika bilars köregenskaper. Reparationshandböcker för bilar. Montering av bilar. Service, fel, reparation och reservdelar som rör bilar Bilens konstruktion och delar. Bilmotorn och dess delar. Utrustning av bilar. Bilstolar. Bilbälten Personbilar. Tävlingsbilar. Go-kart. Bussar. Skåpbilar. Lastbilar. Långtradare. Tankbilar. Elbilar. Hybridbilar Ambulanser samt brandbilar, polisbilar, varubussar och bokbussar ur teknisk synvinkel Om verket handlar om både bilar och bilism eller biltrafik ges företräde åt klasserna 385 och 387+ Om verket handlar om både bilar och bilsport ges företräde åt klassen 791.81 @sv

Muuraus. Rappaus
type: Class
type: Concept
subclass of: Rakennustyöt. Rakennusaineet. Rakennustarvikkeet
alternative label: Laasti, muuraus- ja rappaustyöt (667.11)
alternative label: Muuraaminen (667.11)
alternative label: Muurarit, muurarin työ (667.11)
alternative label: Muuraus (667.11)
alternative label: Pintakäsittely, rappaus (667.11)
alternative label: Rappaus (667.11)
alternative label: Tasoitteet, talonrakennus (667.11)
alternative label: Verhoukset, rappaus (667.11)
alternative label: Viimeistelytyöt, rappaus (667.11)
alternative label: Beklädnad, panel, rappning (667.11) @sv
alternative label: Färdigställande, rappning (667.11) @sv
alternative label: Murare, murarens arbete (667.11) @sv
alternative label: Murbruk, murnings- och rappningsarbeten (667.11) @sv
alternative label: Murning (667.11) @sv
alternative label: Murningsarbeten (667.11) @sv
alternative label: Rappning (667.11) @sv
alternative label: Spackel, husbyggnad (667.11) @sv
alternative label: Ytbehandling, rappning (667.11) @sv
broader: Rakennustyöt. Rakennusaineet. Rakennustarvikkeet
in scheme: URN:NBN:fi:au:hklj:
notation: 667.11
preferred label: Bricklaying. Rendering @en
preferred label: Murning. Rappning @sv
related: Energia
related: Raideliikenneväylät. Junat. Raitiovaunut. Metro
related: Rakennusstatiikka. Rakennusaineet
related: Tekninen rakennussuunnittelu
related: Geotekniikka. Maatyöt
related: Rakenneosat
related: Uunit. Takat
related: Rakennuksen kunnossapito
related: HIENOMEKANIIKKA. KÄSI- JA KOTITEOLLISUUS
related: Sisustusoppaat
related: URN:NBN:fi:au:hklj:720
related: URN:NBN:fi:au:hklj:721
related: URN:NBN:fi:au:hklj:726
scope note: Rakennuksen muuraus- ja rappaustyöt sekä niihin liittyvät työkalut ja tarvikkeet Muuraus- ja rappaustyöt myös talon kunnossapidon ja korjauksen kannalta
scope note: Murning och rappning av byggnader samt tillhörande verktyg och material Också murning och rappning som hänför sig till underhåll och reparation av hus @sv

Suurkeittiöt
type: Class
type: Concept
subclass of: KOTITALOUS. LAITOSTALOUS. KAUNEUDENHOITO
alternative label: Annostus, suurkeittiöt (699)
alternative label: Eväät, kouluruokailu (699)
alternative label: Eväät, työpaikkaruokailu (699)
alternative label: Henkilöstöravintolat (699)
alternative label: Henkilöstöruokalat (699)
alternative label: Joukkoruokailu (699)
alternative label: Keittiöt, suurkeittiöt (699)
alternative label: Keskuskeittiöt (699)
alternative label: Koulukeittiöt (699)
alternative label: Kouluruoka (699)
alternative label: Kouluruokailu (699)
alternative label: Laitoskeittiöt (699)
alternative label: Menyyt, joukkoruokailu (699)
alternative label: Muonitus, joukkoruokailu (699)
alternative label: Opetuskeittiöt, suurkeittiöt (699)
alternative label: Opiskelijahuolto, koulu- ja opiskelijaruokailu (699)
alternative label: Oppilashuolto, koulu- ja opiskelijaruokailu (699)
alternative label: Ravitsemisala, suurkeittiöt (699)
alternative label: Ruokailu, joukkoruokailu (699)
alternative label: Ruokailu, kouluruokailu (699)
alternative label: Ruokailu, suurkeittiöt (699)
alternative label: Ruokailu, työpaikkaruokailu (699)
alternative label: Ruokalat, joukkoruokailu (699)
alternative label: Ruokalistat, joukkoruokailu (699)
alternative label: Ruokapalvelut, joukkoruokailu (699)
alternative label: Sairaalakeittiöt (699)
alternative label: Sairaalaruokailu (699)
alternative label: Suurkeittiölaitteet (699)
alternative label: Suurkeittiöt (699)
alternative label: Suurtaloudet, suurkeittiöt (699)
alternative label: Työpaikkaruokailu (699)
alternative label: Työpaikkaruokalat (699)
alternative label: Anstaltskök (699) @sv
alternative label: Arbetsplatsmatsalar (699) @sv
alternative label: Bespisning, massbespisning (699) @sv
alternative label: Bespisning, personalbespisning (699) @sv
alternative label: Bespisning, skolbespisning (699) @sv
alternative label: Bespisning, storkök (699) @sv
alternative label: Centralkök (699) @sv
alternative label: Elevvård, skol- och studentbespisning (699) @sv
alternative label: Färdkost, personalbespisning (699) @sv
alternative label: Färdkost, skolbespisning (699) @sv
alternative label: Kök, storkök (699) @sv
alternative label: Massbespisning (699) @sv
alternative label: Matserveringar, bespisning (699) @sv
alternative label: Mattjänster, bespisning (699) @sv
alternative label: Menyer, bespisning (699) @sv
alternative label: Personalbespisning (699) @sv
alternative label: Personalmatsalar (699) @sv
alternative label: Personalrestauranger (699) @sv
alternative label: Portionering, storkök (699) @sv
alternative label: Proviantering, bespisning (699) @sv
alternative label: Restaurangbranschen, storkök (699) @sv
alternative label: Sjukhusbespisning (699) @sv
alternative label: Sjukhuskök (699) @sv
alternative label: Skolbespisning (699) @sv
alternative label: Skolkök (699) @sv
alternative label: Skolmat (699) @sv
alternative label: Storhushåll, storkök (699) @sv
broader: KOTITALOUS. LAITOSTALOUS. KAUNEUDENHOITO
in scheme: URN:NBN:fi:au:hklj:
notation: 699
related: URN:NBN:fi:au:hklj:181.7
related: URN:NBN:fi:au:hklj:613.3
related: URN:NBN:fi:au:hklj:649.91
related: Hotelli- ja ravintolatalous
related: Ravintotalous. Gastronomia
related: URN:NBN:fi:au:hklj:691.1
related: Leipominen
related: URN:NBN:fi:au:hklj:691.12
related: URN:NBN:fi:au:hklj:691.13
related: Kalaruoat
related: Eri maiden ja alueiden ruokalajit ja ruokakulttuuri
related: Säilöntä
related: Juomat
scope note: Sairaaloiden, koulujen ja muiden laitosten tai työpaikkojen keittiöiden organisointi, talous ja huolto Joukkoruokailu. Työpaikkaruokailu. Kouluruokailu
scope note: Organisation och skötsel av kök i sjukhus, skolor och andra inrättningar eller arbetsplatser samt deras ekonomi Massbespisning. Personalmatsalar. Skolbespisning @sv

Rakennuksen koristelu
type: Class
type: Concept
subclass of: URN:NBN:fi:au:hklj:720
alternative label: Arkkitehtuuri, rakennusten koristetyylit (725)
alternative label: Kasviaiheet, rakennuksen koristelu (725)
alternative label: Koristeet, rakennusten koristelu (725)
alternative label: Koristelu, rakennusten koristelu (725)
alternative label: Koristemaalaus, rakennuksen koristelu (725)
alternative label: Koristetaide, arkkitehtuuri (725)
alternative label: Koristetyylit, arkkitehtuuri (725)
alternative label: Koristeveisto, rakennusten koristelu (725)
alternative label: Ornamentiikka, arkkitehtuuri (725)
alternative label: Rakennukset, koristelu (725)
alternative label: Rakennustyylit, koristetyylit (725)
alternative label: Tuuliviirit, arkkitehtuuri (725)
alternative label: Arkitektur, byggnadernas dekorationsstilar (725) @sv
alternative label: Byggnader, dekoration (725) @sv
alternative label: Byggnadsstilar, dekorationsstilar (725) @sv
alternative label: Dekoration, byggnadsdekoration (725) @sv
alternative label: Dekorationer, byggnadernas dekoration (725) @sv
alternative label: Dekorationsmålning, byggnadsdekoration (725) @sv
alternative label: Dekorationsstilar, arkitektur (725) @sv
alternative label: Dekorativ konst, arkitektur (725) @sv
alternative label: Konstslöjd, byggnadsdekoration (725) @sv
alternative label: Ornamentik, arkitektur (725) @sv
alternative label: Vindflöjlar, arkitektur (725) @sv
alternative label: Växtmotiv, byggnadsdekoration (725) @sv
broader: URN:NBN:fi:au:hklj:720
in scheme: URN:NBN:fi:au:hklj:
notation: 725
preferred label: Ornamentation of buildings @en
preferred label: Ornamentering av byggnader @sv
related: Taiteen estetiikka. Taidefilosofia. Taidepsykologia. Taidesosiologia. Taidepolitiikka
related: Arkkitehtuurin teoria, estetiikka ja filosofia
related: Arkkitehtuurikilpailut. Arkkitehtuurinäyttelyt. Arkkitehtuuripalkinnot
related: URN:NBN:fi:au:hklj:720.9
related: URN:NBN:fi:au:hklj:767
scope note: Rakennuksen koristelu, sen historia, tyylit, tekniikka ja estetiikka
scope note: Ornamentering av byggnader, dess historia, stilarter, teknik och estetik @sv

Baltian maat
type: Class
type: Concept
subclass of: Pohjoismaat. Baltian maat
alternative label: Baltia, maalaustaide (740.926 +)
alternative label: Baltikum, målarkonst (740.926 +) @sv
broader: Pohjoismaat. Baltian maat
in scheme: URN:NBN:fi:au:hklj:
narrower: Viro
narrower: Latvia
narrower: Liettua
notation: 740.926
preferred label: Baltic countries @en
preferred label: Baltikum @sv
related: URN:NBN:fi:au:hklj:709
related: URN:NBN:fi:au:hklj:741
related: URN:NBN:fi:au:hklj:741.1
related: URN:NBN:fi:au:hklj:741.2
related: URN:NBN:fi:au:hklj:742
related: URN:NBN:fi:au:hklj:749
related: URN:NBN:fi:au:hklj:749.1

Graafisen taiteen historia
type: Class
type: Concept
subclass of: GRAAFINEN TAIDE. VALOKUVAUS
alternative label: Art noveau, grafiikka (750.9 ... 753)
alternative label: Graafikot (750.9 +)
alternative label: Graafinen taide (750.9 +)
alternative label: Grafiikka, graafinen taide (750.9 +)
alternative label: Jugend, grafiikka (750.9 ... 753)
alternative label: Kuvataiteilijat, graafikot (750.9 ... 753)
alternative label: L'art nouveau, grafiikka (750.9 ... 753)
alternative label: Art nouveau, grafik (750.9 ... 753) @sv
alternative label: Bildkonstnärer, grafiker (750.9 ... 753) @sv
alternative label: Grafik, grafisk konst (750.9 +) @sv
alternative label: Grafiker (750.9 +) @sv
alternative label: Grafisk konst (750.9 +) @sv
alternative label: Jugend, grafik (750.9 ... 753) @sv
alternative label: L'art nouveau, grafik (750.9 ... 753) @sv
broader: GRAAFINEN TAIDE. VALOKUVAUS
in scheme: URN:NBN:fi:au:hklj:
narrower: Suomi
notation: 750.9
preferred label: History of graphic art @en
preferred label: Den grafiska konstens historia @sv
related: URN:NBN:fi:au:hklj:709
related: Suomen yleinen taidehistoria
related: MAALAUSTAIDE. PIIRUSTUSTAIDE
related: URN:NBN:fi:au:hklj:740.9
related: URN:NBN:fi:au:hklj:749.1
related: Kuvitustaide
related: Käyttögrafiikka
related: Taidegrafiikka
related: URN:NBN:fi:au:hklj:756
related: Valokuvataide
related: Valokuvauksen materiaalit ja tekniikka. Valokuvausoppaat
scope note: Eri maanosien, maiden ja aikakausien graafisen taiteen ja sen tyylien historiaa koskevat yleisteokset, joihin sisältyy sekä taide- että käyttögrafiikka Tässä ja luokassa 750.921 myös teokset, jotka koskevat sekä graafisen taiteen että valokuvauksen historiaa tai henkilöhistoriaa Graafisen taiteen erikoisalojen historia ja henkilöhistoria alan mukaisessa luokassa
scope note: Allmänna verk om grafiska konstens och dess stilarters allmänna historia i olika världsdelar och länder eller under olika tidsperioder, och som innehåller både konst- och bruksgrafik Hit och till klass 750.921 också verk som rör både den grafiska konstens och fotografins historia eller personhistoria Specialområden inom den grafiska konstens historia eller personhistoria klassificeras enligt område @sv

Kankaankudonta. Kankaanpainanta
type: Class
type: Concept
subclass of: URN:NBN:fi:au:hklj:764
alternative label: Batiikki (764.7)
alternative label: Batikki (764.7)
alternative label: Gobeliinit (764.7)
alternative label: Huopa, käsityöt (764.7)
alternative label: Huopatyöt (764.7)
alternative label: Huovutus (764.7)
alternative label: Kangaslaadut, kankaankudonta (764.7)
alternative label: Kangaspuut, kankaankudonta (764.7)
alternative label: Kankaankudonta, käsityöohjeet (764.7)
alternative label: Kankaanpainanta, käsityöohjeet (764.7)
alternative label: Kankaat, kankaankudonta (764.7)
alternative label: Kankaat, kankaanpainanta (764.7)
alternative label: Kankaat, tekstiilitaide (764.7)
alternative label: Kankaiden sidokset (764.7)
alternative label: Kehyskudonta (764.7)
alternative label: Koristemaalaus, silkkimaalaus (764.7)
alternative label: Kudonta, kankaankudonta (764.7)
alternative label: Kutominen, kankaankudonta (764.7)
alternative label: Kuultokudokset (764.7)
alternative label: Kuvakudokset (764.7)
alternative label: Käsinpainanta, kankaanpainanta (764.7)
alternative label: Käsityöt, batiikki (764.7)
alternative label: Käsityöt, kankaankudonta (764.7)
alternative label: Käsityöt, kankaanpainanta (764.7)
alternative label: Lautanauhat (764.7)
alternative label: Maalaukset, silkkimaalaukset (764.7)
alternative label: Maalaustaide, silkkimaalaus (764.7)
alternative label: Nauhat, kudonta (764.7)
alternative label: Painokuvat, kankaanpainanta (764.7)
alternative label: Painovärit, kankaanpainanta (764.7)
alternative label: Palmikoidut nauhat (764.7)
alternative label: Pellava, kankaankudonta (764.7)
alternative label: Pirtanauhat (764.7)
alternative label: Poppana (764.7)
alternative label: Raanut (764.7)
alternative label: Saalit (764.7)
alternative label: Saalit, kudotut (764.7)
alternative label: Seinätekstiilit, gobeliinit (764.7)
alternative label: Seinätekstiilit, raanut (764.7)
alternative label: Seinätekstiilit, täkänät (764.7)
alternative label: Seinävaatteet, gobeliinit (764.7)
alternative label: Seinävaatteet, raanut (764.7)
alternative label: Seinävaatteet, täkänät (764.7)
alternative label: Serigrafia, tekstiilitaide (764.7)
alternative label: Seripaino, tekstiilitaide (764.7)
alternative label: Shaalit (764.7)
alternative label: Shaalit, kudotut (764.7)
alternative label: Silkinmaalaus (764.7)
alternative label: Silkkimaalaus (764.7)
alternative label: Silkkipaino, tekstiilitaide (764.7)
alternative label: Taidemaalarit, silkkimaalarit (764.7)
alternative label: Tekstiilityö, batiikki (764.7)
alternative label: Tekstiilityö, gobeliinit (764.7)
alternative label: Tekstiilityö, huovutus (764.7)
alternative label: Tekstiilityö, kankaankudonta (764.7)
alternative label: Tekstiilityö, kankaanpainanta (764.7)
alternative label: Tekstiilityö, kuultokudokset (764.7)
alternative label: Tekstiilityö, kuvakudokset (764.7)
alternative label: Tekstiilityö, poppanat (764.7)
alternative label: Tekstiilityö, raanut (764.7)
alternative label: Tekstiilityö, silkkipainanta (764.7)
broader: URN:NBN:fi:au:hklj:764
in scheme: URN:NBN:fi:au:hklj:
notation: 764.7
related: Tekstiili- ja vaatetusteollisuus
related: Kodin korjaustöiden oppaat
related: Taideteollisuuden teoria, estetiikka ja filosofia
related: Antiikkiesineiden keräily
related: Taideteollisuuden historia
related: Ryijyt
related: Matot
related: Kehrääminen. Karstaus. Värjäys
related: URN:NBN:fi:au:hklj:767
related: URN:NBN:fi:au:hklj:798
related: Muodin historia
scope note: Kankaankudonta ja kankaanpainanta, niiden historia, materiaalit, tekniikka ja estetiikka Kankaankudonta ja kankaanpainantaohjeet ja -mallit Kankaat. Saalit. Raanut. Poppanat. Täkänät. Batiikki. Gobeliinit Kuulto- ja kuvakudokset. Silkkipainanta. Silkkimaalaus Tekstiilien ja kankaiden maalaus ja painanta Kankaiden sidokset. Huovutus
scope note: Tygvävning och tygtryck, deras historia, material, tekniker och estetik Vävbeskrivningar och vävmönster, arbetsbeskrivningar och mallar för tygtryck Tyger. Sjalar. Ranor. Poppana. Finnväv. Batik. Gobelänger Transparangväv och bildväv. Sidentryck. Sidenbatik Målning och tryckning av textilier och tyger Vävbindning. Tovning @sv

Kehrääminen. Karstaus. Värjäys
type: Class
type: Concept
subclass of: URN:NBN:fi:au:hklj:764
alternative label: Kankaat, kankaiden värjäys (764.9)
alternative label: Karstaaminen, käsityöt (764.9)
alternative label: Karstaus, käsityöt (764.9)
alternative label: Kasveilla värjääminen, tekstiilit (764.9)
alternative label: Kasvivärjäys, tekstiilit (764.9)
alternative label: Kehruu, käsityöt (764.9)
alternative label: Kehrääminen, käsityöt (764.9)
alternative label: Käsityölangat, kehrääminen ja karstaus (764.9)
alternative label: Käsityölangat, lankojen värjäys (764.9)
alternative label: Käsityöt, kehrääminen ja karstaus (764.9)
alternative label: Käsityöt, värjäys (764.9)
alternative label: Langat, kehrääminen ja karstaus (764.9)
alternative label: Langat, värjäys (764.9)
alternative label: Pellava, kehräys, karstaus, värjäys (764.9)
alternative label: Rukit, kehrääminen (764.9)
alternative label: Sienivärjäys (764.9)
alternative label: Tekstiilityö, karstaus (764.9)
alternative label: Tekstiilityö, kehrääminen (764.9)
alternative label: Tekstiilityö, värjäys (764.9)
alternative label: Villa, kehrääminen, karstaus, värjäys (764.9)
alternative label: Väriaineet, tekstiilikäsityö (764.9)
alternative label: Värjäys, tekstiilikäsityö (764.9)
alternative label: Färgning med växter, textilier (764.9) @sv
alternative label: Färgning, textilhandarbete (764.9) @sv
alternative label: Färgämnen, textilhandarbete (764.9) @sv
alternative label: Garn, färgning (764.9) @sv
alternative label: Garn, spinning och kardning (764.9) @sv
alternative label: Handarbeten, färgning (764.9) @sv
alternative label: Handarbeten, spinning och kardning (764.9) @sv
alternative label: Handarbetsgarn, färgning av garn (764.9) @sv
alternative label: Handarbetsgarn, spinning och kardning (764.9) @sv
alternative label: Kardning, handarbeten (764.9) @sv
alternative label: Lin, spinning, kardning, färgning (764.9) @sv
alternative label: Spinning, handarbeten (764.9) @sv
alternative label: Spinnrockar, spinning (764.9) @sv
alternative label: Spånad, handarbeten (764.9) @sv
alternative label: Svampfärgning (764.9) @sv
alternative label: Textilslöjd, kardning (764.9) @sv
alternative label: Textilslöjd, spinning (764.9) @sv
alternative label: Textilslöjd, tygfärgning (764.9) @sv
alternative label: Tyg, tygfärgning (764.9) @sv
alternative label: Ull, spinning, kardning, färgning (764.9) @sv
alternative label: Växtfärgning, textilier (764.9) @sv
broader: URN:NBN:fi:au:hklj:764
in scheme: URN:NBN:fi:au:hklj:
notation: 764.9
preferred label: Spinning. Carding. Dyeing @en
preferred label: Spinning. Kardning. Färgning @sv
related: Tekstiili- ja vaatetusteollisuus
related: Kemian teollisuus
related: Yrtti- ja maustekasvit
related: Vuohet ja lampaat
related: Kodin korjaustöiden oppaat
related: Taideteollisuuden teoria, estetiikka ja filosofia
related: Antiikkiesineiden keräily
related: Taideteollisuuden historia
related: Kankaankudonta. Kankaanpainanta
related: URN:NBN:fi:au:hklj:767
related: URN:NBN:fi:au:hklj:798
related: Muodin historia
scope note: Kehrääminen, karstaus ja värjäys, niiden historia, materiaalit, tekniikka ja estetiikka Kehruu-, karstaus- ja värjäysohjeet ja -mallit Lankojen valmistus käsityönä Lankojen ja tekstiilien värjäys ja kasveilla värjäys käsityönä
scope note: Spinning, kardning och färgning, deras historia, material, tekniker och estetik Arbetsbeskrivningar och mönster för spinning, kardning och färgning Garnframställning som handarbete Färgning och växtfärgning av garn och textilier som handarbete @sv

Teatteritekniikka
type: Class
type: Concept
subclass of: URN:NBN:fi:au:hklj:770
alternative label: Efektit, teatteritekniikka (772)
alternative label: Erikoistehosteet, teatteritekniikka (772)
alternative label: Esiintymistaito, näyttelijän työ (772)
alternative label: Esittäminen, näyttelijän työ (772)
alternative label: Kaiku, teatterin akustiikka (772)
alternative label: Kasetit, äänitehosteet, teatteri (772)
alternative label: Kasvomaalaus (772)
alternative label: Katsomot, teatteritekniikka (772)
alternative label: Kulissit, teatteri (772)
alternative label: Lavastajat, teatteri, lavastajan työ (772)
alternative label: Lavasteet, teatteri (772)
alternative label: Lavastus, teatteri (772)
alternative label: Maskeeraus, teatteri (772)
alternative label: Metamusiikki, äänitehosteet, teatteri (772)
alternative label: Naamiaiset, kasvomaalaus (772)
alternative label: Naamiaiset, teatterinaamiot (772)
alternative label: Naamiointi, kasvomaalaus (772)
alternative label: Naamiointi, teatteri (772)
alternative label: Naamioituminen, kasvomaalaus (772)
alternative label: Naamioituminen, teatteri (772)
alternative label: Naamiot, teatterinaamiot (772)
alternative label: Näyttämöpuvut (772)
alternative label: Näyttämöt, teatteritekniikka (772)
alternative label: Näyttämötaide, teatteritekniikka (772)
alternative label: Näyttämötekniikka (772)
alternative label: Pukusuunnittelu, teatteri (772)
alternative label: Puvustus, teatteri (772)
alternative label: Rekvisiitta, teatteri (772)
alternative label: Skenografia, teatteri (772)
alternative label: Tarpeisto, teatteri (772)
alternative label: Tarpeistonhoitajat, teatteri (772)
alternative label: Teatteri, teatteritekniikka (772)
alternative label: Teatterilavastus (772)
alternative label: Teatterinaamiointi (772)
alternative label: Teatteripuvut (772)
alternative label: Teatteritekniikka (772)
alternative label: Teatterivalaistus (772)
alternative label: Tehosteet, teatteritekniikka (772)
alternative label: Vaatteet, näyttämöpuvut (772)
alternative label: Valaistus, teatteritekniikka (772)
alternative label: Valo, valaistus, teatteri (772)
alternative label: Valosuunnittelu, teatteri (772)
alternative label: Äänimaisema, äänitehosteet, teatteri (772)
alternative label: Äänisuunnittelu, teatteritekniikka (772)
alternative label: Äänitehosteet, teatteritekniikka (772)
alternative label: Ansiktsmålning (772) @sv
alternative label: Belysning, teaterteknik (772) @sv
alternative label: Effekter, teaterteknik (772) @sv
alternative label: Effektmedel, teaterteknik (772) @sv
alternative label: Eko, teaterakustik (772) @sv
alternative label: Framförande, skådespelarens arbete (772) @sv
alternative label: Förmåga att uppträda, skådespelarens arbete (772) @sv
alternative label: Iscensättning, teater (772) @sv
alternative label: Kamouflage, ansiktsmålning (772) @sv
alternative label: Kamouflage, teater (772) @sv
alternative label: Kassetter, ljudeffekter, teater (772) @sv
alternative label: Kläder, scendräkter (772) @sv
alternative label: Kostymdesign, teater (772) @sv
alternative label: Kostymering, teater (772) @sv
broader: URN:NBN:fi:au:hklj:770
in scheme: URN:NBN:fi:au:hklj:
notation: 772
related: Huoneakustiikka
related: Pukeutuminen. Kauneudenhoito
related: Kauneudenhoito
related: Kulttuurirakennukset
related: Harrastajateatteri
related: URN:NBN:fi:au:hklj:770.9
related: Suomi
related: Teatterimuodot
related: Nukketeatteri
related: Tanssitaide
related: Pantomiimi
related: Elokuva. Elokuvataide
related: New Age -musiikki. Rentoutusmusiikki
scope note: Teatteritekniikka ja sen historia yleensä Lavastus. Valaistus. Puvustus. Naamiointi. Kasvomaalaus. Tehosteet. Äänitehosteet Yksittäistä lavastajaa ym. koskevat henkilöhistorialliset teokset teatteritaiteen historiassa 770.9+ Tiettyä teatterimuotoa koskeva teatteritekniikka, sen historia ja henkilöhistoria ko. teatterimuodon luokassa
scope note: Teaterteknik och dess historia i allmänhet Scenografi. Belysning. Kostymering. Maskering. Ansiktsmålning. Effekter. Ljudeffekter Personhistoriska verk som handlar om enskilda scenografer o.dyl. förs till klassen för teaterhistoria 770.9+ Teaterteknik inom en bestämd teaterform samt dess historia och personhistoria förs till klassen för teaterformen @sv

Musiikin estetiikka ja filosofia
type: Class
type: Concept
subclass of: Musiikin filosofia, estetiikka, psykologia ja sosiologia Musiikkikasvatus. Musiikkiopetus
alternative label: Arvostelut, musiikki (781.1)
alternative label: Autenttisuus, musiikin filosofia (781.1)
alternative label: Formalismi, musiikin estetiikka (781.1)
alternative label: Kauneus, musiikin estetiikka (781.1)
alternative label: Kauneusihanteet, musiikin estetiikka (781.1)
alternative label: Kerronnallisuus, musiikin estetiikka (781.1)
alternative label: Kokemukset, musiikki (781.1)
alternative label: Kriitikot, kriitikon työ, musiikki (781.1)
alternative label: Kuunteleminen, musiikin estetiikka (781.1)
alternative label: Musiikin estetiikka (781.1)
alternative label: Musiikin filosofia (781.1)
alternative label: Musiikin kuuntelu (781.1)
alternative label: Musiikki-ikonografia (781.1)
alternative label: Musiikki-ikonologia (781.1)
alternative label: Musiikkianalyysi, musiikin estetiikka (781.1)
alternative label: Musiikkiarvostelut (781.1)
alternative label: Musiikkiesseet, musiikkiarvostelut (781.1)
alternative label: Musiikkifilosofia (781.1)
alternative label: Musiikkikritiikki (781.1)
alternative label: Musiikkisemiotiikka (781.1)
alternative label: Narratiivisuus, musiikin estetiikka (781.1)
alternative label: Rakenneanalyysi, musiikki (781.1)
alternative label: Reseptioestetiikka, musiikin estetiikka (781.1)
alternative label: Struktuurianalyysi, musiikki (781.1)
alternative label: Tarinallisuus, musiikin estetiikka (781.1)
alternative label: Vastaanotto, musiikin estetiikka (781.1)
alternative label: Yleisö, kuuntelijat, musiikki (781.1)
alternative label: Yleisö, musiikin kuuntelu (781.1)
alternative label: Autenticitet, musikens filosofi (781.1) @sv
alternative label: Erfarenheter, musik (781.1) @sv
alternative label: Formalism, musikens estetik (781.1) @sv
alternative label: Kritiker, kritikerns arbete, musik (781.1) @sv
alternative label: Lyssnande, musikens estetik (781.1) @sv
alternative label: Musik, lyssnarvanor (781.1) @sv
alternative label: Musikanalys, musikens estetik (781.1) @sv
alternative label: Musikens estetik (781.1) @sv
alternative label: Musikens filosofi (781.1) @sv
alternative label: Musikessäer, musikrecensioner (781.1) @sv
alternative label: Musikfilosofi (781.1) @sv
alternative label: Musikikonografi (781.1) @sv
alternative label: Musikikonologi (781.1) @sv
alternative label: Musikkritik (781.1) @sv
alternative label: Musikrecensioner (781.1) @sv
alternative label: Musiksemiotik (781.1) @sv
alternative label: Narrativitet, narratiivisuus, musikens estetik (781.1) @sv
alternative label: Narrativitet, tarinallisuus, musikens estetik (781.1) @sv
alternative label: Publik, lyssnare, musik (781.1) @sv
alternative label: Publik, musik, lyssnarvanor (781.1) @sv
alternative label: Recensioner, musik (781.1) @sv
alternative label: Reception, musikens estetik (781.1) @sv
alternative label: Receptionsestetik, musikens estetik (781.1) @sv
alternative label: Skönhet, musikens estetik (781.1) @sv
alternative label: Skönhetsideal, musikens estetik (781.1) @sv
alternative label: Strukturanalys, rakenneanalyysi, musik (781.1) @sv
alternative label: Strukturanalys, struktuurianalyysi, musik (781.1) @sv
broader: Musiikin filosofia, estetiikka, psykologia ja sosiologia Musiikkikasvatus. Musiikkiopetus
in scheme: URN:NBN:fi:au:hklj:
notation: 781.1
preferred label: Aesthetics and philosophy of music @en
preferred label: Musikestetik och musikfilosofi @sv
related: Esseet. Taidearvostelut
related: Musiikin psykologia. Musiikin akustiikka
related: Musiikin teoria
related: Rytmioppi
related: Säveloppi
related: Sointuoppi
related: URN:NBN:fi:au:hklj:782.4
related: Muoto-oppi
related: URN:NBN:fi:au:hklj:782.6
related: Johtaminen
related: Musiikin tulkinta. Tyylioppi
related: Notaatio
scope note: Musiikin yleinen estetiikka ja filosofia Musiikin arvostelu ja musiikkiarvostelut yleensä Musiikin kuuntelu yleensä Tiettyyn musiikin erikoisalaan liittyvä estetiikka ja filosofia sekä musiikkiarvostelu ja -arvostelut alan mukaisessa luokassa
scope note: Allmän musikestetik och musikfilosofi Musikkritik och musikrecensioner i allmänhet Musikavlyssning i allmänhet Estetik och filosofi samt musikkritik och musikrecensioner som rör ett bestämt specialområde inom musiken klassificeras enligt område @sv

Kuorot ilman säestystä
type: Class
type: Concept
subclass of: Kuorot (yli 9 laulajaa)
alternative label: A cappella, kuorolaulu (783.41 +)
alternative label: Kuoromusiikki, a cappella (783.41 +)
alternative label: Kuorot, a cappella (783.41 +)
alternative label: A cappella, körsång (783.41 +) @sv
alternative label: Körer, a cappella (783.41 +) @sv
alternative label: Körmusik, a cappella (783.41 +) @sv
broader: Kuorot (yli 9 laulajaa)
in scheme: URN:NBN:fi:au:hklj:
narrower: Sekakuorot
narrower: Mieskuorot
narrower: Naiskuorot
narrower: Lapsi- ja nuorisokuorot
notation: 783.41
preferred label: A cappella choirs @en
preferred label: Körsång a cappella @sv
related: URN:NBN:fi:au:hklj:770
related: URN:NBN:fi:au:hklj:784
related: URN:NBN:fi:au:hklj:784.111
related: URN:NBN:fi:au:hklj:788
related: URN:NBN:fi:au:hklj:789

Färsaaret
type: Class
type: Concept
subclass of: Tanska
broader: Tanska
in scheme: URN:NBN:fi:au:hklj:
notation: 784.1141
preferred label: Faroe Islands @en
preferred label: Färöarna @sv
related: URN:NBN:fi:au:hklj:473.1
related: URN:NBN:fi:au:hklj:769
related: URN:NBN:fi:au:hklj:783
related: URN:NBN:fi:au:hklj:783.1
related: URN:NBN:fi:au:hklj:787
related: URN:NBN:fi:au:hklj:787.2
related: URN:NBN:fi:au:hklj:787.29
related: URN:NBN:fi:au:hklj:788.8
related: URN:NBN:fi:au:hklj:789
related: URN:NBN:fi:au:hklj:795.1
related: URN:NBN:fi:au:hklj:797.2
related: URN:NBN:fi:au:hklj:807

Konsertot yhdelle näppäinsoittimelle
type: Class
type: Concept
subclass of: Konsertot
broader: Konsertot
in scheme: URN:NBN:fi:au:hklj:
narrower: Harppukonsertot
narrower: Kitarakonsertot
narrower: Luuttukonsertot
narrower: Mandoliinikonsertot
narrower: Konsertot muille näppäinsoittimille
notation: 785.625
preferred label: Concerti for a single plucked-string instrument @en
preferred label: Konserter för ett knäppinstrument @sv
related: URN:NBN:fi:au:hklj:785.4
related: URN:NBN:fi:au:hklj:786
related: URN:NBN:fi:au:hklj:789

Konsertot yhdelle jousisoittimelle
type: Class
type: Concept
subclass of: Konsertot
alternative label: Jousisoittimet, konsertot jousisoittimille (785.626 +)
alternative label: Stråkinstrument, konserter för stråkinstrument (785.626 +) @sv
broader: Konsertot
in scheme: URN:NBN:fi:au:hklj:
narrower: Viulukonsertot
narrower: Alttoviulukonsertot
narrower: Sellokonsertot
narrower: Kontrabassokonsertot
narrower: Konsertot muille jousisoittimille
notation: 785.626
preferred label: Concerti for a single bowed-string instrument @en
preferred label: Konserter för ett stråkinstrument @sv
related: URN:NBN:fi:au:hklj:785.4
related: URN:NBN:fi:au:hklj:786
related: URN:NBN:fi:au:hklj:789

Konsertot yhdelle vaskipuhaltimelle
type: Class
type: Concept
subclass of: Konsertot
broader: Konsertot
in scheme: URN:NBN:fi:au:hklj:
narrower: Käyrätorvikonsertot
narrower: Trumpettikonsertot
narrower: Pasuunakonsertot
narrower: Tuubakonsertot
narrower: Konsertot muille vaskipuhaltimille
notation: 785.628
preferred label: Concerti for a single brass instrument @en
preferred label: Konserter för ett bleckblåsinstrument @sv
related: URN:NBN:fi:au:hklj:785.4
related: URN:NBN:fi:au:hklj:786
related: URN:NBN:fi:au:hklj:789

Cembalo
type: Class
type: Concept
subclass of: Kosketinsoittimet
alternative label: Cembalo (786.12 +)
alternative label: Harpsichord (786.12 +)
alternative label: Kielflügel (786.12 +)
alternative label: Klavikordi (786.12 +)
alternative label: Spinetti (786.12 +)
alternative label: Virginaali (786.12 +)
alternative label: Klavikord (786.12 +) @sv
alternative label: Spinett (786.12 +) @sv
alternative label: Virginal (786.12 +) @sv
broader: Kosketinsoittimet
in scheme: URN:NBN:fi:au:hklj:
narrower: Koulut, harjoituskappaleet ja -etydit
notation: 786.12
preferred label: Harpsichord @en
related: URN:NBN:fi:au:hklj:627.7531
related: URN:NBN:fi:au:hklj:681
related: URN:NBN:fi:au:hklj:781.5
related: URN:NBN:fi:au:hklj:782.6
related: URN:NBN:fi:au:hklj:785
related: URN:NBN:fi:au:hklj:785.11
related: URN:NBN:fi:au:hklj:788
related: URN:NBN:fi:au:hklj:789
scope note: Tässä ja alaluokissa myös klavesiini, virginaali ja spinetti
scope note: Hit och till underklasserna också klavecin, virginal och spinett @sv

Harmoni
type: Class
type: Concept
subclass of: Kosketinsoittimet
alternative label: Harmoni (786.15 +)
alternative label: Polkuharmoni (786.15 +)
alternative label: Urkuharmoni (786.15 +)
alternative label: Orgelharmoni (786.15 +) @sv
alternative label: Orgelharmonium (786.15 +) @sv
alternative label: Tramporgel (786.15 +) @sv
broader: Kosketinsoittimet
in scheme: URN:NBN:fi:au:hklj:
narrower: Koulut, harjoituskappaleet ja -etydit
notation: 786.15
preferred label: Harmonium @en
related: URN:NBN:fi:au:hklj:627.7531
related: URN:NBN:fi:au:hklj:681
related: URN:NBN:fi:au:hklj:781.5
related: URN:NBN:fi:au:hklj:782.6
related: URN:NBN:fi:au:hklj:785
related: URN:NBN:fi:au:hklj:785.11
related: URN:NBN:fi:au:hklj:788
related: URN:NBN:fi:au:hklj:789

Muut puhallinsoittimet
type: Class
type: Concept
subclass of: URN:NBN:fi:au:hklj:786
alternative label: Alppitorvi (786.6 +)
alternative label: Ansatsi, puhallinsoittimet (786.4 ... 786.6 +)
alternative label: Asete, puhallinsoittimet (786.4 ... 786.6 +)
alternative label: Huuliharppu (786.6 +)
alternative label: Luonnontorvet (786.6 +)
alternative label: Luuri, luonnontorvi (786.6 +)
alternative label: Melodika (786.6 +)
alternative label: Musette, puhallinsoitin (786.6)
alternative label: Okariina (786.6)
alternative label: Postitorvi (786.6 +)
alternative label: Puhallinsoittimet, muut puhallinsoittimet (786.6 +)
alternative label: Puhallussoittimet, muut puhallinsoittimet (786.6 +)
alternative label: Säkkipilli, puhaltimet (786.6 +)
alternative label: Tuohisoittimet (786.6 +)
alternative label: Alphorn (786.6 +) @sv
alternative label: Ansats, ansatsi (786.4 ... 786.6 +) @sv
alternative label: Ansats, asete (786.4 ... 786.6 +) @sv
alternative label: Blåsinstrument, andra blåsinstrument (786.6 +) @sv
alternative label: Lur, naturhorn (786.6 +) @sv
alternative label: Munspel (786.6 +) @sv
alternative label: Musette, blåsinstrument (786.6) @sv
alternative label: Naturhorn (786.6 +) @sv
alternative label: Näverinstrument (786.6 +) @sv
alternative label: Okarina (786.6) @sv
alternative label: Posthorn (786.6 +) @sv
alternative label: Säckpipa, blåsinstrument (786.6 +) @sv
broader: URN:NBN:fi:au:hklj:786
in scheme: URN:NBN:fi:au:hklj:
narrower: Koulut, harjoituskappaleet ja -etydit
notation: 786.6
preferred label: Other wind instruments @en
preferred label: Andra blåsinstrument @sv
related: URN:NBN:fi:au:hklj:627.7531
related: URN:NBN:fi:au:hklj:681
related: URN:NBN:fi:au:hklj:781.5
related: URN:NBN:fi:au:hklj:782.6
related: URN:NBN:fi:au:hklj:785
related: URN:NBN:fi:au:hklj:785.11
related: URN:NBN:fi:au:hklj:788
related: URN:NBN:fi:au:hklj:789
scope note: Tässä ja alaluokassa esim. huuliharppu ja melodica
scope note: Hit och till underklasserna t.ex. munspel och melodika @sv

Rock and roll. Rockabilly
type: Class
type: Concept
subclass of: Rock. Pop
alternative label: Rock and roll (788.331)
alternative label: Rockabilly (788.331)
broader: Rock. Pop
in scheme: URN:NBN:fi:au:hklj:
notation: 788.331
related: URN:NBN:fi:au:hklj:782.4
related: URN:NBN:fi:au:hklj:783
related: URN:NBN:fi:au:hklj:783.1
related: URN:NBN:fi:au:hklj:785.7
related: URN:NBN:fi:au:hklj:786.8
related: URN:NBN:fi:au:hklj:787.112
related: Folk. Country
related: Aasialainen maailmanmusiikki. Aasialainen etninen pop ja viihdemusiikki
related: URN:NBN:fi:au:hklj:789
related: URN:NBN:fi:au:hklj:795

Suomenkielinen viihdemusiikki
type: Class
type: Concept
subclass of: Viihdemusiikki
alternative label: Rillumareimusiikki (788.41)
alternative label: Rillumareimusik (788.41) @sv
broader: Viihdemusiikki
in scheme: URN:NBN:fi:au:hklj:
notation: 788.41
preferred label: Finnish light music @en
preferred label: Underhållningsmusik på finska @sv
related: Tanssitaide
related: URN:NBN:fi:au:hklj:782.4
related: URN:NBN:fi:au:hklj:783
related: URN:NBN:fi:au:hklj:783.1
related: URN:NBN:fi:au:hklj:785.7
related: URN:NBN:fi:au:hklj:786.8
related: URN:NBN:fi:au:hklj:787.112
related: Eurooppalainen maailmanmusiikki. Europpalainen etninen pop ja viihdemusikki
related: URN:NBN:fi:au:hklj:789
related: URN:NBN:fi:au:hklj:795

Saksankielinen viihdemusiikki
type: Class
type: Concept
subclass of: Viihdemusiikki
broader: Viihdemusiikki
in scheme: URN:NBN:fi:au:hklj:
notation: 788.43
preferred label: German light music @en
preferred label: Underhållningsmusik på tyska @sv
related: Tanssitaide
related: URN:NBN:fi:au:hklj:782.4
related: URN:NBN:fi:au:hklj:783
related: URN:NBN:fi:au:hklj:783.1
related: URN:NBN:fi:au:hklj:785.7
related: URN:NBN:fi:au:hklj:786.8
related: URN:NBN:fi:au:hklj:787.112
related: Eurooppalainen maailmanmusiikki. Europpalainen etninen pop ja viihdemusikki
related: URN:NBN:fi:au:hklj:789
related: URN:NBN:fi:au:hklj:795

Englanninkielinen viihdemusiikki
type: Class
type: Concept
subclass of: Viihdemusiikki
alternative label: Barbershop-musiikki (788.44)
alternative label: Barbershop (788.44) @sv
broader: Viihdemusiikki
in scheme: URN:NBN:fi:au:hklj:
notation: 788.44
preferred label: English light music @en
preferred label: Underhållningsmusik på engelska @sv
related: Tanssitaide
related: URN:NBN:fi:au:hklj:782.4
related: URN:NBN:fi:au:hklj:783
related: URN:NBN:fi:au:hklj:783.1
related: URN:NBN:fi:au:hklj:785.7
related: URN:NBN:fi:au:hklj:786.8
related: URN:NBN:fi:au:hklj:787.112
related: Eurooppalainen maailmanmusiikki. Europpalainen etninen pop ja viihdemusikki
related: URN:NBN:fi:au:hklj:789
related: URN:NBN:fi:au:hklj:795

Ranskankielinen viihdemusiikki
type: Class
type: Concept
subclass of: Viihdemusiikki
broader: Viihdemusiikki
in scheme: URN:NBN:fi:au:hklj:
notation: 788.45
preferred label: French light music @en
preferred label: Underhållningsmusik på franska @sv
related: Tanssitaide
related: URN:NBN:fi:au:hklj:782.4
related: URN:NBN:fi:au:hklj:783
related: URN:NBN:fi:au:hklj:783.1
related: URN:NBN:fi:au:hklj:785.7
related: URN:NBN:fi:au:hklj:786.8
related: URN:NBN:fi:au:hklj:787.112
related: Eurooppalainen maailmanmusiikki. Europpalainen etninen pop ja viihdemusikki
related: URN:NBN:fi:au:hklj:789
related: URN:NBN:fi:au:hklj:795

Italiankielinen viihdemusiikki
type: Class
type: Concept
subclass of: Viihdemusiikki
broader: Viihdemusiikki
in scheme: URN:NBN:fi:au:hklj:
notation: 788.46
preferred label: Italian light music @en
preferred label: Underhållningsmusik på italienska @sv
related: Tanssitaide
related: URN:NBN:fi:au:hklj:782.4
related: URN:NBN:fi:au:hklj:783
related: URN:NBN:fi:au:hklj:783.1
related: URN:NBN:fi:au:hklj:785.7
related: URN:NBN:fi:au:hklj:786.8
related: URN:NBN:fi:au:hklj:787.112
related: Eurooppalainen maailmanmusiikki. Europpalainen etninen pop ja viihdemusikki
related: URN:NBN:fi:au:hklj:789
related: URN:NBN:fi:au:hklj:795

Espanjankielinen viihdemusiikki
type: Class
type: Concept
subclass of: Viihdemusiikki
alternative label: Vallenata (788.48)
broader: Viihdemusiikki
in scheme: URN:NBN:fi:au:hklj:
notation: 788.48
preferred label: Spanish light music @en
preferred label: Underhållningsmusik på spanska @sv
related: Tanssitaide
related: URN:NBN:fi:au:hklj:782.4
related: URN:NBN:fi:au:hklj:783
related: URN:NBN:fi:au:hklj:783.1
related: URN:NBN:fi:au:hklj:785.7
related: URN:NBN:fi:au:hklj:786.8
related: URN:NBN:fi:au:hklj:787.112
related: Eurooppalainen maailmanmusiikki. Europpalainen etninen pop ja viihdemusikki
related: URN:NBN:fi:au:hklj:789
related: URN:NBN:fi:au:hklj:795

Kreikankielinen viihdemusiikki
type: Class
type: Concept
subclass of: Muunkielinen viihdemusiikki
alternative label: Laika (788.491)
alternative label: Rebetika, kreikkalainen viihdemusiikki (788.491)
alternative label: Rebetika, grekisk underhållningsmusik (788.491) @sv
broader: Muunkielinen viihdemusiikki
in scheme: URN:NBN:fi:au:hklj:
notation: 788.491
preferred label: Greek light music @en
preferred label: Underhållningsmusik på grekiska @sv
related: Tanssitaide
related: URN:NBN:fi:au:hklj:782.4
related: URN:NBN:fi:au:hklj:783
related: URN:NBN:fi:au:hklj:783.1
related: URN:NBN:fi:au:hklj:785.7
related: URN:NBN:fi:au:hklj:786.8
related: URN:NBN:fi:au:hklj:787.112
related: Eurooppalainen maailmanmusiikki. Europpalainen etninen pop ja viihdemusikki
related: URN:NBN:fi:au:hklj:789
related: URN:NBN:fi:au:hklj:795

Portugalinkielinen viihdemusiikki
type: Class
type: Concept
subclass of: Muunkielinen viihdemusiikki
alternative label: Fadot, laulelmat (788.492)
alternative label: Fado, visor (788.492) @sv
broader: Muunkielinen viihdemusiikki
in scheme: URN:NBN:fi:au:hklj:
notation: 788.492
preferred label: Portuguese light music @en
preferred label: Underhållningsmusik på portugisiska @sv
related: Tanssitaide
related: URN:NBN:fi:au:hklj:782.4
related: URN:NBN:fi:au:hklj:783
related: URN:NBN:fi:au:hklj:783.1
related: URN:NBN:fi:au:hklj:785.7
related: URN:NBN:fi:au:hklj:786.8
related: URN:NBN:fi:au:hklj:787.112
related: Eurooppalainen maailmanmusiikki. Europpalainen etninen pop ja viihdemusikki
related: URN:NBN:fi:au:hklj:789
related: URN:NBN:fi:au:hklj:795

Vironkielinen viihdemusiikki
type: Class
type: Concept
subclass of: Muunkielinen viihdemusiikki
broader: Muunkielinen viihdemusiikki
in scheme: URN:NBN:fi:au:hklj:
notation: 788.493
preferred label: Estonian light music @en
preferred label: Underhållningsmusik på estniska @sv
related: Tanssitaide
related: URN:NBN:fi:au:hklj:782.4
related: URN:NBN:fi:au:hklj:783
related: URN:NBN:fi:au:hklj:783.1
related: URN:NBN:fi:au:hklj:785.7
related: URN:NBN:fi:au:hklj:786.8
related: URN:NBN:fi:au:hklj:787.112
related: Eurooppalainen maailmanmusiikki. Europpalainen etninen pop ja viihdemusikki
related: URN:NBN:fi:au:hklj:789
related: URN:NBN:fi:au:hklj:795

Baltian maat
type: Class
type: Concept
subclass of: Pohjoismaat. Baltian maat
alternative label: Baltia, musiikinhistoria (789.216 +)
alternative label: Baltikum, musikhistoria (789.216 +) @sv
broader: Pohjoismaat. Baltian maat
in scheme: URN:NBN:fi:au:hklj:
narrower: Viro
narrower: Latvia
narrower: Liettua
notation: 789.216
preferred label: Baltic countries @en
preferred label: Baltikum @sv
related: URN:NBN:fi:au:hklj:709
related: URN:NBN:fi:au:hklj:782.4
related: URN:NBN:fi:au:hklj:783
related: URN:NBN:fi:au:hklj:789.1
scope note: Baltian maiden musiikin historian yleisteokset
scope note: Allmänna verk som rör den baltiska musikens historia @sv

Suomenkielisen lasten- ja nuortenkirjallisuuden historia ja tutkimus
type: Class
type: Concept
subclass of: Suomenkielisen kirjallisuuden aihepiirejä ja kirjallisuustyyppejä koskeva historia ja tutkimus
alternative label: Aarnikotkat, lastenkirjallisuuden tutkimus, suomi (816.1)
alternative label: Ensikirjat, lastenkirjallisuuden tutkimus, suomi (816.1)
alternative label: Feeniks-lintu, lastenkirjallisuuden tutkimus, suomi (816.1)
alternative label: Feniks, lastenkirjallisuuden tutkimus, suomi (816.1)
alternative label: Griipit, lastenkirjallisuuden tutkimus, suomi (816.1)
alternative label: Haltiat, lastenkirj.tutk., suomi (816.1)
alternative label: Haltijat, lastenkirjallisuuden tutkimus, suomi (816.1)
alternative label: Hevoskirjat, nuortenkirj.tutk., suomi (816.1)
alternative label: Ihmesadut, lastenkirj.tutk., suomi (816.1)
alternative label: Jättiläiset, lastenkirjallisuuden tutkimus, suomi (816.1)
alternative label: Kansansadut, lastenkirj.tutk., suomi (816.1)
alternative label: Kansantarinat, lastenkirj.tutk., suomi (816.1)
alternative label: Katselukirjat, lastenkirjallisuuden tutkimus, suomi (816.1)
alternative label: Keijukaiset, lastenkirjallisuuden tutkimus, suomi (816.1)
alternative label: Keijut, lastenkirjallisuuden tutkimus, suomi (816.1)
alternative label: Koskettelukirjat, lastenkirjalloisuuden tutkimus, suomi (816.1)
alternative label: Kuvakirjat, lastenkirj. tutk., suomi (816.1)
alternative label: Lastenkirjailijat, lastenkirjallisuuden tutkimus, suomi (816.1)
alternative label: Lastenkirjallisuus, lastenkirj.tutk., suomi (816.1)
alternative label: Lastenkulttuuri, lastenkirjallisuuden tutkimus, suomi (816.1)
alternative label: Lastenlorut, lastenkirjallisuuden tutkimus, suomi (816.1)
alternative label: Lastennäytelmät, lastenkirj.tutk., suomi (816.1)
alternative label: Lastenrunot, lastenkirj.tutk., suomi (816.1)
alternative label: Lorut, lastenkirjallisuuden tutkimus, suomi (816.1)
alternative label: Merenneidot, lastenkirjallisuuden tutkimus, suomi (816.1)
alternative label: Nuorisonäytelmät, kirjallisuudentutkimus, suomi (816.1)
alternative label: Nuorisoromaanit, kirjallisuudentutkimus, suomi (816.1)
alternative label: Nuortenkirjailijat, lastenkirjallisuuden tutkimus, suomi (816.1)
alternative label: Nuortenkirjallisuus, kirjallisuudentutkimus, suomi (816.1)
alternative label: Peikot, lastenkirj.tutk., suomi (816.1)
alternative label: Pilasadut, lastenkirj.tutk., suomi (816.1)
alternative label: Poikakirjat, kirjallisuudentutkimus, suomi (816.1)
alternative label: Prinsessat, lastenkirjallisuuden tutkimus, suomi (816.1)
alternative label: Prinssit, lastenkirjallisuuden tutkimus, suomi (816.1)
alternative label: Puuhakirjat, lastenkirjallisuuden tutkimus, suomi (816.1)
alternative label: Runokuvakirjat, lastenkirj.tutk., suomi (816.1)
alternative label: Sadut, lastenkirjallisuuden tutkimus, suomi (816.1)
alternative label: Satuhahmot, lastenkirjallisuuden tutkimus, suomi (816.1)
alternative label: Satuolennot, lastenkirjallisuuden tutkimus, suomi (816.1)
alternative label: Taruolennot, lastenkirjallisuuden tutkimus, suomi (816.1)
alternative label: Tyttökirjat, nuortenkirj.tutk., suomi (816.1)
alternative label: Vedenhaltijat , lastenkirjallisuuden tutkimus, suomi (816.1)
alternative label: Vedenneidot, lastenkirjallisuuden tutkimus, suomi (816.1)
alternative label: Alfer, barnlitteraturforskning, finska (816.1) @sv
alternative label: Barnboksförfattare, barnlitteraturforskning, finska (816.1) @sv
alternative label: Barnkultur, barnlitteraturforskning, finska (816.1) @sv
alternative label: Barnlitteratur, barnlitt.forskning, finska (816.1) @sv
alternative label: Barnlyrik, barnlitt.forskning, finska (816.1) @sv
alternative label: Barnpjäser, barnlitt.forskning, finska (816.1) @sv
alternative label: Barnramsor, barnlitteraturforskning (816.1) @sv
alternative label: Bilderböcker, barnlitt.forskning, finska (816.1) @sv
alternative label: Diktbilderböcker, barnlitt.forskning, finska (816.1) @sv
alternative label: Fenix, barnlitteratur, forskning, finska (816.1) @sv
alternative label: Flickböcker, ungdomslitteraturforskning, finska (816.1) @sv
alternative label: Folksagor, barnlitt.forskning, finska (816.1) @sv
alternative label: Folksägner, barnlitt.forskning, finska (816.1) @sv
alternative label: Fågeln Fenix, barnlitteratur, forskning, finska (816.1) @sv
alternative label: Gripar, aarnikotkat, barnlitteratur, forskning, finska (816.1) @sv
alternative label: Gripar, griipit, barnlitteratur, forskning, finska (816.1) @sv
alternative label: Havsnymfer, barnlitteraturforskning, finska (816.1) @sv
broader: Suomenkielisen kirjallisuuden aihepiirejä ja kirjallisuustyyppejä koskeva historia ja tutkimus
in scheme: URN:NBN:fi:au:hklj:
notation: 816.1
related: URN:NBN:fi:au:hklj:060
related: URN:NBN:fi:au:hklj:1
related: URN:NBN:fi:au:hklj:357.1
related: URN:NBN:fi:au:hklj:749.1
related: Piirustuksen materiaalit ja tekniikka
related: Pilapiirrokset. Karikatyyrit
related: Kuvitustaide
related: Lasten- ja nuortenkirjallisuuden historia ja tutkimus
related: Suomenkielisen kirjallisuuden historia ja tutkimus
related: Pohjoismaisten kielten kirjallisuuden historia ja tutkimus
related: Suomenruotsalaisen kirjallisuuden historia ja tutkimus
related: Suomen kieli
scope note: Suomenkielisten satujen ja kuvakirjojen historia ja tutkimus Lapsille ja nuorille tarkoitettujen suomenkielisten runojen, näytelmä- ja kertomakirjallisuuden sekä sarjakuvien historia ja tutkimus Suomenkielisen lasten- ja nuortenkirjallisuuden eri aihepiirien historia ja tutkimus Yksittäistä kirjailijaa tai hänen tuotantoaan koskevat teokset ovat kuitenkin aina luokassa 811 Suomenkielisen lasten- ja nuorten tietokirjallisuuden historia ja tutkimus yleensä Tietyn alan tietokirjallisuus sekä sen historia ja tutkimus alan mukaisessa luokassa
scope note: De finska sagornas och bilderböckernas litteraturhistoria och forskning i de finska sagorna och bilderböckerna Litteraturhistoria och litteraturforskning som rör finsk poesi, dramalitteratur, episk litteratur och finska tecknade serier skrivna för barn och unga Litteraturhistoria och litteraturforskning som rör olika temaområden inom finsk barn- och ungdomslitteratur Verk som handlar om enskilda författare och deras produktion förs dock alltid till klass 811 Hit också litteraturhistoria och litteraturforskning som rör finsk facklitteratur för barn och unga i allmänhet Facklitteratur som hänför sig till ett bestämt område samt litteraturhistoria och litteraturforskning som rör sådan facklitteratur klassificeras enligt område @sv

Esi- ja varhaishistoria vuoteen 1154
type: Class
type: Concept
subclass of: URN:NBN:fi:au:hklj:920
alternative label: Arkeologia, Suomi (921)
alternative label: Askolan kulttuuri (921)
alternative label: Hiidenkiukaat, Suomen arkeologia (921)
alternative label: Kalmistot, Suomen arkeologia (921)
alternative label: Kampakeraaminen kulttuuri, Suomen historia (921)
alternative label: Kiukaisten kulttuuri (921)
alternative label: Kuoppakeraaminen kulttuuri, Suomi (921)
alternative label: Linnavuoret, Suomen arkeologia (921)
alternative label: Merovingiaika, Suomen historia (921)
alternative label: Nuorakeraaminen kulttuuri, Suomen arkeologia (921)
alternative label: Pronssikausi, Suomi (921)
alternative label: Rautakausi, Suomi (921)
alternative label: Roomalainen rautakausi, Suomen historia (921)
alternative label: Suomen historia, esi- ja varhaishistoria (921)
alternative label: Suomusjärven kulttuuri (921)
alternative label: Varhaismetallikausi, Suomi (921)
alternative label: Vasarakirveskulttuuri, Suomen arkeologia (921)
alternative label: Viikingit, Suomen historia (921)
alternative label: Viikinkiaika, Suomen historia (921)
alternative label: Viikinkiretket, Suomen historia (921)
alternative label: Arkeologi, Finland (921) @sv
alternative label: Askolakulturen (921) @sv
alternative label: Borgberg, Finlands arkeologi (921) @sv
alternative label: Bronsåldern, Finland (921) @sv
alternative label: Finlands historia, förhistoria och tidig historia (921) @sv
alternative label: Gravfält, Finlands arkeologi (921) @sv
alternative label: Gropkeramiska kulturen, Finland (921) @sv
alternative label: Järnåldern, Finland (921) @sv
alternative label: Kamkeramiska kulturen, Finlands historia (921) @sv
alternative label: Kiukaiskulturen (921) @sv
alternative label: Merovingertiden, Finlands historia (921) @sv
alternative label: Romersk järnålder, Finlands historia (921) @sv
alternative label: Rösen, Finlands arkeologi (921) @sv
alternative label: Snörkeramiska kulturen, Finlands arkeologi (921) @sv
alternative label: Stridsyxekultur, Finlands arkeologi (921) @sv
alternative label: Suomusjärvikulturen (921) @sv
alternative label: Tidig metallålder, Finland (921) @sv
alternative label: Vikingafärder, Finlands historia (921) @sv
alternative label: Vikingar, Finlands historia (921) @sv
alternative label: Vikingatiden, Finlands historia (921) @sv
broader: URN:NBN:fi:au:hklj:920
in scheme: URN:NBN:fi:au:hklj:
notation: 921
preferred label: Ancient history to 1154 @en
preferred label: Förhistoria och fornhistoria till 1154 @sv
related: URN:NBN:fi:au:hklj:061
related: Suomi
related: Suomen ulkopolitiikka
related: URN:NBN:fi:au:hklj:411
related: Suomenruotsalaisten asuma-alueet
related: Suomen yleinen taidehistoria
related: URN:NBN:fi:au:hklj:909
related: Vanhan ajan historia
related: URN:NBN:fi:au:hklj:919
related: URN:NBN:fi:au:hklj:930
related: Esi- ja varhaishistoria
related: Neuvostoliiton historia 1945-1991
scope note: Tässä myös Suomen arkeologian yleisteokset
scope note: Hit också allmänna verk om Finlands arkeologi @sv

Venäjän historia vuoteen 1917
type: Class
type: Concept
subclass of: Venäjän historia
alternative label: Anarkismi, Venäjän historia (971.2 +)
alternative label: Tsaarit (971.2 +)
alternative label: Anarkism, Rysslands historia (971.2 +) @sv
alternative label: Tsarer (971.2 +) @sv
broader: Venäjän historia
in scheme: URN:NBN:fi:au:hklj:
narrower: Venäjän vanha ja keskiaika
narrower: Venäjän historia 1682-1856
narrower: Venäjän historia 1857-1917
notation: 971.2
preferred label: Russia's history to 1917 @en
preferred label: Rysslands historia till 1917 @sv
related: Menetetty Karjalan alue
related: Lappi
related: Armenia. Azerbaidzan. Georgia. Kazakstan. Kirgisia. Tadzikistan. Turkmenistan. Uzbekistan
related: URN:NBN:fi:au:hklj:909
related: URN:NBN:fi:au:hklj:919
related: Aasian historia
related: URN:NBN:fi:au:hklj:989
scope note: Vallankumousta edeltäneen Venäjän historian yleisteokset Tässä ja alaluokissa sekä Venäjän Euroopan että Aasian puoleisten alueiden historia vuoteen 1917 Tässä ja alaluokissa myös Siperian historia vuoteen 1917
scope note: Allmänna verk om Rysslands historia före revolutionen Hit och till underklasserna historiska verk om både de europeiska och de asiatiska områdena av Ryssland till 1917 Hit och till underklasserna också Sibiriens historia till 1917 @sv

Venäjän historia 1992-
type: Class
type: Concept
subclass of: Venäjän historia
alternative label: Karjalan kannas, historia vuodesta 1945 (971.8)
alternative label: Karjalankannas, historia vuodesta 1945 (971.8)
alternative label: Luovutettu Karjala, historia vuodesta 1992 (971.8)
alternative label: Luovutetut alueet, historia vuodesta 1992 (971.8)
alternative label: Petsamo, historia vuodesta 1992 (971.8)
alternative label: Sallan alue, historia vuodesta 1992 (971.8)
alternative label: Viipuri, historia vuodesta 1992 (971.8)
alternative label: Viipurin lääni, historia vuodesta 1992 (971.8)
alternative label: Avträdda Karelen, historia från år 1992 (971.8) @sv
alternative label: Avträdda områden, historia från år 1992 (971.8) @sv
alternative label: Karelska näset, historia från år 1945 (971.8) @sv
alternative label: Petsamo, historia från år 1992 (971.8) @sv
alternative label: Sallaområdet, historia från år 1992 (971.8) @sv
alternative label: Viborg, historia från år 1992 (971.8) @sv
alternative label: Viborgs län, historia från år 1992 (971.8) @sv
broader: Venäjän historia
in scheme: URN:NBN:fi:au:hklj:
notation: 971.8
preferred label: Russia's history 1992- @en
preferred label: Rysslands historia 1992- @sv
related: Menetetty Karjalan alue
related: Lappi
related: Armenia. Azerbaidzan. Georgia. Kazakstan. Kirgisia. Tadzikistan. Turkmenistan. Uzbekistan
related: URN:NBN:fi:au:hklj:909
related: URN:NBN:fi:au:hklj:919
related: URN:NBN:fi:au:hklj:920
related: Ukrainan, Valko-Venäjän ja Moldovan historia
related: Ukrainan historia
related: Valko-Venäjän historia
related: Moldovan historia
related: Aasian historia
related: Armenian, Azerbaidzanin, Georgian, Kazakstanin, Kirgisian, Tadzikistanin, Turkmenistanin ja Uzbekistanin historia
related: URN:NBN:fi:au:hklj:989
scope note: Tässä sekä Venäjän Euroopan että Aasian puoleisten alueiden historia 1992- Tässä myös Siperian historia 1992- Tässä myös menetettyjen Karjalan, Petsamon ja Sallan alueiden historia 1992- Karjalan tasavallan ja Murmanskin alueen historia 1992-
scope note: Hit historiska verk om både de europeiska och de asiatiska områdena av Ryssland 1992- Hit också Sibiriens historia 1992- Hit också det avträdda Karelens och de avträdda Petsamo- och Sallaområdenas historia till 1992- Sovjetkarelens och Murmanskregionens historia 1992- @sv

Armenian, Azerbaidzanin, Georgian, Kazakstanin, Kirgisian, Tadzikistanin, Turkmenistanin ja Uzbekistanin historia
type: Class
type: Concept
subclass of: Aasian historia
alternative label: Armenia, historia (981.6)
alternative label: Azerbaidzan, historia (981.6)
alternative label: Jakutia, historia (981.6)
alternative label: Kamtsatka, historia (981.6)
alternative label: Kazakstan, historia (981.6)
alternative label: Keski-Aasia, IVY-maat, historia (981.6)
alternative label: Kirgisia, historia (981.6)
alternative label: Kuriilit, Venäjä, historia (981.6)
alternative label: Tadzikistan, historia (981.6)
alternative label: Tsetsenia, historia (981.6)
alternative label: Turkmenistan, historia (981.6)
alternative label: Uzbekistan, historia (981.6)
alternative label: Venäläistämispolitiikka, IVY:n Aasian puoleisten maiden historia (981.6)
alternative label: Armenien, historia (981.6) @sv
alternative label: Azerbajdzjan, historia (981.6) @sv
alternative label: Jakutien, historia (981.6) @sv
alternative label: Kamtjatka, historia (981.6) @sv
alternative label: Kirgisien, historia (981.6) @sv
alternative label: Kurilerna, Ryssland, historia (981.6) @sv
alternative label: Tadzjikistan, historia (981.6) @sv
alternative label: Tjetjenien, historia (981.6) @sv
broader: Aasian historia
in scheme: URN:NBN:fi:au:hklj:
notation: 981.6
preferred label: History of Armenia. Azerbaijan. Georgia. Kazakhstan. Kirgisia. Tajikistan. Turkmenistan and Uzbekistan @en
preferred label: Armeniens, Azerbajdjans, Georgiens, Kazakstans, Kirgisistans, Tadjikistans, Turkmenistans och Uzbekistans historia @sv
related: AASIA
related: Armenia. Azerbaidzan. Georgia. Kazakstan. Kirgisia. Tadzikistan. Turkmenistan. Uzbekistan
related: URN:NBN:fi:au:hklj:970
related: Venäjän historia
related: Neuvostoliiton historia 1917-1991
related: Venäjän historia 1992-
related: Keski- ja Itä-Aasian historia
scope note: Armenian, Azerbaidzanin, Georgian, Kazakstanin, Kirgisian, Tadzikistanin, Turkmenistanin ja Uzbekistanin historia. Tässä myös Abhasian historia.
scope note: Armeniens, Azerbajdjans, Georgiens, Kazakstans, Kirgisistans, Tadjikistans, Turkmenistans och Uzbekistans historia. Hit också Abchaziens historia. @sv

Yhdysvaltojen historia
type: Class
type: Concept
subclass of: Amerikan historia
alternative label: Alaska, historia (987.2 +)
alternative label: Aleutit, historia (987.2 +)
alternative label: Georgia, Yhdysvallat, historia (987.2 +)
alternative label: Intiaanisodat, Yhdysvallat (987.2 +)
alternative label: New York, historia (987.2 +)
alternative label: Pohjois-Amerikka, Yhdysvallat, historia (987.2 +)
alternative label: Reservaatit, intiaanit, historia (987.2 +)
alternative label: USA, historia (987.2 +)
alternative label: Villi länsi, Yhdysvaltojen historia (987.2 +)
alternative label: Yhdysvallat, historia (987.2 +)
alternative label: Aleuterna, historia (987.2 +) @sv
alternative label: Förenta staterna, historia (987.2 +) @sv
alternative label: Georgien, Förenta staterna, historia (987.2 +) @sv
alternative label: Indiankrig, Förenta staterna (987.2 +) @sv
alternative label: Nordamerika, Förenta staterna, historia (987.2 +) @sv
alternative label: Reservat, indianer, historia (987.2 +) @sv
alternative label: Vilda västern, Förenta staternas historia (987.2 +) @sv
broader: Amerikan historia
in scheme: URN:NBN:fi:au:hklj:
narrower: Yhdysvaltojen historia vuoteen 1775
narrower: Yhdysvaltojen historia 1775-1860
narrower: Yhdysvaltojen historia 1861-1938
narrower: Yhdysvaltojen historia 1939-
notation: 987.2
preferred label: History of the United States of America @en
preferred label: Förenta staternas historia @sv
related: Pohjois-Amerikka
related: Yhdysvallat, USA
related: New York
related: Keski-Amerikan historia
related: URN:NBN:fi:au:hklj:989
scope note: Yhdysvaltojen historian yleisteokset Tässä myös Alaskan historia Jos teos koskee vähintään kolmea luokkien 987.2+ aikakautta, se kuuluu pääluokkaan 987.2 Jos teos koskee samassa määrin kahta aikakautta, se kuuluu varhaisemman aikakauden luokkaan, muuten siihen luokkaan, johon se selvästi painottuu
scope note: Allmänna verk om Förenta staternas historia Hit också Alaskas historia Om verket handlar om minst tre tidsperioder inom klasserna 987.2+ förs det till huvudklass 987.2 Om verket behandlar två tidsperioder jämbördigt förs det till klassen för den tidigare tidsperioden, i andra fall till klassen för den tidsperiod som klart dominerar i verket @sv

Suomi
type: Class
type: Concept
subclass of: HENKILÖ- JA SUKUHISTORIA
alternative label: Kirjakustantajat, elämäkerrat ja muistelmat (990.1)
alternative label: Evakot, elämäkerrat ja muistelmat (990.1 ... 997.1)
alternative label: Jääkärit, elämäkerrat ja muistelmat (990.1 ... 997.1)
alternative label: Lotat, elämäkerrat ja muistelmat (990.1)
alternative label: Bokförläggare, biografier och memoarer (990.1) @sv
alternative label: Evakuerad befolkning, biografier och memoarer (990.1 ... 997.1) @sv
alternative label: Jägare, armén, biografier och memoarer (990.1 ... 997.1) @sv
alternative label: Lottor, biografier och memoarer (990.1) @sv
broader: HENKILÖ- JA SUKUHISTORIA
in scheme: URN:NBN:fi:au:hklj:
narrower: Suomen yleiset elämäkerralliset hakuteokset
notation: 990.1
preferred label: Finland @en
related: Pelastusoppi. Kristillinen antropologia
related: URN:NBN:fi:au:hklj:323
related: Poliittiset ja aatteelliset vähemmistöt
related: URN:NBN:fi:au:hklj:617
related: URN:NBN:fi:au:hklj:618.24
related: URN:NBN:fi:au:hklj:618.3
related: URN:NBN:fi:au:hklj:909
related: URN:NBN:fi:au:hklj:919
related: Sukuhistoria. Sukututkimus

Suomi
type: Class
type: Concept
subclass of: Filosofit. Psykologit. Kasvatustieteiden edustajat
broader: Filosofit. Psykologit. Kasvatustieteiden edustajat
in scheme: URN:NBN:fi:au:hklj:
notation: 991.1
preferred label: Finland @en
related: Pelastusoppi. Kristillinen antropologia
related: URN:NBN:fi:au:hklj:323
related: Poliittiset ja aatteelliset vähemmistöt
related: URN:NBN:fi:au:hklj:617
related: URN:NBN:fi:au:hklj:618.24
related: URN:NBN:fi:au:hklj:618.3
related: URN:NBN:fi:au:hklj:909
related: URN:NBN:fi:au:hklj:919
related: URN:NBN:fi:au:hklj:991.103
related: Sukuhistoria. Sukututkimus

Suomi
type: Class
type: Concept
subclass of: URN:NBN:fi:au:hklj:992
broader: URN:NBN:fi:au:hklj:992
in scheme: URN:NBN:fi:au:hklj:
notation: 992.1
preferred label: Finland @en
related: RAAMATTU. RAAMATUNTUTKIMUS
related: Pelastusoppi. Kristillinen antropologia
related: URN:NBN:fi:au:hklj:323
related: Poliittiset ja aatteelliset vähemmistöt
related: URN:NBN:fi:au:hklj:617
related: URN:NBN:fi:au:hklj:618.24
related: URN:NBN:fi:au:hklj:618.3
related: URN:NBN:fi:au:hklj:909
related: URN:NBN:fi:au:hklj:919
related: URN:NBN:fi:au:hklj:992.103
related: Sukuhistoria. Sukututkimus

Luonnontieteilijät. Matemaatikot
type: Class
type: Concept
subclass of: HENKILÖ- JA SUKUHISTORIA
alternative label: Astronautit, elämäkerrat ja muistelmat (995)
alternative label: Avaruuslentäjät, elämäkerrat ja muistelmat (995)
alternative label: Biografiat, muiden alojen edustajat (991 ... 997 +)
alternative label: Biologit, elämäkerrat ja muistelmat (995 +)
alternative label: Edelläkävijät, muiden alojen edustajat (991 ... 997 +)
alternative label: Elämäkerrat, muiden alojen edustajat (991 ... 997 +)
alternative label: Elämänhistoria, henkilöhistoria, muiden alojen edustajat (991 ... 997 +)
alternative label: Fyysikot, elämäkerrat ja muistelmat (995 +)
alternative label: Haastattelut, henkilöhistoria, muut alat (991 ... 997 +)
alternative label: Henkilöhistoria, muiden alojen edustajat (991 ... 997 +)
alternative label: Henkilökuvat, muiden alojen edustajat (991 ... 997 +)
alternative label: Henkilöt, muiden alojen edustajat (991 ... 997 +)
alternative label: Historia, henkilöhistoria, muut alat (991 ... 997 +)
alternative label: Julkisuuden henkilöt, muiden alojen edustajat (991 ... 997 +)
alternative label: Kansalliset suurmiehet, muiden alojen edustajat (991 ... 997 +)
alternative label: Kemistit, elämäkerrat ja muistelmat (995 +)
alternative label: Kirjeet, muiden alojen edustajat (991 ... 997 +)
alternative label: Kosmonautit, elämäkerrat ja muistelmat (995)
alternative label: Lapsuus, muiden alojen edustajat (991 ... 997 +)
alternative label: Luonnontieteilijät, elämäkerrat ja muistelmat (995 +)
alternative label: Maahanmuuttajat, henkilöhistoria, muuta alat (991 ... 997 +)
alternative label: Maanpako, henkilöhistoria, muut alat (991 ... 997 +)
alternative label: Matemaatikot, elämäkerrat ja muistelmat (995 +)
alternative label: Merkkihenkilöt, muiden alojen edustajat (991 ... 997 +)
alternative label: Muistelmat, muiden alojen edustajat (991 ... 997 +)
alternative label: Muistokirjoitukset, muiden alojen edustajat (991 ... 997 +)
alternative label: Nekrologit, muiden alojen edustajat (991 ... 997 +)
alternative label: Omaelämäkerrat, muiden alojen edustajat (991 ... 997 +)
alternative label: Pakolaiset, henkilöhistoria, muut alat (991 ... 997 +)
alternative label: Professorit, muiden alojen edustajat (991 ... 997 +)
alternative label: Päiväkirjat, muiden alojen edustajat (991 ... 997 +)
alternative label: Rakkauskirjeet, muiden alojen edustajat (991 ... 997 +)
alternative label: Siirtolaiset, henkilöhistoria, muut alat (991 ... 997 +)
alternative label: Suurmiehet, muiden alojen edustajat (991 ... 997 +)
alternative label: Tähtitieteilijät, elämäkerrat ja muistelmat (995 +)
alternative label: Uranuurtajat, muiden alojen edustajat (991 ... 997 +)
alternative label: Vaihtoehtohistoria, henkilöhistoria, muut alat (991 ... 997 +)
alternative label: Vaihtoehtoinen historia, henkilöhistoria, muut alat (991 ... 997 +)
alternative label: Alternativ historia, personhistoria, övriga områden (991 ... 997 +) @sv
alternative label: Astronauter, biografier och memoarer (995) @sv
alternative label: Astronomer, biografier och memoarer (995 +) @sv
alternative label: Barndom, andra yrkesområdens representanter (991 ... 997 +) @sv
alternative label: Bemärkta personer, andra yrkesområdens representanter (991 ... 997 +) @sv
alternative label: Biografier, andra yrkesområdens representanter (991 ... 997 +) @sv
alternative label: Biologer, biografier och memoarer (995 +) @sv
alternative label: Brev, andra yrkesområdens representanter (991 ... 997 +) @sv
alternative label: Dagböcker, andra yrkesområdens representanter (991 ... 997 +) @sv
alternative label: Flyktingar, personhistoria, övriga områden (991 ... 997 +) @sv
alternative label: Fysiker, biografier och memoarer (995 +) @sv
alternative label: Föregångare, andra yrkesområdens representanter (991 ... 997 +) @sv
alternative label: Historia, personhistoria, övriga områden (991 ... 997 +) @sv
alternative label: Immigranter, personhistoria, övriga områden (991 ... 997 +) @sv
alternative label: Intervjuer, personhistoria, övriga områden (991 ... 997 +) @sv
alternative label: Invandrare, personhistoria, övriga branscher (991 ... 997 +) @sv
alternative label: Kemister, biografier och memoarer (995 +) @sv
alternative label: Kosmonauter, biografier och memoarer (995) @sv
alternative label: Kärleksbrev, andra yrkesområdens representanter (991 ... 997 +) @sv
alternative label: Landsflykt, personhistoria, övriga områden (991 ... 997 +) @sv
alternative label: Levnadsteckningar, andra yrkesområdens representanter (991 ... 997 +) @sv
alternative label: Livshistoria, personhistoria, andra yrkesområdens representanter (991 ... 997 +) @sv
alternative label: Matematiker, biografier och memoarer (995 +) @sv
broader: HENKILÖ- JA SUKUHISTORIA
in scheme: URN:NBN:fi:au:hklj:
narrower: Suomi
notation: 995
related: Pelastusoppi. Kristillinen antropologia
related: URN:NBN:fi:au:hklj:323
related: Poliittiset ja aatteelliset vähemmistöt
related: URN:NBN:fi:au:hklj:617
related: URN:NBN:fi:au:hklj:618.24
related: URN:NBN:fi:au:hklj:618.3
related: URN:NBN:fi:au:hklj:909
related: URN:NBN:fi:au:hklj:919
related: URN:NBN:fi:au:hklj:995.03
related: Sukuhistoria. Sukututkimus
scope note: Tässä esim. luonnon- ja ympäristönsuojelijoiden, matemaatikkojen, tähtitieteilijöiden, avaruustutkijoiden, astronauttien, fyysikkojen, kemistien ja biologien henkilöhistoria
scope note: Hit t.ex. natur- och miljövårdares, matematikers, astronomers, rymdforskares, astronauters, fysikers, kemisters och biologers personhistoria @sv

Kurdinkielinen kaunokirjallisuus (Kaunoluokka)
type: Class
type: Concept
type: FormClass
subclass of: Indoiraanisten kielten kaunokirjallisuus (Kaunoluokka)
broader: Indoiraanisten kielten kaunokirjallisuus (Kaunoluokka)
in scheme: URN:NBN:fi:au:hklj:
narrower: Kurmandžinkielinen kaunokirjallisuus (Kaunoluokka)
narrower: Soraninkielinen kaunokirjallisuus (Kaunoluokka)
notation: 9.62
preferred label: Kurdish fiction (Fiction class) @en
preferred label: Kurdisk skönlitteratur (Skönklass) @sv

Kirjastohistoria
type: Class
type: Concept
subclass of: KIRJASTOT. KIRJASTOTOIMI
alternative label: Kirjastohistoria (029 +)
alternative label: Kirjastolaitos, kirjastohistoria (029 +)
alternative label: Kirjastot, kirjastolaitos (029 +)
alternative label: Varastokirjastot (029 +)
alternative label: Bibliotek, biblioteksväsen (029 +) @sv
alternative label: Bibliotekshistoria (029 +) @sv
alternative label: Biblioteksverk, bibliotekshistoria (029 +) @sv
alternative label: Depåbibliotek (029 +) @sv
broader: KIRJASTOT. KIRJASTOTOIMI
in scheme: URN:NBN:fi:au:hklj:
narrower: Suomi
notation: 029
preferred label: Library history @en
preferred label: Bibliotekshistoria @sv
related: URN:NBN:fi:au:hklj:018
related: Yleiset kirjastot
related: Suomi
related: Erikoiskirjastot. Yhdistysten, laitosten ja yritysten kirjastot
related: URN:NBN:fi:au:hklj:028
related: Dokumentaatio ja informaatiopalvelu yleensä
related: Museonhoito
related: Arkistonhoito
related: URN:NBN:fi:au:hklj:061
related: URN:NBN:fi:au:hklj:063
scope note: Yleinen kirjastohistoria Eri maiden kirjastolaitosta tai kirjastohistoriaa sekä yleisten että tieteellisten kirjastojen kannalta koskevat yleisteokset Yksittäistä kirjastoa tai tiettyä kirjastomuotoa koskevat yleisteokset ja yleiset historiat ko. kirjastomuodon luokassa Kirjastohistorialliset teokset, jotka koskevat jotakin kirjaston toiminnan erikoisalaa, alan mukaan luokissa 021.09-025.09
scope note: Allmän bibliotekshistoria Allmänna verk om biblioteksinstitutioner eller bibliotekshistoria i olika länder som rör både allmänna och vetenskapliga bibliotek Allmänna och historiska verk som rör enskilda bibliotek eller biblioteksformer klassificeras enligt biblioteksformen i fråga Bibliotekshistoriska verk som rör specialområden inom biblioteksverksamheten förs enligt område till klasserna 021.09-025.09 @sv

Tunne- ja tahtotoiminnot
type: Class
type: Concept
subclass of: Psyyken rakenne ja toiminnot
alternative label: Affektit, psyyken rakenne (121.2)
alternative label: Aggressiivisuus, psyyken rakenne (121.2)
alternative label: Aggressiot, psyyken rakenne (121.2)
alternative label: Aktiivisuus, psyyken rakenne (121.2)
alternative label: Aktivaatiotaso, psykologia (121.2)
alternative label: Antipatia, psyyken toiminnot (121.2)
alternative label: Assosiaatio, oppimisen psykologia (121.2)
alternative label: Dynaaminen psykologia (121.2)
alternative label: Elämyksellisyys, psykologia (121.2)
alternative label: Elämys, psykologia (121.2)
alternative label: Elämänhalu, psykologia (121.2)
alternative label: Emootiot, psykologia (121.2)
alternative label: Empaattisuus, psyyken toiminnot (121.2)
alternative label: Empatia, psyyken toiminnot (121.2)
alternative label: Frustraatio, psykologia (121.2)
alternative label: Hellyydenosoitukset, tunteet (121.2)
alternative label: Hellyys, tunteet (121.2)
alternative label: Hyvyys, psykologia (121.2)
alternative label: Hyvä ja paha, psykologia (121.2)
alternative label: Häpeä, psykologia (121.2)
alternative label: Ihastuminen, psyyken toiminnot (121.2)
alternative label: Ihastus, psyyken toiminnot (121.2)
alternative label: Ilo, psykologia (121.2)
alternative label: Inho, psyyken toiminnot (121.2)
alternative label: Intentio, psykologia (121.2)
alternative label: Intohimo, tunne- ja tahtotoiminnot (121.2)
alternative label: Kannustimet, psykologia (121.2)
alternative label: Kannustus, psykologia (121.2)
alternative label: Kateus, psykologia (121.2)
alternative label: Kauhu, psyyken toiminnot (121.2)
alternative label: Kosketus, tunnetoiminnot, vaistot (121.2)
alternative label: Kömpelyys, motoriikka, psykologia (121.2)
alternative label: Levottomuus, mieliala, psykologia (121.2)
alternative label: Lohduttaminen, tunteet (121.2)
alternative label: Lohdutus, tunteet (121.2)
alternative label: Mieliala, psykologia (121.2)
alternative label: Mielihyvä, psykologia (121.2)
alternative label: Motiivit, psykologia (121.2)
alternative label: Motivaatio (121.2)
alternative label: Motivaatio, psykologia (121.2)
alternative label: Motivaatioilmasto, motivaatio (121.2)
alternative label: Motivaatioilmasto, psykologia (121.2)
alternative label: Motivaatiopsykologia (121.2)
alternative label: Motivaatiopsykologia, psykologia (121.2)
alternative label: Motoriikka, psykologia (121.2)
alternative label: Myötätunto, psyyken toiminnot (121.2)
alternative label: Nautinto, psykologia (121.2)
alternative label: Paha, psykologia (121.2)
alternative label: Pahuus, psykologia (121.2)
alternative label: Passiivisuus, psyyken rakenne (121.2)
alternative label: Pelko, psykologia (121.2)
alternative label: Perustarpeet, psykologia (121.2)
alternative label: Pettymys, psykologia (121.2)
alternative label: Psykodynamiikka (121.2)
alternative label: Psykomotoriikka (121.2)
alternative label: Rakastuminen, psyyken toiminnot (121.2)
alternative label: Rakkaus, psyyken toiminnot (121.2)
alternative label: Suoritusmotivaatio, psykologia (121.2)
broader: Psyyken rakenne ja toiminnot
in scheme: URN:NBN:fi:au:hklj:
notation: 121.2
related: Tiedostamaton sielunelämä
related: Uni
related: Alitajunta
related: Hypnoosi. Suggestio
related: Psykologian suunnat
related: Lapsuuden ja nuoruuden psykologia
related: Muita psykologian aloja
related: Ihmissuhteiden psykologia
related: Kehityspsykologia. Eri ikäkausien psykologia
related: Elämänohjeet
related: Etologia. Eläinsosiologia
related: URN:NBN:fi:au:hklj:618.2
related: URN:NBN:fi:au:hklj:618.24
related: Itsemurhat ja niiden ehkäisy
scope note: Henkisten perustoimintojen psykologia ja tutkimus Emootiot. Affektit. Intentiot. Motivaatio. Frustraatio. Toiminta. Vietit. Vaistot Rakkaus, ilo, suru, pelko, viha ja aggressio psykologisina perustoimintoina
scope note: De själsliga grundfunktionernas psykologi och forskning i dem Emotioner. Affekter. Intentioner. Motivation. Frustration. Aktiviteter. Drifter. Instinkter Kärlek, glädje, sorg, rädsla, hat och aggressioner som psykologiska primärfunktioner @sv

Opintokerhotoiminta
type: Class
type: Concept
subclass of: URN:NBN:fi:au:hklj:185
alternative label: Opintokerhot, yleinen sivistystyö (185.4)
alternative label: Studiecirklar, allmänt bildningsarbete (185.4) @sv
broader: URN:NBN:fi:au:hklj:185
in scheme: URN:NBN:fi:au:hklj:
notation: 185.4
preferred label: Study circles @en
preferred label: Studiecirklar @sv
related: Muu kirjastotoiminta
related: URN:NBN:fi:au:hklj:060
related: URN:NBN:fi:au:hklj:061
related: URN:NBN:fi:au:hklj:063
related: URN:NBN:fi:au:hklj:181.7
related: URN:NBN:fi:au:hklj:182
related: URN:NBN:fi:au:hklj:183
related: URN:NBN:fi:au:hklj:183.5
related: Keskiasteen koulutus
related: URN:NBN:fi:au:hklj:183.7
related: Muiden maiden koululaitokset
related: URN:NBN:fi:au:hklj:184
related: Muiden maiden yliopistot ja korkeakoulut
related: URN:NBN:fi:au:hklj:188.4
scope note: Opintokerhotoiminta yleensä Erikoisalojen opintokerhotoiminta alan mukaisessa luokassa
scope note: Studiecirklar i allmänhet Studiecirklar som rör specialområden klassificeras enligt område @sv

Muut yleisen sivistystyön muodot
type: Class
type: Concept
subclass of: URN:NBN:fi:au:hklj:185
alternative label: Setlementtiliike (185.7)
alternative label: Työkeskusliike (185.7)
alternative label: Vapaaopistot (185.7)
alternative label: Settlement (185.7) @sv
alternative label: Settlementrörelsen (185.7) @sv
alternative label: Settlementsrörelsen (185.7) @sv
broader: URN:NBN:fi:au:hklj:185
in scheme: URN:NBN:fi:au:hklj:
notation: 185.7
preferred label: Other forms of general education @en
preferred label: Övriga former av allmänt bildningsarbete @sv
related: URN:NBN:fi:au:hklj:060
related: URN:NBN:fi:au:hklj:061
related: URN:NBN:fi:au:hklj:063
related: URN:NBN:fi:au:hklj:181.7
related: URN:NBN:fi:au:hklj:182
related: URN:NBN:fi:au:hklj:183
related: URN:NBN:fi:au:hklj:183.5
related: Keskiasteen koulutus
related: URN:NBN:fi:au:hklj:183.7
related: Muiden maiden koululaitokset
related: URN:NBN:fi:au:hklj:184
related: Muiden maiden yliopistot ja korkeakoulut
related: Nuorisotyö
related: URN:NBN:fi:au:hklj:188.4
scope note: Ohjattu vapaa-ajanvietto ja harrastustoiminta yleensä. Setlementtityö Erikoisalojen harrastustoiminta alan mukaisessa luokassa
scope note: Handledd fritids- och hobbyverksamhet. Settlementverksamhet Hobbyverksamhet som rör specialområden klassificeras enligt område @sv

Rukouskirjat
type: Class
type: Concept
subclass of: Hartauskirjat
alternative label: Hengellinen elämä, rukouskirjat, kristilliset (242.1)
alternative label: Kirkkorunous, rukouskirjat (242.1)
alternative label: Kristillinen kirjallisuus, rukouskirjat (242.1)
alternative label: Rukoukset, kristilliset rukouskirjat (242.1)
alternative label: Rukouskirjat, kristilliset (242.1)
alternative label: Uskonelämä, rukouskirjat, kristilliset (242.1)
alternative label: Uskonnollinen kirjallisuus, rukouskirjat (242.1)
alternative label: Andligt liv, bönböcker, kristliga (242.1) @sv
alternative label: Bönböcker, kristliga (242.1) @sv
alternative label: Böner, kristna bönböcker (242.1) @sv
alternative label: Kristen litteratur, bönböcker (242.1) @sv
alternative label: Kyrkopoesi, bönböcker (242.1) @sv
alternative label: Religiös litteratur, bönböcker (242.1) @sv
alternative label: Trosliv, bönböcker, kristliga (242.1) @sv
broader: Hartauskirjat
in scheme: URN:NBN:fi:au:hklj:
notation: 242.1
preferred label: Prayer books @en
preferred label: Bönböcker @sv
related: URN:NBN:fi:au:hklj:210
related: Esseet
related: Virsikirjat ja hengelliset laulukirjat
related: Sielunhoito
related: Henkilökohtainen hartaudenharjoitus
related: Saarnat. Postillat. Kristilliset puhe- ja päivänavauskokoelmat
related: Kristillisten kirkkojen musiikki
related: Protestanttinen musiikki
related: Virret. Hengelliset laulut
related: URN:NBN:fi:au:hklj:787.112
related: Spirituaalit. Gospel-musiikki
related: Roomalaiskatolinen musiikki
related: Ortodoksinen musiikki
related: Muiden kristillisten kirkkojen musiikki

Sakramentit. Kirkolliset toimitukset
type: Class
type: Concept
subclass of: EVANKELIS-LUTERILAINEN KIRKKO
alternative label: Arkipyhät, ev.-lut. kirkko (251)
alternative label: Avioliittoon vihkiminen, ev.-lut. kirkko (251)
alternative label: Ehtoollinen, kirkolliset toimitukset, ev.-lut. kirkko (251)
alternative label: Eukaristia, kirkolliset toimitukset, ev.-lut. kirkko (251)
alternative label: Hautajaiset, ev.-lut. kirkko (251)
alternative label: Hautaus, ev.-lut. kirkko (251)
alternative label: Hautauspalvelut, ev.-lut. kirkko (251)
alternative label: Hautauspuheet, ev.-lut. kirkko (251)
alternative label: Hautaustavat, ev.-lut. kirkko (251)
alternative label: Häät, kirkolliset, ev.-lut. (251)
alternative label: Initiaatiot, kristilliset, ev.-lut. (251)
alternative label: Jumalanpalvelus, ev.-lut. (251)
alternative label: Kalendaariperinne, kirkkovuosi, ev.-lut. (251)
alternative label: Kaste, kirkolliset toimitukset, ev.-lut. (251)
alternative label: Kirkkokäsikirjat, ev.-lut. kirkko (251)
alternative label: Kirkolliset toimitukset, ev.-lut. kirkko (251)
alternative label: Kolehti, ev.-lut. kirkko (251)
alternative label: Konfirmaatio, ev.-lut. kirkko (251)
alternative label: Kulkueet, kirkolliset, ev.-lut. (251 ... 252)
alternative label: Kummilapset, ev.-lut. kirkko (251)
alternative label: Kummit, ev.-lut. kirkko (251)
alternative label: Kuolleet, hautaus, ev.-lut. kirkko (251)
alternative label: Kuulutukset, avioliitto, ev.-lut. (251)
alternative label: Liturgia, ev.-lut. kirkko (251)
alternative label: Liturgiikka, ev.-lut. kirkko (251)
alternative label: Liturgiset ajat, ev.-lut. kirkko (251)
alternative label: Liturgiset kirjat, ev.-lut. kirkko (251)
alternative label: Liturgiset värit, ev.-lut. kirkko (251)
alternative label: Messu, ev.-lut. kirkko (251)
alternative label: Messukirjat, ev.-lut. kirkko (251)
alternative label: Palvonta, jumalanpalvelus, ev.-lut. (251)
alternative label: Polttohautaus, ev.-lut. kirkko (251)
alternative label: Pyhäinpäivä, ev.-lut. kirkko (251)
alternative label: Pyhäpäivät, ev.-lut. kirkko (251)
alternative label: Pyhät ajat, ev.-lut. kirkko (251)
alternative label: Rippi, ev.-lut. kirkko (251)
alternative label: Rippisalaisuus, ev.-lut. kirkko (251)
alternative label: Ristisaatot, ev.-lut. kirkko (251)
alternative label: Ristiäiset, kaste, ev.-lut. kirkko (251)
alternative label: Rukouspäivät, ev.-lut. kirkko (251)
alternative label: Sakraaliteologia, sakramentit, ev.-lut. (251)
alternative label: Sakramentit, ev.-lut. kirkko (251)
alternative label: Seremoniat, kirkolliset toimitukset, ev.-lut. (251)
alternative label: Siirtymäriitit, kirkolliset toimitukset, ev.-lut. (251)
alternative label: Siunaaminen, ev.-lut. kirkko (251)
alternative label: Siunaukset, ev.-lut. kirkko (251)
alternative label: Siunaus, ev.-lut. kirkko (251)
alternative label: Synninpäästö, ehtoollinen, ev.-lut. (251)
alternative label: Tuhkaus, ev.-lut. kirkko (251)
alternative label: Uskonnolliset kulkueet, kristilliset, ev.-lut. (251 ... 252)
alternative label: Vainajat, ev.-lut. kirkko (251)
alternative label: Vesperit, ev.-lut. kirkko (251)
alternative label: Vigiliat, ev.-lut. kirkko (251)
alternative label: Vihkiminen, ev.-lut. kirkko (251)
alternative label: Alla helgons dag, ev.luth. kyrkan (251) @sv
alternative label: Avlidna, begravning, ev.luth. kyrkan (251) @sv
alternative label: Begravning, ev.luth. kyrkan (251) @sv
alternative label: Begravningsskick, ev.luth. kyrkan (251) @sv
broader: EVANKELIS-LUTERILAINEN KIRKKO
in scheme: URN:NBN:fi:au:hklj:
notation: 251
related: KRISTILLINEN DOGMATIIKKA
related: Virsikirjat ja hengelliset laulukirjat
related: Kirkolliset juhlat ja juhlapäivät
related: Saarnat. Postillat. Kristilliset puhe- ja päivänavauskokoelmat
related: URN:NBN:fi:au:hklj:260
related: Juhlien järjestäminen
related: Kristillisten kirkkojen musiikki
related: Protestanttinen musiikki
related: Virret. Hengelliset laulut
related: URN:NBN:fi:au:hklj:787.112
related: Spirituaalit. Gospel-musiikki
related: Roomalaiskatolinen musiikki
related: Ortodoksinen musiikki
related: Muiden kristillisten kirkkojen musiikki
scope note: Ev.-lut. kirkon sakramentit ja toimitukset kirkon käytännön toiminnan kannalta Kaste. Ehtoollinen. Vihkiminen. Hautaus. Jumalanpalvelus Liturgiikka. Liturgiset kirjat. Kirkkokäsikirjat. Liturgiset ajat. Kirkkovuosi. Pyhäpäivät
scope note: Den evangelisk-lutherska kyrkans sakrament och förrättningar ur den praktiska verksamhetens synvinkel Dop. Nattvard. Vigsel till äktenskap. Jordfästning. Gudstjänst Liturgi. Liturgiska böcker. Kyrkohandböcker. Liturgiska tider. Kyrkoåret. Helgdagar @sv

Suomen valtiojärjestelmä
type: Class
type: Concept
subclass of: URN:NBN:fi:au:hklj:320
alternative label: Ahvenanmaa, itsehallinto (327)
alternative label: Ahvenanmaan itsehallintolaki (327)
alternative label: Aloitteet, eduskunta (327)
alternative label: Asuntoministerit, valtiojärjestelmät, Suomi (327)
alternative label: Demokratia, valtiojärjestelmät, Suomi (327 +)
alternative label: Demokratiavaje, valtiojärjestelmät (327 ... 328)
alternative label: Demokratisoituminen, valtiojärjestelmät, Suomi (327 +)
alternative label: Digitaalidemokratia, valtiojärjestelmät, Suomi (327 +)
alternative label: Digitaalinen demokratia, valtiojärjestelmät, Suomi (327 +)
alternative label: Eduskunnan puhemiehet, Suomen valtiojärjestelmä (327)
alternative label: Eduskunta, Suomen eduskunta (327)
alternative label: Eduskunta, Suomen valtiojärjestelmä (327)
alternative label: Eduskuntakäsittely (327)
alternative label: Eduskuntakäsittely, Suomen valtiojärjestelmä (327)
alternative label: Eduskuntaryhmät (327)
alternative label: Eduskuntaryhmät, Suomen valtiojärjestelmä (327)
alternative label: Eduskuntatyö (327)
alternative label: Eduskuntavaalit (327)
alternative label: Ehdokasasettelu, EU-vaalit, Suomi (327)
alternative label: Ehdokasasettelu, valtiolliset vaalit, Suomi (327)
alternative label: Ehdokkaat, EU-vaalit, Suomi (327)
alternative label: Ehdokkaat, valtiolliset vaalit, Suomi (327)
alternative label: Elektroninen demokratia, valtiojärjestelmät, Suomi (327 +)
alternative label: Elinkeinoministerit, valtiojärjestelmät, Suomi (327)
alternative label: Ennakkoäänestys, valtiolliset, Suomi (327)
alternative label: Ennakkoäänestäminen, valtiolliset, Suomi (327)
alternative label: Esivaalit, Suomi (327)
alternative label: Etädemokratia, valtiojärjestelmät, Suomi (327 +)
alternative label: Hallintopolitiikka, Suomen valtiojärjestelmä (327)
alternative label: Hallituksen muodostaminen, valtiojärjestelmät, Suomi (327 +)
alternative label: Hallitukset, valtiojärjestelmät, Suomi (327 +)
alternative label: Hallitusmuoto, Suomi (327)
alternative label: Henkilökohtaiset avustajat, valtiojärjestelmät, Suomi (327)
alternative label: Itsehallinto, Ahvenanmaan (327)
alternative label: Kannatus, vaalit, eu-vaalit, Suomi (327)
alternative label: Kannatus, vaalit, valtiolliset, Suomi (327)
alternative label: Kansanedustajan avustajat, valtiojärjestelmät, Suomi (327)
alternative label: Kansanedustajat, valtiojärjestelmät, Suomi (327)
alternative label: Kansanedustuslaitokset, Suomi (327 +)
alternative label: Kansanäänestykset, valtiolliset, Suomi (327)
alternative label: Lainsäädäntöprosessi, Suomi (327)
alternative label: Lainsäädäntövalta, Suomi (327)
alternative label: Lainsäätämisjärjestys, Suomi (327)
alternative label: Lainvalmistelu, Eduskunnan työ (327)
alternative label: Lakialoitteet, lainsäädäntö (327)
alternative label: Lakiehdotukset, Eduskunnan työ, Suomi (327 +)
alternative label: Luottamushenkilöt, Eduskunta, Suomi (327)
alternative label: Ministerit, valtiojärjestelmät, Suomi (327)
alternative label: Oikeusministerit, valtiojärjestelmät, Suomi (327)
alternative label: Parlamentaarinen valvonta, Suomen valtiojärjestelmä (327)
alternative label: Parlamentarismi, Suomi (327)
alternative label: Parlamentin hajottaminen, Suomi (327)
alternative label: Parlamentit, Suomi (327)
alternative label: Parlamenttivaalit, Suomi (327)
alternative label: Poliittinen kehitys, vaalit, Suomi (327)
alternative label: Poliittinen kontrolli, valtiojärjestelmät, Suomi (327)
alternative label: Poliittinen käyttäytyminen, vaalit, äänestäminen, Suomi (327)
alternative label: Poliittinen muutos, vaalit, Suomi (327)
alternative label: Poliittinen osallistuminen, vaalit, äänestäminen, Suomi (327)
broader: URN:NBN:fi:au:hklj:320
in scheme: URN:NBN:fi:au:hklj:
narrower: Suomen valtiopäiväasiakirjat
notation: 327
related: Valtiofilosofia. Valtiomuodot
related: Sisäpolitiikka. Puolueet
related: Suomi
related: URN:NBN:fi:au:hklj:326.2
related: URN:NBN:fi:au:hklj:327.09
related: Muiden maiden valtiojärjestelmät
related: URN:NBN:fi:au:hklj:332.1
related: URN:NBN:fi:au:hklj:340
related: URN:NBN:fi:au:hklj:345
related: Helsinki. Pääkaupunkiseutu
related: Suomen valtionhallinto
scope note: Suomen hallitusmuoto. Suomen valtiomuoto. Suomen valtiosääntö Suomen kansanedustuslaitos. Valtiopäivät. Eduskunta Hallitus. Presidentti-instituutio Suomen vaalijärjestelmä. Vaalitapa. Äänioikeus Valtiolliset vaalit. Eduskuntavaalit. EU-vaalit Suomen osalta Presidentinvaalit. Valtiolliset kansanäänestykset Ahvenanmaan itsehallinto
scope note: Finlands regeringsform. Finlands statsskick. Finlands författningssamling Finlands folkrepresentation. Lantdagen. Riksdagen Regeringen. Presidenten Finlands valsystem. Valsätt. Rösträtt Statliga val. Riksdagsval. EU-val: Finland Presidentval. Statliga folkomröstningar Ålands självstyrelse @sv

Kansainväliset taloudelliset suhteet. Maailmantalous
type: Class
type: Concept
subclass of: URN:NBN:fi:au:hklj:360
alternative label: Aluetaloudelliset vaikutukset , kauppapolitiikka (367 +)
alternative label: Anti-Imperialismi, kansainvälinen talous (367 +)
alternative label: Demokratiavaje, kansainvälinen talous (367 +)
alternative label: Digitaalitalous, globalisaatio (367)
alternative label: Erikoistalousalueet (367 +)
alternative label: Erityistalousalueet (367 +)
alternative label: Eturyhmät, kansainvälinen talous (367 +)
alternative label: G7-maat, globalisaatio (367)
alternative label: G7-maat, kansainvälinen talous (367 +)
alternative label: Globaali hallinta (367)
alternative label: Globaali hallinta, maailmantalous (367 +)
alternative label: Globaalihallinta (367)
alternative label: Globaalihallinta, maailmantalous (367 +)
alternative label: Globaaliset ongelmat, maailmantalous (367 +)
alternative label: Globaalitalous (367 +)
alternative label: Global governance (367)
alternative label: Global governance, maailmantalous (367 +)
alternative label: Globalisaatio (367)
alternative label: Globalisaatio, maailmantalous (367 +)
alternative label: Globalisaation hallinta (367)
alternative label: Globalisaation hallinta, maailmantalous (367 +)
alternative label: Halpatuonti (367 +)
alternative label: Halpatuonti, kansainvälinen talous (367 +)
alternative label: Harmaatuonti (367 +)
alternative label: Harmonisointi, globalisaatio (367 +)
alternative label: Hintakilpailu, kansainvälinen talous (367 +)
alternative label: Huippukokoukset, kansainvälinen talous (367 +)
alternative label: Imperialismi, kansainvälinen talous (367 +)
alternative label: Intressiryhmät, kansainvälinen talous (367 +)
alternative label: Johtavat teollisuusmaat, globalisaatio (367)
alternative label: Johtavat teollisuusmaat, kansainvälinen talous (367 +)
alternative label: Joint venture, kansainvälinen talous (367 +)
alternative label: Jälkikolonialismi, maailmantalous (367 +)
alternative label: Kansainvälinen järjestelmä, globalisaatio (367 +)
alternative label: Kansainvälinen järjestelmä, kansainvälinen talous (367 +)
alternative label: Kansainvälinen kilpailukyky (367 +)
alternative label: Kansainvälinen laskentatoimi, kansainvälinen talous (367 +)
alternative label: Kansainvälinen talous (367 +)
alternative label: Kansainvälistyminen, globalisaatio (367)
alternative label: Kansainvälistyminen, kansainvälinen talous (367 +)
alternative label: Kansainvälisyys, globalisaatio (367)
alternative label: Kansainvälisyys, kansainvälinen talous (367 +)
alternative label: Kansallisvaltiot, kansainvälinen talous (367 +)
alternative label: Kauppapolitiikka, kansainvälinen talous (367 +)
alternative label: Kilpailu, kansainvälinen talous (367 +)
alternative label: Kilpailuetu, kansainvälinen talous (367 +)
alternative label: Kolonialismi, maailmantalous (367 +)
alternative label: Konsulaatit (367 +)
alternative label: Konsulitoimi (367 +)
alternative label: Kontaktit, maailmantalous (367 +)
alternative label: Kotoistus, kansainvälinen talous (367 +)
alternative label: Kuljetus, kansainvälinen kauppa (367 +)
alternative label: Laajeneminen, globalisaatio (367 +)
alternative label: Laajeneminen, kansainvälinen talous (367 +)
alternative label: Laajentuminen, globalisaatio (367 +)
alternative label: Laajentuminen, kansainvälinen talous (367 +)
alternative label: Liikesuhteet, ulkomaakauppa (367 +)
alternative label: Lisenssit, ulkomaankauppa (367 +)
alternative label: Lissabonin strategia, kansainvälinen talous (367 +)
alternative label: Lokalisointi, kansainvälinen talous (367 +)
alternative label: Läpinäkyvyys, kansainväline talous (367 +)
alternative label: Maailma, maailmantalous (367 +)
broader: URN:NBN:fi:au:hklj:360
in scheme: URN:NBN:fi:au:hklj:
narrower: Suomen ulkomaankauppa
narrower: Maailmankauppa. Kansainväliset talousjärjestöt
narrower: Monikansalliset yritykset
narrower: Kehitysmaiden taloudelliset olot
notation: 367
related: URN:NBN:fi:au:hklj:325
related: Kansainvälinen yhteistyö
related: Muiden maanosien valtioiden keskinäinen yhteistyö
related: Vero-oikeus
related: Talousjärjestelmät
related: URN:NBN:fi:au:hklj:368
scope note: Tässä ja alaluokissa kansainvälisiä taloudellisia suhteita ja niiden kehitystä koskevat teokset
scope note: Hit och till underklasserna verk som rör internationella ekonomiska relationer och deras utveckling @sv

Suomen ulkomaankauppa
type: Class
type: Concept
subclass of: Kansainväliset taloudelliset suhteet. Maailmantalous
alternative label: Bilateraalinen kauppa, Suomen ulkomaankauppa (367.1)
alternative label: Clearing, ulkomaankauppa, Suomi (367.1)
alternative label: Halpatuonti, Suomi (367.1)
alternative label: Harmaatuonti, Suomen ulkomaankauppa (367.1)
alternative label: Idänkauppa, Suomen (367.1)
alternative label: Kahdenkeskinen kauppa, Suomen ulkomaankauppa (367.1)
alternative label: Kansainvälinen kilpailukyky, Suomi (367.1)
alternative label: Kaupalliset edustustot, ulkomaankauppa, Suomi (367.1)
alternative label: Kaupalliset sihteerit, ulkomaankauppa, Suomi (367.1)
alternative label: Kaupalliset suhteet, Suomi (367.1)
alternative label: Kaupankäynti, ulkomaankauppa, Suomi (367.1)
alternative label: Kauppa, ulkomaankauppa, Suomi (367.1)
alternative label: Kauppapolitiikka, Suomi (367.1)
alternative label: Kauppasopimukset, Suomi (367.1)
alternative label: Kauppasuhteet, Suomi (367.1)
alternative label: Kauppatase, Suomi (367.1)
alternative label: Kilpailukyky, Suomen (367.1)
alternative label: Kilpailupolitiikka, Suomen (367.1)
alternative label: Komissio, ulkomaankauppa, Suomi (367.1)
alternative label: Komissiokauppa, ulkomaankauppa, Suomi (367.1)
alternative label: Konsulaatit, Suomen (367.1)
alternative label: Lähialueet, Suomen ulkomaankauppa (367.1)
alternative label: Länsikauppa, Suomen (367.1)
alternative label: Maahantuojat, Suomen ulkomaankauppa (367.1)
alternative label: Maahantuonti, Suomen ulkomaankauppa (367.1)
alternative label: Maksutase, Suomen ulkomaankauppa (367.1)
alternative label: Markkina-alueet, Suomen ulkomaankauppa (367.1)
alternative label: Projektituonti, Suomen ulkomaankauppa (367.1)
alternative label: Projektivienti, Suomen ulkomaankauppa (367.1)
alternative label: Rajakauppa, Suomi (367.1)
alternative label: Rinnakkaistuonti, Suomen ulkomaankauppa (367.1)
alternative label: Suomi, ulkomaankauppa (367.1)
alternative label: Suorat investoinnit, ulkomaille (367.1)
alternative label: Suorat sijoitukset, ulkomaille (367.1)
alternative label: Takaisinostot, Suomen ulkomaankauppa (367.1)
alternative label: Taloudelliset sidonnaisuudet, Suomen ulkomaankauppa (367.1)
alternative label: Taloudelliset sidonnaisuudet, kansainväliset talousjärjestöt (367.1)
alternative label: Tuonti, Suomen ulkomaankauppa (367.1)
alternative label: Tuontimaksut, Suomen ulkomaankauppa (367.1)
alternative label: Tuontirajoitukset, Suomen ulkomaankauppa (367.1)
alternative label: Ulkomaankauppa, Suomi (367.1)
alternative label: Ulkomaat, Suomen ulkomaankauppa (367.1)
alternative label: Vaihtokauppa, ulkomaankauppa, Suomi (367.1)
alternative label: Vaihtotase, Suomi (367.1)
alternative label: Vastakaupat, Suomen ulkomaankauppa (367.1)
alternative label: Viennin edistäminen, Suomen ulkomaankauppa (367.1)
alternative label: Vienti, Suomen ulkomaankauppa (367.1)
alternative label: Vientiluotot, Suomen ulkomaankauppa (367.1)
alternative label: Vientimaksut, Suomen ulkomaankauppa (367.1)
alternative label: Vientirajoitukset, Suomen ulkomaankauppa (367.1)
alternative label: Vientitakuu, Suomen ulkomaankauppa (367.1)
alternative label: Vientiteollisuus, vienti, Suomen ulkomaankauppa (367.1)
alternative label: Vientituki, Suomen ulkomaankauppa (367.1)
alternative label: Betalningsbalans, Finlands utrikeshandel (367.1) @sv
alternative label: Bilateral handel, Finlands utrikeshandel (367.1) @sv
alternative label: Bytesbalans, Finland (367.1) @sv
alternative label: Byteshandel, utrikeshandel, Finland (367.1) @sv
alternative label: Clearing, utrikeshandel, Finland (367.1) @sv
broader: Kansainväliset taloudelliset suhteet. Maailmantalous
in scheme: URN:NBN:fi:au:hklj:
notation: 367.1
related: URN:NBN:fi:au:hklj:325
related: Suomen ulkopolitiikka
related: Kansainvälinen yhteistyö
related: URN:NBN:fi:au:hklj:326.2
related: Muiden maanosien valtioiden keskinäinen yhteistyö
related: Vero-oikeus
related: Tullilaitos
related: Talousjärjestelmät
related: Maailmankauppa. Kansainväliset talousjärjestöt
related: Monikansalliset yritykset
related: Kehitysmaiden taloudelliset olot
related: URN:NBN:fi:au:hklj:368
related: URN:NBN:fi:au:hklj:675
related: Markkinointi. Asiakaspalvelu
scope note: Suomen ulkomaankauppa ja Suomen kauppapolitiikka sekä kansantaloudelliselta että liiketaloudelliselta kannalta Suomen tuonti ja vienti ja niiden kehitys. Maahantuonti Suomen asema maailmankaupassa ja -taloudessa Suomen kauppatase, kauppasopimukset ja tullipolitiikka Suomen kansainvälinen kilpailukyky Idänkauppa. Länsikauppa. Rajakauppa Suomen taloudelliset ja kaupalliset suhteet kansainvälisiin talousjärjestöihin ja monikansallisiin yrityksiin Suomen suhde Euroopan talousalueeseen Suomen taloudelliset suhteet Euroopan Unioniin Suomen ja kehitysmaiden välinen kauppa Tiettyä tuotetta koskeva ulkomaankauppa ko. tuotteen mukaisessa luokassa
scope note: Finlands utrikeshandel och Finlands handelspolitik ur både nationalekonomisk och företagsekonomisk synvinkel Finlands import och export och utvecklingen av dem. Införsel Finlands ställning i världshandeln och världsekonomin Finlands handelsbalans, handelsavtal och tullpolitik Finlands internationella konkurrenskraft Östhandeln. Västhandeln. Gränshandeln Finlands ekonomiska relationer och handelsrelationer till internationella ekonomiska organisationer och multinationella företag Finlands relation till Europeiska ekonomiska samarbetsområdet Finlands ekonomiska relationer till Europeiska unionen Handeln mellan Finland och utvecklingsländerna Utrikeshandel som rör enskilda produkter klassificeras enligt produkt @sv

Talousmaantiede. Taloushistoria
type: Class
type: Concept
subclass of: URN:NBN:fi:au:hklj:360
alternative label: Anti-Imperialismi, taloushistoria (369)
alternative label: G7-maat, talousmaantiede (369)
alternative label: Ihmismaantiede, talousmaantiede (369)
alternative label: Imperialismi, taloushistoria (369)
alternative label: Industrialismi, taloushistoria (369)
alternative label: Johtavat teollisuusmaat, talousmaantiede (369)
alternative label: Jälkikolonialismi, taloushistoria (369)
alternative label: Kapitalismi, taloushistoria (369)
alternative label: Kapitalistiset maat, taloushistoria (369)
alternative label: Kapitalistiset maat, talousmaantiede (369)
alternative label: Kauppamaantiede (369)
alternative label: Kehittyneet maat , taloushistoria (369)
alternative label: Kliometria (369)
alternative label: Kolonialismi, taloushistoria (369)
alternative label: Luonnonvarat, talousmaantiede (369)
alternative label: Luontaistalous (369)
alternative label: Luontoistalous (369)
alternative label: Maantiede, talousmaantiede (369)
alternative label: Maatalousmaat, talousmaantiede (369)
alternative label: Merkantilismi, taloushistoria (369)
alternative label: Postkolonialismi, taloushistoria (369)
alternative label: Raaka-aineet, talousmaantiede (369)
alternative label: Raaka-ainevarat, talousmaantiede (369)
alternative label: Rahatalous, taloushistoria (369)
alternative label: Ravintovarat, talousmaantiede (369)
alternative label: Riisto, taloushistoria ja -maantiede (369)
alternative label: Riistäminen, taloushistoria ja -maantiede (369)
alternative label: Siirtomaapolitiikka, taloushistoria (369)
alternative label: Siirtomaat, taloushistoria (369)
alternative label: Siirtomaavallat, taloushistoria (369)
alternative label: Taloudelliset sidonnaisuudet, taloushistoria (369)
alternative label: Taloudelliset sidonnaisuudet, talousmaantiede (369)
alternative label: Talousalueet (369)
alternative label: Taloushistoria (369)
alternative label: Talousmaantiede (369)
alternative label: Teollistuminen, taloushistoria (369)
alternative label: Teollistuneet maat, taloushistoria (369)
alternative label: Teollisuusmaat, taloushistoria (369)
alternative label: Tropiikki, talousmaantiede (369)
alternative label: Valtiotieteet, taloushistoria (369)
alternative label: Viljavarastot, taloushistoria (369)
alternative label: Antiimperialism, ekonomisk historia (369) @sv
alternative label: Berövande, ekonomisk historia och geografi (369) @sv
alternative label: Ekonomiområden (369) @sv
alternative label: Ekonomisk geografi (369) @sv
alternative label: Ekonomisk historia (369) @sv
alternative label: Ekonomiska bindningar, ekonomisk geografi (369) @sv
alternative label: Ekonomiska bindningar, ekonomisk historia (369) @sv
alternative label: G7-länder, ekonomisk geografi (369) @sv
alternative label: Geografi, ekonomisk geografi (369) @sv
alternative label: Handelsgeografi (369) @sv
alternative label: Humangeografi, ekonomisk geografi (369) @sv
alternative label: Imperialism, ekonomisk historia (369) @sv
alternative label: Industrialiserade länder, ekonomisk historia (369) @sv
alternative label: Industrialisering, ekonomisk historia (369) @sv
alternative label: Industrialism, ekonomisk historia (369) @sv
alternative label: Industriländer, ekonomisk historia (369) @sv
alternative label: Jordbruksländer, ekonomisk geografi (369) @sv
alternative label: Kapitalism, ekonomisk historia (369) @sv
broader: URN:NBN:fi:au:hklj:360
in scheme: URN:NBN:fi:au:hklj:
notation: 369
related: URN:NBN:fi:au:hklj:360.09
related: Pääoma. Työ. Luonnonvarat
related: Talousjärjestelmät
related: Kehitysmaiden taloudelliset olot
related: URN:NBN:fi:au:hklj:367.909
related: Tuotanto. Tuottavuus
related: Talouselämän kehitysilmiöt
related: URN:NBN:fi:au:hklj:400
related: Yleinen aluemaantiede. Yleinen kulttuurimaantiede. Yleinen poliittinen maantiede
related: URN:NBN:fi:au:hklj:620.09
related: Energia
related: URN:NBN:fi:au:hklj:909
related: URN:NBN:fi:au:hklj:920
scope note: Yleinen talous- ja kauppamaantiede. Yleinen taloushistoria Eri maanosien, maiden ja aikakausien yleinen talous- ja kauppamaantiede sekä yleinen taloushistoria Suomen yleinen talous- ja kauppamaantiede Suomen yleinen taloushistoria Luonnonvarojen, raaka-aineiden, teollisuuden ja muun taloudellisen toiminnan maantieteellinen sijoittuminen Imperialismin, kolonialismin ja merkantilismin yleinen historia Tiettyä erikoisalaa koskeva talousmaantiede ja taloushistoria alan mukaisessa luokassa
scope note: Allmän ekonomisk geografi och handelsgeografi. Allmän ekonomisk historia Olika världsdelars, länders och tidsperioders allmänna ekonomiska geografi och handelsgeografi samt ekonomiska historia Finlands allmänna ekonomiska geografi och handelsgeografi Finlands allmänna ekonomiska historia Naturresurser, råmaterial, industrier och annan ekonomisk verksamhet ur det geografiska lägets synvinkel Imperialismens, kolonialismens och merkantilismens allmänna historia Ekonomisk geografi eller ekonomisk historia inom ett bestämt specialområde klassificeras enligt område @sv

Työolot
type: Class
type: Concept
subclass of: Työ sosiaalipoliittisena kysymyksenä
alternative label: Alisuoriutuminen, työuupumus (371.11)
alternative label: Burn out, työuupumus (371.11)
alternative label: Burnout, työuupumus (371.11)
alternative label: Fyysinen väkivalta, väkivalta työpaikoilla (371.11)
alternative label: Henkinen hyvinvointi, työolot (371.11)
alternative label: Henkinen väkivalta, työpaikoilla (371.11)
alternative label: Hyväksikäyttö, työolot (371.11)
alternative label: Häirintä, häirintä työpaikoilla (371.11)
alternative label: Häiriökäyttäytyminen, työelämä (371.11)
alternative label: Ihmissuhdetyö, työolot (371.11)
alternative label: Ihmissuhdetyö, työuupumus (371.11)
alternative label: Isät, vanhempainloma (371.11)
alternative label: Jaksaminen, työelämä (371.11)
alternative label: Jaksotyö, työolot (371.11)
alternative label: Kaltoinkohtelu, työelämä (371.11)
alternative label: Kausityö (371.11)
alternative label: Kesäloma, työajat (371.11)
alternative label: Kiire, stressi työpaikalla (371.11)
alternative label: Kiusaaminen, työpaikalla (371.11)
alternative label: Kylmä työ, työolot (371.11)
alternative label: Liikarasitus, työuupumus (371.11)
alternative label: Lisätyö (371.11)
alternative label: Liukuva työaika (371.11)
alternative label: Loma, työajat (371.11)
alternative label: Lomat, työajat (371.11)
alternative label: Lomitus, työelämä (371.11)
alternative label: Lomituspalvelut, työelämä (371.11)
alternative label: Loppuunpalaminen, työuupumus (371.11)
alternative label: Lyhytaikaiset työsuhteet (371.11)
alternative label: Nimittely, työpaikkakiusaaminen (371.11)
alternative label: Nollatyösopimukset, osa-aikatyö (371.11)
alternative label: Opintovapaa (371.11)
alternative label: Osa-aikatyö (371.11)
alternative label: Osasairausvapaa (371.11)
alternative label: Paluu työelämään, työolot (371.11)
alternative label: Palveluammatit, työolot (371.11)
alternative label: Pennalismi, työpaikat (371.11)
alternative label: Psyykkinen kuormittavuus, työpaikalla (371.11)
alternative label: Psyykkiset vaikutukset, työolot (371.11)
alternative label: Päivätyöt, työaika, työolot (371.11)
alternative label: Pätkätyö (371.11)
alternative label: Ruumiillinen työ, työolot (371.11)
alternative label: Sairasloma (371.11)
alternative label: Sairausloma (371.11)
alternative label: Sapattivapaa (371.11)
alternative label: Seksuaalinen häirintä, työpaikoilla (371.11)
alternative label: Sijaisapu, lomitus, työelämä (371.11)
alternative label: Simputus, työpaikat (371.11)
alternative label: Stressi, työpaikoilla (371.11)
alternative label: Stressinhallinta, työpaikoilla (371.11)
alternative label: Sukupuolinen häirintä, työpaikoilla (371.11)
alternative label: Suorituskyky, työuupumus (371.11)
alternative label: Suoriutuminen, työuupumus (371.11)
alternative label: Synnytysloma (371.11)
alternative label: Talviloma, työajat (371.11)
alternative label: Toisto, toistotyö, työolot (371.11)
alternative label: Toistotyö, työolot (371.11)
alternative label: Työ, työolot (371.11)
broader: Työ sosiaalipoliittisena kysymyksenä
in scheme: URN:NBN:fi:au:hklj:
notation: 371.11
related: Sovellettu psykologia
related: Työoikeus
related: Työn sosiologia
related: Kriminologia. Kriminaalisosiologia
related: Pääoma. Työ. Luonnonvarat
related: Elintaso. Kulutus
related: Työsuojelu
related: Perhepolitiikka. Lapsipolitiikka. Nuorisopolitiikka
related: Naisen ja miehen asema yhteiskunnassa
related: Työväenliike
related: Työmarkkinajärjestöt
related: URN:NBN:fi:au:hklj:613.31
related: Työntutkimukset. Työanalyysi
related: Henkilöstöpolitiikka
scope note: Työolot ja niiden parantaminen yleensä Työajat. Vuorotyö. Yötyö. Osa-aikatyö. Lomat Stressi työpaikalla. Väkivalta ja henkinen väkivalta työpaikalla
scope note: Arbetsförhållanden och förbättrande av dem i allmänhet Arbetstider. Skiftarbete. Nattarbete. Deltidsarbete. Semestrar Stress på arbetsplatsen. Våld, trakasseri och psykiskt våld på arbetsplatsen @sv

Päivähoito
type: Class
type: Concept
subclass of: Perhepolitiikka. Lapsipolitiikka. Nuorisopolitiikka
alternative label: Aamupäivätoiminta (371.52)
alternative label: Avoin päivähoito (371.52)
alternative label: Erikoispäiväkodit (371.52)
alternative label: Erityislastentarhanopettajat, lastentarhanopettajan työ (371.52)
alternative label: Erityispäivähoito (371.52)
alternative label: Esikouluikäiset, päivähoito (371.52)
alternative label: Iltapäivähoito (371.52)
alternative label: Iltapäivätoiminta (371.52)
alternative label: Kotihoidontuki (371.52)
alternative label: Kotihoito, lasten päivähoito (371.52)
alternative label: Koululaiset, päivähoito (371.52)
alternative label: Lapset, päivähoito (371.52)
alternative label: Lasten päivähoito (371.52)
alternative label: Lastenhoitajat, päiväkodit (371.52)
alternative label: Lastenhoito, päiväkodit (371.52)
alternative label: Lastenseimet (371.52)
alternative label: Lastentarhanopettajat, lastentarhanopettajan työ (371.52)
alternative label: Lastentarhat (371.52)
alternative label: Leikki-ikäiset, päivähoito (371.52)
alternative label: Leikkikentät, päivähoito (371.52)
alternative label: Leikkikoulut, päiväkoti (371.52)
alternative label: Leikkipaikat, päivähoito (371.52)
alternative label: Leikkipuistot, päivähoito (371.52)
alternative label: Leikkitoiminta (371.52)
alternative label: Liikuntaleikkikoulut (371.52)
alternative label: Musiikkileikkikoulut (371.52)
alternative label: Ohjattu leikkipuistotoiminta (371.52)
alternative label: Ohjattu perhepäivähoito (371.52)
alternative label: Perhepäivähoito (371.52)
alternative label: Päivähoitajat, päivähoitajan työ (371.52)
alternative label: Päivähoito (371.52)
alternative label: Päiväkodit (371.52)
alternative label: Päiväkotikasvatus (371.52)
alternative label: Ryhmäperhepäivähoito (371.52)
alternative label: Siisteyskasvatus, päiväkotikasvatus (371.52)
alternative label: Valvottu perhepäivähoito (371.52)
alternative label: Varhaiskasvatus, päiväkotikasvatus (371.52)
alternative label: Vuorohoito, päivähoito (371.52)
alternative label: Vuoropäivähoito, päivähoito (371.52)
alternative label: Ympärivuorokautinen hoito, päivähoito (371.52)
alternative label: Barn i förskoleåldern, dagvård (371.52) @sv
alternative label: Barn i lekåldern, dagvård (371.52) @sv
alternative label: Barn, dagvård (371.52) @sv
alternative label: Barnavård, daghem (371.52) @sv
alternative label: Barndagvård (371.52) @sv
alternative label: Barnkrubbor (371.52) @sv
alternative label: Barnskötare, daghem (371.52) @sv
alternative label: Barnträdgårdar (371.52) @sv
alternative label: Barnträdgårdslärare, barnträdgårdslärarens arbete (371.52) @sv
alternative label: Daghem (371.52) @sv
alternative label: Daghemsfostran (371.52) @sv
alternative label: Dagvård (371.52) @sv
alternative label: Dagvårdare, dagvårdarens arbete (371.52) @sv
alternative label: Dygnetruntvård, dagvård (371.52) @sv
alternative label: Eftermiddagsverksamhet (371.52) @sv
alternative label: Eftermiddagsvård (371.52) @sv
alternative label: Familjedagvård (371.52) @sv
alternative label: Förmiddagsaktivitet (371.52) @sv
broader: Perhepolitiikka. Lapsipolitiikka. Nuorisopolitiikka
in scheme: URN:NBN:fi:au:hklj:
notation: 371.52
related: Perhe- ja kotikasvatus
related: URN:NBN:fi:au:hklj:181.7
related: Esikoulut
related: Seurakunta. Seurakuntatyö
related: Väestötiede. Väestöpolitiikka
related: Perhe- ja holhousoikeus
related: Työoikeus
related: URN:NBN:fi:au:hklj:345
related: URN:NBN:fi:au:hklj:357.1
related: Perhesosiologia
related: URN:NBN:fi:au:hklj:373
related: Naisen ja miehen asema yhteiskunnassa
related: Työmarkkinajärjestöt
related: Lastenhoito
scope note: Päiväkodit. Lastentarhat. Leikkikoulut. Musiikkileikkikoulut. Päiväkotikasvatus Perhepäivähoito. Kotihoito. Kotihoidon tuki Ohjattu leikkipuistotoiminta. Koululaisten päivähoito Lastentarhanopettajan ja lastenhoitajan työ
scope note: Daghem. Barnträdgårdar. Lekskolor. Musiklekskolor. Fostran i daghem Familjedagvård. Vård i hemmet. Hemvårdsstöd Organiserad lekparksverksamhet. Dagvård för skolbarn Barnträdgårdslärarens och barnskötarens arbete @sv

Väestönsuojelu
type: Class
type: Concept
subclass of: URN:NBN:fi:au:hklj:390
alternative label: Atomivastuu, säteilysuojelu (395)
alternative label: Evakuointi, väestönsuojelu (395)
alternative label: Hälytykset, ilmahälytykset (395)
alternative label: Hälytykset, väestönsuojelu (395)
alternative label: Pommisuojat (395)
alternative label: Radioaktiivinen laskeuma, väestönsuojelu (395)
alternative label: Radioaktiivinen säteily, säteilysuojelu (395)
alternative label: Radioaktiivisuus, säteilysuojelu (395)
alternative label: Suojat, väestönsuojat, rakentaminen (395)
alternative label: Suojat, väestönsuojelu (395)
alternative label: Suojaus, säteilysuojelu (395)
alternative label: Suojautuminen, väestönsuojat (395)
alternative label: Suojelu, väestönsuojelu (395)
alternative label: Säteily, säteilysuojelu (395)
alternative label: Säteilyannokset, säteilysuojelu (395)
alternative label: Säteilysuojat (395)
alternative label: Säteilysuojelu (395)
alternative label: Säteilyturvallisuus, säteilysuojelu (395)
alternative label: Turvallisuus, säteilysuojelu (395)
alternative label: Varoitukset, säteilysuojelu (395)
alternative label: Varoitusmerkinnät, säteilysuojelu (395)
alternative label: Väestöhälyttimet (395)
alternative label: Väestönsuojat (395)
alternative label: Väestönsuojelu (395)
alternative label: Väestönsuojelutekniikka (395)
alternative label: Väestösuojat (395)
alternative label: Ydinlaskeuma, väestönsuojelu (395)
alternative label: Ydinvastuu, säteilysuojelu (395)
alternative label: Anordningar för allmänt larm (395) @sv
alternative label: Atomansvar, strålningssydd (395) @sv
alternative label: Befolkningsskydd (395) @sv
alternative label: Befolkningsskyddsteknik (395) @sv
alternative label: Bombskydd (395) @sv
alternative label: Evakuering, befolkningsskydd (395) @sv
alternative label: Kärnkraftsansvar, strålskydd (395) @sv
alternative label: Kärnnedfall, befolkningsskydd (395) @sv
alternative label: Larm, befolkningsskydd (395) @sv
alternative label: Larm, flyglarm (395) @sv
alternative label: Radioaktiv strålning, strålskydd (395) @sv
alternative label: Radioaktivitet, strålskydd (395) @sv
alternative label: Radioaktivt nedfall, befolkningsskydd (395) @sv
alternative label: Skydd, byggnader, befolkningsskydd (395) @sv
alternative label: Skydd, byggnader, skyddsrum, byggande (395) @sv
alternative label: Skydd, suojaus, strålskydd (395) @sv
alternative label: Skydd, suojelu, befolkningsskydd (395) @sv
alternative label: Skyddsrum (395) @sv
alternative label: Skyddsåtgärder, skyddsrum (395) @sv
alternative label: Strålning, strålskydd (395) @sv
alternative label: Strålningsdoser, strålskydd (395) @sv
alternative label: Strålningsskydd (395) @sv
alternative label: Strålskydd (395) @sv
alternative label: Strålsäkerhet, strålskydd (395) @sv
alternative label: Säkerhet, trygghet, strålskydd (395) @sv
alternative label: Varningar, strålskydd (395) @sv
alternative label: Varningstecken, strålskydd (395) @sv
broader: URN:NBN:fi:au:hklj:390
in scheme: URN:NBN:fi:au:hklj:
notation: 395
preferred label: Civil defence @en
preferred label: Befolkningsskydd @sv
related: URN:NBN:fi:au:hklj:320
related: URN:NBN:fi:au:hklj:325
related: Kansainvälinen yhteistyö
related: Rauhankysymys. Rauhantutkimus
related: URN:NBN:fi:au:hklj:332.2
related: URN:NBN:fi:au:hklj:340
related: Palo- ja pelastustoimi
related: Organisaatioiden ja laitosten sosiologia
related: Sotien yhteiskunnalliset vaikutukset
related: Ydinfysiikka. Atomifysiikka. Molekyylifysiikka
related: Lääkärikirjat. Ensiapuoppaat
related: URN:NBN:fi:au:hklj:613.3
related: Energia
related: Rakennusten erillistilat
scope note: Väestönsuojelun organisaatio. Väestönsuojelutekniikka Väestönsuojat ja niiden rakentaminen. Säteilysuojelu ja sen tekniikka
scope note: Befolkningsskyddets organisation. Befolkningsskyddsteknik Skyddsrum och byggande av dem. Strålskydd och dess teknik @sv

Eläinfysiologia
type: Class
type: Concept
subclass of: URN:NBN:fi:au:hklj:590
alternative label: Aineenvaihdunta, eläimet (593)
alternative label: Aineenvaihduntatuotteet, eläimet (593)
alternative label: Aistimet, eläinfysiologia (593)
alternative label: Aistinelimet, eläinfysiologia (593)
alternative label: Aistinfysiologia, eläimet (593)
alternative label: Aistinsolut, eläimet (593)
alternative label: Aistit, eläinfysiologia (593)
alternative label: Aivo-selkäydinneste , eläinanatomia (593)
alternative label: Aivofysiologia, eläimet (593)
alternative label: Aivokuori, eläinfysiologia (593)
alternative label: Aivoselkäydinneste , eläinanatomia (593)
alternative label: Aivot, eläinfysiologia (593)
alternative label: Akillesjänne, eläinfysiologia (593)
alternative label: Anti-Müllerian hormoni, eläinfysiologia (593)
alternative label: Biofysiikka, eläimet (593)
alternative label: Biokemia, eläimet (593)
alternative label: Biologiset rytmit, eläinfysiologia (593)
alternative label: Biomekaniikka, eläimet (593)
alternative label: Biorytmit, eläinfysiologia (593)
alternative label: Carnivorit, eläinfysiologia (593)
alternative label: Elektrofysiologia, eläimet (593)
alternative label: Eläinfysiologia (593)
alternative label: Eläinhistologia (593)
alternative label: Endokrinologia, eläimet (593)
alternative label: Endosytoosi, eläinfysiologia (593)
alternative label: Entsyymit, eläinfysiologia (593)
alternative label: Fagosytoosi, eläinfysiologia (593)
alternative label: Feromonit, eläinfysiologia (593)
alternative label: Fysiologia, eläimet (593)
alternative label: Fysiologiset rytmit, eläimet (593)
alternative label: Fysiologiset vaikutukset, eläinfysiologia (593)
alternative label: Hajuaisti, eläimet (593)
alternative label: Hapenotto, eläinfysiologia (593)
alternative label: Hedelmällisyys, eläimet (593)
alternative label: Hedelmöitys, eläimet (593)
alternative label: Hengitys, eläinfysiologia (593)
alternative label: Hengityselimet, eläinfysiologia (593)
alternative label: Hengitystiet, eläinfysiologia (593)
alternative label: Herbivorit, eläinfysiologia (593)
alternative label: Hermokudokset, eläinfysiologia (593)
alternative label: Hermosto, eläinfysiologia (593)
alternative label: Hiki, eläinfysiologia (593)
alternative label: Hivenaineet, eläinfysiologia (593)
alternative label: Hormonaaliset tekijät, eläinfysiologia (593)
alternative label: Hormonaaliset vaikutukset, eläinfysiologia (593)
alternative label: Hormonit, eläinfysiologia (593)
alternative label: Hormonivaikutukset, eläinfysiologia (593)
alternative label: Horros, eläinfysiologia (593)
alternative label: Imusuonisto, eläinfysiologia (593)
alternative label: Isoaivokuori, eläinfysiologia (593)
alternative label: Istukka, eläinfysiologia (593)
alternative label: Jänteet, eläinfysiologia (593)
alternative label: Kantajänne, eläinfysiologia (593)
alternative label: Karnivorit, eläinfysiologia (593)
alternative label: Karvapeite, eläinfysiologia (593)
alternative label: Kasvaminen, eläinfysiologia (593)
alternative label: Kasvinsyöjät, eläinfysiologia (593)
alternative label: Kasvu, eläinfysiologia (593)
broader: URN:NBN:fi:au:hklj:590
in scheme: URN:NBN:fi:au:hklj:
notation: 593
related: Äänioppi. Mekaaniset värähtelyt
related: Valo-oppi. Värioppi. Säteilyoppi
related: BIOKEMIA
related: Yleisbiologia
related: Kasvifysiologia
related: Eläinmorfologia. Eläinanatomia
related: Systemaattinen eläintiede
related: Selkärangattomat
related: Hyönteiset
related: Selkärankaiset
related: Kalat
related: Linnut
related: Nisäkkäät
related: URN:NBN:fi:au:hklj:612
scope note: Eläinfysiologian yleisteokset Eläinsytologian ja eläinhistologian yleisteokset Eläinten biokemia ja aineenvaihdunta yleensä Eläinten aistinfysiologia yleensä Tietyn eläinlajin tai lajiryhmän fysiologia ko. lajin tai ryhmän luokassa 587+
scope note: Allmänna verk om djurfysiologi Allmänna verk om djurens cytologi och djurens histologi Allmänna verk om biokemi och ämnesomsättning som rör djur Djurens sinnesfysiologi i allmänhet Fysiologi för en bestämd djurart eller artgrupp förs enligt art eller artgrupp till klass 597+ @sv

Lääketieteen filosofia ja etiikka
type: Class
type: Concept
subclass of: LÄÄKETIEDE. TERVEYDENHOITO
alternative label: Bioetiikka, lääketieteen etiikka (610.1)
alternative label: Biopankit, lääketieteen etiikka (610.1)
alternative label: Biopolitiikka, lääketieteen etiikka (610.1)
alternative label: Eläinkokeet, lääketieteen etiikka (610.1)
alternative label: Etiikka, lääketieteen (610.1)
alternative label: Eutanasia, lääketieteen etiikka (610.1)
alternative label: Hoitotestamentti (610.1)
alternative label: Koe-eläimet, lääketieteen etiikka (610.1)
alternative label: Kudospankit, lääketieteen etiikka (610.1)
alternative label: Kuolema, lääketieteen etiikka (610.1)
alternative label: Kuolinapu (610.1)
alternative label: Kärsimys, eutanasia (610.1)
alternative label: Lääketieteen etiikka (610.1)
alternative label: Lääketieteen filosofia (610.1)
alternative label: Lääkärin etiikka (610.1)
alternative label: Priorisointi, lääketieteen etiikka (610.1)
alternative label: Salaaminen, lääkärin etiikka (610.1)
alternative label: Salassapitovelvollisuus, lääkärin etiikka (610.1)
alternative label: Salaus, lääkärin etiikka (610.1)
alternative label: Tahdosta riippumaton hoito, lääketieteen etiikka (610.1)
alternative label: Tietoinen suostumus , lääketieteen etiikka (610.1)
alternative label: Tietoon perustuva suostumus , lääketieteen etiikka (610.1)
alternative label: Vaitiolovelvollisuus, lääkärin etiikka (610.1)
alternative label: Vivisektio, lääketieteen etiikka (610.1)
alternative label: Biobanker, medicinsk etik (610.1) @sv
alternative label: Bioetik, medicinens etik (610.1) @sv
alternative label: Biopolitik, medicinens etik (610.1) @sv
alternative label: Djurförsök, medicinens etik (610.1) @sv
alternative label: Döden, medicinens etik (610.1) @sv
alternative label: Döden, medicinsk etik (610.1) @sv
alternative label: Dödshjälp (610.1) @sv
alternative label: Etik, medicinens (610.1) @sv
alternative label: Eutanasi, medicinens etik (610.1) @sv
alternative label: Försöksdjur, medicinens etik (610.1) @sv
alternative label: Hemlighållande, läkarens etik (610.1) @sv
alternative label: Informerat samtycke, medicinsk etik (610.1) @sv
alternative label: Lidande, eutanasi (610.1) @sv
alternative label: Läkaretik (610.1) @sv
alternative label: Medicinsk etik (610.1) @sv
alternative label: Medicinsk filosofi (610.1) @sv
alternative label: Prioritering, medicinens etik (610.1) @sv
alternative label: Sekretess, läkarens etik (610.1) @sv
alternative label: Tvångsvård, medicinsk etik (610.1) @sv
alternative label: Tystnadsplikt, läkarens etik (610.1) @sv
alternative label: Vivisektion, medicinens etik (610.1) @sv
alternative label: Vävnadsbanker, medicinsk etik (610.1) @sv
alternative label: Vårdtestamente (610.1) @sv
broader: LÄÄKETIEDE. TERVEYDENHOITO
in scheme: URN:NBN:fi:au:hklj:
notation: 610.1
preferred label: Philosophy and ethics of medicine @en
preferred label: Medicinsk filosofi och etik @sv
related: Etiikka. Moraalifilosofia
related: Kristillinen etiikka
related: URN:NBN:fi:au:hklj:332.22
related: URN:NBN:fi:au:hklj:371.6
related: Hoitotiede. Hoitotyö. Hoitohenkilökunta
related: Hoitolaitokset. Sairaalatekniikka
related: Lääketieteen opinnot
related: Lääkärin työ
related: Sairaanhoitajan ja terveydenhoitajan työ
related: URN:NBN:fi:au:hklj:615
related: Raskaus. Sikiönkehitys. Synnytys. Gynekologia
related: URN:NBN:fi:au:hklj:618.24
related: Itsemurhat ja niiden ehkäisy
scope note: Lääketieteen filosofia ja etiikka yleensä Lääkärin etiikka yleensä. Hoitotyön etiikka yleensä Eutanasia. Kuolinapu Lääketieteen erikoisaloja koskeva filosofia ja etiikka alan mukaisessa luokassa
scope note: Medicinsk filosofi och etik i allmänhet Läkaretik i allmänhet. Vårdarbetets etik i allmänhet Eutanasi. Dödshjälp Filosofi och etik inom medicinska specialområden klassificeras enligt område @sv

Fysioterapia. Fysiologiset hoitomuodot
type: Class
type: Concept
subclass of: URN:NBN:fi:au:hklj:615
alternative label: Fysiatria (615.2)
alternative label: Fysikaalinen hoito (615.2)
alternative label: Fysiologiset hoitomuodot (615.2)
alternative label: Fysioterapeutit, fysioterapeutin työ (615.2)
alternative label: Fysioterapia (615.2)
alternative label: Hartiat, hieronta, fysioterapia (615.2)
alternative label: Hieronta (615.2)
alternative label: Infrapunahoito (615.2)
alternative label: Jäsenkorjaus, manipulaatiohoito, fysioterapia (615.2)
alternative label: Kirkasvalolamput (615.2)
alternative label: Kuumakivihieronta (615.2)
alternative label: Kylmyyshoito (615.2)
alternative label: Kylmäkäsittely, hoitomenetelmät (615.2)
alternative label: Liikkeet, fysioterapia (615.2)
alternative label: Liikuntahoito, fysioterapia (615.2)
alternative label: Liikuntaterapia, fysioterapia (615.2)
alternative label: Lämpöhoito (615.2)
alternative label: Lääkintävoimistelu (615.2)
alternative label: Magneettihoito, fysikaalinen hoito (615.2)
alternative label: Manipulaatiohoito, fysioterapia (615.2)
alternative label: Sähköhoito (615.2)
alternative label: Ultraviolettihoito (615.2)
alternative label: Valohoito (615.2)
alternative label: Äänihoito (615.2)
alternative label: Axlarna, massage, fysioterapi (615.2) @sv
alternative label: Dagsljuslampor (615.2) @sv
alternative label: Elektroterapi (615.2) @sv
alternative label: Fysiatri (615.2) @sv
alternative label: Fysikalisk vård (615.2) @sv
alternative label: Fysiologiska behandlingsmetoder (615.2) @sv
alternative label: Fysioterapeuter, fysioterapeutens arbete (615.2) @sv
alternative label: Fysioterapi (615.2) @sv
alternative label: Hot stone massage (615.2) @sv
alternative label: Infrarödbehandling (615.2) @sv
alternative label: Köldbehandling, behanmdlingsmetoder (615.2) @sv
alternative label: Ljudterapi (615.2) @sv
alternative label: Ljusbehandling (615.2) @sv
alternative label: Magnetterapi, fysikalisk vård (615.2) @sv
alternative label: Manipulationsvård, fysioterapi (615.2) @sv
alternative label: Massage (615.2) @sv
alternative label: Motionsterapi, fysioterapi (615.2) @sv
alternative label: Muskel- och ledkorrigering, manipulationsvård, fysioterapi (615.2) @sv
alternative label: Rörelser, fysioterapi (615.2) @sv
alternative label: Rörelseterapi, fysioterapi (615.2) @sv
alternative label: Sjukgymnastik (615.2) @sv
alternative label: Ultraviolettbehandling (615.2) @sv
alternative label: Värmeterapi (615.2) @sv
broader: URN:NBN:fi:au:hklj:615
in scheme: URN:NBN:fi:au:hklj:
notation: 615.2
preferred label: Physiotherapy. Physiological treatments @en
preferred label: Fysioterapi. Fysiologiska behandlingsmetoder @sv
related: URN:NBN:fi:au:hklj:332.22
related: URN:NBN:fi:au:hklj:371.6
related: Hoitolaitokset. Sairaalatekniikka
related: Terveydenhoito
related: Henkilökohtainen terveydenhoito
related: Urheilulääketiede
related: URN:NBN:fi:au:hklj:615.3
related: URN:NBN:fi:au:hklj:615.8
related: Vaihtoehtolääkintä. Luonnonparannus
related: URN:NBN:fi:au:hklj:616
related: URN:NBN:fi:au:hklj:617
related: URN:NBN:fi:au:hklj:617.7
related: Liikuntaelimet. Liikuntaelinten taudit
related: Voimistelu
scope note: Fysiatria. Fysikaalinen hoito. Lääkintävoimistelu Hieronta. Urheiluhieronta Lämpö-, kylmyys-, sähkö-, valo- ja äänihoito Infrapuna- ja ultraviolettihoito
scope note: Fysiatri. Fysikalisk vård. Sjukgymnastik Massage. Idrottsmassage Värmebehandling, kryoterapi, elbehandling, ljusterapi och ljudterapi Infraröd- och ultraviolettbehandling @sv

Lentokoneet
type: Class
type: Concept
subclass of: Ilmakulkuneuvot
alternative label: Ambulanssilentokoneet, lentokoneet (626.3)
alternative label: Huolto, lentokoneet (626.3)
alternative label: Hävittäjät, lentokoneet (626.3)
alternative label: Ilmailu, lentokoneet (626.3)
alternative label: Ilmailu, sotilaslentokoneet (626.3)
alternative label: Kojelaudat, lentokoneet (626.3)
alternative label: Lento-ominaisuudet, lentokoneet (626.3)
alternative label: Lentoasemat, rakentaminen, lentokentät (626.3)
alternative label: Lentokentät, rakentaminen (626.3)
alternative label: Lentokoneet (626.3)
alternative label: Lentokonemoottorit (626.3)
alternative label: Lentokonetekniikka (626.3)
alternative label: Liikennealueet, rakentaminen, asema-alueet, lentoasemat (626.3)
alternative label: Liikennealueet, rakentaminen, lentokentät (626.3)
alternative label: Matkustajakoneet (626.3)
alternative label: Moottorilentokoneet (626.3)
alternative label: Museolentokoneet, lentokoneet (626.3)
alternative label: Mustat laatikot, lentokonetekniikka (626.3)
alternative label: Ohjaamot, lentokoneet (626.3)
alternative label: Pommikoneet (626.3)
alternative label: Potkurit, lentokoneet (626.3)
alternative label: Siivet, lentokoneet (626.3)
alternative label: Siviililentokoneet (626.3)
alternative label: Sotilasilmailu, sotilaslentokoneet (626.3)
alternative label: Sotilaslentokoneet (626.3)
alternative label: Suihkukoneet (626.3)
alternative label: Tiedustelukoneet (626.3)
alternative label: Vesitasot (626.3)
alternative label: Ambulansflygplan, flygplan (626.3) @sv
alternative label: Bombplan (626.3) @sv
alternative label: Civila flygplan (626.3) @sv
alternative label: Flygegenskaper, flygplan (626.3) @sv
alternative label: Flygfält, byggande (626.3) @sv
alternative label: Flygplan (626.3) @sv
alternative label: Flygplansmotorer (626.3) @sv
alternative label: Flygplansteknik (626.3) @sv
alternative label: Flygplatser, byggande, flygfält (626.3) @sv
alternative label: Instrumentbrädor, flygplan (626.3) @sv
alternative label: Jagare, flygplan (626.3) @sv
alternative label: Jetplan (626.3) @sv
alternative label: Luftfart, flygplan (626.3) @sv
alternative label: Luftfart, militärflygplan (626.3) @sv
alternative label: Militärflyg, militärflygplan (626.3) @sv
alternative label: Militärflygplan (626.3) @sv
alternative label: Motorflygplan (626.3) @sv
alternative label: Museiflygplan, flygplan (626.3) @sv
alternative label: Passagerarplan (626.3) @sv
alternative label: Pilothytter, flygplan (626.3) @sv
alternative label: Propellrar, flygplan (626.3) @sv
alternative label: Sjöflygplan (626.3) @sv
alternative label: Skötsel, teknisk, flygplan (626.3) @sv
alternative label: Spaningsflygplan (626.3) @sv
alternative label: Svarta lådor, flygplansteknik (626.3) @sv
alternative label: Trafikområden, byggande, flygfält (626.3) @sv
alternative label: Trafikområden, byggande, stationsområden, flygplatser (626.3) @sv
alternative label: Vingar, flygplan (626.3) @sv
broader: Ilmakulkuneuvot
in scheme: URN:NBN:fi:au:hklj:
notation: 626.3
preferred label: Aeroplanes @en
preferred label: Flygplan @sv
related: URN:NBN:fi:au:hklj:380
related: Vesi- ja ilmaliikenne
related: Ilmaliikenne. Ilmailu
related: URN:NBN:fi:au:hklj:460
related: Yleinen konetekniikka
related: Koneenrakennus. Pneumatiikka. Hydrauliikka
related: Voimakoneet. Moottorit. Nosto- ja kuljetuslaitteet
related: Tiet. Kadut. Tienrakennus. Kadunrakennus
related: Muut ilmakulkuneuvot
related: URN:NBN:fi:au:hklj:631
related: Moottoriurheilu. Lentourheilu
related: Lentourheilu
scope note: Lentokoneen suunnittelu, tekniikka ja rakentaminen Lentokoneen rakenne ja osat. Lentokoneiden lento-ominaisuudet Lentokoneen huolto, viat ja korjaus Lentokonetyypit. Moottorilentokoneet. Vesitasot. Suihkukoneet. Siviililentokoneet. Matkustajakoneet. Kuljetuskoneet. Sotilaslentokoneet. Hävittäjät. Pommikoneet Lentokentät ja niiden rakentaminen. Lentokenttätekniikka Jos teos koskee sekä ilmaliikennettä tai ilmailua että lentokoneita, on etusija luokalla 386.2 Jos teos koskee sekä lentourheilua että lentokoneita, on etusija luokalla 791.84
scope note: Konstruktion och tillverkning av flygplan, deras teknik Flygplanets konstruktion och delar. Flygplanens flygegenskaper Service, fel och reparation som rör flygplan Flygplanstyper. Motorflygplan. Sjöflygplan. Jetplan. Civilflygplan. Passagerarflygplan. Transportflygplan. Militärflygplan. Jaktplan. Bombplan Flygplatser och byggande av dem. Flygfältsteknik Om verket handlar om såväl lufttrafik och luftfart som flygplan ges företräde åt klass 386.2 Om verket handlar om både flygsport och flygplan ges företräde åt klass 791.84 @sv

Kaivos- ja kaivannaisteollisuus
type: Class
type: Concept
subclass of: KEMIAN TEOLLISUUS. KAIVOSTEOLLISUUS
alternative label: Alumiini, etsintä ja louhinta (646)
alternative label: Alumiinimalmit, etsintä ja louhinta (646)
alternative label: Asfaltti, kaivannaisteollisuus (646)
alternative label: Avolouhinta (646)
alternative label: Avolouhokset (646)
alternative label: Bitumi, kaivannaisteollisuus (646)
alternative label: Esiintymät, kaivannaiset (646)
alternative label: Etikkahappo, orgaaninen kemia (646)
alternative label: Fossiiliset polttoaineet, etsintä, louhinta ja poraus (646)
alternative label: Geologia, kaivosteollisuus (646)
alternative label: Geologia, malmin ja muiden kaivannaisten etsintä (646)
alternative label: Geotekniikka, kaivokset (646)
alternative label: Gneissi, louhinta (646)
alternative label: Graniitti, louhinta (646)
alternative label: Hiekka, hiekkakuopat (646)
alternative label: Hiekkakivi, louhinta (646)
alternative label: Hiekkakuopat (646)
alternative label: Hiekkapuhallus, kiven työstö (646)
alternative label: Hiili, kivihiilen louhinta (646)
alternative label: Hionta, kiven työstö (646)
alternative label: Hopea, etsintä ja louhinta (646)
alternative label: Hopeakaivokset (646)
alternative label: Hopeamalmit, etsintä ja louhinta (646)
alternative label: Jade, etsintä (646)
alternative label: Jalokivet, etsintä ja louhinta (646)
alternative label: Jalometallit, etsintä ja louhinta (646)
alternative label: Jauhatus, sepeliteollisuus (646)
alternative label: Jyrsimet, kiven työstö (646)
alternative label: Jyrsintä, kiven työstö (646)
alternative label: Järvimalmit, etsintä ja nosto (646)
alternative label: Kaasukentät, etsintä (646)
alternative label: Kaasunetsintä (646)
alternative label: Kaasunporaus (646)
alternative label: Kaasuvarat (646)
alternative label: Kairaus, kaivostoiminta (646)
alternative label: Kaivannaiset (646)
alternative label: Kaivannaisteollisuus (646)
alternative label: Kaivokset (646)
alternative label: Kaivosalueet, kaivosteollisuus (646)
alternative label: Kaivoskaupungit, kaivostoiminta (646)
alternative label: Kaivosonnettomuudet (646)
alternative label: Kaivostekniikka (646)
alternative label: Kaivosteollisuus (646)
alternative label: Kaivostoiminta (646)
alternative label: Kaivostyö (646)
alternative label: Kaivostyöntekijät, kaivostyö (646)
alternative label: Kaivu, kaivostoiminta (646)
alternative label: Kaivu, maa-aineksen otto (646)
alternative label: Kaivutekniikka, kaivostekniikka (646)
alternative label: Kaivutekniikka, maa-aineksen otto (646)
alternative label: Kalkki, kaivosteollisuus (646)
alternative label: Kalkkikaivokset (646)
alternative label: Kalkkikivi, louhinta (646)
alternative label: Kalkkiteollisuus (646)
alternative label: Kiven työstö (646)
alternative label: Kivenjalostus (646)
alternative label: Kivenlouhinta (646)
alternative label: Kivi, louhinta (646)
broader: KEMIAN TEOLLISUUS. KAIVOSTEOLLISUUS
in scheme: URN:NBN:fi:au:hklj:
notation: 646
related: GEOLOGIA
related: Mineralogia. Kristallografia. Petrologia
related: Ympäristönsuojelu. Luonnonsuojelu
related: Uhanalaiset lajit. Luonnonsuojelualueet
related: Maaperän, metsien ja soiden suojelu
related: Vesien suojelu
related: Ilman suojelu
related: Energia
related: Sähköenergian tuottaminen. Voimalatekniikka
related: Metallurgia. Metallioppi
related: Orgaanisen kemian teollisuus
related: Kivihiili. Turve
related: Öljy. Maakaasu
related: Geotekniikka. Maatyöt
scope note: Kaivos- ja kaivannaisteollisuuden liiketalous, tuotantomenetelmät, rationalisointi, työt, prosessit, koneet, raaka-aineet, tuotanto ja tuotteiden kauppa Malmien, öljyn, maakaasun, kivihiilen, jalokivien, kivilajien, mineraalien ja maalajien etsintä, louhinta ja poraus Kullanhuuhdonta. Kullanetsintä. Kultakaivokset Kaivokset ja niiden rakentaminen. Kaivostekniikka. Kaivostyö Avolouhokset. Maan- ja vedenalainen louhinta ja poraus Hiekkakuopat. Kivilouhokset. Kiven työstö. Kivenmurskaus Kaivosten, kaivostoiminnan ja kullanhuuhdonnan historia 646.09
scope note: Företagsekonomi, produktionsmetoder, rationalisering, arbete, processer, maskiner, råmaterial, produktion och handel inom bergsbruk och gruvindustri Prospektering och utvinning av malmer, olja, naturgas, stenkol, ädelstenar, bergarter, mineraler och jordarter Guldvaskning. Guldletning. Guldgruvor Gruvor och byggande av dem. Gruvteknik. Gruvarbete Dagbrott. Brytning och borrning under jord och vatten Sandtag. Stenbrott. Bearbetning av stenmaterial. Stenkrosserier Gruvornas, bergsbrukets och guldvaskningens historia 646.09 @sv

Kauppamatematiikka
type: Class
type: Concept
subclass of: URN:NBN:fi:au:hklj:675
alternative label: Finanssimatematiikka (675.4)
alternative label: Kaupankäynti, kauppamatematiikka (675.4)
alternative label: Kauppa, kauppamatematiikka (675.4)
alternative label: Kauppamatematiikka (675.4)
alternative label: Korkolasku (675.4)
alternative label: Korkotaulut (675.4)
alternative label: Matemaattiset menetelmät, kauppamatematikka (675.4)
alternative label: Matematiikka, kauppamatematiikka (675.4)
alternative label: Talousmatematiikka, kauppamatematiikka (675.4)
alternative label: Ekonomisk matematik, handelsmatematik (675.4) @sv
alternative label: Finansmatematik (675.4) @sv
alternative label: Handel, handelsmatematik (675.4) @sv
alternative label: Handelsmatematik (675.4) @sv
alternative label: Kommers, handelsmatematik (675.4) @sv
alternative label: Matematik, handelsmatematik (675.4) @sv
alternative label: Matematiska metoder, handelsmatematik (675.4) @sv
alternative label: Ränteräkning (675.4) @sv
alternative label: Räntetabeller (675.4) @sv
broader: URN:NBN:fi:au:hklj:675
in scheme: URN:NBN:fi:au:hklj:
notation: 675.4
preferred label: Commercial mathematics @en
preferred label: Handelsmatematik @sv
related: Kauppaoikeus. Yhtiölainsäädäntö. Pankki- ja vakuutuslainsäädäntö
related: URN:NBN:fi:au:hklj:360
related: URN:NBN:fi:au:hklj:363
related: Osuustoiminta
related: URN:NBN:fi:au:hklj:368
related: MATEMATIIKKA
related: Matematiikan muut alat
related: URN:NBN:fi:au:hklj:627.751
related: URN:NBN:fi:au:hklj:650.2
related: Kaupan historia
related: Liiketalouden hallinto ja organisaatio
related: Laskentatoimi. Rahoitus. Talousarviot
related: Liiketaloudellinen kirjanpito ja tilintarkastus
related: Mainonta. Kuluttajanvalistus
scope note: Kauppamatematiikan yleisteokset ja yleiset oppikirjat Korkotaulut Erikoisaloja koskeva kauppamatematiikka alan mukaisessa luokassa
scope note: Allmänna verk och läroböcker i handelsmatematik Räntetabeller Handelsmatematik inom specialområden klassificeras enligt område @sv

Taideopinnot
type: Class
type: Concept
subclass of: URN:NBN:fi:au:hklj:700
alternative label: Kuvataidekorkeakoulut (707)
alternative label: Kuvataidekoulut (707)
alternative label: Kuvataideoppilaitokset (707)
alternative label: Lastenkulttuuri, lasten kuvataidekoulut (707)
alternative label: Oppilaitokset, taideoppilaitokset (707)
alternative label: Taidekorkeakoulut (707)
alternative label: Taidekoulut (707)
alternative label: Taideopinnot (707)
alternative label: Taideoppilaitokset (707)
alternative label: Taideyliopistot (707)
alternative label: Teokset, taiteilijoiden teosluettelot (703 ... 776.03)
alternative label: Barnkultur, konstskolor för barn (707) @sv
alternative label: Bildkonsthögskolor (707) @sv
alternative label: Bildkonstläroinrättningar (707) @sv
alternative label: Bildkonstskolor (707) @sv
alternative label: Konsthögskolor (707) @sv
alternative label: Konstskolor (707) @sv
alternative label: Konststudier (707) @sv
alternative label: Konstuniversitet (707) @sv
alternative label: Läroinrättningar inom konstbranschen (707) @sv
alternative label: Läroinrättningar, konstskolor (707) @sv
alternative label: Verk, konstnärers opusförteckningar (703 ... 776.03) @sv
broader: URN:NBN:fi:au:hklj:700
in scheme: URN:NBN:fi:au:hklj:
notation: 707
preferred label: Art studies. Educational institutions @en
preferred label: Konststudier @sv
related: Symbolit. Koodit. Merkkijärjestelmät
related: URN:NBN:fi:au:hklj:010
related: Yleisbibliografiat. Kansallisbibliografiat
related: Kustantajien ja kirjakauppojen luettelot
related: Erikoisalojen bibliografiat
related: Taiteet. Liikunta
related: Paikallisbibliografiat. Henkilöbibliografiat
related: Taideaineiden opetusoppi
related: Keskiasteen koulutus
related: Kansalais-, kansan- ja työväenopistot. Kansankorkeakoulut
related: Oppikirjat. Harjoituskirjat. Tehtäväkokoelmat. Taiteen materiaalit ja tekniikka. Taidekasvatus
related: URN:NBN:fi:au:hklj:760
related: MUSIIKKI
related: Musiikin filosofia, estetiikka, psykologia ja sosiologia Musiikkikasvatus. Musiikkiopetus
scope note: Taideopinnot ja taideoppilaitokset yleensä Taidekoulut ja -opistot yleensä. Lasten taidekoulut yleensä Taideakatemiat yleensä Kuvataidekoulut ja -opistot yleensä Eri taiteenaloja koskevat opinnot ja oppilaitokset alan mukaisessa luokassa
scope note: Konststudier och konstskolor i allmänhet Läroinrättningar för konststudier och konstinstitut i allmänhet Konstskolor för barn i allmänhet Konstakademier i allmänhet Skolor och institut för bildkonst i allmänhet Studier och läroinrättningar som rör enskilda konstarter klassificeras enligt konstart @sv

Antiikin taidehistoria
type: Class
type: Concept
subclass of: URN:NBN:fi:au:hklj:709
alternative label: Aigeialainen kulttuuri, taide (709.2)
alternative label: Aigeialainen taide (709.2)
alternative label: Antiikki, taidehistoria (709.2)
alternative label: Etruskit, taidehistoria (709.2)
alternative label: Hellenistinen taide (709.2)
alternative label: Kreeta, taidehistoria (709.2)
alternative label: Kreetalais-mykeneläinen kulttuuri, taide (709.2)
alternative label: Kreetalais-mykeneläinen taide (709.2)
alternative label: Kreikka, taidehistoria, antiikki (709.2)
alternative label: Mykeneläinen kulttuuri, taide (709.2)
alternative label: Myöhäisantiikki, taidehistoria (709.2)
alternative label: Rooman valtakunta, taidehistoria (709.2)
alternative label: Taidehistoria, antiikki (709.2)
alternative label: Vanha aika, taidehistoria, antiikki (709.2)
alternative label: Varhaiskristillinen taide (709.2)
alternative label: Antiken, konsthistoria (709.2) @sv
alternative label: Egeisk konst (709.2) @sv
alternative label: Egeisk kultur, konst (709.2) @sv
alternative label: Etrusker, konsthistoria (709.2) @sv
alternative label: Fornkristen konst (709.2) @sv
alternative label: Gamla tiden, konsthistoria, antiken (709.2) @sv
alternative label: Grekland, konsthistoria, antiken (709.2) @sv
alternative label: Hellenistisk konst (709.2) @sv
alternative label: Konsthistoria, antiken (709.2) @sv
alternative label: Kreta, konsthistoria (709.2) @sv
alternative label: Kretensisk-mykensk konst (709.2) @sv
alternative label: Kretensisk-mykensk kultur, konst (709.2) @sv
alternative label: Mykensk kultur, konst (709.2) @sv
alternative label: Romerska riket, konsthistoria (709.2) @sv
alternative label: Senantiken, konsthistoria (709.2) @sv
broader: URN:NBN:fi:au:hklj:709
in scheme: URN:NBN:fi:au:hklj:
notation: 709.2
preferred label: Ancient art @en
preferred label: Antikens konsthistoria @sv
related: Euroopan ulkopuolisten vanhojen kulttuurien taide
related: Vanhan ajan arkkitehtuuri. Euroopan ulkopuolisten vanhojen kulttuurien arkkitehtuuri
related: URN:NBN:fi:au:hklj:730.9
related: Vanhan ajan kuvanveistotaide. Euroopan ulkopuolisten vanhojen kulttuurien kuvanveistotaide
related: URN:NBN:fi:au:hklj:740.9
related: Vanhan ajan maalaustaide. Euroopan ulkopuolistenvanhojen kulttuurien maalaustaide
related: URN:NBN:fi:au:hklj:770.9
related: URN:NBN:fi:au:hklj:789
related: URN:NBN:fi:au:hklj:789.1
related: Varhaiskansojen musiikki
related: Kreikan muinaishistoria ja arkeologia
related: Rooman valtakunnan historia ja arkeologia
related: URN:NBN:fi:au:hklj:919
related: Vanhan ajan kulttuurihistoria
scope note: Muinaisen Kreikan ja Rooman valtakunnan taide yleensä Minolainen, mykeneläinen ja hellenistinen taide yleensä Etruskien taide yleensä Antiikin taiteen eri aloja koskevat teokset alan mukaisessa luokassa Yksittäisiä taiteilijoita tai heidän tuotantoaan koskevat teokset ovat aina ko. taiteenalan tai sen historian luokassa
scope note: Konsten i det antika Grekland och Romarriket i allmänhet Minoisk, mykensk och hellenistisk konst i allmänhet Etruskernas konst i allmänhet Verk som handlar om antikens enskilda konstarter klassificeras enligt konstart Verk som handlar om enskilda konstnärer och deras produktion klassificeras alltid enligt konstarten eller dess historia @sv

Vanhan ajan arkkitehtuuri. Euroopan ulkopuolisten vanhojen kulttuurien arkkitehtuuri
type: Class
type: Concept
subclass of: URN:NBN:fi:au:hklj:720.9
alternative label: Aasia, arkkitehtuuri, perinteinen (720.903)
alternative label: Antiikki, arkkitehtuuri (720.903)
alternative label: Arkkitehdit, elämäkerralliset hakuteokset (720.903 ... 720.9903)
alternative label: Egypti, arkkitehtuuri, muinaisajan (720.903)
alternative label: Etruskit, arkkitehtuuri (720.903)
alternative label: Intia, arkkitehtuuri, perinteinen (720.903)
alternative label: Itämaat, arkkitehtuuri, perinteinen (720.903)
alternative label: Japani, arkkitehtuuri, perinteinen (720.903)
alternative label: Kiina, arkkitehtuuri, perinteinen (720.903)
alternative label: Kreikka, arkkitehtuuri, antiikki (720.903)
alternative label: Persia, arkkitehtuuri, muinaisaika (720.903)
alternative label: Pylväsjärjestelmät, antiikki (720.903)
alternative label: Pylväät, antiikin arkkitehtuuri (720.903)
alternative label: Riemukaaret, antiikin arkkitehtuuri (720.903)
alternative label: Rooman valtakunta, arkkitehtuuri (720.903)
alternative label: Antiken, arkitektur (720.903) @sv
alternative label: Arkitekter, biografiska uppslagsverk (720.903 ... 720.9903) @sv
alternative label: Asien, arkitektur, traditionell (720.903) @sv
alternative label: Egypten, arkitektur, forntidens (720.903) @sv
alternative label: Etrusker, arkitektur (720.903) @sv
alternative label: Grekland, arkitektur, antiken (720.903) @sv
alternative label: Indien, arkitektur, traditionell (720.903) @sv
alternative label: Japan, arkitektur, traditionell (720.903) @sv
alternative label: Kina, arkitektur, traditionell (720.903) @sv
alternative label: Kolonner, pelare, antikens arkitektur (720.903) @sv
alternative label: Kolonnordningar, antiken (720.903) @sv
alternative label: Orienten, arkitektur, traditionell (720.903) @sv
alternative label: Persien, arkitektur, forntiden (720.903) @sv
alternative label: Romerska riket, arkitektur (720.903) @sv
alternative label: Triumfbågar, antikens arkitektur (720.903) @sv
broader: URN:NBN:fi:au:hklj:720.9
in scheme: URN:NBN:fi:au:hklj:
notation: 720.903
preferred label: Ancient architecture. Architecture of ancient non-European cultures @en
preferred label: Forntidens arkitektur. Utomeuropeiska fornkulturers arkitektur @sv
related: URN:NBN:fi:au:hklj:709
related: Euroopan ulkopuolisten vanhojen kulttuurien taide
related: Antiikin taidehistoria
related: Arkkitehtuurikilpailut. Arkkitehtuurinäyttelyt. Arkkitehtuuripalkinnot
related: Alkuperäiskansojen arkkitehtuuri
related: Keskiajan arkkitehtuuri
related: Eurooppa
related: Etelä-Eurooppa
related: Italia
related: Aasia
related: Afrikka
related: URN:NBN:fi:au:hklj:749.1
scope note: Vanhan ajan ja antiikin arkkitehtuuri yleensä Muinaisen Kreikan ja Rooman valtakunnan arkkitehtuuri Minolainen, mykeneläinen ja hellenistinen arkkitehtuuri. Etruskien arkkitehtuuri Euroopan ulkopuolisten vanhojen korkeakulttuurien arkkitehtuuri Itämaisten kulttuurien perinteinen arkkitehtuuri Tässä esim. Kiinan, Japanin, Intian, Persian, Mesopotamian ja Egyptin vanhojen kulttuurien arkkitehtuuri Vanhan ajan arkkitehtuurin erikoisaloja koskevat teokset alan mukaisessa luokassa
scope note: Forntidens och antikens arkitektur i allmänhet Arkitekturen i det antika Grekland och Romarriket Minoisk, mykensk och hellenistisk arkitektur. Etruskernas arkitektur De utomeuropeiska forna högkulturernas arkitektur De österländska kulturernas traditionella arkitektur Hit t.ex. de kinesiska, japanska, indiska, persiska, mesopotamiska och egyptiska fornkulturernas arkitektur Specialområden inom forntidens arkitektur klassificeras enligt område @sv

Keramiikkataide. Posliinitaide
type: Class
type: Concept
subclass of: URN:NBN:fi:au:hklj:760
alternative label: Antiikkiesineet, keramiikka ja posliini (765 +)
alternative label: Dreijaus (765 +)
alternative label: Kynttilänjalat, savityöohjeet (765)
alternative label: Käsityöt, savityöt (765)
alternative label: Muotoilijat, eri alat (761 ... 768)
alternative label: Muotoilu, eri alat (761 ... 768)
alternative label: Muovailu, savityöt (765)
alternative label: Paperisavi, käsityöt, savityöt (765)
alternative label: Savi, savityöt (765 +)
alternative label: Saviastiat, taideteollisuus (765 +)
alternative label: Savituotteet, taideteollisuus (765 +)
alternative label: Savityöt, taideteollisuus (765 +)
alternative label: Antikviteter, keramik och porslin (765 +) @sv
alternative label: Drejning (765 +) @sv
alternative label: Formgivare, olika branscher (761 ... 768) @sv
alternative label: Formgivning, olika branscher (761 ... 768) @sv
alternative label: Handarbeten, keramikarbeten (765) @sv
alternative label: Keramikarbeten, konstindustri (765 +) @sv
alternative label: Keramikvaror, konstindustri (765 +) @sv
alternative label: Lera, keramikarbeten (765 +) @sv
alternative label: Lerkärl, konstindustri (765 +) @sv
alternative label: Ljusstakar, keramikarbeten (765) @sv
alternative label: Modellering, konst, keramikarbeten (765) @sv
alternative label: Papperslera, handarbeten, keramikarbeten (765) @sv
broader: URN:NBN:fi:au:hklj:760
in scheme: URN:NBN:fi:au:hklj:
narrower: Keramiikkataide
narrower: Posliinitaide. Posliinimaalaus
notation: 765
preferred label: Ceramic art. Porcelain art @en
preferred label: Keramikkonst. Porslinskonst @sv
related: Lasiteollisuus. Keraaminen teollisuus. Sementtiteollisuus
related: URN:NBN:fi:au:hklj:643.03
related: KUVANVEISTOTAIDE
related: URN:NBN:fi:au:hklj:730.9
related: Kuvanveistotaiteen materiaalit ja tekniikka
related: Taideteollisuuden teoria, estetiikka ja filosofia
related: Antiikkiesineiden keräily
related: Taideteollisuuden historia
related: URN:NBN:fi:au:hklj:798
scope note: Teokset, jotka koskevat sekä keramiikka- että posliinitaidetta Tässä ja alaluokissa keramiikka- ja posliinitaiteen historia ja henkilöhistoria sekä materiaalit, tekniikka ja estetiikka Tässä ja alaluokissa myös keramiikka- ja posliinityöohjeet ja -mallit Tässä savityöohjeet ja mallit
scope note: Verk som handlar om både keramikkonst och porslinskonst Hit och till underklasserna keramikkonstens och porslinskonstens historia och personhistoria samt material, tekniker och estetik Hit och till underklasserna också beskrivningar och modeller för keramik- och porslinsarbete Hit beskrivningar och modeller för arbeten i lera @sv

Ruotsi
type: Class
type: Concept
subclass of: Pohjoismaat. Baltian maat
alternative label: Hambot, kansanmusiikki (784.112)
alternative label: Ruotsi, kansanmusiikki (784.112)
alternative label: Hambo, folkmusik (784.112) @sv
alternative label: Sverige, folkmusik (784.112) @sv
broader: Pohjoismaat. Baltian maat
in scheme: URN:NBN:fi:au:hklj:
notation: 784.112
preferred label: Sweden @en
preferred label: Sverige @sv
related: URN:NBN:fi:au:hklj:473.1
related: URN:NBN:fi:au:hklj:769
related: URN:NBN:fi:au:hklj:783
related: URN:NBN:fi:au:hklj:783.1
related: URN:NBN:fi:au:hklj:787
related: URN:NBN:fi:au:hklj:787.2
related: URN:NBN:fi:au:hklj:787.29
related: URN:NBN:fi:au:hklj:788.8
related: URN:NBN:fi:au:hklj:789
related: URN:NBN:fi:au:hklj:795.1
related: URN:NBN:fi:au:hklj:797.2
related: URN:NBN:fi:au:hklj:807

Norja
type: Class
type: Concept
subclass of: Pohjoismaat. Baltian maat
alternative label: Norja, kansanmusiikki (784.113)
alternative label: Norge, folkmusik (784.113) @sv
broader: Pohjoismaat. Baltian maat
in scheme: URN:NBN:fi:au:hklj:
notation: 784.113
preferred label: Norway @en
preferred label: Norge @sv
related: URN:NBN:fi:au:hklj:473.1
related: URN:NBN:fi:au:hklj:769
related: URN:NBN:fi:au:hklj:783
related: URN:NBN:fi:au:hklj:783.1
related: URN:NBN:fi:au:hklj:787
related: URN:NBN:fi:au:hklj:787.2
related: URN:NBN:fi:au:hklj:787.29
related: URN:NBN:fi:au:hklj:788.8
related: URN:NBN:fi:au:hklj:789
related: URN:NBN:fi:au:hklj:795.1
related: URN:NBN:fi:au:hklj:797.2
related: URN:NBN:fi:au:hklj:807
scope note: Tässä myös Huippuvuoret sekä Svalbard ja Jan Mayen
scope note: Hit också Svalbard och Jan Mayen @sv

Islanti
type: Class
type: Concept
subclass of: Pohjoismaat. Baltian maat
alternative label: Islanti, kansanmusiikki (784.115)
alternative label: Island, folkmusik (784.115) @sv
broader: Pohjoismaat. Baltian maat
in scheme: URN:NBN:fi:au:hklj:
notation: 784.115
preferred label: Iceland @en
preferred label: Island @sv
related: URN:NBN:fi:au:hklj:473.1
related: URN:NBN:fi:au:hklj:769
related: URN:NBN:fi:au:hklj:783
related: URN:NBN:fi:au:hklj:783.1
related: URN:NBN:fi:au:hklj:787
related: URN:NBN:fi:au:hklj:787.2
related: URN:NBN:fi:au:hklj:787.29
related: URN:NBN:fi:au:hklj:788.8
related: URN:NBN:fi:au:hklj:789
related: URN:NBN:fi:au:hklj:795.1
related: URN:NBN:fi:au:hklj:797.2
related: URN:NBN:fi:au:hklj:807

Viro
type: Class
type: Concept
subclass of: Baltian maat
alternative label: Viro, kansanmusiikki (784.1161)
alternative label: Estland, folkmusik (784.1161) @sv
broader: Baltian maat
in scheme: URN:NBN:fi:au:hklj:
notation: 784.1161
preferred label: Estonia @en
preferred label: Estland @sv
related: URN:NBN:fi:au:hklj:473.1
related: URN:NBN:fi:au:hklj:769
related: URN:NBN:fi:au:hklj:783
related: URN:NBN:fi:au:hklj:783.1
related: URN:NBN:fi:au:hklj:787
related: URN:NBN:fi:au:hklj:787.2
related: URN:NBN:fi:au:hklj:787.29
related: URN:NBN:fi:au:hklj:788.8
related: URN:NBN:fi:au:hklj:789
related: URN:NBN:fi:au:hklj:795.1
related: URN:NBN:fi:au:hklj:797.2
related: URN:NBN:fi:au:hklj:807

Latvia
type: Class
type: Concept
subclass of: Baltian maat
alternative label: Latvia, kansanmusiikki (784.1162)
alternative label: Lettland, folkmusik (784.1162) @sv
broader: Baltian maat
in scheme: URN:NBN:fi:au:hklj:
notation: 784.1162
preferred label: Lettland @sv
related: URN:NBN:fi:au:hklj:473.1
related: URN:NBN:fi:au:hklj:769
related: URN:NBN:fi:au:hklj:783
related: URN:NBN:fi:au:hklj:783.1
related: URN:NBN:fi:au:hklj:787
related: URN:NBN:fi:au:hklj:787.2
related: URN:NBN:fi:au:hklj:787.29
related: URN:NBN:fi:au:hklj:788.8
related: URN:NBN:fi:au:hklj:789
related: URN:NBN:fi:au:hklj:795.1
related: URN:NBN:fi:au:hklj:797.2
related: URN:NBN:fi:au:hklj:807

Liettua
type: Class
type: Concept
subclass of: Baltian maat
alternative label: Liettua, kansanmusiikki (784.1163)
alternative label: Litauen, folkmusik (784.1163) @sv
broader: Baltian maat
in scheme: URN:NBN:fi:au:hklj:
notation: 784.1163
preferred label: Lithuania @en
preferred label: Litauen @sv
related: URN:NBN:fi:au:hklj:473.1
related: URN:NBN:fi:au:hklj:769
related: URN:NBN:fi:au:hklj:783
related: URN:NBN:fi:au:hklj:783.1
related: URN:NBN:fi:au:hklj:787
related: URN:NBN:fi:au:hklj:787.2
related: URN:NBN:fi:au:hklj:787.29
related: URN:NBN:fi:au:hklj:788.8
related: URN:NBN:fi:au:hklj:789
related: URN:NBN:fi:au:hklj:795.1
related: URN:NBN:fi:au:hklj:797.2
related: URN:NBN:fi:au:hklj:807

Saksa
type: Class
type: Concept
subclass of: Keski-Eurooppa
alternative label: Jodlaus, etnomusiikki, Saksa (784.121)
alternative label: Saksa, kansanmusiikki (784.121)
alternative label: Joddling, etnomusik, Tyskland (784.121) @sv
alternative label: Tyskland, folkmusik (784.121) @sv
broader: Keski-Eurooppa
in scheme: URN:NBN:fi:au:hklj:
notation: 784.121
preferred label: Germany @en
preferred label: Tyskland @sv
related: URN:NBN:fi:au:hklj:473.1
related: URN:NBN:fi:au:hklj:769
related: URN:NBN:fi:au:hklj:783
related: URN:NBN:fi:au:hklj:783.1
related: URN:NBN:fi:au:hklj:787
related: URN:NBN:fi:au:hklj:787.2
related: URN:NBN:fi:au:hklj:787.29
related: URN:NBN:fi:au:hklj:788.8
related: URN:NBN:fi:au:hklj:789
related: URN:NBN:fi:au:hklj:795.1
related: URN:NBN:fi:au:hklj:797.2
related: URN:NBN:fi:au:hklj:807

Itävalta
type: Class
type: Concept
subclass of: Keski-Eurooppa
alternative label: Itävalta, kansanmusiikki (784.122)
alternative label: Jodlaus, etnomusiikki, Itävalta (784.122)
alternative label: Joddling, etnomusik, Österrike (784.122) @sv
alternative label: Österrike, folkmusik (784.122) @sv
broader: Keski-Eurooppa
in scheme: URN:NBN:fi:au:hklj:
notation: 784.122
preferred label: Austria @en
preferred label: Österrike @sv
related: URN:NBN:fi:au:hklj:473.1
related: URN:NBN:fi:au:hklj:769
related: URN:NBN:fi:au:hklj:783
related: URN:NBN:fi:au:hklj:783.1
related: URN:NBN:fi:au:hklj:787
related: URN:NBN:fi:au:hklj:787.2
related: URN:NBN:fi:au:hklj:787.29
related: URN:NBN:fi:au:hklj:788.8
related: URN:NBN:fi:au:hklj:789
related: URN:NBN:fi:au:hklj:795.1
related: URN:NBN:fi:au:hklj:797.2
related: URN:NBN:fi:au:hklj:807

Sveitsi
type: Class
type: Concept
subclass of: Keski-Eurooppa
alternative label: Jodlaus, etnomusiikki, Sveitsi (784.123)
alternative label: Sveitsi, kansanmusiikki (784.123)
alternative label: Joddling, etnomusik, Schweiz (784.123) @sv
alternative label: Schweiz, folkmusik (784.123) @sv
broader: Keski-Eurooppa
in scheme: URN:NBN:fi:au:hklj:
notation: 784.123
preferred label: Switzerland @en
preferred label: Schweiz @sv
related: URN:NBN:fi:au:hklj:473.1
related: URN:NBN:fi:au:hklj:769
related: URN:NBN:fi:au:hklj:783
related: URN:NBN:fi:au:hklj:783.1
related: URN:NBN:fi:au:hklj:787
related: URN:NBN:fi:au:hklj:787.2
related: URN:NBN:fi:au:hklj:787.29
related: URN:NBN:fi:au:hklj:788.8
related: URN:NBN:fi:au:hklj:789
related: URN:NBN:fi:au:hklj:795.1
related: URN:NBN:fi:au:hklj:797.2
related: URN:NBN:fi:au:hklj:807
scope note: Tässä myös Liechtenstein
scope note: Hit också Liechtenstein @sv

Belgia
type: Class
type: Concept
subclass of: Benelux-maat
alternative label: Belgia, kansanmusiikki (784.1251)
alternative label: Belgien, folkmusik (784.1251) @sv
broader: Benelux-maat
in scheme: URN:NBN:fi:au:hklj:
notation: 784.1251
preferred label: Belgium @en
preferred label: Belgien @sv
related: URN:NBN:fi:au:hklj:473.1
related: URN:NBN:fi:au:hklj:769
related: URN:NBN:fi:au:hklj:783
related: URN:NBN:fi:au:hklj:783.1
related: URN:NBN:fi:au:hklj:787
related: URN:NBN:fi:au:hklj:787.2
related: URN:NBN:fi:au:hklj:787.29
related: URN:NBN:fi:au:hklj:788.8
related: URN:NBN:fi:au:hklj:789
related: URN:NBN:fi:au:hklj:795.1
related: URN:NBN:fi:au:hklj:797.2
related: URN:NBN:fi:au:hklj:807

Alankomaat
type: Class
type: Concept
subclass of: Benelux-maat
alternative label: Alankomaat, kansanmusiikki (784.1252)
alternative label: Hollanti, kansanmusiikki (784.1252)
alternative label: Holland, folkmusik (784.1252) @sv
alternative label: Nederländerna, folk musik (784.1252) @sv
broader: Benelux-maat
in scheme: URN:NBN:fi:au:hklj:
notation: 784.1252
preferred label: Netherlands @en
preferred label: Nederländerna @sv
related: URN:NBN:fi:au:hklj:473.1
related: URN:NBN:fi:au:hklj:769
related: URN:NBN:fi:au:hklj:783
related: URN:NBN:fi:au:hklj:783.1
related: URN:NBN:fi:au:hklj:787
related: URN:NBN:fi:au:hklj:787.2
related: URN:NBN:fi:au:hklj:787.29
related: URN:NBN:fi:au:hklj:788.8
related: URN:NBN:fi:au:hklj:789
related: URN:NBN:fi:au:hklj:795.1
related: URN:NBN:fi:au:hklj:797.2
related: URN:NBN:fi:au:hklj:807

Englanti
type: Class
type: Concept
subclass of: Brittein saaret
alternative label: Englanti, kansanmusiikki (784.131)
alternative label: England, folkmusik (784.131) @sv
broader: Brittein saaret
in scheme: URN:NBN:fi:au:hklj:
notation: 784.131
preferred label: England @en
related: URN:NBN:fi:au:hklj:473.1
related: URN:NBN:fi:au:hklj:769
related: URN:NBN:fi:au:hklj:783
related: URN:NBN:fi:au:hklj:783.1
related: URN:NBN:fi:au:hklj:787
related: URN:NBN:fi:au:hklj:787.2
related: URN:NBN:fi:au:hklj:787.29
related: URN:NBN:fi:au:hklj:788.8
related: URN:NBN:fi:au:hklj:789
related: URN:NBN:fi:au:hklj:795.1
related: URN:NBN:fi:au:hklj:797.2
related: URN:NBN:fi:au:hklj:807

Wales
type: Class
type: Concept
subclass of: Brittein saaret
broader: Brittein saaret
in scheme: URN:NBN:fi:au:hklj:
notation: 784.132
related: URN:NBN:fi:au:hklj:473.1
related: URN:NBN:fi:au:hklj:769
related: URN:NBN:fi:au:hklj:783
related: URN:NBN:fi:au:hklj:783.1
related: URN:NBN:fi:au:hklj:787
related: URN:NBN:fi:au:hklj:787.2
related: URN:NBN:fi:au:hklj:787.29
related: URN:NBN:fi:au:hklj:788.8
related: URN:NBN:fi:au:hklj:789
related: URN:NBN:fi:au:hklj:795.1
related: URN:NBN:fi:au:hklj:797.2
related: URN:NBN:fi:au:hklj:807

Skotlanti
type: Class
type: Concept
subclass of: Brittein saaret
broader: Brittein saaret
in scheme: URN:NBN:fi:au:hklj:
notation: 784.133
preferred label: Scotland @en
preferred label: Skottland @sv
related: URN:NBN:fi:au:hklj:473.1
related: URN:NBN:fi:au:hklj:769
related: URN:NBN:fi:au:hklj:783
related: URN:NBN:fi:au:hklj:783.1
related: URN:NBN:fi:au:hklj:787
related: URN:NBN:fi:au:hklj:787.2
related: URN:NBN:fi:au:hklj:787.29
related: URN:NBN:fi:au:hklj:788.8
related: URN:NBN:fi:au:hklj:789
related: URN:NBN:fi:au:hklj:795.1
related: URN:NBN:fi:au:hklj:797.2
related: URN:NBN:fi:au:hklj:807

Irlanti
type: Class
type: Concept
subclass of: Brittein saaret
alternative label: Eire, kansanmusiikki (784.134)
alternative label: Irlanti, kansanmusiikki (784.134)
alternative label: Eire, folkmusik (784.134) @sv
alternative label: Irland, folkmusik (784.134) @sv
broader: Brittein saaret
in scheme: URN:NBN:fi:au:hklj:
notation: 784.134
preferred label: Ireland @en
preferred label: Irland @sv
related: URN:NBN:fi:au:hklj:473.1
related: URN:NBN:fi:au:hklj:769
related: URN:NBN:fi:au:hklj:783
related: URN:NBN:fi:au:hklj:783.1
related: URN:NBN:fi:au:hklj:787
related: URN:NBN:fi:au:hklj:787.2
related: URN:NBN:fi:au:hklj:787.29
related: URN:NBN:fi:au:hklj:788.8
related: URN:NBN:fi:au:hklj:789
related: URN:NBN:fi:au:hklj:795.1
related: URN:NBN:fi:au:hklj:797.2
related: URN:NBN:fi:au:hklj:807
scope note: Irlannin tasavalta. Pohjois-Irlanti
scope note: Irländska republiken. Nordirland @sv

Ranska
type: Class
type: Concept
subclass of: Länsi- ja Lounais-Eurooppa
alternative label: Kelttiläinen kansanmusiikki, Ranska (784.141)
alternative label: Ranska, kansanmusiikki (784.141)
alternative label: Frankrike, folkmusik (784.141) @sv
alternative label: Keltisk folkmusik, Frankrike (784.141) @sv
broader: Länsi- ja Lounais-Eurooppa
in scheme: URN:NBN:fi:au:hklj:
notation: 784.141
preferred label: France @en
preferred label: Frankrike @sv
related: URN:NBN:fi:au:hklj:473.1
related: URN:NBN:fi:au:hklj:769
related: URN:NBN:fi:au:hklj:783
related: URN:NBN:fi:au:hklj:783.1
related: URN:NBN:fi:au:hklj:787
related: URN:NBN:fi:au:hklj:787.2
related: URN:NBN:fi:au:hklj:787.29
related: URN:NBN:fi:au:hklj:788.8
related: URN:NBN:fi:au:hklj:789
related: URN:NBN:fi:au:hklj:795.1
related: URN:NBN:fi:au:hklj:797.2
related: URN:NBN:fi:au:hklj:807
scope note: Tässä myös Andorra ja Monaco
scope note: Hit också Andorra och Monaco @sv

Italia
type: Class
type: Concept
subclass of: Länsi- ja Lounais-Eurooppa
alternative label: Italia, kansanmusiikki (784.142)
alternative label: Italien, folkmusik (784.142) @sv
broader: Länsi- ja Lounais-Eurooppa
in scheme: URN:NBN:fi:au:hklj:
notation: 784.142
preferred label: Italy @en
preferred label: Italien @sv
related: URN:NBN:fi:au:hklj:473.1
related: URN:NBN:fi:au:hklj:769
related: URN:NBN:fi:au:hklj:783
related: URN:NBN:fi:au:hklj:783.1
related: URN:NBN:fi:au:hklj:787
related: URN:NBN:fi:au:hklj:787.2
related: URN:NBN:fi:au:hklj:787.29
related: URN:NBN:fi:au:hklj:788.8
related: URN:NBN:fi:au:hklj:789
related: URN:NBN:fi:au:hklj:795.1
related: URN:NBN:fi:au:hklj:797.2
related: URN:NBN:fi:au:hklj:807
scope note: Tässä myös San Marino ja Vatikaanivaltio
scope note: Hit också San Marino och Vatikanstaten @sv

Malta
type: Class
type: Concept
subclass of: Länsi- ja Lounais-Eurooppa
broader: Länsi- ja Lounais-Eurooppa
in scheme: URN:NBN:fi:au:hklj:
notation: 784.145
related: URN:NBN:fi:au:hklj:473.1
related: URN:NBN:fi:au:hklj:769
related: URN:NBN:fi:au:hklj:783
related: URN:NBN:fi:au:hklj:783.1
related: URN:NBN:fi:au:hklj:787
related: URN:NBN:fi:au:hklj:787.2
related: URN:NBN:fi:au:hklj:787.29
related: URN:NBN:fi:au:hklj:788.8
related: URN:NBN:fi:au:hklj:789
related: URN:NBN:fi:au:hklj:795.1
related: URN:NBN:fi:au:hklj:797.2
related: URN:NBN:fi:au:hklj:807

Bulgaria
type: Class
type: Concept
subclass of: Balkanin niemimaa
alternative label: Bulgaria, kansanmusiikki (784.151)
alternative label: Bulgarien, folkmusik (784.151) @sv
broader: Balkanin niemimaa
in scheme: URN:NBN:fi:au:hklj:
notation: 784.151
preferred label: Bulgarien @sv
related: URN:NBN:fi:au:hklj:473.1
related: URN:NBN:fi:au:hklj:769
related: URN:NBN:fi:au:hklj:783
related: URN:NBN:fi:au:hklj:783.1
related: URN:NBN:fi:au:hklj:787
related: URN:NBN:fi:au:hklj:787.2
related: URN:NBN:fi:au:hklj:787.29
related: URN:NBN:fi:au:hklj:788.8
related: URN:NBN:fi:au:hklj:789
related: URN:NBN:fi:au:hklj:795.1
related: URN:NBN:fi:au:hklj:797.2
related: URN:NBN:fi:au:hklj:807

Romania
type: Class
type: Concept
subclass of: Balkanin niemimaa
alternative label: Romania, kansanmusiikki (784.152)
alternative label: Rumänien, folkmusik (784.152) @sv
broader: Balkanin niemimaa
in scheme: URN:NBN:fi:au:hklj:
notation: 784.152
preferred label: Rumänien @sv
related: URN:NBN:fi:au:hklj:473.1
related: URN:NBN:fi:au:hklj:769
related: URN:NBN:fi:au:hklj:783
related: URN:NBN:fi:au:hklj:783.1
related: URN:NBN:fi:au:hklj:787
related: URN:NBN:fi:au:hklj:787.2
related: URN:NBN:fi:au:hklj:787.29
related: URN:NBN:fi:au:hklj:788.8
related: URN:NBN:fi:au:hklj:789
related: URN:NBN:fi:au:hklj:795.1
related: URN:NBN:fi:au:hklj:797.2
related: URN:NBN:fi:au:hklj:807

Slovenia
type: Class
type: Concept
subclass of: Entisen Jugoslavian alue
broader: Entisen Jugoslavian alue
in scheme: URN:NBN:fi:au:hklj:
notation: 784.1531
preferred label: Slovenien @sv
related: URN:NBN:fi:au:hklj:473.1
related: URN:NBN:fi:au:hklj:769
related: URN:NBN:fi:au:hklj:783
related: URN:NBN:fi:au:hklj:783.1
related: URN:NBN:fi:au:hklj:787
related: URN:NBN:fi:au:hklj:787.2
related: URN:NBN:fi:au:hklj:787.29
related: URN:NBN:fi:au:hklj:788.8
related: URN:NBN:fi:au:hklj:789
related: URN:NBN:fi:au:hklj:795.1
related: URN:NBN:fi:au:hklj:797.2
related: URN:NBN:fi:au:hklj:807

Kroatia
type: Class
type: Concept
subclass of: Entisen Jugoslavian alue
broader: Entisen Jugoslavian alue
in scheme: URN:NBN:fi:au:hklj:
notation: 784.1532
preferred label: Croatia @en
preferred label: Kroatien @sv
related: URN:NBN:fi:au:hklj:473.1
related: URN:NBN:fi:au:hklj:769
related: URN:NBN:fi:au:hklj:783
related: URN:NBN:fi:au:hklj:783.1
related: URN:NBN:fi:au:hklj:787
related: URN:NBN:fi:au:hklj:787.2
related: URN:NBN:fi:au:hklj:787.29
related: URN:NBN:fi:au:hklj:788.8
related: URN:NBN:fi:au:hklj:789
related: URN:NBN:fi:au:hklj:795.1
related: URN:NBN:fi:au:hklj:797.2
related: URN:NBN:fi:au:hklj:807

Bosnia ja Hertsegovina
type: Class
type: Concept
subclass of: Entisen Jugoslavian alue
broader: Entisen Jugoslavian alue
in scheme: URN:NBN:fi:au:hklj:
notation: 784.1533
preferred label: Bosnia-Herzegovina @en
preferred label: Bosnien-Hercegovina @sv
related: URN:NBN:fi:au:hklj:473.1
related: URN:NBN:fi:au:hklj:769
related: URN:NBN:fi:au:hklj:783
related: URN:NBN:fi:au:hklj:783.1
related: URN:NBN:fi:au:hklj:787
related: URN:NBN:fi:au:hklj:787.2
related: URN:NBN:fi:au:hklj:787.29
related: URN:NBN:fi:au:hklj:788.8
related: URN:NBN:fi:au:hklj:789
related: URN:NBN:fi:au:hklj:795.1
related: URN:NBN:fi:au:hklj:797.2
related: URN:NBN:fi:au:hklj:807

Serbia ja Montenegro
type: Class
type: Concept
subclass of: Entisen Jugoslavian alue
alternative label: Serbia, kansanmusiikki (784.1534)
alternative label: Serbien, folkmusik (784.1534) @sv
broader: Entisen Jugoslavian alue
in scheme: URN:NBN:fi:au:hklj:
notation: 784.1534
preferred label: Serbia and Montenegro @en
preferred label: Serbien och Montenegro @sv
related: URN:NBN:fi:au:hklj:473.1
related: URN:NBN:fi:au:hklj:769
related: URN:NBN:fi:au:hklj:783
related: URN:NBN:fi:au:hklj:783.1
related: URN:NBN:fi:au:hklj:787
related: URN:NBN:fi:au:hklj:787.2
related: URN:NBN:fi:au:hklj:787.29
related: URN:NBN:fi:au:hklj:788.8
related: URN:NBN:fi:au:hklj:789
related: URN:NBN:fi:au:hklj:795.1
related: URN:NBN:fi:au:hklj:797.2
related: URN:NBN:fi:au:hklj:807
scope note: Kosovo. Vojvodina

Makedonia (EJTM)
type: Class
type: Concept
subclass of: Entisen Jugoslavian alue
broader: Entisen Jugoslavian alue
in scheme: URN:NBN:fi:au:hklj:
notation: 784.1535
preferred label: Macedonia (in the former Yogoslavia) @en
preferred label: Makedonien (i det tidigare Jugoslavien) @sv
related: URN:NBN:fi:au:hklj:473.1
related: URN:NBN:fi:au:hklj:769
related: URN:NBN:fi:au:hklj:783
related: URN:NBN:fi:au:hklj:783.1
related: URN:NBN:fi:au:hklj:787
related: URN:NBN:fi:au:hklj:787.2
related: URN:NBN:fi:au:hklj:787.29
related: URN:NBN:fi:au:hklj:788.8
related: URN:NBN:fi:au:hklj:789
related: URN:NBN:fi:au:hklj:795.1
related: URN:NBN:fi:au:hklj:797.2
related: URN:NBN:fi:au:hklj:807

Albania
type: Class
type: Concept
subclass of: Balkanin niemimaa
broader: Balkanin niemimaa
in scheme: URN:NBN:fi:au:hklj:
notation: 784.154
preferred label: Albanien @sv
related: URN:NBN:fi:au:hklj:473.1
related: URN:NBN:fi:au:hklj:769
related: URN:NBN:fi:au:hklj:783
related: URN:NBN:fi:au:hklj:783.1
related: URN:NBN:fi:au:hklj:787
related: URN:NBN:fi:au:hklj:787.2
related: URN:NBN:fi:au:hklj:787.29
related: URN:NBN:fi:au:hklj:788.8
related: URN:NBN:fi:au:hklj:789
related: URN:NBN:fi:au:hklj:795.1
related: URN:NBN:fi:au:hklj:797.2
related: URN:NBN:fi:au:hklj:807

Kreikka
type: Class
type: Concept
subclass of: Balkanin niemimaa
alternative label: Bouzouki, kreikkalainen kansanmusiikki (784.155)
alternative label: Buzuki, kreikkalainen kansanmusiikki (784.155)
alternative label: Kreikka, kansanmusiikki (784.155)
alternative label: Rebetika, kreikkalainen kansanmusiikki (784.155)
alternative label: Bouzouki, grekisk folkmusik (784.155) @sv
alternative label: Buzuki, grekisk folkmusik (784.155) @sv
alternative label: Grekland, folkmusik (784.155) @sv
alternative label: Rebetika, grekisk folkmusik (784.155) @sv
broader: Balkanin niemimaa
in scheme: URN:NBN:fi:au:hklj:
notation: 784.155
preferred label: Greece @en
preferred label: Grekland @sv
related: URN:NBN:fi:au:hklj:473.1
related: URN:NBN:fi:au:hklj:769
related: URN:NBN:fi:au:hklj:783
related: URN:NBN:fi:au:hklj:783.1
related: URN:NBN:fi:au:hklj:787
related: URN:NBN:fi:au:hklj:787.2
related: URN:NBN:fi:au:hklj:787.29
related: URN:NBN:fi:au:hklj:788.8
related: URN:NBN:fi:au:hklj:789
related: URN:NBN:fi:au:hklj:795.1
related: URN:NBN:fi:au:hklj:797.2
related: URN:NBN:fi:au:hklj:807

Puola
type: Class
type: Concept
subclass of: Itä-Eurooppa
alternative label: Puola, kansanmusiikki (784.161)
alternative label: Polen, folkmusik (784.161) @sv
broader: Itä-Eurooppa
in scheme: URN:NBN:fi:au:hklj:
notation: 784.161
preferred label: Poland @en
preferred label: Polen @sv
related: URN:NBN:fi:au:hklj:473.1
related: URN:NBN:fi:au:hklj:769
related: URN:NBN:fi:au:hklj:783
related: URN:NBN:fi:au:hklj:783.1
related: URN:NBN:fi:au:hklj:787
related: URN:NBN:fi:au:hklj:787.2
related: URN:NBN:fi:au:hklj:787.29
related: URN:NBN:fi:au:hklj:788.8
related: URN:NBN:fi:au:hklj:789
related: URN:NBN:fi:au:hklj:795.1
related: URN:NBN:fi:au:hklj:797.2
related: URN:NBN:fi:au:hklj:807

Tsekki
type: Class
type: Concept
subclass of: Tsekkoslovakian alue
alternative label: Tsekki, kansanmusiikki (784.1621)
alternative label: Tjeckien, folkmusik (784.1621) @sv
broader: Tsekkoslovakian alue
in scheme: URN:NBN:fi:au:hklj:
notation: 784.1621
preferred label: Czech Republic @en
preferred label: Tjeckien @sv
related: URN:NBN:fi:au:hklj:473.1
related: URN:NBN:fi:au:hklj:769
related: URN:NBN:fi:au:hklj:783
related: URN:NBN:fi:au:hklj:783.1
related: URN:NBN:fi:au:hklj:787
related: URN:NBN:fi:au:hklj:787.2
related: URN:NBN:fi:au:hklj:787.29
related: URN:NBN:fi:au:hklj:788.8
related: URN:NBN:fi:au:hklj:789
related: URN:NBN:fi:au:hklj:795.1
related: URN:NBN:fi:au:hklj:797.2
related: URN:NBN:fi:au:hklj:807

Slovakia
type: Class
type: Concept
subclass of: Tsekkoslovakian alue
broader: Tsekkoslovakian alue
in scheme: URN:NBN:fi:au:hklj:
notation: 784.1622
preferred label: Slovakien @sv
related: URN:NBN:fi:au:hklj:473.1
related: URN:NBN:fi:au:hklj:769
related: URN:NBN:fi:au:hklj:783
related: URN:NBN:fi:au:hklj:783.1
related: URN:NBN:fi:au:hklj:787
related: URN:NBN:fi:au:hklj:787.2
related: URN:NBN:fi:au:hklj:787.29
related: URN:NBN:fi:au:hklj:788.8
related: URN:NBN:fi:au:hklj:789
related: URN:NBN:fi:au:hklj:795.1
related: URN:NBN:fi:au:hklj:797.2
related: URN:NBN:fi:au:hklj:807

Unkari
type: Class
type: Concept
subclass of: Itä-Eurooppa
alternative label: Unkari, kansanmusiikki (784.163)
alternative label: Ungern, folkmusik (784.163) @sv
broader: Itä-Eurooppa
in scheme: URN:NBN:fi:au:hklj:
notation: 784.163
preferred label: Hungary @en
preferred label: Ungern @sv
related: URN:NBN:fi:au:hklj:473.1
related: URN:NBN:fi:au:hklj:769
related: URN:NBN:fi:au:hklj:783
related: URN:NBN:fi:au:hklj:783.1
related: URN:NBN:fi:au:hklj:787
related: URN:NBN:fi:au:hklj:787.2
related: URN:NBN:fi:au:hklj:787.29
related: URN:NBN:fi:au:hklj:788.8
related: URN:NBN:fi:au:hklj:789
related: URN:NBN:fi:au:hklj:795.1
related: URN:NBN:fi:au:hklj:797.2
related: URN:NBN:fi:au:hklj:807

Piano
type: Class
type: Concept
subclass of: Kosketinsoittimet
alternative label: Flyygeli (786.11 +)
alternative label: Fortepiano (786.11 +)
alternative label: Hammerklavier (786.11 +)
alternative label: Piano (786.11)
alternative label: Preparoitu piano (786.11 +)
alternative label: Taffelipiano (786.11 +)
alternative label: Vasaraklaveeri (786.11 +)
alternative label: Flygel (786.11 +) @sv
alternative label: Hammarklaver (786.11 +) @sv
alternative label: Preparerat piano (786.11 +) @sv
alternative label: Taffelpiano (786.11 +) @sv
broader: Kosketinsoittimet
in scheme: URN:NBN:fi:au:hklj:
narrower: Koulut, harjoituskappaleet ja -etydit
narrower: Nelikätinen pianomusiikki
notation: 786.11
related: URN:NBN:fi:au:hklj:627.7531
related: URN:NBN:fi:au:hklj:681
related: URN:NBN:fi:au:hklj:781.5
related: URN:NBN:fi:au:hklj:782.6
related: URN:NBN:fi:au:hklj:785
related: URN:NBN:fi:au:hklj:785.11
related: URN:NBN:fi:au:hklj:788
related: URN:NBN:fi:au:hklj:789
scope note: Flyygeli
scope note: Flygel @sv

Urut
type: Class
type: Concept
subclass of: Kosketinsoittimet
alternative label: Kirkkomusiikki, urkumusiikki (786.13 +)
alternative label: Koraalialkusoitot (786.13)
alternative label: Koraalit, urkumusiikki (786.13 +)
alternative label: Pneumaattiset urut (786.13 +)
alternative label: Positiiviurut (786.13 +)
alternative label: Regaali (786.13 +)
alternative label: Urut (786.13 +)
alternative label: Versetit (786.13)
alternative label: Vesiurut (786.13 +)
alternative label: Koraler, orgelmusik (786.13 +) @sv
alternative label: Koralförspel (786.13) @sv
alternative label: Kyrkomusik, orgelmusik (786.13 +) @sv
alternative label: Orgel (786.13 +) @sv
alternative label: Pneumatisk orgel (786.13 +) @sv
alternative label: Positivorgel (786.13 +) @sv
alternative label: Regal (786.13 +) @sv
alternative label: Vattenorgel (786.13 +) @sv
alternative label: Versetter (786.13) @sv
broader: Kosketinsoittimet
in scheme: URN:NBN:fi:au:hklj:
narrower: Koulut, harjoituskappaleet ja -etydit
notation: 786.13
preferred label: Organ @en
preferred label: Orglar @sv
related: URN:NBN:fi:au:hklj:627.7531
related: URN:NBN:fi:au:hklj:681
related: URN:NBN:fi:au:hklj:781.5
related: URN:NBN:fi:au:hklj:782.6
related: URN:NBN:fi:au:hklj:785
related: URN:NBN:fi:au:hklj:785.11
related: URN:NBN:fi:au:hklj:787
related: URN:NBN:fi:au:hklj:788
related: URN:NBN:fi:au:hklj:789

Sähköurut ja muut sähköiset kosketinsoittimet
type: Class
type: Concept
subclass of: Kosketinsoittimet
alternative label: Elektroniset soittimet, sähköiset kosketinsoittimet (786.14 +)
alternative label: Hammond, kosketinsoittimet (786.14 +)
alternative label: Sähköiset soittimet, sähköiset kosketinsoittimet (786.14 +)
alternative label: Sähkösoittimet, sähköiset kosketinsoittimet (786.14 +)
alternative label: Sähköurut (786.14 +)
alternative label: Elektriska musikinstrument, elektriska tangentinstrument (786.14 +) @sv
alternative label: Elektroniska musikinstrument, elektroniska tangentinstrument (786.14 +) @sv
alternative label: Elinstrument, elektroniska tangentinstrument (786.14 +) @sv
alternative label: Elorgel (786.14 +) @sv
alternative label: Hammond, tangentinstrument (786.14 +) @sv
broader: Kosketinsoittimet
in scheme: URN:NBN:fi:au:hklj:
narrower: Koulut, harjoituskappaleet ja -etydit
notation: 786.14
preferred label: Electric organs and other electrical keyboard instruments @en
preferred label: Elorglar och andra elektriska klaviaturinstrument @sv
related: URN:NBN:fi:au:hklj:627.7531
related: URN:NBN:fi:au:hklj:681
related: URN:NBN:fi:au:hklj:781.5
related: URN:NBN:fi:au:hklj:782.6
related: URN:NBN:fi:au:hklj:785
related: URN:NBN:fi:au:hklj:785.11
related: URN:NBN:fi:au:hklj:786.8
related: URN:NBN:fi:au:hklj:788
related: URN:NBN:fi:au:hklj:789

Sähkökitara
type: Class
type: Concept
subclass of: Näppäinsoittimet
alternative label: Elektroniset soittimet, sähkökitara (786.24 +)
alternative label: Ilmakitara, sähkökitara (786.24)
alternative label: Kitara, sähkökitara (786.24)
alternative label: Sähköiset soittimet, sähkökitara (786.24 +)
alternative label: Sähkökitara (786.24 +)
alternative label: Sähkösoittimet, sähkökitara (786.24 +)
alternative label: Elektriska musikinstrument, elgitarr (786.24 +) @sv
alternative label: Elektroniska musikinstrument, elgitarr (786.24 +) @sv
alternative label: Elgitarr (786.24 +) @sv
alternative label: Elinstrument, elgitarr (786.24 +) @sv
alternative label: Gitarr, elgitarr (786.24) @sv
alternative label: Luftgitarr, elgitarr (786.24) @sv
broader: Näppäinsoittimet
in scheme: URN:NBN:fi:au:hklj:
narrower: Koulut, harjoituskappaleet ja -etydit
notation: 786.24
preferred label: Electric guitar @en
preferred label: Elgitarr @sv
related: URN:NBN:fi:au:hklj:627.7531
related: URN:NBN:fi:au:hklj:681
related: URN:NBN:fi:au:hklj:781.5
related: URN:NBN:fi:au:hklj:782.6
related: URN:NBN:fi:au:hklj:785
related: URN:NBN:fi:au:hklj:785.11
related: Sähköbasso
related: Koulut, harjoituskappaleet ja -etydit
related: URN:NBN:fi:au:hklj:788
related: URN:NBN:fi:au:hklj:789

Sähköbasso
type: Class
type: Concept
subclass of: Näppäinsoittimet
alternative label: Bassokitara (786.28)
alternative label: Elektroniset soittimet, sähköbasso (786.28 +)
alternative label: Sähköbasso (786.28 +)
alternative label: Sähköiset soittimet, sähköbasso (786.28 +)
alternative label: Sähkösoittimet, sähköbasso (786.28 +)
alternative label: Basgitarr (786.28) @sv
alternative label: Elbas (786.28 +) @sv
alternative label: Elektriska musikinstrument, elbas (786.28 +) @sv
alternative label: Elektroniska musikinstrument, elbas (786.28 +) @sv
alternative label: Elinstrument, elbas (786.28 +) @sv
broader: Näppäinsoittimet
in scheme: URN:NBN:fi:au:hklj:
narrower: Koulut, harjoituskappaleet ja -etydit
notation: 786.28
preferred label: Electric bass @en
preferred label: Elbas @sv
related: URN:NBN:fi:au:hklj:627.7531
related: URN:NBN:fi:au:hklj:681
related: URN:NBN:fi:au:hklj:781.5
related: URN:NBN:fi:au:hklj:782.6
related: URN:NBN:fi:au:hklj:785
related: URN:NBN:fi:au:hklj:785.11
related: Sähkökitara
related: Koulut, harjoituskappaleet ja -etydit
related: URN:NBN:fi:au:hklj:788
related: URN:NBN:fi:au:hklj:789

Viulu
type: Class
type: Concept
subclass of: Jousisoittimet
alternative label: Barokkiviulu (786.31 +)
alternative label: Hardangerinviulu (786.31 +)
alternative label: Jean Sibelius -viulukilpailu (786.31)
alternative label: Kansainvälinen Jean Sibelius -viulukilpailu (786.31)
alternative label: Sibelius-viulukilpailu (786.31)
alternative label: Viola da braccio (786.31 +)
alternative label: Viulu (786.31)
alternative label: Viulunrakennus (786.31)
alternative label: Barockfiol (786.31 +) @sv
alternative label: Fiolbygge (786.31) @sv
alternative label: Hardangerfiol (786.31 +) @sv
alternative label: Jean Sibelius-violintävlingen (786.31) @sv
alternative label: Sibelius-violintävling (786.31) @sv
alternative label: Violin (786.31) @sv
broader: Jousisoittimet
in scheme: URN:NBN:fi:au:hklj:
narrower: Koulut, harjoituskappaleet ja -etydit
narrower: Sooloviulu
notation: 786.31
preferred label: Violin @en
related: URN:NBN:fi:au:hklj:627.7531
related: URN:NBN:fi:au:hklj:681
related: URN:NBN:fi:au:hklj:781.5
related: URN:NBN:fi:au:hklj:782.6
related: URN:NBN:fi:au:hklj:785
related: URN:NBN:fi:au:hklj:785.11
related: URN:NBN:fi:au:hklj:788
related: URN:NBN:fi:au:hklj:789

Alttoviulu
type: Class
type: Concept
subclass of: Jousisoittimet
alternative label: Alttoviulu (786.32)
alternative label: Bratsche (786.32 +)
alternative label: Viola (786.32)
alternative label: Viola d'amore (786.32 +)
alternative label: Viola pomposa (786.32 +)
alternative label: Altviolin (786.32) @sv
broader: Jousisoittimet
in scheme: URN:NBN:fi:au:hklj:
narrower: Koulut, harjoituskappaleet ja -etydit
narrower: Sooloalttoviulu
notation: 786.32
preferred label: Viola @en
preferred label: Altviolin @sv
related: URN:NBN:fi:au:hklj:627.7531
related: URN:NBN:fi:au:hklj:681
related: URN:NBN:fi:au:hklj:781.5
related: URN:NBN:fi:au:hklj:782.6
related: URN:NBN:fi:au:hklj:785
related: URN:NBN:fi:au:hklj:785.11
related: URN:NBN:fi:au:hklj:788
related: URN:NBN:fi:au:hklj:789
scope note: Tässä ja alaluokissa myös viola d'amore
scope note: Hit och till underklasserna också viola d'amore @sv

Sello
type: Class
type: Concept
subclass of: Jousisoittimet
alternative label: Gamba (786.33 +)
alternative label: Sello (786.33)
alternative label: Viola da gamba (786.33 +)
alternative label: Cello (786.33) @sv
broader: Jousisoittimet
in scheme: URN:NBN:fi:au:hklj:
narrower: Koulut, harjoituskappaleet ja -etydit
narrower: Soolosello
notation: 786.33
preferred label: Cello @en
related: URN:NBN:fi:au:hklj:627.7531
related: URN:NBN:fi:au:hklj:681
related: URN:NBN:fi:au:hklj:781.5
related: URN:NBN:fi:au:hklj:782.6
related: URN:NBN:fi:au:hklj:785
related: URN:NBN:fi:au:hklj:785.11
related: URN:NBN:fi:au:hklj:788
related: URN:NBN:fi:au:hklj:789
scope note: Tässä ja alaluokissa myös viola da gamba
scope note: Hit och till underklasserna också viola da gamba @sv

Kontrabasso
type: Class
type: Concept
subclass of: Jousisoittimet
alternative label: Bassoviulu (786.34 +)
alternative label: Kontrabasso (786.34)
alternative label: Violone (786.34 +)
alternative label: Basfiol (786.34 +) @sv
alternative label: Kontrabas (786.34) @sv
broader: Jousisoittimet
in scheme: URN:NBN:fi:au:hklj:
narrower: Koulut, harjoituskappaleet ja -etydit
narrower: Soolokontrabasso
notation: 786.34
preferred label: Double bass @en
preferred label: Kontrabas @sv
related: URN:NBN:fi:au:hklj:627.7531
related: URN:NBN:fi:au:hklj:681
related: URN:NBN:fi:au:hklj:781.5
related: URN:NBN:fi:au:hklj:782.6
related: URN:NBN:fi:au:hklj:785
related: URN:NBN:fi:au:hklj:785.11
related: URN:NBN:fi:au:hklj:788
related: URN:NBN:fi:au:hklj:789

Huilu. Piccolo
type: Class
type: Concept
subclass of: Puupuhaltimet
alternative label: Flauto (786.41 +)
alternative label: Flute (786.41 +)
alternative label: Huilu (786.41)
alternative label: Piccolohuilu (786.41 +)
alternative label: Poikkihuilu (786.41 +)
alternative label: Querflöte (786.41 +)
alternative label: Flöjt (786.41) @sv
alternative label: Piccolaflöjt (786.41 +) @sv
alternative label: Tvärflöjt (786.41 +) @sv
broader: Puupuhaltimet
in scheme: URN:NBN:fi:au:hklj:
narrower: Koulut, harjoituskappaleet ja -etydit
narrower: Soolohuilu
notation: 786.41
preferred label: Flute. Piccolo @en
preferred label: Flöjt. Piccoloflöjt @sv
related: URN:NBN:fi:au:hklj:627.7531
related: URN:NBN:fi:au:hklj:681
related: URN:NBN:fi:au:hklj:781.5
related: URN:NBN:fi:au:hklj:782.6
related: URN:NBN:fi:au:hklj:785
related: URN:NBN:fi:au:hklj:785.11
related: URN:NBN:fi:au:hklj:788
related: URN:NBN:fi:au:hklj:789

Nokkahuilu
type: Class
type: Concept
subclass of: Puupuhaltimet
alternative label: Blockflöte (786.42 +)
alternative label: Flautino (786.42 +)
alternative label: Nokkahuilu (786.42)
alternative label: Piccolonokkahuilu (786.42 +)
alternative label: Blockflöjt (786.42) @sv
alternative label: Piccoloblockflöjt (786.42 +) @sv
broader: Puupuhaltimet
in scheme: URN:NBN:fi:au:hklj:
narrower: Koulut, harjoituskappaleet ja -etydit
narrower: Soolonokkahuilu
notation: 786.42
preferred label: Recorder @en
preferred label: Blockflöjt @sv
related: URN:NBN:fi:au:hklj:627.7531
related: URN:NBN:fi:au:hklj:681
related: URN:NBN:fi:au:hklj:781.5
related: URN:NBN:fi:au:hklj:782.6
related: URN:NBN:fi:au:hklj:785
related: URN:NBN:fi:au:hklj:785.11
related: URN:NBN:fi:au:hklj:788
related: URN:NBN:fi:au:hklj:789

Klarinetti
type: Class
type: Concept
subclass of: Puupuhaltimet
alternative label: Basettiklarinetti (786.43 +)
alternative label: Basettitorvi (786.43 +)
alternative label: Chalumeau (786.43 +)
alternative label: Klarinetti (786.43)
alternative label: Bassetthorn (786.43 +) @sv
alternative label: Bassettklarinett (786.43 +) @sv
alternative label: Klarinett (786.43) @sv
broader: Puupuhaltimet
in scheme: URN:NBN:fi:au:hklj:
narrower: Koulut, harjoituskappaleet -etydit
narrower: Sooloklarinetti
notation: 786.43
preferred label: Clarinet @en
preferred label: Klarinett @sv
related: URN:NBN:fi:au:hklj:627.7531
related: URN:NBN:fi:au:hklj:681
related: URN:NBN:fi:au:hklj:781.5
related: URN:NBN:fi:au:hklj:782.6
related: URN:NBN:fi:au:hklj:785
related: URN:NBN:fi:au:hklj:785.11
related: URN:NBN:fi:au:hklj:788
related: URN:NBN:fi:au:hklj:789

Saksofoni
type: Class
type: Concept
subclass of: Puupuhaltimet
alternative label: Saksofoni (786.44)
alternative label: Saxofon (786.44) @sv
broader: Puupuhaltimet
in scheme: URN:NBN:fi:au:hklj:
narrower: Koulut, harjoituskappaleet ja -etydit
narrower: Soolosaksofoni
notation: 786.44
preferred label: Saxophone @en
preferred label: Saxofon @sv
related: URN:NBN:fi:au:hklj:627.7531
related: URN:NBN:fi:au:hklj:681
related: URN:NBN:fi:au:hklj:781.5
related: URN:NBN:fi:au:hklj:782.6
related: URN:NBN:fi:au:hklj:785
related: URN:NBN:fi:au:hklj:785.11
related: URN:NBN:fi:au:hklj:788
related: URN:NBN:fi:au:hklj:789

Oboe. Englannintorvi
type: Class
type: Concept
subclass of: Puupuhaltimet
alternative label: Englannintorvi (786.45 +)
alternative label: Hautbois (786.45 +)
alternative label: Oboe (786.45)
alternative label: Oboe d'amore (786.45 +)
alternative label: Skalmeija (786.45 +)
alternative label: Engelskt horn (786.45 +) @sv
alternative label: Skalmeja (786.45 +) @sv
broader: Puupuhaltimet
in scheme: URN:NBN:fi:au:hklj:
narrower: Koulut, harjoituskappaleet ja -etydit
narrower: Soolo-oboe. Sooloenglannintorvi
notation: 786.45
preferred label: Oboe. English horn @en
preferred label: Oboe. Engelskt horn @sv
related: URN:NBN:fi:au:hklj:627.7531
related: URN:NBN:fi:au:hklj:681
related: URN:NBN:fi:au:hklj:781.5
related: URN:NBN:fi:au:hklj:782.6
related: URN:NBN:fi:au:hklj:785
related: URN:NBN:fi:au:hklj:785.11
related: URN:NBN:fi:au:hklj:788
related: URN:NBN:fi:au:hklj:789
scope note: Tässä ja alaluokissa myös oboe d'amore ja skalmeija
scope note: Hit och till underklasserna också oboe d'amore och skalmeja @sv

Fagotti
type: Class
type: Concept
subclass of: Puupuhaltimet
alternative label: Fagotti (786.46)
alternative label: Fagott (786.46) @sv
broader: Puupuhaltimet
in scheme: URN:NBN:fi:au:hklj:
narrower: Koulut, harjoituskappaleet ja -etydit
narrower: Soolofagotti
notation: 786.46
preferred label: Bassoon @en
preferred label: Fagott @sv
related: URN:NBN:fi:au:hklj:627.7531
related: URN:NBN:fi:au:hklj:681
related: URN:NBN:fi:au:hklj:781.5
related: URN:NBN:fi:au:hklj:782.6
related: URN:NBN:fi:au:hklj:785
related: URN:NBN:fi:au:hklj:785.11
related: URN:NBN:fi:au:hklj:788
related: URN:NBN:fi:au:hklj:789

Käyrätorvi
type: Class
type: Concept
subclass of: Vaskipuhaltimet
alternative label: French horn (786.51 +)
alternative label: Käyrätorvi (786.51)
alternative label: Valthorn (786.51) @sv
broader: Vaskipuhaltimet
in scheme: URN:NBN:fi:au:hklj:
narrower: Koulut, harjoituskappaleet ja -etydit
narrower: Soolokäyrätorvi
notation: 786.51
preferred label: French horn @en
preferred label: Valthorn @sv
related: URN:NBN:fi:au:hklj:627.7531
related: URN:NBN:fi:au:hklj:681
related: URN:NBN:fi:au:hklj:781.5
related: URN:NBN:fi:au:hklj:782.6
related: URN:NBN:fi:au:hklj:785
related: URN:NBN:fi:au:hklj:785.11
related: URN:NBN:fi:au:hklj:788
related: URN:NBN:fi:au:hklj:789

Trumpetti
type: Class
type: Concept
subclass of: Vaskipuhaltimet
alternative label: Flyygelitorvi (786.52 +)
alternative label: Kornetti (786.52)
alternative label: Trumpetti (786.52)
alternative label: Flygelhorn (786.52 +) @sv
alternative label: Kornett (786.52) @sv
alternative label: Trumpet (786.52) @sv
broader: Vaskipuhaltimet
in scheme: URN:NBN:fi:au:hklj:
narrower: Koulut, harjoituskappaleet ja -etydit
narrower: Soolotrumpetti
notation: 786.52
preferred label: Trumpet @en
related: URN:NBN:fi:au:hklj:627.7531
related: URN:NBN:fi:au:hklj:681
related: URN:NBN:fi:au:hklj:781.5
related: URN:NBN:fi:au:hklj:782.6
related: URN:NBN:fi:au:hklj:785
related: URN:NBN:fi:au:hklj:785.11
related: URN:NBN:fi:au:hklj:788
related: URN:NBN:fi:au:hklj:789

Pasuuna
type: Class
type: Concept
subclass of: Vaskipuhaltimet
alternative label: Pasuuna (786.53)
alternative label: Sackbut (786.53 +)
alternative label: Vetopasuuna (786.53 +)
alternative label: Basun (786.53) @sv
alternative label: Dragbasun (786.53 +) @sv
broader: Vaskipuhaltimet
in scheme: URN:NBN:fi:au:hklj:
narrower: Koulut, harjoituskappaleet ja -etydit
narrower: Soolopasuuna
notation: 786.53
preferred label: Trombone @en
preferred label: Trombon @sv
related: URN:NBN:fi:au:hklj:627.7531
related: URN:NBN:fi:au:hklj:681
related: URN:NBN:fi:au:hklj:781.5
related: URN:NBN:fi:au:hklj:782.6
related: URN:NBN:fi:au:hklj:785
related: URN:NBN:fi:au:hklj:785.11
related: URN:NBN:fi:au:hklj:788
related: URN:NBN:fi:au:hklj:789

Tuuba
type: Class
type: Concept
subclass of: Vaskipuhaltimet
alternative label: Tuuba (786.54)
alternative label: Tuba (786.54) @sv
broader: Vaskipuhaltimet
in scheme: URN:NBN:fi:au:hklj:
narrower: Koulut, harjoituskappaleet ja -etydit
narrower: Soolotuuba
notation: 786.54
preferred label: Tuba @en
related: URN:NBN:fi:au:hklj:627.7531
related: URN:NBN:fi:au:hklj:681
related: URN:NBN:fi:au:hklj:781.5
related: URN:NBN:fi:au:hklj:782.6
related: URN:NBN:fi:au:hklj:785
related: URN:NBN:fi:au:hklj:785.11
related: URN:NBN:fi:au:hklj:788
related: URN:NBN:fi:au:hklj:789

Lyömä- ja hankaussoittimet
type: Class
type: Concept
subclass of: URN:NBN:fi:au:hklj:786
alternative label: Bongorummut (786.7 +)
alternative label: Carillon (786.7 +)
alternative label: Cimbalom (786.7 +)
alternative label: Claves (786.7 +)
alternative label: Congarumpu (786.7 +)
alternative label: Crotales (786.7 +)
alternative label: Dulcimer, lyömäsoittimena (786.7 +)
alternative label: Gongi (786.7 +)
alternative label: Guiro (786.7 +)
alternative label: Hankaussoittimet (786.7 +)
alternative label: High hat ja lautaset (786.7 +)
alternative label: Kastanjetit (786.7)
alternative label: Kellopeli (786.7 +)
alternative label: Kettle drums (786.7 +)
alternative label: Ksylofoni (786.7 +)
alternative label: Lautaset, soittimet (786.7 +)
alternative label: Lehmänkello, soittimena (786.7)
alternative label: Lyömäsoittajat (786.7 +)
alternative label: Lyömäsoittimet (786.7 +)
alternative label: Maracas (786.7 +)
alternative label: Marimba (786.7 +)
alternative label: Patarummut (786.7)
alternative label: Percussion (786.7)
alternative label: Rummut (786.7 +)
alternative label: Räikkä (786.7 +)
alternative label: Steel-rummut (786.7 +)
alternative label: Symbaali (786.7 +)
alternative label: Tamburiini (786.7 +)
alternative label: Tamtam (786.7 +)
alternative label: Timbtales (786.7 +)
alternative label: Timpani (786.7 +)
alternative label: Tom-tom (786.7 +)
alternative label: Triangeli (786.7 +)
alternative label: Vibrafoni (786.7 +)
alternative label: Xylorimba (786.7 +)
alternative label: Bongotrummor (786.7 +) @sv
alternative label: Bäcken, instrument (786.7 +) @sv
alternative label: Congatrumma (786.7 +) @sv
alternative label: Cymbal (786.7 +) @sv
alternative label: Gong (786.7 +) @sv
alternative label: Hackbräde, som slaginstrument (786.7 +) @sv
alternative label: High hat och cymbaler (786.7 +) @sv
alternative label: Kastanjetter (786.7) @sv
alternative label: Klockspel (786.7 +) @sv
alternative label: Koskälla, som instrument (786.7) @sv
alternative label: Pukor (786.7) @sv
alternative label: Skramla (786.7 +) @sv
alternative label: Skrapidiofoner (786.7 +) @sv
alternative label: Slaginstrument (786.7 +) @sv
alternative label: Slagverkare (786.7 +) @sv
alternative label: Steel trummor (786.7 +) @sv
alternative label: Tamburin (786.7 +) @sv
alternative label: Triangel (786.7 +) @sv
alternative label: Trummor (786.7 +) @sv
alternative label: Vibrafon (786.7 +) @sv
alternative label: Xylofon (786.7 +) @sv
broader: URN:NBN:fi:au:hklj:786
in scheme: URN:NBN:fi:au:hklj:
narrower: Koulut, harjoituskappaleet ja -etydit
notation: 786.7
preferred label: Percussion instruments and idiophones @en
preferred label: Slaginstrument och strykidiofoner @sv
related: URN:NBN:fi:au:hklj:627.7531
related: URN:NBN:fi:au:hklj:681
related: URN:NBN:fi:au:hklj:781.5
related: URN:NBN:fi:au:hklj:782.6
related: URN:NBN:fi:au:hklj:785
related: URN:NBN:fi:au:hklj:785.11
related: URN:NBN:fi:au:hklj:788
related: URN:NBN:fi:au:hklj:789
scope note: Marimba. Patarummut. Rummut. Symbaalit
scope note: Cymbaler. Marimba. Pukor. Trummor @sv

Swing. Traditionaalinen jazz
type: Class
type: Concept
subclass of: Jazz
broader: Jazz
in scheme: URN:NBN:fi:au:hklj:
narrower: Swing
narrower: Traditionaalinen jazz
notation: 788.22
preferred label: Swing. Traditional jazz @en
preferred label: Swing. Traditionell jazz @sv
related: URN:NBN:fi:au:hklj:782.4
related: URN:NBN:fi:au:hklj:783
related: URN:NBN:fi:au:hklj:783.1
related: URN:NBN:fi:au:hklj:785.7
related: URN:NBN:fi:au:hklj:786.8
related: URN:NBN:fi:au:hklj:787.112
related: URN:NBN:fi:au:hklj:789
related: URN:NBN:fi:au:hklj:795
scope note: Yleisteokset ja sekasisältöiset kokoelmat Tässä ja alaluokissa swing ja traditionaalinen jazz sekä niitä koskeva kirjallisuus Tässä ja alaluokissa myös swingin ja traditionaalisen jazzin suuntaukset sekä niiden historia ja henkilöhistoria
scope note: Allmänna verk och samlingar med blandat innehåll Hit och till underklasserna swing och traditionell jazz samt litteratur om dem Hit och till underklasserna också olika riktningar inom swing och traditionell jazz samt deras historia och personhistoria @sv

Folk. Country. Rock. Pop
type: Class
type: Concept
subclass of: URN:NBN:fi:au:hklj:788
alternative label: Populaarimusiikki, folk, country, rock, pop (788.3 +)
alternative label: Rytmi- ja viihdemusiikki, rock, pop, folk, country (788.3 +)
alternative label: Rytmimusiikki, folk, country, rock, pop (788.3 +)
alternative label: Populärmusik, folk, country, rock, pop (788.3 +) @sv
alternative label: Rytm- och underhållningsmusik, rock, pop, folk, country (788.3 +) @sv
alternative label: Rytmmusik, folk, country, rock, pop (788.3 +) @sv
broader: URN:NBN:fi:au:hklj:788
in scheme: URN:NBN:fi:au:hklj:
narrower: Folk. Country
narrower: Rock. Pop
notation: 788.3
related: URN:NBN:fi:au:hklj:782.4
related: URN:NBN:fi:au:hklj:783
related: URN:NBN:fi:au:hklj:783.1
related: URN:NBN:fi:au:hklj:785.7
related: URN:NBN:fi:au:hklj:786.8
related: URN:NBN:fi:au:hklj:787.112
related: URN:NBN:fi:au:hklj:789
related: URN:NBN:fi:au:hklj:795
scope note: Yleisteokset ja sekasisältöiset kokoelmat Tässä ja alaluokissa folk, country, rock ja pop sekä niitä koskeva kirjallisuus Tässä ja alaluokissa folkin, countryn, rockin ja popin suuntaukset sekä niiden historia ja henkilöhistoria
scope note: Allmänna verk och samlingar med blandat innehåll Hit och till underklasserna folk, country, rock och pop samt litteratur om dem Hit och till underklasserna också olika riktningar inom folk, country, rock och pop samt deras historia och personhistoria @sv

New Age -musiikki. Rentoutusmusiikki
type: Class
type: Concept
subclass of: URN:NBN:fi:au:hklj:788
alternative label: Ambient (788.9)
alternative label: Maisemamusiikki (788.9)
alternative label: Meditaatio, meditaatiomusiikki (788.9)
alternative label: Meditaatiomusiikki (788.9)
alternative label: Metamusiikki, mietiskelymusiikki (788.9)
alternative label: Mietiskely, meditaatiomusiikki (788.9)
alternative label: New Age -musiikki (788.9)
alternative label: Populaarimusiikki, New Age, ambient (788.9)
alternative label: Rentoutusmusiikki (788.9)
alternative label: Rytmimusiikki, New Age, ambient (788.9)
alternative label: Uusi aika, New Age -musiikki (788.9)
alternative label: Ympäristömusiikki (788.9)
alternative label: Äänimaisema, ambient (788.9)
alternative label: Äänimaisema, maisemamusiikki (788.9)
alternative label: Avslappningsmusik (788.9) @sv
alternative label: Landskapsmusik (788.9) @sv
alternative label: Ljudlandskap, ambient (788.9) @sv
alternative label: Ljudlandskap, musiklandskap (788.9) @sv
alternative label: Meditation, meditaatio, meditationsmusik (788.9) @sv
alternative label: Meditation, mietiskely, meditationsmusik (788.9) @sv
alternative label: Meditationsmusik (788.9) @sv
alternative label: Metamusik, meditationsmusik (788.9) @sv
alternative label: Miljömusik (788.9) @sv
alternative label: New Age-musik (788.9) @sv
alternative label: Nya tiden, New Age-musik (788.9) @sv
alternative label: Populärmusik, New Age, ambient (788.9) @sv
alternative label: Rytmmusik, New Age, ambient (788.9) @sv
broader: URN:NBN:fi:au:hklj:788
in scheme: URN:NBN:fi:au:hklj:
notation: 788.9
preferred label: New Age music. Environmental music. Music for relaxation @en
preferred label: New Age-musik. Avslappningsmusik @sv
related: Henkilökohtainen terveydenhoito
related: Teatteritekniikka
related: URN:NBN:fi:au:hklj:782.4
related: URN:NBN:fi:au:hklj:783
related: URN:NBN:fi:au:hklj:783.1
related: URN:NBN:fi:au:hklj:785.7
related: URN:NBN:fi:au:hklj:786.8
related: URN:NBN:fi:au:hklj:787.112
related: Rock. Pop
related: Elektroninen popmusiikki. Electronica
related: URN:NBN:fi:au:hklj:789
related: URN:NBN:fi:au:hklj:795

Pohjois-Amerikka
type: Class
type: Concept
subclass of: URN:NBN:fi:au:hklj:789
alternative label: Amerikka, musiikki, historia, P-Amer. (789.5 +)
alternative label: Pohjois-Amerikka, musiikki, historia, Pohjois-Amerikka (789.5 +)
alternative label: Amerika, musik, historia, Nordamerika (789.5 +) @sv
alternative label: Nordamerika, musik, historia, Nordamerika (789.5 +) @sv
broader: URN:NBN:fi:au:hklj:789
in scheme: URN:NBN:fi:au:hklj:
narrower: Kanada
narrower: Yhdysvallat
notation: 789.5
preferred label: North America @en
preferred label: Nordamerika @sv
related: URN:NBN:fi:au:hklj:709
related: URN:NBN:fi:au:hklj:782.4
related: URN:NBN:fi:au:hklj:783
related: URN:NBN:fi:au:hklj:789.1
related: Väli-Amerikka
related: Karibianmeren saaret
related: Etelä-Amerikka
scope note: Yleisteokset ja sekasisältöiset kokoelmat Tässä myös yleisteokset ja sekasisältöiset kokoelmat, jotka koskevat sekä Pohjois- että Väli- tai Etelä-Amerikan kansanmusiikkia
scope note: Allmänna verk och samlingar med blandat innehåll Hit också allmänna verk och samlingar med blandat innehåll som rör den nordamerikanska, centralamerikanska eller sydamerikanska musikens historia @sv

Suomenkielisen kansanrunouden historia ja tutkimus
type: Class
type: Concept
subclass of: SUOMALAIS-UGRILAISTEN KIELTEN KIRJALLISUUDEN HISTORIA JA TUTKIMUS
alternative label: Aarnikotkat, folkloristiikka, suomi (812)
alternative label: Aikakoneet, folkloristiikka, Suomi (812)
alternative label: Aikamatkat, folkloristiikka, Suomi (812)
alternative label: Arkkiveisut, folkloristiikka, suomi (812)
alternative label: Arvoitukset, folkloristiikka, suomi (812)
alternative label: Balladit, folkloristiikka, suomi (812)
alternative label: Eepokset, folkloristiikka, suomi (812)
alternative label: Eeppiset runot, folkloristiikka, suomi (812)
alternative label: Eläinkertomukset, folkloristiikka, suomi (812)
alternative label: Eläinrunot, folkloristiikka, suomi (812)
alternative label: Eläinsadut, folkloristiikka, suomi (812)
alternative label: Enteet, folkloristiikka, suomi (812)
alternative label: Faabelit, folkloristiikka, suomi (812)
alternative label: Feeniks-lintu, folkloristiikka, suomi (812)
alternative label: Feniks, folkloristiikka, suomi (812)
alternative label: Folklore, folkloristiikka, suomi (812)
alternative label: Folklorismi, folkloristiikka, suomi (812)
alternative label: Folkloristiikka, suomi (812)
alternative label: Griipit, folkloristiikka, suomi (812)
alternative label: Haltiat, folkloristiikka, suomi (812)
alternative label: Haltijat, folkloristiikka, suomi (812)
alternative label: Haukkumasanat, folkloristiikka, suomi (812)
alternative label: Helkajuhla, folkloristiikka (812)
alternative label: Herjaukset, folkloristiikka, suomi (812)
alternative label: Hirviöt, folkloristiikka, suomi (812)
alternative label: Historialliset tarinat, folkloristiikka, suomi (812)
alternative label: Häviäminen, folkloristiikka, suomen kieli (812)
alternative label: Hölmöläissadut, folkloristiikka, suomi (812)
alternative label: Ihmesadut, folkloristiikka, suomi (812)
alternative label: Ihmissudet, folkloristiikka, suomen kieli (812)
alternative label: Itkijät, folkloristiikka, suomi (812)
alternative label: Itkut, folkloristiikka, suomi (812)
alternative label: Joulupukit, folkloristiikka, suomi (812)
alternative label: Jätkäperinne, folkloristiikka, suomen kieli (812)
alternative label: Jättiläiset, folkloristiikka, suomi (812)
alternative label: Kalevala, folkloristiikka (812)
alternative label: Kalevalamitta (812)
alternative label: Kalevalamittaiset runot (812)
alternative label: Kansalliseepokset, folkloristiikka, suomi (812)
alternative label: Kansaneepokset, folkloristiikka, suomi (812)
alternative label: Kansankertojat, folkloristiikka, suomi (812)
alternative label: Kansankertomukset, folkloristiikka, suomi (812)
alternative label: Kansanperinne, folkloristiikka, suomi (812)
alternative label: Kansanperinteentutkimus, folkloristiikka, suomi (812)
alternative label: Kansanrunoilijat, folkloristiikka, suomi (812)
alternative label: Kansanrunot, folkloristiikka, suomi (812)
alternative label: Kansanrunoudentutkimus, suomi (812)
alternative label: Kansanrunous, folkloristiikka, suomi (812)
alternative label: Kansanrunoustiede, suomi (812)
alternative label: Kansansadut, folkloristiikka, suomi (812)
alternative label: Kansantarinat, folkloristiikka, suomi (812)
alternative label: Kansanusko, folkloristiikka., suomi (812)
alternative label: Kansanuskomukset, folkloristiikka., suomi (812)
alternative label: Kanteletar, folkloristiikka (812)
alternative label: Karelianismi, kansanrunoudentutkimus (812)
alternative label: Kaskut, folkloristiikka, suomi (812)
alternative label: Kaupunkilegendat, folkloristiikka, suomi (812)
alternative label: Keijukaiset, folkloristiikka, suomi (812)
broader: SUOMALAIS-UGRILAISTEN KIELTEN KIRJALLISUUDEN HISTORIA JA TUTKIMUS
in scheme: URN:NBN:fi:au:hklj:
notation: 812
related: URN:NBN:fi:au:hklj:1
related: URN:NBN:fi:au:hklj:1.1
related: Muinaissuomalaiset ja suomalais-ugrilaiset uskonnot ja mytologiat
related: KANSATIEDE. ANTROPOLOGIA
related: URN:NBN:fi:au:hklj:473
related: URN:NBN:fi:au:hklj:475.1
related: URN:NBN:fi:au:hklj:769
related: URN:NBN:fi:au:hklj:784.111
related: URN:NBN:fi:au:hklj:807
related: Suomenkielisen kirjallisuuden historia ja tutkimus
related: Suomenkielisen kirjallisuuden aihepiirejä ja kirjallisuustyyppejä koskeva historia ja tutkimus
related: Pohjoismaisten kielten kirjallisuuden historia ja tutkimus
related: Suomenruotsalaisen kirjallisuuden historia ja tutkimus
related: Suomen kieli
scope note: Suomenkielistä kansanrunoutta koskeva historia, tutkimus ja folkloristiikka Suomenkielinen henkinen kansankulttuuri ja suullinen perinne kansanrunoudentutkimuksen kannalta Suomenkielisten kansanrunojen, kansaneeposten, arvoitusten ja sananlaskujen historia ja tutkimus
scope note: Den finska folkdiktningens historia, finsk folkminnesforskning och folklore Finsk andlig folkkultur och muntlig tradition ur folkminnesforskningens synvinkel Historia och forskning som rör finsk folkdiktning, finska nationalepos, gåtor och ordspråk @sv

Suomenkielisen kirjallisuuden aihepiirejä ja kirjallisuustyyppejä koskeva historia ja tutkimus
type: Class
type: Concept
subclass of: SUOMALAIS-UGRILAISTEN KIELTEN KIRJALLISUUDEN HISTORIA JA TUTKIMUS
alternative label: Aarnikotkat, fantasiakirjallisuuden tutkimus, suomi (816 +)
alternative label: Agenttikirjallisuus, kirjallisuudentutkimus, suomi (816 +)
alternative label: Aiheet, kirjallisuudentutkimus, suomi (816 +)
alternative label: Aikakoneet, fantasiakirj., tutk., suomi (816 +)
alternative label: Aikamatkat, fantasiakirj., tutk., suomi (816 +)
alternative label: Ammattikirjallisuus, kirjallisuudentutkimus, suomi (816)
alternative label: Antiutopiat, kirjallisuudentutkimus, suomi (816 +)
alternative label: Avainromaanit, kirjallisuudentutkimus, suomi (816 +)
alternative label: Bestsellerit, kirjallisuudentutkimus, suomi (816 +)
alternative label: Cowboyt, kirjallisuudenhistoria, suomi (816 +)
alternative label: Dekkarit, kirjallisuudentutkimus, suomi (816 +)
alternative label: Dokumenttikirjallisuus, kirjallisuudentutkimus, suomi (816 +)
alternative label: Dystopiat, kirjallisuudentutkimus, suomi (816 +)
alternative label: Eepokset, kirjallisuudentutkimus, suomi (816 +)
alternative label: Eeppiset runot, kirjallisuudentutkimus, suomi (816 +)
alternative label: Eläinkertomukset, kirjallisuudentutkimus, suomi (816 +)
alternative label: Eläinrunot, kirjallisuudentutkimus, suomi (816 +)
alternative label: Eläinsadut, kirjallisuudentutkimus, suomi (816 +)
alternative label: Elämäkertaromaanit, kirjallisuudentutkimus, suomi (816 +)
alternative label: Emigranttikirjallisuus, kirjallisuudentutkimus, suomi (816 +)
alternative label: Epigrammit, kirjallisuudentutkimus, suomi (816)
alternative label: Eroottinen kirjallisuus, kirjallisuudentutkimus, suomi (816)
alternative label: Erotiikka, kirjallisuudentutkimus, suomi (816)
alternative label: Eräkertomukset, kirjallisuudentutkimus, suomi (816 +)
alternative label: Eräkirjallisuus, kirjallisuudentutkimus, suomi (816 +)
alternative label: Eräkirjat, kirjallisuudentutkimus, suomi (816 +)
alternative label: Erätarinat, kirjallisuudentutkimus, suomi (816 +)
alternative label: Faabelit, kirjallisuudentutkimus, suomi (816 +)
alternative label: Fantasiakirjallisuus, kirjallisuudentutkimus, suomi (816 +)
alternative label: Farssit, kirjallisuudentutkimus, suomi (816 +)
alternative label: Feeniks-lintu, fantasiakirjallisuuden tutkimus, suomi (816 +)
alternative label: Feniks, fantasiakirjallisuuden tutkimus, suomi (816 +)
alternative label: Genret, kirjallisuudentutkimus, suomi (816 +)
alternative label: Genretutkimus, kirjallisuudentutkimus, suomi (816 +)
alternative label: Goottilaiset kauhuromaanit, kirjallisuudenhistoria, suomi (816 +)
alternative label: Goottilaiset romaanit, kirjallisuudenhistoria, suomi (816 +)
alternative label: Griipit, fantasiakirjallisuuden tutkimus, suomi (816 +)
alternative label: Haikut, kirjallisuudentutkimus, suomi (816 +)
alternative label: Harmaa kirjallisuus, kirjallisuudentutkimus, suomi (816)
alternative label: Hirviöt, kirjallisuudentutkimus, suomi (816 +)
alternative label: Historialliset näytelmät, kirjallisuudentutkimus, suomi (816 +)
alternative label: Historialliset romaanit, kirjallisuudentutkimus, suomi (816 +)
alternative label: Historialliset tarinat, kirjallisuudentutkimus, suomi (816 +)
alternative label: Huumori, kirjallisuudentutkimus, suomi (816 +)
alternative label: Ihmenäytelmät, kirjallisuudentutkimus, suomi (816 +)
alternative label: Ironia, kirjallisuudentutkimus, suomi (816 +)
alternative label: Jatkokertomukset, kirjallisuudentutkimus, suomi (816 +)
alternative label: Jatkokirjat, kirjallisuudentutkimus, suomi (816 +)
alternative label: Jännityskirjallisuus, kirjallisuudentutkimus, suomi (816)
alternative label: Karelianismi, kirjallisuudentutkimus (816 +)
alternative label: Kauhukirjallisuus, kirjallisuudenhistoria, suomi (816 +)
alternative label: Kauhuromaanit, kirjallisuudenhistoria, suomi (816 +)
alternative label: Kauhusarjakuvat, kirjallisuudentutkimus, suomi (816 +)
alternative label: Kehitysromaanit, kirjallisuudenhistoria, suomi (816 +)
alternative label: Kertomarunot, kirjallisuudenhistoria, suomi (816 +)
alternative label: Kioskikirjallisuus, kirjallisuudentutkimus, suomi (816 +)
alternative label: Kirjallisuuden lajit, kirjallisuudentutkimus, suomi (816 +)
alternative label: Kirjallisuuden tyylit, kirjallisuudenlajit, suomi (816 +)
alternative label: Kirjallisuudenhistoria, kirjallisuudenlajit, suomi (816 +)
alternative label: Kirjallisuudentutkimus, kirjallisuudenlajit, suomi (816)
broader: SUOMALAIS-UGRILAISTEN KIELTEN KIRJALLISUUDEN HISTORIA JA TUTKIMUS
in scheme: URN:NBN:fi:au:hklj:
narrower: Suomenkielisen lasten- ja nuortenkirjallisuuden historia ja tutkimus
notation: 816
related: URN:NBN:fi:au:hklj:1
related: URN:NBN:fi:au:hklj:749.1
related: Piirustuksen materiaalit ja tekniikka
related: Pilapiirrokset. Karikatyyrit
related: Kirjallisuuden aihepiirejä ja kirjallisuustyyppejä koskeva historia ja tutkimus
related: Lasten- ja nuortenkirjallisuuden historia ja tutkimus
related: Suomenkielisen kirjallisuuden historia ja tutkimus
related: Suomenkielisen kansanrunouden historia ja tutkimus
related: Pohjoismaisten kielten kirjallisuuden historia ja tutkimus
related: Suomenruotsalaisen kirjallisuuden historia ja tutkimus
related: Suomen kieli
scope note: Tässä suomenkielisen kirjallisuuden erotiikka-, erä-, historia-, jännitys-, kauhu-, luonto-, lääkäri-, matka-, meri-, rakkaus-, rikos-, romantiikka-, salapoliisi-, scifi-, seikkailu-, sota-, suku-, taide-, tiede-, uskonto-, vakoilu- ja yhteiskuntaaiheet Tässä myös suomenkielisen viihdekirjallisuuden, pakinoiden ja sarjakuvien historia ja tutkimus Yksittäistä kirjailijaa tai hänen tuotantoaan koskevat teokset ovat kuitenkin aina luokassa 811 Suomenkielisen tietokirjallisuuden historia ja tutkimus yleensä Tietyn alan tietokirjallisuus sekä sen historia ja tutkimus alan mukaisessa luokassa
scope note: Hit den finska litteraturens temaområden som hänför sig till detektiver, erotik, havet, historia, konst, krig, kriminalitet, kärlek, läkare, natur, religion, resor, romantik, samhälle, science fiction, skräck, släkter, spioner, spänning, vetenskap, vildmark och äventyr samt litteraturhistoria och litteraturforskning som rör dessa temaområden Hit också litteraturhistoria och litteraturforskning som rör finsk underhållningslitteratur, finska kåserier och tecknade serier Verk som handlar om enskilda författare och deras produktion förs dock alltid till klass 811 Hit också litteraturhistoria och litteraturforskning som rör den finska facklitteraturen i allmänhet Facklitteratur som hänför sig till ett bestämt område samt litteraturhistoria och litteraturforskning som rör sådan facklitteratur klassificeras enligt omr @sv

Kielioppi. Muoto-oppi. Sanaoppi. Semantiikka
type: Class
type: Concept
subclass of: KIELITIEDE
alternative label: Ablatiivi, sijamuodot, kielioppi (855)
alternative label: Adessiivi, sijamuodot, kielioppi (855)
alternative label: Adjektiivit, kielioppi (855)
alternative label: Adverbiaali, kielioppi (855)
alternative label: Adverbit, kielioppi (855)
alternative label: Affiksit, kielioppi (855)
alternative label: Aikamuodot, kielioppi (855)
alternative label: Aktiivi, kielitiede (855)
alternative label: Anagrammit, kielitiede (855)
alternative label: Antonymia, kielitiede (855)
alternative label: Antonyymit, kielitiede (855)
alternative label: Artikkelit, kielioppi (855)
alternative label: Asemosanat, kielioppi (855)
alternative label: Aspekti, kielioppi (855)
alternative label: Attribuutti, kielioppi (855)
alternative label: Definiittisyys (855)
alternative label: Deklinaatio, kielioppi (855)
alternative label: Deskriptiivisanat, sanaoppi (855)
alternative label: Ekspressiivisanat, sanaoppi (855)
alternative label: Eponyymit, sanaoppi (855)
alternative label: Etuliitteet, kielitiede, kielitiede (855)
alternative label: Fraasit, lauseoppi (855)
alternative label: Fraseologia, lauseoppi (855)
alternative label: Funktiokielioppi (855)
alternative label: Funktionaalinen kielioppi (855)
alternative label: Funktionaalinen lauseoppi (855)
alternative label: Futuurit, kielioppi (855)
alternative label: Grammatikaalistuminen (855)
alternative label: Homonymia, kielitiede (855)
alternative label: Homonyymit, kielitiede (855)
alternative label: Infiniittirakenteet, kielitiede (855)
alternative label: Interjektiot, kielitiede (855)
alternative label: Johdokset, kielitiede (855)
alternative label: Jälkiliitteet, kielitiede (855)
alternative label: Kaksimielisyydet, sanaoppi (855)
alternative label: Kausatiivisuus (855)
alternative label: Kieliopillistuminen (855)
alternative label: Kielioppi (855)
alternative label: Kieltoilmaukset (855)
alternative label: Komparaatio, kielitiede (855)
alternative label: Komposiitit, kielitiede (855)
alternative label: Konjugaatio, kielitiede (855)
alternative label: Konjunktiot (855)
alternative label: Konstruktiokielioppi (855)
alternative label: Kysymykset, kielioppi (855)
alternative label: Käsiteanalyysi, kielitiede (855)
alternative label: Käsitteenmuodostus, kielitiede (855)
alternative label: Käsitteet, kielitiede (855)
alternative label: Lainasanat, sanaoppi (855)
alternative label: Lainautuminen, sanaoppi (855)
alternative label: Lauseenjäsenet, kielitiede (855)
alternative label: Lauseenjäsennys, kielitiede (855)
alternative label: Lauseenvastikkeet, kielitiede (855)
alternative label: Lauseet, kielitiede (855)
alternative label: Lauseoppi, kielitiede (855)
alternative label: Lausetyypit, kielitiede (855)
alternative label: Leksikologia, sanaoppi (855)
alternative label: Liitteet, kielioppi (855)
alternative label: Loppuliitteet, kielitiede (855)
broader: KIELITIEDE
in scheme: URN:NBN:fi:au:hklj:
notation: 855
related: Symbolit. Koodit. Merkkijärjestelmät
related: Lauselogiikka. Lausekalkyyli
related: Kielifilosofia
related: Etymologia. Onomastiikka
related: Kielihistoria
related: URN:NBN:fi:au:hklj:860
related: GERMAANISET, KELTTILÄISET, BALTTILAISET JA SLAAVILAISET KIELET
related: Ruotsin kielen kielioppi ja semantiikka
related: Saksan kielen kielioppi ja semantiikka
related: Englannin kielen kielioppi ja semantiikka
related: URALILAISET KIELET. ALTAILAISET KIELET
related: Suomen kielen kielioppi ja semantiikka
related: MUUT KIELET
scope note: Kieliopin, kielen muoto-opin, sanaopin ja semantiikan yleisteokset Vertaileva kieli-, muoto- ja sanaoppi Sanaluokat, sananmuodostus ja taivutus yleisen kielitieteen kannalta Lauseoppi eli syntaksi yleisen kielitieteen kannalta Tiettyä kieltä tai kieliryhmää koskeva kieli-, muoto- ja sanaoppi sekä semantiikka ko. kielen tai kieliryhmän luokassa
scope note: Allmänna verk om betydelselära (semantik), formlära (morfologi), satslära (syntax) och ordlära (lexikologi) Komparativ satslära, formlära och ordlära Ordklasser, ordbildning och ordböjning ur allmän språkvetenskaplig synvinkel Satslära (syntax) ur allmän språkvetenskaplig synvinkel Satslära, formlära och ordlära samt betydelselära som rör ett bestämt språk eller en bestämd språkgrupp förs till klassen för språket eller språkgruppen i fråga @sv

Saksan kieli
type: Class
type: Concept
subclass of: GERMAANISET, KELTTILÄISET, BALTTILAISET JA SLAAVILAISET KIELET
alternative label: Germaaninen filologia (874 +)
alternative label: Germanistiikka (874 +)
alternative label: Kielikurssit, saksan kieli (874)
alternative label: Kuullun ymmärtäminen, saksan kieli (874)
alternative label: Kuullunymmärtäminen, saksan kieli (874)
alternative label: Luetun ymmärtäminen, saksan kieli (874)
alternative label: Länsigermaaniset kielet (874 ... 876)
alternative label: Saksan kieli (874)
alternative label: Saksan kieli, kielitiede (874)
alternative label: Saksan kieli, oppikirjat (874 +)
alternative label: Ylioppilastehtävät, saksan kieli (874)
alternative label: Germansk filologi (874 +) @sv
alternative label: Hörförståelse, tyska (874) @sv
alternative label: Läsförståelse, tyska (874) @sv
alternative label: Språkkurser, tyska (874) @sv
alternative label: Studentuppgifter, tyska (874) @sv
alternative label: Tyska (874) @sv
alternative label: Tyska, lingvistik (874) @sv
alternative label: Tyska, läroböcker (874 +) @sv
alternative label: Västgermanska språk (874 ... 876) @sv
broader: GERMAANISET, KELTTILÄISET, BALTTILAISET JA SLAAVILAISET KIELET
in scheme: URN:NBN:fi:au:hklj:
narrower: Saksan kielen yksikieliset sanakirjat
narrower: Saksan kielen kielioppi ja semantiikka
narrower: Jiddin kieli
notation: 874
preferred label: German @en
preferred label: Tyska @sv
related: Oppimisen psykologia
related: Kirjallisuuden ja kielten opetusoppi
related: URN:NBN:fi:au:hklj:3
related: Saksankielisen kirjallisuuden historia ja tutkimus
related: Kielipsykologia. Kielisosiologia. Kielipolitiikka
related: URN:NBN:fi:au:hklj:860
related: URN:NBN:fi:au:hklj:874.03
related: URN:NBN:fi:au:hklj:874.09
scope note: Saksan kieltä tai sen tutkimusta koskevat yleisteokset Saksan kielen yleiset oppi- ja harjoituskirjat sekä kielikurssit Saksan kielen opiskeluun liittyvät selityksillä tai sanastolla varustetut lukemistot ja lukukirjat Eri ammatteihin ja aloihin liittyvät saksan kielen oppi- ja harjoituskirjat, kielikurssit ja lukemistot Kirjakieli. Puhekieli. Oikeakielisyys. Oikeakielisyysoppaat. Kielenhuolto Tyylioppi ja tyylintutkimus kielitieteen kannalta Äänneoppi. Etymologia. Onomastiikka. Leksikologia. Murteet. Slangit Kielisosiologia. Kielipsykologia. Sosiolingvistiikka. Psykolingvistiikka. Kielipolitiikka
scope note: Allmänna verk om tyska eller om forskning i tyska Allmänna läroböcker och övningsböcker samt språkkurser i tyska Textböcker och läseböcker för studier i tyska med förklaringar och ordlistor Läroböcker, övningsböcker, språkkurser och textböcker i tyska som rör olika yrken och branscher Skriftspråk. Talspråk. Språkriktighet. Handböcker i språkriktighet. Språkvård Stilistik och stilforskning ur språkvetenskaplig synvinkel Ljudlära. Etymologi. Onomastik. Ordlära (lexikologi). Dialekter. Slang Språksociologi. Språkpsykologi. Sociolingvistik. Psykolingvistik. Språkpolitik @sv

Slaavilaiset kielet
type: Class
type: Concept
subclass of: GERMAANISET, KELTTILÄISET, BALTTILAISET JA SLAAVILAISET KIELET
alternative label: Kirkkoslaavi (879)
alternative label: Kirkkoslaavi, kielitiede (879)
alternative label: Makedonian kieli (879)
alternative label: Makedonian kieli, kielitiede (879)
alternative label: Muinaiskirkkoslaavi (879)
alternative label: Slaavilaiset kielet (879 +)
alternative label: Slaavilaiset kielet, kielitiede (879 +)
alternative label: Slavistiikka, kielitiede (879 +)
alternative label: Fornkyrkoslaviska (879) @sv
alternative label: Kyrkoslaviska (879) @sv
alternative label: Kyrkoslaviska, lingvistik (879) @sv
alternative label: Makedoniska (879) @sv
alternative label: Makedoniska, lingvistik (879) @sv
alternative label: Slaviska språk (879 +) @sv
alternative label: Slaviska språk, lingvistik (879 +) @sv
alternative label: Slavistik, lingvistik (879 +) @sv
broader: GERMAANISET, KELTTILÄISET, BALTTILAISET JA SLAAVILAISET KIELET
in scheme: URN:NBN:fi:au:hklj:
narrower: Venäjän kieli
narrower: Puolan kieli
narrower: Tsekin ja slovakin kieli
narrower: Bulgarian kieli
narrower: Bosnian, kroatian, makedonian, montenegron, serbian ja sloveenin kieli
narrower: Ukrainan ja valkovenäjän kieli
notation: 879
preferred label: Slavic languages @en
preferred label: Slaviska språk @sv
related: URN:NBN:fi:au:hklj:860
scope note: Slaavilaisia kieliä koskevat yleisteokset
scope note: Allmänna verk om slaviska språk @sv

Historialliset kartat. Historiallinen maantiede
type: Class
type: Concept
subclass of: HISTORIAN TUTKIMUSMENETELMÄT. ARKEOLOGIA. KULTTUURIHISTORIA
alternative label: Atlakset, historialliset (914)
alternative label: Dokumentit, diplomatiikka (914)
alternative label: Historiallinen maantiede (914)
alternative label: Historialliset kartat (914)
alternative label: Ihmismaantiede, historiallinen maantiede (914)
alternative label: Kartastot, historialliset maailmankartat (914)
alternative label: Kartat, historialliset (914)
alternative label: Maailma, maailmankartat, historia (914)
alternative label: Maailmankartat, historialliset (914)
alternative label: Rajat, historialliset kartat (914)
alternative label: Sotilasmaantiede, historiallinen (914)
alternative label: Valtakunnan rajat, historialliset kartat (914)
alternative label: Atlaser, historiska (914) @sv
alternative label: Dokument, diplomatik (914) @sv
alternative label: Gränser, historiska kartor (914) @sv
alternative label: Historisk geografi (914) @sv
alternative label: Historiska kartor (914) @sv
alternative label: Humangeografi, historisk geografi (914) @sv
alternative label: Kartor, historiska (914) @sv
alternative label: Kartverk, historiska världskartor (914) @sv
alternative label: Militärgeografi, historisk (914) @sv
alternative label: Riksgränser, historiska kartor (914) @sv
alternative label: Världen, världskartor, historia (914) @sv
alternative label: Världskartor, historiska (914) @sv
broader: HISTORIAN TUTKIMUSMENETELMÄT. ARKEOLOGIA. KULTTUURIHISTORIA
in scheme: URN:NBN:fi:au:hklj:
notation: 914
preferred label: Historical maps. Historical geography @en
preferred label: Historiska kartor. Historisk geografi @sv
related: Maailmankartat. Maailmankartastot
related: Yleinen aluemaantiede. Yleinen kulttuurimaantiede. Yleinen poliittinen maantiede
related: Kartografia
related: URN:NBN:fi:au:hklj:909
related: Vanhan ajan historia
related: Keskiajan historia 400-1499
related: Uuden ajan historia 1500-1788
related: Uusimman ajan historia 1789-1913
related: Nykyajan historia 1914-1938
related: I maailmansodan historia 1914-1918
related: Nykyajan historia 1939-
related: II maailmansodan historia 1939-1945
related: Historian aputieteet
scope note: Historialliset maailmankartat ja -kartastot. Historiallinen maantiede yleensä Eri maanosien, maiden, alueiden ja aikakausien historialliset kartat ja historiallinen maantiede ko. maanosan, maan, alueen tai aikakauden historian luokassa
scope note: Historiska världskartor och atlaser. Historisk geografi i allmänhet Historiska kartor och historisk geografi som hänför sig till olika världsdelar, länder, geografiska områden och tidsperioder förs till klassen för världsdelens, landets, det geografiska områdets eller tidsperiodens historia @sv

Egyptin ja Etu-Aasian muinaishistoria ja arkeologia
type: Class
type: Concept
subclass of: HISTORIAN TUTKIMUSMENETELMÄT. ARKEOLOGIA. KULTTUURIHISTORIA
alternative label: Arkeologia, Egypti (916)
alternative label: Arkeologia, Lähi-Itä (916)
alternative label: Assyria, arkeologia ja historia (916)
alternative label: Assyrialaiset (916)
alternative label: Assyriologia (916)
alternative label: Assyrologia (916)
alternative label: Babylonia, arkeologia ja historia (916)
alternative label: Babylonialaiset (916)
alternative label: Biografiat, hallitsijat ja kuninkaalliset (916 ... 989)
alternative label: Edelläkävijät, hallitsijat ja kuninkaalliset (916 ... 989)
alternative label: Egypti, arkeologia (916)
alternative label: Egypti, historia vuoteen 639 j.Kr. (916)
alternative label: Egyptologia (916)
alternative label: Elämäkerrat, hallitsijat ja kuninkaalliset (916 ... 989)
alternative label: Elämänhistoria, henkilöhistoria, hallitsijat ja kuninkaalliset (916 ... 989)
alternative label: Etu-Aasia, arkeologia (916)
alternative label: Etu-Aasia, historia, muinaisajan (916)
alternative label: Faaraot (916)
alternative label: Faraot (916)
alternative label: Fariseukset, juutalaiset, muinaishistoria (916)
alternative label: Foinikia, historia vuoteen 636 j.Kr. (916)
alternative label: Foinikialainen kulttuuri (916)
alternative label: Foinikialaiset (916)
alternative label: Haastattelut, henkilöhistoria, hallitsijat ja kuninkaalliset (916 ... 989)
alternative label: Hammurabin lait, Babylonia, arkeologia ja historia (916)
alternative label: Heettiläiset (916)
alternative label: Henkilöhistoria, hallitsijat ja kuninkaalliset (916 ... 989)
alternative label: Henkilökuvat, hallitsijat ja kuninkaalliset (916 ... 989)
alternative label: Henkilöt, hallitsijat ja kuninkaalliset (916 ... 989)
alternative label: Historia, henkilöhistoria, hallitsijat ja kuninkaalliset (916 ... 989)
alternative label: Hovit, hallitsijat ja kuninkaalliset (916 ... 989)
alternative label: Jerusalem, arkeologia, muinaishistoria (916)
alternative label: Julkisuuden henkilöt, hallitsijat ja kuninkaalliset (916 ... 989)
alternative label: Juutalaiset, historia, muinaishistoria (916)
alternative label: Kaksoisvirranmaa, arkeologia ja historia (916)
alternative label: Kansalliset suurmiehet, hallitsijat ja kuninkaalliset (916 ... 989)
alternative label: Karthago, arkeologia ja historia (916)
alternative label: Kirjeet, hallitsijat ja kuninkaalliset (916 ... 989)
alternative label: Kuolleenmeren löydöt, arkeologia (916)
alternative label: Kypros, muinaishistoria ja arkeologia (916)
alternative label: Lapsuus, hallitsijat ja kuninkaalliset (916 ... 989)
alternative label: Maahanmuuttajat, henkilöhistoria, hallitsijat ja kuninkaalliset (916 ... 989)
alternative label: Maanpako, henkilöhistoria, hallitsijat ja kuninkaalliset (916 ... 989)
alternative label: Merkkihenkilöt, hallitsijat ja kuninkaalliset (916 ... 989)
alternative label: Mesopotamia, arkeologia (916)
alternative label: Mesopotamia, historia vuoteen 637 jKr. (916)
alternative label: Muistelmat, hallitsijat ja kuninkaalliset (916 ... 989)
alternative label: Muistokirjoitukset, hallitsijat ja kuninkaalliset (916 ... 989)
alternative label: Muumiot, Egyptin historia (916)
alternative label: Nekrologit, hallitsijat ja kuninkaalliset (916 ... 989)
alternative label: Obeliskit, Egypti (916)
alternative label: Omaelämäkerrat, hallitsijat ja kuninkaalliset (916 ... 989)
alternative label: Pakolaiset, henkilöhistoria, hallitsijat ja kuninkaalliset (916 ... 989)
alternative label: Palsamointi, egyptologia (916)
alternative label: Papyrologia, egyptologia (916)
alternative label: Papyrukset, egyptologia (916)
alternative label: Persia, arkeologia (916)
alternative label: Persia, historia vuoteen 642 j.Kr. (916)
alternative label: Pohjois-Afrikka, Egyptologia (916)
broader: HISTORIAN TUTKIMUSMENETELMÄT. ARKEOLOGIA. KULTTUURIHISTORIA
in scheme: URN:NBN:fi:au:hklj:
notation: 916
related: Vanhan ajan filosofia
related: Etu-Aasia
related: Turkki
related: Israel. Palestiina
related: Egypti. Sudan. Etelä-Sudan
related: Euroopan ulkopuolisten vanhojen kulttuurien taide
related: URN:NBN:fi:au:hklj:909
related: Vanhan ajan historia
related: URN:NBN:fi:au:hklj:919
related: Vanhan ajan kulttuurihistoria
related: Etu-Aasian historia
related: Israelin ja Palestiinan historia
related: Pohjois-Afrikan historia
scope note: Muinaisen Egyptin ja Etu-Aasian historia, arkeologia ja kulttuurihistoria Egypti vuoteen 639 j.Kr Mesopotamia vuoteen 637 j.Kr. Syyria ja Foinikia vuoteen 636 j.Kr. Karthago ja Vähä-Aasia vuoteen 395 j.Kr. Persia vuoteen 642 j.Kr.
scope note: Det forna Egyptens och Främre Asiens historia, arkeologi och kulturhistoria Egypten till år 639 e.Kr. Mesopotamien till år 637 e.Kr. Syrien och Fenicien till år 636 e.Kr. Kartago och Mindre Asien till år 395 e.Kr. Persien till år 642 e.Kr. @sv

Keskiajan kulttuurihistoria 400-1499
type: Class
type: Concept
subclass of: URN:NBN:fi:au:hklj:919
alternative label: Arabialainen kulttuuri, keskiaika (919.2)
alternative label: Bysantti, kulttuurihistoria (919.2)
alternative label: Frankit, kulttuurihistoria (919.2)
alternative label: Haarniskat, ritariajan kulttuurihistoria (919.2)
alternative label: Hengelliset ritarikunnat, kulttuurihistoria (919.2)
alternative label: Keskiaika, kulttuurihistoria (919.2)
alternative label: Myöhäiskeskiaika, kulttuurihistoria (919.2)
alternative label: Narrit, keskiajan kulttuurihistoria (919.2)
alternative label: Permakulttuuri, kulttuurihistoria (919.2)
alternative label: Ristiretket, kulttuurihistoria (919.2)
alternative label: Ristiretkiaika, kulttuurihistoria (919.2)
alternative label: Ristiritarit, kulttuurihistoria (919.2)
alternative label: Ritarikunnat, kulttuurihistoria (919.2)
alternative label: Ritarilaitos, kulttuurihistoria (919.2)
alternative label: Ritaristo, keskiajan kulttuurihistoria (919.2)
alternative label: Ritarit, keskiajan kulttuurihistoria (919.2)
alternative label: Temppeliherrat, kulttuurihistoria (919.2)
alternative label: Trubaduurit, keskiajan kulttuurihistoria (919.2)
alternative label: Turnajaiset, keskiajan kultuurihistoria (919.2)
alternative label: Varhaiskeskiaika, kulttuurihistoria (919.2)
alternative label: Andliga riddarordnar, kulturhistoria (919.2) @sv
alternative label: Arabisk kultur, medeltiden (919.2) @sv
alternative label: Bysans, kulturhistoria (919.2) @sv
alternative label: Franker, kulturhistoria (919.2) @sv
alternative label: Harnesk, riddartidens kulturhistoria (919.2) @sv
alternative label: Korsriddare, kulturhistoria (919.2) @sv
alternative label: Korståg, kulturhistoria (919.2) @sv
alternative label: Korstågstiden, kulturhistoria (919.2) @sv
alternative label: Medeltiden, kulturhistoria (919.2) @sv
alternative label: Narrar, medeltidens kulturhistoria (919.2) @sv
alternative label: Permakultur, kulturhistoria (919.2) @sv
alternative label: Riddare, medeltidens kulturhistoria (919.2) @sv
alternative label: Riddarordnar, kulturhistoria (919.2) @sv
alternative label: Riddarväsen, kulturhistoria (919.2) @sv
alternative label: Riddersdkap, medeltidens kulturhistoria (919.2) @sv
alternative label: Senmedeltiden, kulturhistoria (919.2) @sv
alternative label: Tempelriddare, kulturhistoria (919.2) @sv
alternative label: Tidig medeltid, kulturhistoria (919.2) @sv
alternative label: Tornerspel, medeltidens kulturhistoria (919.2) @sv
alternative label: Trubadurer, medeltidens kulturhistoria (919.2) @sv
broader: URN:NBN:fi:au:hklj:919
in scheme: URN:NBN:fi:au:hklj:
notation: 919.2
preferred label: Cultural history of the middle-ages 400-1499 @en
preferred label: Medeltidens kulturhistoria 400-1499 @sv
related: Itämainen filosofia
related: Keskiajan filosofia
related: Kulttuurifilosofia
related: Käytös- ja tapatieto
related: Juhlien järjestäminen
related: Esineellinen kulttuuri
related: URN:NBN:fi:au:hklj:473
related: URN:NBN:fi:au:hklj:649.91
related: Keskiajan taidehistoria
related: Keskiaika
related: URN:NBN:fi:au:hklj:909
related: Keskiajan historia 400-1499
related: Historian tutkimusmenetelmät
related: Historian aputieteet
scope note: Keskiajan kulttuurihistorian yleisteokset Euroopan keskiajan kulttuurihistorian yleisteokset Bysantin ja arabien maailmanvallan kulttuurihistorian yleisteokset Tietyn maan tai alueen keskiajan kulttuurihistoria ko. maan tai alueen historian luokassa
scope note: Allmänna verk om medeltidens kulturhistoria Allmänna verk om den europeiska medeltidens kulturhistoria Allmänna verk om det bysantinska och arabiska världsväldets kulturhistoria Verk om medeltidens kulturhistoria i ett bestämt land eller geografiskt område förs till klassen för världsdelens, landets eller det geografiska områdets historia @sv

Nykyajan kulttuurihistoria 1914-1938
type: Class
type: Concept
subclass of: URN:NBN:fi:au:hklj:919
broader: URN:NBN:fi:au:hklj:919
in scheme: URN:NBN:fi:au:hklj:
notation: 919.5
preferred label: Recent cultural history 1914-1938 @en
preferred label: Nutidens kulturhistoria 1914-1938 @sv
related: Itämainen filosofia
related: Nykyajan filosofia
related: Kulttuurifilosofia
related: Käytös- ja tapatieto
related: Juhlien järjestäminen
related: Esineellinen kulttuuri
related: URN:NBN:fi:au:hklj:473
related: URN:NBN:fi:au:hklj:649.91
related: Nykyajan taidehistoria
related: Nykyaika
related: URN:NBN:fi:au:hklj:909
related: Nykyajan historia 1914-1938
related: Historian tutkimusmenetelmät
related: Historian aputieteet
scope note: Nykyajan kulttuurihistorian yleisteokset 1914-1938 Euroopan nykyajan kulttuurihistorian yleisteokset 1914-1938 Tietyn maan tai alueen nykyajan kulttuurihistoria ko. maan tai alueen historian luokassa
scope note: Allmänna verk om nutidens kulturhistoria 1914-1938 Allmänna verk om den europeiska nutidens kulturhistoria 1914-1938 Verk om nutidens kulturhistoria i ett bestämt land eller geografiskt område förs till klassen för landet eller det geografiska området @sv

Nykyajan kulttuurihistoria 1939-
type: Class
type: Concept
subclass of: URN:NBN:fi:au:hklj:919
alternative label: Lapaset, muoti ja muodin historia (919.6)
alternative label: Lähihistoria, kulttuurihistoria (919.6)
alternative label: Nykyaika, kulttuurihistoria (919.6 +)
alternative label: Vuosituhannen vaihde, kulttuurihistoria (919.6)
alternative label: Millennieskiftet, kulturhistoria (919.6) @sv
alternative label: Nutiden, kulturhistoria (919.6 +) @sv
alternative label: Närhistoria, kulturhistoria (919.6) @sv
alternative label: Vantar, mode och modets historia (919.6) @sv
broader: URN:NBN:fi:au:hklj:919
in scheme: URN:NBN:fi:au:hklj:
notation: 919.6
preferred label: Modern cultural history 1939- @en
preferred label: Nutidens kulturhistoria 1939- @sv
related: Itämainen filosofia
related: Nykyajan filosofia
related: Kulttuurifilosofia
related: Käytös- ja tapatieto
related: Juhlien järjestäminen
related: Esineellinen kulttuuri
related: URN:NBN:fi:au:hklj:473
related: URN:NBN:fi:au:hklj:649.91
related: Nykyajan taidehistoria
related: Nykyaika
related: URN:NBN:fi:au:hklj:909
related: Nykyajan historia 1939-
related: Historian tutkimusmenetelmät
related: Historian aputieteet
scope note: Nykyajan kulttuurihistorian yleisteokset 1939- Euroopan nykyajan kulttuurihistorian yleisteokset 1939- Tietyn maan tai alueen nykyajan kulttuurihistoria ko. maan tai alueen historian luokassa
scope note: Allmänna verk om nutidens kulturhistoria 1939- Allmänna verk om den europeiska nutidens kulturhistoria 1939- Verk om nutidens kulturhistoria i ett bestämt land eller geografiskt område förs till klassen för landets eller det geografiska områdets historia @sv

Itsenäisyyden aika 1939-
type: Class
type: Concept
subclass of: URN:NBN:fi:au:hklj:920
alternative label: Asekätkentä, Suomen historia (928 +)
alternative label: Itsenäisyyden aika, Suomi (927 ... 928 +)
alternative label: Itsenäisyys, itsenäisyyden aika, Suomi (927 ... 928 +)
alternative label: Lähihistoria, Suomen historia (928)
alternative label: Moskovan rauha, Suomen historia (928 +)
alternative label: Moskovan välirauha (928)
alternative label: Pariisin rauha, Suomen historia (928)
alternative label: Suomen historia, 1939- (928 +)
alternative label: Suomettuminen, Suomen historia (928)
alternative label: Säännöstely, Suomen historia (928 +)
alternative label: Toimitusministeristöt, Suomen historia (927 ... 928 +)
alternative label: Vaaran vuodet (928)
alternative label: Välirauha, historia (928)
alternative label: Expeditionsministärer, Finlands historia (927 ... 928 +) @sv
alternative label: Farliga åren (928) @sv
alternative label: Finlandisering, Finlands historia (928) @sv
alternative label: Finlands historia, 1939- (928 +) @sv
alternative label: Mellanfreden i Moskva (928) @sv
alternative label: Moskvafreden, Finlands historia (928 +) @sv
alternative label: Närhistoria, Finlands historia (928) @sv
alternative label: Parisfreden, Finlands historia (928) @sv
alternative label: Ransonering, Finlands historia (928 +) @sv
alternative label: Självständighet, självständighetstiden, Finland (927 ... 928 +) @sv
alternative label: Självständighetstiden, Finland (927 ... 928 +) @sv
alternative label: Tiden efter Moskvafreden, historia (928) @sv
alternative label: Vapensmusselaffären, Finlands historia (928 +) @sv
broader: URN:NBN:fi:au:hklj:920
in scheme: URN:NBN:fi:au:hklj:
narrower: Sodat 1939-1945
notation: 928
preferred label: Independence 1939– @en
preferred label: Självständighetstiden 1939– @sv
related: URN:NBN:fi:au:hklj:061
related: Suomi
related: Suomen ulkopolitiikka
related: URN:NBN:fi:au:hklj:411
related: Suomenruotsalaisten asuma-alueet
related: Suomen yleinen taidehistoria
related: URN:NBN:fi:au:hklj:909
related: URN:NBN:fi:au:hklj:919
related: URN:NBN:fi:au:hklj:930
related: Neuvostoliiton historia 1945-1991

Sukututkimuksen historia ja menetelmät
type: Class
type: Concept
subclass of: Sukuhistoria. Sukututkimus
alternative label: Harrastukset, sukututkimus (999.1)
alternative label: Henkikirjat, sukututkimus (999.1)
alternative label: Henkilönnimitutkimus, sukututkimus (999.1)
alternative label: Henkilörekisterit, sukututkimus (999.1)
alternative label: Kastekirjat, sukututkimus (999.1)
alternative label: Kirkonarkistot, sukututkimus (999.1)
alternative label: Kirkonkirjat, sukututkimus (999.1)
alternative label: Rippikirjat, sukututkimus (999.1)
alternative label: Sukunimet, sukututkimusoppaat (999.1)
alternative label: Sukututkimus, oppaat (999.1)
alternative label: Suvut, sukututkimus (999.1)
alternative label: Väestökirjat, sukututkimus (999.1)
alternative label: Väestörekisterit, sukututkimus (999.1)
alternative label: Befolkningsböcker, släktforskning (999.1) @sv
alternative label: Befolkningsregister, släktforskning (999.1) @sv
alternative label: Dopböcker, släktforskning (999.1) @sv
alternative label: Hobbyer, släktforskning (999.1) @sv
alternative label: Kommunionböcker, släktforskning (999.1) @sv
alternative label: Kyrkböcker, släktforskning (999.1) @sv
alternative label: Kyrkoarkiv, släktforskning (999.1) @sv
alternative label: Mantalsböcker, släktforskning (999.1) @sv
alternative label: Personnamnsforskning, släktforskning (999.1) @sv
alternative label: Personregister, släktforskning (999.1) @sv
alternative label: Släkter, släktforskning (999.1) @sv
alternative label: Släktforskning, handböcker (999.1) @sv
alternative label: Släktnamn, släktforskningshandböcker (999.1) @sv
broader: Sukuhistoria. Sukututkimus
in scheme: URN:NBN:fi:au:hklj:
notation: 999.1
preferred label: History and metholodology of family research @en
preferred label: Släktforskningens historia och metoder @sv
related: Arkistonhoito
related: URN:NBN:fi:au:hklj:061
related: URN:NBN:fi:au:hklj:063
related: Pelastusoppi. Kristillinen antropologia
related: URN:NBN:fi:au:hklj:323
related: Poliittiset ja aatteelliset vähemmistöt
related: URN:NBN:fi:au:hklj:617
related: URN:NBN:fi:au:hklj:618.24
related: URN:NBN:fi:au:hklj:618.3
related: URN:NBN:fi:au:hklj:909
related: Historian tutkimusmenetelmät
related: Historian aputieteet
related: URN:NBN:fi:au:hklj:919
related: Elämäkerralliset hakuteokset
scope note: Sukututkimuksen oppaat Valtion-, maakunta- ja kirkonarkistojen käyttö sukututkimuksen lähteinä
scope note: Handledningar i släktforskning Användning av riksarkiv, landsarkiv och kyrkoarkiv som källor i släktforskning @sv

Norjankielinen kaunokirjallisuus (Kaunoluokka)
type: Class
type: Concept
type: FormClass
subclass of: RUOTSINKIELINEN KAUNOKIRJALLISUUS (Kaunoluokka)
broader: RUOTSINKIELINEN KAUNOKIRJALLISUUS (Kaunoluokka)
in scheme: URN:NBN:fi:au:hklj:
narrower: Norjankieliset kansanrunot (Kaunoluokka)
narrower: Norjankieliset runot (Kaunoluokka)
narrower: Norjankieliset näytelmät ja kuunnelmat (Kaunoluokka)
narrower: Norjankieliset romaanit, novellit ja näytelmäelokuvat (Kaunoluokka)
narrower: Norjankieliset sadut (Kaunoluokka)
narrower: Islanninkielinen kaunokirjallisuus (Kaunoluokka)
narrower: Fäärinkielinen kaunokirjallisuus (Kaunoluokka)
notation: 2.9
preferred label: Norwegian fiction (Fiction class) @en
preferred label: Norsk skönlitteratur (Skönklass) @sv
scope note: Kaunokirjalliset sekasisältöiset kokoelmat, valikoimat, antologiat, lukemistot, lukukirjat, ohjelmistot ja aapiset Jos teos painottuu johonkin kaunokirjallisuuden lajiin, on etusija kirjallisuuden lajin mukaisella luokalla
scope note: Skönlitterära samlade verk, verk i urval, antologier, textböcker, läseböcker, program och ABC-böcker med blandat innehåll, Om någon skönlitterär genre dominerar i verket ges företräde åt klassen för den litterära genren i fråga @sv

SAKSANKIELINEN KAUNOKIRJALLISUUS (Kaunoluokka)
type: Class
type: Concept
type: FormClass
subclass of: Kaunoluokat
broader: Kaunoluokat
in scheme: URN:NBN:fi:au:hklj:
narrower: Saksankieliset kansanrunot (Kaunoluokka)
narrower: Saksankieliset runot (Kaunoluokka)
narrower: Saksankieliset näytelmät ja kuunnelmat (Kaunoluokka)
narrower: Saksankieliset romaanit, novellit ja näytelmäelokuvat (Kaunoluokka)
narrower: Saksankieliset sadut (Kaunoluokka)
narrower: Hollanninkielinen kaunokirjallisuus (Kaunoluokka)
narrower: Jiddinkielinen kaunokirjallisuus (Kaunoluokka)
notation: 3
preferred label: GERMAN FICTION (Fiction class) @en
preferred label: TYSK SKÖNLITTERATUR (Skönklass) @sv
scope note: Kaunokirjallisuuden luokissa teokset ovat julkaisun kielen, eivät julkaisumaan tai alkuteoksen kielen mukaisessa luokassa Jos kaksikielisen teoksen toinen kieli on käännöskieli, on teos käännöskielen mukaisessa luokassa Jos kaksi- tai useampikielisen teoksen tekstit eivät ole toistensa käännöksiä, on teos julkaisun pääkielen mukaisessa luokassa Jos teoksella ei ole pääkieltä, se on julkaisun ensimmäisen kielen mukaisessa luokassa Fiktiiviset video- ja elokuvatallenteet ovat kaunokirjallisuuden luokissa, näytelmäelokuvat romaanien luokissa, näytelmäesitysten tallenteet näytelmien luokissa, satuelokuvat satujen luokissa sekä piirretyt, nukke- ja animaatioelokuvat sarjakuvien luokissa Tekstitetyt elokuva- ja videotallenteet ovat tekstityskielen mukaisessa luokassa Elokuvakäsikirjoitukset ovat elokuvan historian luokassa 777.9+ Kaunokirjalliset äänitteet ovat kaunokirjallisuuden luokissa, kuunnelmat näytelmien luokissa ja ääneen luettu kirjallisuus ko. kirjallisuudenlajin luokissa Tässä kaunokirjalliset sekasisältöiset kokoelmat, valikoimat, antologiat, lukemistot, lukukirjat, ohjelmistot ja aapiset Jos teos painottuu johonkin kaunokirjallisuuden lajiin, on etusija kirjallisuuden lajin mukaisella luokalla
scope note: I klasserna för skönlitteraturen klassificeras verken enligt publikationens språk, inte enligt klassen för utgivningslandets eller originaltitelns språk Om det ena språket i ett tvåspråkigt verk år översättningsspråk klassificeras verket enligt översättningsspråket Om texterna i ett tvåspråkigt eller flerspråkigt verk inte är översättningar av varandra klassificeras verket enligt publikationens huvudspråk Om verket inte har något huvudspråk klassificeras det enligt det första språket i publikationen Fiktiva videoinspelningar och filminspelningar förs till de skönlitteraära klasserna; spelfiler förs till klasserna för romaner, inspelningar av teaterföreställningar förs till klasserna för drama, sagofilmer förs till klasserna för sagor och tecknade filmer, dockfilmer samt animationsfilmer förs till klasserna för tecknade serier Textade videoinspelningar och filminspelningar klassificeras enligt textningens språk Filmmanus förs till klassen för filmens historia 777.9+ Ljudupptagningar med skönlitteratur förs till de skönlitterära klasserna; hörspel förs till klasserna för drama och inläst litteratur klassificeras enligt litterärt temaområde eller genre Hit skönlitterära samlade verk, verk i urval, antologier, textböcker, läseböcker, program och ABC-böcker med blandat innehåll, Om någon skönlitterär genre dominerar i verket ges företräde åt klassen för den litterära genren i fråga @sv

ESPANJANKIELINEN KAUNOKIRJALLISUUS (Kaunoluokka)
type: Class
type: Concept
type: FormClass
subclass of: Kaunoluokat
broader: Kaunoluokat
in scheme: URN:NBN:fi:au:hklj:
narrower: Espanjankieliset kansanrunot (Kaunoluokka)
narrower: Espanjankieliset runot (Kaunoluokka)
narrower: Espanjankieliset näytelmät ja kuunnelmat (Kaunoluokka)
narrower: Espanjankieliset romaanit, novellit ja näytelmäelokuvat (Kaunoluokka)
narrower: Espanjankieliset sadut (Kaunoluokka)
narrower: Portugalinkielinen kaunokirjallisuus (Kaunoluokka)
narrower: Muiden romaanisten kielten kaunokirjallisuus (Kaunoluokka)
notation: 7
preferred label: SPANISH FICTION (Fiction class) @en
preferred label: SPANSK SKÖNLITTERATUR (Skönklass) @sv
scope note: Kaunokirjallisuuden luokissa teokset ovat julkaisun kielen, eivät julkaisumaan tai alkuteoksen kielen mukaisessa luokassa Jos kaksikielisen teoksen toinen kieli on käännöskieli, on teos käännöskielen mukaisessa luokassa Jos kaksi- tai useampikielisen teoksen tekstit eivät ole toistensa käännöksiä, on teos julkaisun pääkielen mukaisessa luokassa Jos teoksella ei ole pääkieltä, se on julkaisun ensimmäisen kielen mukaisessa luokassa Fiktiiviset video- ja elokuvatallenteet ovat kaunokirjallisuuden luokissa, näytelmäelokuvat romaanien luokissa, näytelmäesitysten tallenteet näytelmien luokissa, satuelokuvat satujen luokissa sekä piirretyt, nukke- ja animaatioelokuvat sarjakuvien luokissa Tekstitetyt elokuva- ja videotallenteet ovat tekstityskielen mukaisessa luokassa Elokuvakäsikirjoitukset ovat elokuvan historian luokassa 777.9+ Kaunokirjalliset äänitteet ovat kaunokirjallisuuden luokissa, kuunnelmat näytelmien luokissa ja ääneen luettu kirjallisuus ko. kirjallisuudenlajin luokissa Tässä kaunokirjalliset sekasisältöiset kokoelmat, valikoimat, antologiat, lukemistot, lukukirjat, ohjelmistot ja aapiset Jos teos painottuu johonkin kaunokirjallisuuden lajiin, on etusija kirjallisuuden lajin mukaisella luok
scope note: I klasserna för skönlitteraturen klassificeras verken enligt publikationens språk, inte enligt klassen för utgivningslandets eller originaltitelns språk Om det ena språket i ett tvåspråkigt verk år översättningsspråk klassificeras verket enligt översättningsspråket Om texterna i ett tvåspråkigt eller flerspråkigt verk inte är översättningar av varandra klassificeras verket enligt publikationens huvudspråk Om verket inte har något huvudspråk klassificeras det enligt det första språket i publikationen Fiktiva videoinspelningar och filminspelningar förs till de skönlitteraära klasserna; spelfiler förs till klasserna för romaner, inspelningar av teaterföreställningar förs till klasserna för drama, sagofilmer förs till klasserna för sagor och tecknade filmer, dockfilmer samt animationsfilmer förs till klasserna för tecknade serier Textade videoinspelningar och filminspelningar klassificeras enligt textningens språk Filmmanus förs till klassen för filmens historia 777.9+ Ljudupptagningar med skönlitteratur förs till de skönlitterära klasserna; hörspel förs till klasserna för drama och inläst litteratur klassificeras enligt litterärt temaområde eller genre Hit skönlitterära samlade verk, verk i urval, antologier, textböcker, läseböcker, program och ABC-böcker med blandat innehåll, Om någon skönlitterär genre dominerar i verket ges företräde åt klassen för den litterära genren i fråga @sv

VENÄJÄNKIELINEN KAUNOKIRJALLISUUS (Kaunoluokka)
type: Class
type: Concept
type: FormClass
subclass of: Kaunoluokat
broader: Kaunoluokat
in scheme: URN:NBN:fi:au:hklj:
narrower: Venäjänkieliset kansanrunot (Kaunoluokka)
narrower: Venäjänkieliset runot (Kaunoluokka)
narrower: Venäjänkieliset näytelmät ja kuunnelmat (Kaunoluokka)
narrower: Venäjänkieliset romaanit, novellit ja näytelmäelokuvat (Kaunoluokka)
narrower: Venäjänkieliset sadut (Kaunoluokka)
narrower: Puolankielinen kaunokirjallisuus (Kaunoluokka)
narrower: Muiden slaavilaisten kielten kaunokirjallisuus (Kaunoluokka)
notation: 8
preferred label: RUSSIAN FICTION (Fiction class) @en
preferred label: RYSK SKÖNLITTERATUR (Skönklass) @sv
scope note: Kaunokirjallisuuden luokissa teokset ovat julkaisun kielen, eivät julkaisumaan tai alkuteoksen kielen mukaisessa luokassa Jos kaksikielisen teoksen toinen kieli on käännöskieli, on teos käännöskielen mukaisessa luokassa Jos kaksi- tai useampikielisen teoksen tekstit eivät ole toistensa käännöksiä, on teos julkaisun pääkielen mukaisessa luokassa Jos teoksella ei ole pääkieltä, se on julkaisun ensimmäisen kielen mukaisessa luokassa Fiktiiviset video- ja elokuvatallenteet ovat kaunokirjallisuuden luokissa, näytelmäelokuvat romaanien luokissa, näytelmäesitysten tallenteet näytelmien luokissa, satuelokuvat satujen luokissa sekä piirretyt, nukke- ja animaatioelokuvat sarjakuvien luokissa Tekstitetyt elokuva- ja videotallenteet ovat tekstityskielen mukaisessa luokassa Elokuvakäsikirjoitukset ovat elokuvan historian luokassa 777.9+ Kaunokirjalliset äänitteet ovat kaunokirjallisuuden luokissa, kuunnelmat näytelmien luokissa ja ääneen luettu kirjallisuus ko. kirjallisuudenlajin luokissa Tässä kaunokirjalliset sekasisältöiset kokoelmat, valikoimat, antologiat, lukemistot, lukukirjat, ohjelmistot ja aapiset Jos teos painottuu johonkin kaunokirjallisuuden lajiin, on etusija kirjallisuuden lajin mukaisella luokalla
scope note: I klasserna för skönlitteraturen klassificeras verken enligt publikationens språk, inte enligt klassen för utgivningslandets eller originaltitelns språk Om det ena språket i ett tvåspråkigt verk år översättningsspråk klassificeras verket enligt översättningsspråket Om texterna i ett tvåspråkigt eller flerspråkigt verk inte är översättningar av varandra klassificeras verket enligt publikationens huvudspråk Om verket inte har något huvudspråk klassificeras det enligt det första språket i publikationen Fiktiva videoinspelningar och filminspelningar förs till de skönlitteraära klasserna; spelfiler förs till klasserna för romaner, inspelningar av teaterföreställningar förs till klasserna för drama, sagofilmer förs till klasserna för sagor och tecknade filmer, dockfilmer samt animationsfilmer förs till klasserna för tecknade serier Textade videoinspelningar och filminspelningar klassificeras enligt textningens språk Filmmanus förs till klassen för filmens historia 777.9+ Ljudupptagningar med skönlitteratur förs till de skönlitterära klasserna; hörspel förs till klasserna för drama och inläst litteratur klassificeras enligt litterärt temaområde eller genre Hit skönlitterära samlade verk, verk i urval, antologier, textböcker, läseböcker, program och ABC-böcker med blandat innehåll, Om någon skönlitterär genre dominerar i verket ges företräde åt klassen för den litterära genren i fråga @sv

Kirjapainotaito. Graafinen teollisuus
type: Class
type: Concept
subclass of: KIRJA-ALA
alternative label: Alkukirjaimet, kirjasintyypit (005)
alternative label: Anfangit, kirjasintyypit (005)
alternative label: Digitaalinen painaminen (005)
alternative label: Digitaalinen painatus (005)
alternative label: Digitaalinen painotekniikka (005)
alternative label: Editointi, taitto (005)
alternative label: Elämysteollisuus, kirjankustannusala (005)
alternative label: Fontit (005)
alternative label: Graafinen ala (005)
alternative label: Graafinen suunnittelu, taitto (005)
alternative label: Graafinen teollisuus (005)
alternative label: Graafinen viestintä (005)
alternative label: Graafinen viestintä, graafinen ala (005)
alternative label: Graafiset menetelmät, kirjapaino (005)
alternative label: Grafiikka, graafinen ala (005)
alternative label: Heliografia, kirjapaino (005)
alternative label: Initiaalit, kirjasintyylit (005)
alternative label: Jäljennemenetelmät (005)
alternative label: Jäljennetekniikka (005)
alternative label: Kaanonit, kirjasinlajit (005)
alternative label: Kemigrafia (005)
alternative label: Kirjaimet, kirjapainotekniikka (005)
alternative label: Kirjaimistot, kirjapainotekniikka (005)
alternative label: Kirjainlajit (005)
alternative label: Kirjaintyylit (005)
alternative label: Kirjanpainajat, kirjanpainajan työ (005)
alternative label: Kirjapainoala (005)
alternative label: Kirjapainot (005)
alternative label: Kirjapainotaito (005)
alternative label: Kirjapainotekniikka (005)
alternative label: Kirjasimet (005)
alternative label: Kirjasinlajit (005)
alternative label: Kirjasintyylit (005)
alternative label: Kivipaino, kirjapainotekniikka (005)
alternative label: Kohopaino (005)
alternative label: Kopiointi, graafinen teollisuus (005)
alternative label: Kopistit, kirjapainoala (005)
alternative label: Laakapaino (005)
alternative label: Ladonta (005)
alternative label: Latomot (005)
alternative label: Layout, graafinen teollisuus (005)
alternative label: Layout, kirjapainotekniikka (005)
alternative label: Lehtikustantamot (005)
alternative label: Litografia, kirjapainotekniikka (005)
alternative label: Monistus (005)
alternative label: Offsetpaino (005)
alternative label: On-demand -painatus (005)
alternative label: Painantamenetelmät (005)
alternative label: Painatteet, kirjapainotekniikka (005)
alternative label: Painetut julkaisut, kirjapainotekniikka (005)
alternative label: Painokoneet (005)
alternative label: Painomenetelmät (005)
alternative label: Painomusteet, kirjapainotekniikka (005)
alternative label: Painopaperi, kirjapainotekniikka (005)
alternative label: Painotekniikka (005)
alternative label: Painotuotteet, kirjapainotekniikka (005)
alternative label: Painoviestintä (005)
broader: KIRJA-ALA
in scheme: URN:NBN:fi:au:hklj:
notation: 005
related: Kirjoitus. Kirjoitustaito
related: Konekirjoitus
related: Kirjan historia
related: Kustannustoimi. Kirjakauppa
related: URN:NBN:fi:au:hklj:005.09
related: Kirjansidonta. Kirjansidontataide
related: Tekstinkäsittelyohjelmat
related: Kuvankäsittelyohjelmat. Grafiikkaohjelmat. Taitto-ohjelmat
related: URN:NBN:fi:au:hklj:748
related: GRAAFINEN TAIDE. VALOKUVAUS
related: Kuvitustaide
related: Käyttögrafiikka
related: Taidegrafiikan materiaalit ja tekniikka
related: Konsertit. Musiikkijuhlat. Musiikkikilpailut. Nuottien ja äänitteiden kustantaminen
related: URN:NBN:fi:au:hklj:800
scope note: Kirjapainotekniikka. Jäljennetekniikka. Monistustekniikka Tekstinvalmistus. Ladonta. Kirjasimet Taitto. Typografia. Painaminen. Jälkikäsittely Atk-, datansiirto-, tekstinkäsittely- ja lasertekniikan käyttö kirjapaino- ja jäljennetekniikassa Kirjojen, lehtien, karttojen, nuottien, mainosten, julisteiden, pakkausten ja lomakkeiden painatus
scope note: Boktryckeriteknik. Kopieringsteknik. Dupliceringsteknik Textproduktion. Sättning. Trycktyper Ombrytning. Typografi. Tryckning. Efterbehandling Datateknik, dataöverföring, textbehandling och laserteknik i trycksaksproduktion och koperingsteknik. Tryckning av böcker, tidningar, kartor, noter, reklam, affischer, förpackningar och blanketter @sv

Kirjastojen hallinto ja suunnittelu
type: Class
type: Concept
subclass of: KIRJASTOT. KIRJASTOTOIMI
alternative label: Keskuskirjasto-maakuntakirjastojärjestelmä (021)
alternative label: Keskuskirjastojärjestelmä, tieteelliset kirjastot (021)
alternative label: Keskuskirjastojärjestelmä, yleiset kirjastot (021)
alternative label: Kirjastoasetukset (021)
alternative label: Kirjastohallinto (021)
alternative label: Kirjastokorvaukset, kirjastotoimi (021)
alternative label: Kirjastolainsäädäntö (021)
alternative label: Kirjastolautakunnat (021)
alternative label: Kirjastorakennukset, kirjastosuunnittelu (021 +)
alternative label: Kirjastorationalisointi (021 +)
alternative label: Kirjastosuunnittelu (021 +)
alternative label: Kirjastotekniikka (021 +)
alternative label: Kirjastoverkot (021)
alternative label: Kirjastoyhteistyö (021 +)
alternative label: Maakuntakirjastojärjestelmä (021)
alternative label: Tilat, kirjastojen tilat (021)
alternative label: Biblioteksadministration (021) @sv
alternative label: Biblioteksbyggnader, biblioteksplanering (021 +) @sv
alternative label: Biblioteksersättningar, biblioteksverksamhet (021) @sv
alternative label: Biblioteksförordningar (021) @sv
alternative label: Bibliotekslagstiftning (021) @sv
alternative label: Biblioteksnämnder (021) @sv
alternative label: Biblioteksnätverk (021) @sv
alternative label: Biblioteksplanering (021 +) @sv
alternative label: Biblioteksrationalisering (021 +) @sv
alternative label: Bibliotekssamarbete (021 +) @sv
alternative label: Biblioteksteknik (021 +) @sv
alternative label: Centralbibliotek-landskapsbibliotekssystem (021) @sv
alternative label: Centralbibliotekssystem, allmänna bibliotek (021) @sv
alternative label: Centralbibliotekssystem, vetenskapliga bibliotek (021) @sv
alternative label: Landskapsbibliotekssystem (021) @sv
alternative label: Lokaler, tilat, bibliotekslokaler (021) @sv
broader: KIRJASTOT. KIRJASTOTOIMI
in scheme: URN:NBN:fi:au:hklj:
narrower: Kirjastoautomaatio
notation: 021
preferred label: Library administration and library planning @en
preferred label: Biblioteksadministration och biblioteksplanering @sv
related: URN:NBN:fi:au:hklj:018
related: Yleiset kirjastot
related: Erikoiskirjastot. Yhdistysten, laitosten ja yritysten kirjastot
related: URN:NBN:fi:au:hklj:028
related: Dokumentaatio ja informaatiopalvelu yleensä
related: Museonhoito
related: Arkistonhoito
related: URN:NBN:fi:au:hklj:061
related: URN:NBN:fi:au:hklj:063
related: URN:NBN:fi:au:hklj:330
related: URN:NBN:fi:au:hklj:340
related: URN:NBN:fi:au:hklj:345
related: Kulttuurirakennukset
scope note: Kirjastohallinnon ja -suunnittelun yleisteokset Yleisten, tieteellisten, yksityisten ja erikoiskirjastojen yleinen ja sisäinen hallinto ja suunnittelu Kirjastojen välinen yhteistyö. Kirjastoverkot Keskuskirjasto-maakuntakirjastojärjestelmä Hallinto-osastot. Hallinnon atk-järjestelmät Talous. KTS- ja PTS-suunnitelmat Kirjastorationalisointi yleensä Henkilöstöhallinto ja -politiikka Kirjastolait ja -asetukset. Kirjastolautakunnat Tiettyä kirjaston erikoisalan toimintaa koskeva hallinto, suunnittelu ja rationalisointi alan mukaan luokissa 021.1-025
scope note: Allmänna verk som rör biblioteksadministration och -planering Allmän och intern administration och planering av allmänna, vetenskapliga och privata bibliotek samt specialbibliotek Bibliotekssamarbete. Biblioteksnätverk Centralbibliotek och landskapsbibliotek Administrativa avdelningar. Administrationens datasystem Ekonomi. Planer på medellång och lång sikt Biblioteksrationalisering i allmänhet Personaladministration och personalpolitik Bibliotekslagar och biblioteksförordningar. Biblioteksnämnder Administration, planering och rationalisering som rör bibliotekets verksamhet inom något specialområde förs efter område till klasserna 021.1-025 @sv

Havaintopsykologia
type: Class
type: Concept
subclass of: Psyyken rakenne ja toiminnot
alternative label: 3-ulotteisuus, havaitseminen (121.5)
alternative label: Aika, psykologia (121.5)
alternative label: Aikaerot, psykologia (121.5)
alternative label: Aistiharhat, havaintopsykologia (121.5)
alternative label: Aistihavainnot, havaintopsykologia (121.5)
alternative label: Aistimukset, havaintopsykologia (121.5)
alternative label: Aistinanalogia, psykologia (121.5)
alternative label: Aistit, havaintopsykologia (121.5)
alternative label: Apperseptio (121.5)
alternative label: Autenttisuus, havaintopsykologia (121.5)
alternative label: Avaruudellinen hahmottaminen (121.5)
alternative label: Avaruudellinen hahmotus (121.5)
alternative label: Eideettiset ilmiöt (121.5)
alternative label: Gestalt-psykologia (121.5)
alternative label: Hahmopsykologia (121.5)
alternative label: Haju, psykologia (121.5)
alternative label: Hajuaisti, psykologia (121.5)
alternative label: Hallusinaatiot, havaintopsykologia (121.5)
alternative label: Harha-aistimukset, havaintopsykologia (121.5)
alternative label: Havainnot, havaintopsykologia (121.5)
alternative label: Havaintopsykologia (121.5)
alternative label: Havaitseminen (121.5)
alternative label: Illuusiot, havaintopsykologia (121.5)
alternative label: Kangastukset, havaintopsykologia (121.5)
alternative label: Katse, havaintopsykologia (121.5)
alternative label: Kolmiulotteinen hahmottaminen (121.5)
alternative label: Kolmiulotteisuus, havaitseminen (121.5)
alternative label: Kuulo, havaintopsykologia (121.5)
alternative label: Moniaistisuus, havaintopsykologia (121.5)
alternative label: Näkö, havaintopsykologia (121.5)
alternative label: Näköhavainnot, havaintopsykologia (121.5)
alternative label: Näyt, havaintopsykologia (121.5)
alternative label: Primaarihavaitseminen (121.5)
alternative label: Psykofysiikka, havaintopsykologia (121.5)
alternative label: Psykofysiologia, havaintopsykologia (121.5)
alternative label: Spatiaalinen hahmottaminen (121.5)
alternative label: Spatiaalinen havaitseminen (121.5)
alternative label: Stereonäkö, havaintopsykologia (121.5)
alternative label: Stereoskopia, havaintopsykologia (121.5)
alternative label: Synestesia, psykologia (121.5)
alternative label: Syvyysnäkö, havaintopsykologia (121.5)
alternative label: Tilan hahmottaminen (121.5)
alternative label: Todellisuus, havaintopsykologia (121.5)
alternative label: Tuoksu, psykologia (121.5)
alternative label: Värioppi, havaintopsykologia (121.5)
alternative label: Väripsykologia, havaintopsykologia (121.5)
alternative label: Värit, havaintopsykologia (121.5)
alternative label: Ärsykkeet, havaintopsykologia (121.5)
alternative label: 3-dimensionalitet, perception (121.5) @sv
alternative label: Apperception (121.5) @sv
alternative label: Autenticitet, perceptionspsykologi (121.5) @sv
alternative label: Blick, perceptionspsykologi (121.5) @sv
alternative label: Djupseende, perceptionspsykologi (121.5) @sv
alternative label: Doft, psykologi (121.5) @sv
alternative label: Eidetiska fenomen (121.5) @sv
alternative label: Färger, perceptionspsykologi (121.5) @sv
alternative label: Färglära, perceptionspsykologi (121.5) @sv
broader: Psyyken rakenne ja toiminnot
in scheme: URN:NBN:fi:au:hklj:
notation: 121.5
related: Oppimisen psykologia
related: Psykologian suunnat
related: Lapsuuden ja nuoruuden psykologia
related: Muita psykologian aloja
related: Kehityspsykologia. Eri ikäkausien psykologia
related: Parapsykologia
related: Anatomia
related: URN:NBN:fi:au:hklj:612
related: URN:NBN:fi:au:hklj:617.2
related: Korva. Nenäontelo. Kurkku. Korva-, nenä- ja kurkkutaudit
related: Silmä. Silmätaudit
related: Psyykkiset sairaudet. Mielenterveyden häiriöt
related: Skitsofrenia. Jakomielitauti
related: Kaksisuuntainen mielialahäiriö
related: Neuroosit
scope note: Havainnot ja aistimukset psykologian kannalta Primaarihavaitseminen. Havaitsemaan oppiminen Havaintojen jäsentäminen ja tiedostaminen Havaintokynnys. Havaintovirheet ja -harhat. Optiset harhat. Illuusiot. Hallusinaatiot. Eideettiset ilmiöt Ympäristön, kokemusten ja oppimisen vaikutukset havaintoihin Tässä myös hahmopsykologia
scope note: Varseblivning och sinnesförnimmelser ur psykologisk synvinkel Primär varseblivning. Perceptionsinlärning Perceptionsgestaltning och medvetenhet om perceptioner Perceptionströskel. Perceptionsfel. Optiska villor. Illusioner. Hallucinationer. Eidetiska fenomen Miljöns, erfarenhetens och inlärningens inverkan på varseblivningen Hit också gestaltpsykologi @sv

Differentiaalipsykologia. Persoonallisuuden psykologia
type: Class
type: Concept
subclass of: URN:NBN:fi:au:hklj:120
alternative label: Absoluuttinen sävelkorva, lahjakkuuden psykologia (126 +)
alternative label: Affektiivisuuus, persoonallisuuden psykologia (126 +)
alternative label: Aggressiivisuus, persoonallisuuspsykologia (126 +)
alternative label: Ahneus, persoonallisuuspsykologia (126 +)
alternative label: Aktiivisuus, persoonallisuuspsykologia (126 +)
alternative label: Anteliaisuus, persoonallisuuspsykologia (126 +)
alternative label: Arkuus, persoonallisuuspsykologia (126 +)
alternative label: Arroganssi, persoonallisuuspsykologia (126 +)
alternative label: Asosiaalisuus, persoonallisuuspsykologia (126 +)
alternative label: Assosiaatio, luovuuden psykologia (126 +)
alternative label: Autoritaarisuus, persoonallisuuspsykologia (126 +)
alternative label: Differentiaalipsykologia (126 +)
alternative label: Dogmaattisuus, persoonallisuuspsykologia (126 +)
alternative label: Ego, persoonallisuuspsykologia (126)
alternative label: Eksistentiaalipsykologia (126)
alternative label: Ekstroversio, persoonallisuuspsykologia (126 +)
alternative label: Enneagrammi, persoonallisuuspsykologia (126)
alternative label: Epäsosiaalisuus, persoonallisuuspsykologia (126 +)
alternative label: Epävarmuus, persoonallisuuspsykologia (126 +)
alternative label: Fanaattisuus, persoonallisuuden psykologia (126 +)
alternative label: Fanatismi, persoonallisuuden psykologia (126 +)
alternative label: Haavoittuvuus (126)
alternative label: Hajamielisyys (126 +)
alternative label: Henkisyys, persoonallisuuden psykologia (126 +)
alternative label: Herkkyys, persoonallisuuden psykologia (126 +)
alternative label: Herkkätunteisuus, persoonallisuuden psykologia (126 +)
alternative label: Homoseksuaalisuus, seksuaalipsykologia (126)
alternative label: Humanistinen psykologia (126)
alternative label: Huolellisuus, persoonallisuuspsykologia (126 +)
alternative label: Huolestuneisuus, persoonallisuuden psykologia (126 +)
alternative label: Huomiohakuinen persoonallisuus, persoonallisuuden psykologia (126 +)
alternative label: Huumorintaju (126 +)
alternative label: Hyvyys, persoonallisuuspsykologia (126 +)
alternative label: Hyvä ja paha, persoonallisuuspsykologia (126 +)
alternative label: Identiteetti, persoonallisuuspsykologia (126 +)
alternative label: Identtiset kaksoset, persoonallisuuspsykologia (126 +)
alternative label: Ihmistuntemus, persoonallisuuspsykologia (126 +)
alternative label: Impulsiivisuus, persoonallisuuspsykologia (126 +)
alternative label: Individuaalipsykologia (126 +)
alternative label: Innovatiivisuus, psykologia (126 +)
alternative label: Inspiraatio, luovuuden psykologia (126)
alternative label: Introversio, persoonallisuuspsykologia (126 +)
alternative label: Itsehallinta, persoonallisuuspsykologia (126 +)
alternative label: Itseluottamus, persoonallisuuspsykologia (126 +)
alternative label: Itsemäärääminen, persoonallisuuspsykologia (126 +)
alternative label: Itsenäinen selviytyminen (126 +)
alternative label: Itsetunto, persoonallisuuspsykologia (126 +)
alternative label: Julkeus, persoonallisuuspsykologia (126 +)
alternative label: Kaksoset, persoonallisuuspsykologia (126 +)
alternative label: Karismaattisuus, persoonallisuuspsykologia (126 +)
alternative label: Keho, ruumiinkuva (126)
alternative label: Kehonkaava, persoonallisuuspsykologia (126 +)
alternative label: Kielellinen lahjakkuus, lahjakkuuden psykologia (126)
alternative label: Kiinnostus, persoonallisuuden psykologia (126 +)
alternative label: Kiltteys, persoonallisuuspsykologia (126 +)
alternative label: Kuuliaisuus, persoonallisuuspsykologia (126 +)
alternative label: Kyvykkyys, luovuus ja lahjakkuus (126)
alternative label: Käytännöllinen lahjakkuus, lahjakkuuden psykologia (126)
alternative label: Lahjakkuus, psykologia (126 +)
broader: URN:NBN:fi:au:hklj:120
in scheme: URN:NBN:fi:au:hklj:
narrower: Psychology of expression {@en
notation: 126
related: Ajattelu. Älykkyys. Mielikuvitus
related: Kokeellinen psykologia. Psykometriikka
related: Psykologian suunnat
related: Perinnöllisyyspsykologia
related: Typologia. Karakterologia
related: Lapsuuden ja nuoruuden psykologia
related: Muita psykologian aloja
related: Ihmissuhteiden psykologia
related: Kehityspsykologia. Eri ikäkausien psykologia
related: Naisen ja miehen psykologia
related: Seksologia
related: Taiteen estetiikka. Taidefilosofia. Taidepsykologia. Taidesosiologia. Taidepolitiikka
scope note: Persoonallisuusteoriat. Yksilöpsykologia Persoonallisuuden rakenne. Minäkuva. Ruumiinkuva. Itsetunto Ympäristön ja perintötekijöiden vaikutus persoonallisuuteen Luovuuden ja lahjakkuuden psykologia Persoonallisuuteen, luovuuteen tai lahjakkuuteen liittyvä kokeellinen tutkimus Persoonallisuus-, luovuus- ja lahjakkuustestit Tässä myös teokset, joissa on sekä ajattelun tai älykkyyden että luovuuden tai lahjakkuuden psykologiaa
scope note: Personlighetsteorier. Individualpsykologi Personlighetens struktur. Jagföreställning. Kroppsföreställning. Självkänsla Hur arv och miljö påverkar personligheten Kreativitetspsykologi och begåvningens psykologi Experimentella undersökningar som rör personlighet, kreativitet eller begåvning Personlighets-, kreativitets- och begåvningstest Hit också verk som rör såväl tänkandets eller intelligensens psykologi som kreativitetspsykologi eller begåvningens psykologi @sv

Psychology of expression {@en
type: Class
type: Concept
subclass of: Differentiaalipsykologia. Persoonallisuuden psykologia
alternative label: Asennot, ilmaisupsykologia (126.1)
alternative label: Ei-verbaalinen viestintä, ilmaisupsykologia (126.1)
alternative label: Eleet, psykologia (126.1)
alternative label: Elekieli (126.1)
alternative label: Elekieli, ilmaisupsykologia (126.1)
alternative label: Fysiognomia (126.1)
alternative label: Fysionomia (126.1)
alternative label: Gestiikka (126.1)
alternative label: Gestiikka, ilmaisupsykologia (126.1)
alternative label: Grafologia (126.1)
alternative label: Hymy, ilmeet, psykologia (126.1)
alternative label: Ilmaisu, psykologia (126.1)
alternative label: Ilmaisupsykologia (126.1)
alternative label: Ilmaukset, ilmaisupsykologia (126.1)
alternative label: Ilmeet, psykologia (126.1)
alternative label: Itku, ilmaisupsykologia (126.1)
alternative label: Kasvot, psykologia (126.1)
alternative label: Keho, kehonkieli (126.1)
alternative label: Kehonkieli (126.1)
alternative label: Kehonkieli, ilmaisupsykologia (126.1)
alternative label: Kosketus, ilmaisupsykologia (126.1)
alternative label: Käsialantutkimus, grafologia (126.1)
alternative label: Mimiikka, ilmaisupsykologia (126.1)
alternative label: Nauru, ilmaisupsykologia (126.1)
alternative label: Nimikirjoitukset, grafologia (126.1)
alternative label: Pantomimiikka, ilmaisupsykologia (126.1)
alternative label: Persoonallisuuden piirteet, grafologia (126.1)
alternative label: Ruumiillisuus, ilmaisupsykologia (126.1)
alternative label: Ruumiinkieli (126.1)
alternative label: Ruumiinkieli, ilmaisupsykologia (126.1)
alternative label: Ryhmäviestintä, sanaton viestintä (126.1)
alternative label: Sanaton viestintä (126.1)
alternative label: Signeeraus, grafologia (126.1)
alternative label: Vartalo, kehon kieli (126.1)
alternative label: Viestintä, ei-sanallinen viestintä (126.1)
alternative label: Viestintäpsykologia, ilmaisupsykologia (126.1)
alternative label: Viestintästrategiat, ei-sanallinen viestintä (126.1)
alternative label: Väärinkäsitykset, kommunikaatiopsykologia (126.1)
alternative label: Äänenpainot, ilmaisupsykologia (126.1)
alternative label: Ansiktet, psykologi (126.1) @sv
alternative label: Autografer, grafologi (126.1) @sv
alternative label: Beröring, uttryckspsykologi (126.1) @sv
alternative label: Figuren, kroppsspråk (126.1) @sv
alternative label: Fysiognomi (126.1) @sv
alternative label: Fysionomi (126.1) @sv
alternative label: Gester, psykologi (126.1) @sv
alternative label: Gestik (126.1) @sv
alternative label: Gestik, uttryckspsykologi (126.1) @sv
alternative label: Grafologi (126.1) @sv
alternative label: Gruppkommunikation, nonverbal kommunikation (126.1) @sv
alternative label: Gråt, uttryckspsykologi (126.1) @sv
alternative label: Handstilsforskning, grafologi (126.1) @sv
alternative label: Icke-verbal kommunikation, uttryckspsykologi (126.1) @sv
alternative label: Kommunikation, icke-verbal kommunikation (126.1) @sv
alternative label: Kommunikationspsykologi, uttryckspsykologi (126.1) @sv
alternative label: Kommunikationsstrategier, icke-verbal kommunikation (126.1) @sv
alternative label: Kroppen, keho, kroppsspråket (126.1) @sv
broader: Differentiaalipsykologia. Persoonallisuuden psykologia
in scheme: URN:NBN:fi:au:hklj:
notation: 126.1
preferred label: Ilmaisupsykologia
related: Kirjoitus. Kirjoitustaito
related: Kirjoituksen historia. Paleografia. Epigrafia
related: Oppimisen psykologia
related: Kokeellinen psykologia. Psykometriikka
related: Psykologian suunnat
related: Typologia. Karakterologia
related: Lapsuuden ja nuoruuden psykologia
related: Muita psykologian aloja
related: Ihmissuhteiden psykologia
related: Kehityspsykologia. Eri ikäkausien psykologia
related: Naisen ja miehen psykologia
related: Käytös- ja tapatieto
related: Taiteen estetiikka. Taidefilosofia. Taidepsykologia. Taidesosiologia. Taidepolitiikka
related: Kielipsykologia. Kielisosiologia. Kielipolitiikka
scope note: Ei-verbaalinen ilmaisu- ja kommunikaatiopsykologia Eleet, ilmeet, asennot, mimiikka, pantomimiikka ja fysiognomiikka psykologian kannalta Grafologia. Käsialojen psykologinen tutkimus
scope note: Den icke-verbala kommunikationens psykologi Gester, uttryck, kroppsspråk, mimik, pantomimik och fysiognomik ur psykologisk synvinkel Grafologi. Psykologisk handstilsforskning @sv

Kristillinen etiikka
type: Class
type: Concept
subclass of: KÄYTÄNNÖLLINEN TEOLOGIA
alternative label: 10 käskyä (241)
alternative label: Almut, kristillinen etiikka (241)
alternative label: Altruismi, kristillinen etiikka (241)
alternative label: Arvot, kristilliset (241)
alternative label: Arvottaminen, kristilliset arvot (241)
alternative label: Avioero, kristillinen etiikka (241)
alternative label: Avioliitto, kristillinen etiikka (241)
alternative label: Avioliitto, neuvonta, kristillinen (241)
alternative label: Avioliittoneuvonta, kristillinen (241)
alternative label: Avioparit, kristillinen etiikka (241)
alternative label: Aviopuolisot, kristillinen etiikka (241)
alternative label: Aviorikokset, kristillinen etiikka (241)
alternative label: Avoero, kristillinen etiikka (241)
alternative label: Avoliitto, kristillinen etiikka (241)
alternative label: Avoliitto, neuvonta, kristillinen (241)
alternative label: Avoparit, kristillinen etiikka (241)
alternative label: Avopuolisot, kristillinen etiikka (241)
alternative label: Dekalogi (241)
alternative label: Eettinen kasvatus, kristillinen etiikka (241)
alternative label: Eettinen kehitys, kristillinen etiikka (241)
alternative label: Eettiset arvot ja normit, kristillinen etiikka (241)
alternative label: Epäitsekkyys, kristillinen etiikka (241)
alternative label: Epäoikeudenmukaisuus, kristillinen etiikka (241)
alternative label: Epärehellisyys, kristillinen etiikka (241)
alternative label: Esimerkillisyys, kristillinen etiikka (241)
alternative label: Etiikka, kristillinen (241)
alternative label: Geenimuuntelu, kristillinen etiikka (241)
alternative label: Geenitekniikka, kristillinen etiikka (241)
alternative label: Geeniteknologia, kristillinen etiikka (241)
alternative label: Henkinen kasvu, kristillinen etiikka (241)
alternative label: Humaanisuus, kristillinen etiikka (241)
alternative label: Hyveet, kristillinen etiikka (241)
alternative label: Hyvyys, kristillinen etiikka (241)
alternative label: Hyvä ja paha, kristillinen etiikka (241)
alternative label: Hyvä, kristillinen etiikka (241)
alternative label: Ihmisarvo, kristillinen etiikka (241)
alternative label: Ihmisyys, kristillinen etiikka (241)
alternative label: Inhimillisyys, kristillinen etiikka (241)
alternative label: Kaveruus, kristillinen etiikka (241)
alternative label: Kihlaus, kristillinen etiikka (241)
alternative label: Kiitollisuus, kristillinen etiikka (241)
alternative label: Kristillinen etiikka (241)
alternative label: Kristillinen kirjallisuus, kristillinen etiikka (241)
alternative label: Kristillisyys, kristillinen etiikka (241)
alternative label: Kristinusko, etiikka (241)
alternative label: Kristinusko, moraali (241)
alternative label: Kristityn kasvu, kristillinen etiikka (241)
alternative label: Kymmenen käskyä (241)
alternative label: Käskyt, kristinusko (241)
alternative label: Lainvastaisuus, kristillinen etiikka (241)
alternative label: Mielekkyys, kristillinen etiikka (241)
alternative label: Mielihyvä, kristillinen etiikka (241)
alternative label: Moraali, kristillinen (241)
alternative label: Moraalikasvatus, kristillinen etiikka (241)
alternative label: Moraalikehitys, kristillinen moraali (241)
alternative label: Moraaliteologia (241)
alternative label: Moralismi, kristillinen (241)
broader: KÄYTÄNNÖLLINEN TEOLOGIA
in scheme: URN:NBN:fi:au:hklj:
notation: 241
related: Sosiaalipsykologia. Kulttuuripsykologia
related: Etiikka. Moraalifilosofia
related: Kasvatusneuvonta. Kasvatusneuvolat
related: Perhe- ja kotikasvatus
related: Uskonnonfilosofia
related: KRISTILLINEN DOGMATIIKKA
related: Jumalan olemus
related: Pelastusoppi. Kristillinen antropologia
related: Sielunhoito
related: Seurakunta. Seurakuntatyö
related: Perhepolitiikka. Lapsipolitiikka. Nuorisopolitiikka
related: Lääketieteen filosofia ja etiikka
related: Seksologia
related: Itsemurhat ja niiden ehkäisy
related: URN:NBN:fi:au:hklj:618.85
scope note: Kristillinen yksilö-, sosiaali- ja seksuaalietiikka Kristilliset arvot. Kristillinen moraali ja omatunto Hyvä ja paha kristillisen etiikan kannalta Jumalan laki. Kymmenen käskyä Kristinuskon suhde yhteiskunnalliseen ja poliittiseen elämään Kirkon perheneuvontatyö
scope note: Kristen individual-, social- och sexualetik Kristna värden. Kristen moral och rättskänsla Det goda och det onda ur den kristna etikens synvinkel Guds lag. De tio budorden Kristendomens förhållande till socialt och politiskt liv Kyrkans familjerådgivning @sv

Virsikirjat ja hengelliset laulukirjat
type: Class
type: Concept
subclass of: KÄYTÄNNÖLLINEN TEOLOGIA
alternative label: Hengelliset laulut, hymnologia (245)
alternative label: Hengelliset laulut, laulukirjat ilman nuotteja (245)
alternative label: Hymnologia (245)
alternative label: Kirkkorunous, hymnologia (245)
alternative label: Kirkkorunous, virret ja hengelliset laulut (245)
alternative label: Laulukirjat, virsikirjat, ilman nuotteja (245)
alternative label: Virret, ilman nuotteja (245)
alternative label: Virsikirjat, ilman nuotteja (245)
alternative label: Virsioppi (245)
alternative label: Andliga sånger, hymnologi (245) @sv
alternative label: Andliga sånger, sångböcker utan noter (245) @sv
alternative label: Hymnologi (245) @sv
alternative label: Kyrkopoesi, hymnologi (245) @sv
alternative label: Kyrkopoesi, psalmer och andliga sånger (245) @sv
alternative label: Psalmböcker, utan noter (245) @sv
alternative label: Psalmer, utan noter (245) @sv
alternative label: Sångböcker, psalmböcker, utan noter (245) @sv
broader: KÄYTÄNNÖLLINEN TEOLOGIA
in scheme: URN:NBN:fi:au:hklj:
notation: 245
preferred label: Psalm books and spiritual songs @en
preferred label: Psalmböcker och andliga sånger @sv
related: Hartauskirjat
related: Rukouskirjat
related: Henkilökohtainen hartaudenharjoitus
related: Sakramentit. Kirkolliset toimitukset
related: Saarnaoppi
related: Saarnat. Postillat. Kristilliset puhe- ja päivänavauskokoelmat
related: Kristillisten kirkkojen musiikki
related: Protestanttinen musiikki
related: Virret. Hengelliset laulut
related: URN:NBN:fi:au:hklj:787.112
related: Spirituaalit. Gospel-musiikki
related: Roomalaiskatolinen musiikki
related: Ortodoksinen musiikki
related: Muiden kristillisten kirkkojen musiikki
scope note: Virsikirjat ja hengelliset laulukirjat, joissa ei ole nuotteja Virsioppi. Hymnologia. Virsien ja hengellisten laulujen tutkimus
scope note: Psalmböcker och andliga sångböcker utan noter Psalmlära. Hymnologi. Forskning i psalmer och andliga sånger @sv

Islam ja sen mytologia
type: Class
type: Concept
subclass of: URN:NBN:fi:au:hklj:280
alternative label: Alaviitit, šiialaisuus (287)
alternative label: Avioliittoon vihkiminen, uskontotiede, eri uskonnot (282 ... 289 +)
alternative label: Dervissit (287)
alternative label: Fatwat, islam (287)
alternative label: Fundamentalismi, islamin oppi (287)
alternative label: Hadith (287)
alternative label: Halal, islam (287)
alternative label: Ikonoklasmi, islam (287)
alternative label: Imaamit, islam (287)
alternative label: Islam, uskonto (287)
alternative label: Islamilainen kirjallisuus (287)
alternative label: Islamilainen kirjallisuus, uskonto (287)
alternative label: Islamilainen laki, islaminusko (287)
alternative label: Islamin laki, islaminusko (287)
alternative label: Islamismi, islam (287)
alternative label: Itämaiset uskonnot, islam (287)
alternative label: Koraani (287)
alternative label: Kuvainraasto, islam (287)
alternative label: Maailmanuskonnot, islam (287)
alternative label: Moskeijat, islam (287)
alternative label: Muhamettilaisuus (287)
alternative label: Muslimit, islam (287)
alternative label: Poliittinen islam, islam (287)
alternative label: Pseudepigrafit, juutalaisuus (287)
alternative label: Puhdasoppisuus, islamin oppi (287)
alternative label: Saria, islaminusko (287)
alternative label: Sharia, islaminusko (287)
alternative label: Shialaisuus (287)
alternative label: Sufilaisuus (287)
alternative label: Sunnilaisuus (287)
alternative label: Suufilaisuus (287)
alternative label: Uskonnot, islam (287)
alternative label: Uskontokunnat, islam (287)
alternative label: Wahhabismi, islam (287)
alternative label: Alawiter, shia (287) @sv
alternative label: Bildstormning, islam (287) @sv
alternative label: Dervischer (287) @sv
alternative label: Fatwor, islam (287) @sv
alternative label: Fundamentalism, islams lära (287) @sv
alternative label: Ikonoklasm, islam (287) @sv
alternative label: Imamer, islam (287) @sv
alternative label: Islam, religion (287) @sv
alternative label: Islamisk lag, islam (287) @sv
alternative label: Islamisk litteratur (287) @sv
alternative label: Islamisk litteratur, religion (287) @sv
alternative label: Islamism, islam (287) @sv
alternative label: Koranen (287) @sv
alternative label: Moskéer, islam (287) @sv
alternative label: Muhammedanism (287) @sv
alternative label: Muslimer, islam (287) @sv
alternative label: Politisk islam, islam (287) @sv
alternative label: Pseudepigrafer, judendom (287) @sv
alternative label: Religioner, islam (287) @sv
alternative label: Religionssamfund, islam (287) @sv
alternative label: Renlärighet, islams lära (287) @sv
alternative label: Saria, islam (287) @sv
alternative label: Sharia, islam (287) @sv
broader: URN:NBN:fi:au:hklj:280
in scheme: URN:NBN:fi:au:hklj:
notation: 287
related: URN:NBN:fi:au:hklj:110
related: RAJATIETO
related: URN:NBN:fi:au:hklj:192
related: Kuolemakokemukset
related: Uskonnonfilosofia
related: Elämä. Kuolema
related: Luominen. Kehitys
related: URN:NBN:fi:au:hklj:209
related: URN:NBN:fi:au:hklj:210
related: Jumalan olemus
related: Enkelit. Paholaiset. Demonit
related: Kuolema ja kuolemanjälkeinen elämä
related: Lähetystyö
related: URN:NBN:fi:au:hklj:807
related: URN:NBN:fi:au:hklj:992
scope note: Tässä myös Koraani
scope note: Hit också Koranen @sv

Amerikan alkuperäiskansojen uskonnot ja mytologiat
type: Class
type: Concept
subclass of: Muut uskonnot ja mytologiat
alternative label: Amerikka, mytologiat, alkuperäiskansat (289.2)
alternative label: Amerikka, uskonnot, alkuperäiskansat (289.2)
alternative label: Asteekit, mytologiat (289.2)
alternative label: Asteekit, uskonnot (289.2)
alternative label: Atsteekit, mytologiat (289.2)
alternative label: Atsteekit, uskonnot (289.2)
alternative label: Eskimot, mytologiat (289.2)
alternative label: Eskimot, uskonnot (289.2)
alternative label: Etelä-Amerikka, mytologiat, alkuperäiskansojen (289.2)
alternative label: Etelä-Amerikka, uskonnot, alkuperäiskansat (289.2)
alternative label: Inkat, mytologiat (289.2)
alternative label: Inkat, uskonnot (289.2)
alternative label: Intiaanit, mytologiat (289.2)
alternative label: Intiaanit, uskonnot (289.2)
alternative label: Inuitit, mytologiat (289.2)
alternative label: Inuitit, uskonnot (289.2)
alternative label: Mayat, mytologiat (289.2)
alternative label: Mayat, uskonnot (289.2)
alternative label: Pohjois-Amerikka, mytologiat, alkuperäiskansojen (289.2)
alternative label: Pohjois-Amerikka, uskonnot, alkuperäiskansat (289.2)
alternative label: Tolteekit, mytologiat (289.2)
alternative label: Tolteekit, uskonnot (289.2)
alternative label: Amerika, mytologier, urbefolkningar (289.2) @sv
alternative label: Amerika, religioner, urbefolkningar (289.2) @sv
alternative label: Azteker, asteekit, mytologier (289.2) @sv
alternative label: Azteker, asteekit, religioner (289.2) @sv
alternative label: Azteker, atsteekit, mytologier (289.2) @sv
alternative label: Azteker, atsteekit, religioner (289.2) @sv
alternative label: Eskimåer, mytologier (289.2) @sv
alternative label: Eskimåer, religioner (289.2) @sv
alternative label: Indianer, mytologier (289.2) @sv
alternative label: Indianer, religioner (289.2) @sv
alternative label: Inkaindianer, mytologier (289.2) @sv
alternative label: Inkaindianer, religioner (289.2) @sv
alternative label: Inuiter, mytologier (289.2) @sv
alternative label: Inuiter, religioner (289.2) @sv
alternative label: Mayafolket, mytologier (289.2) @sv
alternative label: Mayafolket, religioner (289.2) @sv
alternative label: Nordamerika, mytologier, urbefolkningarnas (289.2) @sv
alternative label: Nordamerika, religioner, urbefolkningar (289.2) @sv
alternative label: Sydamerika, mytologier, urbefolkningarnas (289.2) @sv
alternative label: Sydamerika, religioner, urbefolkningar (289.2) @sv
alternative label: Tolteker, mytologier (289.2) @sv
alternative label: Tolteker, religioner (289.2) @sv
broader: Muut uskonnot ja mytologiat
in scheme: URN:NBN:fi:au:hklj:
notation: 289.2
preferred label: Native American religions and mythologies @en
preferred label: De amerikanska ursprungsfolkens religioner och mytologier @sv
related: URN:NBN:fi:au:hklj:110
related: RAJATIETO
related: URN:NBN:fi:au:hklj:192
related: Kuolemakokemukset
related: Uskonnonfilosofia
related: Elämä. Kuolema
related: Luominen. Kehitys
related: URN:NBN:fi:au:hklj:209
related: URN:NBN:fi:au:hklj:210
related: Jumalan olemus
related: Enkelit. Paholaiset. Demonit
related: Kuolema ja kuolemanjälkeinen elämä
related: Lähetystyö
related: URN:NBN:fi:au:hklj:807
related: URN:NBN:fi:au:hklj:992
scope note: Intiaanien ja inuitien uskonnot ja mytologiat
scope note: Indianernas och inuiternas religioner och mytologier @sv

Australian ja Oseanian alkuperäiskansojen uskonnot ja mytologiat
type: Class
type: Concept
subclass of: Muut uskonnot ja mytologiat
alternative label: Aboriginaalit, Australia, mytologiat (289.3)
alternative label: Aboriginaalit, Australia, uskonnot (289.3)
alternative label: Australia, mytologiat, aboriginaalit (289.3)
alternative label: Australia, uskonnot, aboriginaalit (289.3)
alternative label: Oseania, mytologiat, aboriginaalien (289.3)
alternative label: Oseania, uskonnot, aboriginaalien (289.3)
alternative label: Aboriginer, Australien, mytologier (289.3) @sv
alternative label: Aboriginer, Australien, religioner (289.3) @sv
alternative label: Australien, mytologier, aboriginer (289.3) @sv
alternative label: Australien, religioner, aboriginer (289.3) @sv
alternative label: Oceanien, mytologier, aboriginers (289.3) @sv
alternative label: Oceanien, religioner, aboriginers (289.3) @sv
broader: Muut uskonnot ja mytologiat
in scheme: URN:NBN:fi:au:hklj:
notation: 289.3
preferred label: Native religions and mythologies in Australia and Oceania @en
preferred label: Ursprungsfolkens religioner och mytologier i Australien och Oceanien @sv
related: URN:NBN:fi:au:hklj:110
related: RAJATIETO
related: URN:NBN:fi:au:hklj:192
related: Kuolemakokemukset
related: Uskonnonfilosofia
related: Elämä. Kuolema
related: Luominen. Kehitys
related: URN:NBN:fi:au:hklj:209
related: URN:NBN:fi:au:hklj:210
related: Jumalan olemus
related: Enkelit. Paholaiset. Demonit
related: Kuolema ja kuolemanjälkeinen elämä
related: Lähetystyö
related: URN:NBN:fi:au:hklj:807
related: URN:NBN:fi:au:hklj:992

Muinaispohjoismaiset uskonnot ja mytologiat
type: Class
type: Concept
subclass of: Muinaisgermaaniset, -balttilaiset, -slaavilaiset ja -kelttiläiset uskonnot ja mytologiat
alternative label: Pohjoisgermaaninen mytologia (289.91)
alternative label: Pohjoisgermaaniset uskonnot (289.91)
alternative label: Pohjoismaiset muinaisuskonnot (289.91)
alternative label: Skandinaavinen mytologia (289.91)
alternative label: Viikingit, uskonnot ja mytologiat (289.91)
alternative label: Nordgermansk mytologi (289.91) @sv
alternative label: Nordgermanska religioner (289.91) @sv
alternative label: Nordiska fornreligioner (289.91) @sv
alternative label: Skandinavisk mytologi (289.91) @sv
alternative label: Vikingar, religioner och mytologier (289.91) @sv
broader: Muinaisgermaaniset, -balttilaiset, -slaavilaiset ja -kelttiläiset uskonnot ja mytologiat
in scheme: URN:NBN:fi:au:hklj:
notation: 289.91
preferred label: Ancient Nordic religions and mythologies @en
preferred label: Fornnordiska religioner och mytologier @sv
related: URN:NBN:fi:au:hklj:110
related: RAJATIETO
related: URN:NBN:fi:au:hklj:192
related: Kuolemakokemukset
related: Uskonnonfilosofia
related: Elämä. Kuolema
related: Luominen. Kehitys
related: URN:NBN:fi:au:hklj:209
related: URN:NBN:fi:au:hklj:210
related: Jumalan olemus
related: Enkelit. Paholaiset. Demonit
related: Kuolema ja kuolemanjälkeinen elämä
related: Lähetystyö
related: URN:NBN:fi:au:hklj:807
related: URN:NBN:fi:au:hklj:992

Prosessioikeus. Oikeushallinto
type: Class
type: Concept
subclass of: Julkisoikeus
alternative label: Alioikeudet (332.5)
alternative label: Alistaminen, prosessioikeus (332.5)
alternative label: Alistus, prosessioikeus (332.5)
alternative label: Alistusmenettely (332.5)
alternative label: Armahdus, oikeustiede (332.5)
alternative label: Asianajajat, oikeuslaitos (332.5)
alternative label: Asianajotoimi (332.5)
alternative label: Asianajotoimistot (332.5)
alternative label: Asianomistajat, oikeudenkäynti (332.5)
alternative label: Asianosaiset, oikeudenkäynti (332.5)
alternative label: Asunto-oikeudet (332.5)
alternative label: Avioliittoon vihkiminen, siviilivihkiminen (332.5)
alternative label: Edunpalautus (332.5)
alternative label: Edunvalvonta, oikeudenkäynti (332.5)
alternative label: Eduskunnan oikeusasiamiehet, oikeushallinto (332.5)
alternative label: Ennakkopäätökset (332.5)
alternative label: Ennakkoratkaisut (332.5)
alternative label: Esitutkinta, oikeusprosessi (332.5)
alternative label: Esteettömyys, prosessioikeus (332.5)
alternative label: Esteettömyystodistukset, prosessioikeus (332.5)
alternative label: Etuoikeudet, konkurssioikeus (332.5)
alternative label: Haasteet, oikeustiede (332.5)
alternative label: Hakemuslainkäyttö (332.5)
alternative label: Hallussapito, huumeet, rikosoikeus (332.5)
alternative label: Harkinta, oikeustiede (332.5)
alternative label: Harkintavalta, oikeustiede (332.5)
alternative label: Hovioikeudet (332.5)
alternative label: Hukkaamiskielto (332.5)
alternative label: Huumausaineen käyttörikokset, rikosoikeus (332.5)
alternative label: Huumausainerikokset, rikosoikeus (332.5)
alternative label: Huumeet, rikosoikeus (332.5)
alternative label: Huumeiden käyttö, rikosoikeus (332.5)
alternative label: Huumerikokset, rikosoikeus (332.5)
alternative label: Insolvenssi, insolvenssioikeus (332.5)
alternative label: Insolvenssioikeus (332.5)
alternative label: Joukkokanteet (332.5)
alternative label: Julkiset haasteet (332.5)
alternative label: Jutun palautus, oikeusprosessi (332.5)
alternative label: Kansainvälinen oikeudenkäyttö, Euroopan unioni (332.5)
alternative label: Kansainvälinen oikeusapu, Euroopan unioni (332.5)
alternative label: Kansainvälinen oikeussubjekti, Euroopan unioni (332.5)
alternative label: Kansainvälinen prosessioikeus, Euroopan unioni (332.5)
alternative label: Kansainvälinen rikosoikeus, Euroopan unioni (332.5)
alternative label: Kansainväliset tuomioistuimet, Euroopan unioni (332.5)
alternative label: Kanteet (332.5)
alternative label: Kantelut (332.5)
alternative label: Katselmus (332.5)
alternative label: Katselmustoimitus (332.5)
alternative label: Kelpoisuus, oikeuskelpoisuus (332.5)
alternative label: Kihlakunnanoikeudet (332.5)
alternative label: Kohtuullistaminen, prosessioikeus (332.5)
alternative label: Konkurssi, konkurssioikeus (332.5)
alternative label: Konkurssioikeus (332.5)
alternative label: Konkurssipesät, lainsäädäntö (332.5)
alternative label: Konkurssit, konkurssioikeus (332.5)
alternative label: Korkein oikeus (332.5)
alternative label: Kuuleminen, oikeustiede, oikeusprosessi (332.5)
alternative label: Kuulustelu, oikeusprosessi (332.5)
broader: Julkisoikeus
in scheme: URN:NBN:fi:au:hklj:
notation: 332.5
related: URN:NBN:fi:au:hklj:326.2
related: URN:NBN:fi:au:hklj:332.2
related: URN:NBN:fi:au:hklj:332.205
related: Rikosoikeus
related: URN:NBN:fi:au:hklj:332.505
related: Vankeinhoito. Vankilat
related: Esine- ja velvoiteoikeus. Immateriaalioikeudet. Huoneen- ja maanvuokralainsäädäntö
related: Kansainvälinen oikeus
related: Suomen ja Euroopan Unionin laki- ja asetuskokoelmat
related: Muiden maiden lait
related: URN:NBN:fi:au:hklj:340
related: Poliisitoimi. Yleinen turvallisuus
related: Suomen valtionhallinto
related: Liiketalouden hallinto ja organisaatio
scope note: Siviili- ja rikosprosessioikeus. Tuomioistuinlaitos. Oikeustapauskokoelmat Raastuvanoikeus. Käräjäoikeus. Kihlakunnanoikeus. Hovioikeus. Korkein oikeus Oikeuskansleri. Eduskunnan oikeusasiamies Syyteoikeus. Syyttäjät. Oikeudenkäynti. Asianajotoimi. Todistusoikeus. Maksuton oikeudenkäynti. Oikeusapu. Välimiesmenettely. Muutoksenhaku. Sovittelu. Esitutkintalaki Ulosotto- ja konkurssilainsäädäntö. Velkasaneerausta koskeva lainsäädäntö
scope note: Civil- och straffprocessrätt. Domstolsväsen. Rättsfallssamlingar Tingsrätt (rådstuvurätt och häradsrätt). Hovrätt. Högsta domstolen Justitiekanslern. Riksdagens justitieombudsman Åtalsrätt. Åklagare. Rättegång. Advokatväsen. Bevisföring. Fri rättegång. Rättshjälp. Skiljemannaförfarande. Sökande av ändring. Förlikning. Förundersökningslagen Utmätningslagstiftning. Konkurslagstiftning. Lagstiftning om skuldsanering @sv

Maaoikeus
type: Class
type: Concept
subclass of: Ympäristöoikeus. Talousoikeus
alternative label: Halkominen, maapoliittinen lainsäädäntö (334.3)
alternative label: Jakolaitos, lainsäädäntö (334.3)
alternative label: Jakotoimitus, maapoliittinen lainsäädäntö (334.3)
alternative label: Lohkominen, maapoliittinen lainsäädäntö (334.3)
alternative label: Maakirjat (334.3)
alternative label: Maanjakolainsäädäntö (334.3)
alternative label: Maanlait, lainsäädäntö (334.3)
alternative label: Maaoikeus (334.3)
alternative label: Maapoliittinen lainsäädäntö (334.3)
alternative label: Naapurioikeudet, maaoikeus (334.3)
alternative label: Tieoikeus (334.3)
alternative label: Uskottu mies, maanjakolainsäädäntö (334.3)
alternative label: Yhteismaa, maaoikeus (334.3)
alternative label: Allmänning, jordrätt (334.3) @sv
alternative label: God man, jorddelningslagstiftning (334.3) @sv
alternative label: Grannelagsrätt, jordrätt (334.3) @sv
alternative label: Indelningsväsen, lagstiftning (334.3) @sv
alternative label: Jorddelningslagstiftning (334.3) @sv
alternative label: Jordeböcker (334.3) @sv
alternative label: Jordrätt (334.3) @sv
alternative label: Klyvning, markpolitisk lagstiftning (334.3) @sv
alternative label: Landslagar, juridik (334.3) @sv
alternative label: Markpolitisk lagstiftning (334.3) @sv
alternative label: Skiftesförrättning, markpolitisk lagstiftning (334.3) @sv
alternative label: Styckning, markpolitisk lagstiftning (334.3) @sv
alternative label: Vägrätt (334.3) @sv
broader: Ympäristöoikeus. Talousoikeus
in scheme: URN:NBN:fi:au:hklj:
notation: 334.3
preferred label: Law of the land @en
preferred label: Jordrätt @sv
related: URN:NBN:fi:au:hklj:326.2
related: URN:NBN:fi:au:hklj:332.2
related: Asemakaava- ja rakentamislainsäädäntö
related: Esine- ja velvoiteoikeus. Immateriaalioikeudet. Huoneen- ja maanvuokralainsäädäntö
related: Vesioikeus
related: Maa- ja metsätalouslainsäädäntö
related: Kansainvälinen oikeus
related: Suomen ja Euroopan Unionin laki- ja asetuskokoelmat
related: Muiden maiden lait
related: URN:NBN:fi:au:hklj:342
related: Kiinteistöt. Tontit
related: Ympäristönsuojelu. Luonnonsuojelu
related: URN:NBN:fi:au:hklj:613.3
related: URN:NBN:fi:au:hklj:657
related: URN:NBN:fi:au:hklj:721
scope note: Maapoliittinen lainsäädäntö. Maanjakolainsäädäntö. Tieoikeus
scope note: Lagstiftning om markpolitik. Jordskifteslagstiftning. Vägrätt @sv

Perhesosiologia
type: Class
type: Concept
subclass of: SOSIOLOGIA
alternative label: Adoptio, perhesosiologia (358)
alternative label: Adoptiolapset, perhesosiologia (358)
alternative label: Aikuiset, perhesosiologia (358)
alternative label: Aikuisuus, perhesosiologia (358)
alternative label: Anopit, perhesosiologia (358)
alternative label: Apet, perhesosiologia (358)
alternative label: Appivanhemmat, perhesosiologia (358)
alternative label: Au-lapset, perhesosiologia (358)
alternative label: Au-äidit, perhesosiologia (358)
alternative label: Avioero, perhesosiologia (358)
alternative label: Avioerolapset, perhesosiologia (358)
alternative label: Avioliitto, sosiologia (358)
alternative label: Aviomiehet, rooli ja asema perheessä (358)
alternative label: Avioparit, perhesosiologia (358)
alternative label: Aviopuolisot, perhesosiologia (358)
alternative label: Aviottomat lapset, perhesosiologia (358)
alternative label: Aviottomat äidit, perhesosiologia (358)
alternative label: Aviovaimot, rooli ja asema perheessä (358)
alternative label: Avoero, perhesosiologia (358)
alternative label: Avoin adoptio, perhesosiologia (358)
alternative label: Avoliitto, sosiologia (358)
alternative label: Avoparit, perhesosiologia (358)
alternative label: Avopuolisot, perhesosiologia (358)
alternative label: Biologiset lapset, perhesosiologia (358 +)
alternative label: Biologiset vanhemmat, perhesosiologia (358 +)
alternative label: Elatus, perhesosiologia (358)
alternative label: Fyysinen väkivalta, perheväkivalta (358)
alternative label: Gender-tutkimus, perhesosiologia (358)
alternative label: Huoltajuus, perhesosiologia (358)
alternative label: Ikäkaudet, perhesosiologia (358)
alternative label: Ikäluokat, asema perheessä (358)
alternative label: Ikäryhmät, asema perheessä (358)
alternative label: Insesti, perhesosiologia (358)
alternative label: Isoisät, perhesosiologia (358)
alternative label: Isovanhemmat, perhesosiologia (358)
alternative label: Isovanhemmuus, perhesosiologia (358)
alternative label: Isoäidit, perhesosiologia (358)
alternative label: Isyys, perhesosiologia (358)
alternative label: Isäpuolet, isän rooli (358)
alternative label: Isäpuolet, perhesosiologia (358)
alternative label: Isät, isän rooli (358)
alternative label: Isät, perhesosiologia (358)
alternative label: Isättömyys, perhesosiologia (358)
alternative label: Kaltoinkohtelu, perhesosiologia (358)
alternative label: Kansainvälinen adoptio, perhesosiologia (358)
alternative label: Kasvattilapset, perhesosiologia (358)
alternative label: Kasvatuskodit, perhesosiologia (358)
alternative label: Kasvatusvanhemmat, perhesosiologia (358)
alternative label: Kasvuympäristö, perhesosiologia (358)
alternative label: Keski-ikä, perhesosiologia (358)
alternative label: Kiusaaminen, kotona (358)
alternative label: Koti, perhesosiologia (358)
alternative label: Koti-isät, perhesosiologia (358)
alternative label: Kotitausta, perhesosiologia (358)
alternative label: Kotiväkivalta (358)
alternative label: Kotiväkivalta, perhesosiologia (358)
alternative label: Kotiympäristö, perhesosiologia (358)
alternative label: Kotiäidit, perhesosiologia (358)
broader: SOSIOLOGIA
in scheme: URN:NBN:fi:au:hklj:
notation: 358
related: Sosiaalipsykologia. Kulttuuripsykologia
related: Ihmissuhteiden psykologia
related: Naisen ja miehen psykologia
related: Perhe- ja kotikasvatus
related: Perhe- ja holhousoikeus
related: Organisaatioiden ja laitosten sosiologia
related: URN:NBN:fi:au:hklj:357.1
related: Kriminologia. Kriminaalisosiologia
related: Perhepolitiikka. Lapsipolitiikka. Nuorisopolitiikka
related: Lastenneuvolat. Äitiysneuvolat
related: Päivähoito
related: URN:NBN:fi:au:hklj:373
related: Naisen ja miehen asema yhteiskunnassa
related: URN:NBN:fi:au:hklj:618.85
scope note: Eri perhemuotojen sosiologia Avio- ja avoliitto. Avioero. Suurperheet. Muut perheenomaiset yhteisöt Yksineläjät. Yksinhuoltajat Perheenjäsenten, äidin ja isän, naisen ja miehen sekä lapsen asema ja roolit perheessä Perheväkivalta perhesosiologian kannalta. Perheväkivalta yleensä
scope note: De olika familjeformernas sociologi Äktenskap. Samboende. Skilsmässa. Storfamiljer. Andra familjeliknande gemenskaper Ensamboende. Ensamförsörjare Familjemedlemmarnas, moderns och faderns, kvinnans och mannens samt barnets ställning och roll i familjen Familjevåld ur familjesociologins synvinkel. Familjevåld i allmänhet @sv

Asuntopolitiikka
type: Class
type: Concept
subclass of: URN:NBN:fi:au:hklj:371
alternative label: Aravajärjestelmä (371.4)
alternative label: Aravalainat (371.4)
alternative label: Asuinalueet, asuntopolitiikka (371.4)
alternative label: Asuinhuoneistot, asuntopolitiikka (371.4)
alternative label: Asuinolot, asuntopolitiikka (371.4)
alternative label: Asuinyhteisöt, asuntopolitiikka (371.4)
alternative label: Asukasdemokratia, asukastoiminta (371.4)
alternative label: Asukasrakenne, asuntopolitiikka (371.4)
alternative label: Asukastoiminta (371.4)
alternative label: Asukasyhdistykset (371.4)
alternative label: Asukkaat, asuntopolitiikka (371.4)
alternative label: Asuminen, asuntopolitiikka (371.4)
alternative label: Asumiskustannukset (371.4)
alternative label: Asumisoikeus, asuntopolitiikka (371.4)
alternative label: Asumisoikeusasunnot, asuntopolitiikka (371.4)
alternative label: Asumistiheys, asuntopolitiikka (371.4)
alternative label: Asumistuki (371.4)
alternative label: Asumisvalmennus (371.4)
alternative label: Asumisväljyys, asuntopolitiikka (371.4)
alternative label: Asumukset, asuntopolitiikka (371.4)
alternative label: Asunnontarkastus (371.4)
alternative label: Asunnonvaltaus (371.4)
alternative label: Asunnonvälitys (371.4)
alternative label: Asunnot, asuntopolitiikka (371.4)
alternative label: Asunnottomat (371.4)
alternative label: Asunnottomuus (371.4)
alternative label: Asunto-olot, asuntopolitiikka (371.4)
alternative label: Asunto-osakkeet, asuntokauppa (371.4)
alternative label: Asunto-osuuskunnat (371.4)
alternative label: Asuntoalueet, asuntopolitiikka (371.4)
alternative label: Asuntoavustukset (371.4)
alternative label: Asuntohallinto (371.4)
alternative label: Asuntokanta (371.4)
alternative label: Asuntokauppa (371.4)
alternative label: Asuntokysymys (371.4)
alternative label: Asuntolainat (371.4)
alternative label: Asuntolat (371.4)
alternative label: Asuntomarkkinat (371.4)
alternative label: Asuntomessut (371.4)
alternative label: Asuntonäyttelyt (371.4)
alternative label: Asuntopolitiikka (371.4)
alternative label: Asuntopula (371.4)
alternative label: Asuntorakentaminen, asuntopolitiikka (371.4)
alternative label: Asuntosäästäminen (371.4)
alternative label: Asuntotoimi (371.4)
alternative label: Asuntotuotanto, asuntopolitiikka (371.4)
alternative label: Asuntovelat (371.4)
alternative label: Ekoasuminen, asuntopolitiikka (371.4)
alternative label: Ekologinen asuminen, asuntopolitiikka (371.4)
alternative label: HITAS (371.4)
alternative label: Haja-asutus, asuntopolitiikka (371.4)
alternative label: Huoneenvuokra, asuntopolitiikka (371.4)
alternative label: Huoneistot, asunnonhankinta (371.4)
alternative label: Huoneistot, asuntokauppa (371.4)
alternative label: Huoneistot, asuntotuotanto (371.4)
alternative label: Hätämajoitus (371.4)
alternative label: Häätö, asuntopolitiikka (371.4)
broader: URN:NBN:fi:au:hklj:371
in scheme: URN:NBN:fi:au:hklj:
notation: 371.4
related: Asemakaava- ja rakentamislainsäädäntö
related: Esine- ja velvoiteoikeus. Immateriaalioikeudet. Huoneen- ja maanvuokralainsäädäntö
related: Työoikeus
related: URN:NBN:fi:au:hklj:345
related: Alueellinen sosiologia. Maassamuutto
related: Kiinteistöt. Tontit
related: Aluepolitiikka. Ympäristöpolitiikka
related: Maapolitiikka
related: Työmarkkinajärjestöt
related: Talonrakennus
related: Rakennuksen kunnossapito
related: URN:NBN:fi:au:hklj:721
related: Asuinrakennukset
related: Kaupunkisuunnittelu. Kaupunkiarkkitehtuuri
related: Helsinki. Pääkaupunkiseutu
scope note: Asuntokysymys. Asuntotuotanto. Asuntomarkkinat Omistus-, vuokra- ja työsuhdeasunnot. Yhteisöasuminen Asunnonhankinta. Asunnonvälitys. Asuntokauppa Rakennus- ja asuntolainat sekä avustukset Asuntojen hinnat ja vuokrat. Vuokrasäännöstely Asuntojen käyttö. Tyhjät asunnot. Asunnon valtaus Asuntopula. Asunnottomuus. Asuntolatoiminta
scope note: Bostadsfrågan. Bostadsproduktion. Bostadsmarknaden Ägarbostäder, hyresbostäder och tjänstebostäder. Kollektivboende Att skaffa bostad. Bostadsförmedling. Bostadsförsäljning och bostadsköp Bygg- och bostadslån samt bidrag Bostadspriser och hyra. Hyresreglering Användning av bostäder. Tomma bostäder. Bostadsockupation Bostadsbrist. Bostadslöshet. Härbärgenas verksamhet @sv

Suomenruotsalaisten asuma-alueet
type: Class
type: Concept
subclass of: Suomi
alternative label: Saaristolaiset, maantiede, suomenruotsalaisten asuma-alueet (412.008)
alternative label: Suomenruotsalaisten asumaalueet (412.008)
alternative label: Suomenruotsalaisten asumaalueet, maantiede, matkat (412.008)
alternative label: Finlandssvenskarnas bosättningsområden (412.008) @sv
alternative label: Finlandssvenskarnas bosättningsområden, geografi, resor (412.008) @sv
broader: Suomi
in scheme: URN:NBN:fi:au:hklj:
notation: 412.008
preferred label: Finnish-Swedish regions @en
preferred label: Svenskbygderna @sv
related: URN:NBN:fi:au:hklj:411
related: URN:NBN:fi:au:hklj:460
related: URN:NBN:fi:au:hklj:920
related: Esi- ja varhaishistoria vuoteen 1154
related: Keskiaika 1155-1522
related: Reformaation aika 1523-1617
related: Ruotsin suurvalta-aika 1618-1721
related: Vapauden aika ja kustavilainen aika 1722-1809
related: Autonomian aika 1810-1917
related: Itsenäisyyden aika 1917-1938
related: Vuoden 1918 sota
related: Itsenäisyyden aika 1939-
related: Sodat 1939-1945
related: URN:NBN:fi:au:hklj:929
related: Helsinki. Pääkaupunkiseutu
scope note: Suomenruotsalaisten asuinalueita koskevat yleisteokset Suomenruotsalaisten yksittäiset asuinalueet maakuntien tai läänien mukaisissa luokissa
scope note: Allmänna verk som rör finlandssvenska bosättningsområden Enskilda bosättningsområden klassificeras enligt landskap eller län @sv

FYYSINEN MAANTIEDE
type: Class
type: Concept
subclass of: URN:NBN:fi:au:hklj:400
alternative label: Fyysinen maantiede (480)
alternative label: Geotieteet, luonnonmaantiede (480 ... 487)
alternative label: Luonnonmaantiede (480)
alternative label: Luonnontieteet, luonnonmaantiede (480 ... 487)
alternative label: Maa, luonnonmaantiede (480)
alternative label: Maa, planeetta, luonnonmaantiede (480)
alternative label: Maantiede, fyysinen maantiede (480)
alternative label: Maantiede, luonnonmaantiede (480)
alternative label: Maapallo, luonnonmaantiede (480)
alternative label: Fysisk geografi (480) @sv
alternative label: Geografi, fysisk geografi (480) @sv
alternative label: Geografi, naturgeografi (480) @sv
alternative label: Geovetenskaper, naturgeografi (480 ... 487) @sv
alternative label: Jorden, naturgeografi (480) @sv
alternative label: Jordklotet, naturgeografi (480) @sv
alternative label: Mark, naturgeografi (480) @sv
alternative label: Naturgeografi (480) @sv
alternative label: Naturvetenskaper, naturgeografi (480 ... 487) @sv
broader: URN:NBN:fi:au:hklj:400
in scheme: URN:NBN:fi:au:hklj:
narrower: Kartografia
narrower: Geodesia. Maanmittaus. Paikannus. Geoinformatiikka
narrower: Hydrologia
narrower: Meteorologia. Klimatologia
notation: 480
preferred label: PHYSICAL GEOGRAPHY @en
preferred label: FYSISK GEOGRAFI @sv
related: Yleinen aluemaantiede. Yleinen kulttuurimaantiede. Yleinen poliittinen maantiede
related: URN:NBN:fi:au:hklj:480.084
related: GEOLOGIA
related: Tähtijärjestelmät. Aurinkokunnat
related: Ekologia. Eliömaantiede
related: Kasvimaantiede
related: Eläinmaantiede
scope note: Fyysisen maantieteen ja luonnonmaantieteen yleisteokset Teokset, joissa on sekä muuta fyysistä tai luonnonmaantiedettä että geologiaa Tässä ja alaluokissa fyysinen maantiede ja yleinen luonnonmaantiede maasta tai alueesta riippumatta
scope note: Allmänna verk som rör fysisk geografi och naturgeografi Verk som handlar om såväl övrig fysisk geografi och naturgeografi som geologi Hit och till underklasserna fysisk geografi och allmän naturgeografi oavsett land eller geografiskt område @sv

GEOLOGIA
type: Class
type: Concept
subclass of: URN:NBN:fi:au:hklj:400
alternative label: Fyysinen maantiede, geologia (490)
alternative label: Geologia (490 ... 498)
alternative label: Geologia (490)
alternative label: Geologia, taloudellinen geologia (490)
alternative label: Geotieteet, geologia (490 ... 498)
alternative label: Kairaus, geologinen tutkimus (490 ... 498)
alternative label: Kivikehä (490)
alternative label: Kivikehä, geologia (490)
alternative label: Litosfääri (490)
alternative label: Litosfääri, geologia (490)
alternative label: Luonnontieteelliset museot, geologiset museot (490)
alternative label: Luonnontieteet, geologia (490 ... 498)
alternative label: Maa, geologia (490)
alternative label: Maa, planeetta, geologia (490)
alternative label: Maapallo, geologia (490)
alternative label: Metallogenia, geologia (490 ... 498)
alternative label: Rakennegeologia, geologia (490 ... 498)
alternative label: Taloudellinen geologia (490)
alternative label: Borrning, kairaus, geologisk undersökning (490 ... 498) @sv
alternative label: Ekonomisk geologi (490) @sv
alternative label: Fysisk geografi, geologi (490) @sv
alternative label: Geologi (490 ... 498) @sv
alternative label: Geologi (490) @sv
alternative label: Geologi, ekonomisk geologi (490) @sv
alternative label: Geovetenskaper, geologi (490 ... 498) @sv
alternative label: Jorden, geologi (490) @sv
alternative label: Jordklotet, geologi (490) @sv
alternative label: Litosfären (490) @sv
alternative label: Litosfären, geologi (490) @sv
alternative label: Mark, geologi (490) @sv
alternative label: Metallogenes, geologi (490 ... 498) @sv
alternative label: Naturvetenskaper, geologi (490 ... 498) @sv
alternative label: Naturvetenskapliga museer, geologiska museer (490) @sv
alternative label: Strukturgeologi, geologi (490 ... 498) @sv
broader: URN:NBN:fi:au:hklj:400
in scheme: URN:NBN:fi:au:hklj:
narrower: Geomorfologia. Geodynamiikka
narrower: Mineralogia. Kristallografia. Petrologia
narrower: Fennoskandian geologia
narrower: Historiallinen geologia
narrower: Paleontologia
notation: 490
preferred label: GEOLOGY @en
preferred label: GEOLOGI @sv
related: Yleinen aluemaantiede. Yleinen kulttuurimaantiede. Yleinen poliittinen maantiede
related: FYYSINEN MAANTIEDE
related: Geodesia. Maanmittaus. Paikannus. Geoinformatiikka
related: Tähtijärjestelmät. Aurinkokunnat
related: Kaivos- ja kaivannaisteollisuus
scope note: Geologian yleisteokset, joissa on sekä geodynamiikkaa tai geomorfologiaa että mineralogiaa tai petrologiaa. Litosfääri yleensä Taloudellisen geologian ja kaivannaisgeologian yleisteokset Yleiset geologiset kartat 490.084, paitsi Fennoskandian osalta 495.084-495.1084
scope note: Allmänna verk om geologi som innehåller såväl geodynamik eller geomorfologi som mineralogi eller petrologi. Litosfären i allmänhet Allmänna verk om ekonomisk geologi och gruvgeologi Allmänna geologiska kartor förs till klass 490.084, förutom de som rör Fennoskandien, vilka förs till klasserna 495.084-495.1084 @sv

TÄHTITIEDE
type: Class
type: Concept
subclass of: LUONNONTIETEET
alternative label: Astromekaniikka (520)
alternative label: Astrometria (520)
alternative label: Astronomia (520 ... 529)
alternative label: Astronomia, harrastusoppaat (520)
alternative label: Avaruusarkeologia (520)
alternative label: Gravitaatio, taivaankappaleiden radat (520)
alternative label: Luonnonopin oppikirjat, tähtitiede, oppikirjat (520 ... 529)
alternative label: Luonnontieteet, tähtitiede (520 ... 529 +)
alternative label: Luonnontieto, tähtitiede (520 ... 529)
alternative label: Matemaattiset tieteet, tähtitiede (520 ... 529)
alternative label: Ominaisliike, tähtitiede (520)
alternative label: Painovoima, taivaankappaleiden radat (520)
alternative label: Pallotähtitiede, astrometria (520)
alternative label: Taivaankappaleiden radat (520)
alternative label: Taivaanmekaniikka (520)
alternative label: Taivas, tähtitiede (520 ... 529)
alternative label: Teoreettinen tähtitiede (520)
alternative label: Tähtitaivas, tähtitiede (520)
alternative label: Tähtitiede (520)
alternative label: Tähtitiede, harrastusoppaat (520)
alternative label: Vetovoima, mekaniikka (520)
alternative label: Vuorokaudenajat, tähtitiede (520)
alternative label: Välimatkat, tähtitiede (520 ... 528)
alternative label: Yö, tähtitiede (520)
alternative label: Astromekanik (520) @sv
alternative label: Astrometri (520) @sv
alternative label: Astronomi (520 ... 529) @sv
alternative label: Astronomi, astronomi som hobby (520) @sv
alternative label: Celest mekanik (520) @sv
alternative label: Distanser, astronomi (520 ... 528) @sv
alternative label: Dragningskraft, himlakropparnas banor (520) @sv
alternative label: Dygnets timmar, astronomi (520) @sv
alternative label: Egenrörelse, astronomi (520) @sv
alternative label: Gravitation, himlakropparnas banor (520) @sv
alternative label: Himlakropparnas banor (520) @sv
alternative label: Himlen, astronomi (520 ... 529) @sv
alternative label: Matematiska vetenskaper, astronomi (520 ... 529) @sv
alternative label: Natt, astronomi (520) @sv
alternative label: Naturlära, astronomi (520 ... 529) @sv
alternative label: Naturlära, läroböcker, astronomi, läroböcker (520 ... 529) @sv
alternative label: Naturvetenskaper, astronomi (520 ... 529 +) @sv
alternative label: Rymdarkeologi (520) @sv
alternative label: Sfärisk astronomii, astrometri (520) @sv
alternative label: Stellarastronomi (520) @sv
alternative label: Stellarastronomi, astronomi som hobby (520) @sv
alternative label: Stjärnhimlen, stellarastronomi (520) @sv
alternative label: Teoretisk astronomi (520) @sv
alternative label: Tyngdkraft, himlakropparnas banor (520) @sv
broader: LUONNONTIETEET
in scheme: URN:NBN:fi:au:hklj:
narrower: Maailmankaikkeus. Kosmologia. Kosmogonia
narrower: Tähtitieteelliset kojeet. Ajanlasku
narrower: Elämä maailmankaikkeudessa. Astrobiologia
narrower: Tähtijärjestelmät. Aurinkokunnat
narrower: Avaruustutkimus. Avaruuslennot. Avaruusteknologia
notation: 520
preferred label: ASTRONOMY @en
preferred label: ASTRONOMI @sv
related: Astrologia. Horoskoopit
related: Luonto-oppaat. Oppikirjat
related: URN:NBN:fi:au:hklj:520.084
related: URN:NBN:fi:au:hklj:520.09
scope note: Tähtitieteen eli astronomian yleisteokset. Tähtitieteen harrastus yleensä Teoreettinen tähtitiede. Taivaanmekaniikka. Taivaankappaleiden radat. Astrometria. Pallotähtitiede. Efemeridien laskeminen
scope note: Hit allmänna arbeten om astronomi. Astronomi som hobby i allmänhet Teoretisk astronomi. Celest mekanik. Himlakropparnas banor. Astrometri. Sfärisk astronomi. Beräkning av efemerider @sv

Yleisbiologia
type: Class
type: Concept
subclass of: BIOLOGIA
alternative label: Aineenvaihdunta, yleisbiologia (573)
alternative label: Aineenvaihduntatuotteet, yleisbiologia (573)
alternative label: Aistimet, yleisbiologia (573)
alternative label: Aistinelimet, yleisbiologia (573)
alternative label: Aistinfysiologia, yleisbiologia (573)
alternative label: Aistinsolut, yleisbiologia (573)
alternative label: Aistit, yleisbiologia (573)
alternative label: Aivo-selkäydinneste , yleisbiologia (573)
alternative label: Aivofysiologia, yleisbiologia (573)
alternative label: Aivokuori, yleisbiologia (573)
alternative label: Aivoselkäydinneste , yleisbiologia (573)
alternative label: Aivot, yleisbiologia (573)
alternative label: Akillesjänne, yleisbiologia (573)
alternative label: Alaraajat, yleisbiologia (573)
alternative label: Alkio, yleisbiologia (573)
alternative label: Alkiokehitys, yleisbiologia (573)
alternative label: Alkionkehitys, yleisbiologia (573)
alternative label: Anatomia, yleisbiologia (573)
alternative label: Androgynia, yleisbiologia (573)
alternative label: Anti-Müllerian hormoni, yleisbiologia (573)
alternative label: Apoptoosi, solubiologia (573)
alternative label: Asetyylikoliini, välittäjäaineet, yleisbiologia (573)
alternative label: Bioelektroniikka (573)
alternative label: Biofysiikka (573)
alternative label: Biologia, yleisbiologia (573)
alternative label: Biologiset rytmit, yleisbiologia (573)
alternative label: Bioluminesenssi (573)
alternative label: Biomekaniikka (573)
alternative label: Biomolekyylit, molekyylibiologia (573)
alternative label: Biorytmit, yleisbiologia (573)
alternative label: Depolarisaatio, hermosolut, yleisbiologia (573)
alternative label: Depolarisaatio, solukalvot, yleisbiologia (573)
alternative label: Ekofysiologia, fysiologia (573)
alternative label: Elektrofysiologia, yleisbiologia (573)
alternative label: Elimet, biologia (573)
alternative label: Elimistö, biologia (573)
alternative label: Elinoppi, yleisbiologia (573)
alternative label: Embryogeneesi, yleisbiologia (573)
alternative label: Embryologia, yleisbiologia (573)
alternative label: Endosytoosi, yleisbiologia (573)
alternative label: Endoteelisolut, yleisbiologia (573)
alternative label: Entsyymit, yleisbiologia (573)
alternative label: Epiteeli, yleisbiologia (573)
alternative label: Epiteelisolut, yleisbiologia (573)
alternative label: Fagosytoosi, yleisbiologia (573)
alternative label: Feromonit, yleisbiologia (573)
alternative label: Fysiikka, biofysiikka (573)
alternative label: Fysiologia, yleisbiologia (573)
alternative label: Fysiologiset rytmit, biologia (573)
alternative label: Fysiologiset vaikutukset, yleisbiologia (573)
alternative label: Fyysiset ominaisuudet, yleisbiologia (573 +)
alternative label: Hajuaisti, yleisbiologia (573)
alternative label: Hedelmällisyys, yleisbiologia (573)
alternative label: Hedelmöitys, yleisbiologia (573)
alternative label: Hemiselluloosa, solubiologia, yleisbiologia (573)
alternative label: Hengitys, yleisbiologia (573)
alternative label: Hengityselimet, yleisbiologia (573)
alternative label: Hengitystiet, yleisbiologia (573)
alternative label: Hermafroditismi, yleisbiologia (573)
broader: BIOLOGIA
in scheme: URN:NBN:fi:au:hklj:
notation: 573
related: FYSIIKKA
related: BIOKEMIA
related: Ekologia. Eliömaantiede
related: Kehitysoppi. Evoluutio
related: URN:NBN:fi:au:hklj:576
related: Yleinen mikrobiologia
related: Kasvimorfologia. Kasvianatomia
related: Kasvifysiologia
related: Eläinmorfologia. Eläinanatomia
related: Eläinfysiologia
related: Anatomia
related: URN:NBN:fi:au:hklj:612
related: URN:NBN:fi:au:hklj:616
scope note: Tähän yleinen ja vertaileva sekä kasveja että eläimiä koskeva anatomia, morfologia, somatologia, fysiologia ja biofysiikka Molekyylibiologian yleisteokset, jotka koskevat sekä kasveja että eläimiä Sytologian eli soluopin tai solubiologian yleisteokset, jotka koskevat sekä kasveja että eläimiä Solun rakenne ja osat. Solun toiminta. Soluviljelmät Ontogenian yleisteokset, jotka koskevat sekä kasveja että eläimiä Yksilön biologinen kehitys yleensä Eliöiden lisääntymistä ja sukupuolisuutta käsittelevät teokset, jotka koskevat sekä kasveja että eläimiä
scope note: Hit allmän och jämförande anatomi, morfologi, somatologi, fysiologi och biofysik som rör både djur och växter Allmänna verk om molekylbiologi som rör både djur och växter Allmänna verk om cytologi (cellära) eller i cellbiologi som rör både djur och växter Cellens uppbyggnad och delar. Cellens funktioner. Cellodling Allmänna verk om ontogeni som rör både djur och växter Biologisk individutveckling i allmänhet Verk som behandlar organismens fortplantning och sexualitet och som rör både djur och växter @sv

Putkilokasvit
type: Class
type: Concept
subclass of: Systemaattinen kasvitiede
alternative label: Ahomansikka, kasvitiede (587.4)
alternative label: Ananas, kasvitiede (587.4)
alternative label: Appelsiini, kasvitiede (587.4)
alternative label: Aprikoosi, kasvitiede (587.4)
alternative label: Auringonkukka, kasvitiede (587.4)
alternative label: Avokado, kasvitiede (587.4)
alternative label: Banaani, kasvitiede (587.4)
alternative label: Dendrologia (587.4)
alternative label: Greippi, kasvitiede (587.4)
alternative label: Haapa, kasvitiede (587.4)
alternative label: Havupensaat, kasvitiede (587.4)
alternative label: Havupuut, kasvitiede (587.4)
alternative label: Hedelmäkasvit, kasvitiede (587.4)
alternative label: Hedelmäpuut, kasvitiede (587.4)
alternative label: Hedelmät, kasvitiede (587.4)
alternative label: Heinäkasvit, kasvitiede (587.4)
alternative label: Heinät, kasvitiede (587.4)
alternative label: Herne, kasvitiede (587.4)
alternative label: Hernekasvit, kasvitiede (587.4)
alternative label: Herukat, kasvitiede (587.4)
alternative label: Hilla, kasvitiede (587.4)
alternative label: Hirssi, kasvitiede (587.4)
alternative label: Hukkakaura, kasvitiede (587.4)
alternative label: Hunajakasvit, kasvitiede (587.4)
alternative label: Itiökasvit, sanikkaiset (587.4)
alternative label: Itiöt, sanikkaisten (587.4)
alternative label: Jalava, kasvitiede (587.4)
alternative label: Jalopuut, kasvitiede (587.4)
alternative label: Juolavehnä, kasvitiede (587.4)
alternative label: Juurikkaat, kasvitiede (587.4)
alternative label: Jyvä, kasvitiede (587.4)
alternative label: Kaakaopuu, kasvitiede (587.4)
alternative label: Kaalirapi, kasvitiede (587.4)
alternative label: Kaalit, kasvitiede (587.4)
alternative label: Kahvipensas, kasvitiede (587.4)
alternative label: Kaktukset, kasvitiede (587.4)
alternative label: Karambola, kasvitiede (587.4)
alternative label: Karpalo, kasvitiede (587.4)
alternative label: Karviainen, kasvitiede (587.4)
alternative label: Kataja, kasvitiede (587.4)
alternative label: Kaura, kasvitiede (587.4)
alternative label: Kevätesikko (587.4)
alternative label: Kiinankaali, kasvitiede (587.4)
alternative label: Kiivi, kasvitiede (587.4)
alternative label: Kirsikka, kasvitiede (587.4)
alternative label: Kodat, siemenkasvit (587.4)
alternative label: Koivu, kasvitiede (587.4)
alternative label: Kookos, kasvitiede (587.4)
alternative label: Kukat, kasvitiede (587.4)
alternative label: Kukinta, kasvitiede (587.4)
alternative label: Kukka, kasvitiede (587.4)
alternative label: Kukkabiologia (587.4)
alternative label: Kukkakasvit, kasvitiede (587.4)
alternative label: Kuusi, kasvitiede (587.4)
alternative label: Kyssäkaali, kasvitiede (587.4)
alternative label: Kävyt, kasvitiede (587.4)
alternative label: Laakerikasvit (587.4)
alternative label: Laakeripuu (587.4)
broader: Systemaattinen kasvitiede
in scheme: URN:NBN:fi:au:hklj:
notation: 587.4
related: Luonto-oppaat. Oppikirjat
related: Kasvimorfologia. Kasvianatomia
related: Kasvifysiologia
related: Kasviekologia
related: Kasvimaantiede
related: Systemaattinen eläintiede
related: Maanviljely
related: Puutarhanhoito. Hyötykasvit. Huone- ja koristekasvit
related: Koristekasvit
related: Hyötykasvit
related: Yrtti- ja maustekasvit
related: Hedelmä-, marja- ja vihanneskasvit
related: Huonekasvit
related: URN:NBN:fi:au:hklj:657
scope note: Sanikkaiset. Siemen- eli kukkakasvit Puu- ja pensaskasvit yleensä Putkilokasvien systematiikka ja lajinmääritysoppaat Putkilokasvien morfologia, anatomia, fysiologia, ekologia ja kasvimaantiede Putkilokasvien lisääntyminen Kukkabiologia. Pölytysbiologia. Kasvullinen lisääntyminen
scope note: Kärlkryptogamer. Frö- eller blomväxter (fanerogamer) Träd och buskar i allmänhet Kärlväxternas systematik och handböcker för artbestämning av kärlväxter Kärlväxternas morfologi, anatomi, fysiologi, ekologi och växtgeografi Kärlväxternas fortplantning Blombiologi. Pollinationsbiologi. Växtlig fortplantning @sv

Selkärankaiset
type: Class
type: Concept
subclass of: Systemaattinen eläintiede
alternative label: Alligaattorit (597.9)
alternative label: Herpetologia (597.9)
alternative label: Kangaskäärme, eläintiede (597.9)
alternative label: Kilpikonnat, eläintiede (597.9)
alternative label: Krokotiilit (597.9)
alternative label: Kuristajakäärmeet (597.9)
alternative label: Kyyt (597.9)
alternative label: Käärmeet, eläintiede (597.9)
alternative label: Liskot, eläintiede (597.9)
alternative label: Matelijat, eläintiede (597.9)
alternative label: Munat, eläintiede, matelijat (597.9)
alternative label: Myrkkykäärmeet (597.9)
alternative label: Myrkylliset käärmeet (597.9)
alternative label: Ruskosammakko (597.9)
alternative label: Salamanterieläimet (597.9)
alternative label: Sammakkoeläimet (597.9)
alternative label: Sammakot (597.9)
alternative label: Selkäjänteiset, selkärankaiset (597.9 +)
alternative label: Selkärankaiset (597.9 +)
alternative label: Sisilisko (597.9)
alternative label: Suikulaiset (597.9)
alternative label: Tarhakäärmeet (597.9)
alternative label: Valekarettikilpikonna (597.9)
alternative label: Vaskitsa (597.9)
alternative label: Ympyräsuiset (597.9)
alternative label: Alligatorer (597.9) @sv
alternative label: Boa- och pytonormar (597.9) @sv
alternative label: Giftormar (597.9) @sv
alternative label: Groddjur (597.9) @sv
alternative label: Grodor (597.9) @sv
alternative label: Hasselsnok, zoologi (597.9) @sv
alternative label: Herpetologi (597.9) @sv
alternative label: Huggormar (597.9) @sv
alternative label: Kopparödla (597.9) @sv
alternative label: Krokodiler (597.9) @sv
alternative label: Kräldjur, zoologi (597.9) @sv
alternative label: Lansettfiskar (597.9) @sv
alternative label: Ormar, zoologi (597.9) @sv
alternative label: Oäkta karettsköldpadda (597.9) @sv
alternative label: Rundmunnar (597.9) @sv
alternative label: Ryggradsdjur (597.9 +) @sv
alternative label: Ryggsträngsdjur, ryggradsdjur (597.9 +) @sv
alternative label: Salamanderdjur (597.9) @sv
alternative label: Skogsödla (597.9) @sv
alternative label: Sköldpaddor, zoologi (597.9) @sv
alternative label: Snokar (597.9) @sv
alternative label: Strypormar (597.9) @sv
alternative label: Vanlig groda (597.9) @sv
alternative label: Ägg, zoologi, reptiler (597.9) @sv
alternative label: Ödlor, zoologi (597.9) @sv
broader: Systemaattinen eläintiede
in scheme: URN:NBN:fi:au:hklj:
narrower: Kalat
narrower: Linnut
narrower: Nisäkkäät
notation: 597.9
preferred label: Vertebrates @en
preferred label: Ryggradsdjur @sv
related: Paleontologia
related: Luonto-oppaat. Oppikirjat
related: Systemaattinen kasvitiede
related: Eläinmorfologia. Eläinanatomia
related: Eläinfysiologia
related: Eläinekologia
related: Eläinmaantiede
related: Lemmikkieläimet
scope note: Selkärankaisten systematiikka ja lajinmääritysoppaat Selkärankaisten morfologia, anatomia, fysiologia, etologia, ekologia ja eläinmaantiede Selkärankaisten lisääntyminen Sammakkoeläimet. Salamanterit. Sammakot Matelijat. Liskot. Käärmeet. Krokotiilit
scope note: Ryggradsdjurens systematik och handböcker i artbestämning av ryggradsdjur Ryggradsdjurens morfologi, anatomi, fysiologi, etologi, ekologi och djurgeografi Ryggradsdjurens fortplantning Groddjur. Salamandrar. Grodor Kräldjur. Ödlor. Ormar. Krokodiler @sv

Paperi- ja selluloosateollisuus
type: Class
type: Concept
subclass of: METALLITEOLLISUUS. PUUNJALOSTUSTEOLLISUUSSÄHKÖTEKNINEN TEOLLISUUS TEKSTIILI- JA NAHKATEOLLISUUS
alternative label: Ainespuu , paperi- ja selluteollisuus (636)
alternative label: Arkkipaperi, paperiteollisuus (636)
alternative label: Ensiöpaperi (636)
alternative label: Haapa, puunjalostusteollisuus (634 ... 636)
alternative label: Hake, metsäteollisuus (634 ... 636)
alternative label: Haketus, metsäteollisuus (634 ... 636)
alternative label: Harvennuspuu, metsäteollisuus (634 ... 636)
alternative label: Havupuut, puuteollisuus (634 ... 636)
alternative label: Hemiselluloosa, puunjalostusteollisuus (636)
alternative label: Hienopaperi (636)
alternative label: Hierre (636)
alternative label: Hioke, puunjalostusteollisuus (636)
alternative label: Hionta, puunjalostusteollisuus (636)
alternative label: Jätepaperi, paperiteollisuus (636)
alternative label: Jätepuu, puuteollisuus (634 ... 636)
alternative label: Kartonki (636)
alternative label: Kartonkiteollisuus (636)
alternative label: Kemiallinen massa (636)
alternative label: Kemiallinen metsäteollisuus (636)
alternative label: Kemiallinen puunjalostusteollisuus (636)
alternative label: Kertakäyttöpakkaukset, paperi- ja pahviteollisuus (636)
alternative label: Keräyspaperi, paperiteollisuus (636)
alternative label: Kierrätyskuidut, paperiteollisuus (636)
alternative label: Koivu, puunjalostusteollisuus (634 ... 636)
alternative label: Kotelointi, pakkaukset, pahvi- ja paperiteollisuus (636)
alternative label: Kotelot, pahvi- ja paperiteollisuus (636)
alternative label: Kuitupuu, metsäteollisuus (634 ... 636)
alternative label: Kuusi, puunjalostusteollisuus (634 ... 636)
alternative label: Käsintehty paperi, paperiteollisuus (636)
alternative label: Laatikot, pahvilaatikot (636)
alternative label: Laminaatti, puunjalostusteollisuus (636)
alternative label: Lautasliinat, paperiteollisuus (636)
alternative label: Lehmus, puunjalostusteollisuus (634 ... 636)
alternative label: Lehtipuut, puunjalostusteollisuus (634 ... 636)
alternative label: Leppä, puunjalostusteollisuus (634 ... 636)
alternative label: Ligniini, puunjalostusteollisuus (636)
alternative label: Lignoselluloosa, puunjalostusteollisuus (636)
alternative label: Liimapuu, massa- ja paperiteollisuus (636)
alternative label: Massa, massateollisuus (636)
alternative label: Massa- ja paperiteollisuus (636)
alternative label: Massanvalmistus, kemiallinen massa (636)
alternative label: Massateollisuus, kemiallinen (636)
alternative label: Mekaaninen massa (636)
alternative label: Metsäala, metsäteollisuus (634 ... 636)
alternative label: Metsäpuut, metsäteollisuus (634 ... 636)
alternative label: Metsäteollisuus, kemiallinen (636)
alternative label: Mänty, paperiteollisuus (636)
alternative label: Mäntyöljy, kemiallinen puunjalostusteollisuus (636)
alternative label: Nanoselluloosa, selluloosateollisuus (636)
alternative label: Narut, paperiteollisuus (636)
alternative label: Pahvi (636)
alternative label: Pahviteollisuus (636)
alternative label: Painopaperi, paperiteollisuus (636)
alternative label: Pakkaukset, pahvi- ja paperiteollisuus (636)
alternative label: Pakkausjätteet , pahvi- ja paperiteollisuus (636)
alternative label: Pakkausteollisuus, paperi- ja pahvipakkaukset (636)
alternative label: Paperi (636)
broader: METALLITEOLLISUUS. PUUNJALOSTUSTEOLLISUUSSÄHKÖTEKNINEN TEOLLISUUS TEKSTIILI- JA NAHKATEOLLISUUS
in scheme: URN:NBN:fi:au:hklj:
notation: 636
related: URN:NBN:fi:au:hklj:342
related: Ympäristönsuojelu. Luonnonsuojelu
related: Uhanalaiset lajit. Luonnonsuojelualueet
related: Maaperän, metsien ja soiden suojelu
related: Vesien suojelu
related: Ilman suojelu
related: KEMIA
related: Sovellettu kemia
related: URN:NBN:fi:au:hklj:631
related: Puuteollisuus
related: URN:NBN:fi:au:hklj:657
related: Materiaalitoiminnot. Logistiikka
related: Sisustusoppaat
related: Sisustusarkkitehtuuri
related: Paperitaide
scope note: Paperi- ja selluloosateollisuuden liiketalous, tuotantomenetelmät, rationalisointi, työt, prosessit, koneet, raaka-aineet, tuotanto ja tuotteiden kauppa Kemiallinen puunjalostusteollisuus. Puukemia Puuhioke-, selluloosa-, paperi- ja kartonkiteollisuus Puu-, jätepaperi- ja lumppuraaka-aineet. Paperin koostumus Hioke. Selluloosa. Paperimassa. Paperit. Kartongit. Pahvit Rullapaperi. Arkkipaperi. Paperi- ja kartonkijalosteet. Paperi- ja pahvipakkaukset. Tapetit teollisuustuotteina
scope note: Företagsekonomi, produktionsmetoder, rationalisering, arbete, processer, maskiner, råmaterial, produktion och handel inom pappers- och massaindustri Kemisk träförädlingsindustri. Träkemi Massa-, pappers- och kartongindustri, industriell tillverkning av slipmassa Trä, avfallspapper och lump som råmaterial. Papperets sammansättning Slipmassa. Kemisk massa. Pappersmassa. Papper. Kartong. Papp Rullpapper. Arkpapper. Pappers-och kartongfabrikat. Pappers- och pappförpackningar. Tapeter som industriella produkter @sv

Nautaeläimet
type: Class
type: Concept
subclass of: URN:NBN:fi:au:hklj:654
alternative label: Automaattilypsy (654.2)
alternative label: Ayrshire, nautakarja (654.2)
alternative label: Emolehmät (654.2)
alternative label: Härät (654.2)
alternative label: Karjanhoito (654.2)
alternative label: Karjanlanta, karjatalous (654.2)
alternative label: Karjantarkkailu (654.2)
alternative label: Karjatalous (654.2)
alternative label: Karjatilat (654.2)
alternative label: Kylmäpihatot, karjanhoito (654.2)
alternative label: Laama, kotieläimet (654.2)
alternative label: Lehmät, kotieläimet (654.2)
alternative label: Liha, lihakarja (654.2)
alternative label: Lihakarja (654.2)
alternative label: Lihakarjatilat (654.2)
alternative label: Lihatalous, lihakarjan hoito (654.2)
alternative label: Lypsy (654.2)
alternative label: Lypsyasemat (654.2)
alternative label: Lypsykarja (654.2)
alternative label: Lypsykarjatilat (654.2)
alternative label: Lypsykoneet (654.2)
alternative label: Lypsäminen (654.2)
alternative label: Maidontuotanto, karjanhoito (654.2)
alternative label: Maitokarja (654.2)
alternative label: Maitotalous, karjanhoito (654.2)
alternative label: Maitotilat (654.2)
alternative label: Maitotuotos (654.2)
alternative label: Märehtijät, kotieläimet, nauta (654.2)
alternative label: Naudat, karjanhoito (654.2)
alternative label: Nauta, karjanhoito (654.2)
alternative label: Nautaeläimet, karjanhoito (654.2)
alternative label: Nautakarja (654.2)
alternative label: Nautakarjatilat (654.2)
alternative label: Navetat, karjanhoito (654.2)
alternative label: Onttosarviset, karjanhoito (654.2)
alternative label: Paimennus, nautaeläimet, karjanhoito (654.2)
alternative label: Parsinavetat, karjanhoito (654.2)
alternative label: Pihatot, karjanhoito (654.2)
alternative label: Puhvelit, kotieläimet (654.2)
alternative label: Robottilypsy (654.2)
alternative label: Separaattorit, maitotalous (654.2)
alternative label: Sonnit (654.2)
alternative label: Ternimaito, karjatalous (654.2)
alternative label: Vasikat (654.2)
alternative label: Automatmjölkning (654.2) @sv
alternative label: Ayrshire, nötboskap (654.2) @sv
alternative label: Boskapsfarmer (654.2) @sv
alternative label: Boskapskontroll (654.2) @sv
alternative label: Boskapsskötsel (654.2) @sv
alternative label: Bufflar, husdjur (654.2) @sv
alternative label: Båsladugårdar, boskapsskötsel (654.2) @sv
alternative label: Dikor (654.2) @sv
alternative label: Idisslare, husdjur, nötkreatur (654.2) @sv
alternative label: Kalvar (654.2) @sv
alternative label: Kor, djur, husdjur (654.2) @sv
alternative label: Kreatursgödsel, boskapsskötsel (654.2) @sv
alternative label: Kreatursskötsel (654.2) @sv
broader: URN:NBN:fi:au:hklj:654
in scheme: URN:NBN:fi:au:hklj:
notation: 654.2
related: URN:NBN:fi:au:hklj:576
related: URN:NBN:fi:au:hklj:590
related: Eläintarhat
related: Eläinsuojelu
related: Systemaattinen eläintiede
related: Nisäkkäät
related: Eläinten vetämät kulkuneuvot
related: URN:NBN:fi:au:hklj:649.91
related: Maatalouspolitiikka
related: URN:NBN:fi:au:hklj:650.2
related: URN:NBN:fi:au:hklj:651
related: URN:NBN:fi:au:hklj:657
related: Eläinlääketiede
related: Rakennusten erillistilat
related: URN:NBN:fi:au:hklj:691.13
scope note: Naudat ja niiden hoito. Nautarodut Maito- ja lihakarjatalous. Navetan hoito Maito- ja lihakarjan hoito ja hoitovälineet Lypsy ja lypsykoneet Nautojen sairaudet ja niiden hoito Tässä myös puhvelit, laamat, kamelit ja muut märehtijät kotieläiminä
scope note: Nötkreatur och boskapsskötsel. Nötkreaturens raser Uppfödning av mjölk- och biffdjur. Skötsel av ladugårdar Skötsel av mjölk- och biffdjur samt redskap för skötseln Mjölkning och mjölkmaskiner Nötkreturens sjukdomar och behandling av dem Hit också bufflar, lamor, kameler och andra idisslare som husdjur @sv

Siat
type: Class
type: Concept
subclass of: URN:NBN:fi:au:hklj:654
alternative label: Emakot, kotieläimet (654.4)
alternative label: Karjut, kotieläimet (654.4)
alternative label: Porsaat, sikatalous (654.4)
alternative label: Porsiminen, sika (654.4)
alternative label: Sianhoito (654.4)
alternative label: Sika, kotieläimet (654.4)
alternative label: Sikalat, sikatalous (654.4)
alternative label: Sikatalous (654.4)
alternative label: Sikatilat (654.4)
alternative label: Galtar, husdjur (654.4) @sv
alternative label: Grisar, svinskötsel (654.4) @sv
alternative label: Grisning, svin (654.4) @sv
alternative label: Suggor, husdjur (654.4) @sv
alternative label: Svin, husdjur (654.4) @sv
alternative label: Svingårdar (654.4) @sv
alternative label: Svinhus, svinuppfödning (654.4) @sv
alternative label: Svinskötsel (654.4) @sv
alternative label: Svinuppfödning (654.4) @sv
broader: URN:NBN:fi:au:hklj:654
in scheme: URN:NBN:fi:au:hklj:
notation: 654.4
preferred label: Pigs @en
preferred label: Svin @sv
related: URN:NBN:fi:au:hklj:576
related: URN:NBN:fi:au:hklj:590
related: Eläintarhat
related: Eläinsuojelu
related: Systemaattinen eläintiede
related: Nisäkkäät
related: Eläinten vetämät kulkuneuvot
related: URN:NBN:fi:au:hklj:649.91
related: Maatalouspolitiikka
related: URN:NBN:fi:au:hklj:650.2
related: URN:NBN:fi:au:hklj:651
related: URN:NBN:fi:au:hklj:657
related: Eläinlääketiede
related: Rakennusten erillistilat
related: URN:NBN:fi:au:hklj:691.13
scope note: Siat ja niiden hoito. Sikarodut Sikatalous. Sikalan hoito Sikojen sairaudet ja niiden hoito
scope note: Svin och svinskötsel. Svinraser Svinuppfödning. Skötsel av svinhus Svinsjukdomar och behandling av dem @sv

Kissat
type: Class
type: Concept
subclass of: Lemmikkieläimet
alternative label: Barffaus, kissat (654.92)
alternative label: Kesykissa (654.92)
alternative label: Kissa (654.92)
alternative label: Kissankasvattajat (654.92)
alternative label: Kissanäyttelyt (654.92)
alternative label: Kissat (654.92)
alternative label: Kulkukissat (654.92)
alternative label: Pennut, kissanpennut (654.92)
alternative label: Raakaruokinta, kissat (654.92)
alternative label: Raapimispuut, kissat (654.92)
alternative label: Trimmaus, kissat (654.92)
alternative label: BARF-utfodring, katter (654.92) @sv
alternative label: Barfutfodring, katter (654.92) @sv
alternative label: Katt (654.92) @sv
alternative label: Kattuppfödare (654.92) @sv
alternative label: Kattutställningar (654.92) @sv
alternative label: Klösträd, katter (654.92) @sv
alternative label: Strykarkatter (654.92) @sv
alternative label: Tamkatt (654.92) @sv
alternative label: Trimning, katter (654.92) @sv
alternative label: Valpar, kattungar (654.92) @sv
broader: Lemmikkieläimet
in scheme: URN:NBN:fi:au:hklj:
notation: 654.92
preferred label: Cats @en
preferred label: Katter @sv
related: URN:NBN:fi:au:hklj:576
related: URN:NBN:fi:au:hklj:590
related: Eläintarhat
related: Eläinsuojelu
related: Systemaattinen eläintiede
related: Nisäkkäät
related: Eläinten vetämät kulkuneuvot
related: URN:NBN:fi:au:hklj:649.91
related: Maatalouspolitiikka
related: URN:NBN:fi:au:hklj:650.2
related: URN:NBN:fi:au:hklj:651
related: URN:NBN:fi:au:hklj:657
related: Eläinlääketiede
related: Rakennusten erillistilat
related: URN:NBN:fi:au:hklj:691.13
scope note: Kissat ja niiden hoito. Kissarodut Kissojen kasvatus ja kauppa. Kissanäyttelyt Kissan käyttäytyminen Kissan sairaudet ja niiden hoito
scope note: Katter och skötsel av katter. Kattraser Uppfödning av och handel med katter. Kattutställningar Kattens beteende Kattsjukdomar och behandling av dem @sv

Maalaustyöt
type: Class
type: Concept
subclass of: Rakennustyöt. Rakennusaineet. Rakennustarvikkeet
alternative label: Jauhemaalaus, maalaustyöt (667.12)
alternative label: Lahontorjunta (667.12)
alternative label: Lakat, rakennustyöt (667.12)
alternative label: Lakkatyöt, rakennustyöt (667.12)
alternative label: Lakkaus, rakennustyöt (667.12)
alternative label: Maalaamot (667.12)
alternative label: Maalarit, maalarin työ (667.12)
alternative label: Maalaus, maalarin työ (667.12)
alternative label: Maalausala (667.12)
alternative label: Maalaustarvikkeet, maalaustyöt (667.12)
alternative label: Maalaustyöt (667.12)
alternative label: Maalausvälineet, maalaustyöt (667.12)
alternative label: Maalit, maalarin työ (667.12)
alternative label: Petsaus, rakennustyöt (667.12)
alternative label: Pintakäsittely, maalaus, lakkaus (667.12)
alternative label: Puunsuojaus, talonrakennus (667.12)
alternative label: Ruiskumaalaus (667.12)
alternative label: Ruiskutus, ruiskumaalaus (667.12)
alternative label: Verhoukset, maalaus, lakkaus (667.12)
alternative label: Viimeistelytyöt, maalaus (667.12)
alternative label: Väriaineet, rakennuksen maalaustyöt (667.12)
alternative label: Öljymaalit, maalarin työ (667.12)
alternative label: Beklädnad, panel, målning, lackering (667.12) @sv
alternative label: Besprutning, sprutmålning (667.12) @sv
alternative label: Betsning, byggnadsarbeten (667.12) @sv
alternative label: Färdigställande, målning (667.12) @sv
alternative label: Färgämnen, byggnadens målningsarbeten (667.12) @sv
alternative label: Lackarbeten, byggnadsarbeten (667.12) @sv
alternative label: Lacker, byggnadsarbeten (667.12) @sv
alternative label: Lackering, byggnadsarbeten (667.12) @sv
alternative label: Målarbranschen (667.12) @sv
alternative label: Målare, målarens arbete (667.12) @sv
alternative label: Målarredskap, målningsarbeten (667.12) @sv
alternative label: Målarutrustning, målningsarbeten (667.12) @sv
alternative label: Målerifirmor (667.12) @sv
alternative label: Målfärger, målarens arbete (667.12) @sv
alternative label: Målning, målarens arbete (667.12) @sv
alternative label: Målningsarbeten (667.12) @sv
alternative label: Oljefärger, målarens arbete (667.12) @sv
alternative label: Pulverlackering, målningsarbeten (667.12) @sv
alternative label: Rötavvärjning (667.12) @sv
alternative label: Sprutmålning (667.12) @sv
alternative label: Träskydd, husbyggnad (667.12) @sv
alternative label: Ytbehandling, målning, lackering (667.12) @sv
broader: Rakennustyöt. Rakennusaineet. Rakennustarvikkeet
in scheme: URN:NBN:fi:au:hklj:
notation: 667.12
preferred label: Painting and decorating @en
preferred label: Målningsarbeten @sv
related: Energia
related: Raideliikenneväylät. Junat. Raitiovaunut. Metro
related: Kemian teollisuus
related: Rakennusstatiikka. Rakennusaineet
related: Tekninen rakennussuunnittelu
related: Geotekniikka. Maatyöt
related: Rakenneosat
related: Rakennuksen kunnossapito
related: HIENOMEKANIIKKA. KÄSI- JA KOTITEOLLISUUS
related: Kodin korjaustöiden oppaat
related: Sisustusoppaat
related: URN:NBN:fi:au:hklj:720
related: URN:NBN:fi:au:hklj:721
related: URN:NBN:fi:au:hklj:726
related: URN:NBN:fi:au:hklj:767
scope note: Rakennuksen maalaus-, lakkaus- ja puunkyllästystyöt sekä niihin liittyvät työkalut ja tarvikkeet Maalaus-, lakkaus- ja puunkyllästystyöt myös talon kunnossapidon ja korjauksen kannalta Maalarin työ yleensä
scope note: Målning, lackering och träimpregnering av hus samt tillhörande verktyg och material Också målning, lackering och träimpregnering som hänför sig till underhåll och reparation av hus Målarens arbete i allmänhet @sv

Alkuperäiskansojen arkkitehtuuri
type: Class
type: Concept
subclass of: URN:NBN:fi:au:hklj:720.9
alternative label: Afrikka, arkkitehtuuri, perinteinen (720.901)
alternative label: Alkuperäiskansat, arkkitehtuuri (720.901)
alternative label: Amerikka, arkkitehtuuri, alkuperäiskansat (720.901)
alternative label: Asteekit, arkkitehtuuri (720.901)
alternative label: Atsteekit, arkkitehtuuri (720.901)
alternative label: Australia, arkkitehtuuri, aboriginaalit (720.901)
alternative label: Etelä-Amerikka, arkkitehtuuri, alkuperäiskansat (720.901)
alternative label: Inkat, arkkitehtuuri (720.901)
alternative label: Intiaanit, arkkitehtuuri (720.901)
alternative label: Luonnonkansat, arkkitehtuuri (720.901)
alternative label: Mayat, arkkitehtuuri (720.901)
alternative label: Oseania, arkkitehtuuri, aboriginaalien (720.901)
alternative label: Pohjois-Amerikka, arkkitehtuuri, alkuperäiskansat (720.901)
alternative label: Primitiivinen taide, arkkitehtuuri (720.901)
alternative label: Primitiiviset kansat, arkkitehtuuri (720.901)
alternative label: Tolteekit, arkkitehtuuri (720.901)
alternative label: Afrika, arkitektur, traditionell (720.901) @sv
alternative label: Amerika, arkitektur, urbefolkningar (720.901) @sv
alternative label: Australien, arkitektur, aboriginer (720.901) @sv
alternative label: Azteker, asteekit, arkitektur (720.901) @sv
alternative label: Azteker, atsteekit, arkitektur (720.901) @sv
alternative label: Indianer, arkitektur (720.901) @sv
alternative label: Inkaindianer, arkitektur (720.901) @sv
alternative label: Mayafolket, arkitektur (720.901) @sv
alternative label: Naturfolk, arkitektur (720.901) @sv
alternative label: Nordamerika, arkitektur, urbefolkningar (720.901) @sv
alternative label: Oceanien, arkitektur, aboriginers (720.901) @sv
alternative label: Primitiv konst, arkitektur (720.901) @sv
alternative label: Primitiva folk, arkitektur (720.901) @sv
alternative label: Sydamerika, arkitektur, urbefolkningar (720.901) @sv
alternative label: Tolteker, arkitektur (720.901) @sv
alternative label: Urbefolkningar, arkitektur (720.901) @sv
broader: URN:NBN:fi:au:hklj:720.9
in scheme: URN:NBN:fi:au:hklj:
notation: 720.901
preferred label: Aboriginal architecture @en
preferred label: Ursprungsfolkens arkitektur @sv
related: URN:NBN:fi:au:hklj:709
related: Alkuperäiskansojen taide
related: Arkkitehtuurikilpailut. Arkkitehtuurinäyttelyt. Arkkitehtuuripalkinnot
related: Vanhan ajan arkkitehtuuri. Euroopan ulkopuolisten vanhojen kulttuurien arkkitehtuuri
related: Eurooppa
related: Aasia
related: Afrikka
related: Amerikka
related: Yhdysvallat
related: Australia. Oseania
related: URN:NBN:fi:au:hklj:749.1
scope note: Maasta tai maanosasta riippumatta eskimoiden, intiaanien, saamelaisten sekä Aasian, Afrikan, Australian ja Oseanian alkuperäiskansojen arkkitehtuuri yleensä Tässä myös intiaanien korkeakulttuurien arkkitehtuuri Alkuperäiskansojen erikoisalojen arkkitehtuuri alan mukaisessa luokassa
scope note: Eskimåernas, indianernas, samernas samt de asiatiska, afrikanska, australiska och oceaniska ursprungsfolkens arkitektur i allmänhet oavsett land eller världsdel Hit också de indianska högkulturernas arkitektur i allmänhet Specialområden inom ursprungsfolkens arkitektur klassificeras enligt område @sv

Vanhan ajan kuvanveistotaide. Euroopan ulkopuolisten vanhojen kulttuurien kuvanveistotaide
type: Class
type: Concept
subclass of: URN:NBN:fi:au:hklj:730.9
alternative label: Aasia, kuvanveisto, perinteinen (730.903)
alternative label: Antiikki, kuvanveisto (730.903)
alternative label: Egypti, kuvanveisto, muinaisajan (730.903)
alternative label: Etruskit, kuvanveisto (730.903)
alternative label: Intia, kuvanveisto, perinteinen (730.903)
alternative label: Itämaat, kuvanveisto, perinteinen (730.903)
alternative label: Japani, kuvanveisto, perinteinen (730.903)
alternative label: Kiina, kuvanveisto, perinteinen (730.903)
alternative label: Kreikka, kuvanveisto, antiikki (730.903)
alternative label: Kuvanveistäjät, elämäkerralliset hakuteokset (730.903 ... 730.9903)
alternative label: Persia, kuvanveisto, muinaisaika (730.903)
alternative label: Riemukaaret, antiikin kuvanveisto (730.903)
alternative label: Rooman valtakunta, kuvanveisto (730.903)
alternative label: Sfinksit, kuvanveistotaide, antiikki (730.903)
alternative label: Antiken, skulptur (730.903) @sv
alternative label: Asien, skulptur, traditionell (730.903) @sv
alternative label: Egypten, skulptur, forntidens (730.903) @sv
alternative label: Etrusker, skulptur (730.903) @sv
alternative label: Grekland, skulptur, antiken (730.903) @sv
alternative label: Indien, skulptur, traditionell (730.903) @sv
alternative label: Japan, skulptur, traditionell (730.903) @sv
alternative label: Kina, skulptur, traditionell (730.903) @sv
alternative label: Orienten, skulptur, traditionell (730.903) @sv
alternative label: Persien, skulptur, forntiden (730.903) @sv
alternative label: Romerska riket, skulptur (730.903) @sv
alternative label: Sfinxer, skulptur, antiken (730.903) @sv
alternative label: Skulptörer, biografiska uppslagsverk (730.903 ... 730.9903) @sv
alternative label: Triumfbågar, antikens skulptur (730.903) @sv
broader: URN:NBN:fi:au:hklj:730.9
in scheme: URN:NBN:fi:au:hklj:
notation: 730.903
preferred label: Ancient sculpture. Sculpture in ancient non-European cultures @en
preferred label: Forntidens skulptur. Utomeuropeiska fornkulturers skulptur @sv
related: URN:NBN:fi:au:hklj:709
related: Euroopan ulkopuolisten vanhojen kulttuurien taide
related: Antiikin taidehistoria
related: Alkuperäiskansojen kuvanveistotaide
related: Keskiajan kuvanveistotaide
related: Eurooppa
related: Etelä-Eurooppa
related: Italia
related: Aasia
related: Afrikka
related: Kuvanveistotaiteen materiaalit ja tekniikka
related: URN:NBN:fi:au:hklj:739
related: URN:NBN:fi:au:hklj:742
scope note: Maasta tai maanosasta riippumatta vanhan ajan ja antiikin kuvanveistotaide Muinaisen Kreikan ja Rooman valtakunnan kuvanveistotaide Minolainen, mykeneläinen ja hellenistinen kuvanveistotaide Etruskien kuvanveistotaide Euroopan ulkopuolisten vanhojen korkeakulttuurien kuvanveistotaide Itämaisten kulttuurien perinteinen kuvanveistotaide Tässä esim. Kiinan, Japanin, Intian, Persian, Mesopotamian ja Egyptin kuvanveistotaide. Netsuke
scope note: Forntidens och antikens skulptur oavsett land eller världsdel Skulpturen i det antika Grekland och Romarriket Minoisk, mykensk och hellenistisk skulptur Etruskernas skulptur De utomeuropeiska forna högkulturernas skulptur De österländska kulturernas traditionella skulptur Hit t.ex. de kinesiska, japanska, indiska, persiska, mesopotamiska och egyptiska fornkulturernas skulptur. Netsuke @sv

Taidegrafiikan materiaalit ja tekniikka
type: Class
type: Concept
subclass of: Taidegrafiikka
alternative label: Akvatinta, taidegrafiikan tekniikka (753.1)
alternative label: Alastonmalli, taidegrafiikan historia (753.1)
alternative label: Asetelmat, taidegrafiikan tekniikka (753.1)
alternative label: Carborundum. taidegrafiikan tekniikka (753.1)
alternative label: Etsaus, tadegrafiikan tekniikat (753.1)
alternative label: Kaiverrus, taidegrafiikan tekniikka (753.1)
alternative label: Karborundum. taidegrafiikan tekniikka (753.1)
alternative label: Kivipaino, graafinen taide, tekniikka (753.1)
alternative label: Kivipiirros, graafinen taide, tekniikka (753.1)
alternative label: Kliseet, taidegrafiikan tekniikka (753.1)
alternative label: Kuivaneula, taidegrafiikan tekniikka (753.1)
alternative label: Kuparipiirros, taidegrafiikan tekniikka (753.1)
alternative label: Käsipaino, taidegrafiikan tekniikka (753.1)
alternative label: Linoleikkaustekniikka (753.1)
alternative label: Linopiirrostekniikka (753.1)
alternative label: Litografia, graafinen taide, tekniikka (753.1)
alternative label: Luonnokset, graafinen taide, tekniikka (753.1)
alternative label: Materiaalit, graafinen taide (753.1)
alternative label: Mezzotinto, taidegrafiikan tekniikka (753.1)
alternative label: Monotypia, taidegrafiikan materiaalit ja tekniikka (753.1)
alternative label: Muotokuvat, taidegrafiikan tekniikka (753.1)
alternative label: Omakuvat, taidegrafiikka, tekniikka (753.1)
alternative label: Painokuvat, graafisen taiteen tekniikka (753.1)
alternative label: Painovärit, grafiikan tekniikka (753.1)
alternative label: Puupiirros, puupiirrostekniikka (753.1)
alternative label: Radeeraustekniikka (753.1)
alternative label: Serigrafia, taidegrafiikan tekniikka (753.1)
alternative label: Seripaino, taidegrafiikan tekniikka (753.1)
alternative label: Silkkipaino, taidegrafiikan tekniikka (753.1)
alternative label: Syövytys, taidegrafiikan tekniikka (753.1)
alternative label: Taidegrafiikka, tekniikka (753.1)
alternative label: Taideharrastukset, taidegrafiikan tekniikka (753.1)
alternative label: Teräspiirrostekniikka (753.1)
alternative label: Vaskipiirrostekniikka (753.1)
alternative label: Vedostus, graafisen taiteen tekniikka (753.1)
alternative label: Viivasyövytys, taidegrafiikan tekniikat (753.1)
alternative label: Väriaineet, graafiset taiteen tekniikka (753.1)
alternative label: Värigrafiikka, materiaalit ja tekniikka (753.1)
alternative label: Värit, graafisen taiteen tekniikka (753.1)
alternative label: Akvatint, konstgrafikens teknik (753.1) @sv
alternative label: Avdragning, grafisk konst, teknik (753.1) @sv
alternative label: Etsning, konstgrafikens teknik (753.1) @sv
alternative label: Frätning, konstgrafikens teknik (753.1) @sv
alternative label: Färger, grafisk konst, teknik (753.1) @sv
alternative label: Färggrafik, material och teknik (753.1) @sv
alternative label: Färgämnen, grafisk konst, teknik (753.1) @sv
alternative label: Gravering, konstgrafikens teknik (753.1) @sv
alternative label: Handtryck, boktryck, konstgrafikens teknik (753.1) @sv
alternative label: Karborundumtryck, konstgrafikens teknik (753.1) @sv
alternative label: Klichéer, konstgrafikens teknik (753.1) @sv
alternative label: Konstgrafik, teknik (753.1) @sv
alternative label: Konstintressen, konstgrafikens teknik (753.1) @sv
alternative label: Kopparstick, konstgrafikens teknik (753.1) @sv
alternative label: Kopparstickteknik (753.1) @sv
alternative label: Linjeetsning, konstgrafikens teknik (753.1) @sv
alternative label: Linoleumsnittsteknik (753.1) @sv
alternative label: Linosnittsteknik (753.1) @sv
broader: Taidegrafiikka
in scheme: URN:NBN:fi:au:hklj:
notation: 753.1
related: Kirjapainotaito. Graafinen teollisuus
related: Oppikirjat. Harjoituskirjat. Tehtäväkokoelmat. Taiteen materiaalit ja tekniikka. Taidekasvatus
related: MAALAUSTAIDE. PIIRUSTUSTAIDE
related: URN:NBN:fi:au:hklj:740.9
related: URN:NBN:fi:au:hklj:741
related: URN:NBN:fi:au:hklj:741.1
related: URN:NBN:fi:au:hklj:741.2
related: URN:NBN:fi:au:hklj:742
related: URN:NBN:fi:au:hklj:749.1
related: Piirustuksen materiaalit ja tekniikka
related: Graafisen taiteen teoria, estetiikka ja filosofia
related: Kuvitustaide
related: Käyttögrafiikka
related: URN:NBN:fi:au:hklj:756
related: Valokuvauksen materiaalit ja tekniikka. Valokuvausoppaat
scope note: Taidegrafiikan materiaaleja ja tekniikkaa koskevat käytännön oppaat Puupiirros-, etsaus-, kivipiirros-, vaskipiirros-, kuparipiirros-, teräspiirros-, mezzotinta-, akvatinta-, kuivaneula-, linoleikkaus-, silkkipaino- ja serigrafiatekniikka. Värigrafiikan tekniikat
scope note: Praktiska handböcker i konstgrafikens material och tekniker Träsnitts-, etsnings-, litografi-, kopparblandnings-, kopparsticks-, stålsticks-, mezzotint-, akvatint-, torrnåls-, linoleumsnitts-, screentrycks- och serigrafiteknik. Färggrafikens tekniker @sv

Neulonta
type: Class
type: Concept
subclass of: URN:NBN:fi:au:hklj:764
alternative label: Asusteet, neulonta (764.6)
alternative label: Huivit, neulontaohjeet (764.6)
alternative label: Juhlapuvut, vaatteiden neulonta (764.6)
alternative label: Juhlavaatteet, vaatteiden neulonta (764.6)
alternative label: Kirjoneuleet (764.6)
alternative label: Kohoneuleet (764.6)
alternative label: Koneneulonta (764.6)
alternative label: Kotivalmistus, vaatteet, neulonta (764.6)
alternative label: Käsineet, neulonta (764.6)
alternative label: Käsityöt, neulonta (764.6)
alternative label: Lapaset, neulonta (764.6)
alternative label: Lastenvaatteet, neulontaohjeet (764.6)
alternative label: Neulakinnastekniikka (764.6)
alternative label: Neulekoneet, käyttö (764.6)
alternative label: Neuletyöt (764.6)
alternative label: Neulonta (764.6)
alternative label: Ohjekirjat, neulonta (764.6)
alternative label: Pukineet, neulonta (764.6)
alternative label: Päähineet, neulontaohjeet (764.6)
alternative label: Saalit, neulotut (764.6)
alternative label: Shaalit, neulotut (764.6)
alternative label: Sukat, neulontaohjeet (764.6)
alternative label: Takit, neulonta (764.6)
alternative label: Tekstiilityö, neulonta (764.6)
alternative label: Tupsut, käsityöt, neulonta (764.6)
alternative label: Vaatetustyö, neulonta (764.6)
alternative label: Vaatteet, neulonta (764.6)
alternative label: Vauvanvaatteet, neulontaohjeet (764.6)
alternative label: Villapaidat, neulonta (764.6)
alternative label: Villatakit, neulonta (764.6)
alternative label: Accessoarer, stickning (764.6) @sv
alternative label: Babykläder, stickbeskrivningar (764.6) @sv
alternative label: Barnkläder, stickbeskrivningar (764.6) @sv
alternative label: Beklädnadsarbete, stickning (764.6) @sv
alternative label: Festdräkter, stickning av kläder (764.6) @sv
alternative label: Festkläder, stickning av kläder (764.6) @sv
alternative label: Handarbeten, stickning (764.6) @sv
alternative label: Handskar, stickning (764.6) @sv
alternative label: Hemtillverkning, kläder, stickning (764.6) @sv
alternative label: Huvudbonader, stickbeskrivningar (764.6) @sv
alternative label: Instruktionsböcker, stickning (764.6) @sv
alternative label: Kappor, stickning (764.6) @sv
alternative label: Kläddesign, stickning av kläder (764.6) @sv
alternative label: Kläder, stickning (764.6) @sv
alternative label: Klädesplagg, stickning (764.6) @sv
alternative label: Maskinstickning (764.6) @sv
alternative label: Mönsterstickade plagg (764.6) @sv
alternative label: Nålbindningsteknik (764.6) @sv
alternative label: Schalar, stickade (764.6) @sv
alternative label: Sjalar, stickade (764.6) @sv
alternative label: Skarfar, stickbeskrivningar (764.6) @sv
alternative label: Stickade plagg (764.6) @sv
alternative label: Stickmaskiner, användning (764.6) @sv
alternative label: Stickning (764.6) @sv
alternative label: Strukturstickning (764.6) @sv
alternative label: Strumpor, stickbeskrivningar (764.6) @sv
alternative label: Textilslöjd, stickning (764.6) @sv
alternative label: Tofsar, handarbeten, stickning (764.6) @sv
alternative label: Vantar, stickning (764.6) @sv
alternative label: Yllekoftor, stickning (764.6) @sv
broader: URN:NBN:fi:au:hklj:764
in scheme: URN:NBN:fi:au:hklj:
narrower: Virkkaus. Pitsinvirkkaus. Koukkuaminen. Nypläys
notation: 764.6
related: Tekstiili- ja vaatetusteollisuus
related: Kodin korjaustöiden oppaat
related: Pukeutuminen. Kauneudenhoito
related: Taideteollisuuden teoria, estetiikka ja filosofia
related: Antiikkiesineiden keräily
related: Taideteollisuuden historia
related: Ompelu
related: URN:NBN:fi:au:hklj:767
related: Leikkikalut
related: URN:NBN:fi:au:hklj:798
related: Muodin historia
scope note: Vaatteiden ja muiden tekstiilien käsin- ja koneneulonta Neulonnan historia, materiaalit, tekniikka ja estetiikka Neulontaohjeet ja -mallit. Neulekoneiden käyttö
scope note: Stickning av kläder och andra textilier för hand och med maskin Stickningens historia, material, tekniker och estetik Stickbeskrivningar och stickmönster. Användning av stickningsmaskiner @sv

Yksinlaulu
type: Class
type: Concept
subclass of: URN:NBN:fi:au:hklj:783
alternative label: Altto, laulumusiikki (783.2 +)
alternative label: Baritoni, laulumusiikki (783.2 +)
alternative label: Basso, laulumusiikki (783.2 +)
alternative label: Bassobaritoni, laulumusiikki (783.2 +)
alternative label: Jodlaus, äänenmuodostus (783.2)
alternative label: Joikaaminen, äänenmuodostus (783.2)
alternative label: Kansanlaulut, yksinlaulusovitukset (783.2 +)
alternative label: Karaoke, laulaminen (783.2 +)
alternative label: Kastraattilaulajat, äänenmuodostus (783.2)
alternative label: Koloratuuri, laulumusiikki (783.2 +)
alternative label: Kontra-altto, laulumusiikki (783.2 +)
alternative label: Kontratenori, laulumusiikki (783.2 +)
alternative label: Kurkkulaulu (783.2 +)
alternative label: Laulu, yksinlaulu (783.2 +)
alternative label: Laulu, äänenmuodostus (783.2)
alternative label: Laulut, yksinlaulut (783.2 +)
alternative label: Lauluäänet, laulumusiikki (783.2 +)
alternative label: Liedit, yksinlaulu (783.2 +)
alternative label: Mezzosopraano, laulumusiikki (783.2 +)
alternative label: Sopraano, laulumusiikki (783.2 +)
alternative label: Tenori, laulumusiikki (783.2 +)
alternative label: Yksinlaulu (783.2 +)
alternative label: Yksinlaulut (783.2 +)
alternative label: Äänenkäyttö, laulu (783.2 +)
alternative label: Äänenmuodostus, laulu (783.2 +)
alternative label: Äänenmurros, laulaminen (783.2 +)
alternative label: Äänialat, lauluääni (783.2 +)
alternative label: Ääniharjoitukset, laulaminen (783.2 +)
alternative label: Alt, vokalmusik (783.2 +) @sv
alternative label: Baryton, vokalmusik (783.2 +) @sv
alternative label: Bas, vokalmusik (783.2 +) @sv
alternative label: Basbaryton, vokalmusik (783.2 +) @sv
alternative label: Folkvisor, solosångarrangemang (783.2 +) @sv
alternative label: Joddling, tonbildning (783.2) @sv
alternative label: Jojkning, tonbildning (783.2) @sv
alternative label: Karaoke, sång (783.2 +) @sv
alternative label: Kastratsångare, tonbildning (783.2) @sv
alternative label: Koloratur, vokalmusik (783.2 +) @sv
alternative label: Kontraalt, vokalmusik (783.2 +) @sv
alternative label: Kontratenor, vokalmusik (783.2 +) @sv
alternative label: Lieder, solosång (783.2 +) @sv
alternative label: Mezzosopran, vokalmusik (783.2 +) @sv
alternative label: Målbrott, sång (783.2 +) @sv
alternative label: Röstteknik, sång (783.2 +) @sv
alternative label: Röstövningar, sång (783.2 +) @sv
alternative label: Solosång (783.2 +) @sv
alternative label: Solosånger (783.2 +) @sv
alternative label: Sopran, vokalmusik (783.2 +) @sv
alternative label: Strupsång (783.2 +) @sv
alternative label: Sång, solosång (783.2 +) @sv
alternative label: Sång, tonbildning (783.2) @sv
alternative label: Sånger, solosånger (783.2 +) @sv
alternative label: Sångstämmor, vokalmusik (783.2 +) @sv
alternative label: Tenor, vokalmusik (783.2 +) @sv
alternative label: Tonbildning, sång (783.2 +) @sv
alternative label: Tonlägen, sångröst (783.2 +) @sv
broader: URN:NBN:fi:au:hklj:783
in scheme: URN:NBN:fi:au:hklj:
narrower: Laulukoulut
narrower: Yksinlaulu ilman säestystä
narrower: Yksinlaulu pianon tai muun sointusoittimen säestyksellä
narrower: Yksinlaulu jonkin muun soittimen, soitinyhtyeen tai ääninauhan säestyksellä
narrower: Yksinlaulu orkesterin ja/tai kuoron säestyksellä
notation: 783.2
preferred label: Solo singing @en
preferred label: Solosång @sv
related: URN:NBN:fi:au:hklj:770
related: URN:NBN:fi:au:hklj:784
related: URN:NBN:fi:au:hklj:784.111
related: URN:NBN:fi:au:hklj:788
related: URN:NBN:fi:au:hklj:789
scope note: Yleiset tai sekasisältöiset yksinlaulukokoelmat Yksinlaulua koskevat yleisteokset. Äänenmuodostus Tässä ja alaluokassa myös yksinlaulua sekä sen historiaa tai henkilöhistoriaa koskeva kirjallisuus
scope note: Samlingar av solosånger med allmänt eller blandat innehåll Allmänna verk som rör solosång. Tonbildning Hit och till underklasserna också litteratur om solosång eller dess historia och personhistoria @sv

Säestyksellinen kuoromusiikki
type: Class
type: Concept
subclass of: Kuorot (yli 9 laulajaa)
alternative label: Kuoromusiikki, säestyksellinen (783.42 +)
alternative label: Kuorot, säestykselliset (783.42 +)
alternative label: Körer, ackompanjerade (783.42 +) @sv
alternative label: Körmusik, ackompanjerad (783.42 +) @sv
broader: Kuorot (yli 9 laulajaa)
in scheme: URN:NBN:fi:au:hklj:
narrower: Sekakuorot
narrower: Mieskuorot
narrower: Naiskuorot
narrower: Lapsi- ja nuorisokuorot
notation: 783.42
preferred label: Accompanied choirs @en
preferred label: Körer med ackompanjemang @sv
related: URN:NBN:fi:au:hklj:770
related: URN:NBN:fi:au:hklj:784
related: URN:NBN:fi:au:hklj:784.111
related: URN:NBN:fi:au:hklj:788
related: URN:NBN:fi:au:hklj:789

Espanja
type: Class
type: Concept
subclass of: Länsi- ja Lounais-Eurooppa
alternative label: Espanja, kansanmusiikki (784.143)
alternative label: Flamenco, kansanmusiikki (784.143)
alternative label: Kelttiläinen kansanmusiikki, Espanja (784.143)
alternative label: Flamenco, folkmusik (784.143) @sv
alternative label: Keltisk folkmusik, Spanien (784.143) @sv
alternative label: Spanien, folkmusik (784.143) @sv
broader: Länsi- ja Lounais-Eurooppa
in scheme: URN:NBN:fi:au:hklj:
notation: 784.143
preferred label: Spain @en
preferred label: Spanien @sv
related: URN:NBN:fi:au:hklj:473.1
related: URN:NBN:fi:au:hklj:769
related: URN:NBN:fi:au:hklj:783
related: URN:NBN:fi:au:hklj:783.1
related: Afrikan saaret
related: URN:NBN:fi:au:hklj:787
related: URN:NBN:fi:au:hklj:787.2
related: URN:NBN:fi:au:hklj:787.29
related: URN:NBN:fi:au:hklj:788.8
related: URN:NBN:fi:au:hklj:789
related: URN:NBN:fi:au:hklj:795.1
related: URN:NBN:fi:au:hklj:797.2
related: URN:NBN:fi:au:hklj:807

Portugali
type: Class
type: Concept
subclass of: Länsi- ja Lounais-Eurooppa
alternative label: Fadot, kansanmusiikki (784.144)
alternative label: Portugali, kansanmusiikki (784.144)
alternative label: Fado, folkmusik (784.144) @sv
alternative label: Portugal, folkmusik (784.144) @sv
broader: Länsi- ja Lounais-Eurooppa
in scheme: URN:NBN:fi:au:hklj:
notation: 784.144
preferred label: Portugal @en
related: URN:NBN:fi:au:hklj:473.1
related: URN:NBN:fi:au:hklj:769
related: URN:NBN:fi:au:hklj:783
related: URN:NBN:fi:au:hklj:783.1
related: Afrikan saaret
related: URN:NBN:fi:au:hklj:787
related: URN:NBN:fi:au:hklj:787.2
related: URN:NBN:fi:au:hklj:787.29
related: URN:NBN:fi:au:hklj:788.8
related: URN:NBN:fi:au:hklj:789
related: URN:NBN:fi:au:hklj:795.1
related: URN:NBN:fi:au:hklj:797.2
related: URN:NBN:fi:au:hklj:807

Saamelaiset
type: Class
type: Concept
subclass of: URN:NBN:fi:au:hklj:784.9
alternative label: Joikaaminen, saamelaisten etnomusiikki (784.91)
alternative label: Joiut, saamelaisten etnomusiikki (784.91)
alternative label: Lappalaiset, musiikki (784.91)
alternative label: Saamelaiset, musiikki (784.91)
alternative label: Jojkar, samernas etnomusik (784.91) @sv
alternative label: Jojkning, samernas etnomusik (784.91) @sv
alternative label: Lappar, musik (784.91) @sv
alternative label: Samer, musik (784.91) @sv
broader: URN:NBN:fi:au:hklj:784.9
in scheme: URN:NBN:fi:au:hklj:
notation: 784.91
preferred label: Samis @en
preferred label: Samer @sv
related: URN:NBN:fi:au:hklj:473.1
related: URN:NBN:fi:au:hklj:769
related: URN:NBN:fi:au:hklj:783
related: URN:NBN:fi:au:hklj:783.1
related: URN:NBN:fi:au:hklj:784.111
related: URN:NBN:fi:au:hklj:787
related: URN:NBN:fi:au:hklj:787.2
related: URN:NBN:fi:au:hklj:787.29
related: URN:NBN:fi:au:hklj:788.8
related: URN:NBN:fi:au:hklj:789
related: URN:NBN:fi:au:hklj:795.1
related: URN:NBN:fi:au:hklj:797.2
related: URN:NBN:fi:au:hklj:807

Romanit
type: Class
type: Concept
subclass of: URN:NBN:fi:au:hklj:784.9
alternative label: Mustalaismusiikki (784.92)
alternative label: Romanit, kansanmusiikki (784.92)
alternative label: Romer, folkmusik (784.92) @sv
alternative label: Zigenarmusik (784.92) @sv
broader: URN:NBN:fi:au:hklj:784.9
in scheme: URN:NBN:fi:au:hklj:
notation: 784.92
preferred label: Romanies @en
preferred label: Romer @sv
related: URN:NBN:fi:au:hklj:473.1
related: URN:NBN:fi:au:hklj:769
related: URN:NBN:fi:au:hklj:783
related: URN:NBN:fi:au:hklj:783.1
related: URN:NBN:fi:au:hklj:784.111
related: URN:NBN:fi:au:hklj:787
related: URN:NBN:fi:au:hklj:787.2
related: URN:NBN:fi:au:hklj:787.29
related: URN:NBN:fi:au:hklj:788.8
related: URN:NBN:fi:au:hklj:789
related: URN:NBN:fi:au:hklj:795.1
related: URN:NBN:fi:au:hklj:797.2
related: URN:NBN:fi:au:hklj:807

Muut näppäinsoittimet
type: Class
type: Concept
subclass of: Näppäinsoittimet
alternative label: Bandora (786.29)
alternative label: Bandurria (786.29)
alternative label: Banjo (786.29)
alternative label: Bouzouki, näppäinsoittimet (786.29)
alternative label: Buzuki, näppäinsoittimet (786.29)
alternative label: Chitarrone (786.29)
alternative label: Chrotta (786.29)
alternative label: Citole (786.29)
alternative label: Cittern (786.29)
alternative label: Crwth (786.29)
alternative label: Domra (786.29)
alternative label: Dulcimer, näppäillen (786.29)
alternative label: Gusli (786.29)
alternative label: Havaijinkitara (786.29)
alternative label: Helikon (786.29)
alternative label: Koto (786.29)
alternative label: Lyyra (786.29)
alternative label: Lyyrasoittimet (786.29)
alternative label: Pandora (786.29)
alternative label: Pedaalikitara (786.29)
alternative label: Psalterion (786.29)
alternative label: Sitar (786.29)
alternative label: Sitra (786.29)
alternative label: Sitrasoittimet (786.29)
alternative label: Steel-kitara (786.29)
alternative label: Tanpura, näppäilysoittimet (786.29)
alternative label: Ukulele (786.29)
alternative label: Bouzouki, knäppinstrument (786.29) @sv
alternative label: Buzuki, knäppinstrument (786.29) @sv
alternative label: Citterinstrument (786.29) @sv
alternative label: Cittra (786.29) @sv
alternative label: Hackbräde, som knäppinstrument (786.29) @sv
alternative label: Hawaiigitarr (786.29) @sv
alternative label: Lyra (786.29) @sv
alternative label: Lyrinstrument (786.29) @sv
alternative label: Pedalgitarr (786.29) @sv
alternative label: Steel guitar (786.29) @sv
alternative label: Tanbur, knäppinstrument (786.29) @sv
broader: Näppäinsoittimet
in scheme: URN:NBN:fi:au:hklj:
notation: 786.29
preferred label: Other plucked-string instruments @en
preferred label: Andra knäppinstrument @sv
related: URN:NBN:fi:au:hklj:627.7531
related: URN:NBN:fi:au:hklj:681
related: URN:NBN:fi:au:hklj:781.5
related: URN:NBN:fi:au:hklj:782.6
related: URN:NBN:fi:au:hklj:785
related: URN:NBN:fi:au:hklj:785.11
related: URN:NBN:fi:au:hklj:788
related: URN:NBN:fi:au:hklj:789
scope note: Banjo. Havaijinkitara. Koto. Sitar. Sitra. Ukulele
scope note: Banjo. Cittra. Hawaiigitarr. Koto. Sitar. Ukulele @sv

Juutalaisten uskonnollinen musiikki
type: Class
type: Concept
subclass of: URN:NBN:fi:au:hklj:787.2
alternative label: Juutalaiset, uskonnollinen musiikki (787.22)
alternative label: Sefardijuutalaiset, uskonnollinen musiikki (787.22)
alternative label: Judar, religiös musik (787.22) @sv
alternative label: Sefardijudar, religiös musik (787.22) @sv
broader: URN:NBN:fi:au:hklj:787.2
in scheme: URN:NBN:fi:au:hklj:
notation: 787.22
preferred label: Jewish religious music @en
preferred label: Judisk religiös musik @sv
related: URN:NBN:fi:au:hklj:280
related: URN:NBN:fi:au:hklj:783
related: URN:NBN:fi:au:hklj:783.1
related: URN:NBN:fi:au:hklj:783.5
related: URN:NBN:fi:au:hklj:783.59
related: URN:NBN:fi:au:hklj:783.6
related: URN:NBN:fi:au:hklj:784
related: Etu-Aasia
related: URN:NBN:fi:au:hklj:784.9
related: Juutalaiset
related: URN:NBN:fi:au:hklj:789
related: Varhaiskansojen musiikki

Blues
type: Class
type: Concept
subclass of: Blues. Soul
alternative label: Barrelhouse piano (788.11)
alternative label: Blues (788.11)
alternative label: Boogie woogie (788.11)
alternative label: Chicago-blues (788.11)
alternative label: Cityblues (788.11)
alternative label: Country blues (788.11)
alternative label: Doo wop (788.11)
alternative label: Folkblues (788.11)
alternative label: Mississippi-blues (788.11)
alternative label: Rhythm and blues (788.11)
alternative label: Soulblues (788.11)
alternative label: Urban blues (788.11)
alternative label: Boogie-woogie (788.11) @sv
broader: Blues. Soul
in scheme: URN:NBN:fi:au:hklj:
notation: 788.11
related: URN:NBN:fi:au:hklj:782.4
related: URN:NBN:fi:au:hklj:783
related: URN:NBN:fi:au:hklj:783.1
related: URN:NBN:fi:au:hklj:785.7
related: URN:NBN:fi:au:hklj:786.8
related: URN:NBN:fi:au:hklj:787.112
related: URN:NBN:fi:au:hklj:789
related: URN:NBN:fi:au:hklj:795
scope note: Tässä esim. barrelhouse-piano, boogie woogie, Chicago blues, city blues, country blues, folk blues, doo wop, Mississippi blues ja rhythm & blues
scope note: Hit t.ex.. barrelhouse-piano, boogie woogie, Chicago blues, city blues, country blues, folk blues, doo wop, Mississippi blues och rhythm & blues @sv

Jazz
type: Class
type: Concept
subclass of: URN:NBN:fi:au:hklj:788
alternative label: Big bandit, jazz (788.2 +)
alternative label: Festivaalit, jazzfestivaalit (788.2 +)
alternative label: Improvisaatiot, jazz (788.2 +)
alternative label: Jazz (788.2 +)
alternative label: Jazz-klubit (788.2 +)
alternative label: Jazzklubit (788.2 +)
alternative label: Jazzlaulu (788.2 +)
alternative label: Jazzorkesterit (788.2 +)
alternative label: Jazzsoolot (788.2 +)
alternative label: Jazzyhtyeet (788.2 +)
alternative label: Orkesterimusiikki, jazz (788.2 +)
alternative label: Orkesterit, jazzorkesterit (788.2 +)
alternative label: Populaarimusiikki, jazz (788.2 +)
alternative label: Rytmi- ja viihdemusiikki, jazz (788.2 +)
alternative label: Rytmimusiikki, jazz (788.2 +)
alternative label: Scatlaulu, jazz (788.2 +)
alternative label: Big band, jazz (788.2 +) @sv
alternative label: Festivaler, jazzfestivaler (788.2 +) @sv
alternative label: Improvisationer, jazz (788.2 +) @sv
alternative label: Jazz-klubbar (788.2 +) @sv
alternative label: Jazzband (788.2 +) @sv
alternative label: Jazzklubbar (788.2 +) @sv
alternative label: Jazzorkestrar (788.2 +) @sv
alternative label: Jazzsolon (788.2 +) @sv
alternative label: Jazzsång (788.2 +) @sv
alternative label: Orkestermusik, jazz (788.2 +) @sv
alternative label: Orkestrar, jazzorkestrar (788.2 +) @sv
alternative label: Populärmusik, jazz (788.2 +) @sv
alternative label: Rytm- och underhållningsmusik, jazz (788.2 +) @sv
alternative label: Rytmmusik, jazz (788.2 +) @sv
alternative label: Scatsång, jazz (788.2 +) @sv
broader: URN:NBN:fi:au:hklj:788
in scheme: URN:NBN:fi:au:hklj:
narrower: Moderni jazz
narrower: Swing. Traditionaalinen jazz
notation: 788.2
related: URN:NBN:fi:au:hklj:782.4
related: URN:NBN:fi:au:hklj:783
related: URN:NBN:fi:au:hklj:783.1
related: URN:NBN:fi:au:hklj:785.7
related: URN:NBN:fi:au:hklj:786.8
related: URN:NBN:fi:au:hklj:787.112
related: URN:NBN:fi:au:hklj:789
related: URN:NBN:fi:au:hklj:795
scope note: Yleisteokset ja sekasisältöiset kokoelmat Tässä ja alaluokissa jazz ja sitä koskeva kirjallisuus esityskokoonpanosta riippumatta Tässä ja alaluokissa myös jazzin suuntaukset sekä niiden historia ja henkilöhistoria
scope note: Allmänna verk och samlingar med blandat innehåll Hit och till underklasserna jazz samt litteratur om jazz oavsett instrumentalbesättning Hit och till underklasserna också olika riktningar inom jazz samt deras historia och personhistoria @sv

Ruotsin-, tanskan- ja norjankielinen viihdemusiikki
type: Class
type: Concept
subclass of: Viihdemusiikki
broader: Viihdemusiikki
in scheme: URN:NBN:fi:au:hklj:
notation: 788.42
preferred label: Swedish, Danish and Norwegian light music @en
preferred label: Underhållningsmusik på svenska, danska och norska @sv
related: Tanssitaide
related: URN:NBN:fi:au:hklj:782.4
related: URN:NBN:fi:au:hklj:783
related: URN:NBN:fi:au:hklj:783.1
related: URN:NBN:fi:au:hklj:785.7
related: URN:NBN:fi:au:hklj:786.8
related: URN:NBN:fi:au:hklj:787.112
related: Eurooppalainen maailmanmusiikki. Europpalainen etninen pop ja viihdemusikki
related: URN:NBN:fi:au:hklj:789
related: URN:NBN:fi:au:hklj:795

Venäjän-, valkovenäjän- ja ukrainankielinen viihdemusiikki
type: Class
type: Concept
subclass of: Viihdemusiikki
broader: Viihdemusiikki
in scheme: URN:NBN:fi:au:hklj:
notation: 788.47
preferred label: Russian light music @en
preferred label: Underhållningsmusik på ryska, vitryska och ukrainska @sv
related: Tanssitaide
related: URN:NBN:fi:au:hklj:782.4
related: URN:NBN:fi:au:hklj:783
related: URN:NBN:fi:au:hklj:783.1
related: URN:NBN:fi:au:hklj:785.7
related: URN:NBN:fi:au:hklj:786.8
related: URN:NBN:fi:au:hklj:787.112
related: Eurooppalainen maailmanmusiikki. Europpalainen etninen pop ja viihdemusikki
related: URN:NBN:fi:au:hklj:789
related: URN:NBN:fi:au:hklj:795

Keski-Eurooppa
type: Class
type: Concept
subclass of: Eurooppa
broader: Eurooppa
in scheme: URN:NBN:fi:au:hklj:
narrower: Saksa
narrower: Itävalta
narrower: Sveitsi
narrower: Benelux-maat
notation: 789.22
preferred label: Central Europe @en
preferred label: Centraleuropa @sv
related: URN:NBN:fi:au:hklj:709
related: URN:NBN:fi:au:hklj:782.4
related: URN:NBN:fi:au:hklj:783
related: URN:NBN:fi:au:hklj:789.1
scope note: Keski-Euroopan musiikin historian yleisteokset
scope note: Allmänna verk som rör den centraleuropeiska musikens historia @sv

Ruotsin kielen murteet
type: Class
type: Concept
subclass of: Ruotsin kieli
alternative label: Amerikanruotsi (872.6)
alternative label: Riikinruotsi, murteet (872.6)
alternative label: Riikinruotsi, slangit (872.6)
alternative label: Ruhnun murre, ruotsin kieli (872.6)
alternative label: Ruotsin kieli, murteet (872.6)
alternative label: Ruotsin kieli, slangit (872.6)
alternative label: Ruotsin ruotsi, murteet (872.6)
alternative label: Ruotsin ruotsi, slangit (872.6)
alternative label: Ruotsinruotsi, murteet (872.6)
alternative label: Ruotsinruotsi, slangit (872.6)
alternative label: Vironruotsi (872.6)
alternative label: Amerikasvenska (872.6) @sv
alternative label: Estlandssvenska (872.6) @sv
alternative label: Rikssvenska, dialekter (872.6) @sv
alternative label: Rikssvenska, slang (872.6) @sv
alternative label: Runö-dialekt, svenska (872.6) @sv
alternative label: Svenska, dialekter (872.6) @sv
alternative label: Svenska, slang (872.6) @sv
alternative label: Sverigesvenska, dialekter (872.6) @sv
alternative label: Sverigesvenska, slang (872.6) @sv
broader: Ruotsin kieli
in scheme: URN:NBN:fi:au:hklj:
notation: 872.6
preferred label: Swedish dialects @en
preferred label: Svenska dialekter @sv
related: URN:NBN:fi:au:hklj:188.4
related: URN:NBN:fi:au:hklj:2.5
related: Sähköposti. Verkkojuttelu
related: URN:NBN:fi:au:hklj:627.7512
related: KIELITIEDE
related: URN:NBN:fi:au:hklj:860
related: Pohjoismaiset kielet
related: Ruotsin kielen äänneoppi
related: Ruotsin kielen etymologia ja onomastiikka
related: Ruotsin kielen kielioppi ja semantiikka
related: URN:NBN:fi:au:hklj:872.603
related: URN:NBN:fi:au:hklj:872.609
related: Suomenruotsi
related: Ruotsin kielen historia
related: Suomen kielen äänneoppi
scope note: Murretutkimus. Murrealueet. Slangit. Slangitutkimus Maantieteelliset slangit. Eri ammattien ja alojen slangit Murteiden äänne-, kieli-, muoto- ja sanaoppi Murteiden semantiikka. Murteiden etymologia ja onomastiikka Kielipsykologia, -sosiologia ja -politiikka murteiden kannalta Murrenäytteet. Murrenäytekokoelmat
scope note: Dialektforskning. Dialektområden. Slang. Slangforskning Regional och lokal slang. Yrkesjargong och jargong inom olika branscher Ljudlära, satslära, formlära och ordlära i dialekterna Betydelselära (semantik) i dialekterna. Etymologi och onomastik i dialekterna Språkpsykologi, språksociologi och språkpolitik i dialekterna Dialektprov. Dialektarkiv @sv

Englannin kieli
type: Class
type: Concept
subclass of: GERMAANISET, KELTTILÄISET, BALTTILAISET JA SLAAVILAISET KIELET
alternative label: Australia, englannin kieli (875 +)
alternative label: Australianenglanti (875 +)
alternative label: Englannin kieli (875 +)
alternative label: Englannin kieli, australianenglanti (875 +)
alternative label: Englannin kieli, kielitiede (875 +)
alternative label: Englannin kieli, oppikirjat (875 +)
alternative label: Intianenglanti (875 +)
alternative label: Irlanninenglanti (875 +)
alternative label: Kanadanenglanti (875 +)
alternative label: Kielikurssit, englannin kieli (875)
alternative label: Kuullun ymmärtäminen, englannin kieli (875)
alternative label: Kuullunymmärtäminen, englannin kieli (875)
alternative label: Luetun ymmärtäminen, englannin kieli (875)
alternative label: Länsigermaaniset kielet (874 ... 876)
alternative label: Ylioppilastehtävät, englannin kieli (875)
alternative label: Australien, engelska språket (875 +) @sv
alternative label: Australisk engelska (875 +) @sv
alternative label: Engelska (875 +) @sv
alternative label: Engelska, australisk engelska (875 +) @sv
alternative label: Engelska, lingvistik (875 +) @sv
alternative label: Engelska, läroböcker (875 +) @sv
alternative label: Hörförståelse, engelska (875) @sv
alternative label: Indisk engelska (875 +) @sv
alternative label: Irländsk engelska (875 +) @sv
alternative label: Kanadensisk engelska (875 +) @sv
alternative label: Läsförståelse, engelska (875) @sv
alternative label: Språkkurser, engelska (875) @sv
alternative label: Studentuppgifter, engelska (875) @sv
alternative label: Västgermanska språk (874 ... 876) @sv
broader: GERMAANISET, KELTTILÄISET, BALTTILAISET JA SLAAVILAISET KIELET
in scheme: URN:NBN:fi:au:hklj:
narrower: Englannin kielen yksikieliset sanakirjat
narrower: Englannin kielen kielioppi ja semantiikka
narrower: Amerikan englannin kieli
notation: 875
preferred label: English @en
preferred label: Engelska @sv
related: Oppimisen psykologia
related: Kirjallisuuden ja kielten opetusoppi
related: URN:NBN:fi:au:hklj:4
related: Englanninkielisen kirjallisuuden historia ja tutkimus
related: Amerikan englanninkielisen kirjallisuuden historia ja tutkimus
related: Kielipsykologia. Kielisosiologia. Kielipolitiikka
related: URN:NBN:fi:au:hklj:860
related: URN:NBN:fi:au:hklj:875.03
related: URN:NBN:fi:au:hklj:875.09
scope note: Englannin kieltä tai sen tutkimusta koskevat yleisteokset Englannin kielen yleiset oppi- ja harjoituskirjat sekä kielikurssit Englannin kielen opiskeluun liittyvät selityksillä tai sanastolla varustetut lukemistot ja lukukirjat Eri ammatteihin ja aloihin liittyvät englannin kielen oppi- ja harjoituskirjat, kielikurssit ja lukemistot Kirjakieli. Puhekieli. Oikeakielisyys. Oikeakielisyysoppaat. Kielenhuolto Tyylioppi ja tyylintutkimus kielitieteen kannalta Äänneoppi. Etymologia. Onomastiikka. Leksikologia. Murteet. Slangit Kielisosiologia. Kielipsykologia. Sosiolingvistiikka. Psykolingvistiikka. Kielipolitiikka
scope note: Allmänna verk om engelska eller om forskning i engelska Allmänna läroböcker och övningsböcker samt språkkurser i engelska Textböcker och läseböcker för studier i engelska med förklaringar och ordlistor Läroböcker, övningsböcker, språkkurser och textböcker i engelska som rör olika yrken och branscher Skriftspråk. Talspråk. Språkriktighet. Handböcker i språkriktighet. Språkvård Stilistik och stilforskning ur språkvetenskaplig synvinkel Ljudlära. Etymologi. Onomastik. Ordlära (lexikologi). Dialekter. Slang Språksociologi. Sråkpsykologi. Sociolingvistik. Psykolingvistik. Språkpolitik @sv

Uuden ajan kulttuurihistoria 1500-1788
type: Class
type: Concept
subclass of: URN:NBN:fi:au:hklj:919
alternative label: Barokki, kulttuurihistoria (919.3)
alternative label: Hyödyn aikakausi, kulttuurihistoria (919.3)
alternative label: Myöhäisrenessanssi, kulttuurihistoria (919.3)
alternative label: Reformaation aika, historia (919.3)
alternative label: Renessanssi, kulttuurihistoria (919.3)
alternative label: Rokokoo, kulttuurihistoria (919.3)
alternative label: Täysrenessanssi, kulttuurihistoria (919.3)
alternative label: Uskonpuhdistusaika, historia (919.3)
alternative label: Uusi aika, kulttuurihistoria (919.3)
alternative label: Valistuksen aika, kulttuurihistoria (919.3 ... 919.4)
alternative label: Varhaisrenessanssi, kulttuurihistoria (919.3)
alternative label: Vastauskonpuhdistuksen aika, kulttuurihistoria (919.3)
alternative label: Barock, kulturhistoria (919.3) @sv
alternative label: Högrenässansen, kulturhistoria (919.3) @sv
alternative label: Motreformationens tid, kulturhistoria (919.3) @sv
alternative label: Nya tiden, kulturhistoria (919.3) @sv
alternative label: Nyttans tidevarv, kulturhistoria (919.3) @sv
alternative label: Reformationstiden, historia (919.3) @sv
alternative label: Renässans, kulturhistoria (919.3) @sv
alternative label: Rokoko, kulturhistoria (919.3) @sv
alternative label: Senrenässansen, kulturhistoria (919.3) @sv
alternative label: Ungrenässansen, kulturhistoria (919.3) @sv
alternative label: Upplysningstiden, kulturhistoria (919.3 ... 919.4) @sv
broader: URN:NBN:fi:au:hklj:919
in scheme: URN:NBN:fi:au:hklj:
notation: 919.3
preferred label: Cultural history of the early modern period 1500-1788 @en
preferred label: Nya tidens kulturhistoria 1500-1788 @sv
related: Itämainen filosofia
related: Renessanssin ja uuden ajan filosofia
related: Kulttuurifilosofia
related: Käytös- ja tapatieto
related: Juhlien järjestäminen
related: Esineellinen kulttuuri
related: URN:NBN:fi:au:hklj:473
related: URN:NBN:fi:au:hklj:649.91
related: Renessanssin taidehistoria
related: Uuden ajan taidehistoria
related: Uusi aika
related: URN:NBN:fi:au:hklj:909
related: Uuden ajan historia 1500-1788
related: Historian tutkimusmenetelmät
related: Historian aputieteet
scope note: Uuden ajan kulttuurihistorian yleisteokset Euroopan uuden ajan kulttuurihistorian yleisteokset Renessanssiajan kulttuurihistorian yleisteokset Tietyn maan tai alueen uuden ajan kulttuurihistoria ko. maan tai alueen historian luokassa
scope note: Allmänna verk om nya tidens kulturhistoria Allmänna verk om europeisk kulturhistoria under nya tiden Allmänna verk om renässansens kulturhistoria Verk om nya tidens kulturhistoria i ett bestämt land eller geografiskt område förs till klassen för landets eller det geografiska områdets historia @sv

Uusimman ajan kulttuurihistoria 1789-1913
type: Class
type: Concept
subclass of: URN:NBN:fi:au:hklj:919
alternative label: Kansallisromantiikka, kulttuurihistoria (919.4)
alternative label: Romantiikka, kulttuurihistoria (919.4)
alternative label: Täysromantiikka, kulttuurihistoria (919.4)
alternative label: Valistuksen aika, kulttuurihistoria (919.3 ... 919.4)
alternative label: Varhaisromantiikka, kulttuurihistoria (919.4)
alternative label: Vuosisadan vaihde, kulttuurihistoria (919.4)
alternative label: Förromantik, kulturhistoria (919.4) @sv
alternative label: Högromantik, kulturhistoria (919.4) @sv
alternative label: Nationalromantik, kulturhistoria (919.4) @sv
alternative label: Romantiken, kulturhistoria (919.4) @sv
alternative label: Sekelskiftet, kulturhistoria (919.4) @sv
alternative label: Upplysningstiden, kulturhistoria (919.3 ... 919.4) @sv
broader: URN:NBN:fi:au:hklj:919
in scheme: URN:NBN:fi:au:hklj:
notation: 919.4
preferred label: Cultural history of the later modern period 1789-1913 @en
preferred label: Nya tidens kulturhistoria 1789-1913 @sv
related: Itämainen filosofia
related: Uusimman ajan filosofia
related: Kulttuurifilosofia
related: Käytös- ja tapatieto
related: Juhlien järjestäminen
related: Esineellinen kulttuuri
related: URN:NBN:fi:au:hklj:473
related: URN:NBN:fi:au:hklj:649.91
related: Uuden ajan taidehistoria
related: Uusi aika
related: URN:NBN:fi:au:hklj:909
related: Uusimman ajan historia 1789-1913
related: Historian tutkimusmenetelmät
related: Historian aputieteet
scope note: Uusimman ajan kulttuurihistorian yleisteokset Euroopan uusimman ajan kulttuurihistorian yleisteokset Tietyn maan tai alueen uusimman ajan kulttuurihistoria ko. maan tai alueen historian luokassa
scope note: Allmänna verk om den senare nya tidens kulturhistoria Allmänna verk om europeisk kulturhistoria under den senare nya tiden Verk om den senare nya tidens kulturhistoria i ett bestämt land eller geografiskt område förs till klassen för landets eller det geografiska områdets historia @sv

Itsenäisyyden aika 1917-1938
type: Class
type: Concept
subclass of: URN:NBN:fi:au:hklj:920
alternative label: Ahvenanmaan kysymys (927)
alternative label: Ahvenanmaankysymys (927)
alternative label: Aitosuomalaisuus, Suomen historia (927)
alternative label: Heimoaate, Suomen historia (927)
alternative label: Itsenäisyyden aika, Suomi (927 ... 928 +)
alternative label: Itsenäisyys, itsenäisyyden aika, Suomi (927 ... 928 +)
alternative label: Kyyditys, Suomen poliittinen historia (927)
alternative label: Punakaartit, Suomen historia (927)
alternative label: Punakapina, Suomen historia (927)
alternative label: Suomalaisuusliike, itsenäisyyden aika (927 +)
alternative label: Suomen historia, 1917-1938 (927 +)
alternative label: Suomen historia, Suomen itsenäistyminen (927 +)
alternative label: Toimitusministeristöt, Suomen historia (927 ... 928 +)
alternative label: Valkokaartit, Suomen historia (927 +)
alternative label: Expeditionsministärer, Finlands historia (927 ... 928 +) @sv
alternative label: Finlands historia, 1917-1938 (927 +) @sv
alternative label: Finlands historia, Finlands självständigblivande (927 +) @sv
alternative label: Finskhetsrörelsen, självständighetstiden (927 +) @sv
alternative label: Röda garden, Finlands historia (927) @sv
alternative label: Röda upproret, Finlands historia (927) @sv
alternative label: Självständighet, självständighetstiden, Finland (927 ... 928 +) @sv
alternative label: Självständighetstiden, Finland (927 ... 928 +) @sv
alternative label: Skjutsning, Finlands politiska historia (927) @sv
alternative label: Stamtänkande, Finlands historia (927) @sv
alternative label: Vita garden, Finlands historia (927 +) @sv
alternative label: Äktfinskhet, Finlands historia (927) @sv
alternative label: Ålandsfrågan (927) @sv
broader: URN:NBN:fi:au:hklj:920
in scheme: URN:NBN:fi:au:hklj:
narrower: Vuoden 1918 sota
notation: 927
preferred label: Independence 1917–1938 @en
preferred label: Självständighetstiden 1917–1938 @sv
related: URN:NBN:fi:au:hklj:061
related: Suomi
related: Suomen ulkopolitiikka
related: URN:NBN:fi:au:hklj:411
related: Suomenruotsalaisten asuma-alueet
related: Suomen yleinen taidehistoria
related: URN:NBN:fi:au:hklj:909
related: URN:NBN:fi:au:hklj:919
related: URN:NBN:fi:au:hklj:930
related: Neuvostoliiton historia 1945-1991

Baltian maiden historia
type: Class
type: Concept
subclass of: URN:NBN:fi:au:hklj:970
alternative label: Baltia, historia (973 +)
alternative label: Kundan kulttuuri (973 +)
alternative label: Metsäveljet (973 +)
alternative label: Venäläistämispolitiikka, Baltian maiden historia (973 +)
alternative label: Baltikum, historia (973 +) @sv
alternative label: Förryskningspolitik, Baltiska ländernas historia (973 +) @sv
alternative label: Kundakulturen (973 +) @sv
alternative label: Skogsbröder (973 +) @sv
broader: URN:NBN:fi:au:hklj:970
in scheme: URN:NBN:fi:au:hklj:
narrower: Viron historia
narrower: Latvian historia
narrower: Liettuan historia
notation: 973
preferred label: History of the Baltic countries @en
preferred label: De baltiska ländernas historia @sv
related: URN:NBN:fi:au:hklj:411
related: Baltian maat
related: Viro
related: Latvia
related: Liettua
related: URN:NBN:fi:au:hklj:909
related: URN:NBN:fi:au:hklj:919
related: Venäjän historia
related: Neuvostoliiton historia 1917-1991
scope note: Tässä ja alaluokissa Baltian maiden historia myös neuvostovallan ajalta
scope note: Hit och till underklasserna de baltiska ländernas historia också under Sovjetväldet @sv

Afrikan historia
type: Class
type: Concept
subclass of: MUIDEN MAANOSIEN HISTORIA
alternative label: Afrikan saaret, historia (985)
alternative label: Afrikka, historia (985 +)
alternative label: Afrikkalaisuus, kulttuurihistoria (985 +)
alternative label: Aldabrasaaret, historia (985)
alternative label: Amirantit, historia (985)
alternative label: Ascension, historia (985)
alternative label: Azorit, historia (985)
alternative label: Kanarian saaret, historia (985)
alternative label: Kap Verde, historia (985)
alternative label: Komorit, historia (985)
alternative label: Maanosat, Afrikka, historia (985)
alternative label: Madagaskar, historia (985)
alternative label: Madeira, historia (985)
alternative label: Mauritius, historia (985)
alternative label: Mayotte, historia (985)
alternative label: Principe, historia (985)
alternative label: Réunion, historia (985)
alternative label: Saint Helena, historia (985)
alternative label: Sao Tomé ja Principe, historia (985)
alternative label: Seychellit, historia (985)
alternative label: Tristan da Cunha, historia (985)
alternative label: Afrika, historia (985 +) @sv
alternative label: Afrikansk identitet, kulturhistoria (985 +) @sv
alternative label: Afrikas öar, historia (985) @sv
alternative label: Aldabraöarna, historia (985) @sv
alternative label: Amiranterna, historia (985) @sv
alternative label: Azorerna, historia (985) @sv
alternative label: Kanarieöarna, historia (985) @sv
alternative label: Komorerna, historia (985) @sv
alternative label: Sao Tomé och Principe, historia (985) @sv
alternative label: Seychellerna, historia (985) @sv
alternative label: Världsdelar, Afrika, historia (985) @sv
broader: MUIDEN MAANOSIEN HISTORIA
in scheme: URN:NBN:fi:au:hklj:
narrower: Pohjois-Afrikan historia
narrower: Länsi-, Itä- ja Keski-Afrikan historia
narrower: Etelä-Afrikan historia
notation: 985
preferred label: History of Africa @en
preferred label: Afrikas historia @sv
related: Espanja
related: Portugali
related: AFRIKKA
related: Afrikan saaret
related: BRITTEIN SAARTEN HISTORIA
related: RANSKAN HISTORIA
related: Espanjan historia
related: Portugalin historia
scope note: Afrikan historian yleisteokset Tässä myös Afrikan saarten historia Aldabrasaarten, Amiranttien, Ascensionin, Azorien, Kanarian saarten, Kap Verden, Komorien, Madagaskarin, Madeiran, Mauritiuksen, Mayotten, Réunionin, Saint Helenan, Sao Tomén ja Principen, Seychellien sekä Tristan da Cunhan historia
scope note: Allmänna verk om Afrikas historia Hit också historiska verk om öarna kring Afrika Aldabrasöarnas, Amiranternas, Ascensions, Azorernas, Comorernas, Kanarieöarnas, Kap Verdes, Madagaskars, Madeiras, Mauritius, Mayottes, Réunions, Saint Helenas, São Tomés och Príncipes, Seychellernas och Tristan da Cunhas historia @sv

Elämäkerralliset hakuteokset
type: Class
type: Concept
subclass of: HENKILÖ- JA SUKUHISTORIA
alternative label: Aateliskalenterit, muut maat (990.03)
alternative label: Akateemikot, elämäkerralliset hakuteokset (990.03 ... 997.103)
alternative label: Assistentit, elämäkerralliset hakuteokset (990.03 ... 997.103)
alternative label: Elämäkerralliset hakuteokset (990.03)
alternative label: Henkilöhakemistot, henkilöhakemistot (990.03)
alternative label: Henkilöhakemistot, muut alat (990.03 ... 997.03)
alternative label: Henkilötiedot, elämäkerralliset hakuteokset (990.03 ... 997.103)
alternative label: Informaatikot, elämäkerralliset hakuteokset (990.03 ... 990.103)
alternative label: Isännät, elämäkerralliset hakuteokset (990.03 ... 990.103)
alternative label: Kaatuneet, elämäkerralliset hakuteokset (990.03)
alternative label: Kadonneet, kaatuneet, elämäkerralliset hakueteokset (990.03 ... 990.103)
alternative label: Kauneuskuningattaret, elämäkerralliset hakuteokset (990.03 ... 990.103)
alternative label: Kirjankustantajat, elämäkerralliset hakuteokset (990.03 ... 990.103)
alternative label: Kirjanpainajat, elämäkerralliset hakuteokset (990.03 ... 990.103)
alternative label: Kirjastonhoitajat, elämäkerralliset hakuteokset (990.03 ... 990.103)
alternative label: Kirjastovirkailijat, elämäkerralliset hakuteokset (990.03 ... 990.103)
alternative label: Maanomistajat, elämäkerralliset hakuteokset (990.03 ... 990.103)
alternative label: Matrikkelit (990.03 ... 990.103)
alternative label: Matrikkelit, muiden alojen edustajat (990.03 ... 997.103)
alternative label: Metsänomistajat, elämäkerralliset hakuteokset (990.03 ... 990.103)
alternative label: Missit, elämäkerralliset hakuteokset (990.03 ... 990.103)
alternative label: Museonhoitajat, elämäkerralliset hakuteokset (990.03 ... 990.103)
alternative label: Nimikirjat (990.03 ... 990.103)
alternative label: Nimikirjat, muiden alojen edustajat (990.03 ... 997.103)
alternative label: Osoitehakemistot, elämäkerralliset hakuteokset (990.03 ... 990.103)
alternative label: Osoitehakemistot, puhelinluettelot (990.03 ... 990.103)
alternative label: Osoitteistot, elämäkerralliset hakuteokset (990.03 ... 990.103)
alternative label: Osoitteistot, puhelinluettelot (990.03 ... 990.103)
alternative label: Puhelinluettelot (990.03 ... 990.103)
alternative label: Puhelinnumerot (990.03 ... 990.103)
alternative label: Rintamamiehet, elämäkerralliset hakuteokset (990.03 ... 990.103)
alternative label: Ritaristo, aateliskalenterit, muut maat (990.03)
alternative label: Ritarit, aateliskalenterit, muut maat (990.03)
alternative label: Sankarit, sankarivainajat, hakuteokset (990.03 ... 990.103)
alternative label: Sankarivainajat, elämäkerralliset hakuteokset (990.03 ... 990.103)
alternative label: Sodissa kaatuneiden luettelot (990.03)
alternative label: Sotainvalidit, elämäkerralliset hakuteokset (990.03 ... 990.103)
alternative label: Sotavammaiset, elämäkerralliset hakuteokset (990.03 ... 990.103)
alternative label: Sotavangit, elämäkerralliset hakuteokset (990.03 ... 990.103)
alternative label: Sotaveteraanit, elämäkerralliset hakuteokset (990.03 ... 990.103)
alternative label: Sotilaat, elämäkerralliset hakuteokset (990.03 ... 990.103)
alternative label: Tiedemiehet, elämäkerralliset hakuteokset (990.03 ... 997.103)
alternative label: Tiedenaiset, elämäkerralliset hakuteokset (990.03 ... 997.103)
alternative label: Tietokirjailijat, elämäkerralliset hakuteokset (990.03 ... 997.103)
alternative label: Tutkijat, elämäkerralliset hakuteokset (990.03 ... 997.103)
alternative label: Veteraanit, elämäkerralliset hakuteokset (990.03 ... 990.103)
alternative label: Yhteystiedot, puhelinluettelot (990.03 ... 997.103)
alternative label: Ylioppilaat, elämäkerralliset hakuteokset (990.03 ... 990.103)
alternative label: Adelskalendrar, övriga länder (990.03) @sv
alternative label: Adresskartotek, biografiska uppslagsverk (990.03 ... 990.103) @sv
alternative label: Adresskartotek, telefonkataloger (990.03 ... 990.103) @sv
alternative label: Adressregister, biografiska uppslagsverk (990.03 ... 990.103) @sv
alternative label: Adressregister, telefonkataloger (990.03 ... 990.103) @sv
alternative label: Akademiledamöter, biografiska uppslagsverk (990.03 ... 997.103) @sv
alternative label: Assistenter, biografiska uppslagsverk (990.03 ... 997.103) @sv
alternative label: Bibliotekarier, biografiska uppslagsverk (990.03 ... 990.103) @sv
alternative label: Biblioteksfunktionärer, biografiska uppslagsverk (990.03 ... 990.103) @sv
broader: HENKILÖ- JA SUKUHISTORIA
in scheme: URN:NBN:fi:au:hklj:
notation: 990.03
related: Pelastusoppi. Kristillinen antropologia
related: URN:NBN:fi:au:hklj:323
related: Poliittiset ja aatteelliset vähemmistöt
related: URN:NBN:fi:au:hklj:384.1103
related: URN:NBN:fi:au:hklj:617
related: URN:NBN:fi:au:hklj:618.24
related: URN:NBN:fi:au:hklj:618.3
related: Matkaviestinpalvelut. Puhelinliikenne
related: Sanakirjat. Hakuteokset
related: URN:NBN:fi:au:hklj:791.03
related: URN:NBN:fi:au:hklj:909
related: URN:NBN:fi:au:hklj:919
related: Sukuhistoria. Sukututkimus
related: Sukututkimuksen historia ja menetelmät
scope note: Yleiset elämäkerralliset ja henkilöhistorialliset hakuteokset, henkilöhakemistot ja matrikkelit, joissa henkilötiedot ovat pääasiana Yleiset osoitehakemistot ja puhelinluettelot Tässä myös esim. kirja-alalla toimivien henkilöiden, kuten kirjankustantajien, kirjakauppiaiden ja kirjastonhoitajien sekä museon- ja arkistonhoitajien elämäkerralliset hakuteokset Jos matrikkelin tai henkilöhakemiston pääsisältönä ovat muut kuin henkilötiedot, esim. oppilaitoksen historia, on teos alan mukaisessa luokassa Kirjailijoiden, taiteilijoiden ja urheilijoiden elämäkerralliset hakuteokset kirjallisuuden, eri taidemuotojen ja eri urheilulajien luokissa Epävarmoissa tapauksissa annetaan etusija luokille 990.03-997.103
scope note: Allmänna biografiska och personhistoriska uppslagsböcker, personregister och matriklar som huvudsakligen behandlar personuppgifter Allmänna adressregister och telefonkataloger Hit också biografiska uppslagsböcker om t.ex. personer verksamma inom bokbranschen, såsom bokförläggare, bokhandlare och bibliotekarier samt museiintendenter och arkivarier Om en matrikel eller ett personregister huvudsakligen behandlar någonting annat än personuppgifter, t.ex. en läroinrättnings historia, förs matrikeln eller personregistret till klassen för området Biografiska uppslagsböcker som rör konstnärer, idrottsmän och författare förs till klasserna för de olika konstformerna, sportgrenarna och litterära genrerna I osäkra fall ges företräde åt klasserna 990.03-997.103 @sv

Suomi
type: Class
type: Concept
subclass of: Yhteiskuntaelämän, joukkotiedotuksen, liikenteen ja maanpuolustuksen edustajat
alternative label: Eduskunnan oikeusasiamiehet, elämäkerrat ja muistelmat (993.1)
alternative label: Eduskunnan puhemiehet, elämäkerrat ja muistelmat (993.1)
alternative label: Hakkapeliitat, elämäkerrat ja muistelmat (993.1)
alternative label: Hakkapeliter, biografier och memoarer (993.1) @sv
alternative label: Riksdagens justitieombudsmän, biografier och memoarer (993.1) @sv
alternative label: Riksdagens talmän, biografier och memoarer (993.1) @sv
broader: Yhteiskuntaelämän, joukkotiedotuksen, liikenteen ja maanpuolustuksen edustajat
in scheme: URN:NBN:fi:au:hklj:
notation: 993.1
preferred label: Finland @en
related: Pelastusoppi. Kristillinen antropologia
related: URN:NBN:fi:au:hklj:323
related: Poliittiset ja aatteelliset vähemmistöt
related: Sisäpolitiikka. Puolueet
related: Suomi
related: Suomen valtiojärjestelmä
related: Muiden maiden valtiojärjestelmät
related: URN:NBN:fi:au:hklj:617
related: URN:NBN:fi:au:hklj:618.24
related: URN:NBN:fi:au:hklj:618.3
related: URN:NBN:fi:au:hklj:909
related: URN:NBN:fi:au:hklj:919
related: URN:NBN:fi:au:hklj:993.103
related: Sukuhistoria. Sukututkimus

Suomi
type: Class
type: Concept
subclass of: Maantieteilijät. Tutkimusmatkailijat. Löytöretkeilijät.Kansatieteilijät. Antropologit
broader: Maantieteilijät. Tutkimusmatkailijat. Löytöretkeilijät.Kansatieteilijät. Antropologit
in scheme: URN:NBN:fi:au:hklj:
notation: 994.1
preferred label: Finland @en
related: Pelastusoppi. Kristillinen antropologia
related: URN:NBN:fi:au:hklj:323
related: Poliittiset ja aatteelliset vähemmistöt
related: Löytöretket. Tutkimusmatkat
related: URN:NBN:fi:au:hklj:617
related: URN:NBN:fi:au:hklj:618.24
related: URN:NBN:fi:au:hklj:618.3
related: URN:NBN:fi:au:hklj:909
related: URN:NBN:fi:au:hklj:919
related: URN:NBN:fi:au:hklj:994.103
related: Humanististen tieteiden edustajat
related: Sukuhistoria. Sukututkimus

Suomi
type: Class
type: Concept
subclass of: Lääketieteen, tuotantoelämän, tekniikan, kaupan ja talous-elämän edustajat
broader: Lääketieteen, tuotantoelämän, tekniikan, kaupan ja talous-elämän edustajat
in scheme: URN:NBN:fi:au:hklj:
notation: 996.1
preferred label: Finland @en
related: Pelastusoppi. Kristillinen antropologia
related: URN:NBN:fi:au:hklj:323
related: Poliittiset ja aatteelliset vähemmistöt
related: URN:NBN:fi:au:hklj:617
related: URN:NBN:fi:au:hklj:618.24
related: URN:NBN:fi:au:hklj:618.3
related: URN:NBN:fi:au:hklj:909
related: URN:NBN:fi:au:hklj:919
related: Filosofit. Psykologit. Kasvatustieteiden edustajat
related: Yhteiskuntaelämän, joukkotiedotuksen, liikenteen ja maanpuolustuksen edustajat
related: URN:NBN:fi:au:hklj:996.103
related: Sukuhistoria. Sukututkimus

Austronesialaisten kielten kaunokirjallisuus (Kaunoluokka)
type: Class
type: Concept
type: FormClass
subclass of: Muiden aasialaisten, australialaisten ja oseanialaisten kielten kaunokirjallisuus (Kaunoluokka)
broader: Muiden aasialaisten, australialaisten ja oseanialaisten kielten kaunokirjallisuus (Kaunoluokka)
in scheme: URN:NBN:fi:au:hklj:
narrower: Tagaloginkielinen kaunokirjallisuus (Kaunoluokka)
narrower: Malaijinkielinen kaunokirjallisuus (Kaunoluokka)
narrower: Indonesiankielinen kaunokirjallisuus (Kaunoluokka)
notation: 9.978
preferred label: Austronesian fiction (Fiction class) @en
preferred label: Skönlitteratur på austronesiska språk (Skönklass) @sv

Tiedostamaton sielunelämä
type: Class
type: Concept
subclass of: Psyyken rakenne ja toiminnot
alternative label: Ekstaattiset ilmiöt, psykologia (121.9)
alternative label: Freudilaisuus, tiedostamaton sielunelämä (121.9 +)
alternative label: Hurmostila, psykologia (121.9)
alternative label: Kokemukset, tiedostamaton sielunelämä (121.9 +)
alternative label: Näyt, tiedostamaton sielunelämä (121.9 +)
alternative label: Psykologia, tiedostamaton sielunelämä (121.9 +)
alternative label: Sielunelämä, tiedostamaton sielunelämä (121.9 +)
alternative label: Sivupersoonat (121.9)
alternative label: Tiedostamaton , psykologia (121.9 +)
alternative label: Tiedostamaton sielunelämä, psykologia (121.9 +)
alternative label: Transsi, psykologia (121.9)
alternative label: Unohtaminen, tiedostamaton sielunelämä (121.9 +)
alternative label: Vietit, tiedostamaton sielunelämä (121.9 +)
alternative label: Yö, uni (121.9 +)
alternative label: Bipersoner (121.9) @sv
alternative label: Det omedvetna, psykologi (121.9 +) @sv
alternative label: Drifter, omedvetna själslivet (121.9 +) @sv
alternative label: Erfarenheter, omedvetna själslivet (121.9 +) @sv
alternative label: Extas, psykologi (121.9) @sv
alternative label: Extatiska fenomen, psykologi (121.9) @sv
alternative label: Freudianism, omedvetna själslivet (121.9 +) @sv
alternative label: Glömska, omedvetna själslivet (121.9 +) @sv
alternative label: Natt, sömn (121.9 +) @sv
alternative label: Omedvetna , psykologi (121.9 +) @sv
alternative label: Omedvetna själslivet, psykologi (121.9 +) @sv
alternative label: Psykologi, omedvetna själslivet (121.9 +) @sv
alternative label: Själsliv, omedvetna själslivet (121.9 +) @sv
alternative label: Syner, omedvetna själslivet (121.9 +) @sv
alternative label: Trance, psykologi (121.9) @sv
broader: Psyyken rakenne ja toiminnot
in scheme: URN:NBN:fi:au:hklj:
narrower: Uni
narrower: Alitajunta
narrower: Hypnoosi. Suggestio
notation: 121.9
preferred label: The unconscious mind @en
preferred label: Det omedvetna själslivet @sv
related: Tunne- ja tahtotoiminnot
related: Psykologian suunnat
related: Syvyyspsykologia
related: Lapsuuden ja nuoruuden psykologia
related: Muita psykologian aloja
related: Kehityspsykologia. Eri ikäkausien psykologia
related: RAJATIETO
related: Parapsykologia
related: Kuolemakokemukset
related: Analyyttinen psykoterapia
scope note: Tässä ja alaluokissa tiedostamattomat sieluntilat psykologisina ilmiöinä Tässä sivupersoonat, ekstaasi, transsi ja hurmostila psykologisina ilmiöinä
scope note: Hit och till underklasserna omedvetna själstillstånd ur psykologisk synvinkel Hit alter ego, extas och trans som psykologiska fenomen @sv

Luku-, kirjoitus- ja puhehäiriöiset
type: Class
type: Concept
subclass of: URN:NBN:fi:au:hklj:181.9
alternative label: AAC-menetelmät, puhehäiriöt, erityisopetus (181.91)
alternative label: Artikulaatiohäiriöt, puheterapia (181.91)
alternative label: Dysartria, puheterapia (181.91)
alternative label: Dysfasia, puheterapia (181.91)
alternative label: Dyslogia, puheterapia (181.91)
alternative label: Helppolukuiset kirjat, lukihäiriöt (181.91)
alternative label: Kielelliset häiriöt, erityisopetus (181.91)
alternative label: Kielelliset häiriöt, lukihäiriöt (181.91)
alternative label: Kielihäiriöt, erityisopetus (181.91)
alternative label: Kielihäiriöt, lukihäiriöt (181.91)
alternative label: Kirjoittamaan oppiminen, lukihäiriöt (181.91)
alternative label: Kirjoittaminen, lukihäiriöt (181.91)
alternative label: Kirjoitushäiriöt, erityisopetus (181.91)
alternative label: Kirjoitusvaikeudet, erityisopetus (181.91)
alternative label: Logonomia (181.91)
alternative label: Logonomia, puheopetus, puheterapia (181.91)
alternative label: Logopedia (181.91)
alternative label: Lukemaan oppiminen, lukemishäiriöt (181.91)
alternative label: Lukeminen, lukemishäiriöt (181.91)
alternative label: Lukemishäiriöt (181.91)
alternative label: Lukemisvaikeudet (181.91)
alternative label: Lukihäiriöt (181.91)
alternative label: Lukivaikeudet (181.91)
alternative label: Luku- ja kirjoitushäiriöt (181.91)
alternative label: Lukuhäiriöt (181.91)
alternative label: Lukutaidottomuus, lukihäiriöt (181.91)
alternative label: Mykkyys, erityisopetus (181.91)
alternative label: Puhe, puheopetus, puheterapia (181.91)
alternative label: Puhe-elimet, puheopetus, puheterapia (181.91)
alternative label: Puheentuotto, puhehäiriöisten erityisopetus (181.91)
alternative label: Puhehäiriöt, erityisopetus (181.91)
alternative label: Puhekyvyttömyys, erityisopetus (181.91)
alternative label: Puheopetus (181.91)
alternative label: Puheoppi (181.91)
alternative label: Puheoppi, puheopetus, puheterapia (181.91)
alternative label: Puhetekniikka, erityisopetus (181.91)
alternative label: Puheterapia (181.91)
alternative label: Puhetieteet, logopedia (181.91)
alternative label: Puhetta tukeva ja korvaava kommunikaatio, puhehäiriöt, erityisopetus (181.91)
alternative label: Puhetta tukeva ja korvaava kommunikointi, puhehäiriöt, erityisopetus (181.91)
alternative label: Puhevammaiset, erityisopetus (181.91)
alternative label: Puheviestintä, puheterapia (181.91)
alternative label: Puhumaan oppiminen, puheopetus, puheterapia (181.91)
alternative label: Puhuminen, puheopetus, puheterapia (181.91)
alternative label: Sanasokeus (181.91)
alternative label: Selkokirjat, lukihäiriöt (181.91)
alternative label: Selkolehdet, lukihäiriöt (181.91)
alternative label: Terapia, puheterapia (181.91)
alternative label: Tuettu kommunikointi, puhehäiriöt, erityisopetus (181.91)
alternative label: Änkytys (181.91)
alternative label: Äänifysiologia, puheterapia (181.91)
alternative label: Ääniharjoitukset, puheterapia (181.91)
alternative label: Äänihäiriöt (181.91)
alternative label: Ääntäminen, puheterapia (181.91)
alternative label: AKK-metoden, talstörningar, specialundervisning (181.91) @sv
alternative label: Alternativ och kompletterande kommunikation, talstörningar, specialundervisning (181.91) @sv
broader: URN:NBN:fi:au:hklj:181.9
in scheme: URN:NBN:fi:au:hklj:
notation: 181.91
related: Kirjoitus. Kirjoitustaito
related: Oppimisen psykologia
related: Kasvatusfilosofia. Kasvatustavoitteet
related: Kasvatuspsykologia
related: URN:NBN:fi:au:hklj:181.7
related: URN:NBN:fi:au:hklj:182
related: Peruskoulut
related: URN:NBN:fi:au:hklj:183.5
related: URN:NBN:fi:au:hklj:183.7
related: URN:NBN:fi:au:hklj:617.2
related: Korva. Nenäontelo. Kurkku. Korva-, nenä- ja kurkkutaudit
related: Lapsi- ja nuorisopsykiatria
related: Ilmaisutaito. Puhetaito. Lausuntataide
related: Äänneoppi
related: Ruotsin kielen äänneoppi
related: Suomen kielen äänneoppi
scope note: Luku-, kirjoitus- ja puhehäiriöisten erityisopetus Puheviat. Änkyttäminen. Puheopetus. Puheterapia
scope note: Specialundervisning för personer med läs- och skrivsvårigheter och talrubbningar Talfel. Stamning. Talpedagogik. Logopedi. Talterapi @sv

Kansalais-, kansan- ja työväenopistot. Kansankorkeakoulut
type: Class
type: Concept
subclass of: URN:NBN:fi:au:hklj:185
alternative label: Kansalaisopistot (185.1)
alternative label: Kansankorkeakoulut (185.1)
alternative label: Kansanopistot (185.1)
alternative label: Työväenopistot (185.1)
alternative label: Arbetarinstitut (185.1) @sv
alternative label: Folkakademier (185.1) @sv
alternative label: Folkhögskolor (185.1) @sv
alternative label: Medborgarinstitut (185.1) @sv
broader: URN:NBN:fi:au:hklj:185
in scheme: URN:NBN:fi:au:hklj:
notation: 185.1
preferred label: Civic and workers' institutes. Folk high-schools. Folk academies @en
preferred label: Medborgar- och arbetarinstitut. Folkhögskolor. Folkakademier @sv
related: URN:NBN:fi:au:hklj:060
related: URN:NBN:fi:au:hklj:061
related: URN:NBN:fi:au:hklj:063
related: URN:NBN:fi:au:hklj:181.7
related: URN:NBN:fi:au:hklj:182
related: URN:NBN:fi:au:hklj:183
related: URN:NBN:fi:au:hklj:183.5
related: Keskiasteen koulutus
related: URN:NBN:fi:au:hklj:183.7
related: Muiden maiden koululaitokset
related: URN:NBN:fi:au:hklj:184
related: Muiden maiden yliopistot ja korkeakoulut
related: URN:NBN:fi:au:hklj:188.4
related: Taideopinnot
related: Kirjailijan työ. Kääntäjän työ
scope note: Kansalais-, kansan- ja työväenopistot sekä kansankorkeakoulut yleensä Erikoisalojen kansalais-, kansan- ja työväenopistot sekä kansankorkeakoulut alan mukaisessa luokassa
scope note: Medborgar- och arbetarinstitut, folkhögskolor och folkakademier i allmänhet Medborgar- och arbetarinstitut, folkhögskolor och folkakademier som rör specialområden klassificeras enligt område @sv

Henkilökohtainen hartaudenharjoitus
type: Class
type: Concept
subclass of: KÄYTÄNNÖLLINEN TEOLOGIA
alternative label: Anakoreetit, askeesi, kristillinen hartaus (248)
alternative label: Askeesi, kristinusko (248)
alternative label: Ekstaattiset ilmiöt, kristillinen meditaatio (248)
alternative label: Erakot, askeesi, kristillinen hartaus (248)
alternative label: Eremiitit, askeesi, kristillinen hartaus (248)
alternative label: Esirukous (248)
alternative label: Hartaudenharjoitus, kristillinen (248)
alternative label: Hengellinen elämä, hartaudenharjoitus, kristinusko (248)
alternative label: Henkilökohtainen hartaudenharjoitus, kristillinen (248)
alternative label: Hiljaisuus, meditaatio, kristillinen (248)
alternative label: Hiljentyminen, kristillinen hartaus (248)
alternative label: Hurmostila, kristillinen hartaudenharjoitus (248)
alternative label: Katarsis, mystiikka (248)
alternative label: Katharsis, mystiikka (248)
alternative label: Kontemplaatio, kristinusko (248)
alternative label: Meditaatio, kristillinen (248)
alternative label: Mielenrauha, kristillinen hartaus (248)
alternative label: Mietiskely, kristillinen (248)
alternative label: Mysteeriuskonnot, kristinusko, mystiikka (248)
alternative label: Mystiikka, kristinusko (248)
alternative label: Näyt, kristillinen mystiikka (248)
alternative label: Paasto, kristillinen hartaus (248)
alternative label: Retriitit, kristillinen mietiskely (248)
alternative label: Rukoileminen, kristinusko (248)
alternative label: Rukouksen teologia, kristinusko (248)
alternative label: Rukous, kristinusko (248)
alternative label: Spiritualiteetti, mietiskely, kristillinen (248)
alternative label: Spiritualiteetti, rukous, kristinusko (248)
alternative label: Transsendenssi, kristillinen mystiikka (248)
alternative label: Transsi, kristillinen meditaatio (248)
alternative label: Uskonelämä, hartaudenharjoitus, rukous (248)
alternative label: Uskonnolliset kokemukset, kristillinen hartaudenharjoitus (248)
alternative label: Visualisointi, meditaatio, kristillinen (248)
alternative label: Yliluonnolliset ilmiöt, kristillinen mystiikka (248)
alternative label: Yliluonnolliset olennot, kristillinen mystiikka (248)
alternative label: Anakoreter, askes, kristen andaktsövning (248) @sv
alternative label: Andaktsövning, kristen (248) @sv
alternative label: Andligt liv, andaktsövning, kristendom (248) @sv
alternative label: Askes, kristendom (248) @sv
alternative label: Bedjande, kristendom (248) @sv
alternative label: Bön, kristendom (248) @sv
alternative label: Bönens teologi, kristendom (248) @sv
alternative label: Eremiter, askes, kristen andaktsövning (248) @sv
alternative label: Extas, kristen andaktsövning (248) @sv
alternative label: Extatiska fenomen, kristen meditation (248) @sv
alternative label: Fasta, kristen andaktsövning (248) @sv
alternative label: Förbön (248) @sv
alternative label: Katharsis, mystik (248) @sv
alternative label: Kontemplation, kristendom (248) @sv
alternative label: Meditation, hiljentyminen, kristen andaktsövning (248) @sv
alternative label: Meditation, meditaatio, kristen (248) @sv
alternative label: Meditation, mietiskely, kristen (248) @sv
alternative label: Mysteriereligioner, kristendom, mystik (248) @sv
alternative label: Mystik, kristendom (248) @sv
alternative label: Personlig andaktsövning, kristen (248) @sv
alternative label: Religiösa upplevelser, kristen andaktsövning (248) @sv
alternative label: Retreater, kristen meditation (248) @sv
broader: KÄYTÄNNÖLLINEN TEOLOGIA
in scheme: URN:NBN:fi:au:hklj:
notation: 248
related: Uskonto- ja maailmankatsomuspsykologia
related: Hartauskirjat
related: Rukouskirjat
related: Virsikirjat ja hengelliset laulukirjat
related: URN:NBN:fi:au:hklj:280
related: Intian uskonnot ja mytologiat
related: Buddhalaisuus ja sen mytologia
related: Kristillisten kirkkojen musiikki
related: Protestanttinen musiikki
related: Virret. Hengelliset laulut
related: URN:NBN:fi:au:hklj:787.112
related: Spirituaalit. Gospel-musiikki
related: Roomalaiskatolinen musiikki
related: Ortodoksinen musiikki
related: Muiden kristillisten kirkkojen musiikki
scope note: Hartaus. Rukous. Rukouksen teologia. Kristillinen meditaatio ja askeesi Mystiikka kristillisen hartaudenharjoituksen kannalta
scope note: Andakt. Bön. Bönens teologi. Kristen meditation och askes Mystik ur den kristna andaktsutövningens synvinkel @sv

Afrikan alkuperäiskansojen uskonnot
type: Class
type: Concept
subclass of: Muut uskonnot ja mytologiat
alternative label: Afrikka, mytologiat (289.1)
alternative label: Afrikka, uskonnot (289.1)
alternative label: Afrika, mytologier (289.1) @sv
alternative label: Afrika, religioner (289.1) @sv
broader: Muut uskonnot ja mytologiat
in scheme: URN:NBN:fi:au:hklj:
notation: 289.1
preferred label: Native African religions and mythologies @en
preferred label: De afrikanska ursprungsfolkens religioner och mytologier @sv
related: URN:NBN:fi:au:hklj:110
related: RAJATIETO
related: URN:NBN:fi:au:hklj:192
related: Kuolemakokemukset
related: Uskonnonfilosofia
related: Elämä. Kuolema
related: Luominen. Kehitys
related: URN:NBN:fi:au:hklj:209
related: URN:NBN:fi:au:hklj:210
related: Jumalan olemus
related: Enkelit. Paholaiset. Demonit
related: Kuolema ja kuolemanjälkeinen elämä
related: Lähetystyö
related: Muinais-Egyptin ja Etu-Aasian uskonnot ja mytologiat
related: URN:NBN:fi:au:hklj:807
related: URN:NBN:fi:au:hklj:992

Muinaissuomalaiset ja suomalais-ugrilaiset uskonnot ja mytologiat
type: Class
type: Concept
subclass of: Muut uskonnot ja mytologiat
alternative label: Karsikkopuut, suomalainen mytologia (289.8)
alternative label: Karsikot, suomalainen mytologia (289.8)
alternative label: Lappalaiset, muinaisuskonto (289.8)
alternative label: Lappalaiset, mytologia (289.8)
alternative label: Saamelaiset, muinaisuskonto (289.8)
alternative label: Saamelaiset, mytologia (289.8)
alternative label: Seidat (289.8)
alternative label: Suomalainen mytologia (289.8)
alternative label: Suomalais-ugrilainen mytologia (289.8)
alternative label: Finländsk mytologi (289.8) @sv
alternative label: Finsk-ugrisk mytologi (289.8) @sv
alternative label: Karsikkoträd, finländsk mytologi (289.8) @sv
alternative label: Lappar, forntida religioner (289.8) @sv
alternative label: Lappar, mytologi (289.8) @sv
alternative label: Samer, forntida religion (289.8) @sv
alternative label: Samer, mytologi (289.8) @sv
alternative label: Sejtar (289.8) @sv
broader: Muut uskonnot ja mytologiat
in scheme: URN:NBN:fi:au:hklj:
notation: 289.8
preferred label: Ancient Finnish and Finno-Ugric religions and mythologies @en
preferred label: Fornfinska och finsk-ugriska religioner och mytologier @sv
related: URN:NBN:fi:au:hklj:110
related: RAJATIETO
related: URN:NBN:fi:au:hklj:192
related: Kuolemakokemukset
related: Uskonnonfilosofia
related: Elämä. Kuolema
related: Luominen. Kehitys
related: URN:NBN:fi:au:hklj:209
related: URN:NBN:fi:au:hklj:210
related: Jumalan olemus
related: Enkelit. Paholaiset. Demonit
related: Kuolema ja kuolemanjälkeinen elämä
related: Lähetystyö
related: URN:NBN:fi:au:hklj:807
related: Suomenkielisen kansanrunouden historia ja tutkimus
related: URN:NBN:fi:au:hklj:992

Työ sosiaalipoliittisena kysymyksenä
type: Class
type: Concept
subclass of: URN:NBN:fi:au:hklj:371
alternative label: Alaiset, työn sosiaalipolitiikka (371.1 +)
alternative label: Ammatillinen kasvu, työelämä (371.1 +)
alternative label: Ammatillinen kehitys, työelämä (371.1 +)
alternative label: Ammatinvaihto, työelämä (371.1 +)
alternative label: Ammattiperinne, työelämä (371.1 +)
alternative label: Ansiotyö, työn sosiaalipolitiikka (371.1 +)
alternative label: Avotyö, työelämä, vammaiset (371.1 +)
alternative label: Diskriminointi, syrjintä työelämässä (371.1)
alternative label: Elämänhallinta, työelämä (371.1 +)
alternative label: Epätyypillinen työ (371.1 +)
alternative label: Etätyö (371.1 +)
alternative label: Hajautettu työ (371.1 +)
alternative label: Halpatyövoima, työelämän sosiaalipolitiikka (371.1 +)
alternative label: Henkilöarviointi, työelämä (371.1 +)
alternative label: Henkinen toimintakyky, työelämä (371.1 +)
alternative label: Huumetestit, työpaikat (371.1 +)
alternative label: ILO-sopimukset (371.1 +)
alternative label: Ihmiskauppa, lapsityövoima (371.1 +)
alternative label: Ikäsyrjintä, työelämä (371.1)
alternative label: Ikääntyneet, työelämä (371.1)
alternative label: Ikääntyvät työntekijät, työelämä (371.1)
alternative label: Itsesäätely, työelämä (371.1 +)
alternative label: Joustavuus, työelämä (371.1 +)
alternative label: Joustotyö (371.1 +)
alternative label: Joustotyö, työelämä (371.1 +)
alternative label: Kansainväliset työsopimukset (371.1)
alternative label: Kesätyö (371.1 +)
alternative label: Kolmas sektori, työelämä (371.1 +)
alternative label: Koulutustausta, työelämä (371.1 +)
alternative label: Lapsikauppa, lapsityövoima (371.1 +)
alternative label: Lapsityövoima, työelämä (371.1 +)
alternative label: Lähityö (371.1 +)
alternative label: Miesvaltaisuus, työelämä (371.1)
alternative label: Monialaisuus, työelämä (371.1 +)
alternative label: Moniammatillisuus, työelämä (371.1 +)
alternative label: Moniogelmaisuus, työelämä (371.1 +)
alternative label: Monitoimisuus, työelämä (371.1 +)
alternative label: Muutosvalmius, työelämä (371.1 +)
alternative label: Muutosvastarinta, työelämä (371.1 +)
alternative label: Naisvaltaisuus, työelämä (371.1)
alternative label: Nuoret työntekijät (371.1 +)
alternative label: Orientoituminen, työelämä (371.1 +)
alternative label: Palveluammatit, työn sosiaalipolitiikka (371.1 +)
alternative label: Prekariaatti, työn sosiaalipolitiikka (371.1 +)
alternative label: Psyykkinen toimintakyky, työelämä (371.1 +)
alternative label: Päätoimisuus, työelämä (371.1 +)
alternative label: Siirtotyöläiset, työn sosiaalipolitiikka (371.1 +)
alternative label: Sijaiset, asema työpaikoilla (371.1 +)
alternative label: Sirkadiaaninen rytmi, työelämä (371.1 +)
alternative label: Sirkadiaanirytmi, työelämä (371.1 +)
alternative label: Sitouttaminen, työelämä (371.1 +)
alternative label: Sosiaaliset innovaatiot, työelämä (371.1 +)
alternative label: Sukupuoleen perustuva vaino, sukupuolisyrjintä, työelämä (371.1 +)
alternative label: Sukupuolisyrjintä, työelämä (371.1 +)
alternative label: Sukupuolivaikutukset, työelämä (371.1 +)
alternative label: Suojatyö, työn sosiaalipolitiikka (371.1 +)
alternative label: Suunnistautuminen, työelämä (371.1 +)
alternative label: Syrjimättömyys, tasa-arvo, työelämä (371.1 +)
alternative label: Syrjintä, syrjintä työelämässä (371.1 +)
broader: URN:NBN:fi:au:hklj:371
in scheme: URN:NBN:fi:au:hklj:
narrower: Työolot
narrower: Työsuojelu
narrower: Työllisyys. Työttömyys. Työvoimapalvelu
notation: 371.1
related: Sovellettu psykologia
related: Työoikeus
related: Työn sosiologia
related: Pääoma. Työ. Luonnonvarat
related: Elintaso. Kulutus
related: Naisen ja miehen asema yhteiskunnassa
related: Työväenliike
related: Työmarkkinajärjestöt
related: Työntutkimukset. Työanalyysi
related: Henkilöstöpolitiikka
scope note: Työ ja työelämä sosiaalipoliittisena kysymyksenä yleensä Nuorten työntekijöiden, naisten, miesten, vammaisten, maahanmuuttajien sekä muiden työntekijäryhmien asema työelämässä. Lapsityövoiman käyttö
scope note: Arbetet och arbetslivet som socialpolitisk fråga i allmänhet Unga arbetstagares, kvinnors, mäns, handikappades, invandrares och andra arbetstagargruppers ställning i arbetslivet. Barnarbetskraft @sv

Hoitolaitokset. Sairaalatekniikka
type: Class
type: Concept
subclass of: Hoitotiede. Hoitotyö. Hoitohenkilökunta
alternative label: Ajanvaraus, hoitolaitokset (610.71)
alternative label: Akuuttihoitopalvelut (610.71)
alternative label: Aluesairaalat (610.71)
alternative label: Antiseptiikka, sairaalatekniikka (610.71)
alternative label: Aseptiikka, sairaalatekniikka (610.71)
alternative label: Autoklinikat (610.71)
alternative label: Biopankit, lääketieteen tekniikka (610.71)
alternative label: Desinfektio, sairaalatekniikka (610.71)
alternative label: Desinfektioaineet, sairaalatekniikka (610.71)
alternative label: Desinfiointi, sairaalatekniikka (610.71)
alternative label: Desinfiointiaineet, sairaalatekniikka (610.71)
alternative label: Green care, terveyspalvelut, hoitolaitokset (610.71)
alternative label: Hoitokodit (610.71)
alternative label: Hoitolaitokset (610.71)
alternative label: Hoitolaitteet, sairaalatekniikka (610.71)
alternative label: Hoitopaikat, sairaalat (610.71)
alternative label: Huoltolaitokset, hoitolaitokset (610.71)
alternative label: Keskuslaitokset, hoitolaitokset (610.71)
alternative label: Keskussairaalat (610.71)
alternative label: Klinikat (610.71)
alternative label: Kotiuttaminen, potilaat (610.71)
alternative label: Kroonikot, hoitolaitokset (610.71)
alternative label: Kudospankit, lääketieteen tekniikka (610.71)
alternative label: Kuntoutuskeskukset (610.71)
alternative label: Kuntoutuslaitokset (610.71)
alternative label: Kuolleet, sairaalatekniikka (610.71)
alternative label: Laboratoriot, lääketiede (610.71)
alternative label: Laboratoriotekniikka, lääketiede (610.71)
alternative label: Laboratoriotyöt, lääketiede (610.71)
alternative label: Laboratoriovälineet, lääketiede (610.71)
alternative label: Laitokset, sairaalat (610.71)
alternative label: Laitoshoito, sairaalat (610.71)
alternative label: Laitoshuolto, sairaalat (610.71)
alternative label: Laitospaikat, sairaalat (610.71)
alternative label: Laitospalvelut, sairaalat (610.71)
alternative label: Lääketieteellinen tekniikka (610.71)
alternative label: Lääketieteelliset laboratoriot (610.71)
alternative label: Lääketieteelliset laitteet (610.71)
alternative label: Lääkäriasemat (610.71)
alternative label: Lääkärikeskukset (610.71)
alternative label: Opetussairaalat, yliopistosairaalat (610.71)
alternative label: Parantolat (610.71)
alternative label: Pitkäaikaissairaat, hoitolaitokset (610.71)
alternative label: Poliklinikat (610.71)
alternative label: Potilaspaikat, sairaalat (610.71)
alternative label: Puhdastilatekniikka, sairaalatekniikka (610.71)
alternative label: Puhdistuspalvelut, sairaalatekniikka (610.71)
alternative label: Puhtaus, sairaalatekniikka (610.71)
alternative label: Puhtauspalvelut, sairaalatekniikka (610.71)
alternative label: Päivystys, sairaalat (610.71)
alternative label: Päiväsairaalat (610.71)
alternative label: Ruumiin säilytystekniikka (610.71)
alternative label: Ruumis, sairaalatekniikka (610.71)
alternative label: Ruumishuoneet (610.71)
alternative label: Sairaalalaboratoriot (610.71)
alternative label: Sairaalalaitteet (610.71)
alternative label: Sairaalaosastot (610.71)
broader: Hoitotiede. Hoitotyö. Hoitohenkilökunta
in scheme: URN:NBN:fi:au:hklj:
notation: 610.71
related: URN:NBN:fi:au:hklj:332.22
related: Organisaatioiden ja laitosten sosiologia
related: URN:NBN:fi:au:hklj:371.6
related: Lääketieteen filosofia ja etiikka
related: URN:NBN:fi:au:hklj:615
related: URN:NBN:fi:au:hklj:615.1
related: Apteekit
related: Fysioterapia. Fysiologiset hoitomuodot
related: URN:NBN:fi:au:hklj:615.3
related: Seerumihoito. Rokotukset. Verensiirto
related: URN:NBN:fi:au:hklj:615.8
related: Vaihtoehtolääkintä. Luonnonparannus
related: URN:NBN:fi:au:hklj:617
related: URN:NBN:fi:au:hklj:617.1
related: Optiset ja lääketieteelliset laitteet
scope note: Yleisteokset hoitolaitoksista sekä niiden hallinnosta, organisaatiosta ja toiminnasta Sairaalat, klinikat, terveyskeskukset, hoitolat, parantolat, kuntoutuslaitokset ja lääkäriasemat yleensä Lääketieteelliset laboratoriot yleensä Sairaaloiden ja muiden hoitolaitosten ja laboratorioiden teknistä laitteistoa koskevat yleisteokset Ruumishuoneet. Ruumiin säilytystekniikat. Palsamointi Erikoisalojen sairaalat ja muut hoitolaitokset sekä niiden tekninen laitteisto alan mukaisessa luokassa
scope note: Allmänna verk som rör vårdinrättningar samt deras administration, organisation och verksamhet Sjukhus, kliniker, hälsocentraler, vårdanstalter, sanatorier, rehabiliteringsanstalter och läkarstationer i allmänhet Medicinska laboratorier i allmänhet Allmänna verk som rör teknisk utrustning på sjukhus och i övriga vårdinrättningar och laboratorier Bårhus. Metoder att bevara döda kroppar. Balsamering Sjukhus och andra vårdinrättningar samt deras tekniska utrustning som hänför sig till specialområden klassificeras enligt område @sv

Lääketieteellinen kemia ja fysiikka
type: Class
type: Concept
subclass of: URN:NBN:fi:au:hklj:616
alternative label: Fysiikka, lääketieteellinen fysiikka (616.1)
alternative label: Kemia, lääketieteellinen kemia (616.1)
alternative label: Lääketieteellinen fysiikka (616.1)
alternative label: Lääketieteellinen kemia (616.1)
alternative label: Fysik, medicinsk fysik (616.1) @sv
alternative label: Kemi, medicinsk kemi (616.1) @sv
alternative label: Medicinsk fysik (616.1) @sv
alternative label: Medicinsk kemi (616.1) @sv
broader: URN:NBN:fi:au:hklj:616
in scheme: URN:NBN:fi:au:hklj:
notation: 616.1
preferred label: Medical chemistry and physics @en
preferred label: Medicinsk kemi och fysik @sv
related: URN:NBN:fi:au:hklj:332.22
related: URN:NBN:fi:au:hklj:371.6
related: FYSIIKKA
related: KEMIA
related: Sovellettu kemia
related: BIOKEMIA
related: Eläinsuojelu
related: Anatomia
related: URN:NBN:fi:au:hklj:612
related: URN:NBN:fi:au:hklj:615.1
related: URN:NBN:fi:au:hklj:616.2
related: Immunologia. Serologia. Verioppi
related: URN:NBN:fi:au:hklj:617
related: URN:NBN:fi:au:hklj:617.1
related: Kemian teollisuus
related: Eläinlääketiede
scope note: Lääketieteellisen kemian ja fysiikan yleisteokset Lääketieteellisen kemian ja fysiikan sovellukset alan mukaisessa luokassa
scope note: Allmänna verk om medicinsk kemi och fysik Tillämpningar av medicinsk kemi och fysik klassificeras enligt område @sv

Immunologia. Serologia. Verioppi
type: Class
type: Concept
subclass of: URN:NBN:fi:au:hklj:616
alternative label: Antibodit (616.4)
alternative label: Antigeenit, lääketiede (616.4)
alternative label: Apoptoosi, immunologia (616.4)
alternative label: Autoimmuniteetti (616.4)
alternative label: Autovasta-aineet (616.4)
alternative label: Biolääketiede, immunologia ja serologia (616.4)
alternative label: Defenssimekanismit, immunologia (616.4)
alternative label: Endosytoosi, immunologia (616.4)
alternative label: Fagosytoosi, immunologia (616.4)
alternative label: Hematologia (616.4)
alternative label: Hematologia, immunologia (616.4)
alternative label: Hematologia, serologia (616.4)
alternative label: Hematologia, vasta-aineet (616.4)
alternative label: Hematologia, veriryhmät (616.4)
alternative label: Hylkimisreaktiot, immunologia (616.4)
alternative label: Hyytyminen, verioppi (616.4)
alternative label: Immuniteetti (616.4)
alternative label: Immunologia (616.4)
alternative label: Immunologiset sairaudet (616.4)
alternative label: Immunologiset taudit (616.4)
alternative label: Immunotoksikologia, immunologia (616.4)
alternative label: Immuunijärjestelmä (616.4)
alternative label: Immuunijärjestelmän sairaudet (616.4)
alternative label: Immuunisairaudet (616.4)
alternative label: Immuunitaudit (616.4)
alternative label: Immuunivaste (616.4)
alternative label: Imusolut, verioppi (616.4)
alternative label: Komplementtijärjestelmä, immunologia (616.4)
alternative label: Lymfosyytit, verioppi (616.4)
alternative label: Lääketieteellinen biologia, immunologia (616.4)
alternative label: Lääketieteellinen biologia, verioppi (616.4)
alternative label: Makrofagit, fagosytoosi, immunologia (616.4)
alternative label: Makrofagit, immunologia (616.4)
alternative label: Ohjelmoitunut solukuolema, immunologia (616.4)
alternative label: Omavasta-aineet (616.4)
alternative label: Plasma, verioppi (616.4)
alternative label: Punasolut, verioppi (616.4)
alternative label: Resistenssi (616.4)
alternative label: Rh-tekijä (616.4)
alternative label: Seerumi (616.4)
alternative label: Seerumioppi (616.4)
alternative label: Sekundaarivaste (616.4)
alternative label: Serologia (616.4)
alternative label: Serotyyppi, serologia (616.4)
alternative label: Syöjäsolutoiminta, immunologia (616.4)
alternative label: Valkosolut, verioppi, immunologia (616.4)
alternative label: Vasta-aineet (616.4)
alternative label: Vastustuskyky (616.4)
alternative label: Veri, veriryhmät (616.4)
alternative label: Veriplasma, verioppi (616.4)
alternative label: Veriryhmät (616.4)
alternative label: Anti bodies (616.4) @sv
alternative label: Antigener, medicin (616.4) @sv
alternative label: Antikroppar (616.4) @sv
alternative label: Apoptosi, immunologi (616.4) @sv
alternative label: Autoantikroppar (616.4) @sv
alternative label: Autoimmunitet (616.4) @sv
broader: URN:NBN:fi:au:hklj:616
in scheme: URN:NBN:fi:au:hklj:
notation: 616.4
related: URN:NBN:fi:au:hklj:332.22
related: URN:NBN:fi:au:hklj:371.6
related: Eläinsuojelu
related: Anatomia
related: URN:NBN:fi:au:hklj:612
related: URN:NBN:fi:au:hklj:615
related: URN:NBN:fi:au:hklj:615.1
related: Seerumihoito. Rokotukset. Verensiirto
related: Lääketieteellinen kemia ja fysiikka
related: URN:NBN:fi:au:hklj:616.2
related: URN:NBN:fi:au:hklj:617
related: URN:NBN:fi:au:hklj:617.1
related: Sydän- ja verenkiertoelimet. Sydän- ja verenkiertoelinten taudit. Veri. Veritaudit
related: Tartuntataudit
related: Eläinlääketiede
scope note: Lääketieteellinen immunologia, serologia ja verioppi Vastustuskyky. Immuniteetti. Vasta-aineet ja niiden muodostuminen Veriryhmät. Veriryhmätutkimukset Jos teos koskee sekä seerumihoitoa, rokotuksia tai verensiirtoja että immunologista, serologista tai veriopillista tutkimusta, on etusija luokalla 616.4
scope note: Medicinsk immunologi, serologi och hematologi Motståndskraft. Immunitet. Antikroppar och bildningen av dem Blodgrupper. Blodgruppsundersökning Om verket handlar om såväl serumbehandling, vaccineringar och blodtransfusioner som forskning i immunologi, serologi och hematologi, ges företräde åt klass 616.4 @sv

Muut ilmakulkuneuvot
type: Class
type: Concept
subclass of: Ilmakulkuneuvot
alternative label: Autogirot (626.5)
alternative label: Helikopterit (626.5)
alternative label: Ilmalaivat (626.5)
alternative label: Ilmapallot (626.5)
alternative label: Kuumailmapallot (626.5)
alternative label: Liitolentokoneet (626.5)
alternative label: Purjelentokoneet (626.5)
alternative label: Sotilashelikopterit (626.5)
alternative label: Sotilasilmailu, sotilashelikopterit (626.5)
alternative label: Autogiror (626.5) @sv
alternative label: Ballonger (626.5) @sv
alternative label: Glidflygplan (626.5) @sv
alternative label: Helikoptrar (626.5) @sv
alternative label: Luftfartyg (626.5) @sv
alternative label: Militärflyg, militärhelikoptrar (626.5) @sv
alternative label: Militärhelikoptrar (626.5) @sv
alternative label: Segelflygplan (626.5) @sv
alternative label: Varmluftsballonger (626.5) @sv
broader: Ilmakulkuneuvot
in scheme: URN:NBN:fi:au:hklj:
notation: 626.5
preferred label: Other aircraft @en
preferred label: Andra luftfarkoster @sv
related: URN:NBN:fi:au:hklj:380
related: Ilmaliikenne. Ilmailu
related: Sotataito. Strategia. Taktiikka
related: Aseteknologia
related: URN:NBN:fi:au:hklj:460
related: Avaruustutkimus. Avaruuslennot. Avaruusteknologia
related: URN:NBN:fi:au:hklj:620.88
related: Yleinen konetekniikka
related: Koneenrakennus. Pneumatiikka. Hydrauliikka
related: Voimakoneet. Moottorit. Nosto- ja kuljetuslaitteet
related: Lentokoneet
related: URN:NBN:fi:au:hklj:631
related: Moottoriurheilu. Lentourheilu
related: Lentourheilu
related: URN:NBN:fi:au:hklj:798
scope note: Purjelentokoneet. Liitolentokoneet. Ilmapallot. Kuumailmapallot. Ilmalaivat Siviili- ja sotilaskäyttöön tarkoitetut helikopterit Jos teos koskee sekä ilmaliikennettä tai ilmailua että ilmakulkuneuvoja, on etusija luokalla 386.2
scope note: Segelflygplan. Glidflygplan. Luftballonger. Varmluftsballonger. Luftskepp Helikoptrar för civilt och militärt bruk Om verket handlar om såväl lufttrafik och luftfart som luftfarkoster ges företräde åt klass 386.2 @sv

Sähköenergian muuttaminen, muuntaminen, jakelu ja siirto
type: Class
type: Concept
subclass of: Sähkötekniikka
alternative label: Aggregaatit (627.3)
alternative label: Asennus, sähkötekniikka (627.3)
alternative label: Dynamot (627.3)
alternative label: Eristeet, sähkötekniikka (627.3)
alternative label: Eristimet, sähkötekniikka (627.3)
alternative label: Eristys, sähkötekniikka (627.3)
alternative label: Fullereenit, sähkötekniikka (627.3)
alternative label: Generaattorit (627.3)
alternative label: Grafeeni, sähkötekniikka (627.3)
alternative label: Grafiini, sähkötekniikka (627.3)
alternative label: Johteet, sähkötekniikka (627.3)
alternative label: Johtimet, sähkötekniikka (627.3)
alternative label: Kaapelit, sähkötekniikka (627.3)
alternative label: Kaapelointi, sähkötekniikka (627.3)
alternative label: Kelat, sähkötekniikka (627.3)
alternative label: Kondensaattorit, sähkötekniikka (627.3)
alternative label: Koneet, sähkökoneet (627.3)
alternative label: Koneikot (627.3)
alternative label: Kuristimet, sähkölaitteet (627.3)
alternative label: Kytkentä, sähkötekniikka (627.3)
alternative label: Kytkentäkaaviot, sähkötekniikka (627.3)
alternative label: Kytkimet, sähkötekniikka (627.3)
alternative label: Kytkinasemat (627.3)
alternative label: Kytkinlaitteet, sähkötekniikka (627.3)
alternative label: Maadoitus (627.3)
alternative label: Maakaapelit, sähkötekniikka (627.3)
alternative label: Magneetot (627.3)
alternative label: Muuntajat (627.3)
alternative label: Muuntamot (627.3)
alternative label: Muuntimet (627.3)
alternative label: Pallohiili, sähkötekniikka (627.3)
alternative label: Pistokytkimet (627.3)
alternative label: Siirtojohdot (627.3)
alternative label: Sulakkeet (627.3)
alternative label: Suojaus, sähkösuojaus (627.3)
alternative label: Suurjännitelinjat, sähkönsiirto (627.3)
alternative label: Suurjännitelinjat, voimansiirtoverkot (627.3)
alternative label: Sähköasemat (627.3)
alternative label: Sähköasennus (627.3)
alternative label: Sähköenergian jakelu (627.3)
alternative label: Sähköenergian muuntaminen (627.3)
alternative label: Sähköeristeet, sähkötekniikka (627.3)
alternative label: Sähkögeneraattorit (627.3)
alternative label: Sähköjohdot (627.3)
alternative label: Sähkökaapelit (627.3)
alternative label: Sähkökatkokset (627.3)
alternative label: Sähkökatkot (627.3)
alternative label: Sähkökojeet (627.3)
alternative label: Sähkökojeet, sähkötekniikka (627.3)
alternative label: Sähkökojeet, sähkötekninen teollisuus (627.3)
alternative label: Sähkökoneet (627.3)
alternative label: Sähkökoneet, sähkötekniikka (627.3)
alternative label: Sähkökoneet, sähkötekninen teollisuus (627.3)
alternative label: Sähkökäytöt, sähkömoottorit (627.3)
alternative label: Sähkölaitteet, sähkötekniikka (627.3)
alternative label: Sähkölaitteet, sähkötekninen teollisuus (627.3)
broader: Sähkötekniikka
in scheme: URN:NBN:fi:au:hklj:
notation: 627.3
related: Sähköoppi. Magnetismi
related: URN:NBN:fi:au:hklj:620.88
related: Yleinen konetekniikka
related: Koneenrakennus. Pneumatiikka. Hydrauliikka
related: Voimakoneet. Moottorit. Nosto- ja kuljetuslaitteet
related: URN:NBN:fi:au:hklj:624
related: Raideliikenneväylät. Junat. Raitiovaunut. Metro
related: Autot
related: URN:NBN:fi:au:hklj:627.753
related: URN:NBN:fi:au:hklj:627.7531
related: URN:NBN:fi:au:hklj:627.7532
related: URN:NBN:fi:au:hklj:667.7
related: URN:NBN:fi:au:hklj:667.71
related: Uunit. Takat
related: URN:NBN:fi:au:hklj:681
related: Toimistokoneet
scope note: Sähkökoneet, sähkömoottorit, sähkölaitteet sekä sähköasennus yleensä Sähkögeneraattorit. Magneetot. Muuttajat. Muuntajat Johteet. Eristeet. Suojaus. Maadoitus. Sulakkeet Sähköjohdot. Sähkökaapelit. Sähköverkot. Sähkökytkennät. Sähkökatkaisijat Sähkötekniikan sovellukset eri aloille sekä erikoisalojen sähkökäyttöiset koneet ja laitteet alan mukaisessa luokassa
scope note: Elmaskiner, elmotorer, elaggregat samt elinstallation i allmänhet Elgeneratorer. Magneter. Omformare. Transformatorer Ledningar. Isolatorer. Strömskydd. Jordning. Säkringar Elledningar. Elkablar. Elnät. Elkopplingar. Strömbrytare Tillämpningar av elteknik inom olika områden samt eldrivna maskiner och apparater för specialområden klassificeras enligt område @sv

Orgaanisen kemian teollisuus
type: Class
type: Concept
subclass of: KEMIAN TEOLLISUUS. KAIVOSTEOLLISUUS
alternative label: Akrylonitriili, kemianteollisuus (649)
alternative label: Akryylinitriili, kemianteollisuus (649)
alternative label: Alkoholipolttoaineet (649)
alternative label: Biopolymeerit, orgaanisen kemian teollisuus (649 +)
alternative label: Bioöljyt, polttoaineet (649)
alternative label: Butanoli, kemianteollisuus, orgaaninen kemia (649)
alternative label: Diasetyyli, orgaaniset yhdisteet, orgaanisen kemian teollisuus (649 +)
alternative label: Energiateknologia, fossiiliset polttoaineet (649 +)
alternative label: Energiateknologia, polttoaineteknologia (649 +)
alternative label: Epäpuhtaudet, polttoaineteknologia (649 +)
alternative label: Esanssit, kemianteollisuus (649)
alternative label: Esterit, kemianteollisuus (649)
alternative label: Eteeni, kemianteollisuus (649 +)
alternative label: Eteeriset öljyt, kemianteollisuus (649)
alternative label: Etikkahappo, kemianteollisuus (649)
alternative label: Fossiiliset polttoaineet (649 +)
alternative label: Fossiiliset polttoaineet, polttoaineteknologia (649 +)
alternative label: Karboksyylihapot, orgaaniset yhdisteet, orgaanisen kemian teollisuus (649 +)
alternative label: Kemian tekniikka, orgaanisen kemian tekniikka (649 +)
alternative label: Kemianteollisuus, orgaaninen kemia (649 +)
alternative label: Klooratut hiilivedyt, kemianteollisuus (649 +)
alternative label: Kynttilät, teollisuus ja kauppa (649)
alternative label: Laki rakennuksen energiatodistuksesta, polttoaineet (649)
alternative label: Luonnonaineet, orgaanisen kemian teoll. (649 +)
alternative label: Luonnonmateriaalit, orgaanisen kemian teollisuus (649 +)
alternative label: Luonnonpolymeerit, orgaanisen kemian teollisuus (649 +)
alternative label: Orgaanisen kemian teollisuus (649 +)
alternative label: Orgaaniset polttoaineet (649 +)
alternative label: Orgaaniset yhdisteet, orgaanisen kemian teollisuus (649 +)
alternative label: PAH-yhdisteet, orgaanisen kemian teoll. (649 +)
alternative label: Polttoaineet (649)
alternative label: Polttoaineet, fossiiliset (649)
alternative label: Polttoaineteknologia (649 +)
alternative label: Polttoaineteollisuus (649 +)
alternative label: Polttotekniikka, polttoainetekniikka (649 +)
alternative label: Polymeerikemia, kemianteollisuus (649 +)
alternative label: Sykliset yhdisteet, orgaanisen kemian teollisuus (649 +)
alternative label: Vahat, orgaanisen kemian teollisuus (649 +)
alternative label: Akrylonitril, kemisk industri (649) @sv
alternative label: Alkoholbränslen (649) @sv
alternative label: Biooljor, bränslen (649) @sv
alternative label: Biopolymerer, organisk kemisk industri (649 +) @sv
alternative label: Bränsleindustri (649 +) @sv
alternative label: Bränslen (649) @sv
alternative label: Bränslen, fossila (649) @sv
alternative label: Bränsleteknologi (649 +) @sv
alternative label: Butanol, kemisk industri, organisk kemi (649) @sv
alternative label: Cykliska föreningar, organisk kemisk industri (649 +) @sv
alternative label: Diacetyl, organiska föreningar, organisk kemisk industri (649 +) @sv
alternative label: Energiteknologi, bränsleteknologi (649 +) @sv
alternative label: Energiteknologi, fossila bränslen (649 +) @sv
alternative label: Essenser, kemisk industri (649) @sv
alternative label: Estrar, kemisk industri (649) @sv
alternative label: Eten, kemisk industri (649 +) @sv
alternative label: Eteriska oljor, kemisk industri (649) @sv
alternative label: Fossila bränslen (649 +) @sv
alternative label: Fossila bränslen, bränsleteknologi (649 +) @sv
alternative label: Förbränningsteknik, bränsleteknologi (649 +) @sv
alternative label: Karboxylsyror, organiska föreningar, organisk kemisk industri (649 +) @sv
alternative label: Kemisk industri, organisk kemi (649 +) @sv
alternative label: Kemisk teknik, organisk kemisk teknik (649 +) @sv
broader: KEMIAN TEOLLISUUS. KAIVOSTEOLLISUUS
in scheme: URN:NBN:fi:au:hklj:
narrower: Kivihiili. Turve
narrower: Öljy. Maakaasu
narrower: Muovi- ja kumiteollisuus
narrower: Biotekniikka
notation: 649
related: Geomorfologia. Geodynamiikka
related: Ilman suojelu
related: Orgaaninen kemia. Muovien kemia
related: BIOLOGIA
related: Energia
related: Kaivos- ja kaivannaisteollisuus
related: Kemian teollisuus
scope note: Orgaanisen kemian teollisuuden yleisteokset Orgaanisen kemian teollisuuden liiketalous, tuotantomenetelmät, rationalisointi, työt, prosessit, koneet, raaka-aineet, tuotanto ja tuotteiden kauppa Orgaaniset ja fossiiliset polttoaineet sekä niiden teknologia ja jalostus yleensä Polttoaineteollisuus yleensä
scope note: Allmänna verk som rör organisk kemisk industri Företagsekonomi, produktionsmetoder, rationalisering, arbete, processer, maskiner, råmaterial, produktion och handel inom organisk kemisk industri Organiska och fossila bränslen samt teknologi och förädling med hänsyn till dem i allmänhet Bränsleindustri i allmänhet @sv

Hevoset
type: Class
type: Concept
subclass of: URN:NBN:fi:au:hklj:654
alternative label: Aasit, kotieläimet (654.1)
alternative label: Hevonen (654.1)
alternative label: Hevonen, hoito (654.1)
alternative label: Hevosenhoito (654.1)
alternative label: Hevoset (654.1)
alternative label: Hevoset, hoito (654.1)
alternative label: Hevosrodut (654.1)
alternative label: Hevostallit, hevosten hoito (654.1)
alternative label: Hevostalous (654.1)
alternative label: Hevostilat (654.1)
alternative label: Kaviot, hevonen (654.1)
alternative label: Kengitys (654.1)
alternative label: Kilpahevoset (654.1)
alternative label: Kuolaimet, hevonen (654.1)
alternative label: Lämminverihevoset (654.1)
alternative label: Lämminverihevoset, hevosten hoito (654.1)
alternative label: Muulit, kotieläimet (654.1)
alternative label: Oriit, hevonen (654.1)
alternative label: Orit, hevonen (654.1)
alternative label: Poni (654.1)
alternative label: Ratsastustallit, hevosten hoito (654.1)
alternative label: Ratsuhevoset (654.1)
alternative label: Ratsuhevoset, hevosten hoito (654.1)
alternative label: Ravihevoset, hevoset (654.1)
alternative label: Ravurit, hevoset (654.1)
alternative label: Ruunat, hevonen (654.1)
alternative label: Tallit, hevosten hoito (654.1)
alternative label: Tammat, hevonen (654.1)
alternative label: Työhevoset (654.1)
alternative label: Työhevoset, hevosen hoito (654.1)
alternative label: Valakat, hevonen (654.1)
alternative label: Varsat (654.1)
alternative label: Varsominen, hevonen (654.1)
alternative label: Arbetshästar (654.1) @sv
alternative label: Arbetshästar, hästskötsel (654.1) @sv
alternative label: Bett (i betsel), häst (654.1) @sv
alternative label: Föl (654.1) @sv
alternative label: Fölning, häst (654.1) @sv
alternative label: Hingstar, häst (654.1) @sv
alternative label: Hovar, häst (654.1) @sv
alternative label: Hovslageri (654.1) @sv
alternative label: Häst (654.1) @sv
alternative label: Häst, skötsel (654.1) @sv
alternative label: Hästgårdar (654.1) @sv
alternative label: Hästraser (654.1) @sv
alternative label: Hästskötsel (654.1) @sv
alternative label: Häststall, hästskötsel (654.1) @sv
alternative label: Kapplöpningshästar (654.1) @sv
alternative label: Mulor, husdjur (654.1) @sv
alternative label: Munlag, häst (654.1) @sv
alternative label: Ponny (654.1) @sv
alternative label: Ridhästar (654.1) @sv
alternative label: Ridhästar, hästskötsel (654.1) @sv
alternative label: Stall, hästskötsel (654.1) @sv
alternative label: Ston, häst (654.1) @sv
alternative label: Travare, hästar (654.1) @sv
broader: URN:NBN:fi:au:hklj:654
in scheme: URN:NBN:fi:au:hklj:
notation: 654.1
related: URN:NBN:fi:au:hklj:576
related: URN:NBN:fi:au:hklj:590
related: Eläintarhat
related: Eläinsuojelu
related: Systemaattinen eläintiede
related: Nisäkkäät
related: Eläinten vetämät kulkuneuvot
related: URN:NBN:fi:au:hklj:649.91
related: Maatalouspolitiikka
related: URN:NBN:fi:au:hklj:650.2
related: URN:NBN:fi:au:hklj:651
related: URN:NBN:fi:au:hklj:657
related: Eläinlääketiede
related: Rakennusten erillistilat
related: URN:NBN:fi:au:hklj:691.13
related: Hevosurheilu. Ratsastus
scope note: Hevoset ja niiden hoito. Hevosrodut. Ponit Hevosten kasvatus. Hevostallin hoito. Hevostenhoitovälineet Työ-, ratsu- ja kilpahevosten hoito Hevosten sairaudet ja niiden hoito Tässä myös aasit, muulit ja muut kavioeläimet kotieläiminä Jos teoksessa on sekä hevosten hoitoa että ratsastusta tai hevosurheilua, on etusija luokalla 654.1
scope note: Hästar och hästskötsel. Hästraser. Ponnyer Hästuppfödning. Stallskötsel. Redskap för hästskötsel Skötsel av arbetshästar, ridhästar och tävlingshästar Hästsjukdomar och behandling av dem Hit också åsnor, mulor och andra hovdjur som husdjur Om verket handlar om såväl hästskötsel som ridning eller hästsport, ges företräde åt klass 654.1 @sv

Pikkunisäkkäät
type: Class
type: Concept
subclass of: Lemmikkieläimet
alternative label: Aavikkorotat, lemmikkieläimet (654.93)
alternative label: Chinchillat, lemmikkieläimet (654.93)
alternative label: Gerbiilit, lemmikkieläimet (654.93)
alternative label: Hamsterit, lemmikkieläimet (654.93)
alternative label: Hiiret, lemmikkieläimet (654.93)
alternative label: Jyrsijät, lemmikkieläimet (654.93)
alternative label: Jäniseläimet, lemmikkieläimet (654.93)
alternative label: Kaniinit, lemmikkieläimet (654.93)
alternative label: Marsut, lemmikkieläimet (654.93)
alternative label: Pikkunisäkkäät, lemmikkieläimet (654.93)
alternative label: Rotat, lemmikkieläimet (654.93)
alternative label: Sinsillat, lemmikkieläimet (654.93)
alternative label: Chinchilla, sällskapsdjur (654.93) @sv
alternative label: Däggdjur, sällskapsdjur (654.93) @sv
alternative label: Gerbiller, sällskapsdjur (654.93) @sv
alternative label: Gnagare, sällskapsdjur (654.93) @sv
alternative label: Hamstrar, sällskapsdjur (654.93) @sv
alternative label: Hardjur, sällskapsdjur (654.93) @sv
alternative label: Harmöss, sällskapsdjur (654.93) @sv
alternative label: Kaniner, sällskapsdjur (654.93) @sv
alternative label: Marsvin, sällskapsdjur (654.93) @sv
alternative label: Möss, sällskapsdjur (654.93) @sv
alternative label: Råttor, sällskapsdjur (654.93) @sv
alternative label: Ökenråttor, sällskapsdjur (654.93) @sv
broader: Lemmikkieläimet
in scheme: URN:NBN:fi:au:hklj:
notation: 654.93
preferred label: Small mammals @en
preferred label: Små däggdjur @sv
related: URN:NBN:fi:au:hklj:576
related: URN:NBN:fi:au:hklj:590
related: Eläintarhat
related: Eläinsuojelu
related: Systemaattinen eläintiede
related: Nisäkkäät
related: Eläinten vetämät kulkuneuvot
related: URN:NBN:fi:au:hklj:649.91
related: Maatalouspolitiikka
related: URN:NBN:fi:au:hklj:650.2
related: URN:NBN:fi:au:hklj:651
related: Turkiseläimet
related: URN:NBN:fi:au:hklj:657
related: Eläinlääketiede
related: Rakennusten erillistilat
related: URN:NBN:fi:au:hklj:691.13
scope note: Pikkunisäkkäät lemmikkieläiminä, niiden lajit ja rodut Marsut, hamsterit, kanit, aavikkorotat, rotat, hiiret ja muut pikkunisäkkäät lemmikkieläiminä Pikkunisäkkäiden kasvatus ja kauppa Pikkunisäkkäiden terraariot Pikkunisäkkäiden sairaudet ja niiden hoito
scope note: Små däggdjur som sällskapsdjur, deras arter och raser Marsvin, hamstrar, kaniner, ökenråttor, råttor, möss och andra små däggdjur som sällskapsdjur Uppfödning av och handel med små däggdjur Terrarier för små däggdjur Små däggdjurs sjukdomar och behandling av dem @sv

Uunit. Takat
type: Class
type: Concept
subclass of: URN:NBN:fi:au:hklj:667.71
alternative label: Arinat (667.711)
alternative label: Avotakat (667.711)
alternative label: Kaakeliuunit (667.711)
alternative label: Kiertoilmauunit (667.711)
alternative label: Kiukaat (667.711)
alternative label: Muuraaminen, uunien ja takkojen muuraus (667.711)
alternative label: Muuraus, uunien ja takkojen muuraus (667.711)
alternative label: Savupiiput, talonrakennus (667.711)
alternative label: Takat (667.711)
alternative label: Tulisijat, talonrakennus (667.711)
alternative label: Uunilämmitys (667.711)
alternative label: Uunit (667.711)
alternative label: Vuolukivi, vuolukiviuunit (667.711)
alternative label: Bastuugnar (667.711) @sv
alternative label: Eldstäder, husbyggnad (667.711) @sv
alternative label: Kakelugnar (667.711) @sv
alternative label: Murning, murning av ugnar och brasor (667.711) @sv
alternative label: Murningsarbeten, murning av ugnar och brasor (667.711) @sv
alternative label: Rostar (667.711) @sv
alternative label: Skorstenar, husbyggnad (667.711) @sv
alternative label: Täljsten, täljstensspisar (667.711) @sv
alternative label: Ugnar (667.711) @sv
alternative label: Ugnseldning (667.711) @sv
alternative label: Varmluftsugnar (667.711) @sv
alternative label: Öppna spisar, avotakat (667.711) @sv
alternative label: Öppna spisar, takat (667.711) @sv
broader: URN:NBN:fi:au:hklj:667.71
in scheme: URN:NBN:fi:au:hklj:
notation: 667.711
preferred label: Ovens. Fireplaces @en
preferred label: Ugnar. Spisar @sv
related: Lämpöoppi
related: Energia
related: Raideliikenneväylät. Junat. Raitiovaunut. Metro
related: Sähkötekniikka
related: Sähköenergian muuttaminen, muuntaminen, jakelu ja siirto
related: Lasiteollisuus. Keraaminen teollisuus. Sementtiteollisuus
related: Rakennusstatiikka. Rakennusaineet
related: Tekninen rakennussuunnittelu
related: Rakennustyöt. Rakennusaineet. Rakennustarvikkeet
related: Muuraus. Rappaus
related: Rakenneosat
related: Rakennuksen kunnossapito
related: Sisustusoppaat
related: URN:NBN:fi:au:hklj:720
related: URN:NBN:fi:au:hklj:721
related: URN:NBN:fi:au:hklj:726
scope note: Uunit, takat, kamiinat, hormit ja savupiiput yleensä Uunit, takat, kamiinat, hormit ja savupiiput talonrakennuksen sekä rakennuksen kunnossapidon ja korjauksen kannalta Uunien, takkojen, hormien ja savupiippujen muuraus ja rappaus Kaakeliuunit
scope note: Ugnar, spisar, kaminer, rökkanaler och skorstenar i allmänhet Ugnar, spisar, kaminer, rökkanaler och skorstenar ur husbyggnadssynvinkel samt ur underhålls- och reparationssynvinkel Murning och rappning av ugnar, spisar, kaminer, rökkanaler och skorstenar Kakelugnar @sv

Liiketaloudellinen kirjanpito ja tilintarkastus
type: Class
type: Concept
subclass of: URN:NBN:fi:au:hklj:675
alternative label: Alijäämä, kirjanpito (675.2)
alternative label: Auditointi, tilintarkastus (675.2)
alternative label: IFR-standardit (675.2 +)
alternative label: IFRS (675.2 +)
alternative label: IFRS-standardit (675.2 +)
alternative label: International Financial Reporting Standards (675.2 +)
alternative label: Kansainvälinen tilinpäätöskäytäntö (675.2)
alternative label: Kiinteä pääoma, tilinpito (675.2)
alternative label: Kirjanpito (675.2)
alternative label: Kirjanpito, kauppakirjanpito (675.2)
alternative label: Kirjanpito, liiketalouden (675.2)
alternative label: Käyttöomaisuus, tilinpito (675.2)
alternative label: Käyttöpääoma, tilinpito (675.2)
alternative label: Liikearvo, taseet (675.2)
alternative label: Liikekirjanpito (675.2)
alternative label: Liiketaloudellinen tilintarkastus (675.2)
alternative label: Materiaalisuus, tilintarkastus (675.2)
alternative label: Matkustustase, kirjanpito ja tilintarkastus (675.2)
alternative label: Menot, kirjanpito (675.2)
alternative label: Oma pääoma, tilinpito (675.2)
alternative label: Pääoma, tilinpito (675.2)
alternative label: Reskontrat (675.2)
alternative label: Tappiontasaus, kirjanpito (675.2)
alternative label: Tappiot, kirjanpito (675.2)
alternative label: Tarkastus, tilintarkastus (675.2)
alternative label: Taseanalyysi (675.2)
alternative label: Taseet (675.2)
alternative label: Tilikirjat (675.2)
alternative label: Tilinpito (675.2)
alternative label: Tilinpito, liiketalous (675.2)
alternative label: Tilinpäätös (675.2)
alternative label: Tilinpäätös, liiketalous (675.2)
alternative label: Tilinpäätösanalyysi, tilinpäätös (675.2)
alternative label: Tilintarkastus (675.2)
alternative label: Tilintarkastus, liiketalous (675.2)
alternative label: Tilintarkastuskertomukset (675.2)
alternative label: Tilitoimistot (675.2)
alternative label: Tilitykset (675.2)
alternative label: Ulkoinen laskentatoimi (675.2)
alternative label: Vaihto-omaisuus, kirjanpito (675.2)
alternative label: Affärsbokföring (675.2) @sv
alternative label: Affärsvärde, balansräkning (675.2) @sv
alternative label: Anläggningstillgångar, bokföring (675.2) @sv
alternative label: Auditering, revision (675.2) @sv
alternative label: Avräkningar (675.2) @sv
alternative label: Balansanalys (675.2) @sv
alternative label: Balansräkning (675.2) @sv
alternative label: Bokföring (675.2) @sv
alternative label: Bokföring, företagsekonomi (675.2) @sv
alternative label: Bokföring, handelsbokföring (675.2) @sv
alternative label: Bokföringsbyråer (675.2) @sv
alternative label: Bokslut (675.2) @sv
alternative label: Bokslut, företagsekonomi (675.2) @sv
alternative label: Bokslutsanalys, bokslut (675.2) @sv
alternative label: Driftskapital, bokföring (675.2) @sv
alternative label: Eget kapital, räkenskapsföring (675.2) @sv
broader: URN:NBN:fi:au:hklj:675
in scheme: URN:NBN:fi:au:hklj:
notation: 675.2
related: Kauppaoikeus. Yhtiölainsäädäntö. Pankki- ja vakuutuslainsäädäntö
related: URN:NBN:fi:au:hklj:345
related: Helsinki. Pääkaupunkiseutu
related: URN:NBN:fi:au:hklj:360
related: URN:NBN:fi:au:hklj:363
related: Osuustoiminta
related: URN:NBN:fi:au:hklj:368
related: Matematiikan taulukot ja kaavakokoelmat. Laskumenetelmät
related: URN:NBN:fi:au:hklj:627.751
related: URN:NBN:fi:au:hklj:650.2
related: Kaupan historia
related: Liiketalouden hallinto ja organisaatio
related: Laskentatoimi. Rahoitus. Talousarviot
related: Kauppamatematiikka
related: Mainonta. Kuluttajanvalistus
related: Kotitalous. Kodinhoito
scope note: Kirjanpidon ja tilintarkastuksen yleisteokset ja yleiset oppikirjat Yksityisen yrityksen tai organisaation kirjanpito ja tilintarkastus yleensä Liiketaloudellinen tilinpito ja tilinpäätös yleensä Erikoisalojen yritysten kirjanpito ja tilintarkastus alan mukaisessa luokassa
scope note: Allmänna verk och läroböcker i bokföring och revision Bokföring och revision inom privata företag eller organisationer i allmänhet Företagsekonomisk bokföring och företagsekonomiska bokslut i allmänhet Bokföring och revision som rör företag inom specialområden klassificeras enligt område @sv

Oppikirjat. Harjoituskirjat. Tehtäväkokoelmat. Taiteen materiaalit ja tekniikka. Taidekasvatus
type: Class
type: Concept
subclass of: URN:NBN:fi:au:hklj:700
alternative label: Entistäminen, taide (702)
alternative label: Esteettinen kasvatus (702)
alternative label: Jäljentäminen, taiteen tekniikka (702)
alternative label: Konservaattorit, taideteosten konservointi (702)
alternative label: Konservointi, taide (702)
alternative label: Kuvaamataito (702)
alternative label: Kuvaamataito, oppikirjat (702)
alternative label: Kuvallinen ilmaisu, taidekasvatus (702)
alternative label: Kuvallinen viestintä, taidekasvatus (702)
alternative label: Kuvataidekasvatus (702)
alternative label: Luonnokset, taiteen tekniikat (702)
alternative label: Luova toiminta, taidekasvatus (702)
alternative label: Luovuus, taidekasvatus (702)
alternative label: Mallin työ, taide (702)
alternative label: Mallit, mallin työ, taide (702)
alternative label: Mallit, taide (702)
alternative label: Ohjekirjat, taide (702)
alternative label: Restaurointi, taide (702)
alternative label: Sablonit, taide (702)
alternative label: Sommittelu, taidekasvatus (702)
alternative label: Taidekasvatus (702)
alternative label: Taiteellinen lahjakkuus, taidekasvatus (702)
alternative label: Taiteentuntemus (702)
alternative label: Viestintäkasvatus, taidekasvatus (702)
alternative label: Visuaalinen kulttuuri, taidekasvatus (702)
alternative label: Visuaalinen viestintä, taidekasvatus (702)
alternative label: Visuaalisuus, taidekasvatus (702)
alternative label: Bildkommunikation, konstfostran (702) @sv
alternative label: Bildkonstfostran (702) @sv
alternative label: Bildspråk, konstfostran (702) @sv
alternative label: Estetisk fostran (702) @sv
alternative label: Instruktionsböcker, konst (702) @sv
alternative label: Kommunikationsfostran, konstfostran (702) @sv
alternative label: Komposition, bildkonst, konstfostran (702) @sv
alternative label: Konservatorer, konservering av konstverk (702) @sv
alternative label: Konservering, konst (702) @sv
alternative label: Konstfostran (702) @sv
alternative label: Konstkännedom (702) @sv
alternative label: Konstnärlig begåvning, konstfostran (702) @sv
alternative label: Kreativitet, konstfostran (702) @sv
alternative label: Modellens arbete, konst (702) @sv
alternative label: Modeller, konst (702) @sv
alternative label: Modeller, modellens arbete, konst (702) @sv
alternative label: Reproducering, konstens teknik (702) @sv
alternative label: Restauration, konst (702) @sv
alternative label: Restaurering, konst (702) @sv
alternative label: Schabloner, konst (702) @sv
alternative label: Skapande verksamhet, konstfostran (702) @sv
alternative label: Teckning (702) @sv
alternative label: Teckning, läroböcker (702) @sv
alternative label: Utkast, konstens tekniker (702) @sv
alternative label: Visualitet, konstfostran (702) @sv
alternative label: Visuell kommunikation, konstfostran (702) @sv
alternative label: Visuell kultur, konstfostran (702) @sv
broader: URN:NBN:fi:au:hklj:700
in scheme: URN:NBN:fi:au:hklj:
notation: 702
preferred label: Textbooks. Exercise books. Collections of examination exercises. Art materials and techniques. Art education @en
preferred label: Läroböcker. Övningsböcker. Samlingar av provuppgifterKonstens material och tekniker. Konstfostran @sv
related: Symbolit. Koodit. Merkkijärjestelmät
related: KASVATUS. OPETUS. KASVATUSTIEDE
related: Kasvatusfilosofia. Kasvatustavoitteet
related: Taideaineiden opetusoppi
related: Taideopinnot
related: Maalaustaiteen teoria, estetiikka ja filosofia
related: URN:NBN:fi:au:hklj:741
related: URN:NBN:fi:au:hklj:741.1
related: URN:NBN:fi:au:hklj:741.2
related: Piirustuksen materiaalit ja tekniikka
related: Taidegrafiikan materiaalit ja tekniikka
related: Valokuvauksen materiaalit ja tekniikka. Valokuvausoppaat
related: URN:NBN:fi:au:hklj:760
related: Elokuvatekniikka. Videokuvauksen tekniikka
related: Musiikin filosofia, estetiikka, psykologia ja sosiologia Musiikkikasvatus. Musiikkiopetus
scope note: Taidetta, taiteentutkimusta tai kuvaamataitoa yleensä koskevat oppikirjat, harjoituskirjat ja tehtäväkokoelmat Taidekasvatus yleensä Taiteen materiaaleja ja tekniikoita koskevat yleiset tai sekasisältöiset oppaat Eri taiteenalojen oppikirjat, harjoituskirjat ja tehtäväkokoelmat sekä materiaalit ja tekniikat alan mukaisessa luokassa
scope note: Allmänna läroböcker, övningsböcker och samlingar av provuppgifter som rör konst, konstvetenskap och teckning Konstfostran i allmänhet Handböcker med allmänt eller blandat innehåll som rör konstens material och tekniker Läroböcker, övningsböcker och samlingar av provuppgifter samt material och tekniker som rör enskilda konstarter klassificeras enligt konstart @sv

Kirkot ja muut uskonnolliset rakennukset
type: Class
type: Concept
subclass of: URN:NBN:fi:au:hklj:726
alternative label: Basilikat, arkkitehtuuri (726.4)
alternative label: Bysantti, arkkitehtuuri, kirkot (726.4)
alternative label: Bysanttilainen kirkko, arkkitehtuuri (726.4)
alternative label: Goottilaiset kirkot, arkkitehtuuri (726.4)
alternative label: Gotiikka, kirkkoarkkitehtuuri (726.4)
alternative label: Hautamuistomerkit, arkkitehtuuri (726.4)
alternative label: Heinolan kirkko, kirkkorakennukset, arkkitehtuuri (726.4)
alternative label: Kappelit, arkkitehtuuri (726.4)
alternative label: Katedraalit, arkkitehtuuri (726.4)
alternative label: Kellotapulit, arkkitehtuuri (726.4)
alternative label: Kellotornit, arkkitehtuuri (726.4)
alternative label: Kirkkoarkkitehtuuri (726.4)
alternative label: Kirkkorakennukset, arkkitehtuuri (726.4)
alternative label: Kirkot, arkkitehtuuri (726.4)
alternative label: Kivikirkot (726.4)
alternative label: Krematoriot, arkkitehtuuri (726.4)
alternative label: Lintulan Pyhän Kolminaisuuden kirkko, arkkitehtuuri (726.4)
alternative label: Luentosalit, arkkitehtuuri (726.4)
alternative label: Luostarit, arkkitehtuuri (726.4)
alternative label: Mausoleumit, arkkitehtuuri (726.4)
alternative label: Minareetit (726.4)
alternative label: Monte Cassinon luostari, luostarit, arkkitehtuuri (726.4)
alternative label: Moskeijat, arkkitehtuuri (726.4)
alternative label: Puukirkot (726.4)
alternative label: Pyhäköt, arkkitehtuuri (726.4)
alternative label: Pyhätöt, arkkitehtuuri (726.4)
alternative label: Pyramidit, arkkitehtuuri (726.4)
alternative label: Romaaninen tyyli, arkkitehtuuri, kirkot (726.4)
alternative label: Romaaniset kirkot (726.4)
alternative label: Rukoushuoneet, arkkitehtuuri (726.4)
alternative label: Seurakuntakeskukset, arkkitehtuuri (726.4)
alternative label: Seurakuntatalot, arkkitehtuuri (726.4)
alternative label: Siunauskappelit, arkkitehtuuri (726.4)
alternative label: Synagogat, arkkitehtuuri (726.4)
alternative label: Temppelit, arkkitehtuuri (726.4)
alternative label: Tsasounat, arkkitehtuuri (726.4)
alternative label: Tuomiokirkot, arkkitehtuuri (726.4)
alternative label: Uskonnolliset rakennukset, arkkitehtuuri (726.4)
alternative label: Zikkuratit, uskonnolliset rakennukset, arkkitehtuuri (726.4)
alternative label: Basilikor, arkitektur (726.4) @sv
alternative label: Begravningskapell, arkitektur (726.4) @sv
alternative label: Bysans, arkitektur, kyrkor (726.4) @sv
alternative label: Bysantinska kyrkan, arkitektur (726.4) @sv
alternative label: Bönehus, arkitektur (726.4) @sv
alternative label: Domkyrkor, arkitektur (726.4) @sv
alternative label: Föreläsningssalar, arkitektur (726.4) @sv
alternative label: Församlingsgårdar, arkitektur (726.4) @sv
alternative label: Församlingshem, arkitektur (726.4) @sv
alternative label: Gotik, kyrkoarkitektur (726.4) @sv
alternative label: Gotiska kyrkor, arkitektur (726.4) @sv
alternative label: Gravmonument, arkitektur (726.4) @sv
alternative label: Heinola kyrka, kyrkobyggnader, arkitektur (726.4) @sv
alternative label: Helgedomar, arkitektur (726.4) @sv
alternative label: Heliga Treenighetens kyrka i Lintula, arkitektur (726.4) @sv
alternative label: Kapell, arkitektur (726.4) @sv
alternative label: Katedraler, arkitektur (726.4) @sv
broader: URN:NBN:fi:au:hklj:726
in scheme: URN:NBN:fi:au:hklj:
notation: 726.4
related: Kirkolliset esineet ja symbolit
related: KIRKKOHISTORIA
related: Vanha aika
related: Keskiaika
related: Uusi aika
related: Uusin aika. Nykyaika
related: Eri maiden kirkkohistoria
related: Suomi
related: Pohjoismaat
related: Ruotsi
related: Muu Eurooppa
related: Germany {@e
related: Arkkitehtuurin teoria, estetiikka ja filosofia
related: Arkkitehtuurikilpailut. Arkkitehtuurinäyttelyt. Arkkitehtuuripalkinnot
related: URN:NBN:fi:au:hklj:720.9
related: Keskiajan arkkitehtuuri
scope note: Kirkkojen ja muiden uskonnollisten rakennusten arkkitehtuuri, maasta, uskontokunnasta tai aikakaudesta riippumatta Kirkot. Temppelit. Kappelit. Moskeijat. Luostarit. Rukoushuoneet. Seurakuntatalot Jos teoksessa on sekä kirkkoarkkitehtuuria että kirkollisia esineitä tai symboleja, on etusija luokalla 726.4 Jos teoksessa on sekä kirkkoarkkitehtuuria että kirkkohistoriaa, on etusija luokilla 270-279+
scope note: Hit kyrkoarkitektur oavsett land, religion och tidsperiod Kyrkor. Kyrkobyggnader. Tempel. Kapell. Moskéer. Kloster. Bönehus. Församlingshus Om verket handlar om såväl kyrkliga föremål och symboler som kyrkoarkitektur ges företräde åt klass 726.4 Om verket innehåller både kyrkoarkitektur och kyrkohistoria, ges företräde åt klasserna 270-279+ @sv

Alkuperäiskansojen kuvanveistotaide
type: Class
type: Concept
subclass of: URN:NBN:fi:au:hklj:730.9
alternative label: Aboriginaalit, Australia, kuvanveisto (730.901)
alternative label: Afrikka, kuvanveisto, perinteinen (730.901)
alternative label: Alkuperäiskansat, kuvanveisto (730.901)
alternative label: Amerikka, kuvanveisto, alkuperäiskansat (730.901)
alternative label: Asteekit, kuvanveisto (730.901)
alternative label: Atsteekit, kuvanveisto (730.901)
alternative label: Australia, kuvanveisto, aboriginaalit (730.901)
alternative label: Etelä-Amerikka, kuvanveisto, alkuperäiskansat (730.901)
alternative label: Inkat, kuvanveisto (730.901)
alternative label: Intiaanit, kuvanveisto (730.901)
alternative label: Luonnonkansat, kuvanveisto (730.901)
alternative label: Mayat, kuvanveisto (730.901)
alternative label: Oseania, kuvanveisto, aboriginaalien (730.901)
alternative label: Pohjois-Amerikka, kuvanveisto, alkuperäiskansat (730.901)
alternative label: Primitiivinen taide, kuvanveisto (730.901)
alternative label: Primitiiviset kansat, kuvanveisto (730.901)
alternative label: Tolteekit, kuvanveisto (730.901)
alternative label: Aboriginer, Australien, skulptur (730.901) @sv
alternative label: Afrika, skulptur, traditionell (730.901) @sv
alternative label: Amerika, skulptur, urbefolkningar (730.901) @sv
alternative label: Australien, skulptur, aboriginer (730.901) @sv
alternative label: Azteker, asteekit, skulptur (730.901) @sv
alternative label: Azteker, atsteekit, skulptur (730.901) @sv
alternative label: Indianer, skulptur (730.901) @sv
alternative label: Inkaindianer, skulptur (730.901) @sv
alternative label: Mayafolket, skulptur (730.901) @sv
alternative label: Naturfolk, skulptur (730.901) @sv
alternative label: Nordamerika, skulptur, urbefolkningar (730.901) @sv
alternative label: Oceanien, skulptur, aboriginers (730.901) @sv
alternative label: Primitiv konst, skulptur (730.901) @sv
alternative label: Primitiva folk, skulptur (730.901) @sv
alternative label: Sydamerika, skulptur, urbefolkningar (730.901) @sv
alternative label: Tolteker, skulptur (730.901) @sv
alternative label: Urbefolkningar, skulptur (730.901) @sv
broader: URN:NBN:fi:au:hklj:730.9
in scheme: URN:NBN:fi:au:hklj:
notation: 730.901
preferred label: Aboriginal sculpture @en
preferred label: Ursprungsfolkens skulptur @sv
related: URN:NBN:fi:au:hklj:709
related: Alkuperäiskansojen taide
related: Vanhan ajan kuvanveistotaide. Euroopan ulkopuolisten vanhojen kulttuurien kuvanveistotaide
related: Eurooppa
related: Aasia
related: Afrikka
related: Amerikka
related: Yhdysvallat
related: Australia. Oseania
related: Kuvanveistotaiteen materiaalit ja tekniikka
related: URN:NBN:fi:au:hklj:739
related: URN:NBN:fi:au:hklj:742
scope note: Maasta tai maanosasta riippumatta eskimoiden, intiaanien, saamelaisten sekä Aasian, Afrikan, Australian ja Oseanian alkuperäiskansojen kuvanveistotaide Tässä myös intiaanien korkeakulttuurien kuvanveistotaide
scope note: Eskimåernas, indianernas, samernas samt de asiatiska, afrikanska, australiska och oceaniska ursprungsfolkens skulptur oavsett land eller världsdel Hit också de indianska högkulturernas skulptur @sv

Länsi- ja Keski-Eurooppa
type: Class
type: Concept
subclass of: URN:NBN:fi:au:hklj:740.9
alternative label: Itävalta, maalaustaide (740.93)
alternative label: Romania, maalaustaide (740.93)
alternative label: Sveitsi, maalaustaide (740.93)
alternative label: Tsekki, maalaustaide (740.93)
alternative label: Unkari, maalaustaide (740.93)
alternative label: Rumänien, målarkonst (740.93) @sv
alternative label: Schweiz, målarkonst (740.93) @sv
alternative label: Tjeckien, målarkonst (740.93) @sv
alternative label: Ungern, målarkonst (740.93) @sv
alternative label: Österrike, målarkonst (740.93) @sv
broader: URN:NBN:fi:au:hklj:740.9
in scheme: URN:NBN:fi:au:hklj:
narrower: Saksa
narrower: Alankomaat. Belgia. Luxemburg
narrower: Ranska
narrower: Brittein saaret
notation: 740.93
preferred label: Western and Central Europe @en
preferred label: Västeuropa och Centraleuropa @sv
related: URN:NBN:fi:au:hklj:709
related: URN:NBN:fi:au:hklj:741
related: URN:NBN:fi:au:hklj:741.1
related: URN:NBN:fi:au:hklj:741.2
related: URN:NBN:fi:au:hklj:742
related: URN:NBN:fi:au:hklj:749
related: URN:NBN:fi:au:hklj:749.1
scope note: Unkari. Puola. Tsekki. Slovakia. Romania. Sveitsi. Liechtenstein. Itävalta
scope note: Ungern. Polen. Tjeckien. Slovakien. Rumänien. Schweiz. Liechtenstein. Österrike @sv

Taidegrafiikka
type: Class
type: Concept
subclass of: GRAAFINEN TAIDE. VALOKUVAUS
alternative label: Aiheet, grafiikka (753)
alternative label: Akvatinta, taidegrafiikan historia (753)
alternative label: Alastonmalli, taidegrafiikka (753)
alternative label: Asetelmat, taidegrafiikka (753)
alternative label: Etsaukset (753)
alternative label: Etsaus, taidegrafiikka (753)
alternative label: Graafikot, taidegraafikot (753)
alternative label: Graafinen taide, taidegrafiikka (753 +)
alternative label: Grafiikka, taidegrafiikka (753 +)
alternative label: Japani, puupiirrokset (753)
alternative label: Kaiverrukset, taidegrafiikka (753)
alternative label: Kivipaino, graafinen taide (753)
alternative label: Kivipiirros, graafinen taide (753)
alternative label: Kuivaneula, taidegrafiikan historia (753)
alternative label: Kuparipiirros, taidegrafiikan historia (753)
alternative label: Linoleikkaus, graafinen taide (753)
alternative label: Linopiirros, graafinen taide (753)
alternative label: Litografia, graafinen taide (753)
alternative label: Luonnokset, graafinen taide, historia (753)
alternative label: Mezzotinto, taidegrafiikka (753)
alternative label: Monotypia, taidegrafiikan historia (753)
alternative label: Muotokuvat, taidegrafiikka (753)
alternative label: Omakuvat, taidegrafiikka, historia (753)
alternative label: Painokuvat, graafinen taide (753)
alternative label: Puupiirros, graafinen taide (753)
alternative label: Radeeraukset (753)
alternative label: Serigrafia, taidegrafiikka (753)
alternative label: Seripaino, taidegrafiikka (753)
alternative label: Taidegraafikot (753)
alternative label: Taidegrafiikka (753)
alternative label: Taiteilijaelämäkerrat, taidegraafikot (753)
alternative label: Taiteilijat, taidegraafikot (753)
alternative label: Teräspiirrokset (753)
alternative label: Viivasyövytys, taidegrafiikka (753)
alternative label: Värigrafiikka (753)
alternative label: Akvatint, konstgrafikens historia (753) @sv
alternative label: Anledningar, grafik (753) @sv
alternative label: Etsning, konstgrafik (753) @sv
alternative label: Etsningar (753) @sv
alternative label: Färggrafik (753) @sv
alternative label: Grafik, konstgrafik (753 +) @sv
alternative label: Grafiker, konstgrafiker (753) @sv
alternative label: Grafisk konst, konstgrafik (753 +) @sv
alternative label: Graveringar, konstgrafik (753) @sv
alternative label: Japan, träsnitt (753) @sv
alternative label: Konstgrafik (753) @sv
alternative label: Konstgrafiker (753) @sv
alternative label: Konstnärer, konstgrafiker (753) @sv
alternative label: Konstnärsbiografier, konstgrafiker (753) @sv
alternative label: Kopparstick, konstgrafikens historia (753) @sv
alternative label: Linjeetsning, konstgrafik (753) @sv
alternative label: Linoleumsnitt, grafisk konst (753) @sv
alternative label: Linosnitt, grafisk konst (753) @sv
alternative label: Litografi, grafisk konst (753) @sv
alternative label: Mezzotint, konstgrafik (753) @sv
alternative label: Monotypi, konstgrafikens historia (753) @sv
alternative label: Nakenmodell, konstgrafik (753) @sv
alternative label: Porträtt, konstgrafik (753) @sv
broader: GRAAFINEN TAIDE. VALOKUVAUS
in scheme: URN:NBN:fi:au:hklj:
narrower: Taidegrafiikan materiaalit ja tekniikka
notation: 753
related: URN:NBN:fi:au:hklj:018
related: MAALAUSTAIDE. PIIRUSTUSTAIDE
related: URN:NBN:fi:au:hklj:740.9
related: Vanhan ajan maalaustaide. Euroopan ulkopuolistenvanhojen kulttuurien maalaustaide
related: URN:NBN:fi:au:hklj:742
related: URN:NBN:fi:au:hklj:749.1
related: Piirustuksen materiaalit ja tekniikka
related: Pilapiirrokset. Karikatyyrit
related: Graafisen taiteen teoria, estetiikka ja filosofia
related: Graafisen taiteen historia
related: Kuvitustaide
related: Käyttögrafiikka
related: URN:NBN:fi:au:hklj:756
scope note: Taidegrafiikka, sen historia, henkilöhistoria ja estetiikka maasta, maanosasta tai aikakaudesta riippumatta Taidegrafiikan kauppa ja keräily Puupiirrokset. Etsaukset. Kivipiirrokset. Vaskipiirrokset. Kuparipiirrokset. Teräspiirrokset. Mezzotintatyöt. Akvatintatyöt. Kuivaneulatyöt. Linoleikkaukset. Silkkipainotyöt. Serigrafiat. Värigrafiikka
scope note: Konstgrafik, dess historia, personhistoria och estetik oavsett land, världsdel eller tidsperiod Handel med konstgrafik och konstgrafik som samlingsobjekt Träsnitt. Etsning. Litografi. Kopparblandning. Kopparstick. Stålstick. Mezzotint. Akvatint. Torrnålsgravyr. Linoleumsnitt. Screentryck. Serigrafi. Färggrafik @sv

Ukraina
type: Class
type: Concept
subclass of: Itsenäisten valtioiden yhteisö
broader: Itsenäisten valtioiden yhteisö
in scheme: URN:NBN:fi:au:hklj:
notation: 784.172
preferred label: Ukraine @en
related: URN:NBN:fi:au:hklj:473.1
related: URN:NBN:fi:au:hklj:769
related: URN:NBN:fi:au:hklj:783
related: URN:NBN:fi:au:hklj:783.1
related: Itä-Eurooppa
related: Itsenäisten valtioiden yhteisön Aasian puoleiset alueet
related: URN:NBN:fi:au:hklj:787
related: URN:NBN:fi:au:hklj:787.2
related: URN:NBN:fi:au:hklj:787.29
related: URN:NBN:fi:au:hklj:788.8
related: URN:NBN:fi:au:hklj:789
related: URN:NBN:fi:au:hklj:795.1
related: URN:NBN:fi:au:hklj:797.2
related: URN:NBN:fi:au:hklj:807

Valko-Venäjä
type: Class
type: Concept
subclass of: Itsenäisten valtioiden yhteisö
broader: Itsenäisten valtioiden yhteisö
in scheme: URN:NBN:fi:au:hklj:
notation: 784.173
preferred label: Belorussia @en
preferred label: Vitryssland @sv
related: URN:NBN:fi:au:hklj:473.1
related: URN:NBN:fi:au:hklj:769
related: URN:NBN:fi:au:hklj:783
related: URN:NBN:fi:au:hklj:783.1
related: Itä-Eurooppa
related: Itsenäisten valtioiden yhteisön Aasian puoleiset alueet
related: URN:NBN:fi:au:hklj:787
related: URN:NBN:fi:au:hklj:787.2
related: URN:NBN:fi:au:hklj:787.29
related: URN:NBN:fi:au:hklj:788.8
related: URN:NBN:fi:au:hklj:789
related: URN:NBN:fi:au:hklj:795.1
related: URN:NBN:fi:au:hklj:797.2
related: URN:NBN:fi:au:hklj:807

Moldova
type: Class
type: Concept
subclass of: Itsenäisten valtioiden yhteisö
broader: Itsenäisten valtioiden yhteisö
in scheme: URN:NBN:fi:au:hklj:
notation: 784.174
preferred label: Moldova (formerly Moldavia) @en
preferred label: Moldova (f.d. Moldavien) @sv
related: URN:NBN:fi:au:hklj:473.1
related: URN:NBN:fi:au:hklj:769
related: URN:NBN:fi:au:hklj:783
related: URN:NBN:fi:au:hklj:783.1
related: Itä-Eurooppa
related: Itsenäisten valtioiden yhteisön Aasian puoleiset alueet
related: URN:NBN:fi:au:hklj:787
related: URN:NBN:fi:au:hklj:787.2
related: URN:NBN:fi:au:hklj:787.29
related: URN:NBN:fi:au:hklj:788.8
related: URN:NBN:fi:au:hklj:789
related: URN:NBN:fi:au:hklj:795.1
related: URN:NBN:fi:au:hklj:797.2
related: URN:NBN:fi:au:hklj:807

Kanada
type: Class
type: Concept
subclass of: Pohjois-Amerikka
broader: Pohjois-Amerikka
in scheme: URN:NBN:fi:au:hklj:
notation: 784.41
preferred label: Canada @en
related: URN:NBN:fi:au:hklj:473.1
related: URN:NBN:fi:au:hklj:769
related: URN:NBN:fi:au:hklj:783
related: URN:NBN:fi:au:hklj:783.1
related: Intiaanit
related: Eskimot. Inuiitit
related: URN:NBN:fi:au:hklj:787
related: URN:NBN:fi:au:hklj:787.2
related: URN:NBN:fi:au:hklj:787.29
related: URN:NBN:fi:au:hklj:788.8
related: URN:NBN:fi:au:hklj:789
related: URN:NBN:fi:au:hklj:795.1
related: URN:NBN:fi:au:hklj:797.2
related: URN:NBN:fi:au:hklj:807

Juutalaiset
type: Class
type: Concept
subclass of: URN:NBN:fi:au:hklj:784.9
alternative label: Jiddisinkieliset laulut (784.95)
alternative label: Juutalaiset, etnomusiikki, ei Israel (784.95)
alternative label: Klezmer-musiikki (784.95)
alternative label: Sefardijuutalaiset, etnomusiikki (784.95)
alternative label: Jiddisch, sånger på (784.95) @sv
alternative label: Judar, etnomusik, icke Israel (784.95) @sv
alternative label: Klezmermusik (784.95) @sv
alternative label: Sefardijudar, etnomusik (784.95) @sv
broader: URN:NBN:fi:au:hklj:784.9
in scheme: URN:NBN:fi:au:hklj:
notation: 784.95
preferred label: Jews @en
preferred label: Judar @sv
related: URN:NBN:fi:au:hklj:473.1
related: URN:NBN:fi:au:hklj:769
related: URN:NBN:fi:au:hklj:783
related: URN:NBN:fi:au:hklj:783.1
related: Etu-Aasia
related: URN:NBN:fi:au:hklj:787
related: URN:NBN:fi:au:hklj:787.2
related: Juutalaisten uskonnollinen musiikki
related: URN:NBN:fi:au:hklj:787.29
related: URN:NBN:fi:au:hklj:788.8
related: URN:NBN:fi:au:hklj:789
related: URN:NBN:fi:au:hklj:795.1
related: URN:NBN:fi:au:hklj:797.2
related: URN:NBN:fi:au:hklj:807

Elektroninen popmusiikki. Electronica
type: Class
type: Concept
subclass of: Rock. Pop
alternative label: Acid house (788.333)
alternative label: Acid jazz (788.333)
alternative label: Ambient electro (788.333)
alternative label: Dance, discomusiikki (788.333)
alternative label: Diskopop (788.333)
alternative label: Downtempo (788.333)
alternative label: House (788.333)
alternative label: Nu jazz (788.333)
alternative label: Tanssimusiikki, diskomusiikki (788.333)
alternative label: Tekno (788.333)
alternative label: Dance, discomusik (788.333) @sv
alternative label: Dansmusik, diskomusik (788.333) @sv
alternative label: Techno (788.333) @sv
broader: Rock. Pop
in scheme: URN:NBN:fi:au:hklj:
notation: 788.333
preferred label: Electronic pop music. Electronica @en
preferred label: Elektronisk popmusik. Electronica @sv
related: URN:NBN:fi:au:hklj:782.4
related: URN:NBN:fi:au:hklj:783
related: URN:NBN:fi:au:hklj:783.1
related: URN:NBN:fi:au:hklj:785.7
related: URN:NBN:fi:au:hklj:786.8
related: URN:NBN:fi:au:hklj:787.112
related: Folk. Country
related: Aasialainen maailmanmusiikki. Aasialainen etninen pop ja viihdemusiikki
related: New Age -musiikki. Rentoutusmusiikki
related: URN:NBN:fi:au:hklj:789
related: URN:NBN:fi:au:hklj:795
scope note: Tässä esim. acid house, ambient electro, dance, EDM (electronic dance music), electro, diskomusiikki, house, tekno ja trance
scope note: Hit t.ex. acid house, ambient electro, dance, EDM (electronic dance music), electro, discomusik, house, techno och trance @sv

Aasia
type: Class
type: Concept
subclass of: URN:NBN:fi:au:hklj:789
alternative label: Aasia, musiikinhistoria (789.3 +)
alternative label: Asien, musikhistoria (789.3 +) @sv
broader: URN:NBN:fi:au:hklj:789
in scheme: URN:NBN:fi:au:hklj:
narrower: Etu-Aasia
narrower: Etelä-Aasia
narrower: Kaakkois-Aasia
narrower: Keski- ja Itä-Aasia
notation: 789.3
preferred label: Asia @en
preferred label: Asien @sv
related: URN:NBN:fi:au:hklj:709
related: URN:NBN:fi:au:hklj:782.4
related: URN:NBN:fi:au:hklj:783
related: URN:NBN:fi:au:hklj:789.1
related: Varhaiskansojen musiikki
scope note: Aasian musiikin historian yleisteokset
scope note: Allmänna verk som rör den asiatiska musikens historia @sv

Kielipsykologia. Kielisosiologia. Kielipolitiikka
type: Class
type: Concept
subclass of: KIELITIEDE
alternative label: Diskurssi, kielisosiologia (852)
alternative label: Diskurssintutkimus, kielisosiologia (852)
alternative label: Etnolingvistiikka (852)
alternative label: Eurooppalainen kielisalkku, kielitaito (852)
alternative label: Hiipuvat kielet, kielisosiologia (852)
alternative label: Häviäminen, uhanalaiset kielet (852)
alternative label: Interaktiivisuus, kielellinen (852)
alternative label: Interaktio, kielellinen (852)
alternative label: Interferenssi, kielitiede (852)
alternative label: Kaksikielisyys (852)
alternative label: Kansalliskielet (852)
alternative label: Kielellinen identiteetti (852)
alternative label: Kielellinen kehitys (852)
alternative label: Kielellinen lahjakkuus (852)
alternative label: Kielellinen viestintä, kielitiede (852)
alternative label: Kielellinen vuorovaikutus, kielisosiologia (852)
alternative label: Kielelliset häiriöt, kielen omaksuminen (852)
alternative label: Kielelliset oikeudet, kielipolitiikka (852)
alternative label: Kielelliset väestöryhmät, kielipolitiikka (852)
alternative label: Kielelliset vähemmistöt, kielipolitiikka (852)
alternative label: Kielen kuoleminen, kielisosiologia (852)
alternative label: Kielen omaksuminen (852)
alternative label: Kielen oppiminen (852)
alternative label: Kielen vaihto (852)
alternative label: Kielenhuolto (852)
alternative label: Kielenkäyttö (852)
alternative label: Kielenoppaat (852)
alternative label: Kielenoppiminen (852)
alternative label: Kielentarkastus (852)
alternative label: Kielentarkistus (852)
alternative label: Kielenvaihto (852)
alternative label: Kieli-identiteetti (852)
alternative label: Kielihäiriöt, kielen omaksuminen (852)
alternative label: Kielikontaktit, kielisosiologia (852)
alternative label: Kielikysymys (852)
alternative label: Kielioppaat (852)
alternative label: Kielipolitiikka (852)
alternative label: Kielipsykologia (852)
alternative label: Kielisosiologia (852)
alternative label: Kielitaito (852)
alternative label: Kielivirheet (852)
alternative label: Kielivähemmistöt, kielipolitiikka (852)
alternative label: Kiertoilmaisut (852)
alternative label: Kirjoittaminen, kielitiede (852)
alternative label: Kliseet, kielitiede (852)
alternative label: Kontaktit, kielikontaktit (852)
alternative label: Koodinvaihto (852)
alternative label: Kuolevat kielet, kielisosiologia (852)
alternative label: Lastenkieli, kielitiede (852)
alternative label: Monikielisyys (852)
alternative label: Muoti-ilmaukset, kielenhuolto (852)
alternative label: Oikeakielisyys (852)
alternative label: Oikeinkirjoitus (852)
alternative label: Pragmatiikka, kielitiede (852)
alternative label: Psykolingvistiikka (852)
alternative label: Puheakti, kielitiede (852)
alternative label: Puolikielisyys (852)
broader: KIELITIEDE
in scheme: URN:NBN:fi:au:hklj:
notation: 852
related: URN:NBN:fi:au:hklj:120
related: Oppimisen psykologia
related: Psychology of expression {@en
related: Kirjallisuuden ja kielten opetusoppi
related: URN:NBN:fi:au:hklj:323
related: Kirjallisuuden psykologia ja sosiologia
related: URN:NBN:fi:au:hklj:860
related: GERMAANISET, KELTTILÄISET, BALTTILAISET JA SLAAVILAISET KIELET
related: Ruotsin kieli
related: Suomenruotsi
related: Saksan kieli
related: Englannin kieli
related: URALILAISET KIELET. ALTAILAISET KIELET
related: Suomen kieli
related: MUUT KIELET
scope note: Kielipsykologian-, sosiologian- ja -politiikan yleisteokset Psykolingvistiikka eli kielipsykologia yleensä. Sosiolingvistiikka yleensä Kielenhuolto ja oikeakielisyys yleensä Kielitaito. Kaksi- ja monikielisyys. Selkokieli Tiettyä kieltä tai kieliryhmää koskeva kielipsykologia, -sosiologia ja -politiikka ko. kielen tai kieliryhmän luokassa
scope note: Allmänna verk om språkpsykologi, språksociologi och språkpolitik Psykolingvistik (språkpsykologi) i allmänhet. Sociolingvistik i allmänhet Språkvård och språkriktighet i allmänhet Språkkunskap. Två- och flerspråkighet. Verk om lättläst litteratur Språkpsykologi, språksociologi och språkpolitik som rör ett bestämt språk eller en bestämd språkgrupp förs till klassen för språket eller språkgruppen i fråga @sv

Pohjoismaiset kielet
type: Class
type: Concept
subclass of: GERMAANISET, KELTTILÄISET, BALTTILAISET JA SLAAVILAISET KIELET
alternative label: Pohjoisgermaaniset kielet (871 ... 872 +)
alternative label: Pohjoisgermaaniset kielet, kielitiede (871 ... 872 +)
alternative label: Pohjoismaiset kielet (871 ... 872 +)
alternative label: Pohjoismaiset kielet, kielitiede (871 ... 872 +)
alternative label: Skandinaaviset kielet (871 ... 872 +)
alternative label: Skandinaaviset kielet, kielitiede (871 ... 872 +)
alternative label: Nordgermanska språk (871 ... 872 +) @sv
alternative label: Nordgermanska språk, lingvistik (871 ... 872 +) @sv
alternative label: Nordiska språk (871 ... 872 +) @sv
alternative label: Nordiska språk, lingvistik (871 ... 872 +) @sv
alternative label: Skandinaviska språk (871 ... 872 +) @sv
alternative label: Skandinaviska språk, lingvistik (871 ... 872 +) @sv
broader: GERMAANISET, KELTTILÄISET, BALTTILAISET JA SLAAVILAISET KIELET
in scheme: URN:NBN:fi:au:hklj:
narrower: Tanskan kieli
narrower: Norjan kieli
narrower: Islannin kieli
notation: 871
preferred label: Nordic languages @en
preferred label: Nordiska språk @sv
related: URN:NBN:fi:au:hklj:860
related: Ruotsin kieli
related: Ruotsin kielen äänneoppi
related: Ruotsin kielen etymologia ja onomastiikka
related: Ruotsin kielen yksikieliset sanakirjat
related: Ruotsin kielen kielioppi ja semantiikka
related: Ruotsin kielen murteet
related: Suomenruotsi
related: Ruotsin kielen ainekirjoitusoppaat
related: Ruotsin kielen historia
scope note: Yleisteokset pohjoismaisista, pohjoisgermaanisista tai skandinaavisista kielistä
scope note: Allmänna verk om nordiska, nordgermanska eller skandinaviska språk @sv

HISTORIAN TUTKIMUSMENETELMÄT. ARKEOLOGIA. KULTTUURIHISTORIA
type: Class
type: Concept
subclass of: URN:NBN:fi:au:hklj:900
alternative label: Historiatieteet (910)
alternative label: Historiska vetenskaper (910) @sv
broader: URN:NBN:fi:au:hklj:900
in scheme: URN:NBN:fi:au:hklj:
narrower: Historian tutkimusmenetelmät
narrower: Historian aputieteet
narrower: Historialliset kartat. Historiallinen maantiede
narrower: Yleinen arkeologia
narrower: Egyptin ja Etu-Aasian muinaishistoria ja arkeologia
narrower: Kreikan muinaishistoria ja arkeologia
narrower: Rooman valtakunnan historia ja arkeologia
narrower: URN:NBN:fi:au:hklj:919
notation: 910
preferred label: HISTORICAL RESEARCH METHODS. ARCHAEOLOGY. CULTURAL HISTORY @en
preferred label: HISTORISKA FORSKNINGSMETODER. ARKEOLOGI. KULTURHISTORIA @sv
scope note: Yleisteokset, jotka koskevat esim. sekä historian tutkimusmenetelmiä että historian aputieteitä tai arkeologiaa
scope note: Allmänna verk som rör t.ex. såväl historiska forskningmetoder som historiska hjälpvetenskaper eller arkeologi @sv

Helsinki. Pääkaupunkiseutu
type: Class
type: Concept
subclass of: URN:NBN:fi:au:hklj:929
alternative label: Espoo, historia (929.11)
alternative label: Helsinki, ympäristöineen, historia (929.11)
alternative label: Kauniainen, historia (929.11)
alternative label: Paikallishistoria, Suomi, pääkaupunkiseutu (929.11)
alternative label: Paikallishistoriat, pääkaupunkiseutu (929.11)
alternative label: Pitäjänhistoriat, pääkaupunkiseutu (929.11)
alternative label: Pääkaupunkiseutu, paikallishistoria (929.11)
alternative label: Vantaa, historia (929.11)
alternative label: Esbo, historia (929.11) @sv
alternative label: Grankulla, historia (929.11) @sv
alternative label: Helsingfors, med omnejd, historia (929.11) @sv
alternative label: Huvudstadsregion, lokalhistoria (929.11) @sv
alternative label: Lokalhistoria, Finland, huvudstadsregionen (929.11) @sv
alternative label: Lokalhistoriker, Finland, huvudstadsregionen (929.11) @sv
alternative label: Sockenhistoriker, huvudstadsregionen (929.11) @sv
alternative label: Vanda, historia (929.11) @sv
broader: URN:NBN:fi:au:hklj:929
in scheme: URN:NBN:fi:au:hklj:
notation: 929.11
preferred label: Helsinki. The metropolitan area @en
preferred label: Helsingfors. Huvudstadsregionen @sv
related: URN:NBN:fi:au:hklj:061
related: Suomi
related: Suomen ulkopolitiikka
related: Helsinki. Pääkaupunkiseutu
related: URN:NBN:fi:au:hklj:411
related: Suomenruotsalaisten asuma-alueet
related: Uusimaa
related: Kotiseutututkimus
related: Suomen yleinen taidehistoria
related: URN:NBN:fi:au:hklj:726
related: URN:NBN:fi:au:hklj:909
related: URN:NBN:fi:au:hklj:919
related: URN:NBN:fi:au:hklj:930
related: Neuvostoliiton historia 1945-1991
scope note: Helsingin, Espoon, Kauniaisten ja Vantaan paikallishistoria
scope note: Helsingfors, Esbos, Vandas och Grankullas lokalhistoria @sv

Suomi
type: Class
type: Concept
subclass of: Humanististen tieteiden edustajat
broader: Humanististen tieteiden edustajat
in scheme: URN:NBN:fi:au:hklj:
notation: 997.1
preferred label: Finland @en
related: Pelastusoppi. Kristillinen antropologia
related: URN:NBN:fi:au:hklj:323
related: Poliittiset ja aatteelliset vähemmistöt
related: URN:NBN:fi:au:hklj:617
related: URN:NBN:fi:au:hklj:618.24
related: URN:NBN:fi:au:hklj:618.3
related: URN:NBN:fi:au:hklj:909
related: URN:NBN:fi:au:hklj:919
related: Maantieteilijät. Tutkimusmatkailijat. Löytöretkeilijät.Kansatieteilijät. Antropologit
related: URN:NBN:fi:au:hklj:997.103
related: Sukuhistoria. Sukututkimus

RUOTSINKIELINEN KAUNOKIRJALLISUUS (Kaunoluokka)
type: Class
type: Concept
type: FormClass
subclass of: Kaunoluokat
broader: Kaunoluokat
in scheme: URN:NBN:fi:au:hklj:
narrower: Ruotsinkieliset kansanrunot (Kaunoluokka)
narrower: Ruotsinkieliset runot (Kaunoluokka)
narrower: Ruotsinkieliset näytelmät ja kuunnelmat (Kaunoluokka)
narrower: Ruotsinkieliset romaanit, novellit ja näytelmäelokuvat (Kaunoluokka)
narrower: Ruotsinkielinen murrekirjallisuus (Kaunoluokka)
narrower: Ruotsinkieliset sadut (Kaunoluokka)
narrower: Tanskankielinen kaunokirjallisuus (Kaunoluokka)
narrower: Norjankielinen kaunokirjallisuus (Kaunoluokka)
notation: 2
preferred label: SWEDISH FICTION (Fiction class) @en
preferred label: SVENSK SKÖNLITTERATUR (Skönklass) @sv
scope note: Kaunokirjallisuuden luokissa teokset ovat julkaisun kielen, eivät julkaisumaan tai alkuteoksen kielen mukaisessa luokassa Jos kaksikielisen teoksen toinen kieli on käännöskieli, on teos käännöskielen mukaisessa luokassa Jos kaksi- tai useampikielisen teoksen tekstit eivät ole toistensa käännöksiä, on teos julkaisun pääkielen mukaisessa luokassa Jos teoksella ei ole pääkieltä, se on julkaisun ensimmäisen kielen mukaisessa luokassa Fiktiiviset video- ja elokuvatallenteet ovat kaunokirjallisuuden luokissa, näytelmäelokuvat romaanien luokissa, näytelmäesitysten tallenteet näytelmien luokissa, satuelokuvat satujen luokissa sekä piirretyt, nukke- ja animaatioelokuvat sarjakuvien luokissa Tekstitetyt elokuva- ja videotallenteet ovat tekstityskielen mukaisessa luokassa Elokuvakäsikirjoitukset ovat elokuvan historian luokassa 777.9+ Kaunokirjalliset äänitteet ovat kaunokirjallisuuden luokissa, kuunnelmat näytelmien luokissa ja ääneen luettu kirjallisuus ko. kirjallisuudenlajin luokissa Tässä kaunokirjalliset sekasisältöiset kokoelmat, valikoimat, antologiat, lukemistot, lukukirjat, ohjelmistot ja aapiset Jos teos painottuu johonkin kaunokirjallisuuden lajiin, on etusija kirjallisuuden lajin mukaisella luokalla
scope note: I klasserna för skönlitteraturen klassificeras verken enligt publikationens språk, inte enligt klassen för utgivningslandets eller originaltitelns språk Om det ena språket i ett tvåspråkigt verk år översättningsspråk klassificeras verket enligt översättningsspråket Om texterna i ett tvåspråkigt eller flerspråkigt verk inte är översättningar av varandra klassificeras verket enligt publikationens huvudspråk Om verket inte har något huvudspråk klassificeras det enligt det första språket i publikationen Fiktiva videoinspelningar och filminspelningar förs till de skönlitteraära klasserna; spelfiler förs till klasserna för romaner, inspelningar av teaterföreställningar förs till klasserna för drama, sagofilmer förs till klasserna för sagor och tecknade filmer, dockfilmer samt animationsfilmer förs till klasserna för tecknade serier Textade videoinspelningar och filminspelningar klassificeras enligt textningens språk Filmmanus förs till klassen för filmens historia 777.9+ Ljudupptagningar med skönlitteratur förs till de skönlitterära klasserna; hörspel förs till klasserna för drama och inläst litteratur klassificeras enligt litterärt temaområde eller genre Hit skönlitterära samlade verk, verk i urval, antologier, textböcker, läseböcker, program och ABC-böcker med blandat innehåll, Om någon skönlitterär genre dominerar i verket ges företräde åt klassen för den litterära genren i fråga @sv

Muiden kielten kaunokirjallisuus (Kaunoluokka)
type: Class
type: Concept
type: FormClass
subclass of: MUIDEN KIELTEN KAUNOKIRJALLISUUS (Kaunoluokka)
broader: MUIDEN KIELTEN KAUNOKIRJALLISUUS (Kaunoluokka)
in scheme: URN:NBN:fi:au:hklj:
narrower: Baskinkielinen kaunokirjallisuus (Kaunoluokka)
narrower: Albaniankielinen kaunokirjallisuus (Kaunoluokka)
narrower: Kelttiläísten kielten kaunokirjallisuus (Kaunoluokka)
narrower: Armeniankielinen kaunokirjallisuus (Kaunoluokka)
narrower: Georgiankielinen kaunokirjallisuus (Kaunoluokka)
narrower: Muiden aasialaisten, australialaisten ja oseanialaisten kielten kaunokirjallisuus (Kaunoluokka)
narrower: Afrikan kielten kaunokirjallisuus (Kaunoluokka)
narrower: Keinotekoisten kielten kaunokirjallisuus (Kaunoluokka)
notation: 9.9
preferred label: Fiction in other languages (Fiction class) @en
preferred label: Skönlitteratur på övriga språk (Skönklass) @sv
scope note: Intiaanikielten kaunokirjallisuus. Eskimokielten kaunokirjallisuus. Inuiittikielten kaunokirjallisuus. Pidgin- ja kreolikielinen kaunokirjallisuus. Abhaasin, adygen, kabardin ja tšerkessinkielinen kaunokirjallisuus.
scope note: Skönlitteratur på indianspråk. Skönlitteratur på eskimåspråk. Skönlitteratur på inuitspråk. Skönlitteratur på pidginspråk och kreolspråk. Skönlitteratur på abchaziska, adygeiska, kabardinska och östcircassiska. @sv

Kirjoitus. Kirjoitustaito
type: Class
type: Concept
subclass of: KIRJA-ALA
alternative label: Aakkoset (001)
alternative label: Aakkosto (001)
alternative label: Aakkostot (001)
alternative label: Aakkostus (001)
alternative label: Alkukirjaimet, kirjoitusmerkit (001)
alternative label: Anfangit, kirjoitusmerkit (001)
alternative label: Grafemiikka (001)
alternative label: Initiaalit, kirjoitusmerkit (001)
alternative label: Kaunokirjoitus (001)
alternative label: Kaunokirjoitus, kirjoitusmerkit (001)
alternative label: Kirjaimet (001)
alternative label: Kirjaimistot (001)
alternative label: Kirjainkirjoitus (001)
alternative label: Kirjoittaminen, kirjoitustaito (001)
alternative label: Kirjoitus, kirjoitustaito (001)
alternative label: Kirjoitusjärjestelmät, kirjoitustaito (001)
alternative label: Kirjoitusmerkit, kirjoitustaito (001)
alternative label: Kirjoitustaito, kirjoitus (001)
alternative label: Kirjoitustyylit (001)
alternative label: Kirjoitustyylit, kirjoitustaito (001)
alternative label: Kirjoitusvälineet, kirjoitustaito (001)
alternative label: Kynät, kirjoitustaito (001)
alternative label: Kyrillinen kirjaimisto (001)
alternative label: Lajittelu, aakkostus (001)
alternative label: Latinalainen kirjaimisto (001)
alternative label: Merkit, kirjoitusmerkit (001)
alternative label: Morseaakkoset (001)
alternative label: Musteet, kirjoitusvälineet (001)
alternative label: Salaaminen, salakirjoitus (001)
alternative label: Salaus, salakirjoitus (001)
alternative label: Sähkötys, morseaakkoset (001)
alternative label: Tarkekirjoitus (001)
alternative label: Tavukirjoitus (001)
alternative label: Tavumerkistöt (001)
alternative label: Transkriptio (001)
alternative label: Transkriptiot, kirjoitusjärjestelmät (001)
alternative label: Translitterointi (001)
alternative label: Välimerkit, kirjoitusjärjestelmät (001)
alternative label: Äännekirjoitus (001)
alternative label: Abc (001) @sv
alternative label: Alfabet (001) @sv
alternative label: Alfabet (ordning) (001) @sv
alternative label: Alfabetisering (001) @sv
alternative label: Anfanger, skrivtecken (001) @sv
alternative label: Begynnelsebokstäver, skrivtecken (001) @sv
alternative label: Bläck, skrivredskap (001) @sv
alternative label: Bokstavsskrift (001) @sv
alternative label: Bokstäver (001) @sv
alternative label: Fonetisk skrift (001) @sv
alternative label: Grafemik (001) @sv
alternative label: Hemlighållande, chifferskrift (001) @sv
alternative label: Initialer, skrivtecken (001) @sv
alternative label: Kyrilliska alfabetet (001) @sv
alternative label: Latinska alfabetet (001) @sv
alternative label: Ljudskrift (001) @sv
alternative label: Morsealfabetet (001) @sv
alternative label: Pennor, skrivkonst (001) @sv
alternative label: Skiljetecken, skriftsystem (001) @sv
broader: KIRJA-ALA
in scheme: URN:NBN:fi:au:hklj:
narrower: Kirjoituksen historia. Paleografia. Epigrafia
narrower: Konekirjoitus
narrower: Pikakirjoitus
notation: 001
related: Symbolit. Koodit. Merkkijärjestelmät
related: Kirjapainotaito. Graafinen teollisuus
related: Lukeminen. Lukutaito
related: Psychology of expression {@en
related: Luku-, kirjoitus- ja puhehäiriöiset
related: Näkövammaiset
related: Kirjallisuuden ja kielten opetusoppi
related: Tekstaus. Kalligrafia
related: Notaatio
related: KIELITIEDE
related: Keinotekoiset kielet
scope note: Kirjoitustaito. Kirjoitustaidottomuus Kirjoitusvälineet ja -aineet. Kirjoitustyylit Kirjaimet. Kirjaimistot. Kirjoitusmerkit Kirjoitusjärjestelmät Aakkoset. Morseaakkoset Translitterointi. Transkriptio Käsialat kirjoitustaidon ja kirjoitustyylien kannalta
scope note: Skrivkonst. Skrivsvårigheter Skrivredskap och skrivmaterial. Stilarter Bokstäver. Alfabet. Skrivtecken Skriftsystem ABC. Morsealfabetet Translitterering. Transkription Handstilar ur skrivkonstens och stilarternas synvinkel @sv

Psyyken rakenne ja toiminnot
type: Class
type: Concept
subclass of: URN:NBN:fi:au:hklj:120
alternative label: Assosiaatio, kognitiivinen psykologia (121 +)
alternative label: Déjà vu -ilmiö, kognitiivinen psykologia (121 +)
alternative label: Henkinen toimintakyky, psyyken rakenne ja toiminnot (121 +)
alternative label: Intersubjektiivisuus, psyyken rakenne (121 +)
alternative label: Itsesäätely, kognitiivinen psykologia (121 +)
alternative label: Itsetajunta, kognitiivinen psykologia (121 +)
alternative label: Kognitiivinen kehitys (121 +)
alternative label: Kognitiivinen psykologia (121 +)
alternative label: Kognitiiviset prosessit (121 +)
alternative label: Kognitiiviset taidot (121 +)
alternative label: Kognitio (121 +)
alternative label: Kognitiotiede (121 +)
alternative label: Metakognitio (121 +)
alternative label: Mielenfilosofia, psyyken rakenne (121 +)
alternative label: Mieli, psyyken rakenne (121 +)
alternative label: Narratiivinen psykologia, psyyken rakenne ja toiminta (121 +)
alternative label: Neuromarkkinointi, kognitiivinen psykologia (121 +)
alternative label: Psykologia, kognitiivinen psykologia (121 +)
alternative label: Psykologia, psyyken rakenne ja toiminta (121 +)
alternative label: Psyyke, rakenne ja toiminta (121 +)
alternative label: Psyykkinen toimintakyky, psyyken rakenne ja toiminnot (121 +)
alternative label: Reaktiot, psykologia (121 +)
alternative label: Sielunelämä, psyyken rakenne (121 +)
alternative label: Sosiaalinen neurotiede, kognitiivinen psykologia (121 +)
alternative label: Subjektiivisuus, psyyken rakenne (121 +)
alternative label: Tajunta, psykologia (121 +)
alternative label: Tiedostaminen, psykologia (121 +)
alternative label: Tietoinen läsnäolo, psykologia (121 +)
alternative label: Tietoisuus (121 +)
alternative label: Tietoisuus, psykologia (121 +)
alternative label: Tilannekuva,kognitiiviset taidot (121 +)
alternative label: Torjunta, psykologia, tietoisuus, psykologia (121 +)
alternative label: Valvetila, kognitiivinen psykologia (121 +)
alternative label: Ymmärtäminen, kognitiivinen psykologia (121 +)
alternative label: Association, kognitiv psykologi (121 +) @sv
alternative label: Bortträngning, psykologi, medvetande, psykologi (121 +) @sv
alternative label: Déjà vu, kognitiv psykologi (121 +) @sv
alternative label: Filosofisk psykologi, psykets struktur (121 +) @sv
alternative label: Förståelse, kognitiv psykologi (121 +) @sv
alternative label: Intersubjektivitet, psykets struktur (121 +) @sv
alternative label: Kognition (121 +) @sv
alternative label: Kognitionsvetenskap (121 +) @sv
alternative label: Kognitiv psykologi (121 +) @sv
alternative label: Kognitiv utveckling (121 +) @sv
alternative label: Kognitiva färdigheter (121 +) @sv
alternative label: Kognitiva processer (121 +) @sv
alternative label: Medvetande, psykologi (121 +) @sv
alternative label: Medvetengörande, psykologi (121 +) @sv
alternative label: Medvetenhet (121 +) @sv
alternative label: Medvetenhet, psykologi (121 +) @sv
alternative label: Mental funktionsförmåga, psykets struktur och funktioner (121 +) @sv
alternative label: Metakognition (121 +) @sv
alternative label: Mindfulnessmeditation, psykologi (121 +) @sv
alternative label: Narrativ psykologi, psyke, struktur och funktion (121 +) @sv
alternative label: Neuromarknadsföring, kognitiv psykologi (121 +) @sv
alternative label: Psyke, struktur och funktion (121 +) @sv
alternative label: Psykisk funktionsförmåga, psykets struktur och funktioner (121 +) @sv
alternative label: Psykologi, kognitiv psykologi (121 +) @sv
alternative label: Psykologi, psyke, struktur och funktion (121 +) @sv
alternative label: Reaktioner, psykologi (121 +) @sv
broader: URN:NBN:fi:au:hklj:120
in scheme: URN:NBN:fi:au:hklj:
narrower: Ajattelu. Älykkyys. Mielikuvitus
narrower: Tunne- ja tahtotoiminnot
narrower: Oppimisen psykologia
narrower: Havaintopsykologia
narrower: Tiedostamaton sielunelämä
notation: 121
related: Psykologian suunnat
related: Perinnöllisyyspsykologia
related: Lapsuuden ja nuoruuden psykologia
related: Muita psykologian aloja
related: Kehityspsykologia. Eri ikäkausien psykologia
related: Fysiologinen psykologia
related: URN:NBN:fi:au:hklj:617.2
scope note: Psyyken rakennetta ja toimintaa sekä kognitiivista psykologiaa koskevat yleisteokset
scope note: Allmänna verk som rör psykets struktur och funktioner samt kognitiv psykologi @sv

Sosiaalipsykologia. Kulttuuripsykologia
type: Class
type: Concept
subclass of: Muita psykologian aloja
alternative label: Aggressiot, sosiaalipsykologia (128.3 +)
alternative label: Aivopesu, sosiaalipsykologia (128.3)
alternative label: Anomia, sosiaalipsykologia (128.3)
alternative label: Antipatia, sosiaalipsykologia (128.3)
alternative label: Arvostus, sosiaalipsykologia (128.3 +)
alternative label: Arvovalta, sosiaalipsykologia (128.3)
alternative label: Asennemuutos, sosiaalipsykologia (128.3)
alternative label: Asennetutkimukset, sosiaalipsykologia (128.3)
alternative label: Asenteet, sosiaalipsykologia (128.3)
alternative label: Asosiaalisuus, sosiaalipsykologia (128.3 +)
alternative label: Attribuutio, sosiaalipsykologia (128.3)
alternative label: Auktoriteetti, sosiaalipsykologia (128.3)
alternative label: Boheemit, sosiaalipsykologia (128.3)
alternative label: Elämänhallinta, sosiaalipsykologia (128.3 +)
alternative label: Elämänhistoria, sosiaalipsykologinen tutkimus (128.3 +)
alternative label: Ennakkoluulot (128.3)
alternative label: Epäinhimillisyys, sosiaalipsykologia (128.3 +)
alternative label: Epäsosiaalisuus, sosiaalipsykologia (128.3 +)
alternative label: Esikuvat, sosiaalipsykologia (128.3)
alternative label: Eskapismi, sosiaalipsykologia (128.3)
alternative label: Henkilösuhteet, sosiaalipsykologia (128.3)
alternative label: Homofobia (128.3)
alternative label: Huhut, sosiaalipsykologia (128.3)
alternative label: Hulluus, sosiaalipsykologia (128.3)
alternative label: Huolestuneisuus, sosiaalipsykologia (128.3 +)
alternative label: Hyväksyminen, sosiaalipsykologia (128.3 +)
alternative label: Hyväksyntä, sosiaalipsykologia (128.3 +)
alternative label: Idolit, sosiaalipsykologia (128.3)
alternative label: Ihanteet, sosiaalipsykologia (128.3)
alternative label: Indoktrinaatio, sosiaalipsykologia (128.3)
alternative label: Integraatio, sosiaalipsykologia (128.3)
alternative label: Interaktiivisuus, sosiaalipsykologia (128.3 +)
alternative label: Interaktio, sosiaalipsykologia (128.3)
alternative label: Johtajuus, sosiaalipsykologia (128.3)
alternative label: Johtaminen, sosiaalipsykologia (128.3)
alternative label: Jonot, sosiaalipsykologia (128.3)
alternative label: Joukkoliikkeet, sosiaalipsykologia (128.3)
alternative label: Joukkopsykologia (128.3)
alternative label: Joukkoäly, ryhmäkäyttäytyminen (128.3)
alternative label: Joukot, sosiaalipsykologia (128.3)
alternative label: Julkinen keskustelu, yleinen mielipide (128.3)
alternative label: Julkinen mielipide (128.3)
alternative label: Kannatus, asenteet ja mielipiteet (128.3)
alternative label: Kansalaiskeskustelu, yleinen mielipide (128.3)
alternative label: Kansalaismielipide (128.3)
alternative label: Karismaattisuus, sosiaalipsykologia (128.3 +)
alternative label: Katastrofipsykologia (128.3)
alternative label: Katastrofipsykologia, sosiaalipsykologia (128.3)
alternative label: Katsojat, sosiaalipsykologia (128.3)
alternative label: Keskustelu, yleinen mielipide (128.3)
alternative label: Kollektiivinen toiminta, sosiaalipsykologia (128.3)
alternative label: Kollektiivinen äly, ryhmäkäyttäytyminen (128.3)
alternative label: Kollektiivinen älykkyys, ryhmäkäyttäytyminen (128.3)
alternative label: Kollektiivit, sosiaalipsykologia (128.3)
alternative label: Kollektiiviäly, ryhmäkäyttäytyminen (128.3)
alternative label: Kommuunit, sosiaalipsykologia (128.3)
broader: Muita psykologian aloja
in scheme: URN:NBN:fi:au:hklj:
narrower: Ihmissuhteiden psykologia
notation: 128.3
related: Psykologian suunnat
related: Uskonto- ja maailmankatsomuspsykologia
related: Kulttuurifilosofia
related: URN:NBN:fi:au:hklj:181.7
related: Kristillinen etiikka
related: Sielunhoito
related: SOSIOLOGIA
related: Organisaatioiden ja laitosten sosiologia
related: Työn sosiologia
related: Elämäntapojen sosiologia. Kulttuurisosiologia
related: URN:NBN:fi:au:hklj:357.1
related: Perhesosiologia
related: URN:NBN:fi:au:hklj:618.85
related: Johtamisen tekniikka ja menetelmät
related: Henkilöstöpolitiikka
scope note: Yksilön ja yhteiskunnan vuorovaikutus. Joukkopsykologia Sosiaalinen vuorovaikutus. Sosiaalinen käyttäytyminen. Sosiaaliset roolit. Sosialisaatio. Ryhmäpsykologia Kulttuurin ja kulttuuri-ilmiöiden psykologinen tarkastelu Yleinen mielipide. Mielipiteenmuokkaus. Propaganda. Mielipidetutkimukset. Asenteet. Asennetutkimukset Rikollisuuden, väkivallan ja muun sosiaalisesti poikkeavan käyttäytymisen psykologia Katastrofipsykologia
scope note: Växelverkan mellan individ och samhälle. Masspsykologi Social växelverkan. Socialt beteende. Sociala roller. Socialisation. Gruppsykologi Psykologiska betraktelser över kultur och kulturella företeelser Allmänna opinionen. Manipulation. Propaganda. Opinionsundersökningar. Attityder. Attitydundersökningar Kriminalitet, våld och annat socialt avvikande beteende ur psykologisk synvinkel Katastrofpsykologi @sv

Elämänohjeet
type: Class
type: Concept
subclass of: Itsekasvatus. Itseopiskelu
alternative label: Ahneus, elämänohjeet (188.1)
alternative label: Aikasuunnittelu, elämänohjeet (188.1)
alternative label: Ajanhallinta, elämänohjeet (188.1)
alternative label: Anakoreetit, elämäntaito (188.1)
alternative label: Anteliaisuus, elämänohjeet (188.1)
alternative label: Arkuus, elämänohjeet (188.1)
alternative label: Armeliaisuus, elämänohjeet (188.1)
alternative label: Common sense, elämänohjeet (188.1)
alternative label: Elelämäntaito-oppaat (188.1)
alternative label: Elämän tarkoitus, elämänohjeet (188.1)
alternative label: Elämänfilosofia, elämänohjeet (188.1)
alternative label: Elämänhallinta (188.1)
alternative label: Elämänhallinta, elämänohjeet (188.1)
alternative label: Elämänhalu, elämänohjeet (188.1)
alternative label: Elämänlaatu, elämänohjeet (188.1)
alternative label: Elämänmuutokset, elämänohjeet (188.1)
alternative label: Elämänodotukset, elämänohjeet (188.1)
alternative label: Elämänohjeet (188.1)
alternative label: Elämäntaito (188.1)
alternative label: Elämäntarkoitus, elämänohjeet (188.1)
alternative label: Elämäntilanne, elämänohjeet (188.1)
alternative label: Elämänviisaus (188.1)
alternative label: Empaattisuus, elämänohjeet (188.1)
alternative label: Empatia, elämänohjeet (188.1)
alternative label: Epäonnistuminen, elämänohjeet (188.1)
alternative label: Epärehellisyys, elämänohjeet (188.1)
alternative label: Erakot, elämäntaito (188.1)
alternative label: Erehdys, elämänohjeet (188.1)
alternative label: Eremiitit, elämäntaito (188.1)
alternative label: Esimerkillisyys, elämänohjeet (188.1)
alternative label: Estot, elämänohjeet (188.1)
alternative label: Haaveet, elämäntaito (188.1)
alternative label: Henkinen hyvinvointi, elämänohjeet (188.1)
alternative label: Henkinen kasvu, elämänohjeet (188.1)
alternative label: Henkinen pääoma, elämäntaito, elämänohjeet (188.1)
alternative label: Henkisyys, elämänohjeet (188.1)
alternative label: Humaanisuus, elämäntaito, elämänohjeet (188.1)
alternative label: Huolellisuus, elämänohjeet (188.1)
alternative label: Huolestuneisuus, elämänohjeet (188.1)
alternative label: Hyvä elämä, elämäntaito (188.1)
alternative label: Hyvä maku, elämänohjeet (188.1)
alternative label: Ihmissuhdetaidot, elämänohjeet (188.1)
alternative label: Ihmistuntemus, elämäntaito (188.1)
alternative label: Ihmisyys, elämäntaito, elämänohjeet (188.1)
alternative label: Ikääntyminen, elämänohjeet (188.1)
alternative label: Ilo, elämänohjeet (188.1)
alternative label: Inhimillinen pääoma, elämäntaito, elämänohjeet (188.1)
alternative label: Inhimillisyys, elämäntaito, elämänohjeet (188.1)
alternative label: Intohimo, elämänohjeet (188.1)
alternative label: Isoisät, elämänohjeet (188.1)
alternative label: Isovanhemmat, elämänohjeet (188.1)
alternative label: Isovanhemmuus, elämänohjeet (188.1)
alternative label: Isoäidit, elämänohjeet (188.1)
alternative label: Isät, elämänohjeet (188.1)
alternative label: Itsehallinta, elämänohjeet (188.1)
broader: Itsekasvatus. Itseopiskelu
in scheme: URN:NBN:fi:au:hklj:
notation: 188.1
related: Tunne- ja tahtotoiminnot
related: Ihmissuhteiden psykologia
related: ETIIKKA. ESTETIIKKA
related: Etiikka. Moraalifilosofia
related: ELÄMÄNFILOSOFIA. KULTTUURIFILOSOFIA
related: Elämänfilosofia
related: Perhe- ja kotikasvatus
related: URN:NBN:fi:au:hklj:181.7
related: URN:NBN:fi:au:hklj:182
related: URN:NBN:fi:au:hklj:183.5
related: URN:NBN:fi:au:hklj:183.7
related: URN:NBN:fi:au:hklj:188.4
related: URN:NBN:fi:au:hklj:613.1
related: Henkilökohtainen terveydenhoito
related: URN:NBN:fi:au:hklj:618.2
related: URN:NBN:fi:au:hklj:618.24
related: Itsemurhat ja niiden ehkäisy
scope note: Elämänviisauteen, elämäntaitoon ja itsensä kehittämiseen liittyvät yleiset elämänohjeet Ujous ja sen voittaminen Jos teoksessa on sekä elämänviisauteen että ihmissuhteiden psykologiaan tai mielenterveyteen liittyviä elämänohjeita, on etusija luokalla 188.1 Eri elämänalueisiin liittyvät elämänohjeet alan mukaisessa luokassa
scope note: Allmänna levnadsregler som rör levnadsvisdom, levnadskonst och konsten att utveckla sig själv Blyghet och hur man övervinner den Om verket handlar om levnadsregler som hänför sig till både levnadsvisdom och de mänskliga relationernas eller den mentala hälsans psykologi, ges företräde åt klass 188.1 Levnadsregler inom olika livsområden klassificeras enligt område @sv

Itä-Aasian uskonnot ja mytologiat
type: Class
type: Concept
subclass of: URN:NBN:fi:au:hklj:280
alternative label: Itämaiset uskonnot, konfutselaisuus (281)
alternative label: Itämaiset uskonnot, sintolaisuus (281)
alternative label: Itämaiset uskonnot, taolaisuus (281)
alternative label: Jang ja jin, taolaisuus (281)
alternative label: Japani, mytologiat (281 ... 283)
alternative label: Japani, uskonnot (281 ... 283)
alternative label: Jin ja jang, taolaisuus (281)
alternative label: Kiina, mytologiat (281 ... 283)
alternative label: Kiina, uskonnot (281 ... 283)
alternative label: Konfutselaisuus (281)
alternative label: Kungfutselaisuus (281)
alternative label: Meditaatio, konfutselaisuus (281)
alternative label: Meditaatio, sintolaisuus (281)
alternative label: Meditaatio, taolaisuus (281)
alternative label: Mietiskely, konfutselaisuus (281)
alternative label: Mietiskely, sintolaisuus (281)
alternative label: Mietiskely, taolaisuus (281)
alternative label: Shintolaisuus (281)
alternative label: Sintolaisuus (281)
alternative label: Taolaisuus (281)
alternative label: Uskonnot, konfutselaisuus (281)
alternative label: Uskonnot, sintolaisuus (281)
alternative label: Uskonnot, taolaisuus (281)
alternative label: Uskontokunnat, konfutselaisuus (281)
alternative label: Uskontokunnat, sintolaisuus (281)
alternative label: Uskontokunnat, taolaisuus (281)
alternative label: Yang ja yin, taolaisuus (281)
alternative label: Yin ja yang, taolaisuus (281)
alternative label: Confucianism (281) @sv
alternative label: Jang och jin, taoism (281) @sv
alternative label: Japan, mytologier (281 ... 283) @sv
alternative label: Japan, religioner (281 ... 283) @sv
alternative label: Jin och jang, taoism (281) @sv
alternative label: Kina, mytologier (281 ... 283) @sv
alternative label: Kina, religioner (281 ... 283) @sv
alternative label: Konfucianism (281) @sv
alternative label: Meditation, meditaatio, konfucianism (281) @sv
alternative label: Meditation, meditaatio, shintoism (281) @sv
alternative label: Meditation, meditaatio, taoism (281) @sv
alternative label: Meditation, mietiskely, konfucianism (281) @sv
alternative label: Meditation, mietiskely, shintoism (281) @sv
alternative label: Meditation, mietiskely, taoism (281) @sv
alternative label: Religioner, konfucianism (281) @sv
alternative label: Religioner, shintoism (281) @sv
alternative label: Religioner, taoism (281) @sv
alternative label: Religionssamfund, konfucianism (281) @sv
alternative label: Religionssamfund, shintoism (281) @sv
alternative label: Religionssamfund, taoism (281) @sv
alternative label: Shintoism (281) @sv
alternative label: Taoism (281) @sv
alternative label: Yang och yin, taoism (281) @sv
alternative label: Yin och yang, taoism (281) @sv
alternative label: Österländska religioner, konfucianism (281) @sv
alternative label: Österländska religioner, shintoism (281) @sv
alternative label: Österländska religioner, taoism (281) @sv
broader: URN:NBN:fi:au:hklj:280
in scheme: URN:NBN:fi:au:hklj:
notation: 281
related: Itämainen filosofia
related: URN:NBN:fi:au:hklj:110
related: RAJATIETO
related: URN:NBN:fi:au:hklj:192
related: Kuolemakokemukset
related: Uskonnonfilosofia
related: Elämä. Kuolema
related: Luominen. Kehitys
related: URN:NBN:fi:au:hklj:209
related: URN:NBN:fi:au:hklj:210
related: Jumalan olemus
related: Enkelit. Paholaiset. Demonit
related: Kuolema ja kuolemanjälkeinen elämä
related: Lähetystyö
related: Buddhalaisuus ja sen mytologia
related: URN:NBN:fi:au:hklj:807
related: URN:NBN:fi:au:hklj:992
scope note: Konfutselaisuus. Shintolaisuus. Taolaisuus
scope note: Konfucianism. Shintoism. Taoism @sv

Antiikin Kreikan ja Rooman uskonnot ja mytologiat
type: Class
type: Concept
subclass of: URN:NBN:fi:au:hklj:280
alternative label: Antiikki, mytologiat (285)
alternative label: Antiikki, uskonnot (285)
alternative label: Avioliittoon vihkiminen, uskontotiede, eri uskonnot (282 ... 289 +)
alternative label: Etruskit, mytologia (285)
alternative label: Etruskit, uskonnot (285)
alternative label: Jupiter, mytologia (285)
alternative label: Kentaurit, antiikin mytologia (285)
alternative label: Kreikka, mytologiat, antiikki (285)
alternative label: Kreikka, uskonnot, antiikki (285)
alternative label: Kreikkalainen mytologia (285)
alternative label: Mars, mytologia (285)
alternative label: Merkurius, mytologia (285)
alternative label: Muusat, mytologia (285)
alternative label: Neptunus, mytologia (285)
alternative label: Oraakkelit (285)
alternative label: Pythagoralaisuus, uskonto (285)
alternative label: Roomalainen mytologia (285)
alternative label: Rooman valtakunta, mytologiat (285)
alternative label: Rooman valtakunta, uskonnot (285)
alternative label: Saturnus, mytologia (285)
alternative label: Venus, mytologia (285)
alternative label: Antiken, mytologier (285) @sv
alternative label: Antiken, religioner (285) @sv
alternative label: Centaurer, antikens mytologi (285) @sv
alternative label: Etrusker, mytologi (285) @sv
alternative label: Etrusker, religioner (285) @sv
alternative label: Grekisk mytologi (285) @sv
alternative label: Grekland, mytologier, antiken (285) @sv
alternative label: Grekland, religioner, antiken (285) @sv
alternative label: Jupiter, mytologi (285) @sv
alternative label: Mars, mytologi (285) @sv
alternative label: Merkurius, mytologi (285) @sv
alternative label: Muser, mytologi (285) @sv
alternative label: Neptunus, mytologi (285) @sv
alternative label: Orakel (285) @sv
alternative label: Pytagoreismen, religion (285) @sv
alternative label: Romersk mytologi (285) @sv
alternative label: Romerska riket, mytologier (285) @sv
alternative label: Romerska riket, religioner (285) @sv
alternative label: Saturnus, mytologi (285) @sv
alternative label: Venus, mytologi (285) @sv
broader: URN:NBN:fi:au:hklj:280
in scheme: URN:NBN:fi:au:hklj:
notation: 285
preferred label: Religions and mythologies in Ancient Greece and Rome @en
preferred label: Religioner och mytologier i det antika Grekland och Rom @sv
related: Vanhan ajan filosofia
related: URN:NBN:fi:au:hklj:110
related: RAJATIETO
related: URN:NBN:fi:au:hklj:192
related: Kuolemakokemukset
related: Uskonnonfilosofia
related: Elämä. Kuolema
related: Luominen. Kehitys
related: URN:NBN:fi:au:hklj:209
related: URN:NBN:fi:au:hklj:210
related: Jumalan olemus
related: Enkelit. Paholaiset. Demonit
related: Kuolema ja kuolemanjälkeinen elämä
related: Lähetystyö
related: Muinais-Egyptin ja Etu-Aasian uskonnot ja mytologiat
related: URN:NBN:fi:au:hklj:807
related: URN:NBN:fi:au:hklj:992
scope note: Tässä myös etruskien uskonto ja mytologia
scope note: Hit också etruskernas religion och mytologi @sv

Persian uskonnot ja mytologiat
type: Class
type: Concept
subclass of: URN:NBN:fi:au:hklj:280
alternative label: Avesta (286)
alternative label: Avioliittoon vihkiminen, uskontotiede, eri uskonnot (282 ... 289 +)
alternative label: Itämaiset uskonnot, persian uskonnot (286)
alternative label: Manikealaisuus (286)
alternative label: Mazdalaisuus (286)
alternative label: Mithran kultti (286)
alternative label: Parsilaisuus (286)
alternative label: Persia, mytologiat (286)
alternative label: Persia, uskonnot (286)
alternative label: Zarathustralaisuus (286)
alternative label: Manikeism (286) @sv
alternative label: Mazdaism (286) @sv
alternative label: Mithraskulten (286) @sv
alternative label: Parsism (286) @sv
alternative label: Persien, mytologier (286) @sv
alternative label: Persien, religioner (286) @sv
alternative label: Zoroastrism (286) @sv
alternative label: Österländska religioner, Persiens religioner (286) @sv
broader: URN:NBN:fi:au:hklj:280
in scheme: URN:NBN:fi:au:hklj:
notation: 286
preferred label: Persian religions and mythologies @en
preferred label: Persiska religioner och mytologier @sv
related: Vanhan ajan filosofia
related: URN:NBN:fi:au:hklj:110
related: RAJATIETO
related: URN:NBN:fi:au:hklj:192
related: Kuolemakokemukset
related: Uskonnonfilosofia
related: Elämä. Kuolema
related: Luominen. Kehitys
related: URN:NBN:fi:au:hklj:209
related: URN:NBN:fi:au:hklj:210
related: Jumalan olemus
related: Enkelit. Paholaiset. Demonit
related: Kuolema ja kuolemanjälkeinen elämä
related: Lähetystyö
related: Muinais-Egyptin ja Etu-Aasian uskonnot ja mytologiat
related: URN:NBN:fi:au:hklj:807
related: URN:NBN:fi:au:hklj:992
scope note: Manikealaisuus. Mazdalaisuus. Parsilaisuus. Zarathustralaisuus. Zoroastrialaisuus
scope note: Manikeism. Mazdaism. Parsism. Zarathustraläran. Zoroastrism @sv

Muinaisgermaaniset, -balttilaiset, -slaavilaiset ja -kelttiläiset uskonnot ja mytologiat
type: Class
type: Concept
subclass of: Muut uskonnot ja mytologiat
alternative label: Balttilainen mytologia (289.9)
alternative label: Balttilaiset uskonnot (289.9)
alternative label: Druidit (289.9)
alternative label: Germaaniset mytologiat (289.9 +)
alternative label: Germaaniset uskonnot (289.9 +)
alternative label: Irlanti, kelttiläinen mytologia (289.9)
alternative label: Keltit, mytologiat (289.9)
alternative label: Keltit, uskonnot (289.9)
alternative label: Slaavilainen mytologia (289.9)
alternative label: Baltisk mytologi (289.9) @sv
alternative label: Baltiska religioner (289.9) @sv
alternative label: Druider (289.9) @sv
alternative label: Germanska mytologier (289.9 +) @sv
alternative label: Germanska religioner (289.9 +) @sv
alternative label: Irland, keltisk mytologi (289.9) @sv
alternative label: Kelter, mytologier (289.9) @sv
alternative label: Kelter, religioner (289.9) @sv
alternative label: Slavisk mytologi (289.9) @sv
broader: Muut uskonnot ja mytologiat
in scheme: URN:NBN:fi:au:hklj:
narrower: Muinaispohjoismaiset uskonnot ja mytologiat
notation: 289.9
preferred label: Ancient German, Ancient Baltic, Ancient Slavic and Ancient Celtic religions and mythologies @en
preferred label: Forngermanska, fornbaltiska, fornslaviska och fornkeltiska religioner och mytologier @sv
related: URN:NBN:fi:au:hklj:110
related: RAJATIETO
related: URN:NBN:fi:au:hklj:192
related: Kuolemakokemukset
related: Uskonnonfilosofia
related: Elämä. Kuolema
related: Luominen. Kehitys
related: URN:NBN:fi:au:hklj:209
related: URN:NBN:fi:au:hklj:210
related: Jumalan olemus
related: Enkelit. Paholaiset. Demonit
related: Kuolema ja kuolemanjälkeinen elämä
related: Lähetystyö
related: URN:NBN:fi:au:hklj:807
related: URN:NBN:fi:au:hklj:992

Muiden maiden valtiojärjestelmät
type: Class
type: Concept
subclass of: URN:NBN:fi:au:hklj:320
alternative label: Asuntoministerit, valtiojärjestelmät, muut maat (328)
alternative label: Demokratia, valtiojärjestelmät, muut maat (328)
alternative label: Demokratiavaje, valtiojärjestelmät (327 ... 328)
alternative label: Demokratisoituminen, valtiojärjestelmät, muut maat (328)
alternative label: Digitaalidemokratia, valtiojärjestelmät, muut maat (328)
alternative label: Digitaalinen demokratia, valtiojärjestelmät, muut maat (328)
alternative label: Ehdokasasettelu, valtiolliset vaalit, muut maat (328)
alternative label: Ehdokkaat, valtiolliset vaalit, muut maat (328)
alternative label: Elektroninen demokratia, valtiojärjestelmät, muut maat (328)
alternative label: Elinkeinoministerit, valtiojärjestelmät, muut (328)
alternative label: Ennakkoäänestys, valtiolliset, muut maat (328)
alternative label: Ennakkoäänestäminen, valtiolliset, muut maat (328)
alternative label: Esivaalit, muut maat (328)
alternative label: Etädemokratia, valtiojärjestelmät, muut maat (328)
alternative label: Hallintopolitiikka, muiden maiden valtiojärjestelmät (328)
alternative label: Hallituksen esitykset, muut maat (328)
alternative label: Hallituksen muodostaminen, valtiojärjestelmät, muut maat (328)
alternative label: Hallitukset, valtiojärjestelmät, muut maat (328)
alternative label: Hallitusmuoto, muut maat (328)
alternative label: Henkilökohtaiset avustajat, valtiojärjestelmät, muut maat (328)
alternative label: Kaksikamarijärjestelmä, eri maiden poliittiset järjestelmät (328)
alternative label: Kannatus, vaalit, valtiolliset, muut maat (328)
alternative label: Kansanedustajan avustajat, valtiojärjestelmät, muut maat (328)
alternative label: Kansanedustajat, valtiojärjestelmät, muut maat (328)
alternative label: Kansanedustuslaitokset, muut maat (328)
alternative label: Kansanäänestykset, valtiolliset, muut maat (328)
alternative label: Lainsäädäntöprosessi, muut maat (328)
alternative label: Lainsäädäntövalta, muut maat (328)
alternative label: Lainsäätämisjärjestys, muut maat (328)
alternative label: Luottamushenkilöt, parlamentit, muut maat (328)
alternative label: Ministerit, valtiojärjestelmät, muut maat (328)
alternative label: Oikeusministerit, valtiojärjestelmät, muut maat (328)
alternative label: Parlamentaarinen valvonta, muut maat (328)
alternative label: Parlamentarismi, muut maat (328)
alternative label: Parlamentin hajottaminen, muut maat (328)
alternative label: Parlamentit, muut maat (328)
alternative label: Parlamenttivaalit, muut maat (328)
alternative label: Poliittinen kehitys, vaalit, muut maat (328)
alternative label: Poliittinen kontrolli, valtiojärjestelmät, muut maat (328)
alternative label: Poliittinen käyttäytyminen, vaalit, äänestäminen (328)
alternative label: Poliittinen muutos, vaalit, muut maat (328)
alternative label: Poliittinen osallistuminen, vaalit, äänestäminen, muut (328)
alternative label: Poliittinen päätöksenteko, valtiojärjestelmät, muut maat (328)
alternative label: Poliittinen valta, valtiojärjestelmät, muut maat (328)
alternative label: Poliittiset instituutiot, valtiojärjestelmät, muut maat (328)
alternative label: Poliittiset järjestelmät, valtiojärjestelmät, muut maat (328)
alternative label: Postiäänestys, valtiolliset, muut maat (328)
alternative label: Postiäänestäminen, valtiolliset, muut maat (328)
alternative label: Presidentinvaalit, muut maat (328)
alternative label: Presidentti, valtiojärjestelmät, Suomi (328)
alternative label: Puolueiden kannatus, vaalit, valtiolliset, muut maat (328)
alternative label: Puoluekuri, muut maat (328)
alternative label: Puolustusministerit, valtiojärjestelmät, muut maat (328)
alternative label: Päätäntävalta, valtiojärjestys, muut maat (328)
alternative label: Päätökset, valtiojärjestys, muut maat (328)
broader: URN:NBN:fi:au:hklj:320
in scheme: URN:NBN:fi:au:hklj:
notation: 328
related: Valtiofilosofia. Valtiomuodot
related: Sisäpolitiikka. Puolueet
related: URN:NBN:fi:au:hklj:326.2
related: Suomen valtiojärjestelmä
related: Suomen valtiopäiväasiakirjat
related: URN:NBN:fi:au:hklj:328.09
related: URN:NBN:fi:au:hklj:332.1
related: Muiden maiden lait
related: URN:NBN:fi:au:hklj:340
related: Muiden maiden kunnallis-, läänin- ja valtionhallinto
related: URN:NBN:fi:au:hklj:930
related: SAKSAN HISTORIA
related: BRITTEIN SAARTEN HISTORIA
related: RANSKAN HISTORIA
related: URN:NBN:fi:au:hklj:970
related: MUIDEN MAANOSIEN HISTORIA
related: Suomi
scope note: Muiden maiden hallitusmuodot, valtiomuodot ja valtiosäännöt Muiden maiden kansanedustuslaitokset. Valtiopäivät. Parlamentit Muiden maiden hallitukset, monarkiat ja presidentti-instituutiot Muiden maiden vaalijärjestelmät, vaalitavat ja äänioikeus Muiden maiden valtiolliset vaalit. Parlamenttivaalit. Presidentinvaalit
scope note: Andra länders regeringsformer, statsformer och författningar Andra länders folkrepresentation. Riksdagar. Parlament Regeringar, monarkier och presidentämbeten i andra länder Valsystem, valsätt och rösträtt i andra länder Statliga val i andra länder. Parlamentsval. Presidentval @sv

Siviili- ja kauppaoikeus. Sopimusoikeus
type: Class
type: Concept
subclass of: URN:NBN:fi:au:hklj:330
alternative label: Aliurakointi, sopimusoikeus (333)
alternative label: Digitaalinen allekirjoitus (333)
alternative label: Direktiivit, erikoisalojen direktiivit (332 ... 334 +)
alternative label: Edustussopimukset (333)
alternative label: Elektroniset sopimukset (333)
alternative label: Esisopimukset, sopimusoikeus (333)
alternative label: Esteettömyys, siviilioikeus (333 +)
alternative label: Esteettömyystodistukset, siviilioikeus (333 +)
alternative label: Hoitovirheet, potilasvahinkolainsäädäntö (333)
alternative label: Hyvitys (333)
alternative label: Kansainvälinen yksityisoikeus, Euroopan unioni (333 +)
alternative label: Kohtuullistaminen, siviilioikeus (333 +)
alternative label: Kommentaarit, lakien kommentaarit (332 ... 338)
alternative label: Korvaukset, vahingonkorvaus (333)
alternative label: Korvausvastuu, vahingonkorvaus (333)
alternative label: Lakien yhdenmukaistaminen, yksittäiset lait (332 ... 334 +)
alternative label: Lakikirjat, EU-lait, erikoisalat (332 ... 334 +)
alternative label: Lakikirjat, Suomen lait, erikoisalat (332 ... 334 +)
alternative label: Lakikokoelmat, EU-lait, erikoisalat (332 ... 334 +)
alternative label: Lakikokoelmat, Suomen lait, erikoisalat (332 ... 334 +)
alternative label: Liikesalaisuus (333)
alternative label: Lisenssit, sopimusoikeus (333 +)
alternative label: Luottamuksensuoja, yksityisoikeus (333 +)
alternative label: Lääkintäoikeus, potilasvahingot (333)
alternative label: Lääkintävirheet, potilasvahinkolainsäädäntö (333)
alternative label: Määräaika, sopimusoikeus (333)
alternative label: Määräykset, asetukset, eri alojen (332 ... 334 +)
alternative label: Määräykset, direktiivit, eri alojen (332 ... 334 +)
alternative label: Noudattaminen, sopimukset, sopimusoikeus (333)
alternative label: Potilaan asema, potilasvahinkolainsäädäntö (333)
alternative label: Potilasvahingot, lainsäädäntö (333)
alternative label: Rakennussopimukset (333)
alternative label: Sanktiot, sopimusoikeus (333 +)
alternative label: Sitoumukset, sopimusoikeus (333)
alternative label: Siviilioikeus (333 +)
alternative label: Sivu-urakointi, sopimusoikeus (333)
alternative label: Sopimuksellisuus, sopimusoikeus (333)
alternative label: Sopimukset, sopimusoikeus (333)
alternative label: Sopimusmallit, sopimusoikeus (333)
alternative label: Sopimusoikeus (333)
alternative label: Sopimusrikkomukset, sopimusoikeus (333)
alternative label: Sopimussakko, sopimusoikeus (333)
alternative label: Sähköinen allekirjoitus (333)
alternative label: Sähköiset sopimukset (333)
alternative label: Taannehtivuus, erikoisalojen lait (332 ... 334 +)
alternative label: Tiedonantovelvollisuus, siviilioikeus (333 +)
alternative label: Tiedonsaantioikeus, siviilioikeus (333 +)
alternative label: Toimeksianto, sopimusoikeus (333)
alternative label: Urakat, sopimusoikeus (333)
alternative label: Urakkasopimukset, sopimisoikeus (333)
alternative label: Urakointi, sopimusoikeus (333)
alternative label: Vaaranvastuu, vahingonkorvausoikeus (333)
alternative label: Vahingonkorvaus (333)
alternative label: Vahingonkorvausvastuu (333)
alternative label: Vahingot, vahingonkorvaus (333)
alternative label: Vajaavaltaiset, lainsäädäntö (332 ... 334 +)
alternative label: Vakiosopimukset (333)
alternative label: Valtakirjat, valtuutus (333 +)
alternative label: Valtuutus (333 +)
broader: URN:NBN:fi:au:hklj:330
in scheme: URN:NBN:fi:au:hklj:
narrower: Esine- ja velvoiteoikeus. Immateriaalioikeudet. Huoneen- ja maanvuokralainsäädäntö
narrower: Perhe- ja holhousoikeus
narrower: Perintö- ja testamenttioikeus
narrower: Kauppaoikeus. Yhtiölainsäädäntö. Pankki- ja vakuutuslainsäädäntö
notation: 333
related: URN:NBN:fi:au:hklj:326.2
related: Asemakaava- ja rakentamislainsäädäntö
related: Työoikeus
related: Kansainvälinen oikeus
related: Suomen ja Euroopan Unionin laki- ja asetuskokoelmat
related: Muiden maiden lait
related: URN:NBN:fi:au:hklj:660
related: Talonrakennus
related: LIIKETALOUS. KAUPPA. MARKKINOINTI. LIIKENNEOPETUS
scope note: Tässä ja alaluokissa Suomen ja Euroopan Unionin siviili- ja kauppa- sekä sopimusoikeus Siviili-, yksityis- ja sopimusoikeuden yleisteokset Teokset, jotka koskevat sekä siviili- että kauppaoikeutta Rakennus- ja urakkasopimuksia koskeva lainsäädäntö. Edustussopimukset. Vakiosopimukset. Vahingonkorvausoikeus. Potilasvahinkolainsäädäntö
scope note: Hit och till underklasserna Finlands och Europeiska unionens civil- och handelsrätt samt avtalsrätt Allmänna verk som rör civil-, privat- och avtalsrätt Verk som rör både civilrätt och handelsrätt Lagstiftning om byggnads- och entreprenadavtal. Representationsavtal. Standardkontrakt. Skadeståndsrätt. Patientskadelagstiftning @sv

Työn sosiologia
type: Class
type: Concept
subclass of: Organisaatioiden ja laitosten sosiologia
alternative label: Alaiset, työn sosiologia (353.1)
alternative label: Alaistaidot, työyhteisöt (353.1)
alternative label: Ammatillinen sijoittuminen, sosiologia (353.1)
alternative label: Ammatillinen tausta, työn sosiologia (353.1)
alternative label: Ammatillistuminen (353.1)
alternative label: Ammatillisuus (353.1)
alternative label: Ammatinkuva (353.1)
alternative label: Ammatit, ammattien sosiologia (353.1)
alternative label: Ammattiasema, sosiologia (353.1)
alternative label: Ammattikulttuuri (353.1)
alternative label: Ammattikuva (353.1)
alternative label: Ammattiperinne, työn sosiologia (353.1)
alternative label: Ammattisalaisuus (353.1)
alternative label: Ammattitausta, työn sosiologia (353.1)
alternative label: Ammattiura, työn sosiologia (353.1)
alternative label: Ansiotyö, työn sosiologia (353.1)
alternative label: Arki, työn sosiologia (353.1)
alternative label: Arkielämä, työn sosiologia (353.1)
alternative label: Arvostus, työn sosiologia (353.1)
alternative label: Asiantuntijuus, työn sosiologia (353.1)
alternative label: Epätyypillinen työ, työn sosiologia (353.1)
alternative label: Erikoistuminen, työn sosiologia (353.1)
alternative label: Etätyö, työn sosiologia (353.1)
alternative label: Freelance-työntekijät, työn sosiologia (353.1)
alternative label: Hajautettu työ, työn sosiologia (353.1)
alternative label: Henkinen työ, työn sosiologia (353.1)
alternative label: Ikääntyvät työntekijät, työn sosiologia (353.1)
alternative label: Itsensä johtaminen, työn sosiologia (353.1)
alternative label: Itsenäinen työskentely, työn sosiologia (353.1)
alternative label: Itseohjautuvuus, työn sosiologia (353.1)
alternative label: Joustotyö, työn sosiologia (353.1)
alternative label: Kunnioittaminen, työn sosiologia (353.1)
alternative label: Kunnioitus, työn sosiologia (353.1)
alternative label: Kyvykkyys, työn sosiologia (353.1)
alternative label: Luovat menetelmät, työyhteisöt, sosiologia (353.1)
alternative label: Lähityö, työn sosiologia (353.1)
alternative label: Moniammatillisuus, työn sosiologia (353.1)
alternative label: Monitoimisuus, työn sosiologia (353.1)
alternative label: Palkkatyö, työn sosiologia (353.1)
alternative label: Palveluammatit, työn sosiologia (353.1)
alternative label: Professionalismi (353.1)
alternative label: Professiot, ammattien sosiologia (353.1)
alternative label: Ruumiillinen työ, työn sosiologia (353.1)
alternative label: Ryhmätyö, työn sosiologia (353.1)
alternative label: Sitoutuminen, työn sosiologia (353.1)
alternative label: Sivutyö, työn sosiologia (353.1)
alternative label: Suojatyö, työn sosiologia (353.1)
alternative label: Suorituskyky, työn sosiologia (353.1)
alternative label: Suoriutuminen, työn sosiologia (353.1)
alternative label: Talkoot, työn sosiologia (353.1)
alternative label: Tehdastyö , työn sosiologia (353.1)
alternative label: Tekniset toimihenkilöt, työn sosiologia (353.1)
alternative label: Teletyö, työn sosiologia (353.1)
alternative label: Teollisuussosiologia (353.1)
alternative label: Teollisuustyö, työn sosiologia (353.1)
broader: Organisaatioiden ja laitosten sosiologia
in scheme: URN:NBN:fi:au:hklj:
notation: 353.1
related: Sosiaalipsykologia. Kulttuuripsykologia
related: Ihmissuhteiden psykologia
related: Sovellettu psykologia
related: Työoikeus
related: URN:NBN:fi:au:hklj:340
related: Pääoma. Työ. Luonnonvarat
related: Työ sosiaalipoliittisena kysymyksenä
related: Työolot
related: Työsuojelu
related: Työllisyys. Työttömyys. Työvoimapalvelu
related: Työväenliike
related: Työmarkkinajärjestöt
related: URN:NBN:fi:au:hklj:618.85
related: Liiketalouden hallinto ja organisaatio
related: Johtamisen tekniikka ja menetelmät
related: Työntutkimukset. Työanalyysi
related: Henkilöstöpolitiikka
scope note: Työn ja ammattien sosiologia yleensä Erikoisalojen sosiologiset kysymykset alan mukaisessa luokassa
scope note: Arbets- och yrkessociologi i allmänhet Sociologiska frågor som rör specialområden klassificeras enligt område @sv

Maailmankauppa. Kansainväliset talousjärjestöt
type: Class
type: Concept
subclass of: Kansainväliset taloudelliset suhteet. Maailmantalous
alternative label: Bilateraalinen kauppa (367.2)
alternative label: CMEA (367.2)
alternative label: COMECON (367.2)
alternative label: Clearing, maailmankauppa (367.2)
alternative label: EEC (367.2)
alternative label: EES (367.2)
alternative label: EFTA (367.2)
alternative label: ETA (367.2)
alternative label: ETA, historia (367.2)
alternative label: Esteet, kaupan esteet (367.2)
alternative label: Euroopan talousalue (367.2)
alternative label: Euroopan yhteisö, talousliittona (367.2)
alternative label: Euroopan yhteisöt, talousliittona (367.2)
alternative label: G7-maat, maailmankauppa (367.2)
alternative label: GATT (367.2)
alternative label: Integraatio, taloudellinen integraatio (367.2)
alternative label: Johtavat teollisuusmaat, maailmankauppa (367.2)
alternative label: Jäsenvaltiot, kansainväliset talousjärjestöt (367.2)
alternative label: Kahdenkeskinen kauppa (367.2)
alternative label: Kansainvälinen järjestelmä, kansainvälinen kauppa (367.2)
alternative label: Kansainvälinen kauppa (367.2)
alternative label: Kansainväliset järjestöt, talousjärjestöt (367.2)
alternative label: Kansainväliset markkinat (367.2)
alternative label: Kansainväliset sopimukset, kauppasopimukset (367.2)
alternative label: Kansainväliset talousjärjestöt (367.2)
alternative label: Kaupalliset edustustot, ulkomaankauppa, muut (367.2)
alternative label: Kaupalliset sihteerit, ulkomaankauppa, muut (367.2)
alternative label: Kaupalliset suhteet (367.2)
alternative label: Kaupalliset suhteet, muut maat (367.2)
alternative label: Kaupan esteet (367.2)
alternative label: Kaupankäynti, maailmankauppa (367.2)
alternative label: Kaupankäynti, ulkomaankauppa, maat (367.2)
alternative label: Kauppa, maailmankauppa (367.2)
alternative label: Kauppa, ulkomaankauppa, maat (367.2)
alternative label: Kauppapolitiikka, muut maat (367.2)
alternative label: Kauppasopimukset (367.2)
alternative label: Kauppasopimukset, muut maat (367.2)
alternative label: Kauppasuhteet (367.2)
alternative label: Kauppasuhteet, muut maat (367.2)
alternative label: Kauppatase, muut maat (367.2)
alternative label: Kilpailuhallinto, maailmankauppa (367.2)
alternative label: Kilpailukyky, muiden maiden (367.2)
alternative label: Kilpailunrajoitukset, maailmankauppa (367.2)
alternative label: Kilpailurajoitukset, maailmankauppa (367.2)
alternative label: Komekon (367.2)
alternative label: Komissio, maailmankauppa (367.2)
alternative label: Komissio, ulkomaankauppa, muut maat (367.2)
alternative label: Komissiokauppa, maailmankauppa (367.2)
alternative label: Komissiokauppa, ulkomaankauppa, muut maat (367.2)
alternative label: Laajeneminen, kansainväliset talousjärjestöt (367.2)
alternative label: Laajentuminen, kansainväliset talousjärjestöt (367.2)
alternative label: Liittoumat, kansainväliset talousjärjestöt (367.2)
alternative label: Liittoutumat, kansainväliset talousjärjestöt (367.2)
alternative label: Maahantuojat, kansainvälinen kauppa (367.2)
alternative label: Maahantuonti, kansainvälinen kauppa (367.2)
alternative label: Maailmankauppa (367.2)
broader: Kansainväliset taloudelliset suhteet. Maailmantalous
in scheme: URN:NBN:fi:au:hklj:
notation: 367.2
related: URN:NBN:fi:au:hklj:325
related: Suomen ulkopolitiikka
related: Kansainvälinen yhteistyö
related: URN:NBN:fi:au:hklj:326.2
related: Muiden maanosien valtioiden keskinäinen yhteistyö
related: Yhdistyneet Kansakunnat
related: Rauhankysymys. Rauhantutkimus
related: Vero-oikeus
related: Pääoma. Työ. Luonnonvarat
related: Tullilaitos
related: Talousjärjestelmät
related: Suomen ulkomaankauppa
related: Kehitysmaiden taloudelliset olot
related: URN:NBN:fi:au:hklj:368
related: Maatalouspolitiikka
related: URN:NBN:fi:au:hklj:675
scope note: Maailmankauppaa ja kansainvälisiä talousjärjestöjä ja niiden talous- ja kauppapolitiikkaa koskevat yleisteokset EFTA, ETA, GATT, NAFTA, WTO jne. EU taloudellisena yhteenliittymänä. EU:n talous yleensä Kauppasopimukset. Vapaakauppa. Taloudellinen yhdentyminen Suosituimmuusasema. Kauppasodat. Tullipolitiikka. Suojelutullit Eri maiden, paitsi Suomen, ulkomaankauppaa koskevat teokset Tiettyä tuotetta koskeva kauppa ko. tuotteen mukaisessa luokassa
scope note: Allmänna verk som rör världshandeln och internationella ekonomiska organisationer och deras ekonomiska politik och handelspolitik EFTA, EES, GATT, NAFTA, WTO osv. EU som ekonomisk sammanslutning, EG. EU:s ekonomi i allmänhet Handelsavtal. Frihandel. Ekonomisk integration Mestgynnadnationsklausul. Handelskrig. Tullpolitik. Skyddstullar Verk som rör olika länders utrikeshandelspolitik, förutom Finlands Handel som rör enskilda produkter klassificeras enligt produkt @sv

Tuotanto. Tuottavuus
type: Class
type: Concept
subclass of: URN:NBN:fi:au:hklj:368
alternative label: Alkutuotanto (368.1)
alternative label: Alkutuotanto, taloustiede (368.1)
alternative label: Elinkeinohallinto, elinkeinorakenne (368.1)
alternative label: Elinkeinonharjoittajat, elinkeinorakenne (368.1)
alternative label: Elinkeinopolitiikka (368.1)
alternative label: Elinkeinorakenne (368.1)
alternative label: Elinkeinot, elinkeinorakenne (368.1)
alternative label: Epävirallinen talous (368.1 +)
alternative label: Kiintiöt, tuotantonormit (368.1)
alternative label: Kolmas sektori, elinkeinorakenne (368.1)
alternative label: Kotimaiset tuotteet, tuotanto (368.1)
alternative label: Liitännäiselinkeinot, elinkeinorakenne (368.1)
alternative label: Luova talous , kansantalous (368.1)
alternative label: Maatalouden liitännäiselinkeinot, elinkeinorakenne (368.1)
alternative label: Palveluala, palvelusektori (368.1)
alternative label: Palveluammatit, palvelusektori (368.1)
alternative label: Palveluelinkeinot, taloustiede (368.1)
alternative label: Palveluntuotanto, palvelusektori, taloustiede (368.1)
alternative label: Palvelusektori, taloustiede (368.1)
alternative label: Palvelutuotanto, palvelusektori, taloustiede (368.1)
alternative label: Perustuotantosektori, taloustiede (368.1)
alternative label: Rakennemuutos, elinkeinorakenne (368.1)
alternative label: Rakennesopeutusohjelmat (368.1)
alternative label: Rojaltit, taloustiede (368.1)
alternative label: Saatavuus, tuotantorakenne (368.1)
alternative label: Sivuelinkeinot, elinkeinorakenne (368.1)
alternative label: Sivutoimet, elinkeinorakenne (368.1)
alternative label: Sosiaalinen muutos, taloudellinen rakennemuutos (368.1)
alternative label: Supistaminen, tuotanto (368.1)
alternative label: Taloudellinen rakenne, tuotantorakenne (368.1)
alternative label: Talous, tuotantorakenne (368.1)
alternative label: Tekijänoikeuspalkkiot, taloustiede (368.1)
alternative label: Tekijänpalkkiot, taloustiede (368.1)
alternative label: Teollisuussektori, talouspolitiikka (368.1)
alternative label: Toimialat, elinkeinorakenne (368.1)
alternative label: Tukielinkeinot, elinkeinorakenne (368.1)
alternative label: Tuotannonmenetykset, kansantalous (368.1)
alternative label: Tuotannonohjaus, kansantalous (368.1)
alternative label: Tuotannonsuunnittelu, kansantalous (368.1)
alternative label: Tuotannontekijät, tuotantorakenne (368.1)
alternative label: Tuotanto, kansantalous (368.1)
alternative label: Tuotantojärjestelmät, kansantalous (368.1)
alternative label: Tuotantokustannukset, kansantalous (368.1)
alternative label: Tuotantokyky, kansantalous (368.1)
alternative label: Tuotantorakenne (368.1)
alternative label: Tuotantotapa, elinkeinorakenne (368.1)
alternative label: Tuottajat, elinkeinorakenne (368.1)
alternative label: Tuottaminen, tuotanto, talouspolitiikka (368.1)
alternative label: Tuottavuus, kansantalous (368.1)
alternative label: Vähentäminen, tuotanto (368.1)
alternative label: Yhteiskunnallinen muutos, tuotantorakenteen muutos (368.1)
alternative label: Yksityinen sektori, kansantalous (368.1)
alternative label: Yksityiset palvelut, elinkeinorakenne (368.1)
alternative label: Ylituotanto, tuotantorakenne (368.1)
alternative label: Binäringar, näringsstruktur (368.1) @sv
broader: URN:NBN:fi:au:hklj:368
in scheme: URN:NBN:fi:au:hklj:
notation: 368.1
related: Yhteiskunnan rakenne
related: Alueellinen sosiologia. Maassamuutto
related: Pääoma. Työ. Luonnonvarat
related: URN:NBN:fi:au:hklj:363
related: Talousjärjestelmät
related: Talousmaantiede. Taloushistoria
related: URN:NBN:fi:au:hklj:370
related: Aluepolitiikka. Ympäristöpolitiikka
related: URN:NBN:fi:au:hklj:620
related: URN:NBN:fi:au:hklj:650
related: Maatalouspolitiikka
related: Liiketalouden hallinto ja organisaatio
related: Johtamisen tekniikka ja menetelmät
related: Laskentatoimi. Rahoitus. Talousarviot
related: Työntutkimukset. Työanalyysi
related: Toimistotyö
related: Henkilöstöpolitiikka
scope note: Perustuotanto-, teollisuus- ja palvelusektori sekä niiden tuotannon ja tuottavuuden kehitys ja suunnittelu taloudellisena ja talouspoliittisena kysymyksenä Elinkeinorakenne ja sen muutos talouspolitiikan kannalta Tiettyä tuotannon tai elinkeinoelämän alaa koskevat teokset alan mukaisessa luokassa
scope note: Primärproduktionssektorn, industrisektorn och servicesektorn samt utvecklingen och planeringen av deras produktion och produktivitet som ekonomisk och ekonomisk-politisk fråga Näringsstrukturen och dess förändring ur den ekonomiska politikens synvinkel Verk som rör enskilda områden inom produktion eller näringsliv klassificeras enligt område @sv

Naisen ja miehen asema yhteiskunnassa
type: Class
type: Concept
subclass of: URN:NBN:fi:au:hklj:370
alternative label: Au-äidit, naisen asema yhteiskunnassa (375)
alternative label: Aviottomat äidit, naisen asema yhteiskunnassa (375)
alternative label: Diskriminointi, sukupuolinen syrjintä (375)
alternative label: Ekofeminismi (375)
alternative label: Emansipaatio (375)
alternative label: Eriarvoisuus, naisen ja miehen asema (375)
alternative label: Feminismi (375)
alternative label: Feministinen tutkimus (375)
alternative label: Gender-tutkimus (375)
alternative label: Gender-tutkimus, naisen ja miehen asema (375)
alternative label: Haaremit, naisen asema (375)
alternative label: Isyys, miehen asema yhteiskunnassa (375)
alternative label: Isät, miehen asema yhteiskunnassa (375)
alternative label: Kaltoinkohtelu, sukupuolten asema (375)
alternative label: Kansalaisen asema, sukupuolten tasa-arvo (375)
alternative label: Kansalaisliikkeet, feminismi (375)
alternative label: Kansalaisoikeudet, sukupuolten tasa-arvo (375)
alternative label: Kansalaisosallistuminen, feminismi (375)
alternative label: Kansalaisosallistuminen, sukupuolten tasa-arvo (375)
alternative label: Kansalaisten osallistuminen, feminismi (375)
alternative label: Kansalaisten osallistuminen, sukupuolten tasa-arvo (375)
alternative label: Kansalaistoiminta, feminismi (375)
alternative label: Kansalaistoiminta, sukupuolten tasa-arvo (375)
alternative label: Keski-ikä, naisen ja miehen asema (375)
alternative label: Kiintiöt, sukupuolten tasa-arvo (375)
alternative label: Läpäisyperiaate, tasa-arvo (375)
alternative label: Mainstreaming, tasa-arvo (375)
alternative label: Maskuliinisuus, miehen asema (375)
alternative label: Matriarkaalisuus (375)
alternative label: Matriarkaalisuus, naisen asema (375)
alternative label: Matriarkaatti (375)
alternative label: Matriarkaatti, naisen asema (375)
alternative label: Miehen asema (375)
alternative label: Miehet, asema yhteiskunnassa (375)
alternative label: Mieskulttuuri (375)
alternative label: Mieskuva (375)
alternative label: Miesliikkeet (375)
alternative label: Miestutkimus (375)
alternative label: Miestutkimus, miehen asema (375)
alternative label: Miesvaltaisuus, miehen asema (375)
alternative label: Miesviha, feminismi (375)
alternative label: Miesviha, naisen ja miehen asema (375)
alternative label: Misandria, feminismi (375)
alternative label: Misandria, naisen ja miehen asema (375)
alternative label: Misogynia, naisen ja miehen asema (375)
alternative label: Moniavioisuus, naisen asema (375)
alternative label: Naimattomuus, naisen asema (375)
alternative label: Naisasiajärjestöt (375)
alternative label: Naisasialiikkeet (375)
alternative label: Naisen asema (375)
alternative label: Naiset, asema yhteiskunnassa (375)
alternative label: Naiseus, naisen asema (375)
alternative label: Naisjärjestöt, naisasiajärjestöt (375)
alternative label: Naiskauppa, naisen asema (375)
alternative label: Naiskulttuuri (375)
broader: URN:NBN:fi:au:hklj:370
in scheme: URN:NBN:fi:au:hklj:
notation: 375
related: Naisen ja miehen psykologia
related: Tiedepolitiikka. Tieteen sosiologia
related: URN:NBN:fi:au:hklj:323
related: Julkisoikeus
related: Elämäntapojen sosiologia. Kulttuurisosiologia
related: URN:NBN:fi:au:hklj:357.1
related: Perhesosiologia
related: URN:NBN:fi:au:hklj:371
related: Työ sosiaalipoliittisena kysymyksenä
related: Työolot
related: Työsuojelu
related: Työllisyys. Työttömyys. Työvoimapalvelu
related: Perhepolitiikka. Lapsipolitiikka. Nuorisopolitiikka
related: Lastenneuvolat. Äitiysneuvolat
related: Päivähoito
related: URN:NBN:fi:au:hklj:375.09
related: Seksologia
scope note: Naisen ja miehen asemaa, sukupuolten tasa-arvoa tai eriarvoisuutta koskevat yleisteokset Nais- ja miesasialiikkeet. Feminismi. Emansipaatio Naisen ja miehen sosiaaliset roolit. Nais- ja mieskulttuuri yleensä Ihmisoikeudet ja kansalaisen asema sukupuolten tasa-arvon kannalta Naisen tai miehen asemaa tietyllä elämänalueella koskevat teokset alan mukaisessa luokassa
scope note: Allmänna verk som rör kvinnans och mannens ställning, jämställdheten mellan könen eller könsdiskriminering i olika länder Kvinno- och mansrörelser. Feminism. Emancipation Kvinnans och mannens sociala roller. Kvinno- och manskultur i allmänhet Mänskliga rättigheter och medborgarens roll med hänsyn till jämställdheten mellan könen Verk som rör kvinnans eller mannens ställning på bestämda levnadsområden klassificeras enligt område @sv

Lehdistöoppi
type: Class
type: Concept
subclass of: URN:NBN:fi:au:hklj:384
alternative label: Advertoriaalit, journalismi (384.7)
alternative label: Elektroniset lehdet, lehdistöoppi (384.7)
alternative label: Ennakkosensuuri, lehdistö (384.7)
alternative label: Haastattelijat, journalismi (384.7)
alternative label: Haastattelumenetelmät , lehdistöoppi, journalismi (384.7)
alternative label: Haastattelut, lehdistöoppi, journalismi (384.7)
alternative label: Hyvä lehtimiestapa, lehdistö (384.7)
alternative label: Iltapäivälehdet, journalismi (384.7)
alternative label: Joukkotiedotusvälineet, lehdistöoppi, journalismi (384.7)
alternative label: Joukkoviestimet, lehdistöoppi, journalismi (384.7)
alternative label: Journalismi, lehdistö (384.7)
alternative label: Journalismikritiikki, lehdistö (384.7)
alternative label: Journalistit, journalistin työ (384.7)
alternative label: Kansalaisjournalismi (384.7)
alternative label: Kaupallinen joukkoviestintä, journalismi, lehdistöoppi (384.7)
alternative label: Keltainen lehdistö, journalismi (384.7)
alternative label: Kirjallinen ilmaisu, lehtimiehen työ (384.7)
alternative label: Kirjallinen viestintä, lehtimiehen työ (384.7)
alternative label: Kirjoitettu sana, lehdistöoppi (384.7)
alternative label: Kirjoittaminen, journalismi (384.7)
alternative label: Kolumnistit, journalismi (384.7)
alternative label: Kolumnit, journalismi (384.7)
alternative label: Kulttuurijournalismi, lehdistö (384.7)
alternative label: Kulttuuriosastot, lehdistöoppi, journalismi (384.7)
alternative label: Lehden osastot, journalismi (384.7)
alternative label: Lehdet, journalismi (384.7)
alternative label: Lehdistö, journalismi (384.7)
alternative label: Lehdistöoppi (384.7)
alternative label: Lehdistösensuuri (384.7)
alternative label: Lehdistötuki (384.7)
alternative label: Lehti-ilmoitukset, journalismi (384.7)
alternative label: Lehtikirjoittelu, journalismi, lehdistöoppi (384.7)
alternative label: Lehtikuolemat (384.7)
alternative label: Lehtimiehet, lehtimiehen työ (384.7)
alternative label: Lehtiournalismi (384.7)
alternative label: Levikki, lehdet (384.7)
alternative label: Lukemistutkimus, lehdistötutkimus (384.7)
alternative label: Lukijat, lehdistötutkimus (384.7)
alternative label: Lukijatutkimus, lehdistötutkimus (384.7)
alternative label: Lukukokemukset, lehdistötutkimus (384.7)
alternative label: Lukutottumukset, lukemistutkimus, lehdet (384.7)
alternative label: Massamedia, lehdistöoppi, journalismi (384.7)
alternative label: Nuortenosastot, lehdet, journalismi (384.7)
alternative label: Otsikot, journalismi (384.7)
alternative label: Paikallislehdet, journalismi (384.7)
alternative label: Pakinat, journalismi (384.7)
alternative label: Pakinoitsijat, journalismi (384.7)
alternative label: Polemiikki, journalismi (384.7)
alternative label: Poliittinen journalismi, lehdistö (384.7)
alternative label: Puoluelehdet, journalismi (384.7)
alternative label: Pääkirjoitukset, journalismi (384.7)
alternative label: Reportaasit, lehdistö (384.7)
alternative label: Sanomalehdet, toimittaminen (384.7)
alternative label: Sensaatiolehdet, journalismi (384.7)
alternative label: Sensuuri, lehdistö (384.7)
broader: URN:NBN:fi:au:hklj:384
in scheme: URN:NBN:fi:au:hklj:
notation: 384.7
related: YLEISET KAUSIJULKAISUT
related: SANOMALEHDET
related: Kasvatusfilosofia. Kasvatustavoitteet
related: URN:NBN:fi:au:hklj:320
related: URN:NBN:fi:au:hklj:332.1
related: Elämäntapojen sosiologia. Kulttuurisosiologia
related: URN:NBN:fi:au:hklj:627.7
related: Tietoliikenne. Viestintätekniikka. Multimedia
related: Öljy. Maakaasu
related: Materiaalitoiminnot. Logistiikka
related: Mainonta
related: URN:NBN:fi:au:hklj:721
related: Kaupunkisuunnittelu. Kaupunkiarkkitehtuuri
related: URN:NBN:fi:au:hklj:756
related: Valokuvataide
related: Valokuvauksen materiaalit ja tekniikka. Valokuvausoppaat
related: Ilmaisutaito. Puhetaito. Lausuntataide
scope note: Sanoma- ja aikakauslehdistöä joukkotiedotuksen kannalta koskevat teokset Paikallis- ja puoluelehdistöä koskevat teokset Lehdistön uutistoiminta Sanoma- ja aikakauslehtien toimitukset ja toimittaminen Sanoma- ja aikakauslehden toimittajan työ Journalismi. Kuvajournalismi. Hyvä lehtimiestapa Lukijatutkimukset. Levikkitutkimukset
scope note: Verk som handlar om tidningar och tidskrifter ur masskommunikationens synvinkel Allmänna verk som rör lokal- och partitidningar Pressens nyhetsförmedling Redigering av tidningar och tidskrifter och deras redaktioner Tidnings- och tidskriftsredaktörens arbete Journalism. Bildjournalism.God journalistisk sed Läsarundersökningar. Upplageundersökningar @sv

Helsinki. Pääkaupunkiseutu
type: Class
type: Concept
subclass of: Paikallisliikenne
alternative label: Helsinki, ympäristöineen, paikallisliikenne (387.11)
alternative label: Pääkaupunkiseutu, paikallisliikenne (387.11)
alternative label: Helsingfors, med omnejd, lokaltrafiken (387.11) @sv
alternative label: Huvudstadsregion, lokaltrafiken (387.11) @sv
broader: Paikallisliikenne
in scheme: URN:NBN:fi:au:hklj:
notation: 387.11
preferred label: Helsinki. Metropolitan area @en
preferred label: Helsingfors. Huvudstadregionen @sv
related: URN:NBN:fi:au:hklj:320
related: URN:NBN:fi:au:hklj:332.2
related: URN:NBN:fi:au:hklj:342
related: Maaliikenne
related: Vesiliikenne
related: URN:NBN:fi:au:hklj:387.1103
related: URN:NBN:fi:au:hklj:387.1105
related: URN:NBN:fi:au:hklj:387.1109
related: Kemian teollisuus
related: Öljy. Maakaasu
related: Materiaalitoiminnot. Logistiikka
related: URN:NBN:fi:au:hklj:721
related: Kaupunkisuunnittelu. Kaupunkiarkkitehtuuri
related: Pyöräily
scope note: Helsinkiä ja pääkaupunkiseutua koskeva liikennepolitiikka ja liikennesuunnittelu Helsingin ja pääkaupunkiseudun liikenne
scope note: Trafikpolitik och trafikplanering i Helsingfors och huvudstadsregionen Trafiken i Helsingfors och huvudstadsregionen @sv

Entisen Jugoslavian alue
type: Class
type: Concept
subclass of: Balkanin niemimaa
alternative label: Jugoslavian alue (419.32 +)
alternative label: Jugoslavian alue, maantiede, matkat (419.32 +)
alternative label: Jugoslaviens område (419.32 +) @sv
alternative label: Jugoslaviens område, geografi, resor (419.32 +) @sv
broader: Balkanin niemimaa
in scheme: URN:NBN:fi:au:hklj:
narrower: Slovenia
narrower: Kroatia
narrower: Bosnia ja Hertsegovina
narrower: Serbia
narrower: Makedonia, EJTM
narrower: Montenegro
narrower: Kosovo
notation: 419.32
preferred label: The former Yugoslavia @en
preferred label: Före detta Jugoslavien @sv
related: URN:NBN:fi:au:hklj:460
related: URN:NBN:fi:au:hklj:979
related: Entisen Jugoslavian alueen historia

Sillat. Sillanrakennus
type: Class
type: Concept
subclass of: URN:NBN:fi:au:hklj:624
alternative label: Geotekniikka, sillanrakennus (624.3)
alternative label: Jännityslaskelmat, sillanrakennus (624.3)
alternative label: Jäävauriot, sillat (624.3)
alternative label: Kantavuus, sillanrakennus (624.3)
alternative label: Kulkuväylät, sillat, rakentaminen ja ylläpito (624.3)
alternative label: Kuormalaskelmat, sillanrakennus (624.3)
alternative label: Kuormitus, sillanrakennus (624.3)
alternative label: Liittymät, sillanrakennus (624.3)
alternative label: Maanrakennus, sillanrakennus (624.3)
alternative label: Maarakennus, sillanrakennus (624.3)
alternative label: Maatyöt, sillanrakennus (624.3)
alternative label: Metallirakenteet, sillanrakennus (624.3)
alternative label: Paalutus, sillanrakennus (624.3)
alternative label: Palkit, sillanrakennus (624.3)
alternative label: Pengerrykset, sillanrakennus (624.3)
alternative label: Pylväät, sillanrakennus (624.3)
alternative label: Rakennesuunnittelu, sillanrakennus (624.3)
alternative label: Rakennustekniikka, sillanrakennus (624.3)
alternative label: Riippurakenteet, sillanrakennus (624.3)
alternative label: Riippusillat (624.3)
alternative label: Sillanrakennus (624.3)
alternative label: Sillat (624.3)
alternative label: Ukko-Pekan silta (624.3)
alternative label: Ylikulkuväylät, sillanrakennus (624.3)
alternative label: Ympäristörakentaminen, sillanrakennus (624.3)
alternative label: Anslutningar, brobygge (624.3) @sv
alternative label: Balkar, brobygge (624.3) @sv
alternative label: Belastning, brobygge (624.3) @sv
alternative label: Belastningsberäkningar, brobygge (624.3) @sv
alternative label: Broar (624.3) @sv
alternative label: Brobygge (624.3) @sv
alternative label: Byggnadsteknik, brobygge (624.3) @sv
alternative label: Bärförmåga, brobygge (624.3) @sv
alternative label: Geoteknik, brobygge (624.3) @sv
alternative label: Hängbroar (624.3) @sv
alternative label: Hängkonstruktioner, brobygge (624.3) @sv
alternative label: Isskador, broar (624.3) @sv
alternative label: Jordbyggnad, brobygge (624.3) @sv
alternative label: Kolonner, pelare, brobygge (624.3) @sv
alternative label: Konstruktionsprojektering, brobygge (624.3) @sv
alternative label: Markarbeten, brobygge (624.3) @sv
alternative label: Markbyggnad, brobygge (624.3) @sv
alternative label: Metallkonstruktioner, brobygge (624.3) @sv
alternative label: Miljöbyggande, brobygge (624.3) @sv
alternative label: Passager, broar, byggnad och underhåll (624.3) @sv
alternative label: Pålning, brobygge (624.3) @sv
alternative label: Spänningskalkyler, brobygge (624.3) @sv
alternative label: Terrassering, brobygge (624.3) @sv
alternative label: Ukko-Pekkas bro (624.3) @sv
alternative label: Överfarter, brobygge (624.3) @sv
broader: URN:NBN:fi:au:hklj:624
in scheme: URN:NBN:fi:au:hklj:
notation: 624.3
preferred label: Bridges. Bridge building @en
preferred label: Broar. Brobygge @sv
related: URN:NBN:fi:au:hklj:380
related: Maaliikenne
related: URN:NBN:fi:au:hklj:460
related: Yleinen konetekniikka
related: Koneenrakennus. Pneumatiikka. Hydrauliikka
related: Voimakoneet. Moottorit. Nosto- ja kuljetuslaitteet
related: Tiet. Kadut. Tienrakennus. Kadunrakennus
related: Raideliikenneväylät. Junat. Raitiovaunut. Metro
related: Vesirakennus. Vesikulkuneuvot
related: Vesiväylät. Vesien säännöstely
related: Muut vesikulkuneuvot
related: URN:NBN:fi:au:hklj:631
related: URN:NBN:fi:au:hklj:660
related: Rakennusstatiikka. Rakennusaineet
related: Tekninen rakennussuunnittelu
related: Geotekniikka. Maatyöt
related: Moottoriurheilu. Lentourheilu
scope note: Rakennusstatiikka, tekninen rakennussuunnittelu sekä geotekniikka ja maatyöt sillanrakennuksen kannalta Siltoja koskevat lujuuslaskelmat Rautatiesillat, maantiesillat, riippusillat, kevyen liikenteen sillat, ali- ja ylikulkusillat sekä niiden rakentaminen
scope note: Byggnadsstatik, teknisk byggnadsplanering samt geoteknik och anläggningsarbeten ur brobyggnadssynvinkel Hållfasthetsberäkningar som rör broar Järnvägsbroar, landsvägsbroar, hängbroar, broar för gång- och cykeltrafik, viadukter och underfartstunnlar samt byggande av dem @sv

Kivihiili. Turve
type: Class
type: Concept
subclass of: Orgaanisen kemian teollisuus
alternative label: Aapasuot, turpeennosto (649.1)
alternative label: Bioenergia, polttoaineet (649.1)
alternative label: Biohiili, bioenergia, polttoaineet (649.1)
alternative label: Biomassa, polttoainetekniikka (649.1)
alternative label: Biopolttoaineet (649.1)
alternative label: Briketit, polttoaineteollisuus (649.1)
alternative label: Eloperäiset lannoitteet, turpeentuotanto (649.1)
alternative label: Energiakasvit, teknologia (649.1)
alternative label: Energiapuu, teknologia (649.1)
alternative label: Energiateknologia, biomassan teknologia (649.1)
alternative label: Energiateknologia, kivihiilen teknologia (649.1)
alternative label: Energiateknologia, puun teknologia (649.1)
alternative label: Energiateknologia, turpeen teknologia (649.1)
alternative label: Hake, polttoaineet (649.1)
alternative label: Halonhakkaus, polttopuu (649.1)
alternative label: Halonhakkuu, polttopuu (649.1)
alternative label: Harvennuspuu, energiapuu, teknologia (649.1)
alternative label: Hiili, kivihiilen teknologia (649.1)
alternative label: Häkäpöntöt, puukaasu (649.1)
alternative label: Jyrsinturve (649.1)
alternative label: Jätelämpö, jätteenpolton energiatekniikka (649.1)
alternative label: Jätepolttamot, jätteenpolton energiatekniikka (649.1)
alternative label: Jätepolttoaineet, teknologia (649.1)
alternative label: Jätepuu, puu polttoaineena (649.1)
alternative label: Jätteenpoltto, jätteenpolton energiatekniikka (649.1)
alternative label: Jätteenpolttolaitokset, jätteenpolton energiatekniikka (649.1)
alternative label: Kasvuturve, turpeen tuotanto ja kauppa (649.1)
alternative label: Kiinteät polttoaineet, polttoaineteknologia (649.1)
alternative label: Kivihiili, jalostus, tuotanto, kauppa (649.1)
alternative label: Koksaus (649.1)
alternative label: Koksi, teollisuus ja kauppa (649.1)
alternative label: Kotimaiset polttoaineet, polttoaineteknologia (649.1)
alternative label: Kuivatislaus (649.1)
alternative label: Letot, turpeennosto (649.1)
alternative label: Metsäenergia, teknologia (649.1)
alternative label: Miilunpoltto (649.1)
alternative label: Nevat, turpeennosto (649.1)
alternative label: Orgaaniset lannoitteet, turpeentuotanto (649.1)
alternative label: Orgaaniset polttoaineet, biomassa (649.1)
alternative label: Orgaaniset polttoaineet, kivihiili (649.1)
alternative label: Orgaaniset polttoaineet, polttopuu (649.1)
alternative label: Orgaaniset polttoaineet, turve (649.1)
alternative label: Paju, energiantuotanto (649.1)
alternative label: Palaturve (649.1)
alternative label: Pelletit (649.1)
alternative label: Polttoainebriketit (649.1)
alternative label: Polttoaineet, biomassa (649.1)
alternative label: Polttoaineet, kivihiili (649.1)
alternative label: Polttoaineet, puu (649.1)
alternative label: Polttoaineet, turve (649.1)
alternative label: Polttohake (649.1)
alternative label: Polttopuu (649.1)
alternative label: Polttoturve (649.1)
alternative label: Puuenergia, polttoaineet (649.1)
alternative label: Puuhiili (649.1)
broader: Orgaanisen kemian teollisuus
in scheme: URN:NBN:fi:au:hklj:
notation: 649.1
related: Geomorfologia. Geodynamiikka
related: Maaperän, metsien ja soiden suojelu
related: Ilman suojelu
related: Orgaaninen kemia. Muovien kemia
related: Energia
related: Sähköenergian tuottaminen. Voimalatekniikka
related: Kaivos- ja kaivannaisteollisuus
related: Kemian teollisuus
related: Maanviljely
related: Puutarhanhoito. Hyötykasvit. Huone- ja koristekasvit
related: Koristekasvit
related: Hyötykasvit
related: Yrtti- ja maustekasvit
related: Hedelmä-, marja- ja vihanneskasvit
related: Huonekasvit
related: URN:NBN:fi:au:hklj:657
related: URN:NBN:fi:au:hklj:667.71
scope note: Kivihiilen, ruskohiilen ja turpeen teknologia, jalostus, tuotanto ja kauppa Turpeennosto Biomassan energiateknologia. Jätteenpolton energiateknologia Kivihiilen, turpeen ja puun käyttö polttoaineena Koksi. Polttoainebriketit. Puuhiili
scope note: Teknologi, förädling, produktion och handel som rör stenkol, brunkol och torv Torvupptagning Energiteknologi som rör biomassa och avfallsförbränning Användning av stenkol, torv och trä som bränsle Koks. Bränslebriketter. Träkol @sv

Vuohet ja lampaat
type: Class
type: Concept
subclass of: URN:NBN:fi:au:hklj:654
alternative label: Karitsat (654.3)
alternative label: Karitsoiminen, lammas (654.3)
alternative label: Keritseminen (654.3)
alternative label: Kilit, vuohitalous (654.3)
alternative label: Kuttu, kotieläimet (654.3)
alternative label: Lammas, lampaanhoito (654.3)
alternative label: Lammastalous (654.3)
alternative label: Lampaanhoito (654.3)
alternative label: Lampaat, lampaanhoito (654.3)
alternative label: Lampolat, lampaanhoito (654.3)
alternative label: Märehtijät, kotieläimet, lammas, vuohi (654.3)
alternative label: Paimennus, lampaanhoito (654.3)
alternative label: Pässit, kotieläimet (654.3)
alternative label: Uuhet, kotieläimet (654.3)
alternative label: Villa, villatalous (654.3)
alternative label: Villatalous (654.3)
alternative label: Vuohenhoito (654.3)
alternative label: Vuohi, kotieläimet (654.3)
alternative label: Vuohitalous (654.3)
alternative label: Bässar, husdjur (654.3) @sv
alternative label: Får, fårskötsel (654.3) @sv
alternative label: Fårhus, fåruppfödning (654.3) @sv
alternative label: Fårskötsel (654.3) @sv
alternative label: Fåruppfödning (654.3) @sv
alternative label: Get, husdjur (654.3) @sv
alternative label: Getskötsel (654.3) @sv
alternative label: Idisslare, husdjur, får, get (654.3) @sv
alternative label: Killingar, getskötsel (654.3) @sv
alternative label: Klippning, får (654.3) @sv
alternative label: Lamm (654.3) @sv
alternative label: Lamning, får (654.3) @sv
alternative label: Tackor, husdjur (654.3) @sv
alternative label: Ull, ullproduktion (654.3) @sv
alternative label: Ullproduktion (654.3) @sv
alternative label: Vallande, fåruppfödning (654.3) @sv
broader: URN:NBN:fi:au:hklj:654
in scheme: URN:NBN:fi:au:hklj:
notation: 654.3
preferred label: Sheep and goats @en
preferred label: Får och getter @sv
related: URN:NBN:fi:au:hklj:576
related: URN:NBN:fi:au:hklj:590
related: Eläintarhat
related: Eläinsuojelu
related: Systemaattinen eläintiede
related: Nisäkkäät
related: Eläinten vetämät kulkuneuvot
related: Tekstiili- ja vaatetusteollisuus
related: URN:NBN:fi:au:hklj:649.91
related: Maatalouspolitiikka
related: URN:NBN:fi:au:hklj:650.2
related: URN:NBN:fi:au:hklj:651
related: URN:NBN:fi:au:hklj:657
related: Eläinlääketiede
related: Rakennusten erillistilat
related: URN:NBN:fi:au:hklj:691.13
related: Kehrääminen. Karstaus. Värjäys
scope note: Vuohet ja lampaat sekä niiden hoito. Vuohi- ja lammasrodut Vuohi- ja lammastalous. Lampolan hoito Maito-, liha- ja villakarjan hoito ja hoitovälineet Keritseminen Vuohien ja lampaiden sairaudet ja niiden hoito
scope note: Getter och får samt får- och getskötsel. Får- och getraser Får- och getuppfödning. Skötsel av fårhus Uppfödning av mjölkboskap, köttboskap och boskap för ullproduktion samt redskap för skötseln av dem Klippning Fårens och getternas sjukdomar och behandling av dem @sv

Porot
type: Class
type: Concept
subclass of: URN:NBN:fi:au:hklj:654
alternative label: Paliskunnat (654.7)
alternative label: Poro, poronhoito (654.7)
alternative label: Poroerotus, poronhoito (654.7)
alternative label: Poronhoito (654.7)
alternative label: Poronhoito, porotalous (654.7)
alternative label: Poronhoitoalueet (654.7)
alternative label: Porotalous (654.7)
alternative label: Porotalous, poronhoito (654.7)
alternative label: Porotilat (654.7)
alternative label: Porotilat, poronhoito (654.7)
alternative label: Vasat, poronvasat (654.7)
alternative label: Vasominen, poro (654.7)
alternative label: Vasonta, poro (654.7)
alternative label: Hjortdjurskalvning, ren (654.7) @sv
alternative label: Kalvning, hjortdjur, ren (654.7) @sv
alternative label: Ren, renskötsel (654.7) @sv
alternative label: Renbeteslag (654.7) @sv
alternative label: Renhushållning (654.7) @sv
alternative label: Renhushållning, renskötsel (654.7) @sv
alternative label: Renkalvar (654.7) @sv
alternative label: Renskiljning, renskötsel (654.7) @sv
alternative label: Renskötsel (654.7) @sv
alternative label: Renskötsel, hemman (654.7) @sv
alternative label: Renskötsel, hemman, renskötsel (654.7) @sv
alternative label: Renskötsel, renhushållning (654.7) @sv
alternative label: Renskötselområden (654.7) @sv
broader: URN:NBN:fi:au:hklj:654
in scheme: URN:NBN:fi:au:hklj:
notation: 654.7
preferred label: Reindeer @en
preferred label: Renar @sv
related: URN:NBN:fi:au:hklj:476.12
related: URN:NBN:fi:au:hklj:576
related: URN:NBN:fi:au:hklj:590
related: Eläintarhat
related: Eläinsuojelu
related: Systemaattinen eläintiede
related: Nisäkkäät
related: Eläinten vetämät kulkuneuvot
related: Nahka- ja jalkineteollisuus
related: URN:NBN:fi:au:hklj:649.91
related: Maatalouspolitiikka
related: URN:NBN:fi:au:hklj:650.2
related: URN:NBN:fi:au:hklj:651
related: URN:NBN:fi:au:hklj:657
related: Eläinlääketiede
related: Rakennusten erillistilat
related: URN:NBN:fi:au:hklj:691.13
scope note: Porot ja poronhoito. Poroelinkeino. Porotalous Porojen laitumet. Paliskunnat Porojen sairaudet ja niiden hoito
scope note: Renar och renskötsel. Rennäring. Renuppfödning Renarnas beten. Renbeteslag Renarnas sjukdomar och behandling av dem @sv

Hyönteiset
type: Class
type: Concept
subclass of: URN:NBN:fi:au:hklj:654
alternative label: Hunaja, mehiläishoito (654.8)
alternative label: Hunajakasvit, mehiläishoito (654.8)
alternative label: Hyötyhyönteiset, mehiläishoito (654.8)
alternative label: Hyötyhyönteiset, silkkiperhosen toukat (654.8)
alternative label: Luonnonsilkki, silkkiperhosten hoito (654.8)
alternative label: Mehiläiset, mehiläishoito (654.8)
alternative label: Mehiläishoito (654.8)
alternative label: Mehiläiskasvit, mehiläishoito (654.8)
alternative label: Mehiläispesät, mehiläishoito (654.8)
alternative label: Mehiläistalous (654.8)
alternative label: Mehiläisvaha, mehiläishoito (654.8)
alternative label: Mesikasvit, mehiläishoito (654.8)
alternative label: Mesipistiäiset, mehiläishoito (654.8)
alternative label: Silkki, silkintuotanto (654.8)
alternative label: Silkkiperhosen toukat (654.8)
alternative label: Toukat, silkkiperhosen toukat (654.8)
alternative label: Bikupor, biodling (654.8) @sv
alternative label: Bin, biodling (654.8) @sv
alternative label: Biodling (654.8) @sv
alternative label: Biskötsel (654.8) @sv
alternative label: Bivax, biodling (654.8) @sv
alternative label: Biväxter, biodling (654.8) @sv
alternative label: Honung, biodling (654.8) @sv
alternative label: Honungsbin och humlor, biskötsel (654.8) @sv
alternative label: Honungsväxter, biodling (654.8) @sv
alternative label: Larver, silkesfjärilens larver (654.8) @sv
alternative label: Natursilke, silkesfjärilskötsel (654.8) @sv
alternative label: Nektarväxter, biodling (654.8) @sv
alternative label: Nyttoinsekter, biodling (654.8) @sv
alternative label: Nyttoinsekter, silkesfjärilens larver (654.8) @sv
alternative label: Siden, sidenproduktion (654.8) @sv
alternative label: Silkesfjärilens larver (654.8) @sv
broader: URN:NBN:fi:au:hklj:654
in scheme: URN:NBN:fi:au:hklj:
notation: 654.8
preferred label: Insects. Bees @en
preferred label: Insekter @sv
related: URN:NBN:fi:au:hklj:576
related: URN:NBN:fi:au:hklj:590
related: Eläintarhat
related: Eläinsuojelu
related: Systemaattinen eläintiede
related: Hyönteiset
related: Nisäkkäät
related: Eläinten vetämät kulkuneuvot
related: Tekstiili- ja vaatetusteollisuus
related: URN:NBN:fi:au:hklj:649.91
related: Maatalouspolitiikka
related: URN:NBN:fi:au:hklj:650.2
related: URN:NBN:fi:au:hklj:651
related: URN:NBN:fi:au:hklj:657
related: Eläinlääketiede
related: Rakennusten erillistilat
related: URN:NBN:fi:au:hklj:691.13
scope note: Mehiläiset ja niiden hoito. Mehiläistalous. Mehiläistarhat Mehiläispesät ja -yhdyskunnat mehiläistenhoidon kannalta Silkkiperhosen toukat ja niiden hoito
scope note: Bin och biskötsel. Biodling. Biodlingar Bikupor och bisamhällen ur biodlingens synvinkel Silkesfjärilen och odling av dess larver @sv

Koirat
type: Class
type: Concept
subclass of: Lemmikkieläimet
alternative label: Agility (654.91)
alternative label: Avustajakoirat (654.91)
alternative label: Barffaus, koirat (654.91)
alternative label: Diabeteskoirat (654.91)
alternative label: Hemangiosarkooma, eläinlääketiede, koira (654.91)
alternative label: Hokkaidonkoira, (654.91)
alternative label: Homekoirat (654.91)
alternative label: Huumekoirat (654.91)
alternative label: Hypokoirat (654.91)
alternative label: Jäljestys (654.91)
alternative label: Kainkoira (654.91)
alternative label: Kaverikoirat (654.91)
alternative label: Kennelit (654.91)
alternative label: Kesykoira (654.91)
alternative label: Kish, koira (654.91)
alternative label: Koira (654.91)
alternative label: Koiranäyttelyt (654.91)
alternative label: Koirat (654.91)
alternative label: Koiraurheilu, agility (654.91)
alternative label: Koiravaljakot (654.91)
alternative label: Kouluttajat, eläinten koulutus, koiran koulutus (654.91)
alternative label: Koulutus, eläinten koulutus, koiran koulutus (654.91)
alternative label: Kulkukoirat (654.91)
alternative label: Kuulokoirat (654.91)
alternative label: Kuulovammaisten opaskoirat (654.91)
alternative label: Länsisiperianlaika (654.91)
alternative label: Metsästyskoirat (654.91)
alternative label: Miinakoirat (654.91)
alternative label: Naksutinkoulutus, koiran koulutus (654.91)
alternative label: Näkövammaisten opaskoirat (654.91)
alternative label: Opaskoirat (654.91)
alternative label: Paimenkoirat (654.91)
alternative label: Palveluskoirat (654.91)
alternative label: Pelastuskoirat (654.91)
alternative label: Pennut, koiranpennut (654.91)
alternative label: Poliisikoirat (654.91)
alternative label: Raakaruokinta, koirat (654.91)
alternative label: Rajakoirat , koirat (654.91)
alternative label: Rajavalvontakoirat , koirat (654.91)
alternative label: Rally-toko (654.91)
alternative label: Rankinglistat, agility (654.91)
alternative label: Rauniokoirat (654.91)
alternative label: Rekikoirat (654.91)
alternative label: Rekikoirat, koiravaljakot (654.91)
alternative label: Seurakoirat (654.91)
alternative label: Shikoku, koira (654.91)
alternative label: Sotakoirat (654.91)
alternative label: Spanielit (654.91)
alternative label: Trimmaus, koirat (654.91)
alternative label: Vetokoirat (654.91)
alternative label: Assistenthundar (654.91) @sv
alternative label: BARF-utfodring, hundar (654.91) @sv
alternative label: Barfutfodring, hundar (654.91) @sv
alternative label: Brukshundar (654.91) @sv
alternative label: Diabeteshundar (654.91) @sv
broader: Lemmikkieläimet
in scheme: URN:NBN:fi:au:hklj:
notation: 654.91
related: URN:NBN:fi:au:hklj:576
related: URN:NBN:fi:au:hklj:590
related: Eläintarhat
related: Eläinsuojelu
related: Systemaattinen eläintiede
related: Nisäkkäät
related: Eläinten vetämät kulkuneuvot
related: URN:NBN:fi:au:hklj:649.91
related: Maatalouspolitiikka
related: URN:NBN:fi:au:hklj:650.2
related: URN:NBN:fi:au:hklj:651
related: URN:NBN:fi:au:hklj:657
related: Metsästys
related: Eläinlääketiede
related: Rakennusten erillistilat
related: URN:NBN:fi:au:hklj:691.13
related: Julkiset huvit
scope note: Koirat ja niiden hoito. Koirarodut Seura- ja palveluskoirat ja niiden hoito. Metsästyskoirat. Paimenkoirat. Opaskoirat. Vetokoirat. Poliisikoirat. Huumekoirat. Rauniokoirat Kenneltoiminta. Koirien kasvatus ja kauppa. Koiranäyttelyt Koiran käyttäytyminen. Koiran koulutus. Agility Koiran sairaudet ja niiden hoito
scope note: Hundar och skötsel av hundar. Hundraser Sällskaps- och brukshundar samt skötsel av dem. Jakthundar. Vallhundar. Ledarhundar. Draghundar. Polishundar. Narkotikahundar. Hundar för letning av jordbävningsoffer Kennelverksamhet. Uppfödning av och handel med hundar. Hundutställningar Hundens beteende. Skolning av hunden. Agility Hundsjukdomar och behandling av dem @sv

Häkkilinnut
type: Class
type: Concept
subclass of: Lemmikkieläimet
alternative label: Häkkilinnut (654.94)
alternative label: Kanarialintu, häkkilinnut (654.94)
alternative label: Kirjekyyhkyt, häkkilinnut (654.94)
alternative label: Linnut, häkkilinnut (654.94)
alternative label: Lintuhäkit, lemmikkieläimet (654.94)
alternative label: Papukaijat, häkkilinnut (654.94)
alternative label: Undulaatti, häkkilinnut (654.94)
alternative label: Brevduvor, burfåglar (654.94) @sv
alternative label: Burfåglar (654.94) @sv
alternative label: Fågelburar, sällskapsdjur (654.94) @sv
alternative label: Fåglar, burfåglar (654.94) @sv
alternative label: Kanariefågel, burfåglar (654.94) @sv
alternative label: Papegojor, burfåglar (654.94) @sv
alternative label: Undulat, burfåglar (654.94) @sv
broader: Lemmikkieläimet
in scheme: URN:NBN:fi:au:hklj:
notation: 654.94
preferred label: Cage-birds @en
preferred label: Burfåglar @sv
related: URN:NBN:fi:au:hklj:576
related: URN:NBN:fi:au:hklj:590
related: Eläintarhat
related: Eläinsuojelu
related: Systemaattinen eläintiede
related: Linnut
related: Nisäkkäät
related: Eläinten vetämät kulkuneuvot
related: URN:NBN:fi:au:hklj:649.91
related: Maatalouspolitiikka
related: URN:NBN:fi:au:hklj:650.2
related: URN:NBN:fi:au:hklj:651
related: Siipikarja
related: URN:NBN:fi:au:hklj:657
related: Eläinlääketiede
related: Rakennusten erillistilat
related: URN:NBN:fi:au:hklj:691.13
scope note: Häkkilinnut ja niiden hoito. Häkkilintulajit ja -rodut Papukaijat. Kanarialinnut. Peipot Häkkilintujen kasvatus ja kauppa Lintuhäkit ja häkkilintujen hoitovälineet Häkkilintujen sairaudet ja niiden hoito
scope note: Burfåglar och skötsel av dem. Burfåglarnas familjer och arter Papegojor. Kanariefåglar. Finkar Uppfödning av och handel med burfåglar Fågelburar och redskap för skötsel av burfåglar Burfåglarnas sjukdomar och behandling av dem @sv

Akvaariot
type: Class
type: Concept
subclass of: Lemmikkieläimet
alternative label: Akvaariokalat (654.95)
alternative label: Akvaariokasvit (654.95)
alternative label: Akvaarioliikkeet (654.95)
alternative label: Akvaariot (654.95)
alternative label: Akvaariot, lemmikkieläimet (654.95)
alternative label: Akvaariot, rakentaminen ja hoito (654.95)
alternative label: Kalataudit, akvaariokalat (654.95)
alternative label: Kasvit, akvaariokasvit (654.95)
alternative label: Kotiakvaariot (654.95)
alternative label: Monnikalat, akvaariokalat (654.95)
alternative label: Suolavesiakvaariot (654.95)
alternative label: Akvarieaffärer (654.95) @sv
alternative label: Akvariefiskar (654.95) @sv
alternative label: Akvarier (654.95) @sv
alternative label: Akvarier, byggande och skötsel (654.95) @sv
alternative label: Akvarier, sällskapsdjur (654.95) @sv
alternative label: Akvarieväxter (654.95) @sv
alternative label: Fisksjukdomar, akvariefiskar (654.95) @sv
alternative label: Hemakvarier (654.95) @sv
alternative label: Malfiskar, akvariefiskar (654.95) @sv
alternative label: Saltvattensakvarier (654.95) @sv
alternative label: Växter, akvarieväxter (654.95) @sv
broader: Lemmikkieläimet
in scheme: URN:NBN:fi:au:hklj:
notation: 654.95
preferred label: Aquaria @en
preferred label: Akvarier @sv
related: URN:NBN:fi:au:hklj:576
related: URN:NBN:fi:au:hklj:590
related: Eläintarhat
related: Eläinsuojelu
related: Systemaattinen eläintiede
related: Kalat
related: Nisäkkäät
related: Eläinten vetämät kulkuneuvot
related: URN:NBN:fi:au:hklj:649.91
related: Maatalouspolitiikka
related: URN:NBN:fi:au:hklj:650.2
related: URN:NBN:fi:au:hklj:651
related: URN:NBN:fi:au:hklj:657
related: Kalastus
related: Eläinlääketiede
related: Rakennusten erillistilat
related: URN:NBN:fi:au:hklj:691.13
scope note: Kotiakvaariot, niiden hoito ja hoitovälineet Makeavesiakvaariot. Suolavesiakvaariot Akvaariokalat, niiden lajit, rodut ja kauppa Muut akvaariossa pidettävät eläimet Akvaarion sisustus. Akvaariokasvit Akvaariokalojen sairaudet ja niiden hoito
scope note: Hemakvarier, skötsel av dem och tillbehör för skötseln Sötvattensakvarier. Saltvattensakvarier Akvariefiskar, deras arter och underarter samt handel med dem Övriga akvariedjur Akvariets inredning. Akvarieväxter Akvariefiskarnas sjukdomar och behandling av dem @sv

Alkuperäiskansojen taide
type: Class
type: Concept
subclass of: URN:NBN:fi:au:hklj:709
alternative label: Aboriginaalit, Australia, taide (709.01)
alternative label: Afrikka, naamiot (709.01)
alternative label: Afrikka, taide, perinteinen (709.01)
alternative label: Alkuperäiskansat, taide (709.01)
alternative label: Amerikka, taide, alkuperäiskansat (709.01)
alternative label: Asteekit, taidehistoria (709.01)
alternative label: Atsteekit, taidehistoria (709.01)
alternative label: Australia, taide, aboriginaalit. (709.01)
alternative label: Eskimot, taidehistoria (709.01)
alternative label: Etelä-Amerikka, taide, alkuperäiskansat (709.01)
alternative label: Etninen taide (709.01)
alternative label: Inkat, taide (709.01)
alternative label: Intiaanit, taidehistoria (709.01)
alternative label: Inuitit, taidehistoria (709.01)
alternative label: Lappalaiset, taide, perinteinen (709.01)
alternative label: Luonnonkansat, taide (709.01)
alternative label: Maorit, taide (709.01)
alternative label: Mayat, taidehistoria (709.01)
alternative label: Naamiot, alkuperäiskansojen (709.01)
alternative label: Oseania, taide, aboriginaalien (709.01)
alternative label: Pohjois-Amerikka, taide, alkuperäiskansat (709.01)
alternative label: Primitiivinen taide (709.01)
alternative label: Primitiiviset kansat, taide (709.01)
alternative label: Saamelaiset, taide, perinteinen (709.01)
alternative label: Taidehistoria, alkuperäiskansat (709.01)
alternative label: Tolteekit, taidehistoria (709.01)
alternative label: Aboriginer, Australien, konst (709.01) @sv
alternative label: Afrika, konst, traditionell (709.01) @sv
alternative label: Afrika, masker (709.01) @sv
alternative label: Amerika, konst, urbefolkningar (709.01) @sv
alternative label: Australien, konst, aboriginer. (709.01) @sv
alternative label: Azteker, asteekit, konsthistoria (709.01) @sv
alternative label: Azteker, atsteekit, konsthistoria (709.01) @sv
alternative label: Eskimåer, konsthistoria (709.01) @sv
alternative label: Etnisk konst (709.01) @sv
alternative label: Indianer, konsthistoria (709.01) @sv
alternative label: Inkaindianer, konst (709.01) @sv
alternative label: Inuiter, konsthistoria (709.01) @sv
alternative label: Konsthistoria, urbefolkningar (709.01) @sv
alternative label: Lappar, konst, traditionell (709.01) @sv
alternative label: Maorier, konst (709.01) @sv
alternative label: Masker, hos urbefolkningar (709.01) @sv
alternative label: Mayafolket, konsthistoria (709.01) @sv
alternative label: Naturfolk, konst (709.01) @sv
alternative label: Nordamerika, konst, urbefolkningar (709.01) @sv
alternative label: Oceanien, konst, aboriginers (709.01) @sv
alternative label: Primitiv konst (709.01) @sv
alternative label: Primitiva folk, konst (709.01) @sv
alternative label: Samer, konst, traditionell (709.01) @sv
alternative label: Sydamerika, konst, urbefolkningar (709.01) @sv
alternative label: Tolteker, konsthistoria (709.01) @sv
alternative label: Urbefolkningar, konst (709.01) @sv
broader: URN:NBN:fi:au:hklj:709
in scheme: URN:NBN:fi:au:hklj:
notation: 709.01
preferred label: Aboriginal art @en
preferred label: Ursprungsfolkens konst @sv
related: Esihistoriallinen taide
related: Euroopan ulkopuolisten vanhojen kulttuurien taide
related: Nykyajan taidehistoria
related: Alkuperäiskansojen arkkitehtuuri
related: URN:NBN:fi:au:hklj:730.9
related: Alkuperäiskansojen kuvanveistotaide
related: URN:NBN:fi:au:hklj:740.9
related: Alkuperäiskansojen maalaustaide
related: URN:NBN:fi:au:hklj:769
related: URN:NBN:fi:au:hklj:770.9
related: URN:NBN:fi:au:hklj:789
related: URN:NBN:fi:au:hklj:789.1
related: URN:NBN:fi:au:hklj:919
scope note: Eskimoiden, intiaanien, saamelaisten sekä Aasian, Afrikan, Australian ja Oseanian alkuperäiskansojen taide yleensä Tässä myös intiaanien korkeakulttuurien taide yleensä Alkuperäiskansojen naamiot Alkuperäiskansojen eri alojen taide alan mukaisessa luokassa Yksittäisiä taiteilijoita tai heidän tuotantoaan koskevat teokset ovat aina ko. taiteenalan tai sen historian luokassa
scope note: Eskimåernas, indianernas, samernas samt de asiatiska, afrikanska, australiska och oceaniska ursprungsfolkens konst i allmänhet Hit också verk som handlar om de indianska högkulturernas konst i allmänhet Ursprungsfolkens masker Ursprungsfolkens enskilda konstarter klassificeras enligt konstart Verk som handlar om enskilda konstnärer och deras produktion klassificeras alltid enligt konstarten eller dess historia @sv

Käyttögrafiikka
type: Class
type: Concept
subclass of: GRAAFINEN TAIDE. VALOKUVAUS
alternative label: Etiketit, keräily (752)
alternative label: Etikettitaide (752)
alternative label: Graafikot, käyttögrafiikan tekijät (752)
alternative label: Graafinen taide, käyttögrafiikka (752)
alternative label: Grafiikka, käyttögrafiikka (752)
alternative label: Joulukortit (752)
alternative label: Julisteet, julistetaide (752)
alternative label: Julistetaide (752)
alternative label: Keräily, etiketit (752)
alternative label: Keräily, kiiltokuvat (752)
alternative label: Keräily, käyttögrafiikka (752)
alternative label: Keräily, postikortit (752)
alternative label: Keräily, puhelukortit (752)
alternative label: Keräilykortit, keräily (752)
alternative label: Kiiltokuvat, grafiikka (752)
alternative label: Kiiltokuvat, keräily (752)
alternative label: Kortit, postikortit (752)
alternative label: Kortit, puhelikortit, kerääminen (752)
alternative label: Kotelot, käyttögrafiikka (752)
alternative label: Kuvallinen viestintä, käyttögrafiikka (752)
alternative label: Käyntikortit, keräily (752)
alternative label: Käyntikortit, käyttögrafiikka (752)
alternative label: Käyttögrafiikka (752)
alternative label: Layout, käyttögrafiikka (752)
alternative label: Mainosgrafiikka (752)
alternative label: Mainostaide (752)
alternative label: Nimikortit, keräily (752)
alternative label: Nimikortit, käyttögrafiikka (752)
alternative label: Painokuvat, julistetaide (752)
alternative label: Painokuvat, käyttögrafiikka (752)
alternative label: Pakkaukset, käyttögrafiikka (752)
alternative label: Postihistoria, postikortit (752)
alternative label: Postikortit (752)
alternative label: Postikortit, keräily (752)
alternative label: Puhelukortit, käyttögrafiikka, keräily (752)
alternative label: Pääsiäiskortit (752)
alternative label: Pääsyliput, pääsylippujen keräily (752)
alternative label: Pääsyliput, pääsyliput grafiikan kannalta (752)
alternative label: Serigrafia, käyttögrafiikan tekniikka (752)
alternative label: Serigrafia, käyttögrafiikka (752)
alternative label: Seripaino, käyttögrafiikan tekniikka (752)
alternative label: Seripaino, käyttögrafiikka (752)
alternative label: Silkkipaino, käyttögrafiikan tekniikka (752)
alternative label: Taideteollinen grafiikka (752)
alternative label: Tulitikkuetiketit, keräily (752)
alternative label: Affischer, affischkonst (752) @sv
alternative label: Affischkonst (752) @sv
alternative label: Bildkommunikation, bruksgrafik (752) @sv
alternative label: Bruksgrafik (752) @sv
alternative label: Etiketter, samlande (752) @sv
alternative label: Etikettkonst (752) @sv
alternative label: Fodral, bruksgrafik (752) @sv
alternative label: Förpackningar, bruksgrafik (752) @sv
alternative label: Glansbilder, grafik (752) @sv
alternative label: Glansbilder, samlande (752) @sv
broader: GRAAFINEN TAIDE. VALOKUVAUS
in scheme: URN:NBN:fi:au:hklj:
notation: 752
related: Kirjapainotaito. Graafinen teollisuus
related: URN:NBN:fi:au:hklj:018
related: Mainonta
related: MAALAUSTAIDE. PIIRUSTUSTAIDE
related: URN:NBN:fi:au:hklj:740.9
related: URN:NBN:fi:au:hklj:749.1
related: Graafisen taiteen teoria, estetiikka ja filosofia
related: Graafisen taiteen historia
related: Kuvitustaide
related: URN:NBN:fi:au:hklj:752.03
related: Taidegrafiikka
related: Taidegrafiikan materiaalit ja tekniikka
related: URN:NBN:fi:au:hklj:756
related: URN:NBN:fi:au:hklj:760
related: Taideteollisuuden historia
related: URN:NBN:fi:au:hklj:798
related: Postimerkkeily
scope note: Käyttögrafiikka eli taideteollinen grafiikka, sen historia, henkilöhistoria ja estetiikka maasta tai maanosasta riippumatta. Käyttögrafiikan keräily Käyttögrafiikan materiaalit ja tekniikka Julistetaide. Mainostaide. Etiketit, postikortit, kiiltokuvat ja niiden keräily
scope note: Bruksgrafik eller konstindustriell grafik, deras historia, personhistoria och estetik oavsett land eller världsdel. Bruksgrafik som samlingsobjekt Bruksgrafikens material och tekniker Affischkonst. Reklamkonst. Etiketter, postkort, glansbilder och samlande av dem @sv

Posliinitaide. Posliinimaalaus
type: Class
type: Concept
subclass of: Keramiikkataide. Posliinitaide
alternative label: Astiastot, taideteollisuus, posliini (765.2)
alternative label: Astiat, taideteollisuus, posliini (765.2)
alternative label: Esineet, taideposliini (765.2)
alternative label: Fajanssi (765.2)
alternative label: Koristemaalaus, posliinimaalaus (765.2)
alternative label: Käsityöt, posliinimaalaus (765.2)
alternative label: Käsityöt, posliinityöt (765.2)
alternative label: Lasitus, posliinitaide (765.2)
alternative label: Maalaukset, posliinimaalaukset (765.2)
alternative label: Maalaustaide, posliinimaalaus (765.2)
alternative label: Majolika (765.2)
alternative label: Maljakkomaalaus (765.2)
alternative label: Maljakot, taideteollisuus, posliini (765.2)
alternative label: Muovailu, posliinityöt (765.2)
alternative label: Posliini (765.2)
alternative label: Posliininmaalaus (765.2)
alternative label: Posliinitaide (765.2)
alternative label: Ruokailuastiat, posliinitaide (765.2)
alternative label: Taidemaalarit, posliinimaalarit (765.2)
alternative label: Vaasimaalaus (765.2)
alternative label: Dekorationsmålning, porslinsmålning (765.2) @sv
alternative label: Fajans (765.2) @sv
alternative label: Föremål, konstporslin (765.2) @sv
alternative label: Glasering, porslinskonst (765.2) @sv
alternative label: Handarbeten, porslinsarbeten (765.2) @sv
alternative label: Handarbeten, porslinsmålning (765.2) @sv
alternative label: Kärl, konstindustri, porslin (765.2) @sv
alternative label: Matkärl, porslinskonst (765.2) @sv
alternative label: Modellering, konst, porslinsarbeten (765.2) @sv
alternative label: Målare, konstnärer, porslinsmålare (765.2) @sv
alternative label: Målarkonst, porslinsmålning (765.2) @sv
alternative label: Målningar, porslinsmålningar (765.2) @sv
alternative label: Porslin (765.2) @sv
alternative label: Porslinskonst (765.2) @sv
alternative label: Porslinsmålning (765.2) @sv
alternative label: Serviser, konstindustri, porslin (765.2) @sv
alternative label: Vaser, konstindustri, porslin (765.2) @sv
alternative label: Vasmålning, maljakkomaalaus (765.2) @sv
alternative label: Vasmålning, vaasimaalaus (765.2) @sv
broader: Keramiikkataide. Posliinitaide
in scheme: URN:NBN:fi:au:hklj:
notation: 765.2
preferred label: Porcelain art. Porcelain painting @en
preferred label: Porslinskonst. Porslinsmålning @sv
related: Lasiteollisuus. Keraaminen teollisuus. Sementtiteollisuus
related: URN:NBN:fi:au:hklj:643.03
related: KUVANVEISTOTAIDE
related: URN:NBN:fi:au:hklj:730.9
related: Kuvanveistotaiteen materiaalit ja tekniikka
related: MAALAUSTAIDE. PIIRUSTUSTAIDE
related: Maalaustaiteen teoria, estetiikka ja filosofia
related: URN:NBN:fi:au:hklj:740.9
related: URN:NBN:fi:au:hklj:741
related: URN:NBN:fi:au:hklj:741.1
related: URN:NBN:fi:au:hklj:741.2
related: Taideteollisuuden teoria, estetiikka ja filosofia
related: Antiikkiesineiden keräily
related: Taideteollisuuden historia
related: Keramiikkataide
related: URN:NBN:fi:au:hklj:767
scope note: Posliinitaide, fajanssitaide ja posliinimaalaus sekä niiden historia, materiaalit, tekniikka ja estetiikka Posliini- ja fajanssityöohjeet ja -mallit Posliininmaalausohjeet ja -mallit Posliiniveistokset Posliiniesineet taideteollisuuden ja käsityön kannalta
scope note: Porslinskonst, fajanskonst och porslinsmålning samt deras historia, material, tekniker och estetik Beskrivningar och modeller för porslinsarbeten och fajansarbeten Arbetsbeskrivningar och mönster för porslinsmålning Porslinsskulpturer Porslinsföremål ur konstindustrins och konsthantverkets synvinkel @sv

Tanska
type: Class
type: Concept
subclass of: Pohjoismaat. Baltian maat
alternative label: Tanska, kansanmusiikki (784.114 +)
alternative label: Danmark, folkmusik (784.114 +) @sv
broader: Pohjoismaat. Baltian maat
in scheme: URN:NBN:fi:au:hklj:
narrower: Färsaaret
notation: 784.114
preferred label: Denmark @en
preferred label: Danmark @sv
related: URN:NBN:fi:au:hklj:473.1
related: URN:NBN:fi:au:hklj:769
related: URN:NBN:fi:au:hklj:783
related: URN:NBN:fi:au:hklj:783.1
related: Eskimot. Inuiitit
related: URN:NBN:fi:au:hklj:787
related: URN:NBN:fi:au:hklj:787.2
related: URN:NBN:fi:au:hklj:787.29
related: URN:NBN:fi:au:hklj:788.8
related: URN:NBN:fi:au:hklj:789
related: URN:NBN:fi:au:hklj:795.1
related: URN:NBN:fi:au:hklj:797.2
related: URN:NBN:fi:au:hklj:807

Pohjois-Afrikka
type: Class
type: Concept
subclass of: Afrikka
alternative label: Arabialainen musiikki, kansanmusiikki, Afrikka (784.31)
alternative label: Egypti, kansanmusiikki (784.31)
alternative label: Arabisk musik, folkmusik, Afrika (784.31) @sv
alternative label: Egypten, folkmusik (784.31) @sv
broader: Afrikka
in scheme: URN:NBN:fi:au:hklj:
notation: 784.31
preferred label: North Africa @en
preferred label: Nordafrika @sv
related: Kirkolliset juhlat ja juhlapäivät
related: URN:NBN:fi:au:hklj:473.1
related: URN:NBN:fi:au:hklj:769
related: URN:NBN:fi:au:hklj:783
related: URN:NBN:fi:au:hklj:783.1
related: URN:NBN:fi:au:hklj:784.9
related: URN:NBN:fi:au:hklj:787
related: URN:NBN:fi:au:hklj:787.2
related: Islamilaisten uskonnollinen musiikki
related: URN:NBN:fi:au:hklj:787.29
related: URN:NBN:fi:au:hklj:788.8
related: URN:NBN:fi:au:hklj:789
related: URN:NBN:fi:au:hklj:795.1
related: URN:NBN:fi:au:hklj:797.2
related: URN:NBN:fi:au:hklj:807
scope note: Algeria. Egypti. Etelä-Sudan. Libya. Marokko. Sudan. Tunisia Saharan aluetta koskevat yleisteokset ja sekasisältöiset kokoelmat Tässä myös Länsi-Sahara
scope note: Algeriet. Egypten. Libyen. Marocko. Sudan. Sydsudan. Tunisien Allmänna verk och samlingar med blandat innehåll som rör Saharaområdet Hit också Västsahara @sv

Länsi-Afrikka
type: Class
type: Concept
subclass of: Afrikka
broader: Afrikka
in scheme: URN:NBN:fi:au:hklj:
notation: 784.32
preferred label: West Africa @en
preferred label: Västafrika @sv
related: Kirkolliset juhlat ja juhlapäivät
related: URN:NBN:fi:au:hklj:473.1
related: URN:NBN:fi:au:hklj:769
related: URN:NBN:fi:au:hklj:783
related: URN:NBN:fi:au:hklj:783.1
related: URN:NBN:fi:au:hklj:784.9
related: URN:NBN:fi:au:hklj:787
related: URN:NBN:fi:au:hklj:787.2
related: Islamilaisten uskonnollinen musiikki
related: URN:NBN:fi:au:hklj:787.29
related: URN:NBN:fi:au:hklj:788.8
related: URN:NBN:fi:au:hklj:789
related: URN:NBN:fi:au:hklj:795.1
related: URN:NBN:fi:au:hklj:797.2
related: URN:NBN:fi:au:hklj:807
scope note: Benin. Burkina Faso. Gambia. Ghana. Guinea. Guinea-Bissau. Liberia. Mali. Mauritania. Niger. Nigeria. Norsunluurannikko. Senegal. Sierra Leone. Togo
scope note: Benin. Burkina Faso. Elfenbenskusten. Gambia. Ghana. Guinea. Guinea-Bissau. Liberia. Mali. Mauretanien. Niger. Nigeria. Senegal. Sierra Leone. Togo @sv

Keski-Afrikka
type: Class
type: Concept
subclass of: Afrikka
broader: Afrikka
in scheme: URN:NBN:fi:au:hklj:
notation: 784.33
preferred label: Central Africa @en
preferred label: Centralafrika @sv
related: Kirkolliset juhlat ja juhlapäivät
related: URN:NBN:fi:au:hklj:473.1
related: URN:NBN:fi:au:hklj:769
related: URN:NBN:fi:au:hklj:783
related: URN:NBN:fi:au:hklj:783.1
related: URN:NBN:fi:au:hklj:784.9
related: URN:NBN:fi:au:hklj:787
related: URN:NBN:fi:au:hklj:787.2
related: Islamilaisten uskonnollinen musiikki
related: URN:NBN:fi:au:hklj:787.29
related: URN:NBN:fi:au:hklj:788.8
related: URN:NBN:fi:au:hklj:789
related: URN:NBN:fi:au:hklj:795.1
related: URN:NBN:fi:au:hklj:797.2
related: URN:NBN:fi:au:hklj:807
scope note: Angola. Gabon. Kamerun. Keski-Afrikan tasavalta. Kongo. Päiväntasaajan Guinea. Tsad
scope note: Angola. Centralafrikanska republiken. Ekvatorialguinea. Gabon. Kamerun. Kongo. Tchad @sv

Tyynen meren saaret
type: Class
type: Concept
subclass of: Australia. Oseania
broader: Australia. Oseania
in scheme: URN:NBN:fi:au:hklj:
notation: 784.74
preferred label: Islands of the Pacific Ocean @en
preferred label: Öarna i Stilla havet @sv
related: URN:NBN:fi:au:hklj:473.1
related: URN:NBN:fi:au:hklj:769
related: URN:NBN:fi:au:hklj:783
related: URN:NBN:fi:au:hklj:783.1
related: Yhdysvallat
related: URN:NBN:fi:au:hklj:784.9
related: URN:NBN:fi:au:hklj:787
related: URN:NBN:fi:au:hklj:787.2
related: URN:NBN:fi:au:hklj:787.29
related: URN:NBN:fi:au:hklj:788.8
related: URN:NBN:fi:au:hklj:789
related: URN:NBN:fi:au:hklj:795.1
related: URN:NBN:fi:au:hklj:797.2
related: URN:NBN:fi:au:hklj:807
scope note: Melanesia. Mikronesia. Polynesia Bismarckinsaaret. Cookinsaaret. Fidzi. Galapagossaaret. Gilbertinsaaret. Guam. Havaiji. Johnstoninsaari. Joulusaari. Karoliinit. Kiribati. Kookossaari. Mariaanit. Marquesassaaret. Marshallinsaaret. Midwaysaaret. Nauru. Niuesaari. Palau. Phoenixsaaret. Pitcairn. Pohjois-Mariaanit. Pääsiäissaari. Ranskan Polynesia. Salomonsaaret. Samoa. Seurasaaret. Tahiti. Tokelau. Tonga. Tuvalu. Uudet-Hebridit. Uusi-Kaledonia. Wallis- ja Futunasaaret. Vanuatu
scope note: Melanesien. Mikronesien. Polynesien Bismarcköarna. Carolinerna. Cooköarna. Fiji. Franska Polynesien. Galapagosöarna. Gilbertöarna. Guam. Johnstonöarna. Julön. Kiribati. Kokosöarna. Marianerna. Marquesasöarna. Marshallöarna. Midwayöarna. Nauru. Niue. Nordmarianerna. Norfolkön. Nya Hebriderna. Nya Kaledonien. Palau. Phoenixöarna. Pitcairn. Påskön. Salomonöarna. Samoa. Sällskapsöarna. Tahiti. Tokelau. Tonga. Tuvalu. Wallis- och Futunaöarna. Vanuatu @sv

Konsertot yhdelle puupuhaltimelle
type: Class
type: Concept
subclass of: Konsertot
broader: Konsertot
in scheme: URN:NBN:fi:au:hklj:
narrower: Huilukonsertot
narrower: Nokkahuilukonsertot
narrower: Klarinettikonsertot
narrower: Saksofonikonsertot
narrower: Oboekonsertot
narrower: Fagottikonsertot
narrower: Konsertot muille puupuhaltimille
notation: 785.627
preferred label: Concerti for a single woodwind instrument @en
preferred label: Konserter för ett träblåsinstrument @sv
related: URN:NBN:fi:au:hklj:785.4
related: URN:NBN:fi:au:hklj:786
related: URN:NBN:fi:au:hklj:789

Roomalaiskatolinen musiikki
type: Class
type: Concept
subclass of: Kristillisten kirkkojen musiikki
alternative label: Ambrosiaaninen laulu (787.12)
alternative label: Antifonit (787.12)
alternative label: Gregoriaaninen laulu (787.12)
alternative label: Gregoriaaninen musiikki (787.12)
alternative label: Hengellinen musiikki, roomalaiskatolinen musiikki (787.12)
alternative label: Latinalainen kirkkolaulu (787.12)
alternative label: Roomalaiskatolinen musiikki (787.12)
alternative label: Ambrosiansk sång (787.12) @sv
alternative label: Andlig musik, romersk-katolsk musik (787.12) @sv
alternative label: Antifoner (787.12) @sv
alternative label: Gregoriansk musik (787.12) @sv
alternative label: Gregoriansk sång (787.12) @sv
alternative label: Latinsk kyrkosång (787.12) @sv
alternative label: Romersk-katolsk musik (787.12) @sv
broader: Kristillisten kirkkojen musiikki
in scheme: URN:NBN:fi:au:hklj:
notation: 787.12
preferred label: Roman Catholic music @en
preferred label: Romersk-katolsk musik @sv
related: Hartauskirjat
related: Rukouskirjat
related: Virsikirjat ja hengelliset laulukirjat
related: Henkilökohtainen hartaudenharjoitus
related: Sakramentit. Kirkolliset toimitukset
related: URN:NBN:fi:au:hklj:783
related: URN:NBN:fi:au:hklj:783.1
related: URN:NBN:fi:au:hklj:783.5
related: URN:NBN:fi:au:hklj:783.59
related: URN:NBN:fi:au:hklj:783.6
related: URN:NBN:fi:au:hklj:784
related: URN:NBN:fi:au:hklj:784.9
related: Virret. Hengelliset laulut
related: URN:NBN:fi:au:hklj:787.112
related: URN:NBN:fi:au:hklj:787.2
related: URN:NBN:fi:au:hklj:789
scope note: Roomalaiskatolinen liturginen ja hengellinen musiikki sekä sitä koskeva kirjallisuus Gregoriaaninen laulu
scope note: Romersk-katolsk liturgisk och andlig musik samt litteratur om den Gregoriansk sång @sv

Ortodoksinen musiikki
type: Class
type: Concept
subclass of: Kristillisten kirkkojen musiikki
alternative label: Bysanttilainen musiikki, ortodoksinen musiikki (787.13)
alternative label: Hengellinen musiikki, ortodoksinen musiikki (787.13)
alternative label: Kreikkalaiskatolinen kirkkomusiikki (787.13)
alternative label: Ortodoksinen kirkkomusiikki (787.13)
alternative label: Andlig musik, ortodox musik (787.13) @sv
alternative label: Bysantinsk musik, ortodox musik (787.13) @sv
alternative label: Grekisk-katolsk kyrkomusik (787.13) @sv
alternative label: Ortodox kyrkomusik (787.13) @sv
broader: Kristillisten kirkkojen musiikki
in scheme: URN:NBN:fi:au:hklj:
notation: 787.13
preferred label: Orthodox music @en
preferred label: Ortodox musik @sv
related: Hartauskirjat
related: Rukouskirjat
related: Virsikirjat ja hengelliset laulukirjat
related: Henkilökohtainen hartaudenharjoitus
related: Sakramentit. Kirkolliset toimitukset
related: URN:NBN:fi:au:hklj:783
related: URN:NBN:fi:au:hklj:783.1
related: URN:NBN:fi:au:hklj:783.5
related: URN:NBN:fi:au:hklj:783.59
related: URN:NBN:fi:au:hklj:783.6
related: URN:NBN:fi:au:hklj:784
related: URN:NBN:fi:au:hklj:784.9
related: Virret. Hengelliset laulut
related: URN:NBN:fi:au:hklj:787.112
related: URN:NBN:fi:au:hklj:787.2
related: URN:NBN:fi:au:hklj:789
scope note: Ortodoksinen liturginen ja hengellinen musiikki sekä sitä koskeva kirjallisuus
scope note: Ortodox liturgisk och andlig musik samt litteratur om den @sv

Muiden kristillisten kirkkojen musiikki
type: Class
type: Concept
subclass of: Kristillisten kirkkojen musiikki
broader: Kristillisten kirkkojen musiikki
in scheme: URN:NBN:fi:au:hklj:
notation: 787.19
preferred label: Other Christian churches’ music @en
preferred label: Andra kristna kyrkors musik @sv
related: Hartauskirjat
related: Rukouskirjat
related: Virsikirjat ja hengelliset laulukirjat
related: Henkilökohtainen hartaudenharjoitus
related: Sakramentit. Kirkolliset toimitukset
related: URN:NBN:fi:au:hklj:783
related: URN:NBN:fi:au:hklj:783.1
related: URN:NBN:fi:au:hklj:783.5
related: URN:NBN:fi:au:hklj:783.59
related: URN:NBN:fi:au:hklj:783.6
related: URN:NBN:fi:au:hklj:784
related: URN:NBN:fi:au:hklj:784.9
related: Virret. Hengelliset laulut
related: URN:NBN:fi:au:hklj:787.112
related: URN:NBN:fi:au:hklj:787.2
related: URN:NBN:fi:au:hklj:789
scope note: Muiden kristillisten kirkkojen tai yhteisöjen hengellinen musiikki sekä sitä koskeva kirjallisuus
scope note: Andra kristna kyrkors eller samfunds andliga musik samt litteratur om den @sv

Aasialainen maailmanmusiikki. Aasialainen etninen pop ja viihdemusiikki
type: Class
type: Concept
subclass of: URN:NBN:fi:au:hklj:788.8
alternative label: Bhangra, maailmanmusiikki (788.84)
alternative label: Etnopop, aasialainen maailmanmusiikki (788.84)
alternative label: Ghazal, maailmanmusiikki (788.84)
alternative label: Maailmanmusiikki, aasialainen maailmanmusiikki (788.84)
alternative label: Bhangra, världsmusik (788.84) @sv
alternative label: Etnopop, asiatisk världsmusik (788.84) @sv
alternative label: Ghazal, världsmusik (788.84) @sv
alternative label: Världsmusik, asiatisk världsmusik (788.84) @sv
broader: URN:NBN:fi:au:hklj:788.8
in scheme: URN:NBN:fi:au:hklj:
notation: 788.84
preferred label: Asian world music. Asian ethnic pop and light music. @en
preferred label: Asiatisk världsmusik. Asiatisk etnisk pop och underhållningsmusik @sv
related: URN:NBN:fi:au:hklj:782.4
related: URN:NBN:fi:au:hklj:783
related: URN:NBN:fi:au:hklj:783.1
related: URN:NBN:fi:au:hklj:785.7
related: URN:NBN:fi:au:hklj:786.8
related: URN:NBN:fi:au:hklj:787.112
related: Rock. Pop
related: Rock and roll. Rockabilly
related: Heavy rock. Hard rock
related: Elektroninen popmusiikki. Electronica
related: Progressiivinen rock. Psykedeelinen rock
related: Punk rock. Uusi aalto. Post-punk
related: URN:NBN:fi:au:hklj:789
related: URN:NBN:fi:au:hklj:795
scope note: Tässä esim. bhangra ja ghazal
scope note: Här till exempel bhangra och ghazal @sv

Länsi- ja Lounais-Eurooppa
type: Class
type: Concept
subclass of: Eurooppa
broader: Eurooppa
in scheme: URN:NBN:fi:au:hklj:
narrower: Ranska
narrower: Italia
narrower: Espanja
narrower: Portugali
narrower: Malta
notation: 789.24
preferred label: Western and South-Western Europe @en
preferred label: Västeuropa och sydvästra Europa @sv
related: URN:NBN:fi:au:hklj:709
related: URN:NBN:fi:au:hklj:782.4
related: URN:NBN:fi:au:hklj:783
related: URN:NBN:fi:au:hklj:789.1
scope note: Länsi- ja Lounais-Europpan musiikin historian yleisteokset
scope note: Allmänna verk som rör musikens historia i Västeuropa och sydvästra Europa @sv

Balkanin niemimaa
type: Class
type: Concept
subclass of: Eurooppa
broader: Eurooppa
in scheme: URN:NBN:fi:au:hklj:
narrower: Bulgaria
narrower: Romania
narrower: Entisen Jugoslavian alue
narrower: Albania
narrower: Kreikka
notation: 789.25
preferred label: Balkan Peninsula @en
preferred label: Balkanhalvön @sv
related: URN:NBN:fi:au:hklj:709
related: URN:NBN:fi:au:hklj:782.4
related: URN:NBN:fi:au:hklj:783
related: URN:NBN:fi:au:hklj:789.1
scope note: Balkanin niemimaan musiikin historian yleisteokset
scope note: Allmänna verk som rör musikens historia på Balkanhalvön @sv

Entisen Jugoslavian alue
type: Class
type: Concept
subclass of: Balkanin niemimaa
alternative label: Jugoslavian alue, musiikinhistoria (789.253 +)
alternative label: Jugoslaviens område, musikhistoria (789.253 +) @sv
broader: Balkanin niemimaa
in scheme: URN:NBN:fi:au:hklj:
narrower: Slovenia
narrower: Kroatia
narrower: Bosnia ja Hertsegovina
narrower: Serbia ja Montenegro
narrower: Makedonia
notation: 789.253
preferred label: The former Yugoslavia @en
preferred label: Det tidigare Jugoslavien @sv
related: URN:NBN:fi:au:hklj:709
related: URN:NBN:fi:au:hklj:782.4
related: URN:NBN:fi:au:hklj:783
related: URN:NBN:fi:au:hklj:789.1
scope note: Jugoslavian alueen musiikin historian yleisteokset
scope note: Allmänna verk som rör musikens historia i det tidigare Jugoslavien @sv

Keski- ja Itä-Aasia
type: Class
type: Concept
subclass of: Aasia
broader: Aasia
in scheme: URN:NBN:fi:au:hklj:
narrower: Itsenäisten valtioiden yhteisön Aasian puoleiset maat
narrower: Korea
narrower: Kiina
narrower: Japani
notation: 789.35
preferred label: Central and Eastern Asia @en
preferred label: Centralasien och Ostasien @sv
related: URN:NBN:fi:au:hklj:709
related: URN:NBN:fi:au:hklj:782.4
related: URN:NBN:fi:au:hklj:783
related: URN:NBN:fi:au:hklj:789.1
related: Varhaiskansojen musiikki
related: Brittein saaret
scope note: Keski- ja Itä-Aasian musiikin historian yleisteokset Mongolia. Himalajan aluetta koskevat yleisteokset
scope note: Allmänna verk som rör musikens historia i Centralasien och Ostasien Mongoliet. Allmänna verk som rör Himalayaområdet @sv

Itsenäisten valtioiden yhteisön Aasian puoleiset maat
type: Class
type: Concept
subclass of: Keski- ja Itä-Aasia
broader: Keski- ja Itä-Aasia
in scheme: URN:NBN:fi:au:hklj:
narrower: Kaukasuksen maat
notation: 789.351
preferred label: Asian countries in the Commonwealth of Independent States @en
preferred label: De asiatiska länderna inom Oberoende staternas samvälde @sv
related: URN:NBN:fi:au:hklj:709
related: URN:NBN:fi:au:hklj:782.4
related: URN:NBN:fi:au:hklj:783
related: URN:NBN:fi:au:hklj:789.1
related: Varhaiskansojen musiikki
related: Itä-Eurooppa
related: Itsenäisten valtioiden yhteisö
related: Venäjä
related: Karjalan tasavalta
related: Ukraina
related: Valko-Venäjä
related: Moldova
scope note: Kazakstan. Kirgisia. Tadzikistan. Turkmenistan. Uzbekistan
scope note: Kazakstan. Kirgisistan. Tadjikistan. Turkmenistan. Uzbekistan @sv

Kirjallisuuden aihepiirejä ja kirjallisuustyyppejä koskeva historia ja tutkimus
type: Class
type: Concept
subclass of: URN:NBN:fi:au:hklj:800
alternative label: Aarnikotkat, fantasiakirjallisuuden tutkimus (805 +)
alternative label: Agenttikirjallisuus, kirjallisuudentutkimus (805 +)
alternative label: Aiheet, kirjallisuudentutkimus (805 +)
alternative label: Aikakoneet, fantasiakirj., tutk. (805 +)
alternative label: Aikamatkat, fantasiakirj., tutk. (805 +)
alternative label: Ammattikirjallisuus, kirjallisuudentutkimus (805)
alternative label: Antiutopiat, kirjallisuudentutkimus (805 +)
alternative label: Avainromaanit, kirjallisuudentutkimus (805 +)
alternative label: Bestsellerit, kirjallisuudentutkimus (805 +)
alternative label: Burleski, kirjallisuudentutkimus (805 +)
alternative label: Chick lit, naiskirjallisuus, kirjallisuudenlajit, tutkimus (805 +)
alternative label: Cowboyt, kirjallisuudenhistoria (805 +)
alternative label: Crossover-kirjallisuus, kirjallisuudenlajit (805 +)
alternative label: Dekkarit, kirjallisuudentutkimus (805 +)
alternative label: Dokumenttikirjallisuus, kirjallisuudentutkimus (805 +)
alternative label: Dystopiat, kirjallisuudentutkimus (805 +)
alternative label: Eepokset, kirjallisuudentutkimus (805 +)
alternative label: Eeppiset runot, kirjallisuudentutkimus (805 +)
alternative label: Eläinkertomukset, kirjallisuudentutkimus (805 +)
alternative label: Eläinrunot, kirjallisuudentutkimus (805 +)
alternative label: Eläinsadut, kirjallisuudentutkimus (805 +)
alternative label: Elämäkertaromaanit, kirjallisuudentutkimus (805 +)
alternative label: Emigranttikirjallisuus, kirjallisuudentutkimus (805 +)
alternative label: Epigrammit, kirjallisuudentutkimus. (805)
alternative label: Eroottinen kirjallisuus, kirjallisuudentutkimus (805)
alternative label: Erotiikka, kirjallisuudentutkimus (805)
alternative label: Eräkertomukset, kirjallisuudentutkimus (805 +)
alternative label: Eräkirjallisuus, kirjallisuudentutkimus (805 +)
alternative label: Eräkirjat, kirjallisuudentutkimus (805 +)
alternative label: Erätarinat, kirjallisuudentutkimus (805 +)
alternative label: Faabelit, kirjallisuudentutkimus (805 +)
alternative label: Fantasiakirjallisuus, kirjallisuudentutkimus (805 +)
alternative label: Farssit, kirjallisuudentutkimus (805 +)
alternative label: Feeniks-lintu, fantasiakirjallisuuden tutkimus (805 +)
alternative label: Feniks, fantasiakirjallisuuden tutkimus (805 +)
alternative label: Genret, kirjallisuudentutkimus (805 +)
alternative label: Genretutkimus, kirjallisuudentutkimus (805 +)
alternative label: Goottilaiset kauhuromaanit, kirjallisuudenhistoria (805 +)
alternative label: Goottilaiset romaanit, kirjallisuudenhistoria (805 +)
alternative label: Griipit, fantasiakirjallisuuden tutkimus (805 +)
alternative label: Haikut, kirjallisuudentutkimus (805 +)
alternative label: Harmaa kirjallisuus, kirjallisuudentutkimus (805)
alternative label: Hirviöt, kirjallisuudentutkimus (805 +)
alternative label: Historialliset näytelmät, kirjallisuudentutkimus (805 +)
alternative label: Historialliset romaanit, kirjallisuudentutkimus (805 +)
alternative label: Historialliset tarinat, kirjallisuudentutkimus (805 +)
alternative label: Huumori, kirjallisuudentutkimus (805 +)
alternative label: Ihmenäytelmät, kirjallisuudentutkimus (805 +)
alternative label: Ironia, kirjallisuudentutkimus (805 +)
alternative label: Jatkokertomukset, kirjallisuudentutkimus (805 +)
alternative label: Jatkokirjat, kirjallisuudentutkimus (805 +)
alternative label: Jännityskirjallisuus, kirjallisuudentutkimus (805)
alternative label: Kauhukirjallisuus, kirjallisuudenhistoria (805 +)
alternative label: Kauhuromaanit, kirjallisuudenhistoria (805 +)
alternative label: Kauhusarjakuvat, kirjallisuudentutkimus (805 +)
alternative label: Kehitysromaanit, kirjallisuudenhistoria (805 +)
alternative label: Kertomarunot, kirjallisuudenhistoria (805 +)
alternative label: Kioskikirjallisuus, kirjallisuudentutkimus (805 +)
broader: URN:NBN:fi:au:hklj:800
in scheme: URN:NBN:fi:au:hklj:
narrower: Lasten- ja nuortenkirjallisuuden historia ja tutkimus
notation: 805
related: Symbolit. Koodit. Merkkijärjestelmät
related: URN:NBN:fi:au:hklj:749.1
related: Piirustuksen materiaalit ja tekniikka
related: Yleinen kirjallisuudenhistoria
related: Suomenkielisen kirjallisuuden aihepiirejä ja kirjallisuustyyppejä koskeva historia ja tutkimus
related: Pohjoismaisten kielten kirjallisuuden historia ja tutkimus
related: Ruotsinkielisen kirjallisuuden historia ja tutkimus
related: Suomenruotsalaisen kirjallisuuden historia ja tutkimus
related: Saksankielisen kirjallisuuden historia ja tutkimus
related: Englanninkielisen kirjallisuuden historia ja tutkimus
related: Amerikan englanninkielisen kirjallisuuden historia ja tutkimus
related: ROMAANISTEN, SLAAVILAISTEN JA BALTTILAISTEN KIELTEN KIRJALLISUUDEN HISTORIA JA TUTKIMUS
related: MUIDEN KIELTEN KIRJALLISUUDEN HISTORIA JA TUTKIMUS
scope note: Kaunokirjallisuuden aihepiirien historia ja tutkimus kielestä, maasta ja aikakaudesta riippumatta; suomenkielisen kirjallisuuden aihepiirien ja kirjallisuustyyppien tutkimuksella on kuitenkin oma luokkansa 816+ Tässä esim. erotiikka-, erä-, historia-, jännitys-, kauhu-, luonto-, lääkäri-, matka-, meri-, rakkaus-, rikos-, romantiikka-, salapoliisi-, scifi-, seikkailu-, sota-, suku-, taide-, tiede-, uskonto-, vakoilu- ja yhteiskunta-aiheet kaunokirjallisuudessa, niiden historia ja tutkimus Tässä myös esim. viihdekirjallisuuden, pakinoiden ja sarjakuvien historia ja tutkimus Yksittäistä kirjailijaa tai hänen tuotantoaan koskevat teokset ovat kuitenkin aina ko. kirjailijan käyttämän kielen mukaisessa kirjallisuuden historian ja tutkimuksen luokassa Tässä myös tietokirjallisuuden historia ja tutkimus yleensä Tietyn alan tietokirjallisuus sekä sen historia ja tutkimus alan mukaisessa luokassa
scope note: Litteraturhistoria och litteraturforskning som rör litterära temaområden och genrer oavsett språk, land och tidsperiod; forskning i den finska litteraturens temaområden och genrer förs dock till sin speciella klass 816+ Hit t.ex. skönlitterära temaområden som hänför sig till detektiver, erotik, havet, historia, konst, krig, kriminalitet, kärlek, läkare, natur, religion, resor, romantik, samhälle, science fiction, skräck, släkter, spioner, spänning, vetenskap, vildmark och äventyr samt litteraturhistoria och litteraturforskning som rör dessa skönlitterära temaområden Hit också litteraturhistoria och litteraturforskning som rör t.ex. underhållningslitteratur, kåserier och tecknade serier Verk som handlar om enskilda författare och deras produktion klassificeras dock alltid enligt författarens språk i klassen för litteraturhistoria och litteraturforskning Hit också litteraturhistoria och litteraturforskning som rör facklitteratur i allmänhet Facklitteratur som hänför sig till ett bestämt specialområde samt litteraturhistoria och litteraturforskning som rör sådan facklitteratur klassificeras enligt område @sv

Filosofit. Psykologit. Kasvatustieteiden edustajat
type: Class
type: Concept
subclass of: HENKILÖ- JA SUKUHISTORIA
alternative label: Aineenopettajat, elämäkerrat ja muistelmat (991 +)
alternative label: Astrologit, elämäkerrat ja muistelmat (991 +)
alternative label: Biografiat, muiden alojen edustajat (991 ... 997 +)
alternative label: Edelläkävijät, muiden alojen edustajat (991 ... 997 +)
alternative label: Elämäkerrat, muiden alojen edustajat (991 ... 997 +)
alternative label: Elämänhistoria, henkilöhistoria, muiden alojen edustajat (991 ... 997 +)
alternative label: Ennustajat, elämäkerrat ja muistelmat (991 +)
alternative label: Ensyklopedistit, elämäkerrat ja muistelmat (991)
alternative label: Erityisopettajat, elämäkerrat ja muistelmat (991 +)
alternative label: Filosofit, elämäkerrat ja muistelmat (991 +)
alternative label: Haastattelut, henkilöhistoria, muut alat (991 ... 997 +)
alternative label: Henkilöhistoria, muiden alojen edustajat (991 ... 997 +)
alternative label: Henkilökuvat, muiden alojen edustajat (991 ... 997 +)
alternative label: Henkilöt, muiden alojen edustajat (991 ... 997 +)
alternative label: Historia, henkilöhistoria, muut alat (991 ... 997 +)
alternative label: Julkisuuden henkilöt, muiden alojen edustajat (991 ... 997 +)
alternative label: Kansalliset suurmiehet, muiden alojen edustajat (991 ... 997 +)
alternative label: Kasvatustieteilijät, elämäkerrat ja muistelmat (991 +)
alternative label: Kieltenopettajat, elämäkerrat ja muistelmat (991 +)
alternative label: Kirjeet, muiden alojen edustajat (991 ... 997 +)
alternative label: Kouluavustajat, elämäkerrat ja muistelmat (991 +)
alternative label: Koulukuraattorit, elämäkerrat ja muistelmat (991 +)
alternative label: Koulunkäyntiavustajat, elämäkerrat ja muistelmat (991 +)
alternative label: Koulupsykologit, elämäkerrat ja muistelmat (991 +)
alternative label: Lapsuus, muiden alojen edustajat (991 ... 997 +)
alternative label: Lehtorit, elämäkerrat ja muistelmat (991 +)
alternative label: Logopedit, elämäkerrat ja muistelmat (991 +)
alternative label: Luokanopettajat, elämäkerrat ja muistelmat (991 +)
alternative label: Maahanmuuttajat, henkilöhistoria, muuta alat (991 ... 997 +)
alternative label: Maanpako, henkilöhistoria, muut alat (991 ... 997 +)
alternative label: Merkkihenkilöt, muiden alojen edustajat (991 ... 997 +)
alternative label: Muistelmat, muiden alojen edustajat (991 ... 997 +)
alternative label: Muistokirjoitukset, muiden alojen edustajat (991 ... 997 +)
alternative label: Nekrologit, muiden alojen edustajat (991 ... 997 +)
alternative label: Nuorisotyöntekijät, elämäkerrat ja muistelmat (991 +)
alternative label: Omaelämäkerrat, muiden alojen edustajat (991 ... 997 +)
alternative label: Opettajat, elämäkerrat ja muistelmat (991 +)
alternative label: Opinto-ohjaajat, elämäkerrat ja muistelmat (991 +)
alternative label: Pakolaiset, henkilöhistoria, muut alat (991 ... 997 +)
alternative label: Professorit, muiden alojen edustajat (991 ... 997 +)
alternative label: Psykologit, elämäkerrat ja muistelmat (991 +)
alternative label: Päiväkirjat, muiden alojen edustajat (991 ... 997 +)
alternative label: Rakkauskirjeet, muiden alojen edustajat (991 ... 997 +)
alternative label: Rehtorit, elämäkerrat ja muistelmat (991 +)
alternative label: Siirtolaiset, henkilöhistoria, muut alat (991 ... 997 +)
alternative label: Sosiaaliasiamiehet, elämäkerrat ja muistelmat (991 +)
alternative label: Suurmiehet, muiden alojen edustajat (991 ... 997 +)
alternative label: Tuntiopettajat, elämäkerrat ja muistelmat (991 +)
alternative label: Uranuurtajat, muiden alojen edustajat (991 ... 997 +)
alternative label: Vaihtoehtohistoria, henkilöhistoria, muut alat (991 ... 997 +)
alternative label: Vaihtoehtoinen historia, henkilöhistoria, muut alat (991 ... 997 +)
alternative label: Alternativ historia, personhistoria, övriga områden (991 ... 997 +) @sv
alternative label: Astrologer, biografier och memoarer (991 +) @sv
alternative label: Barndom, andra yrkesområdens representanter (991 ... 997 +) @sv
alternative label: Bemärkta personer, andra yrkesområdens representanter (991 ... 997 +) @sv
alternative label: Biografier, andra yrkesområdens representanter (991 ... 997 +) @sv
alternative label: Brev, andra yrkesområdens representanter (991 ... 997 +) @sv
alternative label: Dagböcker, andra yrkesområdens representanter (991 ... 997 +) @sv
alternative label: Encyklopedister, biografier och memoarer (991) @sv
broader: HENKILÖ- JA SUKUHISTORIA
in scheme: URN:NBN:fi:au:hklj:
narrower: Suomi
notation: 991
related: Pelastusoppi. Kristillinen antropologia
related: URN:NBN:fi:au:hklj:323
related: Poliittiset ja aatteelliset vähemmistöt
related: URN:NBN:fi:au:hklj:617
related: URN:NBN:fi:au:hklj:618.24
related: URN:NBN:fi:au:hklj:618.3
related: URN:NBN:fi:au:hklj:909
related: URN:NBN:fi:au:hklj:919
related: URN:NBN:fi:au:hklj:991.03
related: Lääketieteen, tuotantoelämän, tekniikan, kaupan ja talous-elämän edustajat
related: Suomi
related: Sukuhistoria. Sukututkimus
scope note: Tässä esim. filosofien, psykologien, opettajien ja kasvatustieteilijöiden henkilöhistoria Tässä myös rajatiedon edustajien henkilöhistoria Jos henkilö on tunnettu toiminnastaan sekä psykologian tutkijana että psykiatrina, on etusija luokalla 991+
scope note: Hit t.ex. filosofers, psykologers, lärares och pedagogers personhistoria Hit också personhistoria som hänför sig till företrädare för paranormala fenomen Om personen är känd för sin verksamhet både som forskare i psykologi och som psykiater ges företräde åt klass 991+ @sv

Lääketieteen, tuotantoelämän, tekniikan, kaupan ja talous-elämän edustajat
type: Class
type: Concept
subclass of: HENKILÖ- JA SUKUHISTORIA
alternative label: Agentit, muistelmat, myyntiedustajat (996 +)
alternative label: Agrologit, elämäkerrat ja muistelmat (996 +)
alternative label: Agronomit, elämäkerrat ja muistelmat (996 +)
alternative label: Aliurakoitsijat, elämäkerrat ja muistelmat (996 +)
alternative label: Apteekkarit, elämäkerrat ja muistelmat (996 +)
alternative label: Apuhoitajat, elämäkerrat ja muistelmat (996 +)
alternative label: Asiamiehet, muistelmat, myyntiedustajat (996 +)
alternative label: Biografiat, muiden alojen edustajat (991 ... 997 +)
alternative label: Edelläkävijät, muiden alojen edustajat (991 ... 997 +)
alternative label: Ekonomistit, elämäkerrat ja muistelmat (996 +)
alternative label: Ekonomit, elämäkerrat ja muistelmat (996 +)
alternative label: Elintarviketyöläiset, elämäkerrat ja muistelmat (996 +)
alternative label: Elintarviketyöntekijät, elämäkerrat ja muistelmat (996 +)
alternative label: Eläinlääkärit, elämäkerrat ja muistelmat (996 +)
alternative label: Elämäkerrat, muiden alojen edustajat (991 ... 997 +)
alternative label: Elämänhistoria, henkilöhistoria, muiden alojen edustajat (991 ... 997 +)
alternative label: Erikoishammaslääkärit, elämäkerrat ja muistelmat (996 +)
alternative label: Erikoislääkärit, elämäkerrat ja muistelmat (996 +)
alternative label: Esittelijät, elämäkerrat ja muistelmat (996 +)
alternative label: Esittelijät, kauppa, elämäkerrat ja muistelmat (996 +)
alternative label: Farmaseutit, elämäkerrat ja muistelmat (996 +)
alternative label: Fysioterapeutit, elämäkerrat ja muistelmat (996 +)
alternative label: Haastattelut, henkilöhistoria, muut alat (991 ... 997 +)
alternative label: Hammashoitajat, elämäkerrat ja muistelmat (996 +)
alternative label: Hammashuoltajat, elämäkerrat ja muistelmat (996 +)
alternative label: Hammaslääkärit, elämäkerrat ja muistelmat (996 +)
alternative label: Hammasteknikot, elämäkerrat ja muistelmat (996 +)
alternative label: Henkilöhistoria, muiden alojen edustajat (991 ... 997 +)
alternative label: Henkilökuvat, muiden alojen edustajat (991 ... 997 +)
alternative label: Henkilöt, muiden alojen edustajat (991 ... 997 +)
alternative label: Historia, henkilöhistoria, muut alat (991 ... 997 +)
alternative label: Hoitohenkilöstö, elämäkerrat ja muistelmat (996 +)
alternative label: Hortonomit, elämäkerrat ja muistelmat (996 +)
alternative label: Hovimestarit, elämäkerrat ja muistelmat (996 +)
alternative label: Huoltomiehet, elämäkerrat ja muistelmat (996 +)
alternative label: Insinöörit, elämäkerrat ja muistelmat (996 +)
alternative label: Jalkinemestarit, elämäkerrat ja muistelmat (996 +)
alternative label: Johtajat, yritysjohtajat (996 +)
alternative label: Julkisuuden henkilöt, muiden alojen edustajat (991 ... 997 +)
alternative label: Jätkät, elämäkerrat ja muistelmat (996 +)
alternative label: Kaivostyöntekijät, elämäkerrat ja muistelmat (996 +)
alternative label: Kalastajat, elämäkerrat ja muistelmat (996 +)
alternative label: Kampaajamestarit, elämäkerrat ja muistelmat (996 +)
alternative label: Kampaajat, elämäkerrat ja muistelmat (996 +)
alternative label: Kansalliset suurmiehet, muiden alojen edustajat (991 ... 997 +)
alternative label: Kansanparantajat, elämäkerrat ja muistelmat (996 +)
alternative label: Kanslistit, elämäkerrat ja muistelmat (996 +)
alternative label: Karjapaimenet, elämäkerrat ja muistelmat (996 +)
alternative label: Kaupalliset sihteerit, elämäkerrat ja muistelmat (996 +)
alternative label: Kaupan edustajat, elämäkerrat ja muistelmat (996 +)
alternative label: Kaupan työntekijät, elämäkerrat ja muistelmat (996 +)
alternative label: Kauppiaat, elämäkerrat ja muistelmat (996 +)
alternative label: Keittiömestarit, elämäkerrat ja muistelmat (996 +)
alternative label: Keittiötyöntekijät, elämäkerrat ja muistelmat (996 +)
alternative label: Keksijät, elämäkerrat ja muistelmat (996 +)
alternative label: Kellosepät, elämäkerrat ja muistelmat (996 +)
alternative label: Kirjeet, muiden alojen edustajat (991 ... 997 +)
alternative label: Kirurgit, elämäkerrat ja muistelmat (996 +)
alternative label: Kirvesmiehet, elämäkerrat ja muistelmat (996 +)
broader: HENKILÖ- JA SUKUHISTORIA
in scheme: URN:NBN:fi:au:hklj:
narrower: Suomi
notation: 996
related: Pelastusoppi. Kristillinen antropologia
related: URN:NBN:fi:au:hklj:323
related: Poliittiset ja aatteelliset vähemmistöt
related: URN:NBN:fi:au:hklj:617
related: URN:NBN:fi:au:hklj:618.24
related: URN:NBN:fi:au:hklj:618.3
related: URN:NBN:fi:au:hklj:909
related: URN:NBN:fi:au:hklj:919
related: Filosofit. Psykologit. Kasvatustieteiden edustajat
related: Yhteiskuntaelämän, joukkotiedotuksen, liikenteen ja maanpuolustuksen edustajat
related: URN:NBN:fi:au:hklj:996.03
related: Sukuhistoria. Sukututkimus
scope note: Tässä esim. lääkäreiden, sairaanhoitajien, psykiatrien, eläinlääkärien, insinöörien, keksijöiden, yrittäjien, teollisuuden, pankkien, kaupan ja vakuutusalan edustajien, talous- ja tuotantoelämän edustajien, taloustieteilijöiden, käsityöammattien harjoittajien, ravitsemusalan, kauneudenhoidon sekä maa- ja metsätalouden edustajien henkilöhistoria Eri sairauksia, niistä paranemista tai kuolemista koskevat muistelmat ja henkilöhistorialliset teokset kohdehenkilön edustaman alan tai ammatin mukaan luokissa 990-997+
scope note: Hit personhistoria som rör t.ex. läkare, sjukskötare, psykiatrer, veterinärer, ingenjörer, uppfinnare, företagare, företrädare för industri, banker, handel och försäkringsverksamhet, företrädare för näringsliv och produktion, ekonomer, hantverkare och företrädare för restaurangbranschen, skönhetsvård samt lantbruk och skogsbruk Memoarer och personhistoriska verk som handlar om olika sjukdomar och tillfrisknande från dem eller dessa sjukdomar som dödsorsak, förs enligt det område eller yrke som den biograferade personen representerar till klasserna 990-997+ @sv

Dravidakielten kaunokirjallisuus (Kaunoluokka)
type: Class
type: Concept
type: FormClass
subclass of: Muiden aasialaisten, australialaisten ja oseanialaisten kielten kaunokirjallisuus (Kaunoluokka)
broader: Muiden aasialaisten, australialaisten ja oseanialaisten kielten kaunokirjallisuus (Kaunoluokka)
in scheme: URN:NBN:fi:au:hklj:
narrower: Malajalaminkielinen kaunokirjallisuus (Kaunoluokka)
narrower: Tamilinkielinen kaunokirjallisuus (Kaunoluokka)
narrower: Kannadankielinen kaunokirjallisuus (Kaunoluokka)
narrower: Telugunkielinen kaunokirjallisuus (Kaunoluokka)
notation: 9.976
preferred label: Dravidian fiction (Fiction class) @en
preferred label: Skönlitteratur på dravidiska språk (Skönklass) @sv

Kaunoluokat
type: Class
type: Concept
type: FormClass
in scheme: URN:NBN:fi:au:hklj:
narrower: SUOMENKIELINEN KAUNOKIRJALLISUUS (Kaunoluokka)
narrower: RUOTSINKIELINEN KAUNOKIRJALLISUUS (Kaunoluokka)
narrower: SAKSANKIELINEN KAUNOKIRJALLISUUS (Kaunoluokka)
narrower: ENGLANNINKIELINEN KAUNOKIRJALLISUUS (Kaunoluokka)
narrower: RANSKANKIELINEN KAUNOKIRJALLISUUS (Kaunoluokka)
narrower: ITALIANKIELINEN KAUNOKIRJALLISUUS (Kaunoluokka)
narrower: ESPANJANKIELINEN KAUNOKIRJALLISUUS (Kaunoluokka)
narrower: VENÄJÄNKIELINEN KAUNOKIRJALLISUUS (Kaunoluokka)
narrower: MUIDEN KIELTEN KAUNOKIRJALLISUUS (Kaunoluokka)
preferred label: Fiction classes @en
preferred label: Skönklasser @sv
top concept of: URN:NBN:fi:au:hklj:

Sairaalakirjastot
type: Class
type: Concept
subclass of: Erityisten väestöryhmien kirjastopalvelut
alternative label: Kirjastot, sairaalakirjastot (024.41)
alternative label: Potilaskirjastot (024.41)
alternative label: Sairaalakirjastot (024.41)
alternative label: Bibliotek, sjukhusbibliotek (024.41) @sv
alternative label: Patientbibliotek (024.41) @sv
alternative label: Sjukhusbibliotek (024.41) @sv
broader: Erityisten väestöryhmien kirjastopalvelut
in scheme: URN:NBN:fi:au:hklj:
notation: 024.41
preferred label: Library service for special population-groups @en
preferred label: Sjukhusbibliotek @sv
related: URN:NBN:fi:au:hklj:018
related: Kirjastoaineisto. Kokoelmatyö
related: Valinta ja hankinta
related: Luettelointi
related: Sisällönkuvailu
related: Muu kuin kirja-aineisto kirjastossa
related: Kirjaston käyttö. Kirjastososiologia
related: Lainaus
related: Tietopalvelu. Informaatiopalvelu
related: Kirjastonkäytön opastus
related: Yleiset kirjastot
related: Erikoiskirjastot. Yhdistysten, laitosten ja yritysten kirjastot
related: URN:NBN:fi:au:hklj:028
related: Dokumentaatio ja informaatiopalvelu yleensä
related: Museonhoito
related: Arkistonhoito
related: URN:NBN:fi:au:hklj:061
related: URN:NBN:fi:au:hklj:063
scope note: Sairaalakirjastot ja sairaalakirjastotyö yleensä
scope note: Sjukhusbibliotek och sjukhusbiblioteksverksamhet i allmänhet @sv

Paikalliskokoelmat
type: Class
type: Concept
subclass of: Erikoiskokoelmat
alternative label: Kotiseutukokoelmat, kirjastot (024.51)
alternative label: Paikalliskokoelmat, kirjastot (024.51)
alternative label: Hembygdssamlingar, bibliotek (024.51) @sv
alternative label: Lokalsamlingar, bibliotek (024.51) @sv
broader: Erikoiskokoelmat
in scheme: URN:NBN:fi:au:hklj:
notation: 024.51
preferred label: Special collections @en
preferred label: Lokala samlingar @sv
related: URN:NBN:fi:au:hklj:018
related: Kirjastoaineisto. Kokoelmatyö
related: Valinta ja hankinta
related: Luettelointi
related: Sisällönkuvailu
related: Muu kuin kirja-aineisto kirjastossa
related: Kirjaston käyttö. Kirjastososiologia
related: Lainaus
related: Tietopalvelu. Informaatiopalvelu
related: Kirjastonkäytön opastus
related: Yleiset kirjastot
related: Erikoiskirjastot. Yhdistysten, laitosten ja yritysten kirjastot
related: URN:NBN:fi:au:hklj:028
related: Dokumentaatio ja informaatiopalvelu yleensä
related: Museonhoito
related: Arkistonhoito
related: URN:NBN:fi:au:hklj:061
related: URN:NBN:fi:au:hklj:063
scope note: Paikalliskokoelmia koskevat yleisteokset
scope note: Allmänna verk som rör lokala samlingar @sv

Musiikkikirjastot
type: Class
type: Concept
subclass of: Erikoiskokoelmat
alternative label: AV-aineisto, musiikkikirjastotyö (024.52)
alternative label: Audiovisuaalinen aineisto, musiikkikirjastotyö (024.52)
alternative label: CD-levyt, musiikkikirjastotyö (024.52)
alternative label: CD-äänilevyt, musiikkikirjastotyö (024.52)
alternative label: Kasetit, musiikkikirjastotyö (024.52)
alternative label: Kirjastot, musiikkikirjastot (024.52)
alternative label: Kokoelmatyö, musiikkikirjastotyö (024.52)
alternative label: Kompaktilevyt, musiikkikirjastotyö (024.52)
alternative label: Laserlevyt, musiikkikirjastotyö (024.52)
alternative label: Musiikkiaineisto, musiikkikirjastotyö (024.52)
alternative label: Musiikkikirjastot (024.52)
alternative label: Musiikkikirjastotyö (024.52)
alternative label: Musiikkikirjat, musiikkikirjastotyö (024.52)
alternative label: Musiikkiosastot (024.52)
alternative label: Musiikkivideot, musiikkikirjastotyö (024.52)
alternative label: Partituurit, musiikkikirjastotyö (024.52)
alternative label: SACD-levyt, musiikkikirjastotyö (024.52)
alternative label: Super audio compact discs, musiikkikirjastotyö (024.52)
alternative label: Tallenteet, kirjastoaineistot, musiikki (024.52)
alternative label: AV-material, musikbiblioteksarbete (024.52) @sv
alternative label: Audiovisuellt material, musikbiblioteksarbete (024.52) @sv
alternative label: Beståndsutveckling, musikbiblioteksarbete (024.52) @sv
alternative label: Bibliotek, musikbibliotek (024.52) @sv
alternative label: CD-grammofonskivor, musikbiblioteksarbete (024.52) @sv
alternative label: CD-skivor, musikbiblioteksarbete (024.52) @sv
alternative label: Kassetter, musikbiblioteksarbete (024.52) @sv
alternative label: Kompaktskivor, musikbiblioteksarbete (024.52) @sv
alternative label: Laserskivor, musikbiblioteksarbete (024.52) @sv
alternative label: Musikavdelningar (024.52) @sv
alternative label: Musikbibliotek (024.52) @sv
alternative label: Musikbiblioteksarbete (024.52) @sv
alternative label: Musikböcker, musikbiblioteksarbete (024.52) @sv
alternative label: Musikmedier, musikbiblioteksarbete (024.52) @sv
alternative label: Musikvideor, musikbiblioteksarbete (024.52) @sv
alternative label: Partitur, musikbiblioteksarbete (024.52) @sv
alternative label: SACD-skivor, musikbiblioteksarbete (024.52) @sv
alternative label: Super audio compact discs, musikbiblioteksarbete (024.52) @sv
alternative label: Upptagningar, biblioteksmedier, musik (024.52) @sv
broader: Erikoiskokoelmat
in scheme: URN:NBN:fi:au:hklj:
notation: 024.52
preferred label: Local collections @en
preferred label: Musikbibliotek @sv
related: URN:NBN:fi:au:hklj:018
related: Kirjastoaineisto. Kokoelmatyö
related: Luettelointi
related: Sisällönkuvailu
related: Muu kuin kirja-aineisto kirjastossa
related: Kirjaston käyttö. Kirjastososiologia
related: Lainaus
related: Tietopalvelu. Informaatiopalvelu
related: Muu kirjastotoiminta
related: Kirjastonkäytön opastus
related: Yleiset kirjastot
related: Erikoiskirjastot. Yhdistysten, laitosten ja yritysten kirjastot
related: URN:NBN:fi:au:hklj:028
related: Dokumentaatio ja informaatiopalvelu yleensä
related: Museonhoito
related: Arkistonhoito
related: URN:NBN:fi:au:hklj:061
related: URN:NBN:fi:au:hklj:063
scope note: Musiikkikirjastot ja musiikkikirjastotyö Kirjastojen musiikkiosastot. Musiikkiaineisto kirjastossa Musiikkikirjaston kokoelmatyö Kirjaston nuotti-, partituuri-, musiikkiäänite-, musiikkikirja-, musiikkivideo- ja musiikki-DVD -kokoelmien valinta, hankinta, hoito ja ylläpito Musiikin kuuntelu kirjastossa Musiikkiesitysten järjestäminen kirjastossa
scope note: Musikbibliotek och musikbiblioteksverksamhet Bibliotekens musikavdelningar. Musikmedierna i bibliotek Arbete med samlingarna i musikbiblioteken Val, anskaffning, skötsel och underhåll av bibliotekens not-, partitur och musikboksamlingar samt samlingar av musikinspelningar, musikvideor och musik-dvd-skivor Musikavlyssning i bibliotek Anordnande av musiktillställningar på bibliotek @sv

Kirjastoautot. Kirjastoveneet
type: Class
type: Concept
subclass of: Yleisönpalvelu
alternative label: Kirjastoautot, kirjastotoiminta (024.6)
alternative label: Kirjastoveneet, kirjastovenetoiminta (024.6)
alternative label: Bokbussar, biblioteksverksamhet (024.6) @sv
alternative label: Bokbåtar, bokbåtsverksamhet (024.6) @sv
broader: Yleisönpalvelu
in scheme: URN:NBN:fi:au:hklj:
notation: 024.6
preferred label: Mobile libraries (including boats) @en
preferred label: Bokbussar. Bokbåtar @sv
related: URN:NBN:fi:au:hklj:018
related: Kirjastoaineisto. Kokoelmatyö
related: Valinta ja hankinta
related: Luettelointi
related: Sisällönkuvailu
related: Muu kuin kirja-aineisto kirjastossa
related: Kirjaston käyttö. Kirjastososiologia
related: Lainaus
related: Tietopalvelu. Informaatiopalvelu
related: Kirjastonkäytön opastus
related: Yleiset kirjastot
related: Erikoiskirjastot. Yhdistysten, laitosten ja yritysten kirjastot
related: URN:NBN:fi:au:hklj:028
related: Dokumentaatio ja informaatiopalvelu yleensä
related: Museonhoito
related: Arkistonhoito
related: URN:NBN:fi:au:hklj:061
related: URN:NBN:fi:au:hklj:063
scope note: Kirjastoauto- tai kirjastovenetoimintaa koskevat yleisteokset
scope note: Allmänna verk som rör bokbuss- eller bokbåtsverksamhet @sv

Tiedepolitiikka. Tieteen sosiologia
type: Class
type: Concept
subclass of: TIEDEOPPI
alternative label: Aivovienti, tiedepolitiikka (152)
alternative label: Aivovuoto, tiedepolitiikka (152)
alternative label: Ajatushautomot , tiedepolitiikka (152)
alternative label: Ajatusmyllyt, tiedepolitiikka (152)
alternative label: Ajatuspajat, tiedepolitiikka (152)
alternative label: Apurahat, tiede ja tutkimus (152)
alternative label: Diskurssi, tieteellinen diskurssi (152)
alternative label: Doktriinit, tiedepolitiikka (152)
alternative label: Gender-tutkimus, tiedepolitiikka (152)
alternative label: Henkinen pääoma, tiedepolitiikka (152)
alternative label: Huippututkimus, tiedepolitiikka (152)
alternative label: Huippuyksiköt, tiedepolitiikka (152)
alternative label: Humanistiset tieteet, tiedepolitiikka (152)
alternative label: Ihmistieteet, tiedepolitiikka (152)
alternative label: Inhimillinen pääoma, tiedepolitiikka (152)
alternative label: Kirjoitettu sana, tieteellinen julkaisutoiminta (152)
alternative label: Know-how, tiedepolitiikka (152)
alternative label: Koeasemat, tiede (152)
alternative label: Koulukunnat, tiedepolitiikka (152)
alternative label: Laatuyksiköt, tiedepolitiikka (152)
alternative label: Lahjoittajat, tieteen rahoitus (152)
alternative label: Mentorointi, tiedeyhteisö (152)
alternative label: Mesenaatit, tieteen rahoitus (152)
alternative label: Miestutkimus, tiedepolitiikka (152)
alternative label: Monialaisuus, tiedepolitiikka (152)
alternative label: Naistutkimus, tiedepolitiikka (152)
alternative label: Opinnäytetyöt, tiedepolitiikka (152)
alternative label: Opinnäytteet, tiedepolitiikka (152)
alternative label: Osaaminen, tiedepolitiikka (152)
alternative label: Osaamiskeskukset, tiedepolitiikka (152)
alternative label: Osaamispääoma, tiedepolitiikka (152)
alternative label: Perustutkimus, tiedepolitiikka (152)
alternative label: Polemiikki, tieteellinen keskustelu (152)
alternative label: Populaarikirjallisuus, tieteen popularisointi (152)
alternative label: Popularisointi (152)
alternative label: Pseudotiede, tiedepolitiikka (152)
alternative label: R&D (152)
alternative label: R&D, tutkimuspolitiikka (152)
alternative label: Rahoittajat, tieteen rahoitus (152)
alternative label: Raportointi, tutkimustoiminta (152)
alternative label: Rinnakkaisjulkaiseminen, tieteellinen julkaisutoiminta (152)
alternative label: Sektoritutkimus, tiedepolitiikka (152)
alternative label: Soveltava tutkimus, tutkimuspolitiikka (152)
alternative label: Sponsorointi, tiede ja tutkimus (152)
alternative label: Stipendiaatit, tiede ja tutkimus (152)
alternative label: Stipendit, tiede ja tutkimus (152)
alternative label: Sukupuoli, naistutkimus (152)
alternative label: Sukupuolitutkimus, tiedepolitiikka (152)
alternative label: T&K (152)
alternative label: T&K, tutkimuspolitiikka (152)
alternative label: Taitotieto, tiedepolitiikka (152)
alternative label: Think tankit, tiedepolitiikka (152)
alternative label: Tiedehallinto (152)
alternative label: Tiedeinstituutit (152)
broader: TIEDEOPPI
in scheme: URN:NBN:fi:au:hklj:
notation: 152
related: URN:NBN:fi:au:hklj:060
related: URN:NBN:fi:au:hklj:061
related: URN:NBN:fi:au:hklj:063
related: URN:NBN:fi:au:hklj:184
related: Turun akatemia
related: Helsingin yliopisto
related: Turun yliopisto
related: Åbo akademi
related: Jyväskylän yliopisto
related: Oulun yliopisto
related: Tampereen yliopisto
related: Muut yliopistot ja korkeakoulut
related: Teknilliset korkeakoulut
related: Kauppakorkeakoulut
related: Muiden maiden yliopistot ja korkeakoulut
related: URN:NBN:fi:au:hklj:320
related: Naisen ja miehen asema yhteiskunnassa
related: LUONNONTIETEET
scope note: Tiede- ja tutkimuspolitiikka yleensä Tieteellisen tutkimuksen organisaatio, rahoitus ja suuntaaminen Tieteen, tiedeyhteisön ja tutkimustyön sosiologia Tutkijakoulutus tiedepoliittisena kysymyksenä Tieteen popularisointi Tieteen yhteiskunnallinen kontrolli Tieteen riippumattomuus. Tieteen sensurointi Tieteen suhteet tuotantoon ja talouselämään Naistutkimusta yleensä koskevat teokset Naisen asema tiedeyhteisössä Tässä myös humanististen tieteiden yleinen tiedepolitiikka ja -sosiologia Erikoisalojen tiedepolitiikka ja tieteen sosiologia alan mukaisessa luokassa
scope note: Vetenskaps- och forskningspolitik i allmänhet Organisation, finansiering och inriktning av vetenskaplig forskning Vetenskapens, det vetenskapliga samfundets och forskningsarbetets sociologi Forskarutbildning som vetenskapspolitisk fråga Popularisering av vetenskap Samhällets kontroll av vetenskapen Vetenskapens oberoende. Censur av vetenskap Vetenskapens förhållande till produktion och näringsliv Verk som rör kvinnoforskning i allmänhet Kvinnans ställning i det vetenskapliga samfundet Hit också allmän vetenskapspolitik och vetenskapssociologi inom de humanistiska vetenskaperna Specialområden inom vetenskapspolitik och vetenskapssociologi klassificeras enligt område @sv

Käytännön kasvatus
type: Class
type: Concept
subclass of: KASVATUS. OPETUS. KASVATUSTIEDE
alternative label: Autoritaarisuus, kasvatusoppaat (181 +)
alternative label: Identtiset kaksoset, kasvatus (181 +)
alternative label: Kaksoset, kasvatus (181 +)
alternative label: Käytännöllinen kasvatus (181)
alternative label: Psykososiaaliset tekijät, koti- ja perhekasvatus (181)
alternative label: Yksityisopetus, erityisopetus (181 +)
alternative label: Auktoritär personlighet, uppfostran, handböcker (181 +) @sv
alternative label: Identiska tvillingar, fostran (181 +) @sv
alternative label: Praktisk fostran (181) @sv
alternative label: Privatundervisning, specialundervisning (181 +) @sv
alternative label: Psykosociala faktorer, hem- och familjefostran (181) @sv
alternative label: Tvillingar, fostran (181 +) @sv
broader: KASVATUS. OPETUS. KASVATUSTIEDE
in scheme: URN:NBN:fi:au:hklj:
narrower: Kokeellinen kasvatus
narrower: Kasvatusneuvonta. Kasvatusneuvolat
narrower: Perhe- ja kotikasvatus
narrower: URN:NBN:fi:au:hklj:181.7
narrower: Erityislahjakkaiden opetus
narrower: URN:NBN:fi:au:hklj:181.9
notation: 181
preferred label: Practical pedagogy @en
preferred label: Praktisk pedagogik @sv
related: Lapsuuden ja nuoruuden psykologia
related: Kasvatusfilosofia. Kasvatustavoitteet
related: Kasvatuspsykologia
related: URN:NBN:fi:au:hklj:182
related: URN:NBN:fi:au:hklj:183.5
related: URN:NBN:fi:au:hklj:183.7
scope note: Tässä ja alaluokissa käytännön kasvatusohjeet Tässä teokset, jotka koskevat sekä koti- että koulukasvatusta Jos teoksessa on sekä käytännön kasvatusohjeita että lapsipsykologiaa tai kasvatuspsykologiaa, on etusija luokalla 181+
scope note: Hit och till underklasserna praktiska uppfostringsråd Hit verk som rör både hem- och skoluppfostran Om verket innehåller både praktiska uppfostringsråd och barnpsykologi eller pedagogisk psykologi ges företräde åt klass 181+ @sv

Peruskoulut
type: Class
type: Concept
subclass of: URN:NBN:fi:au:hklj:183
alternative label: Ala-asteet, peruskoulu (183.4)
alternative label: Alakoulu (183.4)
alternative label: Alkeiskoulut, peruskoulu (183.4)
alternative label: Harjoittelukoulut, peruskoulut (183.4)
alternative label: Inkluusio, koulutus, peruskoulu (183.4)
alternative label: Kansakoulu (183.4)
alternative label: Kansalaiskoulu (183.4)
alternative label: Koulupudokkaat, peruskoulu (183.4)
alternative label: Koulutulokkaat, peruskoulu (183.4)
alternative label: Koulutusasteet, peruskoulu (183.4)
alternative label: Koulutuspolitiikka, peruskoulu (183.4)
alternative label: Koulutussuunnittelu, peruskoulu (183.4)
alternative label: Koulutustarve, peruskoulu (183.4)
alternative label: Koulutustaso, peruskoulu (183.4)
alternative label: Koulutustausta, peruskoulu (183.4)
alternative label: Koulutusvalinnat, peruskoulu (183.4)
alternative label: Liikuntaluokat, peruskoulu (183.4)
alternative label: Lisäluokat, peruskoulu (183.4)
alternative label: Lukujärjestykset, peruskoulut (183.4)
alternative label: Lukukaudet, peruskoulut (183.4)
alternative label: Lukuvuosi, peruskoulut (183.4 +)
alternative label: Luokanopettajat, peruskoulu (183.4)
alternative label: Luokaton opetus, peruskoulu (183.4)
alternative label: Musiikkiluokat, peruskoulu (183.4)
alternative label: Normaalikoulut, peruskoulut (183.4)
alternative label: Normaalilyseot, peruskoulut (183.4)
alternative label: Opintojen keskeyttäminen, peruskoulu (183.4)
alternative label: Opintojen kesto, peruskoulu (183.4)
alternative label: PIAAC-tutkimus (183.4)
alternative label: PISA-tutkimus (183.4)
alternative label: Perusasteen koulutus (183.4)
alternative label: Peruskoulu (183.4)
alternative label: Peruskoulun ala-aste (183.4)
alternative label: Peruskoulun lisäluokat (183.4)
alternative label: Peruskoulun yläaste (183.4)
alternative label: Peruskoulutus, peruskoulu (183.4)
alternative label: Perusopetus, peruskoulu (183.4)
alternative label: Programme for International Students Assessment -tutkimus (183.4)
alternative label: Reaaliaineet, peruskoulu (183.4)
alternative label: Todistukset, koululaitos, opintomenestys, peruskoulut (183.4)
alternative label: Urheiluluokat, peruskoulu (183.4)
alternative label: Vuosiluokkiin sitomaton opetus, peruskoulu (183.4)
alternative label: Yhtenäiskoulujärjestelmä (183.4)
alternative label: Yhtenäiskoulut (183.4)
alternative label: Yläasteet, peruskoulu (183.4)
alternative label: Basundervisning, grundskola (183.4) @sv
alternative label: Betyg, studieframgång, grundskolor (183.4) @sv
alternative label: Elementarskolor, grundskolan (183.4) @sv
alternative label: Enhetsskolor (183.4) @sv
alternative label: Enhetsskolsystem (183.4) @sv
alternative label: Folkskolan (183.4) @sv
alternative label: Grundskolan (183.4) @sv
alternative label: Grundskolans högstadium (183.4) @sv
alternative label: Grundskolans lågstadium (183.4) @sv
broader: URN:NBN:fi:au:hklj:183
in scheme: URN:NBN:fi:au:hklj:
notation: 183.4
related: URN:NBN:fi:au:hklj:181.7
related: URN:NBN:fi:au:hklj:181.9
related: Luku-, kirjoitus- ja puhehäiriöiset
related: Kuulovammaiset
related: Näkövammaiset
related: Liikuntavammaiset
related: Kehitysvammaiset
related: URN:NBN:fi:au:hklj:182
related: URN:NBN:fi:au:hklj:183.403
related: URN:NBN:fi:au:hklj:183.409
related: URN:NBN:fi:au:hklj:183.5
related: URN:NBN:fi:au:hklj:183.7
related: URN:NBN:fi:au:hklj:184
related: Oppikirjat. Oppaat. Harjoituskirjat. Tehtäväkokoelmat
related: URN:NBN:fi:au:hklj:330
related: Asiakirjakaavat ja -ohjeet. Oikeusoppaat
related: URN:NBN:fi:au:hklj:340
related: URN:NBN:fi:au:hklj:345
scope note: Peruskoulun ala- sekä yläkoulut. Tässä myös kansakoulut Peruskoulun leirikoulut ja vaihto-oppilastoiminta
scope note: Grundskolans låg- och högstadier. Hit också folkskolor Grundskolans lägerskolor och elevutbyte @sv

Enkelit. Paholaiset. Demonit
type: Class
type: Concept
subclass of: KRISTILLINEN DOGMATIIKKA
alternative label: Antikristus, kristillinen dogmatiikka (235)
alternative label: Arkkienkelit, kristinusko (235)
alternative label: Demonit, kristinusko (235)
alternative label: Eksorkismi, kristinusko (235)
alternative label: Eksorsismi, kristinusko (235)
alternative label: Eksorskismi, kristinusko (235)
alternative label: Enkelit, kristinusko (235)
alternative label: Henkimaailma, kristillinen dogmatiikka (235)
alternative label: Ilmestykset, kristinusko, enkelit (235)
alternative label: Manaus, kristinusko (235)
alternative label: Pahat henget, kristinusko (235)
alternative label: Paholainen, kristillinen dogmatiikka (235)
alternative label: Piru, kristillinen dogmatiikka (235)
alternative label: Riivaajat, kristinusko (235)
alternative label: Saatana, kristinusko (235)
alternative label: Sielunvihollinen (235)
alternative label: Yliluonnolliset olennot, kristillinen dogmatiikka (235)
alternative label: Andevärlden, kristen dogmatik (235) @sv
alternative label: Antikrist, kristen dogmatik (235) @sv
alternative label: Apokalypser, kristendom, änglar (235) @sv
alternative label: Besvärjelse, kristendom (235) @sv
alternative label: Demoner, kristendom (235) @sv
alternative label: Demoner, riivaajat, kristendom (235) @sv
alternative label: Djävulen, kristen dogmatik (235) @sv
alternative label: Exorcism, kristendom (235) @sv
alternative label: Fan, kristen dogmatik (235) @sv
alternative label: Onda andar, kristendom (235) @sv
alternative label: Satan, kristendom (235) @sv
alternative label: Själafiende (235) @sv
alternative label: Änglar, kristendom (235) @sv
alternative label: Ärkeänglar, kristendom (235) @sv
alternative label: Övernaturliga väsen, kristen dogmatik (235) @sv
broader: KRISTILLINEN DOGMATIIKKA
in scheme: URN:NBN:fi:au:hklj:
notation: 235
preferred label: Angels. Devils. Demons @en
preferred label: Änglar. Djävlar. Demoner @sv
related: Uskonnonfilosofia
related: URN:NBN:fi:au:hklj:209
related: URN:NBN:fi:au:hklj:280
related: Itä-Aasian uskonnot ja mytologiat
related: Intian uskonnot ja mytologiat
related: Buddhalaisuus ja sen mytologia
related: Muinais-Egyptin ja Etu-Aasian uskonnot ja mytologiat
related: Antiikin Kreikan ja Rooman uskonnot ja mytologiat
related: Persian uskonnot ja mytologiat
related: Islam ja sen mytologia
related: Juutalaisten uskonto ja sen mytologia
related: Muut uskonnot ja mytologiat
related: Afrikan alkuperäiskansojen uskonnot
related: Amerikan alkuperäiskansojen uskonnot ja mytologiat
related: Australian ja Oseanian alkuperäiskansojen uskonnot ja mytologiat
related: Muinaissuomalaiset ja suomalais-ugrilaiset uskonnot ja mytologiat
related: Muinaisgermaaniset, -balttilaiset, -slaavilaiset ja -kelttiläiset uskonnot ja mytologiat
related: Muinaispohjoismaiset uskonnot ja mytologiat
scope note: Enkelit, paholaiset ja demonit kristinuskon kannalta
scope note: Änglar, djävlar och demoner ur kristendomens synvinkel @sv

Hartauskirjat
type: Class
type: Concept
subclass of: KÄYTÄNNÖLLINEN TEOLOGIA
alternative label: Aamuhartaudet, kristilliset (242)
alternative label: Hartauskirjat, kristilliset (242)
alternative label: Hengellinen elämä, hartauskirjat, kristilliset (242)
alternative label: Hymnografia (242 +)
alternative label: Kristillinen kirjallisuus, hartauskirjat (242)
alternative label: Lohduttaminen, hartauskirjat, kristilliset (242)
alternative label: Lohdutus, hartauskirjat, kristilliset (242)
alternative label: Päivänsanat (242)
alternative label: Toivo, hartauskirjallisuus (242)
alternative label: Uskonelämä, hartauskirjat, kristilliset (242)
alternative label: Uskonnollinen kirjallisuus, hartauskirjat (242)
alternative label: Andaktsböcker, kristna (242) @sv
alternative label: Andligt liv, andaktsböcker, kristliga (242) @sv
alternative label: Dagens ord (242) @sv
alternative label: Hopp, religion, andaktslitteratur (242) @sv
alternative label: Hymnografi (242 +) @sv
alternative label: Kristen litteratur, andaktsböcker (242) @sv
alternative label: Morgonandakter, kristna (242) @sv
alternative label: Religiös litteratur, andaktsböcker (242) @sv
alternative label: Trosliv, andaktsböcker, kristliga (242) @sv
alternative label: Tröst, andaktsböcker, kristna (242) @sv
broader: KÄYTÄNNÖLLINEN TEOLOGIA
in scheme: URN:NBN:fi:au:hklj:
narrower: Rukouskirjat
notation: 242
preferred label: Devotional books @en
preferred label: Andaktslitteratur @sv
related: URN:NBN:fi:au:hklj:210
related: Esseet
related: Virsikirjat ja hengelliset laulukirjat
related: Sielunhoito
related: Henkilökohtainen hartaudenharjoitus
related: Saarnat. Postillat. Kristilliset puhe- ja päivänavauskokoelmat
related: URN:NBN:fi:au:hklj:260
related: Kristillisten kirkkojen musiikki
related: Protestanttinen musiikki
related: Virret. Hengelliset laulut
related: URN:NBN:fi:au:hklj:787.112
related: Spirituaalit. Gospel-musiikki
related: Roomalaiskatolinen musiikki
related: Ortodoksinen musiikki
related: Muiden kristillisten kirkkojen musiikki
scope note: Päivänsanat. Aamuhartaudet. Iltahartaudet
scope note: Ord för dagen. Morgonandakter. Kvällsandakter. @sv

Kirkolliset juhlat ja juhlapäivät
type: Class
type: Concept
subclass of: EVANKELIS-LUTERILAINEN KIRKKO
alternative label: Adventti, ev.-lut. kirkko (252)
alternative label: Adventtiaika, ev.-lut. kirkko (252)
alternative label: Helatorstai, ev.-lut. kirkko (252)
alternative label: Helluntai, ev.-lut. kirkko (252)
alternative label: Joulu, kirkko, ev.-lut. (252)
alternative label: Juhlapäivät, kirkolliset, ev.-lut. (252)
alternative label: Juhlat, kirkolliset, ev.-lut. (252)
alternative label: Kirkkovuosi, ev.-lut. kirkko (252)
alternative label: Kirkolliset juhlat, ev.-lut. kirkko (252)
alternative label: Kirkolliset vuotuisjuhlat, ev.-lut. kirkko (252)
alternative label: Kulkueet, kirkolliset, ev.-lut. (251 ... 252)
alternative label: Kynttilänpäivä, vuotuisjuhlat, kirkkovuosi, ev.-lut. (252)
alternative label: Loppiainen, ev.-lut. kirkko (252)
alternative label: Lucian päivä, ev.-lut. kirkko (252)
alternative label: Paastonaika, ev.-lut. kirkko (252)
alternative label: Pääsiäinen, kirkko, ev.-lut. (252)
alternative label: Uskonnolliset juhlat, kristilliset, ev.-lut. (252)
alternative label: Uskonnolliset kulkueet, kristilliset, ev.-lut. (251 ... 252)
alternative label: Viattomien lasten päivä, vuotuisjuhlat, kirkkovuosi, ev.-lut. (252)
alternative label: Vuosi, kirkkovuosi, ev.-lut. (252)
alternative label: Vuotuisjuhlat, kirkkovuosi, ev.-lut. (252)
alternative label: Advent, ev.luth. kyrka (252) @sv
alternative label: Adventstiden, ev.luth. kyrka (252) @sv
alternative label: Fastetid, ev.luth. kyrkan (252) @sv
alternative label: Fester, kyrkliga, ev.luth. (252) @sv
alternative label: Högtider, kyrkliga, ev.luth. (252) @sv
alternative label: Jul, kyrkan, ev.luth. (252) @sv
alternative label: Kristi himmelsfärdsdag, ev.luth. kyrkan (252) @sv
alternative label: Kyndelsmässodagen, årets fester, kyrkoåret, ev.luth. (252) @sv
alternative label: Kyrkliga fester, ev.luth. kyrkan (252) @sv
alternative label: Kyrkliga högtider, ev.luth. kyrkan (252) @sv
alternative label: Kyrkliga processioner, kristna, ev.luth (251 ... 252) @sv
alternative label: Kyrkoåret, ev.luth. kyrkan (252) @sv
alternative label: Lucia, ev.luth. kyrkan (252) @sv
alternative label: Menlösa barns dag, årets fester, kyrkoåret, ev.luth. (252) @sv
alternative label: Pingst, ev.luth. kyrkan (252) @sv
alternative label: Processioner, kyrkliga, ev.luth. (251 ... 252) @sv
alternative label: Påsk, kyrkan, ev.luth. (252) @sv
alternative label: Religiösa fester, kristna, ev.luth (252) @sv
alternative label: Trettondag, ev.luth. kyrka (252) @sv
alternative label: År, kyrkoåret, ev.luth. (252) @sv
alternative label: Årets fester, kyrkoåret, ev.luth. (252) @sv
broader: EVANKELIS-LUTERILAINEN KIRKKO
in scheme: URN:NBN:fi:au:hklj:
notation: 252
preferred label: Church feasts and festivals @en
preferred label: Kyrkliga fester och högtider @sv
related: Sakramentit. Kirkolliset toimitukset
related: Saarnat. Postillat. Kristilliset puhe- ja päivänavauskokoelmat
related: URN:NBN:fi:au:hklj:260
related: Juhlien järjestäminen
related: URN:NBN:fi:au:hklj:473.1
related: Kotijuhlien järjestäminen. Kutsujen järjestäminen
related: Afrikka
related: Pohjois-Afrikka
related: Länsi-Afrikka
related: Keski-Afrikka
related: Itä-Afrikka
related: Etelä-Afrikka
related: Afrikan saaret
related: URN:NBN:fi:au:hklj:787.3
related: URN:NBN:fi:au:hklj:787.31
related: URN:NBN:fi:au:hklj:787.311
related: URN:NBN:fi:au:hklj:787.32
related: URN:NBN:fi:au:hklj:787.34
scope note: Kirkolliset juhlat ja juhlapäivät ev.-lut. kirkon toiminnan kannalta
scope note: Kyrkliga fester och högtider som en del av den evangelisk-lutherska kyrkans verksamhet @sv

KIRKKOHISTORIA
type: Class
type: Concept
subclass of: YLEINEN USKONTOTIEDE. YLEINEN USKONNONFILOSOFIA
alternative label: Anakoreetit, kirkkohistoria (270 ... 279 +)
alternative label: Eettinen kasvatus, kristillinen kasvatus, muut kristilliset yhteisöt (260 ... 369)
alternative label: Erakot, kirkkohistoria (270 ... 279 +)
alternative label: Eremiitit, kirkkohistoria (270 ... 279 +)
alternative label: Esireformatoriset liikkeet, uskonpuhdistuksen historia (270 ... 279 +)
alternative label: Hagiografia, kirkkohistoria (270 ... 279 +)
alternative label: Harhaoppisuus, kirkkohistoria (270 ... 279 +)
alternative label: Hengellinen herätys, herätysliikkeet, ev.-lut. (270 ... 279 +)
alternative label: Herätys, herätysliikkeet, ev.-lut. (270 ... 279 +)
alternative label: Herätysliikkeet, ev.-lut. (270 ... 279 +)
alternative label: Hurmoksellisuus, herätysliikkeet, ev.-lut. (270 ... 279 +)
alternative label: Hussilaiset, uskonpuhdistuksen historia (270 ... 279 +)
alternative label: Ikonoklasmi, kirkkohistoria (270 ... 279 +)
alternative label: Jeesus-liike (270 ... 279 +)
alternative label: Karismaattiset liikkeet (270 ... 279 +)
alternative label: Kastajaliikkeet, herätysliikkeet, ev.-lut. (270 ... 379 +)
alternative label: Kastajaliikkeet, kirkkohistoria (270 ... 379 +)
alternative label: Kirkkohistoria (270 ... 279 +)
alternative label: Kirkkohistoria, ev.-lut. kirkko (270 ... 279 +)
alternative label: Kristinusko, historia (270)
alternative label: Kristinusko, kirkkohistoria (270 ... 279 +)
alternative label: Kuvainpalvonta, kirkkohistoria (270 ... 279 +)
alternative label: Kuvainraasto, kirkkohistoria (270 ... 279 +)
alternative label: Luostarilaitos, kirkkohistoria (270 ... 279 +)
alternative label: Luostarit, kirkkohistoria (270 ... 279 +)
alternative label: Maailmanuskonnot, kristinusko (210 ... 279 +)
alternative label: Marttyyrit, kirkkohistoria (270 ... 279 +)
alternative label: Munkkijärjestöt, kirkkohistoria (270 ... 279 +)
alternative label: Mystikot, kirkkohistoria (270 ... 279 +)
alternative label: Nauruherätys (270 ... 279 +)
alternative label: Nunnajärjestöt, kirkkohistoria (270 ... 279 +)
alternative label: Patriarkat, kirkkohistoria (270 ... 279 +)
alternative label: Pietismi (270 ... 279 +)
alternative label: Protestanttiset herätysliikkeet, ev.-lut. herätysliikkeet (270 ... 279 +)
alternative label: Protestanttiset lahkot, ev.-lut. herätysliikkeet (270 ... 279 +)
alternative label: Pyhiinvaellukset, kirkkohistoria (270 ... 279 +)
alternative label: Pyhiinvaeltajat, kirkkohistoria (270 ... 279 +)
alternative label: Pyhimykset, kirkkohistoria (270 ... 279 +)
alternative label: Pyhät henkilöt, kirkkohistoria (270 ... 279 +)
alternative label: Pyhät paikat, kirkkohistoria (270 ... 279 +)
alternative label: Toronton herätys (270 ... 279 +)
alternative label: Tuomiokirkot, kirkkohistoria (270 ... 279 +)
alternative label: Uskonlahkot, herätysliikkeet, ev.-lut. (270 ... 279 +)
alternative label: Uskonnollinen syrjintä, kirkkohistoria (270 ... 279 +)
alternative label: Uskonnolliset liikkeet, herätysliikkeet, ev.-lut. (270 ... 279 +)
alternative label: Uskonnolliset rakennukset, kirkkohistoria (270 ... 279 +)
alternative label: Uskonnolliset yhteisöt, herätysliikkeet, ev.-lut. (270 ... 279 +)
alternative label: Uskonnot, kristinusko (210 ... 279 +)
alternative label: Uskonto, kristinusko (210 ... 279 +)
alternative label: Uskontohistoria, kirkkohistoria (270 ... 279 +)
alternative label: Uskontohistoria, kristinuskon historia (270 ... 279 +)
alternative label: Uskontokunnat, kristinusko (210 ... 279 +)
alternative label: Uskonvainot, kirkkohistoria (270 ... 279 +)
alternative label: Uudestikastajat, herätysliikkeet, ev.-lut. (270 ... 279 +)
alternative label: Uudestikastajat, kirkkohistoria (270 ... 279 +)
alternative label: Veljeskunnat, kirkkohistoria (270 ... 279 +)
alternative label: Anakoreter, kyrkohistoria (270 ... 279 +) @sv
alternative label: Andlig väckelse, väckelserörelser, ev.luth. (270 ... 279 +) @sv
alternative label: Andlig väckelse, väckelserörelser, övriga kristna samfund (260 ... 369) @sv
broader: YLEINEN USKONTOTIEDE. YLEINEN USKONNONFILOSOFIA
in scheme: URN:NBN:fi:au:hklj:
narrower: Vanha aika
narrower: Keskiaika
narrower: Uusi aika
narrower: Uusin aika. Nykyaika
narrower: Eri maiden kirkkohistoria
notation: 270
related: URN:NBN:fi:au:hklj:209
related: URN:NBN:fi:au:hklj:210
related: Oppikirjat
related: Kristillisen teologian historia
related: Sisälähetys. Evankelioiminen
related: URN:NBN:fi:au:hklj:260
related: Kirkot ja muut uskonnolliset rakennukset
related: URN:NBN:fi:au:hklj:992
scope note: Tässä ja alaluokissa kristinuskon yleinen historia sekä useampaa kuin yhtä kirkkokuntaa koskeva kirkkohistoria Tässä ja alaluokissa myös evankelis-luterilaisten kirkkojen kirkkohistoria sekä evankelis-luterilaisia herätysliikkeitä koskevat teokset Jos kirkkohistoriallinen teos sopii sekä erikoisalan, kirkkokunnan, maan että aikakauden mukaiseen luokkaan, on etusija järjestyksessä erikoisalan, kirkkokunnan, maan ja aikakauden mukaisella luokalla Jos teoksessa on sekä kirkkohistoriaa että kirkkoarkkitehtuuria, on etusija luokilla 270-279+
scope note: Hit och till underklasserna kristendomens allmänna historia och kyrkohistoria som rör fler än ett kyrkosamfund Hit och till underklasserna också de evangelisk-lutherska kyrkornas kyrkohistoria samt verk som rör de evangelisk-lutherska väckelserörelserna Om ett kyrkohistoriskt verk passar i klassen för både specialområde, kyrkosamfund, land och tidsperiod, ges företräde åt klasserna enligt följande ordning: specialområde, kyrkosamfund, land och tidsperiod Om verket innehåller både kyrkohistoria och kyrkoarkitektur, ges företräde åt klasserna 270-279+ @sv

Julkisoikeus
type: Class
type: Concept
subclass of: URN:NBN:fi:au:hklj:330
alternative label: Direktiivit, erikoisalojen direktiivit (332 ... 334 +)
alternative label: Diskriminointi, tasa-arvolaki (332)
alternative label: Julkinen oikeus (332 +)
alternative label: Julkisoikeus (332 +)
alternative label: Järjestyksenvalvojat, lainsäädäntö (332)
alternative label: Järjestyksenvalvonta, lainsäädäntö (332)
alternative label: Järjestysmiehet, lainsäädäntö (332)
alternative label: Järjestysoikeus (332)
alternative label: Kansainvälinen julkisokeus, Euroopan unioni (332 +)
alternative label: Kommentaarit, lakien kommentaarit (332 ... 338)
alternative label: Kriminalisoitu toiminta, rikosoikeus (332)
alternative label: Lakien yhdenmukaistaminen, yksittäiset lait (332 ... 334 +)
alternative label: Lakikirjat, EU-lait, erikoisalat (332 ... 334 +)
alternative label: Lakikirjat, Suomen lait, erikoisalat (332 ... 334 +)
alternative label: Lakikokoelmat, EU-lait, erikoisalat (332 ... 334 +)
alternative label: Lakikokoelmat, Suomen lait, erikoisalat (332 ... 334 +)
alternative label: Luottamuksensuoja, hallinto-oikeus (332 +)
alternative label: Määräykset, asetukset, eri alojen (332 ... 334 +)
alternative label: Määräykset, direktiivit, eri alojen (332 ... 334 +)
alternative label: Pakollisuus, hallinto-oikeus (332 +)
alternative label: Sukupuoleen perustuva vaino, sukupuolisyrjintä, tasa-arvolaki (332)
alternative label: Sukupuoli, tasa-arvolaki (332)
alternative label: Sukupuolisyrjintä, tasa-arvolaki (332)
alternative label: Syrjintä, tasa-arvolaki (332)
alternative label: Taannehtivuus, erikoisalojen lait (332 ... 334 +)
alternative label: Tasa-arvo, tasa-arvolaki (332)
alternative label: Tasa-arvoisuus, tasa-arvolaki (332)
alternative label: Tasa-arvopolitiikka, tasa-arvolaki (332)
alternative label: Tasavertaisuus, tasa-arvolaki (332)
alternative label: Täysi-ikäiset (332 +)
alternative label: Täysivaltaiset (332 +)
alternative label: Vajaavaltaiset, lainsäädäntö (332 ... 334 +)
alternative label: Yhdenvertaisuus, tasa-arvolaki (332)
alternative label: Bestämmelser, direktiv, olika områden (332 ... 334 +) @sv
alternative label: Bestämmelser, förordningar, olika områden (332 ... 334 +) @sv
alternative label: Direktiv, direktiv inom specialområden (332 ... 334 +) @sv
alternative label: Diskrimination, jämställdhetslagen (332) @sv
alternative label: Diskriminering, jämställdhetslagen (332) @sv
alternative label: Enhetligandet av lagar, enskilda lagar (332 ... 334 +) @sv
alternative label: Förtroenderätt, förvaltningsrätt (332 +) @sv
alternative label: Internationell offentlig rätt, Europeiska unionen (332 +) @sv
alternative label: Jämbördighet, jämställdhetslagen (332) @sv
alternative label: Jämlikhet, jämställdhetslagen (332) @sv
alternative label: Jämställdhet, jämställdhetslagen (332) @sv
alternative label: Jämställdhetspolitik, jämställdhetslagen (332) @sv
alternative label: Kommentarer, lagkommentarer (332 ... 338) @sv
alternative label: Kriminaliserad verksamhet, straffrätt (332) @sv
alternative label: Kön, jämställdhetslagen (332) @sv
alternative label: Könsdiskriminering, jämställdhetslagen (332) @sv
alternative label: Könsrelaterad förföljelse, könsdiskriminering, jämställdhetslagen (332) @sv
alternative label: Lagböcker, EU-lagar, specialområden (332 ... 334 +) @sv
alternative label: Lagböcker, Finlands lagar, specialområden (332 ... 334 +) @sv
alternative label: Lagsamlingar, EU-lagar, specialområden (332 ... 334 +) @sv
alternative label: Lagsamlingar, Finlands lagar, specialområden (332 ... 334 +) @sv
alternative label: Myndiga, täysi-ikäiset (332 +) @sv
alternative label: Myndiga, täysivaltaiset (332 +) @sv
alternative label: Offentlig lagstiftning (332 +) @sv
alternative label: Offentlig rätt (332 +) @sv
alternative label: Omyndiga, lagstiftning (332 ... 334 +) @sv
broader: URN:NBN:fi:au:hklj:330
in scheme: URN:NBN:fi:au:hklj:
narrower: URN:NBN:fi:au:hklj:332.1
narrower: URN:NBN:fi:au:hklj:332.2
narrower: Rikosoikeus
narrower: Prosessioikeus. Oikeushallinto
narrower: Vankeinhoito. Vankilat
notation: 332
related: URN:NBN:fi:au:hklj:326.2
related: Kansainvälinen oikeus
related: Suomen ja Euroopan Unionin laki- ja asetuskokoelmat
related: Muiden maiden lait
related: URN:NBN:fi:au:hklj:340
related: Poliisitoimi. Yleinen turvallisuus
related: Suomen valtionhallinto
related: Naisen ja miehen asema yhteiskunnassa
scope note: Tässä ja alaluokissa Suomen ja Euroopan Unionin julkisoikeus Julkisoikeuden yleisteokset. Tasa-arvolaki
scope note: Hit och till underklasserna offentlig rätt i Finland och Europeiska unionen Allmänna verk som rör offentlig rätt. Jämställdhetslagen @sv

Asemakaava- ja rakentamislainsäädäntö
type: Class
type: Concept
subclass of: URN:NBN:fi:au:hklj:332.2
alternative label: Aravalait (332.21)
alternative label: Asemakaavat, asemakaavalainsäädäntö (332.21)
alternative label: Asemakaavoitus, asemakaavalainsäädäntö (332.21)
alternative label: Asuntorakentaminen, lainsäädäntö (332.21)
alternative label: Asuntotuotanto, lainsäädäntö (332.21)
alternative label: Eurokoodit, rakentamismääräykset, lainsäädäntö (332.21)
alternative label: Kaava-alueet, kaavoituslainsäädäntö (332.21)
alternative label: Kaavamääräykset, kaavoituslainsäädäntö (332.21)
alternative label: Kaavoitus, kaavoituslainsäädäntö (332.21)
alternative label: Kaavoitusalueet, kaavoituslainsäädäntö (332.21)
alternative label: Purkukiellot, lainsäädäntö (332.21)
alternative label: Rakennusjärjestys (332.21)
alternative label: Rakennuskiellot, lainsäädäntö (332.21)
alternative label: Rakennuslainsäädäntö (332.21)
alternative label: Rakennusluvat (332.21)
alternative label: Rakennusoikeus (332.21)
alternative label: Rakentamismääräykset, lainsäädäntö (332.21)
alternative label: Rakentamisoikeus (332.21)
alternative label: Rakentamisrajoitukset, lainsäädäntö (332.21)
alternative label: Rantarakentaminen, lainsäädäntö (332.21)
alternative label: Sosiaalinen asuntotuotanto, lainsäädäntö (332.21)
alternative label: Aravalagar (332.21) @sv
alternative label: Bostadsbyggande, lagstiftning (332.21) @sv
alternative label: Bostadsproduktion, lagstiftning (332.21) @sv
alternative label: Byggbestämmelser, lagstiftning (332.21) @sv
alternative label: Byggnadsförbud, lagstiftning (332.21) @sv
alternative label: Byggnadsinskränkningar, lagstiftning (332.21) @sv
alternative label: Byggnadslagstiftning (332.21) @sv
alternative label: Byggnadslov (332.21) @sv
alternative label: Byggnadsordning (332.21) @sv
alternative label: Byggnadsrätt, rättsområde (332.21) @sv
alternative label: Detaljplanering, stadsplanelagstiftning (332.21) @sv
alternative label: Eurokoder, byggbestämmelser, lagstiftning (332.21) @sv
alternative label: Planbestämmelser, stadsplanelagstiftning (332.21) @sv
alternative label: Planläggning, stadsplanelagstiftning (332.21) @sv
alternative label: Planläggningsområden, stadsplanelagstiftning (332.21) @sv
alternative label: Planområden, stadsplanelagstiftning (332.21) @sv
alternative label: Rivningsförbud, lagstiftning (332.21) @sv
alternative label: Social bostadsproduktion, lagstiftning (332.21) @sv
alternative label: Stadsplaner, stadsplanelagstiftning (332.21) @sv
alternative label: Strandbebyggelse, lagstiftning (332.21) @sv
broader: URN:NBN:fi:au:hklj:332.2
in scheme: URN:NBN:fi:au:hklj:
notation: 332.21
preferred label: Planning and building legislation @en
preferred label: Plan- och bygglagstiftning @sv
related: URN:NBN:fi:au:hklj:326.2
related: Siviili- ja kauppaoikeus. Sopimusoikeus
related: Ympäristöoikeus. Talousoikeus
related: Merioikeus
related: Maaoikeus
related: Vesioikeus
related: Maa- ja metsätalouslainsäädäntö
related: Työoikeus
related: Kansainvälinen oikeus
related: Suomen ja Euroopan Unionin laki- ja asetuskokoelmat
related: Muiden maiden lait
related: URN:NBN:fi:au:hklj:340
related: Suomen valtionhallinto
related: Kiinteistöt. Tontit
related: Asuntopolitiikka
related: URN:NBN:fi:au:hklj:660
related: Talonrakennus
related: URN:NBN:fi:au:hklj:721
scope note: Kaavoitusta ja sen oikeudellisia vaikutuksia, rakennuslupia sekä asuntotuotantoa koskeva lainsäädäntö Aravalait
scope note: Lagstiftning om fysisk planering och dess rättsliga inverkan samt om byggnadslov och bostadsproduktion Aravalån @sv

Merioikeus
type: Class
type: Concept
subclass of: Ympäristöoikeus. Talousoikeus
alternative label: Haaksirikot, lainsäädäntö (334.2)
alternative label: Karilleajo , lainsäädäntö (334.2)
alternative label: Laivaonnettomuudet, lainsäädäntö (334.2)
alternative label: Merioikeus (334.2)
alternative label: Merionnettomuudet, lainsäädäntö (334.2)
alternative label: Meriturmat, lainsäädäntö (334.2)
alternative label: Rahtausoikeus (334.2)
alternative label: Ruorijuopumus, lainsäädäntö (334.2)
alternative label: Fartygsolyckor, lagstiftning (334.2) @sv
alternative label: Frakträtt (334.2) @sv
alternative label: Grundstötning, lagstiftning (334.2) @sv
alternative label: Roderfylleri, lagstiftning (334.2) @sv
alternative label: Sjöolyckor, lagstiftning (334.2) @sv
alternative label: Sjörätt (334.2) @sv
alternative label: Skeppsbrott, lagstiftning (334.2) @sv
broader: Ympäristöoikeus. Talousoikeus
in scheme: URN:NBN:fi:au:hklj:
notation: 334.2
preferred label: Law of the sea @en
preferred label: Sjörätt @sv
related: URN:NBN:fi:au:hklj:326.2
related: URN:NBN:fi:au:hklj:332.2
related: Asemakaava- ja rakentamislainsäädäntö
related: Vesioikeus
related: Maa- ja metsätalouslainsäädäntö
related: Kansainvälinen oikeus
related: Suomen ja Euroopan Unionin laki- ja asetuskokoelmat
related: Muiden maiden lait
related: URN:NBN:fi:au:hklj:342
related: Maapolitiikka
related: Vesiliikenne
related: Ympäristönsuojelu. Luonnonsuojelu
related: URN:NBN:fi:au:hklj:613.3
related: Vesikulkuneuvot
related: Laivat. Laivanrakennus
related: URN:NBN:fi:au:hklj:625.72
related: URN:NBN:fi:au:hklj:657
related: Merenkulkuoppi
scope note: Merenkulkulainsäädäntö. Vesiliikennelainsäädäntö
scope note: Lagstiftning om sjöfart. Lagstiftning om sjötrafik @sv

Vesioikeus
type: Class
type: Concept
subclass of: Ympäristöoikeus. Talousoikeus
alternative label: Rannat, rantaoikeus (334.4)
alternative label: Ranta-alueet, rantaoikeus (334.4)
alternative label: Rantaoikeus (334.4)
alternative label: Rantaviiva, rantaoikeus (334.4)
alternative label: Tukinuitto, lainsäädäntö (334.4)
alternative label: Uitto, lainsäädäntö (334.4)
alternative label: Vesialueet, vesioikeus (334.4)
alternative label: Vesilainsäädäntö (334.4)
alternative label: Vesiluvat (334.4)
alternative label: Vesioikeus (334.4)
alternative label: Vesistöalueet, vesioikeus (334.4)
alternative label: Flodområden, vattenrätt (334.4) @sv
alternative label: Flottning, lagstiftning (334.4) @sv
alternative label: Strandlinje, strandrätt (334.4) @sv
alternative label: Strandområden, strandrätt (334.4) @sv
alternative label: Strandrätt (334.4) @sv
alternative label: Stränder, strandrätt (334.4) @sv
alternative label: Timmerflottning, lagstiftning (334.4) @sv
alternative label: Vattenlagstiftning (334.4) @sv
alternative label: Vattenområden, vattenrätt (334.4) @sv
alternative label: Vattenrätt (334.4) @sv
alternative label: Vattentillstånd (334.4) @sv
broader: Ympäristöoikeus. Talousoikeus
in scheme: URN:NBN:fi:au:hklj:
notation: 334.4
preferred label: Water rights legislation @en
preferred label: Vattenrätt @sv
related: URN:NBN:fi:au:hklj:326.2
related: URN:NBN:fi:au:hklj:332.2
related: Asemakaava- ja rakentamislainsäädäntö
related: Merioikeus
related: Maaoikeus
related: Maa- ja metsätalouslainsäädäntö
related: Kansainvälinen oikeus
related: Suomen ja Euroopan Unionin laki- ja asetuskokoelmat
related: Muiden maiden lait
related: URN:NBN:fi:au:hklj:342
related: Ympäristönsuojelu. Luonnonsuojelu
related: Maaperän, metsien ja soiden suojelu
related: Vesien suojelu
related: URN:NBN:fi:au:hklj:613.3
related: Vesirakennus. Vesikulkuneuvot
related: Vesiväylät. Vesien säännöstely
related: URN:NBN:fi:au:hklj:657
related: URN:NBN:fi:au:hklj:721
scope note: Rantaoikeus. Vesien ja rantojen suojelua koskeva lainsäädäntö
scope note: Strandrätt. Lagstiftning om strandskydd och vattenskydd @sv

SOSIOLOGIA
type: Class
type: Concept
subclass of: URN:NBN:fi:au:hklj:300
alternative label: Asutustilat, maa- ja metsätalous (350)
alternative label: Barometrit (350)
alternative label: Biografiatutkimus, sosiologian tutkimusmenetelmät (350)
alternative label: Case-tutkimus, sosiologian metodit (350)
alternative label: Elämäkerrallinen tutkimus, sosiologian tutkimusmenetelmät (350)
alternative label: Elämäkertatutkimus, sosiologian tutkimusmenetelmät (350)
alternative label: Elämänhistoria, sosiologinen tutkimus (350 ... 359)
alternative label: Elämänkertatutkimus, sosiologian tutkimusmenetelmät (350)
alternative label: Etnometodologia (350)
alternative label: Faktorianalyysi, sosiologia (350)
alternative label: Gallupit (350)
alternative label: Galluptutkimus, sosiologian tutkimusmenetelmät (350)
alternative label: Haastattelumenetelmät , sosiologia (350)
alternative label: Haastattelut, sosiologia (350)
alternative label: Haastattelututkimus, sosiologia (350)
alternative label: Henkilöhistoriallinen tutkimus, sosiologian tutkimusmenetelmät (350)
alternative label: Kulttuurivaikuttajat, sosiologia (350 ... 359)
alternative label: Kyselytutkimus, sosiologia (350)
alternative label: Käyttäytymistieteet, sosiologia (350 ... 359)
alternative label: Lomaketutkimus, sosiologia (350)
alternative label: Monimuuttujamenetelmät, sosiologia (350)
alternative label: Osallistava tutkimus, sosiologian metodit (350)
alternative label: Osallistuva havainnointi, sosiologian metodit (350)
alternative label: Q-menetelmä, sosiologia (350 ... 359)
alternative label: Regressioanalyysi, sosiologia (350)
alternative label: Sisällönanalyysi, sosiologia (350)
alternative label: Sosiaalitieteet, sosiologia (350 ... 359)
alternative label: Sosiaalitutkimus, sosiologia (350 ... 359)
alternative label: Sosialistiset yhteiskunnat, sosiologia (350 ... 359)
alternative label: Sosiodemografiset tekijät, yhteiskuntakuvaus, sosiologia (350 ... 359)
alternative label: Sosiografia, sosiologia (350 ... 359)
alternative label: Sosiologia (350 ... 359)
alternative label: Survey-tutkimus, sosiologia (350)
alternative label: Taloussosiologia, sosiologia (350)
alternative label: Tapaustutkimus, sosiologian metodit (350)
alternative label: Teemahaastattelut, sosiologia (350)
alternative label: Tutkimushaastattelut , sosiologia (350)
alternative label: Verkostot, sosiologia (350)
alternative label: Vertaisryhmät, sosiologinen tutkimus (350)
alternative label: Vertaissuhteet, sosiologinen tutkimus (350)
alternative label: Yhteiskuntakuvaus, sosiologia (350 ... 359)
alternative label: Yhteiskuntatieteet, sosiologia (350 ... 359)
alternative label: Yhteisöllisyys, sosiologia (350)
alternative label: Yleisötutkimus, sosiologia (350)
alternative label: Beteendevetenskaper, sociologi (350 ... 359) @sv
alternative label: Biografiforskning, sociologins forskningsmetoder (350) @sv
alternative label: Case-forskning, sociologins metoder (350) @sv
alternative label: Delaktig forskning, sociologins metoder (350) @sv
alternative label: Deltagande observation, sociologins metoder (350) @sv
alternative label: Ekonomisk sociologi, sociologi (350) @sv
alternative label: Enkätundersökning, sociologi (350) @sv
alternative label: Etnometodologi (350) @sv
alternative label: Faktoranalys, sociologi (350) @sv
alternative label: Fallstudie, sociologins metoder (350) @sv
alternative label: Forskningsintervjuer, sociologi (350) @sv
alternative label: Gallupar (350) @sv
alternative label: Gallupforskning, sociologins forskningsmetoder (350) @sv
alternative label: Innehållsanalys, sociologi (350) @sv
alternative label: Intervjuer, sociologi (350) @sv
alternative label: Intervjumetoder, sociologi (350) @sv
broader: URN:NBN:fi:au:hklj:300
in scheme: URN:NBN:fi:au:hklj:
narrower: Yhteiskuntafilosofia
narrower: Yhteiskunnan rakenne
narrower: Organisaatioiden ja laitosten sosiologia
narrower: Elämäntapojen sosiologia. Kulttuurisosiologia
narrower: Perhesosiologia
narrower: Kriminologia. Kriminaalisosiologia
notation: 350
related: Sosiaalipsykologia. Kulttuuripsykologia
related: Ihmissuhteiden psykologia
related: URN:NBN:fi:au:hklj:371
related: Vakuutustoimi
related: URN:NBN:fi:au:hklj:373
related: Kulttuuriantropologia. Sosiaaliantropologia
scope note: Sosiologian yleisteokset. Sosiologian suuntaukset yleensä Sosiologian filosofia, teoria ja tutkimusmenetelmät yleensä Yleiset sosiologiset yhteiskuntatutkimukset Sosiaalisia järjestelmiä ja rakenteita sekä niiden kehitystä koskevat yleisteokset Erikoisalojen sosiologiset kysymykset alan mukaisessa luokassa Jos teos koskee sekä sosiologiaa että sosiaalipolitiikkaa, on etusija luokilla 371-373
scope note: Allmänna verk som rör sociologi. Riktningar inom sociologin i allmänhet Sociologins filosofi, teori och forskningsmetoder i allmänhet Allmänna sociologiska samhällsundersökningar Sociala system och strukturer samt allmänna verk som rör deras utveckling Sociologiska frågor som rör specialområden klassificeras enligt område Om verket handlar om både sociologi och socialpolitik ges företräde åt klasserna 371-373 @sv

Kriminologia. Kriminaalisosiologia
type: Class
type: Concept
subclass of: SOSIOLOGIA
alternative label: Abc-aseet, terrorismi (359)
alternative label: Aggressiivisuus, väkivallan sosiologia (359)
alternative label: Alkoholirikokset, rikollisuus (359)
alternative label: Arvoesineet, omaisuusrikokset (359)
alternative label: Aseet, terrorismi (359)
alternative label: Atk-rikokset, rikollisuus (359)
alternative label: Atomipommit, terrorismi (359)
alternative label: Attentaatit (359)
alternative label: Bioaseet, terrorismi (359)
alternative label: Biologiset aseet yl., terrorismi (359)
alternative label: Biopiratismi, rikollisuus (359)
alternative label: Bioterrorismi (359)
alternative label: Crackerointi, rikollisuus (359)
alternative label: Designhuumeet, rikollisuus (359)
alternative label: Eläimeen sekaantuminen, seksuaalirikollisuus (359)
alternative label: Eläimiin sekaantuminen, seksuaalirikollisuus (359)
alternative label: Epäinhimillisyys, rikollisuus (359)
alternative label: Fyysinen väkivalta, kriminologia (359)
alternative label: Fyysinen väkivalta, rikollisuus (359)
alternative label: Gangsterit, rikollisuus (359)
alternative label: Haittaohjelmat, rikollisuus (359)
alternative label: Hakkerit, rikollisuus (359)
alternative label: Hakkerointi, rikollisuus (359)
alternative label: Hallussapito, huumeet, rikollisuus (359)
alternative label: Harmaa talous, talousrikollisuus (359)
alternative label: Henkilörekisteririkokset, rikollisuus (359)
alternative label: Henkirikokset, kriminologia (359)
alternative label: Huijarit, rikollisuus (359)
alternative label: Huliganismi, rikollisuus (359)
alternative label: Huumausaineen käyttörikokset, rikollisuus (359)
alternative label: Huumausainerikokset, rikollisuus (359)
alternative label: Huumeet, rikollisuus (359)
alternative label: Huumeiden käyttö, rikollisuus (359)
alternative label: Huumekauppa (359)
alternative label: Huumeongelmaiset, rikollisuus (359)
alternative label: Huumeongelmat, rikollisuus (359)
alternative label: Huumerikokset, rikollisuus (359)
alternative label: Hyväksikäyttö, rikollisuus, kriminologia (359)
alternative label: Häirintä, rikollisuus (359)
alternative label: Häpeäväkivalta, rikollisuus (359)
alternative label: Identiteettivarkaus, atk-rikokset, rikollisuus (359)
alternative label: Ihmiskauppa, rikollisuus (359)
alternative label: Ihmisryöstöt, rikollisuus (359)
alternative label: Ihmissalakuljetus, rikollisuus (359)
alternative label: Ilkivalta, rikollisuus (359)
alternative label: Ilmaliikenne, lentokonekaappaukset (359)
alternative label: Ilmianto, rikollisuus (359)
alternative label: Insesti, seksuaalirikollisuus (359)
alternative label: Itsemurhaiskut (359)
alternative label: Itsepuolustus, väkivallan sosiologia (359)
alternative label: Joukkomurha, rikollisuus (359)
alternative label: Joukkomurha, terrorismi (359)
alternative label: Joukkotuho, joukkomurha (359)
alternative label: Joukkotuho, terrorismi (359)
broader: SOSIOLOGIA
in scheme: URN:NBN:fi:au:hklj:
notation: 359
related: URN:NBN:fi:au:hklj:181.7
related: Rikosoikeus
related: Vankeinhoito. Vankilat
related: Poliisitoimi. Yleinen turvallisuus
related: Organisaatioiden ja laitosten sosiologia
related: Perhesosiologia
related: Valtionverotus. Veropolitiikka
related: Työolot
related: Perhepolitiikka. Lapsipolitiikka. Nuorisopolitiikka
related: Alkoholipolitiikka
related: Huumausainepolitiikka
related: Kriminaalipolitiikka
related: Sotien yhteiskunnalliset vaikutukset
related: Seksologia
related: URN:NBN:fi:au:hklj:627.7
related: Liiketalouden hallinto ja organisaatio
related: Liikenneopetus. Liikenneturvallisuus
related: Lento-opetus. Lentotaito
scope note: Väkivallan ja rikollisuuden sosiologia Rikollisuuden ja kriminalisoidun toiminnan tutkimus Järjestäytynyt rikollisuus. Väkivaltarikollisuus. Mafia. Terrorismi. Lentokonekaappaukset. Huumausainekauppa. Salakuljetus. Talous- ja omaisuusrikollisuus. Atk-rikollisuus. Hakkeritoiminta Tässä myös muita rikollisuuden lajeja koskeva kriminologinen ja kriminaalisosiologinen tutkimus
scope note: Vålds- och brottssociologi Undersökning av brottslighet och kriminaliserad verksamhet Organiserad brottslighet. Våldsbrott. Maffian. Terrorism. Flygkapningar. Narkotikahandel. Smuggling. Ekonomisk brottslighet. Egendomsbrott. Databrott. Hackare Hit också kriminologisk och kriminalsociologisk utredning av andra brottstyper @sv

Hyönteiset
type: Class
type: Concept
subclass of: Selkärangattomat
alternative label: Ampiaiset (597.61)
alternative label: Ansarijauhiainen (597.61)
alternative label: Auroraperhonen, perhoset (597.61)
alternative label: Entomologia (597.61)
alternative label: Feromonit, hyönteiset (597.61)
alternative label: Heinäsirkat (597.61)
alternative label: Hyönteiset (597.61)
alternative label: Hyönteishotellit (597.61)
alternative label: Hyönteiskuningattaret (597.61)
alternative label: Hyönteistiede (597.61)
alternative label: Hyötyhyönteiset, hyönteistiede (597.61)
alternative label: Immenkorento (597.61)
alternative label: Jalokuoriaiset (597.61)
alternative label: Jauhiaiset (597.61)
alternative label: Kaksisiipiset (597.61)
alternative label: Keihästytönkorento (597.61)
alternative label: Keräily, hyönteiset (597.61)
alternative label: Keräily, perhoset (597.61)
alternative label: Kirput, eläintiede (597.61)
alternative label: Koit, eläintiede (597.61)
alternative label: Kotelot, hyönteiset (597.61)
alternative label: Kovakuoriaiset (597.61)
alternative label: Kuningattaret (hyönteiset) (597.61)
alternative label: Kärpäset (597.61)
alternative label: Lehtipistiäiset (597.61)
alternative label: Lepidopterologia (597.61)
alternative label: Luteet, eläintiede (597.61)
alternative label: Mehiläiset, eläintiede (597.61)
alternative label: Mehiläispesät, eläintiede (597.61)
alternative label: Mesipistiäiset, hyönteistiede (597.61)
alternative label: Metamorfoosi, hyönteiset (597.61)
alternative label: Mittarit, perhoset (597.61)
alternative label: Muodonvaihdos, hyönteiset (597.61)
alternative label: Muurahaiset (597.61)
alternative label: Muurahaispesät (597.61)
alternative label: Neidonkorennot (597.61)
alternative label: Neidonkorento (597.61)
alternative label: Niveljalkaiset, hyönteiset (597.61)
alternative label: Palosirkka (597.61)
alternative label: Perhoset (597.61)
alternative label: Perhoset, keräily (597.61)
alternative label: Pistiäiset (597.61)
alternative label: Päiväperhoset (597.61)
alternative label: Rapsipistiäinen (597.61)
alternative label: Sepikät, hyönteiset (597.61)
alternative label: Siilikkäät, perhoset (597.61)
alternative label: Siivet, hyönteiset (597.61)
alternative label: Sudenkorennot (597.61)
alternative label: Sulkasääsket (597.61)
alternative label: Suorasiipiset (597.61)
alternative label: Sääsket (597.61)
alternative label: Termiitit (597.61)
alternative label: Torakat, eläintiede (597.61)
alternative label: Toukat, hyönteiset (597.61)
broader: Selkärangattomat
in scheme: URN:NBN:fi:au:hklj:
notation: 597.61
related: Luonto-oppaat. Oppikirjat
related: Systemaattinen kasvitiede
related: Eläinmorfologia. Eläinanatomia
related: Eläinfysiologia
related: Eläinekologia
related: Eläinmaantiede
related: URN:NBN:fi:au:hklj:613.3
related: URN:NBN:fi:au:hklj:613.31
related: URN:NBN:fi:au:hklj:616.3
related: Maanviljely
related: Puutarhanhoito. Hyötykasvit. Huone- ja koristekasvit
related: Koristekasvit
related: Hyötykasvit
related: Yrtti- ja maustekasvit
related: Hedelmä-, marja- ja vihanneskasvit
related: Huonekasvit
related: Hyönteiset
related: URN:NBN:fi:au:hklj:657
scope note: Perhoset. Perhosten keräily. Kovakuoriaiset. Korennot. Kaksisiipiset. Kärpäset. Sääsket. Pistiäiset. Ampiaiset. Muurahaiset. Mehiläiset. Muut hyönteisryhmät Hyönteisten systematiikka ja lajinmääritysoppaat Hyönteisten morfologia, anatomia, fysiologia, ekologia, etologia ja eläinmaantiede Hyönteisten lisääntyminen. Muodonvaihdos. Toukka- ja koteloasteet
scope note: Fjärilar. Fjärilssamlande. Skalbaggar. Sländor. Tvåvingar. Flugor. Myggor. Steklar. Getingar. Myror. Bin. Andra insektgrupper Insekternas systematik och handböcker för artbestämning av insekter Insekternas morfologi, anatomi, fysiologi, etologi, ekologi och djurgeografi Insekternas fortplantning. Metamorfos. Larvstadier. Puppor @sv

Vesijohto-, viemäri- ja vedenpuhdistustekniikka
type: Class
type: Concept
subclass of: Vesirakennus. Vesikulkuneuvot
alternative label: Akveduktit, vesijohtoverkot (625.4)
alternative label: Alkalointi, vedenpuhdistustekniikka (625.4)
alternative label: Biologinen puhdistus, vedenpuhdistustekniikka (625.4)
alternative label: Biologinen vedenpuhdistus (625.4)
alternative label: Biologinen vedenpuhdistus, vedenpuhdistustekniikka (625.4)
alternative label: Biopuhdistus, vedenpuhdistustekniikka (625.4)
alternative label: Bioremediaatio, vedenpuhdistustekniikka (625.4)
alternative label: Fluoraus, vedenpuhdistus (625.4)
alternative label: Juomavesi, vesijohdot (625.4)
alternative label: Jätehuoltolaitokset, vedenpuhdistamot (625.4)
alternative label: Jätevedenpuhdistamot (625.4)
alternative label: Jätevesi, puhdistamotekniikka (625.4)
alternative label: Jätevesi, viemäritekniikka (625.4)
alternative label: Jätteenkäsittelylaitokset, vedenpuhdistamot (625.4)
alternative label: Kaivot (625.4)
alternative label: Kaivot, rakentaminen (625.4)
alternative label: Keraamiset putket, viemäritekniikka (625.4)
alternative label: Kiintoaines, vedenpuhdistustekniikka (625.4)
alternative label: Lammikointi, vedenpuhdistustekniikka (625.4)
alternative label: Lietteenkäsittely, vedenpuhdistustekniikka (625.4)
alternative label: Liikenneväylät, rautatienrakennus (625.4)
alternative label: Mädättäminen, vedenpuhdistustekniikka (625.4)
alternative label: Mädätys, vedenpuhdistustekniikka (625.4)
alternative label: Otsonointi, vedenpuhdistustekniikka (625.4)
alternative label: Pienpuhdistamot (625.4)
alternative label: Puhdistus, vedenpuhdistustekniikka (625.4)
alternative label: Putket, vesijohto-ja viemäritekniikka (625.4)
alternative label: Putkiasentajat, putkiasentajan työ (625.4)
alternative label: Putkistot, vesijohto-ja viemäritekniikka (625.4)
alternative label: Saostus, vedenpuhdistustekniikka (625.4)
alternative label: Saostuskaivot, vedenpuhdistustekniikka (625.4)
alternative label: Talousvesi, vesijohdot (625.4)
alternative label: Teollisuusjätevesi, vedenpuhdistustekniikka (625.4)
alternative label: Teollisuusjätevesi, viemäritekniikka (625.4)
alternative label: Tunnelit, viemärit (625.4)
alternative label: Vahingontorjunta, öljyntorjunta (625.4)
alternative label: Vedenhankinta, kaivot, vesijohdot (625.4)
alternative label: Vedenkäsittely, tekniikka (625.4)
alternative label: Vedenottamot (625.4)
alternative label: Vedenotto, vesihuolto (625.4)
alternative label: Vedenpuhdistamot (625.4)
alternative label: Vedenpuhdistus, vedenpuhdistustekniikka (625.4)
alternative label: Vedet, vedenpuhdistustekniikka (625.4)
alternative label: Vesiensuojelutekniikka (625.4)
alternative label: Vesihuoltolaitokset, tekniikka (625.4)
alternative label: Vesijohdot (625.4)
alternative label: Vesijohtotekniikka (625.4)
alternative label: Vesijohtoverkot (625.4)
alternative label: Vesilaitokset (625.4)
alternative label: Vesilinna, vesitornig (625.4)
alternative label: Vesimittarit, mittaustekniikka (625.4)
alternative label: Vesirakennus, vesijohdot (625.4)
alternative label: Vesirakentaminen, vesijohdot (625.4)
alternative label: Vesisäiliöt (625.4)
broader: Vesirakennus. Vesikulkuneuvot
in scheme: URN:NBN:fi:au:hklj:
notation: 625.4
related: URN:NBN:fi:au:hklj:342
related: URN:NBN:fi:au:hklj:380
related: URN:NBN:fi:au:hklj:460
related: Hydrologia
related: Vesien suojelu
related: Yleinen konetekniikka
related: Koneenrakennus. Pneumatiikka. Hydrauliikka
related: Voimakoneet. Moottorit. Nosto- ja kuljetuslaitteet
related: URN:NBN:fi:au:hklj:624
related: URN:NBN:fi:au:hklj:631
related: Öljy. Maakaasu
related: URN:NBN:fi:au:hklj:660
related: Rakennusstatiikka. Rakennusaineet
related: Tekninen rakennussuunnittelu
related: Geotekniikka. Maatyöt
related: URN:NBN:fi:au:hklj:667.7
related: Merenkulkuoppi
related: Moottoriurheilu. Lentourheilu
scope note: Vesijohto-, viemäri- ja vedenpuhdistustekniikka yleisen vesi- ja jätevesihuollon rakentamisen kannalta Vesi- ja jätevesilaitokset. Vesijohto- ja viemäriverkot Vedenottamot. Kaivot. Vesitornit. Vesisäiliöt Vedenpuhdistustekniikka. Biologinen, kemiallinen ja mekaaninen vedenpuhdistus Öljyntorjuntatekniikka
scope note: Vattenlednings-, avlopps- och vattenreningsteknik ur allmän byggnadssynvinkel på vattenförsörjning och spillvattenhantering Vattenverk och spillvattenverk. Vattenlednings- och avloppsnät Vattentäkter. Brunnar. Vattentorn. Vattencisterner Vattenreningsteknik. Biologisk, kemisk och mekanisk vattenrening Oljebekämpningsmetoder @sv

Käyttöjärjestelmät
type: Class
type: Concept
subclass of: URN:NBN:fi:au:hklj:627.73
alternative label: DOS, käyttöjärjestelmät (627.731)
alternative label: Käyttöjärjestelmät (627.731)
alternative label: Linux, käyttöjärjestelmät (627.731)
alternative label: MS-DOS, käyttöjärjestelmät (627.731)
alternative label: Mac OS X, käyttöjärjestelmät (627.731)
alternative label: NetWare, käyttöjärjestelmät (627.731)
alternative label: OS/2, käyttöjärjestelmät (627.731)
alternative label: Palm OS, käyttöjärjestelmät (627.731)
alternative label: UNIX, käyttöjärjestelmät (627.731)
alternative label: Windows 10, käyttöjärjestelmät (627.731)
alternative label: Windows 8, Windows, käyttöjärjestelmät (627.731)
alternative label: Windows, käyttöjärjestelmät (627.731)
alternative label: DOS, operativsystem (627.731) @sv
alternative label: Linux, operativsystem (627.731) @sv
alternative label: MS-DOS, operativsystem (627.731) @sv
alternative label: Mac OS X, operativsystem (627.731) @sv
alternative label: NetWare, operativsystem (627.731) @sv
alternative label: OS/2, operativsystem (627.731) @sv
alternative label: Operativsystem (627.731) @sv
alternative label: Palm OS, operativsystem (627.731) @sv
alternative label: UNIX, operativsystem (627.731) @sv
alternative label: Windows 10, operativsystem (627.731) @sv
alternative label: Windows 8, Windows, operativsystem (627.731) @sv
alternative label: Windows, operativsystem (627.731) @sv
broader: URN:NBN:fi:au:hklj:627.73
in scheme: URN:NBN:fi:au:hklj:
notation: 627.731
preferred label: Operating systems @en
preferred label: Operativsystem @sv
related: Kustannustoimi. Kirjakauppa
related: LOGIIKKA
related: Logistiikka. Looginen kalkyyli
related: URN:NBN:fi:au:hklj:182
related: URN:NBN:fi:au:hklj:332.1
related: URN:NBN:fi:au:hklj:384
related: Sähköoppi. Magnetismi
related: URN:NBN:fi:au:hklj:620.88
related: Systeemityö
related: Ohjelmointi. Ohjelmointikielet
related: Säätö- ja systeemitekniikka. Teollinen automaatio
related: Elektroniikka
related: URN:NBN:fi:au:hklj:667.7
related: URN:NBN:fi:au:hklj:667.71
related: Toimistotyö
related: URN:NBN:fi:au:hklj:681
related: Toimistokoneet
related: Pelit

Tietokantaohjelmat
type: Class
type: Concept
subclass of: URN:NBN:fi:au:hklj:627.73
alternative label: Data-arkistot, tietokantaohjelmat (627.734)
alternative label: MySql, tietokantaohjelmat (627.734)
alternative label: Tietoarkistot, tietokantaohjelmat (627.734)
alternative label: Tietokantaohjelmat (627.734)
alternative label: Dataarkiv, databasprogram (627.734) @sv
alternative label: Databasprogram (627.734) @sv
alternative label: Elektroniska arkiv, databasprogram (627.734) @sv
alternative label: MySql, databasprogram (627.734) @sv
broader: URN:NBN:fi:au:hklj:627.73
in scheme: URN:NBN:fi:au:hklj:
notation: 627.734
preferred label: Database programs @en
preferred label: Databasprogram @sv
related: Kustannustoimi. Kirjakauppa
related: LOGIIKKA
related: Logistiikka. Looginen kalkyyli
related: URN:NBN:fi:au:hklj:182
related: URN:NBN:fi:au:hklj:332.1
related: URN:NBN:fi:au:hklj:384
related: Sähköoppi. Magnetismi
related: URN:NBN:fi:au:hklj:620.88
related: Systeemityö
related: Ohjelmointi. Ohjelmointikielet
related: Säätö- ja systeemitekniikka. Teollinen automaatio
related: Elektroniikka
related: URN:NBN:fi:au:hklj:667.7
related: URN:NBN:fi:au:hklj:667.71
related: Toimistotyö
related: URN:NBN:fi:au:hklj:681
related: Toimistokoneet
related: Pelit

Tietoliikenneohjelmat
type: Class
type: Concept
subclass of: URN:NBN:fi:au:hklj:627.73
alternative label: Tietoliikenneohjelmat (627.736)
alternative label: Telekommunikationsprogram (627.736) @sv
broader: URN:NBN:fi:au:hklj:627.73
in scheme: URN:NBN:fi:au:hklj:
notation: 627.736
preferred label: Communication programs @en
preferred label: Telekommunikationsprogram @sv
related: Kustannustoimi. Kirjakauppa
related: LOGIIKKA
related: Logistiikka. Looginen kalkyyli
related: URN:NBN:fi:au:hklj:182
related: URN:NBN:fi:au:hklj:332.1
related: URN:NBN:fi:au:hklj:384
related: Sähköoppi. Magnetismi
related: URN:NBN:fi:au:hklj:620.88
related: Systeemityö
related: Ohjelmointi. Ohjelmointikielet
related: Säätö- ja systeemitekniikka. Teollinen automaatio
related: Elektroniikka
related: URN:NBN:fi:au:hklj:667.7
related: URN:NBN:fi:au:hklj:667.71
related: Toimistotyö
related: URN:NBN:fi:au:hklj:681
related: Toimistokoneet
related: Pelit

KEMIAN TEOLLISUUS. KAIVOSTEOLLISUUS
type: Class
type: Concept
subclass of: SOVELLETUT TIETEET
alternative label: Jauhatus, kemianteollisuus (640 ... 649 +)
alternative label: Malning, kemisk industri (640 ... 649 +) @sv
alternative label: Verksamhetsställen, förvaltning (640 ... 648) @sv
broader: SOVELLETUT TIETEET
in scheme: URN:NBN:fi:au:hklj:
narrower: Lasiteollisuus. Keraaminen teollisuus. Sementtiteollisuus
narrower: Metallurgia. Metallioppi
narrower: Kaivos- ja kaivannaisteollisuus
narrower: Kemian teollisuus
narrower: Orgaanisen kemian teollisuus
notation: 640
preferred label: CHEMICAL INDUSTRY. MINING. METALLURGY @en
preferred label: KEMISK INDUSTRI. BERGSBRUK @sv
related: URN:NBN:fi:au:hklj:620
related: URN:NBN:fi:au:hklj:620.09
related: Liiketalouden hallinto ja organisaatio
related: Johtamisen tekniikka ja menetelmät
related: Laskentatoimi. Rahoitus. Talousarviot
related: Työntutkimukset. Työanalyysi
related: Toimistotyö
related: Henkilöstöpolitiikka
scope note: Teokset, jotka koskevat sekä kemian teollisuutta että kaivos- tai kaivannaisteollisuutta
scope note: Verk som handlar om såväl kemisk industri som bergsbruk eller gruvindustri @sv

Siipikarja
type: Class
type: Concept
subclass of: URN:NBN:fi:au:hklj:654
alternative label: Ankka, siipikarja (654.5)
alternative label: Broilerit, siipikarja (654.5)
alternative label: Hanhet, siipikarja (654.5)
alternative label: Haudonta, siipikarja (654.5)
alternative label: Hautominen, siipikarja (654.5)
alternative label: Häkkikanalat, kanojen hoito (654.5)
alternative label: Kalkkunat, siipikarja (654.5)
alternative label: Kana (654.5)
alternative label: Kana, siipikarja (654.5)
alternative label: Kanalat, kanojen hoito (654.5)
alternative label: Kanalinnut, siipikarja (654.5)
alternative label: Kananmunantuotanto, siipikarjatalous (654.5)
alternative label: Kananmunat, siipikarjatalous (654.5)
alternative label: Kanat (654.5)
alternative label: Kanat, siipikarja (654.5)
alternative label: Kanatalous (654.5)
alternative label: Kukot, siipikarjanhoito (654.5)
alternative label: Lattiakanalat, kanojen hoito (654.5)
alternative label: Linnut, siipikarja (654.5)
alternative label: Lintuhäkit, siipikarja (654.5)
alternative label: Munantuotanto, siipikarjatalous (654.5)
alternative label: Munat, siipikarjatalous (654.5)
alternative label: Siipikarja (654.5)
alternative label: Siipikarjanhoito (654.5)
alternative label: Siipikarjatalous (654.5)
alternative label: Siipikarjatilat (654.5)
alternative label: Strutsit, tarhaus (654.5)
alternative label: Viiriäiset, siipikarja (654.5)
alternative label: Anka, fjäderfä (654.5) @sv
alternative label: Broilrar, fjäderfä (654.5) @sv
alternative label: Burhönserier, hönsskötsel (654.5) @sv
alternative label: Burhönshus, hönsskötsel (654.5) @sv
alternative label: Burhönsstall, hönsskötsel (654.5) @sv
alternative label: Fjäderfä (654.5) @sv
alternative label: Fjäderfägårdar (654.5) @sv
alternative label: Fjäderfähushållning (654.5) @sv
alternative label: Fjäderfäskötsel (654.5) @sv
alternative label: Fågelburar, fjäderfä (654.5) @sv
alternative label: Fåglar, fjäderfä (654.5) @sv
alternative label: Golvhönserier, hönsskötsel (654.5) @sv
alternative label: Golvhönshus, hönsskötsel (654.5) @sv
alternative label: Golvhönsstall, hönsskötsel (654.5) @sv
alternative label: Gäss, fjäderfä (654.5) @sv
alternative label: Hönor (654.5) @sv
alternative label: Hönor, fjäderfä (654.5) @sv
alternative label: Höns (654.5) @sv
alternative label: Höns, fjäderfä (654.5) @sv
alternative label: Hönsfåglar, fjäderfä (654.5) @sv
alternative label: Hönshus, hönsskötsel (654.5) @sv
alternative label: Hönsskötsel (654.5) @sv
alternative label: Hönsägg, fjäderfähushållning (654.5) @sv
alternative label: Hönsäggsproduktion, fjäderfähushållning (654.5) @sv
alternative label: Kalkoner, fjäderfä (654.5) @sv
alternative label: Ruvning, fjäderfä (654.5) @sv
broader: URN:NBN:fi:au:hklj:654
in scheme: URN:NBN:fi:au:hklj:
notation: 654.5
related: URN:NBN:fi:au:hklj:576
related: URN:NBN:fi:au:hklj:590
related: Eläintarhat
related: Eläinsuojelu
related: Systemaattinen eläintiede
related: Linnut
related: Nisäkkäät
related: Eläinten vetämät kulkuneuvot
related: URN:NBN:fi:au:hklj:649.91
related: Maatalouspolitiikka
related: URN:NBN:fi:au:hklj:650.2
related: URN:NBN:fi:au:hklj:651
related: Häkkilinnut
related: URN:NBN:fi:au:hklj:657
related: Metsästys
related: Eläinlääketiede
related: Rakennusten erillistilat
related: URN:NBN:fi:au:hklj:691.13
scope note: Siipikarja ja sen hoito. Siipikarjalajit ja -rodut Kanat, kalkkunat, viiriäiset, ankat, hanhet ja muut linnut siipikarjana Kanalan hoito Siipikarjatalous. Häkki- ja lattiakanalat Kanojen sairaudet ja niiden hoito
scope note: Fjäderfä och fjäderfäskötsel. Arter och raser av fjäderfä Höns, kalkoner, vaktlar, ankor, gäss och andra fåglar som fjäderfä Skötsel av hönshus och hönsgårdar Uppfödning av fjäderfä. Hönshus med burar och hönsgårdar för sprätthöns Hönssjukdomar och behandling av dem @sv

KOTITALOUS. LAITOSTALOUS. KAUNEUDENHOITO
type: Class
type: Concept
subclass of: SOVELLETUT TIETEET
alternative label: Emäntäkoulut (690)
alternative label: Kodin työt, kotitalous (690)
alternative label: Koti- ja laitostalousoppilaitokset (690)
alternative label: Laitostaloudet (690)
alternative label: Martat (690)
alternative label: Muutot, koti- ja laitostalous (690)
alternative label: Suurtaloudet (690 ... 699)
alternative label: Suurtaloudet, laitostalous (690)
alternative label: Talous, koti- ja laitostalous (690 ... 698)
alternative label: Ekonomi, hem- och storhushållsekonomi (690 ... 698) @sv
alternative label: Flyttningar, hem- och storhushållsekonomi (690) @sv
alternative label: Hemmets arbeten, hushåll (690) @sv
alternative label: Husmorsskolor (690) @sv
alternative label: Institutionshushåll (690) @sv
alternative label: Läroinrättningar i huslig ekonomi, koti- ja laitostalousoppilaitokset (690) @sv
alternative label: Marthor (690) @sv
alternative label: Storhushåll (690 ... 699) @sv
alternative label: Storhushåll, storhushållsekonomi (690) @sv
broader: SOVELLETUT TIETEET
in scheme: URN:NBN:fi:au:hklj:
narrower: Kotitalous. Kodinhoito
narrower: Ravintotalous. Gastronomia
narrower: Kotijuhlien järjestäminen. Kutsujen järjestäminen
narrower: Sisustusoppaat
narrower: Pukeutuminen. Kauneudenhoito
narrower: Siivous. Pesu- ja puhdistustyöt
narrower: Suurkeittiöt
notation: 690
preferred label: DOMESTIC SCIENCE. INSTITUTIONAL HOUSEKEEPING. BEAUTY CARE @en
preferred label: HUSHÅLL. STORHUSHÅLL. SKÖNHETSVÅRD @sv
related: Kiinteistöt. Tontit
related: Rakennuksen kunnossapito
related: Hotelli- ja ravintolatalous
related: Kodin korjaustöiden oppaat
scope note: Laitostalouden yleisteokset Yleisteokset, jotka koskevat sekä koti- että laitostaloutta
scope note: Allmänna verk om storhushåll Allmänna verk om både privathushåll och storhushåll @sv

Säilöntä
type: Class
type: Concept
subclass of: Ravintotalous. Gastronomia
alternative label: Ahomansikka, säilöntä (691.2)
alternative label: Etikka, säilöntäohjeet (691.2)
alternative label: Graavaus (691.2)
alternative label: Hapattaminen, säilöntä (691.2)
alternative label: Hapatteet, säilöntä (691.2)
alternative label: Hapatus, säilöntä (691.2)
alternative label: Hedelmät, säilöntä (691.2)
alternative label: Herukat, mehustus (691.2)
alternative label: Herukat, säilöntä (691.2)
alternative label: Hilla, säilöntä (691.2)
alternative label: Hilloaminen, kotitalous (691.2)
alternative label: Hillot, kotisäilöntä (691.2)
alternative label: Jääkaapit, ruoan säilytys (691.2)
alternative label: Karpalo, säilöntä (691.2)
alternative label: Karviainen, säilöntä (691.2)
alternative label: Kodin työt, säilöntä (691.2)
alternative label: Kotisäilöntä (691.2)
alternative label: Kotitarve, säilöntä (691.2)
alternative label: Kotivalmistus, hillot (691.2)
alternative label: Kotivalmistus, mehut (691.2)
alternative label: Kraavaus (691.2)
alternative label: Kuivaus, säilöntä (691.2)
alternative label: Kuivurit, säilöntä (691.2)
alternative label: Kuumennus, säilöntä (691.2)
alternative label: Kylmälaitteet, säilöntä (691.2)
alternative label: Kylmäpakkaukset, säilöntä (691.2)
alternative label: Kylmävarastointi, säilöntä (691.2)
alternative label: Lakka, säilöntä (691.2)
alternative label: Maakellarit, kotisäilöntä (691.2)
alternative label: Mansikka, säilöntä (691.2)
alternative label: Mehustus, säilöntä (691.2)
alternative label: Mehut, säilöntä (691.2)
alternative label: Mesimarja, säilöntä (691.2)
alternative label: Mustikka, säilöntä (691.2)
alternative label: Pakasteet, kotisäilöntä (691.2)
alternative label: Pakastimet, kotipakastus (691.2)
alternative label: Pakastus, kotipakastus (691.2)
alternative label: Pilaantuminen, säilöntä (691.2)
alternative label: Puolukka, säilöntä (691.2)
alternative label: Raakakypsytys, säilöntä (691.2)
alternative label: Ruoka, säilöntä (691.2)
alternative label: Ruokasuola, säilöntä (691.2)
alternative label: Sokerisäilöntä (691.2)
alternative label: Suola, säilöntä (691.2)
alternative label: Suolaus, säilöntä (691.2)
alternative label: Suomuurain, säilöntä (691.2)
alternative label: Säilytys, kotisäilöntä (691.2)
alternative label: Säilytystilat, säilöntä (691.2)
alternative label: Säilyvyys, kotisäilöntä (691.2)
alternative label: Säilöminen (691.2)
alternative label: Säilöntä (691.2)
alternative label: Säilöntäaineet, kotisäilöntä (691.2)
alternative label: Tuoresuolaus (691.2)
alternative label: Tyrni, säilöntä (691.2)
broader: Ravintotalous. Gastronomia
in scheme: URN:NBN:fi:au:hklj:
notation: 691.2
related: URN:NBN:fi:au:hklj:473.1
related: Sienet
related: URN:NBN:fi:au:hklj:597.11
related: URN:NBN:fi:au:hklj:613.1
related: Koneenrakennus. Pneumatiikka. Hydrauliikka
related: URN:NBN:fi:au:hklj:649.91
related: Hedelmä-, marja- ja vihanneskasvit
related: Rakennusten erillistilat
related: URN:NBN:fi:au:hklj:681
related: Kotitalous. Kodinhoito
related: URN:NBN:fi:au:hklj:691.1
related: Leipominen
related: URN:NBN:fi:au:hklj:691.12
related: URN:NBN:fi:au:hklj:691.13
related: Kalaruoat
related: Eri maiden ja alueiden ruokalajit ja ruokakulttuuri
related: Juomat
related: Suurkeittiöt
scope note: Säilöntäohjeet. Säilöntämenetelmät Ruokatavaroiden säilöntään ja säilyttämiseen tarkoitetut tarvikkeet, keittiökoneet ja tilat koti- ja laitostalouden kannalta Kylmäsäilytys ja -säilöntä. Kuivaus. Kuivasäilytys ja -säilöntä. Hilloaminen. Mehustus. Suolaus. Etikkasäilöntä. Umpiointi. Pakastaminen Pakastimet. Jääkaapit. Kellarit. Kylmiöt. Kuivurit
scope note: Konserveringsrecept. Konserveringsmetoder Utrustning, köksmaskiner och utrymmen för konservering och förvaring av matvaror ur privathushålls- och storhushållssynvinkel Kallförvaring och konservering genom frysning. Torrförvaring och konservering genom torkning. Syltning. Saftning. Saltning. Inläggning i ättika. Vakuumförpackning. Djupfrysning Frysar. Kylskåp. Källare. Kylrum. Torkningsapparater @sv

Maalaustaiteen teoria, estetiikka ja filosofia
type: Class
type: Concept
subclass of: MAALAUSTAIDE. PIIRUSTUSTAIDE
alternative label: Maalaustaide, estetiikka ja filosofia (740.1)
alternative label: Värioppi, taide (740.1)
alternative label: Värit, taiteen värioppi (740.1)
alternative label: Färger, konstens färglära (740.1) @sv
alternative label: Färglära, konst (740.1) @sv
alternative label: Målarkonst, estetik och filosofi (740.1) @sv
broader: MAALAUSTAIDE. PIIRUSTUSTAIDE
in scheme: URN:NBN:fi:au:hklj:
notation: 740.1
preferred label: Theory, aesthetics and philosophy of painting @en
preferred label: Målarkonstens teori, estetik och filosofi @sv
related: Valo-oppi. Värioppi. Säteilyoppi
related: Taiteen estetiikka. Taidefilosofia. Taidepsykologia. Taidesosiologia. Taidepolitiikka
related: Oppikirjat. Harjoituskirjat. Tehtäväkokoelmat. Taiteen materiaalit ja tekniikka. Taidekasvatus
related: URN:NBN:fi:au:hklj:741
related: URN:NBN:fi:au:hklj:742
related: Ikonimaalaus
related: Lasimaalaus. Mosaiikkitaide
related: URN:NBN:fi:au:hklj:748
related: URN:NBN:fi:au:hklj:749
related: URN:NBN:fi:au:hklj:749.1
related: Piirustuksen materiaalit ja tekniikka
related: Pilapiirrokset. Karikatyyrit
related: Tekstaus. Kalligrafia
related: Kuvitustaide
related: Posliinitaide. Posliinimaalaus
related: URN:NBN:fi:au:hklj:767
scope note: Maalaustaiteen yleinen teoria, estetiikka ja filosofia Taiteen väriopit Maalaustaiteen erikoisalojen teoria, estetiikka ja filosofia alan mukaisessa luokassa
scope note: Målarkonstens allmänna teori, estetik och filosofi Färgläror i konsten Teori, estetik och filosofi som som hänför sig till specialområden inom målarkonsten klassificeras enligt område @sv

Valokuvauksen materiaalit ja tekniikka. Valokuvausoppaat
type: Class
type: Concept
subclass of: URN:NBN:fi:au:hklj:756
alternative label: Aiheet, valokuvausoppaat (756.2)
alternative label: Alastonmalli, valokuvauksen tekniikka (756.2)
alternative label: Albumit, valokuvien säilytys (756.2)
alternative label: Asetelmat, valokuvauksen tekniikka (756.2)
alternative label: Ateljeet, valokuvauksen tekniikka (756.2)
alternative label: Camera obscura, valokuvauksen tekniikka (756.2)
alternative label: Diakuvat, valokuvauksen tekniikka (756.2)
alternative label: Diakuvat, valokuvien säilytys (756.2)
alternative label: Diapositiivit, valokuvauksen tekniikka (756.2)
alternative label: Diapositiivit, valokuvien säilytys (756.2)
alternative label: Diaprojektorit, valokuvauksen tekniikka (756.2)
alternative label: Digikamerat, digitaalivalokuvaus (756.2)
alternative label: Digikuvaus (756.2)
alternative label: Digitaalijärjestelmäkamerat, valokuvauksen tekniikka (756.2)
alternative label: Digitaalikamerat, digitaalivalokuvaus (756.2)
alternative label: Digitaalikuvaus (756.2)
alternative label: Digitaalinen kuvankäsittely, valokuvien käsittely (756.2)
alternative label: Digitaalinen kuvaus (756.2)
alternative label: Digitaalivalokuvaus (756.2)
alternative label: Dokumenttivalokuvaus, valokuvauksen tekniikka (756.2)
alternative label: Editointi, valokuvauksen tekniikka (756.2)
alternative label: Efektit, valokuvauksen tekniikka (756.2)
alternative label: Eläinaiheet, valokuvauksen tekniikka (756.2)
alternative label: Entistäminen, valokuvat (756.2)
alternative label: Filmikortit, valmistus ja tekniikka (756.2)
alternative label: Filmit, valokuvauksen tekniikka, valokuvauksen tekniikka (756.2)
alternative label: Filtterit, valokuvauksen tekniikka (756.2)
alternative label: Harrastukset, valokuvaus (756.2)
alternative label: Henkilövalokuvaus, valokuvauksen tekniikka (756.2)
alternative label: Infrapunakamerat (756.2)
alternative label: Infrapunakuvaus (756.2)
alternative label: Järjestelmäkamerat, valokuvauksen tekniikka (756.2)
alternative label: Kamerapuhelimet, valokuvausoppaat (756.2)
alternative label: Kamerat, valokuvausoppaat (756.2)
alternative label: Kasviaiheet, valokuvausoppaat (756.2)
alternative label: Kauko-objektiivit, valokuvausoppaat (756.2)
alternative label: Kehitys, valokuvauksen tekniikka (756.2)
alternative label: Kompaktikamerat, valokuvauksen tekniikka (756.2)
alternative label: Konservointi, valokuvat (756.2)
alternative label: Kuultokuvat, valokuvauksen tekniikka (756.2)
alternative label: Kuultokuvat, valokuvien säilytys (756.2)
alternative label: Kuvaaminen, valokuvausoppaat (756.2)
alternative label: Kuvajournalismi, lehtikuvauksen tekniikka (756.2)
alternative label: Kuvamanipulaatio, valokuvien käsittely (756.2)
alternative label: Kuvankäsittely, valokuvien käsittely (756.2)
alternative label: Kuvanvalmistus, valokuvauksen tekniikka (756.2)
alternative label: Kuvaus, valokuvausoppaat (756.2)
alternative label: Lehtivalokuvaus, tekniikka (756.2)
alternative label: Luonnonkuvaus, valokuvausoppaat (756.2)
alternative label: Luonnonvalokuvaus, valokuvausoppaat (756.2)
alternative label: Lämpökamerat (756.2)
alternative label: Lämpökuvaus (756.2)
alternative label: Mainoskuvaus, valokuvauksen tekniikka (756.2)
alternative label: Maisema, valokuvauksen tekniikka (756.2)
broader: URN:NBN:fi:au:hklj:756
in scheme: URN:NBN:fi:au:hklj:
notation: 756.2
related: Arkistonhoito
related: Lehdistöoppi
related: Geodesia. Maanmittaus. Paikannus. Geoinformatiikka
related: Tähtitieteelliset kojeet
related: Matkaviestinpalvelut. Puhelinliikenne
related: URN:NBN:fi:au:hklj:627.7532
related: Optiset ja lääketieteelliset laitteet
related: Oppikirjat. Harjoituskirjat. Tehtäväkokoelmat. Taiteen materiaalit ja tekniikka. Taidekasvatus
related: MAALAUSTAIDE. PIIRUSTUSTAIDE
related: URN:NBN:fi:au:hklj:740.9
related: URN:NBN:fi:au:hklj:749.1
related: Graafisen taiteen teoria, estetiikka ja filosofia
related: Graafisen taiteen historia
related: Taidegrafiikan materiaalit ja tekniikka
related: Valokuvataide
related: URN:NBN:fi:au:hklj:760
related: Elokuva. Elokuvataide
related: Elokuvatekniikka. Videokuvauksen tekniikka
scope note: Tässä valokuvauksen tai valokuvataiteen materiaaleja ja tekniikkaa koskevat käytännön oppaat Mustavalko- ja värikuvauksen materiaalit ja tekniikka Tiettyyn aihepiiriin tai kohteeseen liittyvät valokuvausoppaat, kuten luonnon- tai maisemakuvaajan, henkilökuvaajan, dokumenttikuvaajan tai lehtikuvaajan oppaat Kamerat, objektiivit, suodattimet ja filmit valokuvauksen kannalta Valokuvien kehitys, kopiointi, suurennos, yhdistely, retusointi ja muokkaus Valokuvien säilytys ja entisöinti Makrokuvaus. Mikroskooppikuvaus. Trikkikuvaus. Mikrokuvaus. Mikrofilmien ja mikrokorttien valmistus
scope note: Hit praktiska handböcker om fotografins eller fotokonstens material och tekniker Den svartvita fotograferingens och färgfotograferingens material och tekniker Fotohandböcker som hänför sig till en bestämt motivkrets eller ett bestämt motiv såsom handböcker för natur- eller landskaps- fotografer, porträttfotografer, dokumentärfotografer eller pressfotografer Kameror, objektiv, filter och filmer ur fotografins synvinkel Framkallning, kopiering, förstoring, kombination, retuschering och bearbetning av fotografier Förvaring och konservering av fotografier Makrofotografering. Mikroskopfotografering. Trickfotografering. Mikrofotografering. Framställning av mikrofilmer och mikrokort @sv

Ilmaisutaito. Puhetaito. Lausuntataide
type: Class
type: Concept
subclass of: URN:NBN:fi:au:hklj:770
alternative label: Ei-verbaalinen viestintä, ilmaisutaito (778)
alternative label: Elekieli, ilmaisutaito (778)
alternative label: Esiintyminen (778)
alternative label: Esiintymisjännitys, esiintymistaito (778)
alternative label: Esiintymiskuume, esiintymistaito (778)
alternative label: Esiintymispelko, esiintymistaito (778)
alternative label: Esiintymistaito (778)
alternative label: Esiintymistaito, ilmaisu- ja puhetaito (778)
alternative label: Esiintymistaito, lausuntataide (778)
alternative label: Esittäminen, ilmaisu-ja puhetaito (778)
alternative label: Esittäminen, lausuntataide (778)
alternative label: Gestiikka, ilmaisutaito (778)
alternative label: Havainnollistaminen, ilmaisutaito (778)
alternative label: Ilmaisu, ilmaisutaito (778)
alternative label: Ilmaisukasvatus (778)
alternative label: Ilmaisutaito (778)
alternative label: Ilmaisutaito, lausuntataide (778)
alternative label: Ilmaukset, ilmaisutaito (778)
alternative label: Juhlapuheet, puhetaito (778)
alternative label: Jännittäminen, esiintymistaito (778)
alternative label: Kehonkieli, ilmaisutaito (778)
alternative label: Keskustelutaito, puhetaito (778)
alternative label: Kielellinen viestintä, puhetaito (778)
alternative label: Kriisiviestintä, puheviestintä, puhetaito (778)
alternative label: Kuorolausunta (778)
alternative label: Lausujat (778)
alternative label: Lausunta (778)
alternative label: Liikunnallinen ilmaisutaito (778)
alternative label: Logonomia, puhetaito (778)
alternative label: Logonomit (778)
alternative label: Mimiikka, ilmaisutaito (778)
alternative label: Pantomimiikka, ilmaisutaito (778)
alternative label: Puhe, puhetaito (778)
alternative label: Puhe-esitykset, lausuntataide (778)
alternative label: Puheakti, puhetaito (778)
alternative label: Puheentuotto, puhetaito (778)
alternative label: Puheet, puhetaito (778)
alternative label: Puheoppi, puhetaito (778)
alternative label: Puhetaito (778)
alternative label: Puhetekniikka, puhetaito (778)
alternative label: Puhetieteet (778)
alternative label: Puhetieteet, puheviestintä (778)
alternative label: Puheviestintä (778)
alternative label: Puheviestintä, puhetaito (778)
alternative label: Puhuminen, puhetaito (778)
alternative label: Ramppikuume, esiintymistaito (778)
alternative label: Retoriikka (778)
alternative label: Runonlausunta, lausuntataide (778)
alternative label: Ruumiillisuus, ilmaisutaito (778)
alternative label: Ruumiinkieli, ilmaisutaito (778)
alternative label: Ryhmäviestintä, puheviestintä, puhetaito (778)
alternative label: Sanallinen viestintä, puhetaito (778)
alternative label: Suullinen esitystaito (778)
alternative label: Suullinen ilmaisu (778)
broader: URN:NBN:fi:au:hklj:770
in scheme: URN:NBN:fi:au:hklj:
notation: 778
related: Luku-, kirjoitus- ja puhehäiriöiset
related: Järjestötoiminta. Kokoustekniikka
related: URN:NBN:fi:au:hklj:384
related: Posti
related: Radio- ja televisiotoiminta
related: Radiotoiminta
related: URN:NBN:fi:au:hklj:384.42
related: Lehdistöoppi
related: URN:NBN:fi:au:hklj:770.9
related: Teatterityö
related: Tanssitaide
related: Baletti
related: Jazzbaletti. Moderni tanssi
related: Elokuva. Elokuvataide
related: Elokuvatekniikka. Videokuvauksen tekniikka
related: Äänneoppi
related: Ruotsin kielen äänneoppi
related: Suomen kielen äänneoppi
scope note: Puhetaidon ja lausuntataiteen historia, henkilöhistoria, tekniikka ja estetiikka Suullinen ja liikunnallinen ilmaisu- ja esiintymistaito yleensä Puheopin ja puheviestinnän yleisteokset Ilmaisu-, esiintymis- ja puhetaitoon liittyvät improvisaatioharjoitukset Jos teoksessa on sekä puhe- että neuvottelutaitoa, on etusija luokalla 377
scope note: Talarkonstens och recitationskonstens historia, personhistoria, tekniker och estetik Muntlig och kroppslig framställningskonst och konsten att uppträda muntligt och kroppsligt i allmänhet Allmänna verk som rör talteknik och talkommunikation Improvisationsövningar i framställningskonst, konsten att uppträda och talarkonst Om verket handlar om både talarkonst och förhandlingskonst ges företräde åt klass 377 @sv

Kuorot (yli 9 laulajaa)
type: Class
type: Concept
subclass of: URN:NBN:fi:au:hklj:783
alternative label: Kamarikuorot (783.4 +)
alternative label: Kirkkokuorot (783.4 +)
alternative label: Kuorofestivaalit (783.4 +)
alternative label: Kuorolaulu, kuoromusiikki (783.4 +)
alternative label: Kuorolaulu, kuorot (783.4 +)
alternative label: Kuoromusiikki (783.4 +)
alternative label: Kuorot (783.4 +)
alternative label: Laulu, kuorolaulu (783.4 +)
alternative label: Laulut, kuorolaulut (783.4 +)
alternative label: Vigiliat, kuoromusiikki (783.4 +)
alternative label: Yhteislaulu, kuorolaulu (783.4 +)
alternative label: Allsång, körsång (783.4 +) @sv
alternative label: Kammarkörer (783.4 +) @sv
alternative label: Kyrkokörer (783.4 +) @sv
alternative label: Körer (783.4 +) @sv
alternative label: Körfestivaler (783.4 +) @sv
alternative label: Körmusik (783.4 +) @sv
alternative label: Körsång, körer (783.4 +) @sv
alternative label: Körsång, körmusik (783.4 +) @sv
alternative label: Sång, körsång (783.4 +) @sv
alternative label: Sånger, körsånger (783.4 +) @sv
alternative label: Vigilia, körmusik (783.4 +) @sv
broader: URN:NBN:fi:au:hklj:783
in scheme: URN:NBN:fi:au:hklj:
narrower: Kuorot ilman säestystä
narrower: Säestyksellinen kuoromusiikki
notation: 783.4
preferred label: Choirs (more than 9 singers) @en
preferred label: Körer (mer än 9 sångare) @sv
related: URN:NBN:fi:au:hklj:770
related: URN:NBN:fi:au:hklj:783.5
related: Oratoriot
related: Passiot
related: Messut. Requiemit
related: Kantaatit
related: Motetit
related: URN:NBN:fi:au:hklj:783.59
related: Oopperoiden kuoro-osat
related: URN:NBN:fi:au:hklj:784
related: URN:NBN:fi:au:hklj:784.111
related: URN:NBN:fi:au:hklj:788
related: URN:NBN:fi:au:hklj:789
scope note: Kokoelmat, joissa on sekä säestyksellistä että säestyksetöntä kuoromusiikkia Tässä ja alaluokissa myös kuoroteokset, joissa esiintyy solisteja ja/tai elektronisia osia Tässä ja alaluokissa myös kuorolaulua, kuoroja sekä niiden historiaa tai henkilöhistoriaa koskeva kirjallisuus Tässä ja alaluokissa kuoronjohtajien henkilöhistoria Tässä ja alaluokissa myös kuorolaulun oppaat
scope note: Samlingar som innehåller körmusik med eller utan ackompanjemang Hit och till underklasserna också körverk med solister eller inslag av elektronisk musik Hit och till underklasserna också litteratur om körsång och körer samt deras historia eller personhistoria Hit och till underklasserna också kördirigenters personhistoria Hit och till underklasserna också skolor för körsång @sv

Benelux-maat
type: Class
type: Concept
subclass of: Keski-Eurooppa
broader: Keski-Eurooppa
in scheme: URN:NBN:fi:au:hklj:
narrower: Belgia
narrower: Alankomaat
notation: 784.125
preferred label: Benelux countries @en
preferred label: Beneluxländerna @sv
related: URN:NBN:fi:au:hklj:473.1
related: URN:NBN:fi:au:hklj:769
related: URN:NBN:fi:au:hklj:783
related: URN:NBN:fi:au:hklj:783.1
related: URN:NBN:fi:au:hklj:787
related: URN:NBN:fi:au:hklj:787.2
related: URN:NBN:fi:au:hklj:787.29
related: URN:NBN:fi:au:hklj:788.8
related: URN:NBN:fi:au:hklj:789
related: URN:NBN:fi:au:hklj:795.1
related: URN:NBN:fi:au:hklj:797.2
related: URN:NBN:fi:au:hklj:807
scope note: Yleisteokset ja sekasisältöiset kokoelmat Tässä myös Luxemburg
scope note: Allmänna verk och samlingar med blandat innehåll Hit också Luxemburg @sv

Tsekkoslovakian alue
type: Class
type: Concept
subclass of: Itä-Eurooppa
broader: Itä-Eurooppa
in scheme: URN:NBN:fi:au:hklj:
narrower: Tsekki
narrower: Slovakia
notation: 784.162
preferred label: The former Czechoslovakia @en
preferred label: Det tidigare Tjeckoslovakien @sv
related: URN:NBN:fi:au:hklj:473.1
related: URN:NBN:fi:au:hklj:769
related: URN:NBN:fi:au:hklj:783
related: URN:NBN:fi:au:hklj:783.1
related: URN:NBN:fi:au:hklj:787
related: URN:NBN:fi:au:hklj:787.2
related: URN:NBN:fi:au:hklj:787.29
related: URN:NBN:fi:au:hklj:788.8
related: URN:NBN:fi:au:hklj:789
related: URN:NBN:fi:au:hklj:795.1
related: URN:NBN:fi:au:hklj:797.2
related: URN:NBN:fi:au:hklj:807
scope note: Yleisteokset ja sekasisältöiset kokoelmat
scope note: Allmänna verk och samlingar med blandat innehåll @sv

Karjalan tasavalta
type: Class
type: Concept
subclass of: Venäjä
broader: Venäjä
in scheme: URN:NBN:fi:au:hklj:
notation: 784.1711
preferred label: Karelian Republic @en
preferred label: Karelska republiken @sv
related: URN:NBN:fi:au:hklj:473.1
related: URN:NBN:fi:au:hklj:769
related: URN:NBN:fi:au:hklj:783
related: URN:NBN:fi:au:hklj:783.1
related: URN:NBN:fi:au:hklj:784.111
related: Itä-Eurooppa
related: Itsenäisten valtioiden yhteisön Aasian puoleiset alueet
related: URN:NBN:fi:au:hklj:787
related: URN:NBN:fi:au:hklj:787.2
related: URN:NBN:fi:au:hklj:787.29
related: URN:NBN:fi:au:hklj:788.8
related: URN:NBN:fi:au:hklj:789
related: URN:NBN:fi:au:hklj:795.1
related: URN:NBN:fi:au:hklj:797.2
related: URN:NBN:fi:au:hklj:807

Korea
type: Class
type: Concept
subclass of: Keski- ja Itä-Aasia
broader: Keski- ja Itä-Aasia
in scheme: URN:NBN:fi:au:hklj:
notation: 784.253
related: URN:NBN:fi:au:hklj:473.1
related: URN:NBN:fi:au:hklj:769
related: URN:NBN:fi:au:hklj:783
related: URN:NBN:fi:au:hklj:783.1
related: URN:NBN:fi:au:hklj:784.9
related: URN:NBN:fi:au:hklj:787
related: URN:NBN:fi:au:hklj:787.2
related: Itämaisten uskontojen musiikki
related: Islamilaisten uskonnollinen musiikki
related: URN:NBN:fi:au:hklj:787.29
related: URN:NBN:fi:au:hklj:788.8
related: URN:NBN:fi:au:hklj:789
related: Varhaiskansojen musiikki
related: URN:NBN:fi:au:hklj:795.1
related: URN:NBN:fi:au:hklj:797.2
related: URN:NBN:fi:au:hklj:807
scope note: Korean tasavalta. Korean kansantasavalta
scope note: Republiken Korea. Demokratiska Folkrepubliken Korea @sv

Kiina
type: Class
type: Concept
subclass of: Keski- ja Itä-Aasia
alternative label: Kiina, kansanmusiikki (784.254)
alternative label: Tiibet, kansanmusiikki (784.254)
alternative label: Kina, folkmusik (784.254) @sv
alternative label: Tibet, folkmusik (784.254) @sv
broader: Keski- ja Itä-Aasia
in scheme: URN:NBN:fi:au:hklj:
notation: 784.254
preferred label: China @en
preferred label: Kina @sv
related: URN:NBN:fi:au:hklj:473.1
related: URN:NBN:fi:au:hklj:769
related: URN:NBN:fi:au:hklj:783
related: URN:NBN:fi:au:hklj:783.1
related: URN:NBN:fi:au:hklj:784.9
related: URN:NBN:fi:au:hklj:787
related: URN:NBN:fi:au:hklj:787.2
related: Itämaisten uskontojen musiikki
related: Islamilaisten uskonnollinen musiikki
related: URN:NBN:fi:au:hklj:787.29
related: URN:NBN:fi:au:hklj:788.8
related: URN:NBN:fi:au:hklj:789
related: Varhaiskansojen musiikki
related: URN:NBN:fi:au:hklj:795.1
related: URN:NBN:fi:au:hklj:797.2
related: URN:NBN:fi:au:hklj:807
scope note: Tässä myös Hongkong, Macao, Taiwan ja Tiibet
scope note: Hit också Hongkong, Macau, Taiwan och Tibet @sv

Japani
type: Class
type: Concept
subclass of: Keski- ja Itä-Aasia
alternative label: Japani, kansanmusiikki (784.256)
alternative label: Japan, folkmusik (784.256) @sv
broader: Keski- ja Itä-Aasia
in scheme: URN:NBN:fi:au:hklj:
notation: 784.256
preferred label: Japan @en
related: URN:NBN:fi:au:hklj:473.1
related: URN:NBN:fi:au:hklj:769
related: URN:NBN:fi:au:hklj:783
related: URN:NBN:fi:au:hklj:783.1
related: URN:NBN:fi:au:hklj:784.9
related: URN:NBN:fi:au:hklj:787
related: URN:NBN:fi:au:hklj:787.2
related: Itämaisten uskontojen musiikki
related: Islamilaisten uskonnollinen musiikki
related: URN:NBN:fi:au:hklj:787.29
related: URN:NBN:fi:au:hklj:788.8
related: URN:NBN:fi:au:hklj:789
related: Varhaiskansojen musiikki
related: URN:NBN:fi:au:hklj:795.1
related: URN:NBN:fi:au:hklj:797.2
related: URN:NBN:fi:au:hklj:807

Itä-Afrikka
type: Class
type: Concept
subclass of: Afrikka
broader: Afrikka
in scheme: URN:NBN:fi:au:hklj:
notation: 784.34
preferred label: East Africa @en
preferred label: Östafrika @sv
related: Kirkolliset juhlat ja juhlapäivät
related: URN:NBN:fi:au:hklj:473.1
related: URN:NBN:fi:au:hklj:769
related: URN:NBN:fi:au:hklj:783
related: URN:NBN:fi:au:hklj:783.1
related: URN:NBN:fi:au:hklj:784.9
related: URN:NBN:fi:au:hklj:787
related: URN:NBN:fi:au:hklj:787.2
related: Islamilaisten uskonnollinen musiikki
related: URN:NBN:fi:au:hklj:787.29
related: URN:NBN:fi:au:hklj:788.8
related: URN:NBN:fi:au:hklj:789
related: URN:NBN:fi:au:hklj:795.1
related: URN:NBN:fi:au:hklj:797.2
related: URN:NBN:fi:au:hklj:807
scope note: Burundi. Djibouti. Eritrea. Etiopia. Kenia. Ruanda. Somalia. Tansania. Uganda Afrikan sarvi
scope note: Burundi. Djibouti. Eritrea. Etiopien. Kenya. Rwanda. Somalia. Tanzania. Uganda Afrikas horn @sv

Yhdysvallat
type: Class
type: Concept
subclass of: Pohjois-Amerikka
alternative label: USA, kansanmusiikki (784.42)
alternative label: Yhdysvallat, kansanmusiikki (784.42)
alternative label: Förenta staterna, folkmusik (784.42) @sv
alternative label: USA, folkmusik (784.42) @sv
broader: Pohjois-Amerikka
in scheme: URN:NBN:fi:au:hklj:
notation: 784.42
preferred label: United States of America @en
preferred label: Förenta staterna @sv
related: URN:NBN:fi:au:hklj:473.1
related: URN:NBN:fi:au:hklj:769
related: URN:NBN:fi:au:hklj:783
related: URN:NBN:fi:au:hklj:783.1
related: Karibianmeren saaret
related: Tyynen meren saaret
related: Intiaanit
related: Eskimot. Inuiitit
related: URN:NBN:fi:au:hklj:787
related: URN:NBN:fi:au:hklj:787.2
related: URN:NBN:fi:au:hklj:787.29
related: URN:NBN:fi:au:hklj:788.8
related: URN:NBN:fi:au:hklj:789
related: URN:NBN:fi:au:hklj:795.1
related: URN:NBN:fi:au:hklj:797.2
related: URN:NBN:fi:au:hklj:807
scope note: Tässä myös Alaska
scope note: Hit också Alaska @sv

Karibianmeren saaret
type: Class
type: Concept
subclass of: Väli-Amerikka
alternative label: Calypso, kansanmusiikki (784.58)
alternative label: Latinalaisamerikkalainen musiikki, kansanmusiikki, Karibian alue (784.58)
alternative label: Mento, perinnemusiikki (784.58)
alternative label: Merengue, perinnemusiikki (784.58)
alternative label: Calypso, folkmusik (784.58) @sv
alternative label: Latinamerikansk musik, folkmusik, karibiska området (784.58) @sv
alternative label: Mento, traditionell musik (784.58) @sv
alternative label: Merengue, traditionell musik (784.58) @sv
broader: Väli-Amerikka
in scheme: URN:NBN:fi:au:hklj:
notation: 784.58
preferred label: Caribbean Islands @en
preferred label: Karibiska öarna @sv
related: URN:NBN:fi:au:hklj:473.1
related: URN:NBN:fi:au:hklj:769
related: URN:NBN:fi:au:hklj:783
related: URN:NBN:fi:au:hklj:783.1
related: Pohjois-Amerikka
related: Yhdysvallat
related: Etelä-Amerikka
related: Intiaanit
related: URN:NBN:fi:au:hklj:787
related: URN:NBN:fi:au:hklj:787.2
related: URN:NBN:fi:au:hklj:787.29
related: URN:NBN:fi:au:hklj:788.8
related: URN:NBN:fi:au:hklj:789
related: URN:NBN:fi:au:hklj:795.1
related: URN:NBN:fi:au:hklj:797.2
related: URN:NBN:fi:au:hklj:807
scope note: Isot-Antillit. Pienet Antillit Alankomaiden Antillit. Anguilla. Antigua ja Barbuda. Aruba. Bahama. Barbados. Bermuda. Caymansaaret. Dominica. Dominikaaninen tasavalta. Grenada. Guadeloupe. Haiti. Jamaika. Kuuba. Martinique. Montserrat. Neitsytsaaret. Puerto Rico. Saint Kitts ja Nevis. Saint Lucia. Saint Vincent ja Grenadiinit. Trinidad ja Tobago. Turks- ja Caicossaaret
scope note: Stora Antillerna. Små Antillerna Anguilla. Antigua och Barbuda. Aruba. Bahamaöarna. Barbados. Bermuda. Caymanöarna. Dominica. Dominikanska republiken. Grenada. Guadeloupe. Haiti. Jamaica. Jungfruöarna. Kuba. Martinique. Montserrat. Nederländska Antillerna. Puerto Rico. Saint Christopher och Nevis. Saint Lucia. Saint Vincent och Grenadinerna. Trinidad och Tobago. Turks- och Caicosöarna @sv

Australia. Uusi-Seelanti. Uusi-Guinea
type: Class
type: Concept
subclass of: Australia. Oseania
alternative label: Australia, kansanmusiikki (784.71)
alternative label: Maorit, kansanmusiikki (784.71)
alternative label: Australien, folkmusik (784.71) @sv
alternative label: Maorier, folkmusik (784.71) @sv
broader: Australia. Oseania
in scheme: URN:NBN:fi:au:hklj:
notation: 784.71
preferred label: Australia. New Zealand. New Guinea @en
preferred label: Australien. Nya Zeeland. Nya Guinea @sv
related: URN:NBN:fi:au:hklj:473.1
related: URN:NBN:fi:au:hklj:769
related: URN:NBN:fi:au:hklj:783
related: URN:NBN:fi:au:hklj:783.1
related: Kaakkois-Aasia
related: URN:NBN:fi:au:hklj:784.9
related: URN:NBN:fi:au:hklj:787
related: URN:NBN:fi:au:hklj:787.2
related: URN:NBN:fi:au:hklj:787.29
related: URN:NBN:fi:au:hklj:788.8
related: URN:NBN:fi:au:hklj:789
related: URN:NBN:fi:au:hklj:795.1
related: URN:NBN:fi:au:hklj:797.2
related: URN:NBN:fi:au:hklj:807

Eskimot. Inuiitit
type: Class
type: Concept
subclass of: URN:NBN:fi:au:hklj:784.9
alternative label: Amerikka, kansanmusiikki, eskimot (784.94)
alternative label: Amerikka, musiikki, eskimot (784.94)
alternative label: Eskimot, musiikki (784.94)
alternative label: Inuitit, musiikki (784.94)
alternative label: Pohjois-Amerikka, kansanmusiikki, eskimot (784.94)
alternative label: Pohjois-Amerikka, musiikki, eskimot (784.94)
alternative label: Amerika, folkmusik, eskimåer (784.94) @sv
alternative label: Amerika, musik, eskimåer (784.94) @sv
alternative label: Eskimåer, musik (784.94) @sv
alternative label: Inuiter, musik (784.94) @sv
alternative label: Nordamerika, folkmusik, eskimåer (784.94) @sv
alternative label: Nordamerika, musik, eskimåer (784.94) @sv
broader: URN:NBN:fi:au:hklj:784.9
in scheme: URN:NBN:fi:au:hklj:
notation: 784.94
preferred label: Eskimos (Inuit) @en
preferred label: Eskimåer. Inuiter @sv
related: URN:NBN:fi:au:hklj:473.1
related: URN:NBN:fi:au:hklj:769
related: URN:NBN:fi:au:hklj:783
related: URN:NBN:fi:au:hklj:783.1
related: Tanska
related: Pohjois-Amerikka
related: Kanada
related: Yhdysvallat
related: URN:NBN:fi:au:hklj:787
related: URN:NBN:fi:au:hklj:787.2
related: URN:NBN:fi:au:hklj:787.29
related: URN:NBN:fi:au:hklj:788.8
related: URN:NBN:fi:au:hklj:789
related: URN:NBN:fi:au:hklj:795.1
related: URN:NBN:fi:au:hklj:797.2
related: URN:NBN:fi:au:hklj:807

Itsenäisten valtioiden yhteisö
type: Class
type: Concept
subclass of: Eurooppa
alternative label: Neuvostoliitto, musiikinhistoria (789.27 +)
alternative label: Sovjetunionen, musikhistoria (789.27 +) @sv
broader: Eurooppa
in scheme: URN:NBN:fi:au:hklj:
narrower: Venäjä
narrower: Ukraina
narrower: Valko-Venäjä
narrower: Moldova
notation: 789.27
preferred label: Commonwealth of Independent States @en
preferred label: Oberoende staternas samvälde @sv
related: URN:NBN:fi:au:hklj:709
related: URN:NBN:fi:au:hklj:782.4
related: URN:NBN:fi:au:hklj:783
related: URN:NBN:fi:au:hklj:789.1
related: Itä-Eurooppa
related: Itsenäisten valtioiden yhteisön Aasian puoleiset maat
related: Kaukasuksen maat
scope note: Yleisteokset, jotka koskevat sekä IVY:n Euroopan että Aasian puoleisia alueita IVY:n Euroopan puoleiset alueet yleensä
scope note: Allmänna verk som rör både de asiatiska och europeiska områdena av OSS De europeiska områdena av OSS i allmänhet @sv

Ukrainan, Valko-Venäjän ja Moldovan historia
type: Class
type: Concept
subclass of: Venäjän historia
alternative label: Krim, Ukrainan historia (971.9)
alternative label: Krim, Ukrainas historia (971.9) @sv
broader: Venäjän historia
in scheme: URN:NBN:fi:au:hklj:
narrower: Ukrainan historia
narrower: Valko-Venäjän historia
narrower: Moldovan historia
notation: 971.9
preferred label: History of the Ukraine, Belorussia and Moldova (formerly Moldavia) @en
preferred label: Ukrainas, Vitrysslands och Moldovas (f.d. Moldaviens) historia @sv
related: Menetetty Karjalan alue
related: Lappi
related: Armenia. Azerbaidzan. Georgia. Kazakstan. Kirgisia. Tadzikistan. Turkmenistan. Uzbekistan
related: URN:NBN:fi:au:hklj:909
related: URN:NBN:fi:au:hklj:919
related: Neuvostoliiton historia 1917-1991
related: Venäjän historia 1992-
related: Aasian historia
related: URN:NBN:fi:au:hklj:989
scope note: Tässä teokset, jotka koskevat sekä Ukrainan että Valko-Venäjän tai Moldovan historiaa Tässä ja alaluokissa Ukrainan, Valko-Venäjän ja Moldovan historia myös neuvostovallan ajalta
scope note: Hit verk som handlar om såväl Ukrainas som Vitrysslands eller Moldovas historia Hit och till underklasserna Ukrainas, Vitrysslands och Moldovas historia också under Sovjetväldet @sv

Maantieteilijät. Tutkimusmatkailijat. Löytöretkeilijät.Kansatieteilijät. Antropologit
type: Class
type: Concept
subclass of: HENKILÖ- JA SUKUHISTORIA
alternative label: Antropologit, elämäkerrat ja muistelmat (994 +)
alternative label: Biografiat, muiden alojen edustajat (991 ... 997 +)
alternative label: Edelläkävijät, muiden alojen edustajat (991 ... 997 +)
alternative label: Elämäkerrat, muiden alojen edustajat (991 ... 997 +)
alternative label: Elämänhistoria, henkilöhistoria, muiden alojen edustajat (991 ... 997 +)
alternative label: Etnografit, elämäkerrat ja muistelmat (994 +)
alternative label: Etnologit, elämäkerrat ja muistelmat (994 +)
alternative label: Geologit, elämäkerrat ja muistelmat (994 +)
alternative label: Haastattelut, henkilöhistoria, muut alat (991 ... 997 +)
alternative label: Henkilöhistoria, muiden alojen edustajat (991 ... 997 +)
alternative label: Henkilökuvat, muiden alojen edustajat (991 ... 997 +)
alternative label: Henkilöt, muiden alojen edustajat (991 ... 997 +)
alternative label: Historia, henkilöhistoria, muut alat (991 ... 997 +)
alternative label: Julkisuuden henkilöt, muiden alojen edustajat (991 ... 997 +)
alternative label: Kansalliset suurmiehet, muiden alojen edustajat (991 ... 997 +)
alternative label: Kansatieteilijät, elämäkerrat ja muistelmat (994 +)
alternative label: Kirjeet, muiden alojen edustajat (991 ... 997 +)
alternative label: Lapsuus, muiden alojen edustajat (991 ... 997 +)
alternative label: Löytöretkeilijät, elämäkerrat ja muistelmat (994 +)
alternative label: Maahanmuuttajat, henkilöhistoria, muuta alat (991 ... 997 +)
alternative label: Maanmittarit, elämäkerrat ja muistelmat (994 +)
alternative label: Maanpako, henkilöhistoria, muut alat (991 ... 997 +)
alternative label: Maantieteilijät, elämäkerrat ja muistelmat (994)
alternative label: Matkailijat, tutkimusmatkailijat (994 +)
alternative label: Matkailuoppaat, elämäkerrat ja muistelmat (994 +)
alternative label: Merenkulkijat, elämäkerrat ja muistelmat (993 ... 994 +)
alternative label: Merenkävijät, elämäkerrat ja muistelmat (993 ... 994 +)
alternative label: Merkkihenkilöt, muiden alojen edustajat (991 ... 997 +)
alternative label: Muistelmat, muiden alojen edustajat (991 ... 997 +)
alternative label: Muistokirjoitukset, muiden alojen edustajat (991 ... 997 +)
alternative label: Nekrologit, muiden alojen edustajat (991 ... 997 +)
alternative label: Omaelämäkerrat, muiden alojen edustajat (991 ... 997 +)
alternative label: Pakolaiset, henkilöhistoria, muut alat (991 ... 997 +)
alternative label: Professorit, muiden alojen edustajat (991 ... 997 +)
alternative label: Päiväkirjat, muiden alojen edustajat (991 ... 997 +)
alternative label: Rakkauskirjeet, muiden alojen edustajat (991 ... 997 +)
alternative label: Siirtolaiset, henkilöhistoria, muut alat (991 ... 997 +)
alternative label: Suurmiehet, muiden alojen edustajat (991 ... 997 +)
alternative label: Tutkimusmatkailijat, elämäkerrat ja muistelmat (994 +)
alternative label: Uranuurtajat, muiden alojen edustajat (991 ... 997 +)
alternative label: Vaihtoehtohistoria, henkilöhistoria, muut alat (991 ... 997 +)
alternative label: Vaihtoehtoinen historia, henkilöhistoria, muut alat (991 ... 997 +)
alternative label: Alternativ historia, personhistoria, övriga områden (991 ... 997 +) @sv
alternative label: Antropologer, biografier och memoarer (994 +) @sv
alternative label: Barndom, andra yrkesområdens representanter (991 ... 997 +) @sv
alternative label: Bemärkta personer, andra yrkesområdens representanter (991 ... 997 +) @sv
alternative label: Biografier, andra yrkesområdens representanter (991 ... 997 +) @sv
alternative label: Brev, andra yrkesområdens representanter (991 ... 997 +) @sv
alternative label: Dagböcker, andra yrkesområdens representanter (991 ... 997 +) @sv
alternative label: Etnografer, biografier och memoarer (994 +) @sv
alternative label: Etnologer, biografier och memoarer (994 +) @sv
alternative label: Flyktingar, personhistoria, övriga områden (991 ... 997 +) @sv
alternative label: Folklivsforskare, biografier och memoarer (994 +) @sv
alternative label: Forskningsresande, biografier och memoarer (994 +) @sv
alternative label: Föregångare, andra yrkesområdens representanter (991 ... 997 +) @sv
alternative label: Geografer, biografier och memoarer (994) @sv
alternative label: Geologer, biografier och memoarer (994 +) @sv
alternative label: Guider, biografier och memoarer (994 +) @sv
broader: HENKILÖ- JA SUKUHISTORIA
in scheme: URN:NBN:fi:au:hklj:
narrower: Suomi
notation: 994
related: Pelastusoppi. Kristillinen antropologia
related: URN:NBN:fi:au:hklj:323
related: Poliittiset ja aatteelliset vähemmistöt
related: Löytöretket. Tutkimusmatkat
related: URN:NBN:fi:au:hklj:617
related: URN:NBN:fi:au:hklj:618.24
related: URN:NBN:fi:au:hklj:618.3
related: URN:NBN:fi:au:hklj:909
related: URN:NBN:fi:au:hklj:919
related: URN:NBN:fi:au:hklj:994.03
related: Humanististen tieteiden edustajat
related: Suomi
related: Sukuhistoria. Sukututkimus
scope note: Tässä esim. maantieteilijöiden, tutkimusmatkailijoiden, löytöretkeilijöiden, kansatieteilijöiden ja antropologien henkilöhistoria
scope note: Hit t.ex. geografers, forskningsresandes, upptäcktsresandes, etnologers och antropologers personhistoria @sv

SUOMENKIELINEN KAUNOKIRJALLISUUS (Kaunoluokka)
type: Class
type: Concept
type: FormClass
subclass of: Kaunoluokat
broader: Kaunoluokat
in scheme: URN:NBN:fi:au:hklj:
narrower: Suomenkieliset kansanrunot (Kaunoluokka)
narrower: Suomenkieliset runot (Kaunoluokka)
narrower: Suomenkieliset näytelmät ja kuunnelmat (Kaunoluokka)
narrower: Suomenkieliset romaanit, novellit ja näytelmäelokuvat (Kaunoluokka)
narrower: Suomenkielinen murrekirjallisuus (Kaunoluokka)
narrower: Suomenkieliset sadut (Kaunoluokka)
narrower: Vironkielinen kaunokirjallisuus (Kaunoluokka)
narrower: Muiden suomalais-ugrilaisten kielten kaunokirjallisuus (Kaunoluokka)
notation: 1
preferred label: FINNISH FICTION (Fiction class) @en
preferred label: FINSK SKÖNLITTERATUR (Skönklass) @sv
scope note: Kaunokirjallisuuden luokissa teokset ovat julkaisun kielen, eivät julkaisumaan tai alkuteoksen kielen mukaisessa luokassa Jos kaksikielisen teoksen toinen kieli on käännöskieli, on teos käännöskielen mukaisessa luokassa Jos kaksi- tai useampikielisen teoksen tekstit eivät ole toistensa käännöksiä, on teos julkaisun pääkielen mukaisessa luokassa Jos teoksella ei ole pääkieltä, se on julkaisun ensimmäisen kielen mukaisessa luokassa Fiktiiviset video- ja elokuvatallenteet ovat kaunokirjallisuuden luokissa, näytelmäelokuvat romaanien luokissa, näytelmäesitysten tallenteet näytelmien luokissa, satuelokuvat satujen luokissa sekä piirretyt, nukke- ja animaatioelokuvat sarjakuvien luokissa Tekstitetyt elokuva- ja videotallenteet ovat tekstityskielen mukaisessa luokassa Elokuvakäsikirjoitukset ovat elokuvan historian luokassa 777.9+ Kaunokirjalliset äänitteet ovat kaunokirjallisuuden luokissa, kuunnelmat näytelmien luokissa ja ääneen luettu kirjallisuus ko. kirjallisuudenlajin luokissa Tässä kaunokirjalliset sekasisältöiset kokoelmat, valikoimat, antologiat, lukemistot, lukukirjat, ohjelmistot ja aapiset Jos teos painottuu johonkin kaunokirjallisuuden lajiin, on etusija kirjallisuuden lajin mukaisella luokalla
scope note: I klasserna för skönlitteraturen klassificeras verken enligt publikationens språk, inte enligt klassen för utgivningslandets eller originaltitelns språk Om det ena språket i ett tvåspråkigt verk år översättningsspråk klassificeras verket enligt översättningsspråket Om texterna i ett tvåspråkigt eller flerspråkigt verk inte är översättningar av varandra klassificeras verket enligt publikationens huvudspråk Om verket inte har något huvudspråk klassificeras det enligt det första språket i publikationen Fiktiva videoinspelningar och filminspelningar förs till de skönlitteraära klasserna; spelfiler förs till klasserna för romaner, inspelningar av teaterföreställningar förs till klasserna för drama, sagofilmer förs till klasserna för sagor och tecknade filmer, dockfilmer samt animationsfilmer förs till klasserna för tecknade serier Textade videoinspelningar och filminspelningar klassificeras enligt textningens språk Filmmanus förs till klassen för filmens historia 777.9+ Ljudupptagningar med skönlitteratur förs till de skönlitterära klasserna; hörspel förs till klasserna för drama och inläst litteratur klassificeras enligt litterärt temaområde eller genre Hit skönlitterära samlade verk, verk i urval, antologier, textböcker, läseböcker, program och ABC-böcker med blandat innehåll, Om någon skönlitterär genre dominerar i verket ges företräde åt klassen för den litterära genren i fråga @sv

Muiden slaavilaisten kielten kaunokirjallisuus (Kaunoluokka)
type: Class
type: Concept
type: FormClass
subclass of: VENÄJÄNKIELINEN KAUNOKIRJALLISUUS (Kaunoluokka)
broader: VENÄJÄNKIELINEN KAUNOKIRJALLISUUS (Kaunoluokka)
in scheme: URN:NBN:fi:au:hklj:
narrower: Tsekinkielinen kaunokirjallisuus (Kaunoluokka)
narrower: Slovakinkielinen kaunokirjallisuus (Kaunoluokka)
narrower: Bulgariankielinen kaunokirjallisuus (Kaunoluokka)
narrower: Serbiankielinen kaunokirjallisuus (Kaunoluokka)
narrower: Kroatiankielinen kaunokirjallisuus (Kaunoluokka)
narrower: Sloveeninkielinen kaunokirjallisuus (Kaunoluokka)
narrower: Bosniankielinen kaunokirjallisuus (Kaunoluokka)
narrower: Ukrainankielinen kaunokirjallisuus (Kaunoluokka)
narrower: Valkovenäjänkielinen kaunokirjallisuus (Kaunoluokka)
notation: 8.9
preferred label: Fiction in other Slavic languages (Fiction class) @en
preferred label: Skönlitteratur på andra slaviska språk (Skönklass) @sv
scope note: Makedoniankielinen kaunokirjallisuus Montenegronkielinen kaunokirjallisuus
scope note: Skönlitteratur på makedoniska Skönlitteratur på montenegrinska @sv

MUIDEN KIELTEN KAUNOKIRJALLISUUS (Kaunoluokka)
type: Class
type: Concept
type: FormClass
subclass of: Kaunoluokat
broader: Kaunoluokat
in scheme: URN:NBN:fi:au:hklj:
narrower: Balttilaisten kielten kaunokirjallisuus (Kaunoluokka)
narrower: Kreikankielinen kaunokirjallisuus (Kaunoluokka)
narrower: Latinankielinen kaunokirjallisuus (Kaunoluokka)
narrower: Turkinkielinen kaunokirjallisuus (Kaunoluokka)
narrower: Seemiläisten kielten kaunokirjallisuus (Kaunoluokka)
narrower: Indoiraanisten kielten kaunokirjallisuus (Kaunoluokka)
narrower: Tiibetiläis-burmalaisten ja austroaasialaisten kielten kaunokirjallisuus (Kaunoluokka)
narrower: Japaninkielinen kaunokirjallisuus (Kaunoluokka)
narrower: Muiden kielten kaunokirjallisuus (Kaunoluokka)
notation: 9
preferred label: FICTION IN OTHER LANGUAGES (Fiction class) @en
preferred label: SKÖNLITTERATUR PÅ ÖVRIGA SPRÅK (Skönklass) @sv

Indoiraanisten kielten kaunokirjallisuus (Kaunoluokka)
type: Class
type: Concept
type: FormClass
subclass of: MUIDEN KIELTEN KAUNOKIRJALLISUUS (Kaunoluokka)
broader: MUIDEN KIELTEN KAUNOKIRJALLISUUS (Kaunoluokka)
in scheme: URN:NBN:fi:au:hklj:
narrower: Persiankielinen kaunokirjallisuus (Kaunoluokka)
narrower: Kurdinkielinen kaunokirjallisuus (Kaunoluokka)
narrower: Bengalinkielinen kaunokirjallisuus (Kaunoluokka)
narrower: Gudžaratinkielinen kaunokirjallisuus (Kaunoluokka)
narrower: Hindinkielinen kaunokirjallisuus (Kaunoluokka)
narrower: Pandžabinkielinen kaunokirjallisuus (Kaunoluokka)
narrower: Paštunkielinen kaunokirjallisuus (Kaunoluokka)
narrower: Romanikielinen kaunokirjallisuus (Kaunoluokka)
narrower: Urdunkielinen kaunokirjallisuus (Kaunoluokka)
notation: 9.6
preferred label: Indo-Iranian fiction (Fiction class) @en
preferred label: Indoiransk skönlitteratur (Skönklass) @sv
scope note: Intialaisten ja iranilaisten kielten kaunokirjallisuus Assamin-, biharin-, kashmirin-, marathin-, orijan-, rajasthanin-, sanskritin-, sindhin- ja singalinkielinen kaunokirjallisuus Belutsin-, jaghnobin-, osseetin-, pamirin- ja tadzikinkielinen kaunokirjallisuus
scope note: Skönlitteratur på indiska och iranska språk Skönlitteratur på assamesiska, bihari, kashmiri, marathi, oriya, rajasthani, sanskrit, sindhi och singalesiska Skönlitteratur på baluchiska, jaghnob, ossetiska, pamir och tadjikiska @sv

Taiteet. Liikunta
type: Class
type: Concept
subclass of: Erikoisalojen bibliografiat
broader: Erikoisalojen bibliografiat
in scheme: URN:NBN:fi:au:hklj:
notation: 015.7
preferred label: Art. Sport @en
preferred label: Konst. Sport @sv
related: Lasten- ja nuortenkirjallisuuden luettelot
related: Yleisbibliografiat. Kansallisbibliografiat
related: Kirjastojen luettelot
related: Kustantajien ja kirjakauppojen luettelot
related: Sanakirjat. Hakuteokset
related: Esseet. Taidearvostelut
related: Kausijulkaisut
related: Yhdistykset. Laitokset. Kokoukset
related: Taideopinnot
related: Kokoomateokset
related: URN:NBN:fi:au:hklj:709
related: URN:NBN:fi:au:hklj:710
related: URN:NBN:fi:au:hklj:720
related: KUVANVEISTOTAIDE
related: MAALAUSTAIDE. PIIRUSTUSTAIDE
related: GRAAFINEN TAIDE. VALOKUVAUS
related: URN:NBN:fi:au:hklj:760
related: URN:NBN:fi:au:hklj:770
related: Musiikkibibliografiat. Diskografiat
scope note: Bibliografiset julkaisut, jotka koskevat pääluokan 700 erikoisaloja, kuten urheilua, liikuntaa, leikkejä tai huveja Tässä myös bibliografiat, joissa on taidetta tai taidehistoriaa koskevaa kirjallisuutta, ei kuitenkaan musiikkikirjallisuutta
scope note: Bibliografier över specialområden som hör till huvudklass 700, såsom sport, motion, lekar och nöjen Hit också bibliografier över litteratur som rör konst och konsthistoria, dock inte musiklitteratur @sv

Valinta ja hankinta
type: Class
type: Concept
subclass of: Kirjastoaineisto. Kokoelmatyö
alternative label: Aineistonvalinta, kirjastoaineisto (022.3)
alternative label: Hankinta, kirjastoaineisto (022.3)
alternative label: Kirjanvalinta, kirjastonhoito (022.3)
alternative label: Kirjavalinta, kirjastoaineisto (022.3)
alternative label: Vapaakappaleet (022.3 +)
alternative label: Anskaffning, biblioteksmedier (022.3) @sv
alternative label: Bokval, biblioteksarbete (022.3) @sv
alternative label: Bokval, biblioteksmedier (022.3) @sv
alternative label: Friexemplar (022.3 +) @sv
alternative label: Medieval, biblioteksmedier (022.3) @sv
broader: Kirjastoaineisto. Kokoelmatyö
in scheme: URN:NBN:fi:au:hklj:
notation: 022.3
preferred label: Choice and acquisition @en
preferred label: Val och anskaffning @sv
related: Kustannustoimi. Kirjakauppa
related: URN:NBN:fi:au:hklj:010
related: URN:NBN:fi:au:hklj:018
related: Muu kuin kirja-aineisto kirjastossa
related: Lastenkirjastot
related: Koulukirjastot
related: Erityisten väestöryhmien kirjastopalvelut
related: Sairaalakirjastot
related: Erikoiskokoelmat
related: Paikalliskokoelmat
related: Kirjastoautot. Kirjastoveneet
related: Yleiset kirjastot
related: Erikoiskirjastot. Yhdistysten, laitosten ja yritysten kirjastot
related: URN:NBN:fi:au:hklj:028
related: Dokumentaatio ja informaatiopalvelu yleensä
related: Museonhoito
related: Arkistonhoito
related: URN:NBN:fi:au:hklj:061
related: URN:NBN:fi:au:hklj:063
scope note: Kirjastoaineiston (paitsi musiikin) valinta ja hankinta aineistotyypistä riippumatta Valinta- ja hankintatavat. Valinta- ja hankintajärjestelmät Ostot. Vaihdot. Lahjat. Vapaakappaleet
scope note: Val och anskaffning av biblioteksmedier (undantaget musikmedier) oavsett mediatyp Principer för val och anskaffning. System för val och anskaffning Köp. Byten. Gåvor. Friexemplar @sv

Lainaus
type: Class
type: Concept
subclass of: Yleisönpalvelu
alternative label: Atk-lainausjärjestelmät, kirjastot (024.1)
alternative label: Detroit-lainaus, kirjastot (024.1)
alternative label: Kameralainaus (024.1)
alternative label: Kaukolainaus (024.1)
alternative label: Kaukopalvelu, kirjastot (024.1)
alternative label: Kirjastokortit (024.1)
alternative label: Kuittilainaus, kirjasto (024.1)
alternative label: Lainaajarekisterit (024.1)
alternative label: Lainaajat, lainaustoiminta, kirjastot (024.1)
alternative label: Lainausjärjestelmät (024.1)
alternative label: Lainaustoiminta, lainaustoiminta (024.1)
alternative label: Myöhästymismaksut, kirjasto (024.1)
alternative label: Varaukset, lainaustoiminta (024.1)
alternative label: ADB-utlåningssystem, bibliotek (024.1) @sv
alternative label: Bibliotekskort (024.1) @sv
alternative label: Detroit-utlåning, bibliotek (024.1) @sv
alternative label: Fjärrlån, bibliotek (024.1) @sv
alternative label: Fjärrutlåning (024.1) @sv
alternative label: Förseningsavgifter, bibliotek (024.1) @sv
alternative label: Kamerautlåning (024.1) @sv
alternative label: Kvittoutlåning, bibliotek (024.1) @sv
alternative label: Lånesystem (024.1) @sv
alternative label: Låntagare, utlåningsverksamhet, bibliotek (024.1) @sv
alternative label: Låntagarregister (024.1) @sv
alternative label: Reserveringar, utlåningsverksamhet (024.1) @sv
alternative label: Utlåningsverksamhet, utlåningsverksamhet (024.1) @sv
broader: Yleisönpalvelu
in scheme: URN:NBN:fi:au:hklj:
notation: 024.1
preferred label: Lending @en
preferred label: Låneverksamhet @sv
related: URN:NBN:fi:au:hklj:018
related: Kirjaston käyttö. Kirjastososiologia
related: Lastenkirjastot
related: Koulukirjastot
related: Erityisten väestöryhmien kirjastopalvelut
related: Sairaalakirjastot
related: Erikoiskokoelmat
related: Paikalliskokoelmat
related: Musiikkikirjastot
related: Kirjastoautot. Kirjastoveneet
related: Kirjastonkäytön opastus
related: Yleiset kirjastot
related: Erikoiskirjastot. Yhdistysten, laitosten ja yritysten kirjastot
related: URN:NBN:fi:au:hklj:028
related: Dokumentaatio ja informaatiopalvelu yleensä
related: Museonhoito
related: Arkistonhoito
related: URN:NBN:fi:au:hklj:061
related: URN:NBN:fi:au:hklj:063
scope note: Lainausjärjestelmät. Lainauksenvalvonta. Lainaustoimistot Kuitti-, detroit-, kamera- ja atk-lainausjärjestelmät Lainaajarekisterit. Kirjastokortit Kaukopalvelutoiminta
scope note: Lånesystem. Låneövervakning. Låneavdelningar Kvitto-, detroit-, kamera och adb-lånesystem Låntagarregister. Bibliotekskort Fjärrlån @sv

Etiikka. Moraalifilosofia
type: Class
type: Concept
subclass of: ETIIKKA. ESTETIIKKA
alternative label: Absolutismi, etiikka (162)
alternative label: Aksiologia (162)
alternative label: Altruismi, etiikka (162)
alternative label: Ammattietiikka (162)
alternative label: Arvofilosofia (162)
alternative label: Arvostus, filosofia (162)
alternative label: Arvot, arvofilosofia (162)
alternative label: Arvoteoria (162)
alternative label: Arvottaminen, arvofilosofia (162)
alternative label: Avioero, etiikka (162)
alternative label: Avioliitto, etiikka (162)
alternative label: Avioparit, avioliiton etiikka (162)
alternative label: Aviopuolisot, avioliiton etiikka (162)
alternative label: Aviorikokset, etiikka (162)
alternative label: Avoero, etiikka (162)
alternative label: Avoliitto, etiikka (162)
alternative label: Avoparit, avioliiton etiikka (162)
alternative label: Avopuolisot, avoliiton etiikka (162)
alternative label: Bioetiikka (162)
alternative label: Biohakkerointi, etiikka (162)
alternative label: Biopankit, bioetiikka (162)
alternative label: Biopolitiikka, bioetiikka (162)
alternative label: Bona fides, etiikka (162)
alternative label: Eetos, filosofia, etiikka (162)
alternative label: Eettinen kehitys, etiikka (162)
alternative label: Eettiset arvot ja normit (162)
alternative label: Eettisyys (162)
alternative label: Egoismi, etiikka (162)
alternative label: Ekspressivismi (162)
alternative label: Emotivismi (162)
alternative label: Epäitsekkyys, etiikka (162)
alternative label: Epäoikeudenmukaisuus, etiikka (162)
alternative label: Epärehellisyys, etiikka (162)
alternative label: Erehdys, etiikka (162)
alternative label: Esimerkillisyys, etiikka (162)
alternative label: Etiikka (162)
alternative label: Eudaimonismi (162)
alternative label: Filosofia, arvofilosofia (162)
alternative label: Filosofia, etiikka (162)
alternative label: Filosofia, käytännöllinen filosofia (162)
alternative label: Geenimuuntelu, etiikka (162)
alternative label: Geenitekniikka, etiikka (162)
alternative label: Geeniteknologia, etiikka (162)
alternative label: Globaali oikeudenmukaisuus (162)
alternative label: Hedonismi (162)
alternative label: Henkinen kasvu, etiikka (162)
alternative label: Humaanisuus, etiikka (162)
alternative label: Humanitarismi, filosofia, etiikka (162)
alternative label: Hyveet, etiikka (162)
alternative label: Hyvyys, etiikka (162)
alternative label: Hyvä ja paha, etiikka (162)
alternative label: Hyvä, etiikka (162)
alternative label: Hyödyllisyys, etiikka, utilitarismi (162)
broader: ETIIKKA. ESTETIIKKA
in scheme: URN:NBN:fi:au:hklj:
notation: 162
related: ELÄMÄNFILOSOFIA. KULTTUURIFILOSOFIA
related: Mietelausekokoelmat. Sitaattikokoelmat
related: Elämänfilosofia
related: Elämänohjeet
related: Uskonnonfilosofia
related: Kristillinen etiikka
related: Valtiofilosofia. Valtiomuodot
related: Rauhankysymys. Rauhantutkimus
related: Oikeusfilosofia
related: Ympäristönsuojelu. Luonnonsuojelu
related: Uhanalaiset lajit. Luonnonsuojelualueet
related: Maaperän, metsien ja soiden suojelu
related: Vesien suojelu
related: Ilman suojelu
related: URN:NBN:fi:au:hklj:580.86
related: Lääketieteen filosofia ja etiikka
related: Seksologia
related: Raskaus. Sikiönkehitys. Synnytys. Gynekologia
related: Itsemurhat ja niiden ehkäisy
scope note: Etiikka ja moraalifilosofia yleensä Moraali. Eettiset arvot ja normit. Arvoteoria. Aksiologia Yksilö-, sosiaali-, perhe- ja seksuaalietiikka Ihmissuhteiden etiikka. Oikeudenmukaisuusteoria Elämän kunnioitus ja väkivalta eettisinä kysymyksinä Etiikan teoriat ja suunnat, kuten velvollisuus-, taipumus-, mieliala-, seuraus- ja hyötyetiikka Eri alojen eettiset kysymykset alan mukaisessa luokassa
scope note: Etik och moralfilosofi i allmänhet Moral. Etiska värden och normer. Värdeteori. Axiologi Individual-, social-, familje- och sexualetik De mänskliga relationernas etik. Teorier om rättvisa Respekten för liv samt våld som etiska frågor Teorier och riktningar inom etiken, såsom etiska frågor kring pliktkänsla, läggning, sinnesstämning, konsekvenser och nytta Etiska frågor som rör olika områden klassificeras enligt område @sv

Kulttuurifilosofia
type: Class
type: Concept
subclass of: ELÄMÄNFILOSOFIA. KULTTUURIFILOSOFIA
alternative label: Aatteellisuus, kulttuurifilosofia (175)
alternative label: Aatteet, kulttuurifilosofia (175)
alternative label: Aineellinen kulttuuri, kulttuurifilosofia (175)
alternative label: Ajan henki (175)
alternative label: Ajanhenki (175)
alternative label: Arvot, kulttuurifilosofia (175)
alternative label: Arvottaminen, kulttuurifilosofia (175)
alternative label: Degeneraatio, kulttuurifilosofia (175)
alternative label: Dekadenssi, kulttuurifilosofia (175)
alternative label: Diversiteetti, kulttuurifilosofia (175)
alternative label: Edistys, kulttuurifilosofia (175)
alternative label: Erikoistuminen, kulttuurifilosofia (175)
alternative label: Eskapismi, kulttuurifilosofia (175)
alternative label: Filosofia, kulttuurifilosofia (175)
alternative label: Globalisaatio, kulttuurifilosofia (175)
alternative label: Henkinen kulttuuri, kulttuurifilosofia (175)
alternative label: Humanismi, kulttuurifilosofia (175)
alternative label: Ihminen-luontosuhde, kulttuurifilosofia (175)
alternative label: Ihmiskunta, kulttuurifilosofia (175)
alternative label: Ihmiskuva, kulttuurifilosofia (175)
alternative label: Individualismi, kulttuurifilosofia (175)
alternative label: Intellektuellit, kulttuurifilosofia (175)
alternative label: Intelligentsija, kulttuurifilosofia (175)
alternative label: Jälkimoderni, kulttuurifilosofia (175)
alternative label: Jälkimodernismi, kulttuurifilosofia (175)
alternative label: Kansallinen identiteetti, kulttuurifilosofia (175)
alternative label: Kansanluonne, kulttuurifilosofia (175)
alternative label: Korkeakulttuuri, kulttuurifilosofia (175)
alternative label: Kriittisyys, kulttuurifilosofia (175)
alternative label: Kulttuuri, kulttuurifilosofia (175)
alternative label: Kulttuuri-identiteetti, kulttuurifilosofia (175)
alternative label: Kulttuurienvälisyys, kulttuurifilosofia (175)
alternative label: Kulttuurierot, kulttuurifilosofia (175)
alternative label: Kulttuurifilosofia (175)
alternative label: Kulttuurijärjestelmät, kulttuurifilosofia (175)
alternative label: Kulttuurikehitys, kulttuurifilosofia (175)
alternative label: Kulttuurikosketukset, kulttuurifilosofia (175)
alternative label: Kulttuurikritiikki, kulttuurifilosofia (175)
alternative label: Kulttuurimuodot, kulttuurifilosofia (175)
alternative label: Kulttuurin muutos, kulttuurifilosofia (175)
alternative label: Kulttuurinen identiteetti, kulttuurifilosofia (175)
alternative label: Kulttuurinmuutos, kulttuurifilosofia (175)
alternative label: Kulttuurinormit, kulttuurifilosofia (175)
alternative label: Kulttuuriosaaminen, kulttuurifilosofia (175)
alternative label: Kulttuuripessimismi, kulttuurifilosofia (175)
alternative label: Kulttuurirelativismi, kulttuurifilosofia (175)
alternative label: Kulttuuriristiriidat, kulttuurifilosofia (175)
alternative label: Kulttuurishokki, kulttuurifilosofia (175)
alternative label: Kulttuurisidonnaisuus, kulttuurifilosofia (175)
alternative label: Kulttuurisokki, kulttuurifilosofia (175)
alternative label: Kulttuurit, kulttuurifilosofia (175)
alternative label: Kulttuuriteoriat, kulttuurifilosofia (175)
alternative label: Kulttuuriyhteiskunta, kulttuurifilosofia (175)
broader: ELÄMÄNFILOSOFIA. KULTTUURIFILOSOFIA
in scheme: URN:NBN:fi:au:hklj:
notation: 175
related: URN:NBN:fi:au:hklj:060
related: Uskonto- ja maailmankatsomuspsykologia
related: Sosiaalipsykologia. Kulttuuripsykologia
related: Tieteenfilosofia
related: Elämäntapojen sosiologia. Kulttuurisosiologia
related: URN:NBN:fi:au:hklj:357.1
related: URN:NBN:fi:au:hklj:618.2
related: Taiteen estetiikka. Taidefilosofia. Taidepsykologia. Taidesosiologia. Taidepolitiikka
related: Kirjallisuuden filosofia, teoria ja estetiikka. Runousoppi
related: URN:NBN:fi:au:hklj:900
related: URN:NBN:fi:au:hklj:919
related: Vanhan ajan kulttuurihistoria
related: Keskiajan kulttuurihistoria 400-1499
related: Uuden ajan kulttuurihistoria 1500-1788
related: Uusimman ajan kulttuurihistoria 1789-1913
related: Nykyajan kulttuurihistoria 1914-1938
related: Nykyajan kulttuurihistoria 1939-
related: Erotiikan historia
related: Muodin historia
scope note: Kulttuurin, kulttuurinormien ja kulttuurimuotojen filosofinen tarkastelu yleensä Jos teoksessa on sekä kulttuurifilosofiaa että historianfilosofiaa, on etusija luokalla 900 Tiettyä kulttuurin osa-aluetta koskevat teokset alan mukaisessa luokassa
scope note: Filosofiska aspekter på kultur, kulturnormer och kulturformer i allmänhet Om verket innehåller både kulturfilosofi och historiefilosofi ges företräde åt klass 900 Verk som rör ett bestämt delområde inom kultur klassificeras enligt område @sv

Muiden maiden koululaitokset
type: Class
type: Concept
subclass of: URN:NBN:fi:au:hklj:183
alternative label: Eurooppa-koulut (183.9)
alternative label: Kansainväliset koulut (183.9)
alternative label: Opiskelijavaihto, koululaitos, ulkomaat (183.9)
alternative label: Opiskelu ulkomailla, koululaitos (183.9)
alternative label: Poikakoulut, muiden maiden koulut (183.9)
alternative label: Public schools (183.9)
alternative label: Suomi-koulut (183.9)
alternative label: Ulkomaankoulut (183.9)
alternative label: Ulkomailla opiskelu, koululaitos (183.9)
alternative label: Vaihto-opiskelu, koululaitos (183.9)
alternative label: Europaskolor (183.9) @sv
alternative label: Finlandskolor (183.9) @sv
alternative label: Internationella skolor (183.9) @sv
alternative label: Pojkskolor, övriga länders skolor (183.9) @sv
alternative label: Studentutbyte, skolväsen, utlandet (183.9) @sv
alternative label: Studier utomlands, skolväsen (183.9) @sv
alternative label: Utlandsskolor (183.9) @sv
broader: URN:NBN:fi:au:hklj:183
in scheme: URN:NBN:fi:au:hklj:
notation: 183.9
preferred label: School systems in other countries @en
preferred label: Skolväsen i övriga länder @sv
related: URN:NBN:fi:au:hklj:181.7
related: URN:NBN:fi:au:hklj:182
related: URN:NBN:fi:au:hklj:183.5
related: URN:NBN:fi:au:hklj:183.7
related: Erikoiskoulut. Kokeilukoulut
related: URN:NBN:fi:au:hklj:183.903
related: URN:NBN:fi:au:hklj:183.909
related: URN:NBN:fi:au:hklj:184
related: Muiden maiden yliopistot ja korkeakoulut
related: URN:NBN:fi:au:hklj:185
related: Kansalais-, kansan- ja työväenopistot. Kansankorkeakoulut
related: Opintokerhotoiminta
related: Muut yleisen sivistystyön muodot
related: Nuorisotyö
related: Oppikirjat. Oppaat. Harjoituskirjat. Tehtäväkokoelmat
related: URN:NBN:fi:au:hklj:330
related: Asiakirjakaavat ja -ohjeet. Oikeusoppaat
related: URN:NBN:fi:au:hklj:340
related: URN:NBN:fi:au:hklj:345
scope note: Muiden maiden koululaitokset, koulut, koulumuodot, koululainsäädäntö, kouluhallinto ja koulusuunnittelu Tässä myös muiden maiden koululaitosta koskeva kasvatus- ja koulutuspolitiikka sekä opintojen rahoitus Tässä myös ulkomailla opiskelevalle suomalaiselle kouluopiskelijalle tarkoitetut oppaat
scope note: Hit skolväsen, skolor, skolformer, skollagstiftning, skoladministration och skolplanering i övriga länder Hit också skolväsendets pedagogiska politik och utbildningspolitik samt finansiering av studier i övriga länder Hit också vägledningar avsedda för finländska studerande i utländska skolor @sv

Muinais-Egyptin ja Etu-Aasian uskonnot ja mytologiat
type: Class
type: Concept
subclass of: URN:NBN:fi:au:hklj:280
alternative label: Avioliittoon vihkiminen, uskontotiede, eri uskonnot (282 ... 289 +)
alternative label: Egypti, mytologiat, muinaisajan (284)
alternative label: Egypti, uskonnot, muinaisajan (284)
alternative label: Etu-Aasia, mytologia, muinaisajan (284)
alternative label: Etu-Aasia, uskonnot, muinaisajan (284)
alternative label: Egypten, mytologier, forntidens (284) @sv
alternative label: Egypten, religioner, forntidens (284) @sv
alternative label: Främre Asien, mytologi, forntidens (284) @sv
alternative label: Främre Asien, religioner, forntidens (284) @sv
broader: URN:NBN:fi:au:hklj:280
in scheme: URN:NBN:fi:au:hklj:
notation: 284
preferred label: Ancient Egyptian and South-west Asian religions and mythologies @en
preferred label: Fornegyptiska och främreasiatiska religioner och mytologier @sv
related: Vanhan ajan filosofia
related: URN:NBN:fi:au:hklj:110
related: RAJATIETO
related: URN:NBN:fi:au:hklj:192
related: Kuolemakokemukset
related: Uskonnonfilosofia
related: Elämä. Kuolema
related: Luominen. Kehitys
related: URN:NBN:fi:au:hklj:209
related: URN:NBN:fi:au:hklj:210
related: Jumalan olemus
related: Enkelit. Paholaiset. Demonit
related: Kuolema ja kuolemanjälkeinen elämä
related: Lähetystyö
related: Antiikin Kreikan ja Rooman uskonnot ja mytologiat
related: Persian uskonnot ja mytologiat
related: Afrikan alkuperäiskansojen uskonnot
related: URN:NBN:fi:au:hklj:807
related: URN:NBN:fi:au:hklj:992
scope note: Egyptin, Pohjois-Afrikan, Syyrian, Palestiinan ja Mesopotamian muinaisuskonnot. Mithran kultti
scope note: Religioner i det forna Egypten, Nordafrika, Syrien, Palestina och Mesopotamien. Mithraskulten @sv

Rauhankysymys. Rauhantutkimus
type: Class
type: Concept
subclass of: Kansainvälinen yhteistyö
alternative label: Abc-aseet, aseistariisunta, asevalvonta, rauhankysymys (326.5)
alternative label: Antimilitarismi (326.5)
alternative label: Aseelliset konfliktit, konfliktintutkimus (326.5)
alternative label: Aseelliset konfliktit, rauhantyö (326.5)
alternative label: Aseelliset selkkaukset, konfliktintutkimus (326.5)
alternative label: Aseelliset selkkaukset, rauhantyö (326.5)
alternative label: Aseet, aseistariisunta (326.5)
alternative label: Aseeton palvelus, pasifismi (326.5)
alternative label: Aseeton vastarinta (326.5)
alternative label: Aseidenriisunta (326.5)
alternative label: Aseistakieltäytyminen, pasifismi (326.5)
alternative label: Aseistariisuminen (326.5)
alternative label: Aseistariisunta (326.5)
alternative label: Aseistautuminen, rauhankysymys (326.5)
alternative label: Asekokeet, rauhankysymys (326.5)
alternative label: Aselepo, rauhankysymys (326.5)
alternative label: Aserajoitukset (326.5)
alternative label: Aseriisunta (326.5)
alternative label: Aseteollisuus, rauhankysymys (326.5)
alternative label: Asevalvonta (326.5)
alternative label: Asevarustelu, rauhankysymys (326.5)
alternative label: Asevelvollisuus, rauhankysymys (326.5)
alternative label: Atomipommit, aseistariisunta, asevalvonta, rauhankysymys (326.5)
alternative label: Bioaseet, aseistariisunta, asevalvonta (326.5)
alternative label: Biologiset aseet yl., aseistariisunta, asevalvonta, rauhankysymys (326.5)
alternative label: Demilitarisoidut alueet, rauhankysymys (326.5)
alternative label: Demilitarisointi, rauhankysymys (326.5)
alternative label: Eirenologia (326.5)
alternative label: Globaaliset ongelmat, rauhankysymys (326.5)
alternative label: Humaanisuus, rauhankysymys (326.5)
alternative label: Ihmisyys, rauhankysymys (326.5)
alternative label: Inhimillisyys, rauhankysymys (326.5)
alternative label: Joukkotuhoaseet, aseistariisunta (326.5)
alternative label: Joukkotuhoaseet, asevalvonta (326.5)
alternative label: Julistukset, rauhankysymys (326.5)
alternative label: Jäätyneet konfliktit, rauhantyö (326.5 +)
alternative label: Kaasuaseet, aseistariisunta (326.5)
alternative label: Kansainväliset konfliktit, rauhantyö (326.5)
alternative label: Kansainväliset liikkeet, rauhanliike (326.5)
alternative label: Kansainväliset selkkaukset, rauhankysymys, konfliktintutkimus (326.5)
alternative label: Kansainväliset suhteet, rauhanliike (326.5)
alternative label: Kansainvälistyminen, rauhanliike (326.5)
alternative label: Kansainvälisyys, rauhanliike (326.5)
alternative label: Kansalaisliikkeet, rauhanliike (326.5)
alternative label: Kansalaisosallistuminen, rauhanliike (326.5)
alternative label: Kansalaisten osallistuminen, rauhanliike (326.5)
alternative label: Kansalaistoiminta, rauhanliike (326.5)
alternative label: Kansanliikkeet, rauhanliike (326.5)
alternative label: Kemialliset aseet, aseistariisunta, asevalvonta, rauhankysymys (326.5)
alternative label: Kieltäytyminen, aseistakieltäytyminen, pasifismi (326.5)
alternative label: Kilpavarustelu, rauhankysymys (326.5)
alternative label: Konfliktinhallinta, konfliktintutkimus (326.5)
alternative label: Konfliktinhallinta, rauhantyö (326.5)
broader: Kansainvälinen yhteistyö
in scheme: URN:NBN:fi:au:hklj:
notation: 326.5
related: URN:NBN:fi:au:hklj:060
related: Etiikka. Moraalifilosofia
related: Kasvatusfilosofia. Kasvatustavoitteet
related: URN:NBN:fi:au:hklj:325
related: Suomen ulkopolitiikka
related: Yhdistyneet Kansakunnat
related: Maailmankauppa. Kansainväliset talousjärjestöt
related: Kehitysmaiden taloudelliset olot
related: Yhteiskunnalliset aatesuunnat. Poliittiset ideologiat
related: URN:NBN:fi:au:hklj:390
related: Asevarustelu. Asekauppa
related: Sotataito. Strategia. Taktiikka
related: Aseteknologia
related: Sotien yhteiskunnalliset vaikutukset
related: Väestönsuojelu
related: Suomen puolustusvoimat
related: Muiden maiden puolustusvoimat
related: Sotahistoria
related: Suomi
scope note: Rauhanfilosofia. Pasifismi. Rauhanliike. Rauhanjärjestöt Aseeton vastarinta. Siviilivastarinta Aseistakieltäytyminen. Siviilipalvelu. Totaalikieltäytyminen Aseistariisunta. Aserajoitusneuvottelut. Aserajoitussopimukset Asevarustelu ja asekauppa rauhankysymyksen kannalta Rauhantutkimus. Konfliktintutkimus
scope note: Fredsfilosofi. Pacifism. Fredsrörelsen. Fredsorganisationer Vapenlöst motstånd. Civilt motstånd Vapenvägran. Civiltjänst. Totalvägran Nedrustning. Förhandlingar och avtal om vapenbegränsning Upprustning och vapenhandel som fredsfråga Fredsforskning. Konfliktforskning @sv

Vero-oikeus
type: Class
type: Concept
subclass of: URN:NBN:fi:au:hklj:332.2
alternative label: Ajoneuvovero, vero-oikeus (332.23)
alternative label: Arvonlisävero, vero-oikeus (332.23)
alternative label: Autovero, vero-oikeus (332.23)
alternative label: Dieselvero, vero-oikeus (332.23)
alternative label: Edut, vero-oikeus (332.23)
alternative label: Elinkeinoverolaki (332.23)
alternative label: Energiavero, vero-oikeus (332.23)
alternative label: Ennakkoperintä, lainsäädäntö (332.23)
alternative label: Ennakkovero, lainsäädäntö (332.23)
alternative label: Ennakonpidätys, lainsäädäntö (332.23)
alternative label: Erillisverotus, lainsäädäntö (332.23)
alternative label: Haittavero, vero-oikeus (332.23)
alternative label: Henkilökuntaedut, vero-oikeus (332.23)
alternative label: Henkilöverotus, vero-oikeus (332.23)
alternative label: Jälkiverotus, vero-oikeus (332.23)
alternative label: Kaksinkertainen verotus, vero-oikeus (332.23)
alternative label: Kaksoisverotus, vero-oikeus (332.23)
alternative label: Kansainvälinen vero-oikeus, Euroopan unioni (332.23)
alternative label: Kiinteistövero, vero-oikeus (332.23)
alternative label: Kulttuurisetelit , vero-oikeus (332.23)
alternative label: Kulutusverotus, vero-oikeus (332.23)
alternative label: Kunnallinen lainsäädäntö, verolainsäädäntö (332.23)
alternative label: Kunnallinen verolainsäädäntö (332.23)
alternative label: Kunnallisoikeus, verolainsäädäntö (332.23)
alternative label: Kunnallisvero, verolainsäädäntö (332.23)
alternative label: Kunnallisverotus, verolainsäädäntö (332.23)
alternative label: Käännetty arvonlisävero, vero-oikeus (332.23)
alternative label: Käännetty arvonlisäverovelvollisuus, vero-oikeus (332.23)
alternative label: Käänteinen arvonlisävero, vero-oikeus (332.23)
alternative label: Leimavero, vero-oikeus (332.23)
alternative label: Liiketoimintasiirto, vero-oikeus (332.23)
alternative label: Liikevaihtovero-oikeus (332.23)
alternative label: Liikeverotus, lainsäädäntö (332.23)
alternative label: Liikuntasetelit , vero-oikeus (332.23)
alternative label: Lounassetelit , vero-oikeus (332.23)
alternative label: Luontaisedut, vero-oikeus (332.23)
alternative label: Luontoisedut, vero-oikeus (332.23)
alternative label: Luovutusvoitot, vero-oikeus (332.23)
alternative label: Lähdevero, vero-oikeus (332.23)
alternative label: Maatalousverotus, lainsäädäntö (332.23)
alternative label: Marginaalivero, vero-oikeus (332.23)
alternative label: Metsäverotus, lainsäädäntö (332.23)
alternative label: Moottoriajoneuvovero, vero-oikeus (332.23)
alternative label: Offshore-yhtiöt, vero-oikeus (332.23)
alternative label: Omaisuus, vero-oikeus (332.23)
alternative label: Omaisuusvero, vero-oikeus (332.23)
alternative label: Perintövero, vero-oikeus (332.23)
alternative label: Polttoainevero, vero-oikeus (332.23)
alternative label: Pääomaverotus, vero-oikeus (332.23)
alternative label: Tullilaitos, lainsäädäntö (332.23)
alternative label: Tullioikeus (332.23)
alternative label: Tulo- ja omaisuusvero, lainsäädäntö (332.23)
alternative label: Tulovero, lainsäädäntö (332.23)
broader: URN:NBN:fi:au:hklj:332.2
in scheme: URN:NBN:fi:au:hklj:
notation: 332.23
related: Kirkko-oikeus
related: URN:NBN:fi:au:hklj:260
related: URN:NBN:fi:au:hklj:326.2
related: Rikosoikeus
related: Perintö- ja testamenttioikeus
related: Kansainvälinen oikeus
related: Suomen ja Euroopan Unionin laki- ja asetuskokoelmat
related: Muiden maiden lait
related: URN:NBN:fi:au:hklj:340
related: URN:NBN:fi:au:hklj:345
related: Helsinki. Pääkaupunkiseutu
related: Suomen valtionhallinto
related: Valtionverotus. Veropolitiikka
related: Tullilaitos
related: Kansainväliset taloudelliset suhteet. Maailmantalous
related: Suomen ulkomaankauppa
related: Maailmankauppa. Kansainväliset talousjärjestöt
related: Monikansalliset yritykset
related: Kehitysmaiden taloudelliset olot
scope note: Valtion- ja kunnallisverotusta koskeva lainsäädäntö Tulo- ja varallisuusveroa, ennakkoperintää, perintö- ja lahjaveroa sekä liikevaihto- ja leimaveroa koskeva lainsäädäntö. Tullioikeus
scope note: Lagstiftning om stats- och kommunalbeskattning Lagstiftning om inkomst- och förmögenhetsskatt, förskottsarv, arvs- och gåvoskatt samt om omsättnings- och stämpelskatt. Tullrätt @sv

Rikosoikeus
type: Class
type: Concept
subclass of: Julkisoikeus
alternative label: Alkoholirikokset, rikosoikeus (332.4)
alternative label: Alkometrit, lainsäädäntö (332.4)
alternative label: Ampuma-aserikokset (332.4)
alternative label: Arvoesineet, omaisuusrikokset, rikosoikeus (332.4)
alternative label: Aserikokset (332.4)
alternative label: Atk-rikokset, rikosoikeus (332.4)
alternative label: Biopiratismi, rikosoikeus (332.4)
alternative label: Crackerointi, rikosoikeus (332.4)
alternative label: Designhuumeet, rikosoikeus (332.4)
alternative label: Ehdolliset rangaistukset, rikosoikeus (332.4)
alternative label: Ehdonalainen vapaus, rikosoikeus (332.4)
alternative label: Eläimeen sekaantuminen, rikosoikeus (332.4)
alternative label: Eläimiin sekaantuminen, rikosoikeus (332.4)
alternative label: Fyysinen väkivalta, rikosoikeus (332.4)
alternative label: Hakkerit, rikosoikeus (332.4)
alternative label: Hakkerointi, rikosoikeus (332.4)
alternative label: Harmaa talous, rikosoikeus (332.4)
alternative label: Haudanryöstö, rikosoikeus (332.4)
alternative label: Heitteillejättö, rikosoikeus (332.4)
alternative label: Henkilörekisteririkokset, rikosoikeus (332.4)
alternative label: Henkirikokset, rikosoikeus (332.4)
alternative label: Herjaus (332.4)
alternative label: Hirtto, rikosoikeus (332.4)
alternative label: Hirttäminen, rikosoikeus (332.4)
alternative label: Huumeiden käyttäjät, rikosoikeus (332.4)
alternative label: Häirintä, rikosoikeus (332.4)
alternative label: Häpeäväkivalta, rikosoikeus (332.4)
alternative label: Hätävarjelu (332.4)
alternative label: Identiteettivarkaus, atk-rikokset, rikosoikeus (332.4)
alternative label: Ihmiskauppa, rikosoikeus (332.4)
alternative label: Ihmisryöstöt, rikosoikeus (332.4)
alternative label: Ilkivalta, rikosoikeus (332.4)
alternative label: Ilmianto, rikosoikeus (332.4)
alternative label: Insesti, rikosoikeus (332.4)
alternative label: Itseapu, hätävarjelu (332.4)
alternative label: Itsepuolustus, lainsäädäntö (332.4)
alternative label: Joukkomurha, rikosoikeus (332.4)
alternative label: Jumalanpilkka, rikosoikeus (332.4)
alternative label: Kaappaukset, rikosoikeus (332.4)
alternative label: Kaltoinkohtelu, rikosoikeus (332.4)
alternative label: Kavallus, rikosoikeus (332.4)
alternative label: Kidnappaukset, rikosoikeus (332.4)
alternative label: Kiristys, rikosoikeus (332.4)
alternative label: Kirjanpitorikokset, rikosoikeus (332.4)
alternative label: Kivittäminen, rikosoikeus (332.4)
alternative label: Kivitys, rikosoikeus (332.4)
alternative label: Konkurssirikokset, rikosoikeus (332.4)
alternative label: Kotipoltto, rikosoikeus (332.4)
alternative label: Kotiväkivalta, rikosoikeus (332.4)
alternative label: Krakkerointi, rikosoikeus (332.4)
alternative label: Kriminalisointi, rikosoikeus (332.4)
alternative label: Kuittikauppa, rikosoikeus (332.4)
alternative label: Kunniaan liittyvä väkivalta, rikosoikeus (332.4)
broader: Julkisoikeus
in scheme: URN:NBN:fi:au:hklj:
notation: 332.4
related: URN:NBN:fi:au:hklj:326.2
related: Vero-oikeus
related: Prosessioikeus. Oikeushallinto
related: Vankeinhoito. Vankilat
related: Esine- ja velvoiteoikeus. Immateriaalioikeudet. Huoneen- ja maanvuokralainsäädäntö
related: Kansainvälinen oikeus
related: Suomen ja Euroopan Unionin laki- ja asetuskokoelmat
related: Muiden maiden lait
related: URN:NBN:fi:au:hklj:340
related: Poliisitoimi. Yleinen turvallisuus
related: Suomen valtionhallinto
related: Kriminologia. Kriminaalisosiologia
related: URN:NBN:fi:au:hklj:359.083
related: Valtionverotus. Veropolitiikka
related: Alkoholipolitiikka
related: Huumausainepolitiikka
related: Kriminaalipolitiikka
related: Sotien yhteiskunnalliset vaikutukset
related: Liikenneopetus. Liikenneturvallisuus
scope note: Tässä sekä rikosoikeuden yleisteokset että eri alojen rikoksia koskeva rikosoikeus Alkoholi-, huume-, virka-, liikenne-, omaisuus-, talous-, konkurssi-, vero-, ympäristö-, väkivalta-, henki-, ym. -rikokset rikosoikeuden kannalta
scope note: Hit både allmänna verk om straffrätt och straffrätt som rör brott inom olika områden Alkohol-, narkotika-, tjänste-, trafik-, egendoms-, konkurs-, skatte, miljö- och våldsbrott samt ekonomiska brott och brott mot liv o.dyl. brott ur straffrättslig synvinkel @sv

Esine- ja velvoiteoikeus. Immateriaalioikeudet. Huoneen- ja maanvuokralainsäädäntö
type: Class
type: Concept
subclass of: Siviili- ja kauppaoikeus. Sopimusoikeus
alternative label: Aineettomat oikeudet (333.1)
alternative label: Alkuperäissuoja (333.1)
alternative label: Arvopaperit, lainsäädäntö (333.1)
alternative label: Asumisoikeus, huoneenvuokralaki (333.1)
alternative label: Asunnonvälitys, lainsäädäntö (333.1)
alternative label: Asunto-osakkeet, asuntokauppaoikeus (333.1)
alternative label: Asuntokauppa, lainsäädäntö (333.1)
alternative label: Asuntokauppaoikeus (333.1)
alternative label: Biopiratismi, patenttilainsäädäntö (333.1)
alternative label: Copyright-lainsäädäntö (333.1)
alternative label: Esineoikeus (333.1)
alternative label: Etuoikeudet, etuosto-oikeus (333.1)
alternative label: Etuosto-oikeus (333.1)
alternative label: Hallintaanotto, hallintaoikeus (333.1)
alternative label: Hallintaoikeus (333.1)
alternative label: Hallussapito, omistusoikeus (333.1)
alternative label: Huoneenvuokra, lainsäädäntö (333.1)
alternative label: Huoneistot, asuntokauppalainsäädäntö (333.1)
alternative label: Hypoteekki, lainsäädäntö (333.1)
alternative label: Hyödyllisyysmallit, lainsäädäntö (333.1)
alternative label: IPR-oikeus (333.1)
alternative label: Immateriaalioikeus (333.1)
alternative label: Irtaimen luovutus (333.1)
alternative label: Irtaimenluovutus (333.1)
alternative label: Irtaimisto, esine- ja velvoiteoikeus (333.1)
alternative label: Irtaimistokiinnitys (333.1)
alternative label: Julkiset kaupanvahvistajat, kiinteistönkauppaoikeus (333.1)
alternative label: Kansainvälinen tekijänoikeus, Euroopan unioni (333.1)
alternative label: Kansainvälinen varallisuusoikeus, Euroopan unioni (333.1)
alternative label: Kansainvälinen velvoiteoikeus, Euroopan unioni (333.1)
alternative label: Kaupalliset suhteet, lainsäädäntö (333.1)
alternative label: Kaupanvahvistajat, kiinteistönkauppaoikeus (333.1)
alternative label: Kauppakirjat (333.1)
alternative label: Kauppasopimukset, lainsäädäntö (333.1)
alternative label: Kauppasuhteet, lainsäädäntö (333.1)
alternative label: Keksijänoikeus (333.1)
alternative label: Kiinnitys, oikeustiede, lainsäädäntö (333.1)
alternative label: Kiinnitysrekisterit (333.1)
alternative label: Kiinteistökauppa, kiinteistönkauppaoikeus (333.1)
alternative label: Kiinteistönkauppa, kiinteistönkauppaoikeus (333.1)
alternative label: Kiinteistönluovutus (333.1)
alternative label: Kiinteistönmuodostamisoikeus (333.1)
alternative label: Kiinteistöoikeus (333.1)
alternative label: Korkolainsäädäntö (333.1)
alternative label: Koronmaksut, korkolainsäädäntö (333.1)
alternative label: Korvaukset, tekijänoikeuskorvaukset (333.1)
alternative label: Kustannusoikeus (333.1)
alternative label: Käyttöoikeus (333.1)
alternative label: Käänteinen asuntokauppa, lainsäädäntö (333.1)
alternative label: Lumeavioliitto, avioliittolainsäädäntö (333.1)
alternative label: Lunastus, lunastusoikeus (333.1)
alternative label: Lunastuskorvaukset, lunastusoikeus (333.1)
alternative label: Lunastusoikeus (333.1)
alternative label: Luotot, luottolainsäädäntö (333.1)
alternative label: Luottolainsäädäntö (333.1)
alternative label: Luottolaitokset, luottolainsäädäntö (333.1)
alternative label: Luovuttaminen, kiinteistönluovutus, lainsäädäntö (333.1)
broader: Siviili- ja kauppaoikeus. Sopimusoikeus
in scheme: URN:NBN:fi:au:hklj:
notation: 333.1
related: Kustannustoimi. Kirjakauppa
related: URN:NBN:fi:au:hklj:326.2
related: URN:NBN:fi:au:hklj:332.2
related: Rikosoikeus
related: Prosessioikeus. Oikeushallinto
related: Kauppaoikeus. Yhtiölainsäädäntö. Pankki- ja vakuutuslainsäädäntö
related: Maaoikeus
related: Maa- ja metsätalouslainsäädäntö
related: Kansainvälinen oikeus
related: Suomen ja Euroopan Unionin laki- ja asetuskokoelmat
related: Muiden maiden lait
related: Kiinteistöt. Tontit
related: Maapolitiikka
related: Asuntopolitiikka
related: LIIKETALOUS. KAUPPA. MARKKINOINTI. LIIKENNEOPETUS
scope note: Omistusoikeutta ja yhteisomistusta koskeva lainsäädäntö Varallisuusoikeus. Käyttö-, pakkolunastus- ja etuosto-oikeus Luotto- ja korkolainsäädäntö. Takaus. Saneerauslainsäädäntö Rahoitusmuotoja koskeva lainsäädäntö Yksityishenkilöiden välistä tai elinkeinonharjoittajien välistä kauppaa koskeva lainsäädäntö. Asunto- ja kiinteistönvälitykseen sekä asunto-osakkeiden ja kiinteistöjen hallintaan ja myymiseen liittyvä lainsäädäntö. Kiinteistönmuodostamisoikeus Lainhuudatus. Kiinnitys. Kauppakirja. Velkakirja Immateriaalioikeudet. Tekijänoikeus-, patentti-, tavaramerkki-, malli-, kustannus- ja copyright-lainsäädäntö. Vapaakappaleoikeus Huoneen- ja maanvuokralainsäädäntö
scope note: Lagstiftning om äganderätt och gemensamt ägande Förmögenhetsrätt. Nyttjande-, expropriations- och förköpsrätt Kredit- och räntelagstiftning. Borgen. Saneringslagstiftning Lagstiftning om finansieringsformer Lagstiftning om köp mellan privatpersoner eller mellan näringsidkare Lagstiftning om bostads- och fastighetsförmedling samt om ägande, försäljning och köp av bostadsaktier och fastigheter. Lagstiftning om fastighetsbildning Lagfart. Inteckning. Köpebrev. Skuldebrev Immaterialrätt. Lagstiftning om upphovsrätt, mönsterrätt och varumärke. Patent-, förlags- och copyrightlagstiftning. Lagstiftning om friexemplar Hyres- och arrendelagstiftning @sv

Yhteiskunnalliset aatesuunnat. Poliittiset ideologiat
type: Class
type: Concept
subclass of: URN:NBN:fi:au:hklj:370
alternative label: Aatteellisuus, poliittiset ideologiat (374 +)
alternative label: Aatteet, poliittiset ideologiat (374 +)
alternative label: Agitaatio, poliittiset ideologiat (374 +)
alternative label: Agitointi, poliittiset ideologiat (374 +)
alternative label: Aktivismi, yhteiskunnalliset aatteet (374 +)
alternative label: Aktivointi, poliittiset ideologiat (374 +)
alternative label: Antifasismi, poliittiset ideologiat (374)
alternative label: Antikommunismi, poliittiset ideologiat (374 +)
alternative label: Antiutopiat, poliittiset ideologiat (374 +)
alternative label: Dogmaattisuus, poliittiset ideologiat (374 +)
alternative label: Dogmatismi, poliittiset ideologiat (374 +)
alternative label: Doktriinit, poliittiset ideologiat (374 +)
alternative label: Dystopiat, poliittiset ideologiat (374 +)
alternative label: Edistys, poliittiset ideologiat (374 +)
alternative label: Egalitarismi, ideologiat, poliittiset (374 +)
alternative label: Fanaattisuus, poliittiset ideologiat (374 +)
alternative label: Fanatismi, poliittiset ideologiat (374 +)
alternative label: Fasisminvastaisuus, poliittiset ideologiat (374)
alternative label: Ideologiat, poliittiset (374 +)
alternative label: Julistukset, poliittiset ideologiat (374 +)
alternative label: Julkinen keskustelu, yhteiskunnalliset aatesuunnat (374 +)
alternative label: Kansainväliset liikkeet, poliittiset ideologiat (374 +)
alternative label: Kansalaiskeskustelu, yhteiskunnalliset aatesuunnat (374 +)
alternative label: Kansalaisliikkeet, yhteiskunnalliset aatteet (374 +)
alternative label: Kansalaisosallistuminen, yhteiskunnalliset aatteet (374 +)
alternative label: Kansalaisten osallistuminen, yhteiskunnalliset aatteet (374 +)
alternative label: Kansalaistoiminta, yhteiskunnalliset aatteet (374 +)
alternative label: Kansanliikkeet, yhteiskunnalliset aatteet (374 +)
alternative label: Kansanrintama, poliittinen ideologia (374 +)
alternative label: Levitys, poliittiset aatesuunnat (374 +)
alternative label: Liberaalisuus, yhteiskunnalliset aatesuunnat (374 +)
alternative label: Opiskelijaliikkeet, yhteiskunnalliset aatteet (374 +)
alternative label: Osallistuminen, poliittiset ideologiat (374 +)
alternative label: Palveluelinkeinot, yritystalous (374 +)
alternative label: Periaatteet, poliittiset ideologiat (374 +)
alternative label: Poliittinen osallistuminen, poliittiset ideologiat (374 +)
alternative label: Poliittinen toiminta, poliittiset ideologiat (374 +)
alternative label: Poliittiset aatesuunnat (374 +)
alternative label: Poliittiset asenteet, poliittiset ideologiat (374 +)
alternative label: Poliittiset ideologiat (374 +)
alternative label: Poliittiset liikkeet, poliittiset ideologiat (374 +)
alternative label: Poliittiset nuorisojärjestöt, poliittiset ideologiat (374 +)
alternative label: Poliittiset opiskelijajärjestöt, poliittiset ideologiat (374 +)
alternative label: Poliittiset puolueet, poliittiset ideologiat (374 +)
alternative label: Poliittiset vaihtoehtoliikkeet, poliittiset ideologiat (374 +)
alternative label: Poliittisuus, poliittiset ideologiat (374 +)
alternative label: Politiikka, poliittiset ideologiat (374 +)
alternative label: Politisoituminen, poliittiset ideologiat (374 +)
alternative label: Populismi, poliittiset ideologiat (374 +)
alternative label: Protestointi, poliittiset ideologiat (374 +)
alternative label: Provokaatiot, poliittiset ideologiat (374 +)
alternative label: Sitoutuminen, poliittiset ideologiat (374 +)
alternative label: Sosiaalinen oikeudenmukaisuus, poliittiset ideologiat (374 +)
alternative label: Sosiaaliset liikkeet, poliittiset ideologiat (374 +)
alternative label: Suora demokratia, poliittiset ideologiat (374 +)
alternative label: Totalitarismi, poliittiset ideologiat (374 +)
alternative label: Utopiat, poliittiset ideologiat (374 +)
alternative label: Vallankumoukselliset, poliittiset ideologiat (374 +)
broader: URN:NBN:fi:au:hklj:370
in scheme: URN:NBN:fi:au:hklj:
narrower: Sosialismi. Kommunismi
narrower: Konservatismi
narrower: Liberalismi
narrower: Fasismi
narrower: Muut aatesuunnat
notation: 374
related: URN:NBN:fi:au:hklj:320
related: Valtiofilosofia. Valtiomuodot
related: Sisäpolitiikka. Puolueet
related: Suomi
related: Rauhankysymys. Rauhantutkimus
related: Yhteiskuntafilosofia
related: Talousjärjestelmät
related: URN:NBN:fi:au:hklj:371
related: Työväenliike
scope note: Yhteiskunnalliset aatesuunnat ja poliittiset ideologiat yleensä
scope note: Samhälleliga åskådningar och politiska ideologier i allmänhet @sv

Sotataito. Strategia. Taktiikka
type: Class
type: Concept
subclass of: URN:NBN:fi:au:hklj:390
alternative label: Abc-aseet, strategia, avaruuden sotilaallinen käyttö (392)
alternative label: Asemasota, strategia ja taktiikka (392)
alternative label: Atomipommit, strategia, avaruuden sotilaallinen käyttö (392)
alternative label: Avaruus, sotilaallinen käyttö (392)
alternative label: Bioaseet, strategia, avaruuden sotilaallinen käyttö (392)
alternative label: Biologinen sodankäynti, strategia ja taktiikka (392)
alternative label: Biologiset aseet yl., strategia, avaruuden sotilaallinen käyttö (392)
alternative label: Bunkkerit, sotataito (392)
alternative label: Desantit, sissisota (392)
alternative label: Elektroninen sodankäynti (392)
alternative label: Erikoisjoukot, sissisota (392)
alternative label: Huoltojoukot, sotataito (392)
alternative label: Huoltovarmuus, joukkojen huolto (392)
alternative label: Hybridisota (392)
alternative label: Hyökkäys, sotataito (392)
alternative label: Hyökkäyssota, sotataito (392)
alternative label: Ilmailu, ilmasodan strategia ja taktiikka (392)
alternative label: Ilmapuolustus, sotataito (392)
alternative label: Ilmasota, sotataito (392)
alternative label: Ilmatorjunta, sotataito (392)
alternative label: Ilmavalvonta, strategia (392)
alternative label: Informaatiosodankäynti (392)
alternative label: Informaatiosota (392)
alternative label: Iskujoukot, sissisota (392)
alternative label: Joukkojenhallinta (392)
alternative label: Juoksuhaudat, sotataito (392)
alternative label: Kaukopartiot, sissisota, sotataito (392)
alternative label: Kemiallinen sodankäynti (392)
alternative label: Kemialliset aseet, strategia, avaruuden sotilaallinen käyttö (392)
alternative label: Kenttälinnoitukset, sotataito (392)
alternative label: Kommandojoukot, sissisota (392)
alternative label: Korsut, rakentaminen (392)
alternative label: Kriisivalmius, joukkojen huolto (392)
alternative label: Kybersodankäynti (392)
alternative label: Laivastotukikohdat, taktiikka ja strategia (392)
alternative label: Lentotukialukset, merisodan strategia (392)
alternative label: Lentotukikohdat, strategia ja taktiikka (392)
alternative label: Liikkuvuus, sotataito (392)
alternative label: Linnoittaminen (392)
alternative label: Linnoitukset, linnoitustaito (392)
alternative label: Linnoitustaito (392)
alternative label: Maanalainen toiminta, sotataito (392)
alternative label: Maasodankäynti, sotataito (392)
alternative label: Maihinnousu, sotataito (392)
alternative label: Majoitus, armeijan huolto (392)
alternative label: Merilinnoitukset (392)
alternative label: Meripuolustus, taktiikka ja strategia (392)
alternative label: Merisota, taktiikka ja strategia (392)
alternative label: Meritaistelut, taktiikka ja strategia (392)
alternative label: Muonitus, armeijan huolto (392)
alternative label: Ohjukset, avaruuden sotilaskäyttö (392)
alternative label: Ohjuspuolustus,avaruuden sotilaskäyttö (392)
alternative label: Ohjustentorjunta, avaruuden sotilaskäyttö (392)
alternative label: Ohjustorjunta, avaruuden sotilaskäyttö (392)
alternative label: Oikeutettu sota (392)
alternative label: Panssarintorjunta, sotataito (392)
alternative label: Partisaanit, sissisota, sotataito (392)
broader: URN:NBN:fi:au:hklj:390
in scheme: URN:NBN:fi:au:hklj:
notation: 392
related: URN:NBN:fi:au:hklj:320
related: URN:NBN:fi:au:hklj:325
related: Rauhankysymys. Rauhantutkimus
related: URN:NBN:fi:au:hklj:332.2
related: URN:NBN:fi:au:hklj:340
related: Organisaatioiden ja laitosten sosiologia
related: Ilmaliikenne. Ilmailu
related: Suomen puolustusvoimat
related: Muiden maiden puolustusvoimat
related: Avaruustutkimus. Avaruuslennot. Avaruusteknologia
related: Vesikulkuneuvot
related: Laivat. Laivanrakennus
related: Muut vesikulkuneuvot
related: Ilmakulkuneuvot
related: Muut ilmakulkuneuvot
scope note: Sota- ja sotilastaidot yleensä Maa-, meri- ja ilmasodankäynti. Sissisota. Avaruuden sotilaallinen käyttö Sotilaspsykologia. Psykologinen sodankäynti Joukkojen huolto
scope note: Krigs- och militärkonst i allmänhet Land-, sjö- och luftkrigföring. Gerillakrig. Militärt utnyttjande av rymden Militärpsykologi. Psykologisk krigföring Truppunderhåll @sv

Yleinen aluemaantiede. Yleinen kulttuurimaantiede. Yleinen poliittinen maantiede
type: Class
type: Concept
subclass of: URN:NBN:fi:au:hklj:400
alternative label: Aavikot, aluemaantiede (409)
alternative label: Aika, aikavyöhykkeet (409)
alternative label: Aikaerot, aikavyöhykkeet (409)
alternative label: Aikavyöhykkeet (409)
alternative label: Aikavyöhykkeet, maantiede, matkat (409)
alternative label: Alueet, aluemaantiede (409)
alternative label: Aluemaantiede (409)
alternative label: Aluemeri, aluemaantiede (409)
alternative label: Aluerajat, aluemaantiede (409)
alternative label: Antropogeografia (409)
alternative label: Arot, aluemaantiede (409)
alternative label: Asutusmaantiede (409)
alternative label: Asutusmaantiede, maantiede, matkat (409)
alternative label: Autiomaat, aluemaantiede (409)
alternative label: Deltat, aluemaantiede (409)
alternative label: Dyynit, aluemaantiede (409)
alternative label: Erämaat, aluemaantiede (409)
alternative label: Geotieteet, aluemaantiede (409)
alternative label: Harjut, aluemaantiede (409)
alternative label: Hiekkasärkät, aluemaantiede (409)
alternative label: Humusjärvet, aluemaantiede (409)
alternative label: Ihmismaantiede (409)
alternative label: Ihmismaantiede, kulttuurimaantiede (409)
alternative label: Ihmismaantiede, maantiede, matkat (409)
alternative label: Ihmismaantiede, sosiaalimaantiede (409)
alternative label: Joenuomat, aluemaantiede (409)
alternative label: Joet, aluemaantiede (409)
alternative label: Jokisuistot, aluemaantiede (409)
alternative label: Jyrkänteet, aluemaantiede (409)
alternative label: Järvet, aluemaantiede (409)
alternative label: Jäätiköt, aluemaantiede (409)
alternative label: Kaivoskaupungit, aluemaantiede (409)
alternative label: Kalderat, aluemaantiede (409)
alternative label: Kanaalit, aluemaantiede (409)
alternative label: Kanjonit, aluemaantiede (409)
alternative label: Kannakset, aluemaantiede (409)
alternative label: Kansallisvaltiot, aluemaantiede (409 +)
alternative label: Kansandemokratiat, aluemaantiede (409)
alternative label: Kansat, aluemaantiede (409)
alternative label: Kapitalistiset maat, aluemaantiede (409)
alternative label: Karsti, aluemaantiede (409)
alternative label: Kaupunginosat, aluemaantiede (409)
alternative label: Kaupungit, aluemaantiede (409)
alternative label: Kaupunkikeskustat, aluemaantiede (409)
alternative label: Kaupunkimaantiede, kulttuurimaantiede (409)
alternative label: Kehittyneet maat , aluemaantiede (409)
alternative label: Kehitysmaantiede, aluemaantiede (409)
alternative label: Kehitysmaat, aluemaantiede (409)
alternative label: Kehyskunnat, aluemaantiede (409)
alternative label: Keitaat, aluemaantiede (409)
alternative label: Keskustat, aluemaantiede (409)
alternative label: Kolmannet maat, aluemaantiede (409)
alternative label: Kommunistiset maat, aluemaantiede (409)
alternative label: Korkeussuhteet, aluemaantiede (409)
alternative label: Korvet, aluemaantiede (409)
alternative label: Kraatterit, aluemaantiede (409)
alternative label: Kulttuurimaantiede (409)
broader: URN:NBN:fi:au:hklj:400
in scheme: URN:NBN:fi:au:hklj:
notation: 409
related: Väestötiede. Väestöpolitiikka
related: URN:NBN:fi:au:hklj:325
related: Talousmaantiede. Taloushistoria
related: Aluepolitiikka. Ympäristöpolitiikka
related: EUROOPPA
related: AASIA
related: AFRIKKA
related: AMERIKKA
related: AUSTRALIA. OSEANIA. NAPAMAAT
related: FYYSINEN MAANTIEDE
related: GEOLOGIA
related: Ekologia. Eliömaantiede
related: Merenkulkuoppi
related: URN:NBN:fi:au:hklj:900
related: Historialliset kartat. Historiallinen maantiede
scope note: Aluemaantieteen kulttuurimaantieteen, sosiaalimaantieteen ja poliittisen maantieteen yleisteokset Tiettyä maanosaa, maata tai aluetta koskevat teokset ko. alueen luokassa Jos teoksessa on sekä maantiedettä että historiaa, on etusija maantieteen luokalla
scope note: Allmänna verk som rör regionalgeografi, kulturgeografi, socialgeografi och politisk geografi Verk som handlar om bestämda världsdelar, länder eller regioner klassificeras enligt geografiskt område Om verket handlar om både geografi och historia ges företräde åt klassen för geografi @sv

Hydrologia
type: Class
type: Concept
subclass of: FYYSINEN MAANTIEDE
alternative label: Aallot, hydrologia (485)
alternative label: Aapasuot, hydrologia (485)
alternative label: Ahtojää, hydrologia (485)
alternative label: Allikot, limnologia (485)
alternative label: Anoksia, hydrologia (485)
alternative label: Arteesiset kaivot, pohjavesi (485)
alternative label: Fyysinen maantiede, hydrologia (485)
alternative label: Geohydrologia (485)
alternative label: Glasiologia, hydrologia (485)
alternative label: Golf-virta, merentutkimus (485)
alternative label: Haihdunta, hydrologia (485)
alternative label: Hasardit, tulvat (485)
alternative label: Humusjärvet, hydrologia (485)
alternative label: Hydrogeologia (485)
alternative label: Hydrografia (485)
alternative label: Hydrologia (485)
alternative label: Hydrologinen kierto (485)
alternative label: Hydrosfääri (485)
alternative label: Hydrosfääri, hydrologia (485)
alternative label: Hyökyaallot (485)
alternative label: Infiltraatio, hydrologia (485)
alternative label: Itämeri, merentutkimus (485)
alternative label: Joenuomat, hydrologia (485)
alternative label: Joet, hydrologia (485)
alternative label: Jokisuistot, hydrologia (485)
alternative label: Jokisuistot, vesientutkimus (485)
alternative label: Jäidenlähtö (485)
alternative label: Järvet, hydrologia (485)
alternative label: Järvet, vesientutkimus (485)
alternative label: Jää, hydrologia (485)
alternative label: Jäätiköntutkimus, hydrologia (485)
alternative label: Jäätutkimus, hydrologia (485)
alternative label: Kaivot, pohjavesi (485)
alternative label: Katastrofit, tulvat (485)
alternative label: Kaupunkihydrologia (485)
alternative label: Kerrostuneisuus (485)
alternative label: Kryosfääri, jääpeite, hydrologia (485)
alternative label: Laguunit, hydrologia (485)
alternative label: Lahdet, hydrologia (485)
alternative label: Lammet, limnologia (485)
alternative label: Letot, hydrologia (485)
alternative label: Limnologia (485)
alternative label: Luonnonmaantiede, hydrologia (485)
alternative label: Luonnononnettomuudet, kuivuus (485)
alternative label: Luonnononnettomuudet, tulvat (485)
alternative label: Luotaimet, hydrologiset luotaimet (485)
alternative label: Luotaus, hydrologinen luotaus (485)
alternative label: Lähdevesi, hydrologia (485)
alternative label: Lähteet, hydrologia (485)
alternative label: Madaltuminen, merentutkimus (485)
alternative label: Makea vesi, hydrologia (485)
alternative label: Matalikot, merentutkimus (485)
alternative label: Mataloituminen, merentutkimus (485)
broader: FYYSINEN MAANTIEDE
in scheme: URN:NBN:fi:au:hklj:
notation: 485
related: URN:NBN:fi:au:hklj:342
related: URN:NBN:fi:au:hklj:485.084
related: Vesien suojelu
related: KEMIA
related: Sovellettu kemia
related: BIOLOGIA
related: Ekologia. Eliömaantiede
related: KASVITIEDE
related: URN:NBN:fi:au:hklj:590
related: Vesirakennus. Vesikulkuneuvot
related: Satamat. Satamatekniikka
related: Vesiväylät. Vesien säännöstely
related: Vesijohto-, viemäri- ja vedenpuhdistustekniikka
related: Vesikulkuneuvot
related: Laivat. Laivanrakennus
related: URN:NBN:fi:au:hklj:625.72
related: Muut vesikulkuneuvot
related: Kalastus
related: Uinti. Sukellus
scope note: Vesikehä. Vesientutkimus. Hydrografia. Vesikemia Hydrologinen kierto ja maapallon vesitase Haihdunta. Valuma. Virtaama. Suotautuminen Sadevesi hydrologian kannalta. Tulvat. Kuivuus Vesivarat. Pohjavedet. Geohydrologia Järvien, virtaavan veden ja meren tutkimus Limnologia. Potamologia. Oseanologia. Oseanografia Merivirrat. Vuorovedet. Veden lämpötila. Jääpeite
scope note: Hydrosfären. Hydrometri. Hydrografi. Hydrokemi Vattnets kretslopp och jordklotets vattenbalans Avdunstning. Avrinning. Vattenföring. Filtrering Regnvatten ur hydrologisk synvinkel. Översvämningar. Torka Vattenreserver. Grundvatten. Geohydrologi Undersökning av sjöar, vattendrag och hav Limnologi. Potamologi. Oceanologi. Oceanografi Havsströmmar. Tidvatten. Vattnets temperatur. Istäcke @sv

Lastenhoito
type: Class
type: Concept
subclass of: Terveydenhoito
alternative label: Babymassage (613.4)
alternative label: Esikouluikäiset, terveydenhoito (613.4)
alternative label: Fyysinen kehitys, lapsen fyysinen kehitys (613.4)
alternative label: Hieronta, vauvahieronta (613.4)
alternative label: Identtiset kaksoset, lastenhoito (613.4)
alternative label: Imetys (613.4)
alternative label: Imeväisikäiset, lastenhoito (613.4)
alternative label: Itku, lastenhoito (613.4)
alternative label: Kaksoset, lastenhoito (613.4)
alternative label: Kantoliinat (613.4)
alternative label: Kapalot (613.4)
alternative label: Kasvaminen, lapsen yksilönkehitys (613.4)
alternative label: Kasvu, lapsen yksilönkehitys (613.4)
alternative label: Kasvuhäiriöt, lapsen yksilönkehitys (613.4)
alternative label: Kehitys, lapsen kehitys (613.4)
alternative label: Kehityshäiriöt, lapsen yksilönkehitys (613.4)
alternative label: Lapsen kehitys (613.4)
alternative label: Lapsen kehitys, fyysinen kehitys (613.4)
alternative label: Lapset, fyysinen kehitys (613.4)
alternative label: Lapset, kehitys (613.4)
alternative label: Lapset, lastenhoito (613.4)
alternative label: Lapset, terveydenhoito (613.4)
alternative label: Lasten kehitys (613.4)
alternative label: Lasten kehitys, fyysinen kehitys (613.4)
alternative label: Lasten terveydenhoito (613.4)
alternative label: Lastenhoito (613.4)
alternative label: Lastenhoito, terveydenhoito (613.4)
alternative label: Leikki-ikäiset, lastenhoito (613.4)
alternative label: Leikki-ikäiset, terveydenhoito (613.4)
alternative label: Liikkumaan oppiminen, lapsen kehitys (613.4)
alternative label: Maito, imetys (613.4)
alternative label: Motorinen kehitys, lapsen kehitys (613.4)
alternative label: Pituuskasvu, lapsen yksilönkehitys (613.4)
alternative label: Rinnat, imetys (613.4)
alternative label: Rintaruokinta (613.4)
alternative label: Sensomotorinen kehitys (613.4)
alternative label: Taaperoikäiset, fyysinen kehitys (613.4)
alternative label: Taaperot, fyysinen kehitys (613.4)
alternative label: Terveydenhoito, lapset (613.4)
alternative label: Tutit, lastenhoito (613.4)
alternative label: Vaipat (613.4)
alternative label: Varhainen vuorovaikutus, lastenhoito (613.4)
alternative label: Varhaislapsuus, lastenhoito (613.4)
alternative label: Varhaislapsuus, terveydenhoito (613.4)
alternative label: Vastasyntyneet, lastenhoito (613.4)
alternative label: Vauvahieronta (613.4)
alternative label: Vauvat, lastenhoito (613.4)
alternative label: Vierihoito (613.4)
alternative label: Viivästynyt kehitys, fyysinen kehitys (613.4)
alternative label: Viivästynyt kehitys, lapsen kehitys (613.4)
alternative label: Vuoteenkastelu, lastenhoito (613.4)
alternative label: Yökastelu, lastenhoito (613.4)
alternative label: Äidinmaito, imetys (613.4)
broader: Terveydenhoito
in scheme: URN:NBN:fi:au:hklj:
notation: 613.4
related: Lapsuuden ja nuoruuden psykologia
related: Kasvatusneuvonta. Kasvatusneuvolat
related: Perhe- ja kotikasvatus
related: URN:NBN:fi:au:hklj:332.22
related: Lastenneuvolat. Äitiysneuvolat
related: Päivähoito
related: URN:NBN:fi:au:hklj:371.6
related: Hoitotiede. Hoitotyö. Hoitohenkilökunta
related: Anatomia
related: URN:NBN:fi:au:hklj:612
related: URN:NBN:fi:au:hklj:613.1
related: Henkilökohtainen terveydenhoito
related: URN:NBN:fi:au:hklj:613.3
related: URN:NBN:fi:au:hklj:615
related: URN:NBN:fi:au:hklj:617
related: URN:NBN:fi:au:hklj:617.4
related: Raskaus. Sikiönkehitys. Synnytys. Gynekologia
related: Uinti. Sukellus
related: Voimistelu
scope note: Lastenhoidon yleisteokset. Lastenhoitajan työ yleensä Imetys. Vauvahieronta Terveen lapsen tai vauvan hoito yleensä Lapsen tai vauvan terveydenhoito yleensä Lapsen tai vauvan yksilönkehitys yleensä Teokset, jotka koskevat sekä lapsen tai vauvan fyysistä että psyykkistä kehitystä Jos teos koskee sekä lastenhoitoa että lastentauteja, on etusija luokalla 613.4 Jos teos koskee sekä raskautta, synnytystä että lastenhoitoa, on etusija luokalla 617.8
scope note: Allmänna verk som rör barnavård. Barnskötarens arbete i allmänhet Amning. Babymassage Vård av friska barn eller babyer Hälsovård för barn eller babyer i allmänhet Barns eller babyers individutveckling i allmänhet Verk som rör barns och babyers fysiska och psykiska utveckling Om verket handlar om både barnavård och barnsjukdomar ges företräde åt klass 613.4 Om verket handlar om såväl graviditet och förlossning som barnavård ges företräde åt klass 617.8 @sv

Vaihtoehtolääkintä. Luonnonparannus
type: Class
type: Concept
subclass of: URN:NBN:fi:au:hklj:615
alternative label: A-vitamiini, vaihtoehtolääketiede (615.9)
alternative label: Aleksanteri-tekniikka (615.9)
alternative label: Alexander-tekniikka (615.9)
alternative label: Antroposofinen lääketiede (615.9)
alternative label: Antroposofiset valmisteet, vaihtoehtolääketiede (615.9)
alternative label: Aromaterapia (615.9)
alternative label: B-vitamiinit, vaihtoehtolääketiede (615.9)
alternative label: Bach-kukkaterapia (615.9)
alternative label: Bachin kukkaterapia (615.9)
alternative label: C-vitamiini, vaihtoehtolääketiede (615.9)
alternative label: Chakrat, vaihtoehtolääkintä (615.9)
alternative label: Chi kung (615.9)
alternative label: D-vitamiini, vaihtoehtolääketiede (615.9)
alternative label: E-vitamiini, vaihtoehtolääketiede (615.9)
alternative label: EFT, vaihtoehtolääkintä (615.9)
alternative label: Esanssit, aromaterapia (615.9)
alternative label: Eteeriset öljyt, aromaterapia (615.9)
alternative label: Etnomedisiina (615.9)
alternative label: Feldenkrais-menetelmä, vaihtoehtolääkintä (615.9)
alternative label: Funktionaalinen lääketiede (615.9)
alternative label: Hajuaineet, aromaterapia (615.9)
alternative label: Healing, vaihtoehtolääkintä (615.9)
alternative label: Hivenaineet, vaihtoehtolääketiede (615.9)
alternative label: Holistinen lääketiede, vaihtoehtolääketiede (615.9)
alternative label: Homeopaattiset valmisteet (615.9)
alternative label: Homeopatia (615.9)
alternative label: Hyötykasvit, lääkekasvit, luonnonparannus (615.9)
alternative label: Inhalaatio, vaihtoehtohoidot (615.9)
alternative label: Jalokiviterapia (615.9)
alternative label: Jäsenkorjaus, kansanlääkintä (615.9)
alternative label: K-vitamiini, vaihtoehtolääketiede (615.9)
alternative label: Kansanlääkintä (615.9)
alternative label: Kansanparannus (615.9)
alternative label: Kansanperinne, kansanparannus (615.9)
alternative label: Kasvisparantaminen, vaihtoehtolääketiede (615.9)
alternative label: Kasviöljyt, terapiaöljyt (615.9)
alternative label: Kiinalainen lääketiede (615.9)
alternative label: Kiropraktiikka (615.9)
alternative label: Kivennäisaineet, vaihtoehtolääketiede (615.9)
alternative label: Kivennäisainevalmisteet, vaihtoehtolääkintä (615.9)
alternative label: Kokonaisvaltainen lääketiede, vaihtoehtolääketiede (615.9)
alternative label: Kristalli, jalokiviterapia (615.9)
alternative label: Kukkaisterapia (615.9)
alternative label: Kukkaterapia (615.9)
alternative label: Kuppaus (615.9)
alternative label: Kylpyhoito, Kuhne-kylvyt (615.9)
alternative label: Kylvyt, Kuhne-kylvyt (615.9)
alternative label: Luonnonhoito (615.9)
alternative label: Luonnonlääkintä (615.9)
alternative label: Luonnonlääkkeet (615.9)
alternative label: Luonnonmukaisuus, luonnonparannus (615.9)
alternative label: Luonnonparannus (615.9)
alternative label: Luontaishoito (615.9)
alternative label: Luontaishoitolat (615.9)
alternative label: Luontaislääketiede (615.9)
broader: URN:NBN:fi:au:hklj:615
in scheme: URN:NBN:fi:au:hklj:
notation: 615.9
related: RAJATIETO
related: URN:NBN:fi:au:hklj:192
related: URN:NBN:fi:au:hklj:332.22
related: URN:NBN:fi:au:hklj:371.6
related: Hoitolaitokset. Sairaalatekniikka
related: Terveydenhoito
related: Henkilökohtainen terveydenhoito
related: URN:NBN:fi:au:hklj:615.1
related: Fysioterapia. Fysiologiset hoitomuodot
related: URN:NBN:fi:au:hklj:615.3
related: URN:NBN:fi:au:hklj:615.8
related: URN:NBN:fi:au:hklj:616
related: URN:NBN:fi:au:hklj:617
related: URN:NBN:fi:au:hklj:617.7
related: Liikuntaelimet. Liikuntaelinten taudit
related: Hyötykasvit
related: Yrtti- ja maustekasvit
scope note: Vaihtoehtolääkinnän, luonnonparannuksen ja kansanomaisten parannuskeinojen sekä niihin perustuvan kuntoutuksen ja itsehoidon yleisteokset Rajatietoon kuuluvat parannusmenetelmät yleensä. Healing Luonnonlääkkeet ja luonnonlääkitys yleensä Lääke- ja yrttikasvit luonnonparannuksen kannalta yleensä Alexander-tekniikka. Aromaterapia. Bioenergeettinen terapia. Homeopatia. Jalokiviterapia. Kiinalainen lääketiede. Kinesiologia. Kiropraktiikka. Kuhne-kylvyt. Kukkaterapia. Lymfahieronta. Lymfaterapia. Naprapatia. Osteopatia. Polariaterapia. Qi gong. Rolffaus. Rosenterapia. Rytminen hieronta. Sidekudoshieronta. Väriterapia Tietyn sairauden hoitoon tai ennaltaehkäisyyn tarkoitetut parannusmenetelmät ko. taudin luokassa 617-618+
scope note: Allmänna verk om alternativ medicin, naturläkemetoder och folkliga botemedel samt rehabilitering och egenvård i anknytning till dem Botande som hänför sig till paranormala fenomen. Healing Naturmediciner och naturmedicinering i allmänhet Medicinalväxter och örtväxter med anknytning till naturläkemetoder i allmänhet Alexanderteknik. Aromterapi. Bioenergetisk terapi. Homeopati. Ädelstensterapi. Kinesiologi. Kinesisk läkekonst. Kiropraktik. Kuhnebad. Blomsterterapi. Lymfmassage. Lymfterapi. Naprapati. Osteopati. Polarisationsterapi. Qi gong. Rolfning. Rosenterapi. Rytmisk massage. Bindvävsmassage. Färgterapi Naturläkemetoder avsedda för behandling eller förebyggande av enskilda sjukdomar förs till sjukdomens klass 617-618+ @sv

Rakenneosat
type: Class
type: Concept
subclass of: Talonrakennus
alternative label: Alapohjat, talonrakennus (667.3)
alternative label: Elementtirakentaminen, talonrakennus (667.3)
alternative label: Fasadit, rakennustekniikka (667.3)
alternative label: Harjakatot, talonrakennus (667.3)
alternative label: Hissit, talonrakennus (667.3)
alternative label: Holvit, talonrakennus (667.3)
alternative label: Huopakatot, talonrakennus (667.3)
alternative label: Ikkunat, talonrakennus (667.3)
alternative label: Kaakelointi, talonrakennus (667.3)
alternative label: Kantavat rakenteet, talonrakennus (667.3)
alternative label: Kantavat seinät (667.3)
alternative label: Katot, talonrakennus (667.3)
alternative label: Katteet, talonrakennus (667.3)
alternative label: Kevyet seinät, rakentaminen (667.3)
alternative label: Kitti, talonrakennus (667.3)
alternative label: Korkki, lattiat (667.3)
alternative label: Kynnykset (667.3)
alternative label: Laminointi, rakennustyöt (667.3)
alternative label: Lasi, ikkunoiden rakentaminen (667.3)
alternative label: Lasityöt, ikkunat (667.3)
alternative label: Lattianpäällysteet (667.3)
alternative label: Lattiat, talonrakennus (667.3)
alternative label: Listat, talonrakennus (667.3)
alternative label: Liukuportaat, talonrakennus (667.3)
alternative label: Lukot, ovet (667.3)
alternative label: Ovet, talonrakennus (667.3)
alternative label: Paanukatot, talonrakennus (667.3)
alternative label: Paanut, talonrakennus (667.3)
alternative label: Palkit, talonrakennus (667.3)
alternative label: Paneelit, rakennustekniikka (667.3)
alternative label: Parketti (667.3)
alternative label: Peltikatot, talonrakennus (667.3)
alternative label: Pilarit, talonrakennus (667.3)
alternative label: Pintarakenteet, talonrakennus (667.3)
alternative label: Pohjarakennus, talonrakennus (667.3)
alternative label: Pohjatutkimus, talonrakennus (667.3)
alternative label: Portaat, rakennustekniikka (667.3)
alternative label: Pylväät, talonrakennus (667.3)
alternative label: Pärekatot, talonrakennus (667.3)
alternative label: Päällysteet, lattiapäällysteet (667.3)
alternative label: Rakennesuunnittelu, talonrakennus (667.3)
alternative label: Rakennetekniikka, talonrakennus (667.3)
alternative label: Rakennuselementit, talonrakennus (667.3)
alternative label: Rakennusosat, talonrakennus (667.3)
alternative label: Rakennusrungot, talonrakennus (667.3)
alternative label: Rakenteet, talonrakennus (667.3)
alternative label: Rungot, talonrakennus (667.3)
alternative label: Runkorakenteet, talonrakennus (667.3)
alternative label: Saranat (667.3)
alternative label: Seinät, talonrakennus (667.3)
alternative label: Sisäkatot, talonrakennus (667.3)
alternative label: Sulkimet, ovet (667.3)
alternative label: Säleiköt, talonrakennus (667.3)
broader: Talonrakennus
in scheme: URN:NBN:fi:au:hklj:
notation: 667.3
related: Energia
related: Voimakoneet. Moottorit. Nosto- ja kuljetuslaitteet
related: Raideliikenneväylät. Junat. Raitiovaunut. Metro
related: Lasiteollisuus. Keraaminen teollisuus. Sementtiteollisuus
related: Rakennusstatiikka. Rakennusaineet
related: Tekninen rakennussuunnittelu
related: Rakennustyöt. Rakennusaineet. Rakennustarvikkeet
related: Muuraus. Rappaus
related: Maalaustyöt
related: URN:NBN:fi:au:hklj:667.7
related: URN:NBN:fi:au:hklj:667.71
related: Uunit. Takat
related: Huoneakustiikka
related: Rakennusten erillistilat
related: Rakennuksen kunnossapito
related: Sisustusoppaat
related: URN:NBN:fi:au:hklj:720
related: URN:NBN:fi:au:hklj:721
related: URN:NBN:fi:au:hklj:726
scope note: Rakenneosat, kuten perustukset, muurit, kantavat ja kevyet seinät, holvit, sisä- ja vesikatot, lattiat, pohjarakenteet, portaat, liukuportaat, hissit, ovet, ikkunat, pilarit, pylväät, palkit ja rakennuselementit talonrakennuksen sekä talon kunnossapidon ja korjauksen kannalta Tässä myös tiettyyn rakenneosaan liittyvät rakennus-, viimeistely-, maalaus-, korjaus- ja kunnostustyöt sekä rakennusaineet ja -tarvikkeet
scope note: Konstruktionsdelar såsom grunder, murar, bärande och lätta väggar, valv, inner- och yttertak, golv, fundament, trappor, rulltrappor, hissar, dörrar, fönster, pelare, kolonner, balkar och byggelement som hänför sig till husbyggnad samt underhåll och reparation av hus Hit också byggnadsarbeten, slutförande arbeten, målning, reparation och underhåll samt byggmaterial och byggvaror som hänför sig till enskilda konstruktionsdelar @sv

Rakennuksen kunnossapito
type: Class
type: Concept
subclass of: URN:NBN:fi:au:hklj:660
alternative label: Aliurakointi, korjausrakentaminen (668)
alternative label: Asbesti, korjausrakentaminen (668)
alternative label: Asuinhuoneistot, kunnossapito, korjaus (668)
alternative label: Asuinrakennukset, kunnossapito, korjaus (668)
alternative label: Asunnot, kunnossapito, korjaus (668)
alternative label: Autiotalot, rakennusten korjaus (668)
alternative label: Avaimet, rakennuksen kunnossapito (668)
alternative label: Betonirakennukset, rakennuksen kunnossapito (668)
alternative label: Ekoasuminen, rakennuksen korjaus (668)
alternative label: Ekologinen asuminen, rakennuksen korjaus (668)
alternative label: Ekologinen rakentaminen, rakennuksen korjaus (668)
alternative label: Ekorakentaminen, rakennuksen korjaus (668)
alternative label: Entistäminen, rakennustekniikka (668)
alternative label: Erillistalot, korjaus ja kunnossapito (668)
alternative label: Home, rakennuksen korjaus (668)
alternative label: Homevauriot, rakennuksen korjaus (668)
alternative label: Huoltomiehet, huoltomiehen työ (668)
alternative label: Huoltoyhtiöt (668)
alternative label: Huoneet, rakennuksen korjaus (668)
alternative label: Huoneistot, rakennuksen korjaus (668)
alternative label: Huvilat, rakennuksen korjaus (668)
alternative label: Hylätyt rakennukset, rakennusten korjaus (668)
alternative label: Hyönteistuhot, rakennukset (668)
alternative label: Interiöörit, korjausrakentaminen (668)
alternative label: Jää, rakennuksen kunnossapito (668)
alternative label: Jäävauriot, rakennukset (668)
alternative label: Kakkosasunnot, kunnossapito, korjaus (668)
alternative label: Keittiöt, keittiöremontit (668)
alternative label: Kerrostalot, kunnossapito ja korjaus (668)
alternative label: Kesäasunnot, rakennuksen korjaus (668)
alternative label: Kesämökit, rakennuksen korjaus (668)
alternative label: Kiinteistönhoito, talonmiehen tehtävät (668)
alternative label: Kiinteistönhoitoyritykset, talonmiehen tehtävät (668)
alternative label: Kiinteistöpalvelut, talonmiehen tehtävät (668)
alternative label: Kivirakennukset, rakennuksen kunnossapito (668)
alternative label: Kodin korjaustyöt, rakennuksen korjaus (668)
alternative label: Konservointi, rakennustekniikka (668)
alternative label: Korjaus, rakennukset (668)
alternative label: Korjauskustannukset, rakennukset (668)
alternative label: Korjausrakentaminen (668)
alternative label: Kosteat tilat, rakennusvauriot (668)
alternative label: Kosteusvauriot, rakennukset (668)
alternative label: Kulttuurihistorialliset rakennukset, rakennuksen korjaus (668)
alternative label: Kulttuurihistorialliset suojelukohteet, rakennuksen korjaus (668)
alternative label: Kunnossapito, rakennukset (668)
alternative label: Kunnostus, rakennukset (668)
alternative label: Kuntotutkimus (668)
alternative label: Liikehuoneistot, remontointi (668)
alternative label: Lisärakentaminen, rakennuksen korjaus (668)
alternative label: Loft-asunnot, kunnossapito, korjaus (668)
alternative label: Loma-asunnot, rakennuksen korjaus (668)
alternative label: Lukot, rakennuksen kunnossapito (668)
alternative label: Lumi, rakennusten lumivauriot (668)
broader: URN:NBN:fi:au:hklj:660
in scheme: URN:NBN:fi:au:hklj:
notation: 668
related: Palo- ja pelastustoimi
related: Kiinteistöt. Tontit
related: Asuntopolitiikka
related: Rakennusstatiikka. Rakennusaineet
related: Tekninen rakennussuunnittelu
related: Geotekniikka. Maatyöt
related: Talonrakennus
related: Rakennustyöt. Rakennusaineet. Rakennustarvikkeet
related: Muuraus. Rappaus
related: Maalaustyöt
related: Rakenneosat
related: URN:NBN:fi:au:hklj:667.7
related: URN:NBN:fi:au:hklj:667.71
related: Uunit. Takat
related: Rakennusten erillistilat
related: Kodin korjaustöiden oppaat
related: KOTITALOUS. LAITOSTALOUS. KAUNEUDENHOITO
related: URN:NBN:fi:au:hklj:720
related: URN:NBN:fi:au:hklj:726
scope note: Rakennuksen kunnossapitoa, korjaustöitä, peruskorjausta, saneerausta tai entisöintiä koskevat yleiset rakennustekniset ohjeet ja oppaat Rakennuksen kunnossapitoon liittyvä yleinen rakennusstatiikka ja tekninen rakennussuunnittelu Rakennusvauriot ja -virheet sekä niiden ehkäisy ja korjaus Rakennusten takuukorjaukset. Talonmiehen ja huoltomiehen tehtävät Tiettyyn rakennustekniikan erikoisalaan liittyvät kunnossapito- ja korjausohjeet ko. rakennustekniikan erikoisalan luokassa
scope note: Byggnadstekniska instruktioner och handböcker om underhåll, renovering, ombyggnad, sanering eller restaurering av byggnader Allmän byggnadsstatik och teknisk byggnadsplanering som hänför sig till underhåll av byggnader Byggnadsskador samt reparation och förebyggande av dem Garantireparationer av byggnader. Gårdskarlens och fastighetsskötarens arbete Underhålls- och reparationsinstruktioner som rör ett bestämt byggnadstekniskt specialområde förs till klassen för det byggnadstekniska specialområdet @sv

Työntutkimukset. Työanalyysi
type: Class
type: Concept
subclass of: Liiketalouden hallinto ja organisaatio
alternative label: Aikasuunnittelu, työntutkimukset (674.3)
alternative label: Aikatutkimus, työntutkimus (674.3)
alternative label: Ajanhallinta, työntutkimukset (674.3)
alternative label: Ajankäyttö, työntutkimukset (674.3)
alternative label: Alaiset, työntutkimus (674.3)
alternative label: Ammattitaito, työn kehittäminen (674.3)
alternative label: Ammattitaitokilpailut, ammattitaito (674.3)
alternative label: Kehittyminen, työyhteisöt (674.3)
alternative label: Kehittämishankkeet (674.3)
alternative label: Kehittämishankkeet, työn organisointi (674.3)
alternative label: Kehittämisohjelmat (674.3)
alternative label: Kehittämisohjelmat, työn organisointi (674.3)
alternative label: Kehittämisprojektit (674.3)
alternative label: Kehittämisprojektit, työn organisointi (674.3)
alternative label: Kehittämisstrategiat, työyhteisöt (674.3)
alternative label: Kehittämissuunnittelu (674.3)
alternative label: Kehittämissuunnittelu, työn organisointi (674.3)
alternative label: Kehittävä työntutkimus (674.3)
alternative label: Kehitys, työyhteisöt (674.3)
alternative label: Kehitysohjelmat (674.3)
alternative label: Kehitysohjelmat, työn organisointi (674.3)
alternative label: Kehitysstrategiat, työyhteisöt (674.3)
alternative label: Kehitystutkimus, työyhteisöt (674.3)
alternative label: Kelpoisuus, ammattipätevyys (674.3)
alternative label: Kvalifikaatiot, pätevyys (674.3)
alternative label: Laatu, työntutkimus (674.3)
alternative label: Laatujärjestelmät, työntutkimus (674.3)
alternative label: Parityöskentely, työn organisointi (674.3)
alternative label: Pätevyys, ammattipätevyys (674.3)
alternative label: Ryhmätyö, työn organisointi (674.3)
alternative label: Taidot, ammattitaito (674.3)
alternative label: Taylorismi (674.3)
alternative label: Tehokkuus, työanalyysi (674.3)
alternative label: Tehtävänkuvaukset, työanalyysi (674.3)
alternative label: Tehtävät, työanalyysi (674.3)
alternative label: Tiimityö, työanalyysi (674.3)
alternative label: Toimenkuvat (674.3)
alternative label: Toimenkuvat, työn organisointi (674.3)
alternative label: Tulospiirit (674.3)
alternative label: Työ, työanalyysi (674.3)
alternative label: Työanalyysi (674.3)
alternative label: Työjärjestys, työanalyysi (674.3)
alternative label: Työkierto, työanalyysi (674.3)
alternative label: Työkokeilu, työanalyysi (674.3)
alternative label: Työmenetelmät (674.3)
alternative label: Työmäärä, työanalyysi (674.3)
alternative label: Työn jakaminen (674.3)
alternative label: Työn luokitus (674.3)
alternative label: Työn organisointi (674.3)
alternative label: Työn sisältö, työanalyysi (674.3)
alternative label: Työnarviointi (674.3)
alternative label: Työnjako (674.3)
alternative label: Työnkuva (674.3)
broader: Liiketalouden hallinto ja organisaatio
in scheme: URN:NBN:fi:au:hklj:
notation: 674.3
related: URN:NBN:fi:au:hklj:340
related: Organisaatioiden ja laitosten sosiologia
related: Työn sosiologia
related: URN:NBN:fi:au:hklj:360
related: URN:NBN:fi:au:hklj:363
related: URN:NBN:fi:au:hklj:368
related: Tuotanto. Tuottavuus
related: Työ sosiaalipoliittisena kysymyksenä
related: Työolot
related: Työsuojelu
related: Työllisyys. Työttömyys. Työvoimapalvelu
related: URN:NBN:fi:au:hklj:620
related: URN:NBN:fi:au:hklj:627.751
related: METALLITEOLLISUUS. PUUNJALOSTUSTEOLLISUUSSÄHKÖTEKNINEN TEOLLISUUS TEKSTIILI- JA NAHKATEOLLISUUS
related: KEMIAN TEOLLISUUS. KAIVOSTEOLLISUUS
related: URN:NBN:fi:au:hklj:650.2
related: Johtamisen tekniikka ja menetelmät
related: Henkilöstöpolitiikka
related: URN:NBN:fi:au:hklj:675
scope note: Työntutkimukset ja työanalyysi sekä yksityisen että julkisen yrityksen tai organisaation kannalta yleensä Työn suunnittelu, järjestäminen ja rationalisointi yleensä Laatupiirit, tulospiirit, toimenkuvat ja työnkulku yleensä Työn mittaaminen, ajankäyttötutkimukset yleensä Työn ja työpaikkojen luokitus yleensä Erikoisaloja koskeva työntutkimus ja työanalyysi alan mukaisessa luokassa
scope note: Arbetsstudier och arbetsanalyser med hänsyn till både privata och offentliga företag eller organisationer i allmänhet Planering, organisation och rationalisering av arbete i allmänhet Kvalitetskretsar, resultatcirklar, befattningsbeskrivningar och arbetsprocedurer i allmänhet Arbetsmätning, undersökningar av tidsanvändning i allmänhet Klassificering av arbete och arbetsplatser i allmänhet Arbetsstudier och arbetsanalys inom specialområden klassificeras enligt område @sv

Kuluttajanvalistus
type: Class
type: Concept
subclass of: Mainonta. Kuluttajanvalistus
alternative label: CE-merkintä, kuluttajansuojelu (676.2)
alternative label: Kampanjat, kuluttajanvalistus (676.2)
alternative label: Kohderyhmät, kuluttajaneuvonta (676.2)
alternative label: Kotimaiset tuotteet, kuluttajanvalistus (676.2)
alternative label: Kuluttajakasvatus (676.2)
alternative label: Kuluttajaneuvonta (676.2)
alternative label: Kuluttajansuoja (676.2)
alternative label: Kuluttajariidat (676.2)
alternative label: Kuluttajasuoja (676.2)
alternative label: Kuluttajavalistus (676.2)
alternative label: Käyttöikä, kuluttajanvalistus (676.2)
alternative label: Merkinnät, kuluttajansuoja (676.2)
alternative label: Merkit, kuluttajansuoja (676.2)
alternative label: Ostajat, kuluttajaneuvonta (676.2)
alternative label: Ryhmävalitukset, kuluttajansuojelu (676.2)
alternative label: Sisältö, tuoteselosteet, kuluttajanvalistus (676.2)
alternative label: Talouskasvatus, kuluttajakasvatus (676.2)
alternative label: Tavaraselosteet, kuluttajanvalistus (676.2)
alternative label: Tavarat, kuluttajanvalistus (676.2)
alternative label: Tuoteselosteet, kuluttajanvalistus (676.2)
alternative label: Tuoteturvallisuus, kuluttajansuojelu (676.2)
alternative label: Tuotevahingot, kuluttajansuojelu (676.2)
alternative label: Tuotevalvonta, kuluttajansuojelu (676.2)
alternative label: Tuotteet, kuluttajanvalistus (676.2)
alternative label: Turvallisuus, tuoteturvallisuus (676.2)
alternative label: Tyyppihyväksyntä, kuluttajansuojelu (676.2)
alternative label: Valitukset, kuluttajansuojelu (676.2)
alternative label: Valvonta, tuoteturvallisuus (676.2)
alternative label: Varoitusmerkinnät, kuluttajansuoja (676.2)
alternative label: Användningstid, konsumentupplysning (676.2) @sv
alternative label: Besvär, konsumentskydd (676.2) @sv
alternative label: CE-märkning, konsumentskydd (676.2) @sv
alternative label: Ekonomisk fostran, konsumentfostran (676.2) @sv
alternative label: Grupptalan, konsumentskydd (676.2) @sv
alternative label: Inhemska produkter, konsumentupplysning (676.2) @sv
alternative label: Innehåll, varudeklarationer, konsumentupplysning (676.2) @sv
alternative label: Kampanjer, konsumentupplysning (676.2) @sv
alternative label: Konsumentfostran (676.2) @sv
alternative label: Konsumentrådgivning (676.2) @sv
alternative label: Konsumentskydd (676.2) @sv
alternative label: Konsumenttvister (676.2) @sv
alternative label: Konsumentupplysning (676.2) @sv
alternative label: Köpare, konsumentrådgivning (676.2) @sv
alternative label: Märkningar, konsumentskydd (676.2) @sv
alternative label: Målgrupper, konsumentrådgivning (676.2) @sv
alternative label: Produkter, konsumentupplysning (676.2) @sv
alternative label: Produktkontroll, konsumentskydd (676.2) @sv
alternative label: Produktskador, konsumentskydd (676.2) @sv
alternative label: Produktsäkerhet, konsumentskydd (676.2) @sv
alternative label: Säkerhet, trygghet, produktsäkerhet (676.2) @sv
alternative label: Tecken, konsumentskydd (676.2) @sv
alternative label: Typgodkännande, konsumentskydd (676.2) @sv
alternative label: Varningstecken, konsumentskydd (676.2) @sv
broader: Mainonta. Kuluttajanvalistus
in scheme: URN:NBN:fi:au:hklj:
notation: 676.2
related: Kauppaoikeus. Yhtiölainsäädäntö. Pankki- ja vakuutuslainsäädäntö
related: URN:NBN:fi:au:hklj:360
related: URN:NBN:fi:au:hklj:363
related: Osuustoiminta
related: URN:NBN:fi:au:hklj:368
related: Hinnat. Hintapolitiikka
related: Elintaso. Kulutus
related: Ympäristönsuojelu. Luonnonsuojelu
related: Uhanalaiset lajit. Luonnonsuojelualueet
related: Maaperän, metsien ja soiden suojelu
related: Vesien suojelu
related: Ilman suojelu
related: Henkilökohtainen terveydenhoito
related: URN:NBN:fi:au:hklj:649.91
related: URN:NBN:fi:au:hklj:650.2
related: Tavaraoppi
related: URN:NBN:fi:au:hklj:675
related: Markkinointi. Asiakaspalvelu
related: Mainonta
scope note: Kuluttajanvalistus, kuluttajakasvatus, kuluttajaneuvonta sekä kuluttajansuojelu yleensä Yleiset kuluttajan oppaat Tiettyä tuotetta tai erikoisalaa koskeva kuluttajanvalistus alan mukaisessa luokassa
scope note: Konsumentupplysning, konsumentfostran och konsumentvägledning samt konsumentskydd i allmänhet Allmänna råd för konsumenter Konsumentupplysning som rör enskilda produkter eller ett bestämt specialområde klassificeras enligt område @sv

Optiset ja lääketieteelliset laitteet
type: Class
type: Concept
subclass of: URN:NBN:fi:au:hklj:681
alternative label: Alkometrit, hienomekaniikka (681.2)
alternative label: Apuvälineet, vammaisten, hienomekaninen teollisuus (681.2)
alternative label: Aurinkolasit, optinen teollisuus (681.2)
alternative label: Diaprojektorit, teollisuus ja kauppa (681.2)
alternative label: Digikamerat, teollisuus ja kauppa (681.2)
alternative label: Digitaalikamerat, teollisuus ja kauppa (681.2)
alternative label: Elektronimikroskoopit (681.2)
alternative label: Elektronimikroskopia (681.2)
alternative label: Elokuvakamerat, teollisuus ja kauppa (681.2)
alternative label: Elokuvaprojektorit, teollisuus ja kauppa (681.2)
alternative label: Fluoresenssimikroskopia (681.2)
alternative label: Holografia, optinen tekniikka (681.2)
alternative label: Hologrammit, optinen tekniikka (681.2)
alternative label: Hyvinvointitekniikka, vammaisten apuvälineet, tekniikka ja teollisuus (681.2)
alternative label: Hyvinvointiteknologia, vammaisten apuvälineet, tekniikka ja teollisuus (681.2)
alternative label: Ikänäkö, silmälasit (681.2)
alternative label: Ilmapuntarit, hienomekaniikka (681.2)
alternative label: Infrapunatekniikka, optinen teollisuus (681.2)
alternative label: Instrumentit, hienomekaniikka (681.2)
alternative label: Jalustat, optiset laitteet (681.2)
alternative label: Järjestelmäkamerat, teollisuus ja kauppa (681.2)
alternative label: Kaitafilmikamerat, teollisuus ja kauppa (681.2)
alternative label: Kamerat, teollisuus ja kauppa (681.2)
alternative label: Kauko-objektiivit, teollisuus ja kauppa (681.2)
alternative label: Kaukoputket, optinen teollisuus (681.2)
alternative label: Kiikarit, optinen teollisuus (681.2)
alternative label: Kompaktikamerat, teollisuus ja -kauppa (681.2)
alternative label: Kompassit, hienomekaniikka (681.2)
alternative label: Kuituoptiikka (681.2)
alternative label: Kuulokojeet, tekniikka ja valmistus (681.2)
alternative label: Kuumemittarit, tekniikka ja valmistus (681.2)
alternative label: Käyttövarmuus, optiset ja lääketieteelliset laitteet (681.2)
alternative label: Lasikuituoptiikka (681.2)
alternative label: Likinäköisyys, silmälasit (681.2)
alternative label: Linssit (681.2)
alternative label: Lisälaitteet, optiikka (681.2)
alternative label: Mikroskoopit (681.2)
alternative label: Mikroskopia (681.2)
alternative label: Mittarit, hienomekaniikka (681.2)
alternative label: Mittauslaitteet, hienomekaniikka (681.2)
alternative label: Mittausmenetelmät, hienomekaniikka (681.2)
alternative label: Mittaustekniikka, hienomekaniikka (681.2)
alternative label: Objektiivit, kiikarit, ym. (681.2)
alternative label: Optiikka, hienomekaniikka (681.2)
alternative label: Optikot, optikon työ (681.2)
alternative label: Optinen mikroskopia (681.2)
alternative label: Optinen tekniikka (681.2)
alternative label: Optinen teollisuus (681.2)
alternative label: Optiset laitteet (681.2)
alternative label: Peilikaukoputket, optiikka (681.2)
alternative label: Peilit, optiikka (681.2)
alternative label: Periskoopit, optiset laitteet (681.2)
alternative label: Piilolasit, optinen teollisuus (681.2)
broader: URN:NBN:fi:au:hklj:681
in scheme: URN:NBN:fi:au:hklj:
notation: 681.2
related: Tähtitieteelliset kojeet
related: Kokeellinen fysiikka
related: Valo-oppi. Värioppi. Säteilyoppi
related: Kokeellinen kemia
related: Yleinen mikrobiologia
related: Linnut
related: Hoitolaitokset. Sairaalatekniikka
related: URN:NBN:fi:au:hklj:615
related: Korva. Nenäontelo. Kurkku. Korva-, nenä- ja kurkkutaudit
related: Liikuntaelimet. Liikuntaelinten taudit
related: Silmä. Silmätaudit
related: Säätö- ja systeemitekniikka. Teollinen automaatio
related: URN:NBN:fi:au:hklj:627.7532
related: Kodin korjaustöiden oppaat
related: URN:NBN:fi:au:hklj:756
related: Valokuvauksen materiaalit ja tekniikka. Valokuvausoppaat
related: URN:NBN:fi:au:hklj:760
related: Elokuvatekniikka. Videokuvauksen tekniikka
related: URN:NBN:fi:au:hklj:798
scope note: Lääketieteelliseen hoitoon ja tutkimukseen liittyvät laitteet, niiden teollinen valmistus ja kauppa Optinen teollisuus ja sen tuotteiden kauppa Kiikareiden, kaukoputkien, mikroskooppien, kameroiden, objektiivien ja linssien valmistus. Holografiatekniikka Silmälasien, piilolinssien ja aurinkolasien valmistus Optikon työ. Optikkoliikkeet Kuulokojeiden, proteesien, pyörätuolien ja muiden vammaisten apuvälineiden valmistus Tässä myös mittaus- ja valvontalaitteiden valmistus Optisten ja lääketieteellisten laitteiden käyttö alan mukaisessa luokassa
scope note: Instrument och apparater som används vid medicinsk behandling och undersökning, industriell tillverkning av och handel med dem Optisk industri och handel med dess produkter Tillverkning av kikare, teleskop, mikroskop, kameror, objektiv och linser Holografiteknik Tillverkning av glasögon, kontaktlinser och solglasögon Optikerns arbete. Optikeraffärer Tillverkning av hörapparater, proteser, rullstolar och andra hjälpmedel för handikappade Användning av optiska och medicinska apparater klassificeras enligt område Hit också tillverkning av mätinstrument och utrustning för övervakning Användning av optiska och medicinska instrument och apparater klassificeras enligt område @sv

Metallityö
type: Class
type: Concept
subclass of: HIENOMEKANIIKKA. KÄSI- JA KOTITEOLLISUUS
alternative label: Kiillotus, metallikäsityöt (683)
alternative label: Kupariesineet, sepän työ (683)
alternative label: Kynttilänjalat, metallityöohjeet (683)
alternative label: Käsityöt, metallityöt (683)
alternative label: Käyttöesineet, metallityöt (683)
alternative label: Lehmänkello, metallityöt (683)
alternative label: Levytyö, peltisepän työ (683)
alternative label: Lukot, sepän työ (683)
alternative label: Metalliesineet, sepän työ (683)
alternative label: Metallinpakotus, sepän työ (683)
alternative label: Metallinvalu, sepän työ (683)
alternative label: Metallityöt, sepän työ (683)
alternative label: Ohjekirjat, metallityöt (683)
alternative label: Pajat, sepän pajat (683)
alternative label: Pajatyö (683)
alternative label: Pakotus, metallityöt (683)
alternative label: Pelti, metallityöt (683)
alternative label: Peltisepät, peltisepän työ (683)
alternative label: Peltityö (683)
alternative label: Pintakäsittely, käsityö, metallityö (683)
alternative label: Puukot, käsiteollisuus (683)
alternative label: Rakentaminen, käsityö, metallityöt (683)
alternative label: Sepät, sepän työ (683)
alternative label: Takominen, sepän työ (683)
alternative label: Taonta, sepän työ (683)
alternative label: Tinatyöt, sepän työ (683)
alternative label: Työpajat, sepän työ (683)
alternative label: Valaminen, metallikäsityöt (683)
alternative label: Valu, metallikäsityö, sepän työ (683)
alternative label: Verstaat, sepän työ (683)
alternative label: Viilaus, metallikäsityö (683)
alternative label: Bruksvaror, metallarbeten (683) @sv
alternative label: Byggande, hantverk, metallarbeten (683) @sv
alternative label: Drivning, metall, metallarbeten (683) @sv
alternative label: Filning, metallhantverk (683) @sv
alternative label: Gjutning, metallhantverk, smedens (683) @sv
alternative label: Handarbeten, metallarbeten (683) @sv
alternative label: Instruktionsböcker, metallarbeten (683) @sv
alternative label: Kopparföremål, smedens arbete (683) @sv
alternative label: Koskälla, metallarbeten (683) @sv
alternative label: Ljusstakar, metallarbetsbeskrivningar (683) @sv
alternative label: Lås, smedens arbete (683) @sv
alternative label: Metallarbeten, smedens arbete (683) @sv
alternative label: Metalldrivning, smedens arbete (683) @sv
alternative label: Metallföremål, smedens arbete (683) @sv
alternative label: Metallgjutning, smedens arbete (683) @sv
alternative label: Plåt, metallarbeten (683) @sv
alternative label: Plåtarbete (683) @sv
alternative label: Plåtslagare, plåtslagarens arbete (683) @sv
alternative label: Plåtslageriarbete, plåtslagarens arbete (683) @sv
alternative label: Polering, metallhantverk (683) @sv
alternative label: Slidknivar, hantverk (683) @sv
alternative label: Smeder, smedens arbete (683) @sv
broader: HIENOMEKANIIKKA. KÄSI- JA KOTITEOLLISUUS
in scheme: URN:NBN:fi:au:hklj:
notation: 683
related: URN:NBN:fi:au:hklj:473
related: URN:NBN:fi:au:hklj:473.1
related: URN:NBN:fi:au:hklj:475
related: URN:NBN:fi:au:hklj:475.1
related: URN:NBN:fi:au:hklj:476
related: URN:NBN:fi:au:hklj:476.1
related: URN:NBN:fi:au:hklj:476.11
related: URN:NBN:fi:au:hklj:476.12
related: URN:NBN:fi:au:hklj:476.5
related: URN:NBN:fi:au:hklj:476.6
related: URN:NBN:fi:au:hklj:476.7
related: URN:NBN:fi:au:hklj:476.8
related: URN:NBN:fi:au:hklj:631
related: Rakennustyöt. Rakennusaineet. Rakennustarvikkeet
related: Kodin korjaustöiden oppaat
related: URN:NBN:fi:au:hklj:760
related: Taidetaonta
related: Kulta- ja hopeasepäntaide. Korutaide
related: URN:NBN:fi:au:hklj:798
scope note: Metallityöohjeet ja -mallit Metallin valu, pakotus ja taonta käsityön ja kotiteollisuuden kannalta Sepän ja peltisepän työ käsityön, pajatyön ja kotiteollisuuden kannalta
scope note: Arbetsinstruktioner och modeller för metallarbete Gjutning, drivning och smide av metall ur hantverks- och hemslöjdssynvinkel Smedens och plåtslagarens arbete ur hantverks-, verkstads- och hemslöjdssynvinkel @sv

Euroopan ulkopuolisten vanhojen kulttuurien taide
type: Class
type: Concept
subclass of: URN:NBN:fi:au:hklj:709
alternative label: Aasia, taide, perinteinen (709.1)
alternative label: Arabialainen taide (709.1)
alternative label: Egypti, taidehistoria, muinaisajan (709.1)
alternative label: Indus-kulttuuri, taide (709.1)
alternative label: Intia, taide, perinteinen (709.1)
alternative label: Islam, taidehistoria (709.1)
alternative label: Islamilainen taide, taidehistoria (709.1)
alternative label: Itämaat, taidehistoria, perinteinen (709.1)
alternative label: Itämainen kulttuuri, taidehistoria (709.1)
alternative label: Itämainen taide (709.1)
alternative label: Itämaisuus, taidehistoria (709.1)
alternative label: Japani, taidehistoria (709.1)
alternative label: Kiina, taidehistoria (709.1)
alternative label: Orientalismi, taidehistoria (709.1)
alternative label: Persia, taidehistoria, muin. (709.1)
alternative label: Sinologia, Kiinan taide, perinteinen (709.1)
alternative label: Skyyttalaiset, taidehistoria (709.1)
alternative label: Sumerilainen taide (709.1)
alternative label: Taidehistoria, Euroopan ulkopuoliset kulttuurit (709.1)
alternative label: Vanha aika, taidehistoria, Euroopan ulkopuoliset kulttuurit (709.1)
alternative label: Arabisk konst (709.1) @sv
alternative label: Asien, konst, traditionell (709.1) @sv
alternative label: Egypten, konsthistoria, forntidens (709.1) @sv
alternative label: Gamla tiden, konsthistoria, utomeuropeiska kulturer (709.1) @sv
alternative label: Indien, konst, traditionell (709.1) @sv
alternative label: Induskulturen, konst (709.1) @sv
alternative label: Islam, konsthistoria (709.1) @sv
alternative label: Islamisk konst, konsthistoria (709.1) @sv
alternative label: Japan, konsthistoria (709.1) @sv
alternative label: Kina, konsthistoria (709.1) @sv
alternative label: Konsthistoria, utomeuropeiska kulturer, kulturer (709.1) @sv
alternative label: Orientalisk kultur, konsthistoria (709.1) @sv
alternative label: Orientalism, konsthistoria (709.1) @sv
alternative label: Orienten, konsthistoria, traditionell (709.1) @sv
alternative label: Persien, konsthistoria, forn. (709.1) @sv
alternative label: Sinologi, Kina, konst, traditionell (709.1) @sv
alternative label: Skyter, konsthistoria (709.1) @sv
alternative label: Sumerisk konst (709.1) @sv
alternative label: Österländsk konst (709.1) @sv
broader: URN:NBN:fi:au:hklj:709
in scheme: URN:NBN:fi:au:hklj:
notation: 709.1
preferred label: Art of ancient non-European cultures @en
preferred label: Utomeuropeiska fornkulturernas konst @sv
related: Alkuperäiskansojen taide
related: Antiikin taidehistoria
related: Nykyajan taidehistoria
related: Vanhan ajan arkkitehtuuri. Euroopan ulkopuolisten vanhojen kulttuurien arkkitehtuuri
related: Keskiajan arkkitehtuuri
related: URN:NBN:fi:au:hklj:730.9
related: Vanhan ajan kuvanveistotaide. Euroopan ulkopuolisten vanhojen kulttuurien kuvanveistotaide
related: URN:NBN:fi:au:hklj:740.9
related: Vanhan ajan maalaustaide. Euroopan ulkopuolistenvanhojen kulttuurien maalaustaide
related: URN:NBN:fi:au:hklj:769
related: URN:NBN:fi:au:hklj:770.9
related: URN:NBN:fi:au:hklj:789
related: URN:NBN:fi:au:hklj:789.1
related: Varhaiskansojen musiikki
related: Yleinen arkeologia
related: Egyptin ja Etu-Aasian muinaishistoria ja arkeologia
related: URN:NBN:fi:au:hklj:919
related: Vanhan ajan kulttuurihistoria
scope note: Euroopan ulkopuolisten vanhojen korkeakulttuurien taide yleensä Itämaisten kulttuurien perinteinen taide yleensä Tässä esim. Kiinan, Japanin, Intian, Persian, Mesopotamian, Arabian, islamin ja Egyptin vanhojen kulttuurien taide yleensä Tässä myös Euroopan ulkopuolisten vanhojen kulttuurien naamiot Euroopan ulkopuolisten vanhojen kulttuurien taiteen eri aloja koskevat teokset alan mukaisessa luokassa Yksittäisiä taiteilijoita tai heidän tuotantoaan koskevat teokset ovat aina ko. taiteenalan tai sen historian luokassa
scope note: De utomeuropeiska forna högkulturernas konst i allmänhet De österländska kulturernas traditionella konst i allmänhet Hit t.ex. de kinesiska, japanska, indiska, persiska, mesopotamiska, arabiska, islamiska och egyptiska fornkulturernas konst i allmänhet Hit också de utomeuropeiska fornkulturernas masker Verk som handlar om de utomeuropeiska fornkulturernas enskilda konstarter klassificeras enligt konstart Verk som handlar om enskilda konstnärer och deras produktion klassificeras alltid enligt konstarten eller dess historia @sv

Alkuperäiskansojen maalaustaide
type: Class
type: Concept
subclass of: URN:NBN:fi:au:hklj:740.9
alternative label: Aboriginaalit, Australia, maalaustaide (740.901)
alternative label: Afrikka, maalaustaide, perinteinen (740.901)
alternative label: Alkuperäiskansat, maalaustaide (740.901)
alternative label: Amerikka, maalaustaide, alkuperäiskansat (740.901)
alternative label: Asteekit, maalaustaide (740.901)
alternative label: Atsteekit, maalaustaide (740.901)
alternative label: Australia, maalaustaide, aboriginaalit. (740.901)
alternative label: Etelä-Amerikka, maalaustaide, alkuperäiskansat (740.901)
alternative label: Inkat, maalaustaide (740.901)
alternative label: Intiaanit, maalaustaide (740.901)
alternative label: Luolamaalaukset, alkuperäiskansat, nykyajan (740.901)
alternative label: Luonnonkansat, maalaustaide (740.901)
alternative label: Mayat, maalaustaide (740.901)
alternative label: Oseania, maalaustaide, aboriginaalien (740.901)
alternative label: Pohjois-Amerikka, maalaustaide, alkuperäiskansat (740.901)
alternative label: Primitiivinen taide, maalaustaide (740.901)
alternative label: Primitiiviset kansat, maalaustaide (740.901)
alternative label: Tolteekit, maalaustaide (740.901)
alternative label: Aboriginer, Australien, målarkonst (740.901) @sv
alternative label: Afrika, målarkonst, traditionell (740.901) @sv
alternative label: Amerika, målarkonst, urbefolkningar (740.901) @sv
alternative label: Australien, målarkonst, aboriginer. (740.901) @sv
alternative label: Azteker, asteekit, målarkonst (740.901) @sv
alternative label: Azteker, atsteekit, målarkonst (740.901) @sv
alternative label: Grottmålningar, urbefolkningar, nutidens (740.901) @sv
alternative label: Indianer, målarkonst (740.901) @sv
alternative label: Inkaindianer, målarkonst (740.901) @sv
alternative label: Mayafolket, målarkonst (740.901) @sv
alternative label: Naturfolk, målarkonst (740.901) @sv
alternative label: Nordamerika, målarkonst, urbefolkningar (740.901) @sv
alternative label: Oceanien, målarkonst, aboriginers (740.901) @sv
alternative label: Primitiv konst, målarkonst (740.901) @sv
alternative label: Primitiva folk, målarkonst (740.901) @sv
alternative label: Sydamerika, målarkonst, urbefolkningar (740.901) @sv
alternative label: Tolteker, målarkonst (740.901) @sv
alternative label: Urbefolkningar, målarkonst (740.901) @sv
broader: URN:NBN:fi:au:hklj:740.9
in scheme: URN:NBN:fi:au:hklj:
notation: 740.901
preferred label: Aboriginal painting @en
preferred label: Ursprungsfolkens målarkonst @sv
related: URN:NBN:fi:au:hklj:709
related: Alkuperäiskansojen taide
related: Vanhan ajan maalaustaide. Euroopan ulkopuolistenvanhojen kulttuurien maalaustaide
related: Eurooppa
related: Aasia
related: Afrikka
related: Amerikka
related: Yhdysvallat
related: Australia. Oseania
related: URN:NBN:fi:au:hklj:741
related: URN:NBN:fi:au:hklj:741.1
related: URN:NBN:fi:au:hklj:741.2
related: URN:NBN:fi:au:hklj:742
related: URN:NBN:fi:au:hklj:749
related: URN:NBN:fi:au:hklj:749.1
scope note: Maasta tai maanosasta riippumatta eskimoiden, intiaanien, saamelaisten sekä Aasian, Afrikan, Australian ja Oseanian alkuperäiskansojen maalaustaide Tässä myös intiaanien korkeakulttuurien maalaustaide
scope note: Eskimåernas, indianernas, samernas samt de asiatiska, afrikanska, australiska och oceaniska ursprungsfolkens målarkonst oavsett land eller världsdel Hit också de indianska högkulturernas målarkonst @sv

Vanhan ajan maalaustaide. Euroopan ulkopuolistenvanhojen kulttuurien maalaustaide
type: Class
type: Concept
subclass of: URN:NBN:fi:au:hklj:740.9
alternative label: Aasia, maalaustaide, perinteinen (740.903)
alternative label: Antiikki, maalaustaide (740.903)
alternative label: Egypti, maalaustaide, muinaisajan (740.903)
alternative label: Etruskit, maalaustaide (740.903)
alternative label: Intia, maalaustaide, perinteinen (740.903)
alternative label: Itämaat, maalaustaide, perinteinen (740.903)
alternative label: Japani, maalaustaide, perinteinen (740.903)
alternative label: Kertaustyylit, maalaustaide (740.903)
alternative label: Kiina, maalaustaide, perinteinen (740.903)
alternative label: Kreikka, maalaustaide, antiikki (740.903)
alternative label: Persia, maalaustaide, muinaisaika (740.903)
alternative label: Rooman valtakunta, maalaustaide (740.903)
alternative label: Antiken, målarkonst (740.903) @sv
alternative label: Asien, målarkonst, traditionell (740.903) @sv
alternative label: Egypten, målarkonst, forntidens (740.903) @sv
alternative label: Etrusker, målarkonst (740.903) @sv
alternative label: Grekland, målarkonst, antiken (740.903) @sv
alternative label: Imitationsstilar, målarkonst (740.903) @sv
alternative label: Indien, målarkonst, traditionell (740.903) @sv
alternative label: Japan, målarkonst, traditionell (740.903) @sv
alternative label: Kina, målarkonst, traditionell (740.903) @sv
alternative label: Orienten, målarkonst, traditionell (740.903) @sv
alternative label: Persien, målarkonst, forntiden (740.903) @sv
alternative label: Romerska riket, målarkonst (740.903) @sv
broader: URN:NBN:fi:au:hklj:740.9
in scheme: URN:NBN:fi:au:hklj:
notation: 740.903
preferred label: Ancient painting. Painting in ancient non-European cultures @en
preferred label: Forntidens målarkonst. Utomeuropeiska fornkulturers målarkonst @sv
related: URN:NBN:fi:au:hklj:709
related: Euroopan ulkopuolisten vanhojen kulttuurien taide
related: Antiikin taidehistoria
related: Alkuperäiskansojen maalaustaide
related: Keskiajan maalaustaide
related: Eurooppa
related: Etelä-Eurooppa
related: Italia
related: Aasia
related: Afrikka
related: URN:NBN:fi:au:hklj:741
related: URN:NBN:fi:au:hklj:741.1
related: URN:NBN:fi:au:hklj:741.2
related: URN:NBN:fi:au:hklj:742
related: URN:NBN:fi:au:hklj:749
related: URN:NBN:fi:au:hklj:749.1
related: Taidegrafiikka
scope note: Maasta tai maanosasta riippumatta vanhan ajan ja antiikin maalaustaide Muinaisen Kreikan ja Rooman valtakunnan maalaustaide Minolainen, mykeneläinen ja hellenistinen maalaustaide Etruskien maalaustaide Euroopan ulkopuolisten vanhojen korkeakulttuurien maalaustaide Itämaisten kulttuurien perinteinen maalaustaide Tässä esim. Kiinan, Japanin, Intian, Persian, Mesopotamian ja Egyptin maalaustaide
scope note: Forntidens och antikens målarkonst oavsett land eller världsdel Målarkonsten i det antika Grekland och Romarriket Minoisk, mykensk och hellenistisk målarkonst Etruskernas målarkonst De utomeuropeiska forna högkulturernas målarkonst De österländska kulturernas traditionella målarkonst Hit t.ex. de kinesiska, japanska, indiska, persiska, mesopotamiska och egyptiska fornkulturernas målarkonst @sv

Taidetaonta
type: Class
type: Concept
subclass of: URN:NBN:fi:au:hklj:760
alternative label: Kupariesineet, taidetaonta (761)
alternative label: Kupariesineet, taideteollisuus (761)
alternative label: Kuparityöt, taidetaonta (761)
alternative label: Kynttilänjalat, taideteollisuus, metalli (761)
alternative label: Käsityöt, taidetaonta (761)
alternative label: Messinkityöt, taidetaonta (761)
alternative label: Metalliesineet, taideteollisuus (761)
alternative label: Metallinpakotus, taideteollisuus (761)
alternative label: Metallinvalu, taideteollisuus (761)
alternative label: Metallitaide (761)
alternative label: Metallituotteet, taideteollisuustuotteet (761)
alternative label: Metallityöt, taidetaonta (761)
alternative label: Muotit, metallinvalu, taideteollinen (761)
alternative label: Muotoilijat, eri alat (761 ... 768)
alternative label: Muotoilu, eri alat (761 ... 768)
alternative label: Pakotus, taidetaonta (761)
alternative label: Pronssiesineet, taideteollisuus (761)
alternative label: Pronssityöt, taideteollisuus (761)
alternative label: Taidetaonta (761)
alternative label: Taidevalu (761)
alternative label: Takominen, taidetaonta (761)
alternative label: Taonta, taideteonta (761)
alternative label: Taontataide (761)
alternative label: Tinatyöt, taidetaonta (761)
alternative label: Tinatyöt, taideteollisuus (761)
alternative label: Tinaus, taideteollisuus (761)
alternative label: Tulityöt, taidetaonta (761)
alternative label: Valaminen, taidevalu (761)
alternative label: Valu, metallikäsityö, taideteollisuus (761)
alternative label: Valutuotteet, taideteollisuus (761)
alternative label: Brandfarliga arbeten, konstsmide (761) @sv
alternative label: Bronsarbeten, konstindustri (761) @sv
alternative label: Bronsföremål, konstindustri (761) @sv
alternative label: Drivning, metall, konstsmide (761) @sv
alternative label: Formar, metallgjutning, konstindustriell (761) @sv
alternative label: Formgivare, olika branscher (761 ... 768) @sv
alternative label: Formgivning, olika branscher (761 ... 768) @sv
alternative label: Förtenning, konstindustri (761) @sv
alternative label: Gjuteriprodukter, konstindustri (761) @sv
alternative label: Gjutning, metallhantverk, konstindustri (761) @sv
alternative label: Handarbeten, konstsmide (761) @sv
alternative label: Konstgjutning (761) @sv
alternative label: Konstsmide (761) @sv
alternative label: Koppararbeten, konstsmide (761) @sv
alternative label: Kopparföremål, konstindustri (761) @sv
alternative label: Kopparföremål, konstsmide (761) @sv
alternative label: Ljusstakar, konstindustri, metall (761) @sv
alternative label: Metallarbeten, konstsmide (761) @sv
alternative label: Metalldrivning, konstindustri (761) @sv
alternative label: Metallföremål, konstindustri (761) @sv
alternative label: Metallgjutning, konstindustri (761) @sv
alternative label: Metallkonst (761) @sv
alternative label: Metallprodukter, konstindustriprodukter (761) @sv
broader: URN:NBN:fi:au:hklj:760
in scheme: URN:NBN:fi:au:hklj:
notation: 761
related: Esineellinen kulttuuri
related: URN:NBN:fi:au:hklj:473
related: URN:NBN:fi:au:hklj:473.1
related: URN:NBN:fi:au:hklj:475
related: URN:NBN:fi:au:hklj:475.1
related: URN:NBN:fi:au:hklj:476
related: URN:NBN:fi:au:hklj:476.1
related: URN:NBN:fi:au:hklj:476.11
related: URN:NBN:fi:au:hklj:476.12
related: URN:NBN:fi:au:hklj:476.5
related: URN:NBN:fi:au:hklj:476.6
related: URN:NBN:fi:au:hklj:476.7
related: URN:NBN:fi:au:hklj:476.8
related: URN:NBN:fi:au:hklj:631
related: Metallityö
related: Taideteollisuuden teoria, estetiikka ja filosofia
related: Antiikkiesineiden keräily
related: Taideteollisuuden historia
related: Kulta- ja hopeasepäntaide. Korutaide
scope note: Taidetaonta, sen historia, henkilöhistoria ja tuotteet sekä materiaalit, tekniikka ja estetiikka Metallinvalu ja -pakotus taidetaonnan kannalta Tina-, kupari-, rauta-, pronssi, messinki- ja muut metallityöt ja -esineet taidetaonnan ja taideteollisuuden kannalta
scope note: Konstsmide, dess historia, personhistoria och produktion samt material, tekniker och estetik Gjutning och drivning av metall ur konstmidets synvinkel Metallarbeten och metallföremål i tenn, koppar, järn, brons, mässing o.dyl. ur konstmidets och konstindustrins synvinkel @sv

Nahkatyöt. Turkistyöt
type: Class
type: Concept
subclass of: Muut taideteollisuuden alat
alternative label: Jalkineet, suutarin työ (766.3)
alternative label: Jalkinemestarit, jalkinemestarin työ (766.3)
alternative label: Kalannahka, käsityöt (766.3)
alternative label: Kengät, suutarin työ (766.3)
alternative label: Käsilaukut, nahkatyöt (766.3)
alternative label: Käsityöt, nahkatyöt (766.3)
alternative label: Käsityöt, turkistyöt (766.3)
alternative label: Käyttöesineet, nahkatyöt (766.3)
alternative label: Laukut, nahkatyöt (766.3)
alternative label: Leikkaus, tekstiilit, turkistyö (766.3)
alternative label: Nahka, käsityöt (766.3)
alternative label: Nahkatyöt (766.3)
alternative label: Nahkurit (766.3)
alternative label: Nutria, turkistyö (766.3)
alternative label: Päähineet, turkishatun teko (766.3)
alternative label: Satulasepät, satulasepän työ (766.3)
alternative label: Satulat, valmistus (766.3)
alternative label: Suutarit (766.3)
alternative label: Taljat, turkistyö (766.3)
alternative label: Tekonahka, nahkatyöt (766.3)
alternative label: Tekoturkikset, turkistyöt (766.3)
alternative label: Turkikset (766.3)
alternative label: Turkistyöt (766.3)
alternative label: Turkit, käsin tehdyt (766.3)
alternative label: Turkki, eläimet, turkistyöt (766.3)
alternative label: Turkkurit, turkkurin työ (766.3)
alternative label: Vaatetustyö, turkistyö (766.3)
alternative label: Vaatteet, turkistyö (766.3)
alternative label: Vuodat, käsityöt (766.3)
alternative label: Vuodat, laukut, nahkatyöt (766.3)
alternative label: Vuodat, nahkatyöt (766.3)
alternative label: Vuodat, turkkurin työ (766.3)
alternative label: Vyöt, nahkatyöt (766.3)
alternative label: Beklädnadsarbete, körsnärsarbete (766.3) @sv
alternative label: Bruksvaror, läderarbeten (766.3) @sv
alternative label: Bälten, läderarbeten (766.3) @sv
alternative label: Fiskskinn, handarbeten (766.3) @sv
alternative label: Fällar, körsnärsarbete (766.3) @sv
alternative label: Garvare (766.3) @sv
alternative label: Handarbeten, läderarbeten (766.3) @sv
alternative label: Handarbeten, pälsarbeten (766.3) @sv
alternative label: Handväskor, läderarbeten (766.3) @sv
alternative label: Hudar, handarbeten (766.3) @sv
alternative label: Hudar, körsnärens arbete (766.3) @sv
alternative label: Hudar, läderarbeten (766.3) @sv
alternative label: Hudar, väskor, läderarbeten (766.3) @sv
alternative label: Huvudbonader, tillverkning av pälshatt (766.3) @sv
alternative label: Kläder, körsnärsarbete (766.3) @sv
alternative label: Konstläder, läderarbeten (766.3) @sv
alternative label: Körsnärer, körsnärens arbete (766.3) @sv
alternative label: Läder, handarbeten (766.3) @sv
alternative label: Läderarbeten (766.3) @sv
alternative label: Nutria, körsnärsarbete (766.3) @sv
alternative label: Päls, pälsverk (766.3) @sv
broader: Muut taideteollisuuden alat
in scheme: URN:NBN:fi:au:hklj:
notation: 766.3
related: Esineellinen kulttuuri
related: URN:NBN:fi:au:hklj:473
related: URN:NBN:fi:au:hklj:473.1
related: URN:NBN:fi:au:hklj:475
related: URN:NBN:fi:au:hklj:475.1
related: URN:NBN:fi:au:hklj:476
related: URN:NBN:fi:au:hklj:476.1
related: URN:NBN:fi:au:hklj:476.11
related: URN:NBN:fi:au:hklj:476.12
related: URN:NBN:fi:au:hklj:476.5
related: URN:NBN:fi:au:hklj:476.6
related: URN:NBN:fi:au:hklj:476.7
related: URN:NBN:fi:au:hklj:476.8
related: Nahka- ja jalkineteollisuus
related: Turkiseläimet
related: URN:NBN:fi:au:hklj:764
related: Ompelu
related: Muodin historia
scope note: Nahka-, tekonahka- ja turkistyöohjeet ja mallit Nahkojen ja turkisten käsittely Nahka- ja turkistöiden historia, materiaalit, tekniikka ja estetiikka Suutarin, satulasepän, nahkurin ja turkkurin työ Jalkineiden ja kenkien sekä nahka- ja turkisesineiden valmistus käsityönä Turkisasujen ja -hattujen valmistus käsityönä
scope note: Beskrivningar, mallar och mönster för läder- och pälsvaruarbeten samt för arbete med konstläder Beredning av skinn och päls Läder- och pälsvaruarbetets historia, material, tekniker och estetik Skomakarens, sadelmakarens, garvarens och körsnärens arbete Tillverkning av skor samt läder- och pälsföremål ur hantverkssynvinkel Tillverkning av pälsplagg och pälsmössor ur hantverkssynvinkel @sv

Oopperoiden soitinosat
type: Class
type: Concept
subclass of: Oopperat
alternative label: Airit, ooppera (783.611)
alternative label: Alkusoitot, oopperat (783.611)
alternative label: Intermezzot, oopperamusiikki (783.611)
alternative label: Ooppera, soitinosat (783.611)
alternative label: Oopperat, soitinosat (783.611)
alternative label: Välisoitot, oopperamusiikki (783.611)
alternative label: Airer, opera (783.611) @sv
alternative label: Intermezzon, operamusik (783.611) @sv
alternative label: Mellanspel, operamusik (783.611) @sv
alternative label: Opera, instrumentalpartier (783.611) @sv
alternative label: Operor, instrumentalpartier (783.611) @sv
alternative label: Ouvertyrer, opera (783.611) @sv
broader: Oopperat
in scheme: URN:NBN:fi:au:hklj:
notation: 783.611
preferred label: Intsrumental parts from operas @en
preferred label: Instrumentalpartier ur operor @sv
related: URN:NBN:fi:au:hklj:1.3
related: URN:NBN:fi:au:hklj:1.83
related: URN:NBN:fi:au:hklj:1.943
related: URN:NBN:fi:au:hklj:2.3
related: URN:NBN:fi:au:hklj:2.83
related: URN:NBN:fi:au:hklj:2.93
related: URN:NBN:fi:au:hklj:3.3
related: URN:NBN:fi:au:hklj:4.3
related: URN:NBN:fi:au:hklj:5.3
related: URN:NBN:fi:au:hklj:6.3
related: URN:NBN:fi:au:hklj:7.3
related: URN:NBN:fi:au:hklj:770
related: Teatterimuodot
related: URN:NBN:fi:au:hklj:783.5
related: URN:NBN:fi:au:hklj:784
related: URN:NBN:fi:au:hklj:784.111
related: URN:NBN:fi:au:hklj:788
related: URN:NBN:fi:au:hklj:789
related: URN:NBN:fi:au:hklj:8.3

Melodraamat
type: Class
type: Concept
subclass of: URN:NBN:fi:au:hklj:783.6
alternative label: Melodraamat, musiikki (783.66)
alternative label: Puhe-esitykset, säestykselliset (783.66)
alternative label: Säestykselliset luenta- ja lausuntaesitykset (783.66)
alternative label: Framföranden, till ackompanjemang (783.66) @sv
alternative label: Läsnings- och deklamationsföreställningar till ackompanjemang (783.66) @sv
alternative label: Melodramer, musik (783.66) @sv
broader: URN:NBN:fi:au:hklj:783.6
in scheme: URN:NBN:fi:au:hklj:
notation: 783.66
preferred label: Melodramas @en
preferred label: Melodramer @sv
related: URN:NBN:fi:au:hklj:1.3
related: URN:NBN:fi:au:hklj:1.83
related: URN:NBN:fi:au:hklj:1.943
related: URN:NBN:fi:au:hklj:2.3
related: URN:NBN:fi:au:hklj:2.83
related: URN:NBN:fi:au:hklj:2.93
related: URN:NBN:fi:au:hklj:3.3
related: URN:NBN:fi:au:hklj:4.3
related: URN:NBN:fi:au:hklj:5.3
related: URN:NBN:fi:au:hklj:6.3
related: URN:NBN:fi:au:hklj:7.3
related: URN:NBN:fi:au:hklj:770
related: Teatterimuodot
related: URN:NBN:fi:au:hklj:783.5
related: URN:NBN:fi:au:hklj:784
related: URN:NBN:fi:au:hklj:784.111
related: URN:NBN:fi:au:hklj:788
related: URN:NBN:fi:au:hklj:789
related: URN:NBN:fi:au:hklj:8.3
scope note: Säestykselliset luentakappaleet
scope note: Recitationer med ackompanjemang @sv

Etelä-Afrikka
type: Class
type: Concept
subclass of: Afrikka
alternative label: Mbira, etnomusiikki (784.35)
alternative label: Sormipiano, etnomusiikki (784.35)
alternative label: Fingerpiano, etnomusik (784.35) @sv
alternative label: Mbira, etnomusik (784.35) @sv
broader: Afrikka
in scheme: URN:NBN:fi:au:hklj:
notation: 784.35
preferred label: South Africa @en
preferred label: Sydafrika @sv
related: Kirkolliset juhlat ja juhlapäivät
related: URN:NBN:fi:au:hklj:473.1
related: URN:NBN:fi:au:hklj:769
related: URN:NBN:fi:au:hklj:783
related: URN:NBN:fi:au:hklj:783.1
related: URN:NBN:fi:au:hklj:784.9
related: URN:NBN:fi:au:hklj:787
related: URN:NBN:fi:au:hklj:787.2
related: Islamilaisten uskonnollinen musiikki
related: URN:NBN:fi:au:hklj:787.29
related: URN:NBN:fi:au:hklj:788.8
related: URN:NBN:fi:au:hklj:789
related: URN:NBN:fi:au:hklj:795.1
related: URN:NBN:fi:au:hklj:797.2
related: URN:NBN:fi:au:hklj:807
scope note: Botswana. Etelä-Afrikan tasavalta. Lesotho. Malawi. Mosambik. Namibia. Sambia. Swazimaa. Zimbabwe
scope note: Botswana. Lesotho. Malawi. Moçambique. Namibia. Swaziland. Sydafrikanska republiken. Zambia. Zimbabwe @sv

Afrikan saaret
type: Class
type: Concept
subclass of: Afrikka
broader: Afrikka
in scheme: URN:NBN:fi:au:hklj:
notation: 784.39
preferred label: Islands around Africa @en
preferred label: Öarna kring Afrika @sv
related: Kirkolliset juhlat ja juhlapäivät
related: URN:NBN:fi:au:hklj:473.1
related: URN:NBN:fi:au:hklj:769
related: URN:NBN:fi:au:hklj:783
related: URN:NBN:fi:au:hklj:783.1
related: Espanja
related: Portugali
related: URN:NBN:fi:au:hklj:784.9
related: URN:NBN:fi:au:hklj:787
related: URN:NBN:fi:au:hklj:787.2
related: Islamilaisten uskonnollinen musiikki
related: URN:NBN:fi:au:hklj:787.29
related: URN:NBN:fi:au:hklj:788.8
related: URN:NBN:fi:au:hklj:789
related: URN:NBN:fi:au:hklj:795.1
related: URN:NBN:fi:au:hklj:797.2
related: URN:NBN:fi:au:hklj:807
scope note: Aldabrasaaret. Amirantit. Ascension. Azorit. Kanarian saaret. Kap Verde. Komorit. Madagaskar. Madeira. Mauritius. Mayotte. Réunion. Saint Helena. Sao Tomé ja Principe. Seychellit. Tristan da Cunha
scope note: Aldabrasöarna. Amiranterna. Ascension. Azorerna. Comorerna. Kanarieöarna. Kap Verde. Madagaskar. Madeira. Mauritius. Mayotte. Réunion. Saint Helena. São Tomé och Príncipe. Seychellerna. Tristan da Cunha @sv

Australia. Oseania
type: Class
type: Concept
subclass of: URN:NBN:fi:au:hklj:784
alternative label: Oseania, kansanmusiikki (784.7 +)
alternative label: Oceanien, folkmusik (784.7 +) @sv
broader: URN:NBN:fi:au:hklj:784
in scheme: URN:NBN:fi:au:hklj:
narrower: Australia. Uusi-Seelanti. Uusi-Guinea
narrower: Tyynen meren saaret
notation: 784.7
preferred label: Australia. Oceania @en
preferred label: Australien. Oceanien @sv
related: URN:NBN:fi:au:hklj:473.1
related: URN:NBN:fi:au:hklj:769
related: URN:NBN:fi:au:hklj:783
related: URN:NBN:fi:au:hklj:783.1
related: URN:NBN:fi:au:hklj:784.9
related: URN:NBN:fi:au:hklj:787
related: URN:NBN:fi:au:hklj:787.2
related: URN:NBN:fi:au:hklj:787.29
related: URN:NBN:fi:au:hklj:788.8
related: URN:NBN:fi:au:hklj:789
related: URN:NBN:fi:au:hklj:795.1
related: URN:NBN:fi:au:hklj:797.2
related: URN:NBN:fi:au:hklj:807
scope note: Yleisteokset ja sekasisältöiset kokoelmat Tässä ja alaluokissa myös Australian ja Oseanian alueen alkuperäiskansojen musiikki
scope note: Allmänna verk och samlingar med blandat innehåll Hit till underklasserna också de australiska och oceaniska ursprungsfolkens musik @sv

Kamariyhtyeet (2-9 soittajaa)
type: Class
type: Concept
subclass of: URN:NBN:fi:au:hklj:785
alternative label: Kamariyhtyeet (785.1 +)
alternative label: Soitinyhtyeet, kamarimusiikki (785.1 +)
alternative label: Sonaatit, kamarimusiikki (785.1 +)
alternative label: Sonatiinit, kamarimusiikki (785.1 +)
alternative label: Yhtyeet, kamariyhtyeet (785.1 +)
alternative label: Yhtyemusiikki, kamarimusiikki (785.1 +)
alternative label: Ensemblemusik, kammarmusik (785.1 +) @sv
alternative label: Ensembler, kammarensembler (785.1 +) @sv
alternative label: Instrumentalensembler, kammarmusik (785.1 +) @sv
alternative label: Kammarensembler (785.1 +) @sv
alternative label: Sonater, kammarmusik (785.1 +) @sv
alternative label: Sonatiner, kammarmusik (785.1 +) @sv
broader: URN:NBN:fi:au:hklj:785
in scheme: URN:NBN:fi:au:hklj:
narrower: URN:NBN:fi:au:hklj:785.11
narrower: Triot
narrower: Kvartetit
narrower: Kvintetit
narrower: Sekstetit
narrower: Septetit
narrower: Oktetit
narrower: Nonetit
narrower: Kokoonpanoltaan poikkeukselliset yhtyeet
notation: 785.1
preferred label: Chamber ensembles @en
preferred label: Kammarensembler (2-9 medlemmar) @sv
related: URN:NBN:fi:au:hklj:789
scope note: Kamariyhtyemusiikin yleisteokset sekä sekasisältöiset kokoelmat Tässä ja alaluokissa myös yhtyesoiton oppaat
scope note: Allmänna verk och samlingar med blandat innehåll som rör kammarensemblernas musik Hit och till underklasserna också skolor i att spela i ensembler @sv

Muunkielinen viihdemusiikki
type: Class
type: Concept
subclass of: Viihdemusiikki
broader: Viihdemusiikki
in scheme: URN:NBN:fi:au:hklj:
narrower: Kreikankielinen viihdemusiikki
narrower: Portugalinkielinen viihdemusiikki
narrower: Vironkielinen viihdemusiikki
notation: 788.49
preferred label: Light music in other languages @en
preferred label: Underhållningsmusik på andra språk @sv
related: Tanssitaide
related: URN:NBN:fi:au:hklj:782.4
related: URN:NBN:fi:au:hklj:783
related: URN:NBN:fi:au:hklj:783.1
related: URN:NBN:fi:au:hklj:785.7
related: URN:NBN:fi:au:hklj:786.8
related: URN:NBN:fi:au:hklj:787.112
related: Eurooppalainen maailmanmusiikki. Europpalainen etninen pop ja viihdemusikki
related: URN:NBN:fi:au:hklj:789
related: URN:NBN:fi:au:hklj:795

Afrikka
type: Class
type: Concept
subclass of: URN:NBN:fi:au:hklj:789
alternative label: Afrikka, musiikinhistoria (789.4 +)
alternative label: Afrika, musikhistoria (789.4 +) @sv
broader: URN:NBN:fi:au:hklj:789
in scheme: URN:NBN:fi:au:hklj:
narrower: Pohjois-Afrikka
narrower: Länsi-Afrikka
narrower: Keski-Afrikka
narrower: Itä-Afrikka
narrower: Etelä-Afrikka
narrower: Afrikan saaret
notation: 789.4
preferred label: Africa @en
preferred label: Afrika @sv
related: URN:NBN:fi:au:hklj:709
related: URN:NBN:fi:au:hklj:782.4
related: URN:NBN:fi:au:hklj:783
related: URN:NBN:fi:au:hklj:789.1
scope note: Afrikan musiikin historian yleisteokset
scope note: Allmänna verk som rör den afrikanska musikens historia @sv

MUUT KIELET
type: Class
type: Concept
subclass of: URN:NBN:fi:au:hklj:800
alternative label: Filologia (850 ... 899 +)
alternative label: Filologi (850 ... 899 +) @sv
broader: URN:NBN:fi:au:hklj:800
in scheme: URN:NBN:fi:au:hklj:
narrower: Seemiläiset kielet. Haamilaiset kielet
narrower: Japanin kieli
narrower: Tiibetiläis-burmalaiset kielet
narrower: Afrikan kielet
narrower: Muut ei-indoeurooppalaiset kielet
notation: 890
preferred label: OTHER LANGUAGES @en
preferred label: ANDRA SPRÅK @sv
related: Kirjoituksen historia. Paleografia. Epigrafia
related: KIELITIEDE
related: Kielifilosofia
related: Kielipsykologia. Kielisosiologia. Kielipolitiikka
related: Monikieliset sanakirjat. Sivistyssanakirjat
related: Kielioppi. Muoto-oppi. Sanaoppi. Semantiikka
related: Äänneoppi
related: Etymologia. Onomastiikka
scope note: Yleisteokset muista kielistä
scope note: Allmänna verk om andra språk @sv

Keskiajan historia 400-1499
type: Class
type: Concept
subclass of: URN:NBN:fi:au:hklj:909
alternative label: Arabia, keskiajan historia (909.2)
alternative label: Bysantti, historia (909.2)
alternative label: Germaanit, kansainvaellukset (909.2)
alternative label: Hengelliset ritarikunnat, historia (909.2)
alternative label: Kansainvaellukset (909.2)
alternative label: Keskiaika, arkeologia (909.2)
alternative label: Keskiaika, historia (909.2)
alternative label: Maailmanhistoria, keskiaika (909.2)
alternative label: Myöhäiskeskiaika, historia (909.2)
alternative label: Permakulttuuri, historia (909.2)
alternative label: Ristiretket, maailmanhistoria (909.2)
alternative label: Ristiretkiaika, maailmanhistoria (909.2)
alternative label: Ristiritarit, historia (909.2)
alternative label: Ritarikunnat, maailmanhistoria (909.2)
alternative label: Ritarilaitos, maailmanhistoria (909.2)
alternative label: Temppeliherrat, hengelliset ritarikunnat (909.2)
alternative label: Vaellus, kansainvaellukset (909.2)
alternative label: Varhaiskeskiaika, historia (909.2)
alternative label: Andliga riddarordnar, historia (909.2) @sv
alternative label: Arabien, medeltidens historia (909.2) @sv
alternative label: Bysans, historia (909.2) @sv
alternative label: Folkvandringarna (909.2) @sv
alternative label: Germaner, folkvandringar (909.2) @sv
alternative label: Korsriddare, historia (909.2) @sv
alternative label: Korståg, världshistoria (909.2) @sv
alternative label: Korstågstiden, världshistoria (909.2) @sv
alternative label: Medeltiden, arkeologi (909.2) @sv
alternative label: Medeltiden, historia (909.2) @sv
alternative label: Permakultur, historia (909.2) @sv
alternative label: Riddarordnar, världshistoria (909.2) @sv
alternative label: Riddarväsen, världshistoria (909.2) @sv
alternative label: Senmedeltiden, historia (909.2) @sv
alternative label: Tempelriddare, andliga riddarordnar (909.2) @sv
alternative label: Tidig medeltid, historia (909.2) @sv
alternative label: Vandring, folkvandringar (909.2) @sv
alternative label: Världshistoria, medeltiden (909.2) @sv
broader: URN:NBN:fi:au:hklj:909
in scheme: URN:NBN:fi:au:hklj:
notation: 909.2
preferred label: History of the middle-ages 400-1499 @en
preferred label: Medeltidens historia 400-1499 @sv
related: URN:NBN:fi:au:hklj:300
related: Yhteiskuntatieteiden historia
related: URN:NBN:fi:au:hklj:320
related: URN:NBN:fi:au:hklj:325
related: URN:NBN:fi:au:hklj:370
related: URN:NBN:fi:au:hklj:371
related: URN:NBN:fi:au:hklj:390
related: Sotien yhteiskunnalliset vaikutukset
related: Muiden maiden puolustusvoimat
related: Sotahistoria
related: EUROOPPA
related: Keski-Eurooppa
related: Historialliset kartat. Historiallinen maantiede
related: Yleinen arkeologia
related: URN:NBN:fi:au:hklj:919
related: Keskiajan kulttuurihistoria 400-1499
related: URN:NBN:fi:au:hklj:970
related: Muiden Keski-Euroopan maiden historia
related: URN:NBN:fi:au:hklj:979
scope note: Keskiajan historian ja arkeologian yleisteokset Euroopan keskiajan historian ja arkeologian yleisteokset Bysantin ja arabien maailmanvallan historia ja arkeologia Tietyn maan tai alueen keskiajan historia ja arkeologia ko. maanosan, maan tai alueen historian luokassa
scope note: Allmänna verk om medeltidens historia och arkeologi Allmänna verk om den europeiska medeltidens historia och arkeologi Det bysantinska och arabiska världsväldets historia och arkeologi Verk om medeltidens historia eller arkeologi i ett bestämt land eller geografiskt område förs till klassen för världsdelens, landets eller det geografiska områdets historia @sv

Uuden ajan historia 1500-1788
type: Class
type: Concept
subclass of: URN:NBN:fi:au:hklj:909
alternative label: Hyödyn aikakausi, historia (909.3)
alternative label: Kolmikymmenvuotinen sota, historia (909.3)
alternative label: Maailmanhistoria, 1500-1788 (909.3)
alternative label: Myöhäisrenessanssi, historia (909.3)
alternative label: Pommerin sota (909.3)
alternative label: Reformaation aika, kulttuurihistoria (909.3)
alternative label: Renessanssi, historia (909.3)
alternative label: Seitsemänvuotinen sota (909.3)
alternative label: Seitsenvuotinen sota (909.3)
alternative label: Suuri siirtomaasota (909.3)
alternative label: Täysrenessanssi, historia (909.3)
alternative label: Uskonpuhdistusaika, kulttuurihistoria (909.3)
alternative label: Uskonsodat, uskonpuhdistusaika (909.3)
alternative label: Uuden ajan alku, historia (909.3)
alternative label: Uusi aika, historia (909.3)
alternative label: Valistuksen aika, historia (909.3 ... 909.4)
alternative label: Varhaisrenessanssi, historia (909.3)
alternative label: Vastauskonpuhdistuksen aika, historia (909.3)
alternative label: Högrenässansen, historia (909.3) @sv
alternative label: Motreformationens tid, historia (909.3) @sv
alternative label: Nya tiden, historia (909.3) @sv
alternative label: Nyttans tidevarv, historia (909.3) @sv
alternative label: Pommerska kriget (909.3) @sv
alternative label: Reformationstiden, kulturhistoria (909.3) @sv
alternative label: Religionskrig, reformationstiden (909.3) @sv
alternative label: Renässans, historia (909.3) @sv
alternative label: Senrenässansen, historia (909.3) @sv
alternative label: Sjuårskriget (909.3) @sv
alternative label: Tidigmodern tid, historia (909.3) @sv
alternative label: Trettioåriga kriget, historia (909.3) @sv
alternative label: Ungrenässansen, historia (909.3) @sv
alternative label: Upplysningstiden, historia (909.3 ... 909.4) @sv
alternative label: Världshistoria, 1500-1788 (909.3) @sv
broader: URN:NBN:fi:au:hklj:909
in scheme: URN:NBN:fi:au:hklj:
notation: 909.3
preferred label: History of the early modern period 1500-1788 @en
preferred label: Nya tidens historia 1500-1788 @sv
related: URN:NBN:fi:au:hklj:300
related: Yhteiskuntatieteiden historia
related: URN:NBN:fi:au:hklj:320
related: URN:NBN:fi:au:hklj:325
related: URN:NBN:fi:au:hklj:370
related: URN:NBN:fi:au:hklj:371
related: URN:NBN:fi:au:hklj:390
related: Sotien yhteiskunnalliset vaikutukset
related: Muiden maiden puolustusvoimat
related: Sotahistoria
related: EUROOPPA
related: Keski-Eurooppa
related: Historialliset kartat. Historiallinen maantiede
related: Yleinen arkeologia
related: URN:NBN:fi:au:hklj:919
related: Uuden ajan kulttuurihistoria 1500-1788
related: URN:NBN:fi:au:hklj:970
related: Muiden Keski-Euroopan maiden historia
related: URN:NBN:fi:au:hklj:979
scope note: Uuden ajan historian ja arkeologian yleisteokset Euroopan uuden ajan historian ja arkeologian yleisteokset Renessanssiajan historian ja arkeologian yleisteokset Tietyn maan tai alueen uuden ajan historia ja arkeologia ko. maanosan, maan tai alueen historian luokassa
scope note: Allmänna verk om nya tidens historia och arkeologi Allmänna verk om europeisk historia och arkeologi under nya tiden Allmänna verk om renässansens historia och arkeologi Verk om nya tidens historia eller arkeologi i ett bestämt land eller geografiskt område förs till klassen för världsdelens, landets eller det geografiska områdets historia @sv

Vuoden 1918 sota
type: Class
type: Concept
subclass of: Itsenäisyyden aika 1917-1938
alternative label: Kansalaissota, Suomen historia (927.1)
alternative label: Kansalaissota, sotamuistelmat (927.1)
alternative label: Luokkasota, Suomen historia (927.1)
alternative label: Punakaartit, vuoden 1918 sota (927.1)
alternative label: Punakapina, vuoden 1918 sota (927.1)
alternative label: Raudun taistelu, suomen vuoden 1918 sota (927.1)
alternative label: Rintama, Suomen historia 1918 (927.1)
alternative label: Sisällissodat, Suomi (927.1)
alternative label: Sotamuistelmat, Suomi 1918 (927.1)
alternative label: Sotarintama, Suomen historia 1918 (927.1)
alternative label: Sotatoimet, Suomen historia 1918 (927.1)
alternative label: Sotilaat, sotamuistelmat, Suomi, vuoden 1918 sota (927.1)
alternative label: Suomen historia, sota 1918 (927.1)
alternative label: Suomen sisällisota (927.1)
alternative label: Valkokaartit, vuoden 1918 sota (927.1)
alternative label: Vapaussota, Suomen historia (927.1)
alternative label: Veljessota, historia, vuoden 1918 sota, Suomi (927.1)
alternative label: Broderkrig, historia, kriget år 1918, Finland (927.1) @sv
alternative label: Finlands historia, krig 1918 (927.1) @sv
alternative label: Finska inbördeskriget (927.1) @sv
alternative label: Frihetskriget, Finlands historia (927.1) @sv
alternative label: Fronten, Finlands historia 1918 (927.1) @sv
alternative label: Inbördeskrig , Finland (927.1) @sv
alternative label: Inbördeskriget, Finlands historia (927.1) @sv
alternative label: Inbördeskriget, krigsminnen (927.1) @sv
alternative label: Klasskrig, Finlands historia (927.1) @sv
alternative label: Krigsfronten, Finlands historia 1918 (927.1) @sv
alternative label: Krigshandlingar, Finlands historia 1918 (927.1) @sv
alternative label: Krigsmemoarer, Finland 1918 (927.1) @sv
alternative label: Röda garden, kriget år 1918 (927.1) @sv
alternative label: Röda upproret, kriget år 1918 (927.1) @sv
alternative label: Slaget vid Rautus, kriget 1918 i Finland (927.1) @sv
alternative label: Soldater, krigsmemoarer, Finland, kriget år 1918 (927.1) @sv
alternative label: Vita garden, kriget år 1918 (927.1) @sv
broader: Itsenäisyyden aika 1917-1938
in scheme: URN:NBN:fi:au:hklj:
notation: 927.1
preferred label: The 1918 War @en
preferred label: Kriget 1918 @sv
related: URN:NBN:fi:au:hklj:061
related: URN:NBN:fi:au:hklj:1.4
related: Suomi
related: Suomen ulkopolitiikka
related: URN:NBN:fi:au:hklj:390
related: Sotien yhteiskunnalliset vaikutukset
related: Suomen puolustusvoimat
related: URN:NBN:fi:au:hklj:411
related: Suomenruotsalaisten asuma-alueet
related: Suomen yleinen taidehistoria
related: URN:NBN:fi:au:hklj:909
related: I maailmansodan historia 1914-1918
related: URN:NBN:fi:au:hklj:919
related: URN:NBN:fi:au:hklj:930
related: Neuvostoliiton historia 1945-1991
related: Yhteiskuntaelämän, joukkotiedotuksen, liikenteen ja maanpuolustuksen edustajat

Sodat 1939-1945
type: Class
type: Concept
subclass of: Itsenäisyyden aika 1939-
alternative label: Ajopuuteoria, jatkosota, Suomen historia (928.1)
alternative label: Aliupseerit, sotamuistelmat, Suomi (928.1)
alternative label: Asemasota, toinen maailmansota, Suomi (928.1)
alternative label: Desantit, Suomen sodat 1939-1944 (928.1)
alternative label: Hävittäjälentäjät, historia, Suomi 1939-1944 (928.1)
alternative label: Ilmapuolustus, Suomen historia (928.1)
alternative label: Ilmasota, Suomen historia (928.1)
alternative label: Ilmatorjunta, Suomen historia (928.1)
alternative label: Jatkosota, Suomen historia (928.1)
alternative label: Jatkosota, sotamuistelmat (928.1)
alternative label: Kaukopartiot, Suomen sodat 1939-1944 (928.1)
alternative label: Lapin sota (928.1)
alternative label: Lotat, sotamuistelmat (928.1)
alternative label: Pikkulotat, sotamuistelmat (928.1)
alternative label: Rintama, Suomen historia 1939-1944 (928.1)
alternative label: Sotahistoria, II maailmansota, Suomi (928.1)
alternative label: Sotamuistelmat, Suomi 1939-1944 (928.1)
alternative label: Sotarintama, Suomen historia 1939-1944 (928.1)
alternative label: Sotatoimet, Suomen historia 1939-1944 (928.1)
alternative label: Sotavangit, Suomen historia 1939-1944 (928.1)
alternative label: Sotilaat, sotamuistelmat, Suomi, talvi- ja jatkosota (928.1)
alternative label: Sotilasilmailu, sotamuistelmat, Suomi, talvi- ja jatkosota (928.1)
alternative label: Sotilaslentäjät, historia, Suomi 1939-1944 (928.1)
alternative label: Suomen historia, sodat 1939-1944 (928.1)
alternative label: Talvisota, Suomen historia (928.1)
alternative label: Talvisota, sotamuistelmat (928.1)
alternative label: Teikarsaaren taistelut, jatkosota, Suomen historia (928.1)
alternative label: Veteraanit, sotamuistelmat, Suomi (928.1)
alternative label: Desanter, Finlands krig 1939-1944 (928.1) @sv
alternative label: Drivvedsteori, fortsättningskriget, Finlands historia (928.1) @sv
alternative label: Finlands historia, krigen 1939-1944 (928.1) @sv
alternative label: Fjärrpatruller, Finlands krig 1939-1944 (928.1) @sv
alternative label: Fortsättningskriget, Finlands historia (928.1) @sv
alternative label: Fortsättningskriget, krigsminnen (928.1) @sv
alternative label: Fronten, Finlands historia 1939-1944 (928.1) @sv
alternative label: Jaktflygare, historia, Finland 1939-1944 (928.1) @sv
alternative label: Krigsfronten, Finlands historia 1939-1944 (928.1) @sv
alternative label: Krigsfångar, Finlands historia 1939-1944 (928.1) @sv
alternative label: Krigshandlingar, Finlands historia 1939-1944 (928.1) @sv
alternative label: Krigshistoria, II världskriget, Finland (928.1) @sv
alternative label: Krigsmemoarer, Finland 1939-1944 (928.1) @sv
alternative label: Lapplandskriget (928.1) @sv
alternative label: Lottor, krigsminnen (928.1) @sv
alternative label: Luftförsvar, Finlands historia (928.1) @sv
alternative label: Luftkrig, Finlands historia (928.1) @sv
alternative label: Luftvärn, Finlands historia (928.1) @sv
alternative label: Militärflyg, krigsmemoarer, Finland, vinter- och fortsättningskriget (928.1) @sv
alternative label: Militärflygare, historia, Finland 1939-1944 (928.1) @sv
alternative label: Smålottor, krigsminnen (928.1) @sv
alternative label: Soldater, krigsmemoarer, Finland, vinter- och fortsättningskriget (928.1) @sv
alternative label: Ställningskrig, andra världskriget, Finland (928.1) @sv
alternative label: Teikarsaaren taistelut, fortsättningskriget, Finlands historia (928.1) @sv
alternative label: Underofficerare, krigsminnen, Finland (928.1) @sv
alternative label: Veteraner, krigsminnen, Finland (928.1) @sv
alternative label: Vinterkriget, Finlands historia (928.1) @sv
alternative label: Vinterkriget, krigsminnen (928.1) @sv
broader: Itsenäisyyden aika 1939-
in scheme: URN:NBN:fi:au:hklj:
notation: 928.1
related: URN:NBN:fi:au:hklj:061
related: URN:NBN:fi:au:hklj:1.4
related: Suomi
related: Suomen ulkopolitiikka
related: URN:NBN:fi:au:hklj:390
related: Sotien yhteiskunnalliset vaikutukset
related: Suomen puolustusvoimat
related: URN:NBN:fi:au:hklj:411
related: Suomenruotsalaisten asuma-alueet
related: Suomen yleinen taidehistoria
related: URN:NBN:fi:au:hklj:909
related: II maailmansodan historia 1939-1945
related: URN:NBN:fi:au:hklj:919
related: URN:NBN:fi:au:hklj:930
related: Neuvostoliiton historia 1945-1991
related: Yhteiskuntaelämän, joukkotiedotuksen, liikenteen ja maanpuolustuksen edustajat

Muiden Keski-Euroopan maiden historia
type: Class
type: Concept
subclass of: URN:NBN:fi:au:hklj:970
alternative label: Liechtenstein, historia (978)
broader: URN:NBN:fi:au:hklj:970
in scheme: URN:NBN:fi:au:hklj:
narrower: Tsekin ja slovakian historia
narrower: Romanian historia
notation: 978
preferred label: History of other Central European countries @en
preferred label: Andra centraleuropeiska länders historia @sv
related: Sveitsi
related: Ranska
related: Pariisi
related: URN:NBN:fi:au:hklj:909
related: Vanhan ajan historia
related: Keskiajan historia 400-1499
related: Uuden ajan historia 1500-1788
related: Uusimman ajan historia 1789-1913
related: Nykyajan historia 1914-1938
related: I maailmansodan historia 1914-1918
related: Nykyajan historia 1939-
related: II maailmansodan historia 1939-1945
related: URN:NBN:fi:au:hklj:919
related: RANSKAN HISTORIA
scope note: Tässä Liechtensteinin ja Monacon historia
scope note: Hit Liechtensteins och Monacos historia @sv

Yhteiskuntaelämän, joukkotiedotuksen, liikenteen ja maanpuolustuksen edustajat
type: Class
type: Concept
subclass of: HENKILÖ- JA SUKUHISTORIA
alternative label: Agentit, muistelmat, vakoilu (993 +)
alternative label: Agitaattorit, poliitikkojen elämäkerrat ja muistelmat (993 +)
alternative label: Aliupseerit, elämäkerrat ja muistelmat (993 +)
alternative label: Ammattiautoilijat, elämäkerrat ja muistelmat (993 +)
alternative label: Anarkistit, elämäkerrat ja muistelmat (993 +)
alternative label: Asianajajat, elämäkerrat ja muistelmat (993 +)
alternative label: Autoilijat, henkilöhistoria (993 +)
alternative label: Autonkuljettajat, elämäkerrat ja muistelmat (993 +)
alternative label: Biografiat, muiden alojen edustajat (991 ... 997 +)
alternative label: CIA, henkilöhistoria, agentit (993 +)
alternative label: Dekkarit, yksityisetsivät, elämäkerrat ja muistelmat (993 +)
alternative label: Diktaattorit, elämäkerrat ja muistelmat (993 +)
alternative label: Diplomaatit, elämäkerrat ja muistelmat (993 +)
alternative label: EU-parlamentaarikot, elämäkerrat ja muistelmat (993 +)
alternative label: Edelläkävijät, muiden alojen edustajat (991 ... 997 +)
alternative label: Elinkeinoasiamiehet, elämäkerrat ja muistelmat (993 +)
alternative label: Elämäkerrat, muiden alojen edustajat (991 ... 997 +)
alternative label: Elämänhistoria, henkilöhistoria, muiden alojen edustajat (991 ... 997 +)
alternative label: Erityislastentarhanopettajat, elämäkerrat ja muistelmat (993 +)
alternative label: Etsivät, elämäkerrat ja muistelmat (993 +)
alternative label: Europarlamentaarikot, elämäkerrat ja muistelmat (993 +)
alternative label: Fasistit, elämäkerrat ja muistelmat (993 +)
alternative label: Haastattelut, henkilöhistoria, muut alat (991 ... 997 +)
alternative label: Hallinnon edustajat, elämäkerrat ja muistelmat (993 +)
alternative label: Hallitukset, ministerien henkilöhistoria (993 +)
alternative label: Henkilöhistoria, muiden alojen edustajat (991 ... 997 +)
alternative label: Henkilökohtaiset avustajat, elämäkerrat ja muistelmat (993 +)
alternative label: Henkilökuvat, muiden alojen edustajat (991 ... 997 +)
alternative label: Henkilöt, muiden alojen edustajat (991 ... 997 +)
alternative label: Henkivartijat, elämäkerrat ja muistelmat (993 +)
alternative label: Historia, henkilöhistoria, muut alat (991 ... 997 +)
alternative label: Isännöitsijät, elämäkerrat ja muistelmat (993 +)
alternative label: Itsevaltiaat, diktaattorit, henkilöhistoria (993 +)
alternative label: Johtajat, poliittiset johtajat (993 +)
alternative label: Journalistit, elämäkerrat ja muistelmat (993 +)
alternative label: Julkiset kaupanvahvistajat, elämäkerrat ja muistelmat (993)
alternative label: Julkisuuden henkilöt, muiden alojen edustajat (991 ... 997 +)
alternative label: Juontajat, elämäkerrat ja muistelmat (993 +)
alternative label: Juristit, elämäkerrat ja muistelmat (993 +)
alternative label: Järjestyksenvalvojat, elämäkerrat ja muistelmat (993 +)
alternative label: Järjestysmiehet, elämäkerrat ja muistelmat (993 +)
alternative label: KGB, henkilöhistoria, agentit (993 +)
alternative label: Kaksoisagentit, muistelmat, vakoilu (993 +)
alternative label: Kansalliset suurmiehet, muiden alojen edustajat (991 ... 997 +)
alternative label: Kansallissosialistit, poliitikkojen henkilöhistoria (993)
alternative label: Kansanedustajan avustajat, elämäkerrat ja muistelmat (993 +)
alternative label: Kansanedustajat, elämäkerrat ja muistelmat (993 +)
alternative label: Kanta-aliupseerit, elämäkerrat ja muistelmat (993 +)
alternative label: Kaupanvahvistajat, elämäkerrat ja muistelmat (993)
alternative label: Kaupunginjohtajat, elämäkerrat ja muistelmat (993 +)
alternative label: Kaupunginvaltuutetut, elämäkerrat ja muistelmat (993 +)
alternative label: Kenraalikuvernöörit, elämäkerrat ja muistelmat (993 +)
alternative label: Kirjeenvaihtajat, elämäkerrat ja muistelmat (993 +)
alternative label: Kirjeet, muiden alojen edustajat (991 ... 997 +)
alternative label: Kodinhoitajat, elämäkerrat ja muistelmat (993 +)
broader: HENKILÖ- JA SUKUHISTORIA
in scheme: URN:NBN:fi:au:hklj:
narrower: Suomi
notation: 993
related: URN:NBN:fi:au:hklj:1.4
related: Pelastusoppi. Kristillinen antropologia
related: URN:NBN:fi:au:hklj:323
related: Poliittiset ja aatteelliset vähemmistöt
related: Sisäpolitiikka. Puolueet
related: URN:NBN:fi:au:hklj:617
related: URN:NBN:fi:au:hklj:618.24
related: URN:NBN:fi:au:hklj:618.3
related: URN:NBN:fi:au:hklj:909
related: URN:NBN:fi:au:hklj:919
related: Vuoden 1918 sota
related: Sodat 1939-1945
related: URN:NBN:fi:au:hklj:993.03
related: Lääketieteen, tuotantoelämän, tekniikan, kaupan ja talous-elämän edustajat
related: Suomi
related: Sukuhistoria. Sukututkimus
scope note: Tässä esim. valtiomiesten, poliitikkojen, ministerien, valtio-, yhteiskunta-, oikeus- ja tilastotieteilijöiden, lakimiesten, hallinnon edustajien, virkamiesten, sosiaalityön edustajien, toimittajien, tiedotusvälineiden ja liikenteen edustajien sekä upseerien henkilöhistoria Sotamuistelmat ja sotaa koskevat henkilöhistorialliset teokset kohdehenkilön edustaman alan tai ammatin mukaan luokissa 990-997+ Hallitsijoiden, kuninkaallisten ja kuningashuoneiden henkilöhistoria ko. maan historian luokassa
scope note: Hit t.ex. personhistoria som rör statsmän, politiker, ministrar, statsvetare, rättsvetare, statistiker, jurister, företrädare för förvaltningen, tjänstemän, företrädare för det sociala arbetet, redaktörer, företrädare för massmedierna och trafiken samt officerare Krigsmemoarer och personhistoriska verk om krig förs enligt det område eller yrke som den biograferade personen representerar till klasserna 990-997+ Personhistoria som rör regenter, kungligheter eller kungahus förs till klassen för landets historia @sv

Humanististen tieteiden edustajat
type: Class
type: Concept
subclass of: HENKILÖ- JA SUKUHISTORIA
alternative label: Arkeologit, elämäkerrat ja muistelmat (997 +)
alternative label: Arvostelijat, elämäkerrat ja muistelmat (997 +)
alternative label: Biografiat, muiden alojen edustajat (991 ... 997 +)
alternative label: Edelläkävijät, muiden alojen edustajat (991 ... 997 +)
alternative label: Elämäkerrat, muiden alojen edustajat (991 ... 997 +)
alternative label: Elämänhistoria, henkilöhistoria, muiden alojen edustajat (991 ... 997 +)
alternative label: Haastattelut, henkilöhistoria, muut alat (991 ... 997 +)
alternative label: Henkilöhistoria, muiden alojen edustajat (991 ... 997 +)
alternative label: Henkilökuvat, muiden alojen edustajat (991 ... 997 +)
alternative label: Henkilöt, muiden alojen edustajat (991 ... 997 +)
alternative label: Historia, henkilöhistoria, muut alat (991 ... 997 +)
alternative label: Historiantutkijat, elämäkerrat ja muistelmat (997 +)
alternative label: Historioitsijat, elämäkerrat ja muistelmat (997 +)
alternative label: Julkisuuden henkilöt, muiden alojen edustajat (991 ... 997 +)
alternative label: Kansalliset suurmiehet, muiden alojen edustajat (991 ... 997 +)
alternative label: Kansanrunoudentutkijat, elämäkerrat ja muistelmat (997 +)
alternative label: Kielenkääntäjät, elämäkerrat ja muistelmat (997 +)
alternative label: Kielitieteilijät, elämäkerrat ja muistelmat (997 +)
alternative label: Kirjallisuudentutkijat, elämäkerrat ja muistelmat (997 +)
alternative label: Kirjeet, muiden alojen edustajat (991 ... 997 +)
alternative label: Kriitikot, elämäkerrat ja muistelmat (997 +)
alternative label: Lapsuus, muiden alojen edustajat (991 ... 997 +)
alternative label: Lingvistit, elämäkerrat ja muistelmat (997 +)
alternative label: Maahanmuuttajat, henkilöhistoria, muuta alat (991 ... 997 +)
alternative label: Maanpako, henkilöhistoria, muut alat (991 ... 997 +)
alternative label: Merkkihenkilöt, muiden alojen edustajat (991 ... 997 +)
alternative label: Muistelmat, muiden alojen edustajat (991 ... 997 +)
alternative label: Muistokirjoitukset, muiden alojen edustajat (991 ... 997 +)
alternative label: Nekrologit, muiden alojen edustajat (991 ... 997 +)
alternative label: Omaelämäkerrat, muiden alojen edustajat (991 ... 997 +)
alternative label: Pakolaiset, henkilöhistoria, muut alat (991 ... 997 +)
alternative label: Professorit, muiden alojen edustajat (991 ... 997 +)
alternative label: Päiväkirjat, muiden alojen edustajat (991 ... 997 +)
alternative label: Rakkauskirjeet, muiden alojen edustajat (991 ... 997 +)
alternative label: Siirtolaiset, henkilöhistoria, muut alat (991 ... 997 +)
alternative label: Suurmiehet, muiden alojen edustajat (991 ... 997 +)
alternative label: Tulkit, elämäkerrat ja muistelmat (997 +)
alternative label: Uranuurtajat, muiden alojen edustajat (991 ... 997 +)
alternative label: Vaihtoehtohistoria, henkilöhistoria, muut alat (991 ... 997 +)
alternative label: Vaihtoehtoinen historia, henkilöhistoria, muut alat (991 ... 997 +)
alternative label: Alternativ historia, personhistoria, övriga områden (991 ... 997 +) @sv
alternative label: Arkeologer, biografier och memoarer (997 +) @sv
alternative label: Barndom, andra yrkesområdens representanter (991 ... 997 +) @sv
alternative label: Bemärkta personer, andra yrkesområdens representanter (991 ... 997 +) @sv
alternative label: Biografier, andra yrkesområdens representanter (991 ... 997 +) @sv
alternative label: Brev, andra yrkesområdens representanter (991 ... 997 +) @sv
alternative label: Dagböcker, andra yrkesområdens representanter (991 ... 997 +) @sv
alternative label: Flyktingar, personhistoria, övriga områden (991 ... 997 +) @sv
alternative label: Folkdiktsforskare, biografier och memoarer (997 +) @sv
alternative label: Föregångare, andra yrkesområdens representanter (991 ... 997 +) @sv
alternative label: Historia, personhistoria, övriga områden (991 ... 997 +) @sv
alternative label: Historieforskare, biografier och memoarer (997 +) @sv
alternative label: Historiker, forskare, biografier och memoarer (997 +) @sv
alternative label: Immigranter, personhistoria, övriga områden (991 ... 997 +) @sv
alternative label: Intervjuer, personhistoria, övriga områden (991 ... 997 +) @sv
alternative label: Invandrare, personhistoria, övriga branscher (991 ... 997 +) @sv
alternative label: Kritiker, biografier och memoarer (997 +) @sv
alternative label: Kärleksbrev, andra yrkesområdens representanter (991 ... 997 +) @sv
alternative label: Landsflykt, personhistoria, övriga områden (991 ... 997 +) @sv
broader: HENKILÖ- JA SUKUHISTORIA
in scheme: URN:NBN:fi:au:hklj:
narrower: Suomi
notation: 997
related: Pelastusoppi. Kristillinen antropologia
related: URN:NBN:fi:au:hklj:323
related: Poliittiset ja aatteelliset vähemmistöt
related: URN:NBN:fi:au:hklj:617
related: URN:NBN:fi:au:hklj:618.24
related: URN:NBN:fi:au:hklj:618.3
related: URN:NBN:fi:au:hklj:909
related: URN:NBN:fi:au:hklj:919
related: Maantieteilijät. Tutkimusmatkailijat. Löytöretkeilijät.Kansatieteilijät. Antropologit
related: Suomi
related: URN:NBN:fi:au:hklj:997.03
related: Sukuhistoria. Sukututkimus
scope note: Tässä esim. kielitieteilijöiden, kirjallisuuden- ja kansanrunoudentutkijoiden, historioitsijoiden ja arkeologien henkilöhistoria Kirjailijoiden ja taiteilijoiden henkilöhistoria kirjallisuudenhistorian ja eri taidemuotojen historian luokissa
scope note: Hit t.ex. språkvetares, litteratur- och folkminnesforskares, historikers och arkeologers personhistoria Författares och konstnärers personhistoria förs till klasserna för litteraturhistoria och de olika konstarternas historia @sv

Sisällönkuvailu
type: Class
type: Concept
subclass of: Kirjastoaineisto. Kokoelmatyö
alternative label: Asiasanastot (022.5)
alternative label: Asiasanat (022.5)
alternative label: Asiasanoitus (022.5)
alternative label: Automaattinen sisällönkuvailu (022.5)
alternative label: Avainsanat, sisällönkuvailu (022.5)
alternative label: Bibliografinen valvonta, sisällönkuvailu (022.5)
alternative label: Dokumentaatio, sisällönkuvailu (022.5)
alternative label: Dokumentaatiokielet (022.5)
alternative label: Dokumentointi, sisällönkuvailu (022.5)
alternative label: Folksonomiat, sisällönkuvailu (022.5)
alternative label: Indeksointi (022.5)
alternative label: Indeksointikielet (022.5)
alternative label: Luokittaminen, kirjastonhoito (022.5)
alternative label: Luokitus, kirjastonhoito (022.5)
alternative label: Luokitusjärjestelmät, kirjastonhoito (022.5)
alternative label: Metadata, sisällönkuvailu (022.5)
alternative label: Metatieto, sisällönkuvailu (022.5)
alternative label: Musiikin luokitus (022.5)
alternative label: Musiikkiaineisto, luokitus ja indeksointi (022.5)
alternative label: Musiikkikirjastotyö, luokitus ja indeksointi (022.5)
alternative label: Ontologiat, sisällönkuvailu, kirjastoaineisto (022.5)
alternative label: Sisällönkuvailu, kirjastoaineisto (022.5)
alternative label: Sosiaalinen metadata, sisällönkuvailu (022.5)
alternative label: Tesaurukset (022.5)
alternative label: Tägit, metadata, sisällönkuvailu (022.5)
alternative label: Automatisk innehållsbeskrivning (022.5) @sv
alternative label: Bibliografisk kontroll, innehållsbeskrivning (022.5) @sv
alternative label: Dokumentation, innehållsbeskrivning (022.5) @sv
alternative label: Dokumentationsspråk (022.5) @sv
alternative label: Dokumentering, innehållsbeskrivning (022.5) @sv
alternative label: Folksonomier, innehållsbeskrivning (022.5) @sv
alternative label: Indexering (022.5) @sv
alternative label: Indexering, indeksointi (022.5) @sv
alternative label: Indexeringsspråk (022.5) @sv
alternative label: Innehållsbeskrivning, biblioteksmedier (022.5) @sv
alternative label: Klassificering, biblioteksarbete (022.5) @sv
alternative label: Klassifikation, biblioteksarbete (022.5) @sv
alternative label: Klassifikationssystem, biblioteksarbete (022.5) @sv
alternative label: Metadata, innehållsbeskrivning (022.5) @sv
alternative label: Metakunskap, innehållsbeskrivning (022.5) @sv
alternative label: Musik, klassificering (022.5) @sv
alternative label: Musikbiblioteksarbete, klassificering och indexering (022.5) @sv
alternative label: Musikmedier, klassificering och indexering (022.5) @sv
alternative label: Nyckelord, innehållsbeskrivning (022.5) @sv
alternative label: Ontologier, innehållsbeskrivning, biblioteksmedier (022.5) @sv
alternative label: Social metadata, innehållsanalys (022.5) @sv
alternative label: Tags, metadata, innehållsbeskrivning (022.5) @sv
alternative label: Tesaurusar (022.5) @sv
alternative label: Ämnesord (022.5) @sv
alternative label: Ämnesordsregister (022.5) @sv
broader: Kirjastoaineisto. Kokoelmatyö
in scheme: URN:NBN:fi:au:hklj:
notation: 022.5
preferred label: Content description @en
preferred label: Innehållsanalys @sv
related: URN:NBN:fi:au:hklj:010
related: URN:NBN:fi:au:hklj:018
related: Luettelointi
related: Muu kuin kirja-aineisto kirjastossa
related: Lastenkirjastot
related: Koulukirjastot
related: Erityisten väestöryhmien kirjastopalvelut
related: Sairaalakirjastot
related: Erikoiskokoelmat
related: Paikalliskokoelmat
related: Musiikkikirjastot
related: Kirjastoautot. Kirjastoveneet
related: Yleiset kirjastot
related: Erikoiskirjastot. Yhdistysten, laitosten ja yritysten kirjastot
related: URN:NBN:fi:au:hklj:028
related: Dokumentaatio ja informaatiopalvelu yleensä
related: Museonhoito
related: Arkistonhoito
related: URN:NBN:fi:au:hklj:061
related: URN:NBN:fi:au:hklj:063
scope note: Kirjastoaineiston (myös musiikin) luokitus ja indeksointi aineistotyypistä riippumatta Luokitusjärjestelmät. Asiasanastot. Tesaurukset
scope note: Klassificering och indexering av biblioteksmedier (också musikmedier) oavsett mediatyp Klassifikationssystem. Ämnesordsförteckningar. Tesaurusar @sv

Lastenkirjastot
type: Class
type: Concept
subclass of: Yleisönpalvelu
alternative label: Kirjastot, lastenkirjastot (024.3)
alternative label: Kirjavinkkaus (024.3 +)
alternative label: Lasten- ja nuortenkirjastot (024.3 +)
alternative label: Lastenkirjastot (024.3 +)
alternative label: Lastenkulttuuri, kirjastot (024.3 +)
alternative label: Lastenosastot, kirjastot (024.3)
alternative label: Nuortenkirjastotyö (024.3)
alternative label: Nuortenosastot, kirjasto (024.3)
alternative label: Satutunnit, kirjastossa (024.3)
alternative label: Barn- och ungdomsbibliotek (024.3 +) @sv
alternative label: Barnavdelningar, bibliotek (024.3) @sv
alternative label: Barnbibliotek (024.3 +) @sv
alternative label: Barnkultur, bibliotek (024.3 +) @sv
alternative label: Bibliotek, barnbibliotek (024.3) @sv
alternative label: Bokprat (024.3 +) @sv
alternative label: Sagotimmar, på bibliotek (024.3) @sv
alternative label: Ungdomsavdelningar, bibliotek (024.3) @sv
alternative label: Ungdomsbiblioteksarbete (024.3) @sv
broader: Yleisönpalvelu
in scheme: URN:NBN:fi:au:hklj:
narrower: Koulukirjastot
notation: 024.3
preferred label: Children's libraries @en
preferred label: Barnbibliotek @sv
related: URN:NBN:fi:au:hklj:018
related: Kirjastoaineisto. Kokoelmatyö
related: Valinta ja hankinta
related: Luettelointi
related: Sisällönkuvailu
related: Muu kuin kirja-aineisto kirjastossa
related: Kirjaston käyttö. Kirjastososiologia
related: Lainaus
related: Tietopalvelu. Informaatiopalvelu
related: Kirjastonkäytön opastus
related: Yleiset kirjastot
related: Erikoiskirjastot. Yhdistysten, laitosten ja yritysten kirjastot
related: URN:NBN:fi:au:hklj:028
related: Dokumentaatio ja informaatiopalvelu yleensä
related: Museonhoito
related: Arkistonhoito
related: URN:NBN:fi:au:hklj:061
related: URN:NBN:fi:au:hklj:063
scope note: Lasten- ja nuortenkirjastotyö yleensä Kirjastojen lasten- ja nuortenosastot Satutuntien, nukketeatteri- ja videoesitysten sekä muun lasten oheistoiminnan järjestäminen kirjastossa
scope note: Barn och ungdomsbiblioteksverksamhet i allmänhet Bibliotekens barn- och ungdomsavdelningar Sagotimmar, dockteaterföreställningar och videoföreställningar samt annat program för barn i bibliotek @sv

Koulukirjastot
type: Class
type: Concept
subclass of: Lastenkirjastot
alternative label: Kirjastot, koulukirjastot (024.31)
alternative label: Koulukirjastot (024.31)
alternative label: Bibliotek, skolbibliotek (024.31) @sv
alternative label: Skolbibliotek (024.31) @sv
broader: Lastenkirjastot
in scheme: URN:NBN:fi:au:hklj:
notation: 024.31
preferred label: School libraries @en
preferred label: Skolbibliotek @sv
related: URN:NBN:fi:au:hklj:018
related: Kirjastoaineisto. Kokoelmatyö
related: Valinta ja hankinta
related: Luettelointi
related: Sisällönkuvailu
related: Muu kuin kirja-aineisto kirjastossa
related: Kirjaston käyttö. Kirjastososiologia
related: Lainaus
related: Tietopalvelu. Informaatiopalvelu
related: Kirjastonkäytön opastus
related: Yleiset kirjastot
related: Erikoiskirjastot. Yhdistysten, laitosten ja yritysten kirjastot
related: URN:NBN:fi:au:hklj:028
related: Dokumentaatio ja informaatiopalvelu yleensä
related: Museonhoito
related: Arkistonhoito
related: URN:NBN:fi:au:hklj:061
related: URN:NBN:fi:au:hklj:063
related: URN:NBN:fi:au:hklj:182
related: URN:NBN:fi:au:hklj:183
scope note: Koulukirjastot ja koulukirjastotyö yleensä Kirjaston ja koulun yhteistyö
scope note: Skolbibliotek och skolbiblioteksverksamhet i allmänhet Samarbete mellan bibliotek och skolor @sv

Erityisten väestöryhmien kirjastopalvelut
type: Class
type: Concept
subclass of: Yleisönpalvelu
alternative label: Hakeutuva kirjastotoiminta, erityisväestöryhmät (024.4 +)
alternative label: Huoltolaitosten kirjastot (024.4)
alternative label: Kirjastot, laitoskirjastot (024.4 +)
alternative label: Kirjastot, merimieskirjastot (024.4)
alternative label: Kirjastot, työpaikkakirjastot (024.4)
alternative label: Kirjastot, vankilakirjastot (024.4)
alternative label: Kotipalvelut, kirjaston (024.4)
alternative label: Laitoskirjastot, sairaalat (024.4 +)
alternative label: Näkövammaisten kirjastot (024.4)
alternative label: Sokeainkirjastot (024.4)
alternative label: Sosiaaliset erikoiskirjastot (024.4 +)
alternative label: Sosiaaliset kirjastopalvelut (024.4 +)
alternative label: Sotilaskirjastot (024.4)
alternative label: Työpaikkakirjastot (024.4)
alternative label: Vankilakirjastot (024.4)
alternative label: Arbetsplatsbibliotek (024.4) @sv
alternative label: Bibliotek för synskadade (024.4) @sv
alternative label: Bibliotek, anstaltsbibliotek (024.4 +) @sv
alternative label: Bibliotek, arbetsplatsbibliotek (024.4) @sv
alternative label: Bibliotek, fängelsebibliotek (024.4) @sv
alternative label: Bibliotek, sjömansbibliotek (024.4) @sv
alternative label: Blindbibliotek (024.4) @sv
alternative label: Fängelsebibliotek (024.4) @sv
alternative label: Hemservice, bibliotekets (024.4) @sv
alternative label: Institutionsbibliotek, sjukhus (024.4 +) @sv
alternative label: Militärbibliotek (024.4) @sv
alternative label: Social biblioteksservice (024.4 +) @sv
alternative label: Sociala specialbibliotek (024.4 +) @sv
alternative label: Uppsökande biblioteksverksamhet, speciella befolkningsgrupper (024.4 +) @sv
alternative label: Vårdanstaltsbibliotek (024.4) @sv
broader: Yleisönpalvelu
in scheme: URN:NBN:fi:au:hklj:
narrower: Sairaalakirjastot
notation: 024.4
preferred label: Bibliotekstjänster för särskilda befolkningsgrupper @sv
related: URN:NBN:fi:au:hklj:018
related: Kirjastoaineisto. Kokoelmatyö
related: Valinta ja hankinta
related: Luettelointi
related: Sisällönkuvailu
related: Muu kuin kirja-aineisto kirjastossa
related: Kirjaston käyttö. Kirjastososiologia
related: Lainaus
related: Tietopalvelu. Informaatiopalvelu
related: Kirjastonkäytön opastus
related: Yleiset kirjastot
related: Erikoiskirjastot. Yhdistysten, laitosten ja yritysten kirjastot
related: URN:NBN:fi:au:hklj:028
related: Dokumentaatio ja informaatiopalvelu yleensä
related: Museonhoito
related: Arkistonhoito
related: URN:NBN:fi:au:hklj:061
related: URN:NBN:fi:au:hklj:063
scope note: Erityisten väestöryhmien kirjastopalvelut yleensä Sosiaaliset erikoiskirjastot ja laitoskirjastot yleensä Työpaikkakirjastot. Merimieskirjastot. Sotilaskirjastot. Vankilakirjastot. Näkövammaisten kirjastot. Vanhainkotien kirjastot Kotipalvelu Pakolaisten, siirtolaisten ja muiden vähemmistöryhmien kirjastopalvelut
scope note: Bibliotekstjänster för särskilda befolkningsgrupper i allmänhet Sociala specialbibliotek och anstaltsbibliotek i allmänhet Arbetsplatsbibliotek. Sjömansbibliotek. Soldatbibliotek. Fängelsebibliotek. Synskadades bibliotek. Bibliotek på ålderdomshem Boken kommer-verksamhet Bibliotekstjänster för flyktingar, invandrare och andra minoriteter @sv

SANOMALEHDET
type: Class
type: Concept
subclass of: KIRJA-ALA
alternative label: Ilmaisjakelulehdet, sanomalehdet (070 ... 078)
alternative label: Iltapäivälehdet (070 ... 078)
alternative label: Joukkotiedotusvälineet, sanomalehdet (070 ... 078)
alternative label: Joukkoviestimet, sanomalehdet (070 ... 078)
alternative label: Kasettilehdet, sanomalehdet (070 ... 078)
alternative label: Kaupallinen joukkoviestintä, sanomalehdet (070 ... 078)
alternative label: Keltainen lehdistö, sanomalehdet (070 ... 078)
alternative label: Kolumnistit, sanomalehdet (070 ... 078)
alternative label: Kolumnit, sanomalehdet (070 ... 078)
alternative label: Kulttuuriosastot, sanomalehdet (070 ... 078)
alternative label: Lehdet, sanomalehdet (070 ... 078)
alternative label: Lehdistö, sanomalehdet (070 ... 078)
alternative label: Lehti-ilmoitukset, sanomalehdet (070 ... 078)
alternative label: Maakuntalehdet (070 ... 078)
alternative label: Massamedia, sanomalehdet (070 ... 078)
alternative label: Opiskelijalehdet, sanomalehdet (070 ... 078)
alternative label: Paikallislehdet (070 ... 078)
alternative label: Pakinat, sanomalehdet (070 ... 078)
alternative label: Pakinoitsijat, sanomalehdet (070 ... 078)
alternative label: Puoluelehdet (070 ... 078)
alternative label: Pääkirjoitukset, sanomalehdet (070 ... 078)
alternative label: Reportaasit, sanomalehdet (070 ... 078)
alternative label: Sanomalehdet (070 ... 078)
alternative label: Sanomalehtiartikkelit, sanomalehdet (070 ... 078)
alternative label: Selkolehdet, sanomalehdet (070 ... 078)
alternative label: Sensaatiolehdet, sanomalehdet (070 ... 078)
alternative label: Sitoutumattomat lehdet, sanomalehdet (070 ... 078)
alternative label: Skandaalilehdistö, sanomalehdet (070 ... 078)
alternative label: Skandaalit, sanomalehdet (070 ... 078)
alternative label: Telelehdet (070 ... 078)
alternative label: Tiedotusvälineet, sanomalehdet (070 ... 078)
alternative label: Työväenlehdet (070 ... 078)
alternative label: Videolehdet, sanomalehdet (070 ... 078)
alternative label: Yleisönosastot, sanomalehdet (070 ... 078)
alternative label: Äänilehdet, sanomalehdet (070 ... 078)
alternative label: Arbetartidningar (070 ... 078) @sv
alternative label: Dagstidningar (070 ... 078) @sv
alternative label: Gratistidningar, tidningar (070 ... 078) @sv
alternative label: Gula pressen, tidningar (070 ... 078) @sv
alternative label: Insändarsidor, tidningar (070 ... 078) @sv
alternative label: Kassettidningar, tidningar (070 ... 078) @sv
alternative label: Kolumner, tidningar (070 ... 078) @sv
alternative label: Kolumnister, tidningar (070 ... 078) @sv
alternative label: Kommersiell masskommunikation, tidningar (070 ... 078) @sv
alternative label: Kultursidor, tidningar (070 ... 078) @sv
alternative label: Kvällstidningar (070 ... 078) @sv
alternative label: Kåserier, tidningar (070 ... 078) @sv
alternative label: Kåsörer, tidningar (070 ... 078) @sv
alternative label: Ledare, tidningar, tidningar (070 ... 078) @sv
alternative label: Lokaltidningar (070 ... 078) @sv
alternative label: Lättlästa tidningar, tidningar (070 ... 078) @sv
alternative label: Masskommunikationsmedel, tidningar (070 ... 078) @sv
alternative label: Massmedia, tidningar (070 ... 078) @sv
alternative label: Massmedier, tidningar (070 ... 078) @sv
alternative label: Obundna tidningar, tidningar (070 ... 078) @sv
alternative label: Partitidningar (070 ... 078) @sv
alternative label: Regionala tidningar (070 ... 078) @sv
alternative label: Reportage, tidningar (070 ... 078) @sv
alternative label: Sensationspress, tidningar (070 ... 078) @sv
alternative label: Sensationstidningar, tidningar (070 ... 078) @sv
broader: KIRJA-ALA
in scheme: URN:NBN:fi:au:hklj:
narrower: Suomenkieliset
narrower: Ruotsinkieliset
narrower: Saksankieliset
narrower: Englanninkieliset
narrower: Ranskankieliset
narrower: Italiankieliset
narrower: Espanjankieliset
narrower: Venäjänkieliset
notation: 070
related: YLEISET KOKOOMATEOKSET
related: YLEISET KAUSIJULKAISUT
related: URN:NBN:fi:au:hklj:384
related: Lehdistöoppi
scope note: Tässä ja alaluokissa aineistotyypistä riippumatta yleiset tai sekasisältöiset sanomalehdet ja niiden erilliset sisällysluettelot Tässä ja alaluokissa myös sellaiset elektroniset kausijulkaisut, äänilehdet sekä tele- tai videolehdet, joita voidaan pitää sanomalehtinä Erikoisalojen sanomalehdet ja niiden erilliset hakemistot alan mukaisessa luokassa
scope note: Hit och till underklasserna tidningar med allmänt och blandat innehåll och separata innehållsförteckningar för dessa oavsett mediatyp Hit och till underklasserna också sådana elektroniska seriella publikationer, taltidningar och tele- och videotidningar som kan betraktas som tidningar Tidningar som rör specialområden och deras separata innehållsförteckningar klassificeras enligt område @sv

URN:NBN:fi:au:hklj:1.3
alternative label: Antologiat, näytelmät (1.3)
alternative label: Dialogi, näytelmäkirjallisuus (1.3)
alternative label: Dokumenttinäytelmät, kaunokirjallisuus (1.3)
alternative label: Draamat (1.3)
alternative label: Esitykset, kuunnelmatallenteet (1.3)
alternative label: Esitykset, näytelmätallenteet (1.3)
alternative label: Farssit, näytelmät (1.3)
alternative label: Historialliset näytelmät (1.3)
alternative label: Huumori, näytelmät (1.3)
alternative label: Huvinäytelmät, näytelmätekstit (1.3)
alternative label: Ihmenäytelmät (1.3)
alternative label: Jatkokertomukset, näytelmätekstit (1.3)
alternative label: Kamarinäytelmät, kaunokirjallisuus (1.3)
alternative label: Kansannäytelmät (1.3)
alternative label: Kirkkonäytelmät (1.3)
alternative label: Komediat, näytelmätekstit (1.3)
alternative label: Kuunnelmat, kuunnelmaesitykset (1.3)
alternative label: Kuunnelmat, kuunnelmatekstit (1.3)
alternative label: Kärsimysnäytelmät, näytelmäkirjallisuus (1.3)
alternative label: Lastennäytelmät (1.3)
alternative label: Melodraamat, näytelmät (1.3)
alternative label: Miraakkelit, näytelmät (1.3)
alternative label: Monologit, kaunokirjallisuus (1.3)
alternative label: Moraliteetit, kaunokirjallisuus (1.3)
alternative label: Murhenäytelmät, näytelmät (1.3)
alternative label: Musta komedia, näytelmätekstit (1.3)
alternative label: Mysteerinäytelmät, näytelmät (1.3)
alternative label: No-näytelmät, näytelmätekstit (1.3)
alternative label: Nukkenäytelmät, näytelmätekstit (1.3)
alternative label: Nukketeatteriesitykset, videotallenteet (1.3)
alternative label: Nuorisonäytelmät, näytelmät (1.3)
alternative label: Nuortennäytelmät, näytelmät (1.3)
alternative label: Näytelmäkirjallisuus (1.3)
alternative label: Näytelmät, kaunokirjallisuus (1.3)
alternative label: Näytelmätekstit (1.3)
alternative label: Prologit, näytelmät (1.3)
alternative label: Radio-ohjelmat, kuunnelmat (1.3)
alternative label: Runonäytelmät, näytelmät (1.3)
alternative label: Satiiri, näytelmät (1.3)
alternative label: Satunäytelmät, näytelmät (1.3)
alternative label: Seuranäytelmät (1.3)
alternative label: Sketsit, sketsiohjelmat (1.3)
alternative label: Stand up -komiikka, tekstit ja taltioinnit (1.3)
alternative label: Teatteriesitykset, taltioinnit (1.3)
alternative label: Tiernapojat, näytelmätekstit (1.3)
alternative label: Tragediat, näytelmätekstit (1.3)
alternative label: Tragikomediat, näytelmäesitysten taltioinnit (1.3)
alternative label: Tragikomediat, näytelmätekstit (1.3)
alternative label: Uskonnolliset näytelmät (1.3)
alternative label: Amatörpjäser (1.3) @sv
alternative label: Antologier, skådespel (1.3) @sv
alternative label: Barnpjäser (1.3) @sv
alternative label: Dialog, dramatik (1.3) @sv
alternative label: Dockskådespel, skådespelstexter (1.3) @sv
alternative label: Dockteaterföreställningar, videoinspelningar (1.3) @sv
alternative label: Dokumentära skådespel, skönlitteratur (1.3) @sv
alternative label: Dramatik (1.3) @sv
alternative label: Dramer (1.3) @sv
related: URN:NBN:fi:au:hklj:770
related: Teatterimuodot
related: URN:NBN:fi:au:hklj:783.5
related: Oratoriot
related: Passiot
related: Messut. Requiemit
related: Kantaatit
related: Motetit
related: URN:NBN:fi:au:hklj:783.59
related: URN:NBN:fi:au:hklj:783.6
related: Oopperat
related: Oopperoiden soitinosat
related: Oopperoiden solistiset lauluosat
related: Oopperoiden kuoro-osat
related: Operetit
related: Musikaalit
related: Balettimusiikki
related: Näytelmämusiikki
related: Melodraamat
related: URN:NBN:fi:au:hklj:783.67
related: URN:NBN:fi:au:hklj:783.68
related: Muu näyttämö- tai draamamusiikki. Pelimusiikki

Suomi
type: Class
type: Concept
subclass of: Filosofian historia
alternative label: Filosofian historia, Suomi (108.9)
alternative label: Suomi, filosofian historia (108.9)
alternative label: Filosofins historia, Finland (108.9) @sv
alternative label: Finland, filosofins historia (108.9) @sv
broader: Filosofian historia
in scheme: URN:NBN:fi:au:hklj:
notation: 108.9
preferred label: Finland @en
related: Oppikirjat. Johdatukset filosofiaan
related: Esseet
related: Nykyajan filosofia
related: URN:NBN:fi:au:hklj:110
related: Tietoteorian historia ja suunnat
related: URN:NBN:fi:au:hklj:920
related: Esi- ja varhaishistoria vuoteen 1154
related: Keskiaika 1155-1522
related: Reformaation aika 1523-1617
related: Ruotsin suurvalta-aika 1618-1721
related: Vapauden aika ja kustavilainen aika 1722-1809
related: Autonomian aika 1810-1917
related: Itsenäisyyden aika 1917-1938
related: Vuoden 1918 sota
related: Itsenäisyyden aika 1939-
related: Sodat 1939-1945
related: URN:NBN:fi:au:hklj:929
related: Helsinki. Pääkaupunkiseutu
scope note: Suomen eri aikakausien yleinen filosofia sen historia Filosofian erikoisalojen kysymykset alan mukaisessa luokassa
scope note: Allmän filosofi och dess historia under olika tidsperioder i Finland Specialfrågor inom filosofin klassificeras enligt område @sv

Ihmissuhteiden psykologia
type: Class
type: Concept
subclass of: Sosiaalipsykologia. Kulttuuripsykologia
alternative label: Adoptio, perhepsykologia (128.32)
alternative label: Adoptiolapset, perhepsykologia (128.32)
alternative label: Alemmuudentunne, ihmissuhteiden psykologia (128.32)
alternative label: Anopit, perhepsykologia (128.32)
alternative label: Antipatia, ihmissuhteiden psykologia (128.32)
alternative label: Apet, perhepsykologia (128.32)
alternative label: Appivanhemmat, perhepsykologia (128.32)
alternative label: Avioero, ihmissuhteiden psykologia (128.32)
alternative label: Avioerolapset, perhepsykologia (128.32)
alternative label: Avioliitto, ihmissuhteiden psykologia (128.32)
alternative label: Aviomiehet, ihmissuhteiden psykologia (128.32)
alternative label: Avioparit, ihmissuhteiden psykologia (128.32)
alternative label: Aviopuolisot, ihmissuhteiden psykologia (128.32)
alternative label: Aviorikokset, ihmissuhteiden psykologia (128.32)
alternative label: Aviovaimot, ihmissuhteiden psykologia (128.32)
alternative label: Avoero, ihmissuhteiden psykologia (128.32)
alternative label: Avoin adoptio, perhepsykologia (128.32)
alternative label: Avoliitto, ihmissuhteiden psykologia (128.32)
alternative label: Avoparit, ihmissuhteiden psykologia (128.32)
alternative label: Avopuolisot, ihmissuhteiden psykologia (128.32)
alternative label: Biologiset lapset, perhepsykologia (128.32 +)
alternative label: Biologiset vanhemmat, perhepsykologia (128.32 +)
alternative label: Elämänhallinta, ihmissuhteet (128.32)
alternative label: Elämänmuutokset, ihmissuhteet (128.32)
alternative label: Elämänodotukset, ihmissuhteiden psykologia (128.32)
alternative label: Elämänohjeet, ihmissuhteiden psykologia (128.32)
alternative label: Elämäntaito, ihmissuhteiden psykologia (128.32)
alternative label: Elämäntilanne, ihmissuhteet (128.32)
alternative label: Eläytyminen, ihmissuhteiden psykologia (128.32)
alternative label: Emotionaalinen kehitys, ihmissuhteiden psykologia (128.32)
alternative label: Empaattisuus, ihmissuhteiden psykologia (128.32)
alternative label: Empatia, ihmissuhteiden psykologia (128.32)
alternative label: Epärehellisyys, ihmissuhteiden psykologia (128.32)
alternative label: Erehdys, ihmissuhteiden psykologia (128.32)
alternative label: Erillään asuminen, avioeron psykologia (128.32)
alternative label: Erillään asuminen, ihmissuhteiden psykologia (128.32)
alternative label: Eronneet, avioeron psykologia (128.32)
alternative label: Estot, ihmissuhteiden psykologia (128.32)
alternative label: Etäsuhteet, parisuhde (128.32)
alternative label: Flirtti, ihmissuhteiden psykologia (128.32)
alternative label: Hellyydenosoitukset, ihmissuhteiden psykologia (128.32)
alternative label: Hellyys, ihmissuhteiden psykologia (128.32)
alternative label: Henkilösuhteet, ihmisuuhteiden psykologia (128.32)
alternative label: Henkinen hyvinvointi, ihmissuhteiden psykologia (128.32)
alternative label: Henkinen kasvu, ihmissuhteiden psykologia (128.32)
alternative label: Henkinen väkivalta, ihmis- ja parisuhteissa (128.32)
alternative label: Hyväksyminen, ihmissuhteiden psykologia (128.32)
alternative label: Hyväksyntä, ihmissuhteiden psykologia (128.32)
alternative label: Ihastuminen, ihmissuhdepsykologia (128.32)
alternative label: Ihastus, ihmissuhdepsykologia (128.32)
alternative label: Ihmissuhdetaidot, ihmissuhteiden psykologia (128.32)
alternative label: Ihmissuhteet, psykologia (128.32)
broader: Sosiaalipsykologia. Kulttuuripsykologia
in scheme: URN:NBN:fi:au:hklj:
notation: 128.32
related: Tunne- ja tahtotoiminnot
related: Psykologian suunnat
related: Differentiaalipsykologia. Persoonallisuuden psykologia
related: Psychology of expression {@en
related: Naisen ja miehen psykologia
related: Perhe- ja kotikasvatus
related: Elämänohjeet
related: SOSIOLOGIA
related: Työn sosiologia
related: Elämäntapojen sosiologia. Kulttuurisosiologia
related: Perhesosiologia
related: Perhepolitiikka. Lapsipolitiikka. Nuorisopolitiikka
related: Seksologia
related: URN:NBN:fi:au:hklj:618.2
related: URN:NBN:fi:au:hklj:618.24
related: Itsemurhat ja niiden ehkäisy
related: URN:NBN:fi:au:hklj:618.8
related: URN:NBN:fi:au:hklj:618.85
related: Johtamisen tekniikka ja menetelmät
related: Henkilöstöpolitiikka
scope note: Perhepsykologia. Parisuhteen psykologia. Avioliiton ja avioeron psykologia Tässä myös ihmissuhteita ja tunteita koskevat populaaripsykologiset teokset ja elämänohjeet Jos teoksessa on sekä ihmissuhteisiin, mielenterveyteen että itsensä kehittämiseen liittyviä elämänohjeita, on etusija luokalla 188.1
scope note: Familjepsykologi. Parförhållandenas psykologi. Äktenskaps- och skilsmässopsykologi Hit också populärpsykologiska verk och levnadsregler om mänskliga relationer och känslor Om verket innehåller levnadsregler för såväl mänskliga relationer, mental hälsa som självuppfostran, ges företräde åt klass 188.1 @sv

KÄYTÄNNÖLLINEN TEOLOGIA
type: Class
type: Concept
subclass of: YLEINEN USKONTOTIEDE. YLEINEN USKONNONFILOSOFIA
alternative label: Kristinusko, käytännöllinen teologia (240 ... 248)
alternative label: Käytännöllinen teologia (240 ... 248)
alternative label: Maailmanuskonnot, kristinusko (210 ... 279 +)
alternative label: Uskonnot, kristinusko (210 ... 279 +)
alternative label: Uskonto, kristinusko (210 ... 279 +)
alternative label: Uskontokunnat, kristinusko (210 ... 279 +)
alternative label: Kristendom, praktisk teologi (240 ... 248) @sv
alternative label: Praktisk teologi (240 ... 248) @sv
alternative label: Primitiva religioner, olika religioner (208 ... 289 +) @sv
alternative label: Religion, kristendom (210 ... 279 +) @sv
alternative label: Religioner, kristendom (210 ... 279 +) @sv
alternative label: Religionssamfund, kristendom (210 ... 279 +) @sv
alternative label: Världsreligioner, kristendom (210 ... 279 +) @sv
broader: YLEINEN USKONTOTIEDE. YLEINEN USKONNONFILOSOFIA
in scheme: URN:NBN:fi:au:hklj:
narrower: Kristillinen etiikka
narrower: Hartauskirjat
narrower: Virsikirjat ja hengelliset laulukirjat
narrower: Kirkolliset esineet ja symbolit
narrower: Sielunhoito
narrower: Henkilökohtainen hartaudenharjoitus
notation: 240
preferred label: PRACTICAL CHRISTIAN THEOLOGY @en
preferred label: PRAKTISK TEOLOGI @sv
related: URN:NBN:fi:au:hklj:210
related: EVANKELIS-LUTERILAINEN KIRKKO
related: URN:NBN:fi:au:hklj:260
related: Itämaiset kirkot
related: Roomalaiskatolinen kirkko
related: Ortodoksinen kirkko
related: Protestanttiset kirkot ja yhteisöt
related: Muut kristillisperäiset yhteisöt
scope note: Tässä ja alaluokissa kirkkokunnasta tai yhteisöstä riippumatta käytännöllinen kristillinen teologia Tässä käytännöllisen kristillisen teologian yleisteokset Kirkkojen, seurakuntien ja kristillisten yhteisöjen hallinto ja toiminta, kirkolliset toimitukset, jumalanpalvelukset sekä evankelioimis- ja lähetystyö kirkon, kirkkokunnan tai kristillisen yhteisön mukaisessa luokassa 250-269
scope note: Hit och till underklasserna praktisk teologi oavsett kyrkosamfund eller kristet samfund Hit allmänna verk som rör praktisk kristen teologi Kyrkors, församlingars och kristna samfunds administration och verksamhet, kyrkliga förrättningar, gudstjänster samt evangelisation och missionsarbete klassificeras enligt kyrka, kyrkosamfund eller kristet samfund i klasserna 250-269 @sv

Intian uskonnot ja mytologiat
type: Class
type: Concept
subclass of: URN:NBN:fi:au:hklj:280
alternative label: Avioliittoon vihkiminen, uskontotiede, eri uskonnot (282 ... 289 +)
alternative label: Brahmalaisuus (282)
alternative label: Chakrat, hindulaisuus (282)
alternative label: Hindulainen kirjallisuus (282)
alternative label: Hindulaiset (282)
alternative label: Hindulaisuus (282)
alternative label: Hindut (282)
alternative label: Inkarnaatio, hindulaisuus (282)
alternative label: Itämaiset uskonnot, brahmalaisuus (282)
alternative label: Itämaiset uskonnot, hindulaisuus (282)
alternative label: Itämaiset uskonnot, jainalaisuus (282)
alternative label: Jainalaisuus (282)
alternative label: Japani, mytologiat (281 ... 283)
alternative label: Japani, uskonnot (281 ... 283)
alternative label: Jälleensyntyminen, hindulaisuus (282)
alternative label: Karma, hindulaisuus (282)
alternative label: Kiina, mytologiat (281 ... 283)
alternative label: Kiina, uskonnot (281 ... 283)
alternative label: Maailmanuskonnot, hindulaisuus (282)
alternative label: Meditaatio, hindulaisuus (282)
alternative label: Mietiskely, hindulaisuus (282)
alternative label: Ramayana (282)
alternative label: Reinkarnaatio, hindulaisuus (282)
alternative label: Retriitit, hindulainen mietiskely (282)
alternative label: Rigveda (282)
alternative label: Sielunvaellus, hindulaisuus (282)
alternative label: Sikhiläisyys, uskonto (282)
alternative label: Sikhit, Sikhiläisyys (282)
alternative label: Tantra, hindulaisuus (282)
alternative label: Tsakrat, hindulaisuus (282)
alternative label: Uskonnot, hindulaisuus (282)
alternative label: Uskontokunnat, hindulaisuus (282)
alternative label: Uudelleensyntyminen, hindulaisuus (282)
alternative label: Veda-uskonto (282)
alternative label: Vedanta (282)
alternative label: Brahmanism (282) @sv
alternative label: Chakror, hinduism (282) @sv
alternative label: Chakror, tsakrat, hinduism (282) @sv
alternative label: Hinduer (282) @sv
alternative label: Hinduisk litteratur (282) @sv
alternative label: Hinduism (282) @sv
alternative label: Hinduister (282) @sv
alternative label: Inkarnation, hinduism (282) @sv
alternative label: Jainism (282) @sv
alternative label: Japan, mytologier (281 ... 283) @sv
alternative label: Japan, religioner (281 ... 283) @sv
alternative label: Karma, hinduism (282) @sv
alternative label: Kina, mytologier (281 ... 283) @sv
alternative label: Kina, religioner (281 ... 283) @sv
alternative label: Meditation, meditaatio, hinduism (282) @sv
alternative label: Meditation, mietiskely, hinduism (282) @sv
alternative label: Pånyttfödelse, övriga religioner och ockultism, hinduism (282) @sv
broader: URN:NBN:fi:au:hklj:280
in scheme: URN:NBN:fi:au:hklj:
notation: 282
related: Itämainen filosofia
related: URN:NBN:fi:au:hklj:110
related: Uskonto- ja maailmankatsomuspsykologia
related: RAJATIETO
related: URN:NBN:fi:au:hklj:192
related: Kuolemakokemukset
related: Uskonnonfilosofia
related: Elämä. Kuolema
related: Luominen. Kehitys
related: URN:NBN:fi:au:hklj:209
related: URN:NBN:fi:au:hklj:210
related: Jumalan olemus
related: Enkelit. Paholaiset. Demonit
related: Kuolema ja kuolemanjälkeinen elämä
related: Henkilökohtainen hartaudenharjoitus
related: Lähetystyö
related: Buddhalaisuus ja sen mytologia
related: Jooga
related: URN:NBN:fi:au:hklj:807
related: URN:NBN:fi:au:hklj:992
scope note: Brahmalaisuus. Hindulaisuus. Jainalaisuus. Sikhiläisyys. Vedalaisuus Askeesi ja meditaatio Intian uskontojen kannalta
scope note: Bramanism. Hinduism. Jainism. Sikher. Vedism Askes och meditation ur de indiska religionernas synvinkel @sv

Buddhalaisuus ja sen mytologia
type: Class
type: Concept
subclass of: URN:NBN:fi:au:hklj:280
alternative label: Avioliittoon vihkiminen, uskontotiede, eri uskonnot (282 ... 289 +)
alternative label: Buddhalainen kirjallisuus (283)
alternative label: Buddhalaiset (283)
alternative label: Buddhalaisuus (283)
alternative label: Hinajana (283)
alternative label: Inkarnaatio, buddhalaisuus (283)
alternative label: Itämaiset uskonnot, buddhalaisuus (283)
alternative label: Japani, mytologiat (281 ... 283)
alternative label: Japani, uskonnot (281 ... 283)
alternative label: Jälleensyntyminen, buddhalaisuus (283)
alternative label: Karma, buddhalaisuus (283)
alternative label: Karmamudra (283)
alternative label: Kiina, mytologiat (281 ... 283)
alternative label: Kiina, uskonnot (281 ... 283)
alternative label: Lamalaisuus (283)
alternative label: Maailmanuskonnot, buddhalaisuus (283)
alternative label: Mahajana (283)
alternative label: Meditaatio, buddhalaisuus (283)
alternative label: Mietiskely, buddhalaisuus (283)
alternative label: Nirvana (283)
alternative label: Reinkarnaatio, buddhalaisuus (283)
alternative label: Retriitit, buddhalainen mietiskely (283)
alternative label: Sielunvaellus, buddhalaisuus (283)
alternative label: Sutrat, buddhalainen kirjallisuus (283)
alternative label: Tantra, buddhalaisuus (283)
alternative label: Thangkat (283)
alternative label: Tiibet, buddhalaisuus (283)
alternative label: Tiibetinbuddhalaisuus (283)
alternative label: Uskonnot, buddhalaisuus (283)
alternative label: Uskontokunnat, buddhalaisuus (283)
alternative label: Uudelleensyntyminen, buddhalaisuus (283)
alternative label: Zenbuddhalaisuus (283)
alternative label: Buddhism (283) @sv
alternative label: Buddhister (283) @sv
alternative label: Buddhistisk litteratur (283) @sv
alternative label: Hinayana (283) @sv
alternative label: Inkarnation, buddhism (283) @sv
alternative label: Japan, mytologier (281 ... 283) @sv
alternative label: Japan, religioner (281 ... 283) @sv
alternative label: Karma, buddhism (283) @sv
alternative label: Kina, mytologier (281 ... 283) @sv
alternative label: Kina, religioner (281 ... 283) @sv
alternative label: Lamaism (283) @sv
alternative label: Meditation, meditaatio, buddhism (283) @sv
alternative label: Meditation, mietiskely, buddhism (283) @sv
alternative label: Pånyttfödelse, övriga religioner och ockultism, buddhism (283) @sv
alternative label: Reinkarnation, buddhism (283) @sv
alternative label: Religioner, buddhism (283) @sv
alternative label: Religionssamfund, buddhism (283) @sv
alternative label: Retreater, buddhistisk meditation (283) @sv
alternative label: Själavandring, buddhism (283) @sv
alternative label: Sutror, buddhistisk litteratur (283) @sv
broader: URN:NBN:fi:au:hklj:280
in scheme: URN:NBN:fi:au:hklj:
notation: 283
related: Itämainen filosofia
related: URN:NBN:fi:au:hklj:110
related: Uskonto- ja maailmankatsomuspsykologia
related: RAJATIETO
related: URN:NBN:fi:au:hklj:192
related: Kuolemakokemukset
related: Uskonnonfilosofia
related: Elämä. Kuolema
related: Luominen. Kehitys
related: URN:NBN:fi:au:hklj:209
related: URN:NBN:fi:au:hklj:210
related: Jumalan olemus
related: Enkelit. Paholaiset. Demonit
related: Kuolema ja kuolemanjälkeinen elämä
related: Henkilökohtainen hartaudenharjoitus
related: Lähetystyö
related: Itä-Aasian uskonnot ja mytologiat
related: Intian uskonnot ja mytologiat
related: URN:NBN:fi:au:hklj:807
related: URN:NBN:fi:au:hklj:992
scope note: Hinajana. Mahajana. Zen. Lamalaisuus Askeesi ja meditaatio buddhalaisuuden kannalta
scope note: Hinayana. Mahayana. Zen. Lamaism Askes och meditation ur buddhismens synvinkel @sv

Muiden maiden kunnallis-, läänin- ja valtionhallinto
type: Class
type: Concept
subclass of: URN:NBN:fi:au:hklj:340
alternative label: Aluehallinto, muut maat (348)
alternative label: Alueliitokset, kunnat, läänit, maakunnat, muut maat (348)
alternative label: Demokratia, kunnallinen, muut maat (348)
alternative label: Demokratia, lähidemokratia, muut maat (348)
alternative label: Digitaalidemokratia, lähidemokratia, muut maat (348)
alternative label: Digitaalinen demokratia, lähidemokratia, muut maat (348)
alternative label: Ehdokasasettelu, kunnallisvaalit, muut maat (348)
alternative label: Ehdokkaat, kunnallisvaalit, muut maat (348)
alternative label: Elektroninen demokratia, lähidemokratia, muut maat (348)
alternative label: Ennakkoäänestys, kunnalliset, muut maat (348)
alternative label: Ennakkoäänestäminen, kunnalliset, muut maat (348)
alternative label: Etädemokratia, lähidemokratia, muut maat (348)
alternative label: Hallinnolliset palvelut, muiden maiden hallinto (348)
alternative label: Hallinto, muiden maiden hallinto (348)
alternative label: Hallintopalvelut, muiden maiden hallinto (348)
alternative label: Itsehallinto, kunnallinen, muut maat (348)
alternative label: Itsehallinto, maakunnallinen, muut maat (348)
alternative label: Julkinen hallinto, muiden maiden hallinto (348)
alternative label: Julkiset palvelut, valtion (347 ... 348)
alternative label: Julkishallinto, muiden maiden hallinto (348)
alternative label: Julkishyödykkeet, valtion (347 ... 348)
alternative label: Julkisyhteisöt, muiden maiden hallinto (348)
alternative label: Kannatus, vaalit, kunnalliset, muut maat (348)
alternative label: Kansanäänestykset, kunnalliset, muut maat (348)
alternative label: Keskushallinto, muut maat (348)
alternative label: Keskusvirastot, muut maat (348)
alternative label: Komiteanmietinnöt, muut maat (348)
alternative label: Komiteat, muut maat (348)
alternative label: Kuntapalvelut, valtion (347 ... 348)
alternative label: Liittokanslerit, valtionhallinto, muut maat (348)
alternative label: Läpinäkyvyys, muiden maiden hallinto (348)
alternative label: Maa- ja metsätaloushallinto, ministeriöt, muut maat (348)
alternative label: Maaherrat, lääninhallinto, muut maat (348)
alternative label: Maakunnalliset liitot, muut maat (348)
alternative label: Maakunnan liitot, muut maat (348)
alternative label: Maakunnat, maakuntahallinto, muut (348)
alternative label: Maakuntahallinto, muut maat (348)
alternative label: Maakuntaitsehallinto, muut maat (348)
alternative label: Maakuntalait, maakuntahallinto, muut maat (348)
alternative label: Maakuntaliitot, muut maat (348)
alternative label: Maakuntien liitot, muut maat (348)
alternative label: Ministeriöt, muut maat (348)
alternative label: Määräaikaisuus, hallinto, muut maat (348)
alternative label: Neuvottelukunnat, muiden maiden hallinto (348)
alternative label: Palvelupisteet, valtiolliset palvelut (347 ... 348)
alternative label: Piirihallinto, muut maat (348)
alternative label: Poliittinen mainonta, kunnallispolit., muut maat (348)
alternative label: Poliittiset virkanimitykset, valtionhallinto, muut maat (348)
alternative label: Postiäänestys, kunnalliset, muut maat (348)
alternative label: Postiäänestäminen, kunnalliset, muut maat (348)
alternative label: Puolueiden kannatus, vaalit, kunnalliset, muut maat (348)
alternative label: Sisäasiainhallinto, muut maat (348)
alternative label: Sähköinen demokratia, lähidemokratia, muut maat (348)
alternative label: Sähköinen hallinto, muiden maiden hallinto (348)
alternative label: Sähköinen äänestys, kunnalliset, muut maat (348)
alternative label: Sähköinen äänestäminen, kunnalliset, muut maat (348)
alternative label: Teledemokratia, lähidemokratia, muut maat (348)
alternative label: Toimivalta, muiden maiden hallinto (348)
alternative label: Toimivaltuudet, muiden maiden hallinto (348)
alternative label: Ulkoasiainhallinto, valtionhallinto (347 ... 348)
alternative label: Vaalikampanjat, kunnallispolitiikka, muut maat (348)
broader: URN:NBN:fi:au:hklj:340
in scheme: URN:NBN:fi:au:hklj:
notation: 348
related: Muiden maiden valtiojärjestelmät
related: Kansainvälinen oikeus
related: URN:NBN:fi:au:hklj:345
related: Helsinki. Pääkaupunkiseutu
related: Suomen maakuntahallinto
related: Suomen valtionhallinto
related: Komiteat. Komiteanmietinnöt
related: URN:NBN:fi:au:hklj:363
related: Valtionverotus. Veropolitiikka
related: Talouselämän kehitysilmiöt
related: URN:NBN:fi:au:hklj:370
scope note: Muiden maiden kunnallis-, läänin- ja valtionhallinnon yleisteokset Muiden maiden julkinen hallinto yleensä Kunnallis-, läänin- ja valtionhallinnon erikoisalat maasta riippumatta alan mukaisessa luokassa
scope note: Allmänna verk som rör andra länders kommunal-, läns- och statsförvaltning Andra länders offentliga förvaltning i allmänhet Specialområden inom kommunal-, läns- och statsförvaltning klassificeras enligt område oavsett land @sv

Elämäntapojen sosiologia. Kulttuurisosiologia
type: Class
type: Concept
subclass of: SOSIOLOGIA
alternative label: Aikuiset, elämäntapojen sosiologia (357 +)
alternative label: Aikuisuus, elämäntapojen sosiologia (357 +)
alternative label: Ajankäyttö, elämäntapojen sosiologia (357 +)
alternative label: Akkulturaatio, kulttuurisosiologia (357 +)
alternative label: Anakoreetit, elämäntapa (357 +)
alternative label: Arki, elämäntapojen sosiologia (357 +)
alternative label: Arkielämä, elämäntapojen sosiologia (357 +)
alternative label: Arkitieto, tiedon sosiologia (357 +)
alternative label: Arvot, kulttuurisosiologia (357 +)
alternative label: Arvottaminen, kulttuurisosiologia (357 +)
alternative label: Assimilaatio, kulttuurisosiologia (357 +)
alternative label: Biografiatutkimus, elämäntapojen sosiologia (357 +)
alternative label: Diversiteetti, kulttuurisosiologia (357 +)
alternative label: Downshiftaus, elämäntapa, sosiologia (357 +)
alternative label: Elintavat, sosiologia (357 +)
alternative label: Elämismaailma, elämäntapojen sosiologia (357 +)
alternative label: Elämäkerrallinen tutkimus, elämäntapojen sosiologia (357 +)
alternative label: Elämäkertatutkimus, elämäntapojen sosiologia (357 +)
alternative label: Elämänkertatutkimus, elämäntapojen sosiologia (357 +)
alternative label: Elämäntapa, sosiologia (357 +)
alternative label: Elämäntyyli, sosiologia (357 +)
alternative label: Erakot, elämäntapa (357 +)
alternative label: Eremiitit, elämäntapa (357 +)
alternative label: Erikoistuminen, kulttuurisosiologia (357 +)
alternative label: Eskapismi, kulttuurisosiologia (357 +)
alternative label: Farkut, elämäntapojen sosiologia (357 +)
alternative label: Farmarihousut, elämäntapojen sosiologia (357 +)
alternative label: Gender-tutkimus, kulttuurisosiologia (357 +)
alternative label: Henkilöhistoriallinen tutkimus, elämäntapojen sosiologia (357 +)
alternative label: Heterogeenisuus, kulttuurisosiologia (357 +)
alternative label: Homogeenisuus, kulttuurisosiologia (357 +)
alternative label: Homoseksuaalisuus, kulttuurisosiologia (357)
alternative label: Joukkoliikkeet, kulttuurisosiologia (357 +)
alternative label: Jälkimoderni, kulttuurisosiologia (357 +)
alternative label: Jälkimodernismi, kulttuurisosiologia (357 +)
alternative label: Kansalaisosallistuminen, elämäntapojen sosiologia (357 +)
alternative label: Kansalaisten osallistuminen, elämäntapojen sosiologia (357 +)
alternative label: Kansalaistoiminta, elämäntapojen sosiologia (357 +)
alternative label: Kansanelämä, elämäntapojen sosiologia (357 +)
alternative label: Kesä, vapaa-ajan vieton sosiologia (357 +)
alternative label: Kesäasunnot, vapaa-ajan vieton sosiologia (357 +)
alternative label: Kesäloma, vapaa-ajan vieton sosiologia (357 +)
alternative label: Kesämökit, vapaa-ajan vieton sosiologia (357 +)
alternative label: Kesämökkeily, vapaa-ajanvieton sosiologia (357 +)
alternative label: Kesänvietto, vapaa-ajanvieton sosiologia (357 +)
alternative label: Kitsch, kulttuurisosiologia (357 +)
alternative label: Kotiseutu, elämäntapojen sosiologia (357 +)
alternative label: Kulkurit, elämäntapojen sosiologia (357 +)
alternative label: Kulttuuri, kulttuurisosiologia (357 +)
alternative label: Kulttuuri-identiteetti, kulttuurisosiologia (357 +)
alternative label: Kulttuurienvälisyys, kulttuurisosiologia (357 +)
alternative label: Kulttuurierot, kulttuurisosiologia (357 +)
alternative label: Kulttuurijärjestelmät, kulttuurisosiologia (357 +)
broader: SOSIOLOGIA
in scheme: URN:NBN:fi:au:hklj:
narrower: URN:NBN:fi:au:hklj:357.1
notation: 357
related: URN:NBN:fi:au:hklj:060
related: URN:NBN:fi:au:hklj:061
related: URN:NBN:fi:au:hklj:063
related: Sosiaalipsykologia. Kulttuuripsykologia
related: Ihmissuhteiden psykologia
related: ELÄMÄNFILOSOFIA. KULTTUURIFILOSOFIA
related: Kulttuurifilosofia
related: Naisen ja miehen asema yhteiskunnassa
related: URN:NBN:fi:au:hklj:384
related: Posti
related: Radio- ja televisiotoiminta
related: Radiotoiminta
related: URN:NBN:fi:au:hklj:384.42
related: Lehdistöoppi
related: URN:NBN:fi:au:hklj:473
related: Kulttuuriantropologia. Sosiaaliantropologia
related: Taiteen estetiikka. Taidefilosofia. Taidepsykologia. Taidesosiologia. Taidepolitiikka
related: Tatuointi. Kehotaide
scope note: Elämäntapojen ja vapaa-ajanvieton sosiologia yleensä Kultturisosiologia yleensä. Tiedon sosiologia yleensä Arvot, normit ja tabut sosiologian kannalta Eri alojen kulttuurisosiologia alan mukaisessa luokassa
scope note: Levnadsvanornas och fritidens sociologi i allmänhet Kultursociologi i allmänhet. Kunskapssociologi i allmänhet Värden, normer och tabun ur sociologins synvinkel Kultursociologi som rör olika områden klassificeras enligt område @sv

Kehitysmaiden taloudelliset olot
type: Class
type: Concept
subclass of: Kansainväliset taloudelliset suhteet. Maailmantalous
alternative label: Alikehitys, kehitysmaat (367.9)
alternative label: Aliravitsemus, kehitysmaat (367.9)
alternative label: Anti-Imperialismi, kehitysmaiden olot (367.9)
alternative label: Avustusjärjestöt, kehitysyhteistyö (367.9)
alternative label: Avustustoiminta, kehitysyhteistyö (367.9)
alternative label: Deprivaatio, kehitysmaiden olot (367.9)
alternative label: Elinolot, kehitysmaiden olot (367.9)
alternative label: Elintarvikeapu, kehitysmaat (367.9)
alternative label: Elintarvikepula, kehitysmaat (367.9)
alternative label: Globaaliset ongelmat, kehitysmaiden ongelmat (367.9)
alternative label: Henkilöapu, kehitysyhteistyö (367.9)
alternative label: Humanitaarinen apu, kehitysyhteistyö (367.9)
alternative label: Huono-osaisuus, kehitysmaiden olot (367.9)
alternative label: Imperialismi, kehitysmaiden olot (367.9)
alternative label: Jälkikolonialismi, kehitysmaat (367.9)
alternative label: Kansainvälinen apu, taloudellinen kehitysapu (367.9)
alternative label: Kansainvälinen yhteistyö, taloudellinen kehitysapu (367.9)
alternative label: Katastrofiapu, kehitysmaat (367.9)
alternative label: Katastrofiapu, taloudellinen kehitysapu (367.9)
alternative label: Katastrofit, nälänhätä, kehitysmaat (367.9)
alternative label: Katovuodet, kehitysmaiden olot (367.9)
alternative label: Kauppapolitiikka, kehitysmaat (367.9)
alternative label: Kauppatase, kehitysmaat (367.9)
alternative label: Kehittämishankkeet, kehitysyhteistyö (367.9)
alternative label: Kehittämisohjelmat, kehitysyhteistyö (367.9)
alternative label: Kehittämisprojektit, kehitysyhteistyö (367.9)
alternative label: Kehittämisstrategiat, kehitysmaat (367.9)
alternative label: Kehittämissuunnittelu, kehitysyhteistyö (367.9)
alternative label: Kehitysapu (367.9)
alternative label: Kehitysapupolitiikka (367.9)
alternative label: Kehitysmaaliike (367.9)
alternative label: Kehitysmaantiede, kehitysmaiden olot (367.9)
alternative label: Kehitysmaapolitiikka (367.9)
alternative label: Kehitysmaat, taloudelliset olot (367.9)
alternative label: Kehitysmaat, velkaantuminen (367.9)
alternative label: Kehitysohjelmat, kehitysyhteistyö (367.9)
alternative label: Kehitysstrategiat, kehitysmaat (367.9)
alternative label: Kehitystaloustiede (367.9)
alternative label: Kehitysteoriat, kehitystaloustiede (367.9)
alternative label: Kehitystutkimus, kehitysmaatutkimus (367.9)
alternative label: Kehitysyhteistyö (367.9)
alternative label: Kehitysyhteistyöpolitiikka (367.9)
alternative label: Kenttätyö, avustustyö, kehitysapu (367.9)
alternative label: Kerjäläiset, kehitysmaiden olot (367.9)
alternative label: Kilpailukyky, kehitysmaiden (367.9)
alternative label: Kolmas maailma, talous (367.9)
alternative label: Kolonialismi, kehitysmaat (367.9)
alternative label: Köyhtyminen, kehitysmaat (367.9)
alternative label: Köyhyys, kehitysmaissa (367.9)
alternative label: Liikakansoitus, kehitysmaiden olot (367.9)
alternative label: Maahantuojat, kehitysmaiden kauppa (367.9)
alternative label: Maahantuonti, kehitysmaiden kauppa (367.9)
broader: Kansainväliset taloudelliset suhteet. Maailmantalous
in scheme: URN:NBN:fi:au:hklj:
notation: 367.9
related: URN:NBN:fi:au:hklj:325
related: Kansainvälinen yhteistyö
related: URN:NBN:fi:au:hklj:326.2
related: Muiden maanosien valtioiden keskinäinen yhteistyö
related: Yhdistyneet Kansakunnat
related: Rauhankysymys. Rauhantutkimus
related: Vero-oikeus
related: Talousjärjestelmät
related: Suomen ulkomaankauppa
related: Maailmankauppa. Kansainväliset talousjärjestöt
related: Monikansalliset yritykset
related: URN:NBN:fi:au:hklj:368
related: Elintaso. Kulutus
related: Talousmaantiede. Taloushistoria
related: Ympäristönsuojelu. Luonnonsuojelu
related: Uhanalaiset lajit. Luonnonsuojelualueet
related: Maaperän, metsien ja soiden suojelu
related: Vesien suojelu
related: Ilman suojelu
related: Maatalouspolitiikka
scope note: Kehitysmaiden talousongelmia ja talouspolitiikkaa koskevat yleisteokset Kehitysmaiden asema maailmankaupassa Kehitysmaiden ja kehittyneiden maiden välinen kauppa Kehitysmaiden suhteet kansainvälisiin talousjärjestöihin ja monikansallisiin yrityksiin Kehitysmaita koskeva kauppa- ja talousmaantiede Kehitysmaiden velkaantuminen. Köyhyys ja nälänhätä kehitysmaissa Kehitysapu. Kehitysyhteistyö Tässä myös Suomen harjoittama kehitysapu ja kehitysyhteistyö Tiettyä kehitysmaan tuotetta koskevat teokset ko. tuotteen mukaisessa luokassa Tiettyyn erikoisalaan liittyvä kehitysyhteistyö alan mukaisessa luokassa
scope note: Allmänna verk som rör utvecklingsländernas ekonomiska problem och ekonomiska politik Utvecklingsländernas ställning i världshandeln Handeln mellan utvecklingsländer och utvecklade länder Utvecklingsländernas relationer till internationella ekonomiska organisationer och multinationella företag Handelsgeografi och ekonomisk geografi som rör utvecklingsländerna Skuldsättning i utvecklingsländerna. Fattigdom och svält i utvecklingsländerna Utvecklingsbistånd. Utvecklingssamarbete Hit också Finlands utvecklingsbistånd och utvecklingssamarbete Verk som rör enskilda produkter från utvecklingsländerna klassificeras enligt produkt Utvecklingssamarbete inom ett bestämt specialområde klassificeras enligt område @sv

Työväenliike
type: Class
type: Concept
subclass of: Järjestötoiminta. Kokoustekniikka
alternative label: Internationaalit, työväenliike (377.1)
alternative label: Joukkoliikkeet, työväenliike (377.1)
alternative label: Joukot, työväenliike (377.1)
alternative label: Kansainvälinen työväenliike (377.1)
alternative label: Kansainväliset liikkeet, työväenliike (377.1)
alternative label: Kansalaisliikkeet, työväenliike (377.1)
alternative label: Kansalaisosallistuminen, työväenliike (377.1)
alternative label: Kansalaisten osallistuminen, työväenliike (377.1)
alternative label: Kansalaistoiminta, työväenliike (377.1)
alternative label: Kansanliikkeet, työväenliike (377.1)
alternative label: Kansanrintama, työväenliike (377.1)
alternative label: Painostusryhmät, työväenliike (377.1)
alternative label: Palkkatyöläiset, työväenliike (377.1)
alternative label: Protestiliikkeet, työväenliike (377.1)
alternative label: Sosiaaliset liikkeet, työväenliike (377.1)
alternative label: Työläiset, työväenliike (377.1)
alternative label: Työväenjärjestöt (377.1)
alternative label: Työväenjärjestöt, työväenliike (377.1)
alternative label: Työväenjärjestöt, työväenyhdistykset (377.1)
alternative label: Työväenkulttuuri, työväenliike (377.1)
alternative label: Työväenliike (377.1)
alternative label: Työväenmuseot, työväenliike (377.1)
alternative label: Työväenperinne, työväenliike (377.1)
alternative label: Työväentalot, työväenliike (377.1)
alternative label: Työväenyhdistykset (377.1)
alternative label: Yhteiskunnalliset liikkeet, työväenliike (377.1)
alternative label: Arbetare, arbetarrörelsen (377.1) @sv
alternative label: Arbetarföreningar (377.1) @sv
alternative label: Arbetarkultur, arbetarrörelsen (377.1) @sv
alternative label: Arbetarmuseer, arbetarrörelsen (377.1) @sv
alternative label: Arbetarorganisationer (377.1) @sv
alternative label: Arbetarorganisationer, arbetarföreningar (377.1) @sv
alternative label: Arbetarorganisationer, arbetarrörelsen (377.1) @sv
alternative label: Arbetarrörelsen (377.1) @sv
alternative label: Arbetartradition, arbetarrörelsen (377.1) @sv
alternative label: Folkets hus, arbetarrörelsen (377.1) @sv
alternative label: Folkfronten, arbetarrörelsen (377.1) @sv
alternative label: Folkrörelser, arbetarrörelsen (377.1) @sv
alternative label: Internationaler, arbetarrörelsen (377.1) @sv
alternative label: Internationella arbetarrörelsen (377.1) @sv
alternative label: Internationella rörelser, arbetarrörelsen (377.1) @sv
alternative label: Lönearbetare, arbetarrörelsen (377.1) @sv
alternative label: Massor, arbetarrörelsen (377.1) @sv
alternative label: Massrörelser, arbetarrörelsen (377.1) @sv
alternative label: Medborgaraktivitet, arbetarrörelsen (377.1) @sv
alternative label: Medborgardeltagande, arbetarrörelsen (377.1) @sv
alternative label: Medborgarinflytande, arbetarrörelsen (377.1) @sv
alternative label: Medborgarrörelser, arbetarrörelsen (377.1) @sv
alternative label: Proteströrelser, arbetarrörelsen (377.1) @sv
alternative label: Påtryckningsgrupper, arbetarrörelsen (377.1) @sv
alternative label: Samhälleliga rörelser, arbetarrörelsen (377.1) @sv
alternative label: Sociala rörelser, arbetarrörelsen (377.1) @sv
broader: Järjestötoiminta. Kokoustekniikka
in scheme: URN:NBN:fi:au:hklj:
notation: 377.1
preferred label: Workers' movement @en
preferred label: Arbetarrörelsen @sv
related: URN:NBN:fi:au:hklj:060
related: URN:NBN:fi:au:hklj:061
related: URN:NBN:fi:au:hklj:063
related: Sisäpolitiikka. Puolueet
related: Suomi
related: Yhteiskunnan rakenne
related: Alueellinen sosiologia. Maassamuutto
related: Työn sosiologia
related: Pääoma. Työ. Luonnonvarat
related: URN:NBN:fi:au:hklj:371
related: Työ sosiaalipoliittisena kysymyksenä
related: Työolot
related: Työsuojelu
related: Työllisyys. Työttömyys. Työvoimapalvelu
related: Yhteiskunnalliset aatesuunnat. Poliittiset ideologiat
related: Sosialismi. Kommunismi
related: URN:NBN:fi:au:hklj:377.109
related: Työmarkkinajärjestöt
scope note: Eri maiden työväenliikettä koskevat yleisteokset Kansainvälinen työväenliike yleensä Työväenyhdistykset
scope note: Allmänna verk som rör arbetarrörelsen i olika länder Den internationella arbetarrörelsen i allmänhet Arbetarföreningarna @sv

Vesi- ja ilmaliikenne
type: Class
type: Concept
subclass of: URN:NBN:fi:au:hklj:380
alternative label: Ajettavuus, liikenne (385 ... 387 +)
alternative label: Ajokelpoisuus, liikenne (385 ... 387 +)
alternative label: Charter-liikenne, maaliikenne (385 ... 387 +)
alternative label: Haitalliset aineet, kuljetus, liikenne (385 ... 386 +)
alternative label: Haitta-aineet, kuljetus, liikenne (385 ... 386 +)
alternative label: Infrastruktuurit, liikenne (385 ... 386 +)
alternative label: Kansainvälinen kuljetus, liikenne (385 ... 386 +)
alternative label: Käyttäjät, liikennevälineet (385 ... 386 +)
alternative label: Käyttötutkimus, liikennevälineet (385 ... 386 +)
alternative label: Liikenneala (385 ... 387 +)
alternative label: Liikennealueet, liikenne, asema-alueet, linja-autoasemat (385 ... 387 +)
alternative label: Liikennealueet, liikenne, asema-alueet, rautatieasemat (385 ... 387 +)
alternative label: Liikennealueet, liikenne, kadut ja tiet (385 ... 387 +)
alternative label: Liikennealueet, liikenne, pysäköintialueet (385 ... 387 +)
alternative label: Liikennealueet, liikenne, rautatiet (385 ... 387 +)
alternative label: Liikennehallinto, rautatiehallinto (385 ... 387 +)
alternative label: Liikennehallinto, tiehallinto (385 ... 387 +)
alternative label: Liikennesektori (385 ... 387 +)
alternative label: Myrkylliset aineet, kuljetus (385 ... 386 +)
alternative label: Myrkyt, kuljetus (385 ... 386 +)
alternative label: Palavat nesteet, vaaralliset aineet, kuljetus (385 ... 386 +)
alternative label: Syttyvät nesteet, vaaralliset aineet, kuljetus (385 ... 386 +)
alternative label: Vaaralliset aineet, kuljetus, liikenne (385 ... 386 +)
alternative label: Användare, trafikmedel (385 ... 386 +) @sv
alternative label: Bruksundersökning, färdmedel (385 ... 386 +) @sv
alternative label: Brännbara vätskor, farliga ämnen, transport (385 ... 386 +) @sv
alternative label: Chartertrafik, landtrafik (385 ... 387 +) @sv
alternative label: Farliga ämnen, transport, trafik (385 ... 386 +) @sv
alternative label: Gifter, transport (385 ... 386 +) @sv
alternative label: Giftiga ämnen, transport (385 ... 386 +) @sv
alternative label: Infrastruktur, trafik (385 ... 386 +) @sv
alternative label: Internationell transport, trafik (385 ... 386 +) @sv
alternative label: Körbarhet, trafik (385 ... 387 +) @sv
alternative label: Lättantändliga vätskor, farliga ämnen, transport (385 ... 386 +) @sv
alternative label: Skadeämnen, transport, trafik (385 ... 386 +) @sv
alternative label: Skadliga ämnen, transport, trafik (385 ... 386 +) @sv
alternative label: Trafikbranschen (385 ... 387 +) @sv
alternative label: Trafikförvaltning, järnvägsförvaltning (385 ... 387 +) @sv
alternative label: Trafikförvaltning, vägförvaltning (385 ... 387 +) @sv
alternative label: Trafikområden, trafik, gator och vägar (385 ... 387 +) @sv
alternative label: Trafikområden, trafik, järnvägar (385 ... 387 +) @sv
alternative label: Trafikområden, trafik, parkeringsområden (385 ... 387 +) @sv
alternative label: Trafikområden, trafik, stationsområden, busstationer (385 ... 387 +) @sv
alternative label: Trafikområden, trafik, stationsområden, järnvägsstationer (385 ... 387 +) @sv
broader: URN:NBN:fi:au:hklj:380
in scheme: URN:NBN:fi:au:hklj:
narrower: Vesiliikenne
narrower: Ilmaliikenne. Ilmailu
notation: 386
preferred label: Sea and air traffic @en
preferred label: Sjö- och lufttrafik @sv
related: URN:NBN:fi:au:hklj:320
related: URN:NBN:fi:au:hklj:332.2
related: URN:NBN:fi:au:hklj:342
related: URN:NBN:fi:au:hklj:624
related: Vesikulkuneuvot
related: Laivat. Laivanrakennus
related: URN:NBN:fi:au:hklj:625.72
related: Muut vesikulkuneuvot
related: Lentokoneet
related: Kemian teollisuus
related: Öljy. Maakaasu
related: Materiaalitoiminnot. Logistiikka
related: Lento-opetus. Lentotaito
related: Merenkulkuoppi
related: URN:NBN:fi:au:hklj:721
related: Kaupunkisuunnittelu. Kaupunkiarkkitehtuuri
scope note: Teokset, jotka koskevat sekä vesi- että ilmaliikennettä Jos teos koskee sekä vesi- tai ilmaliikennettä että vesi- tai ilmakulkuneuvoja, on etusija luokalla 386+ Tässä ja alaluokissa huoltoasematoiminta ja huolinta muun kuin maaliikenteen kannalta Vaarallisten aineiden kuljetus muuten kuin maitse
scope note: Verk som handlar om både sjötrafik och lufttrafik Om verket handlar om både sjö- eller lufttrafik och vatten- eller luftfarkoster, ges företräde åt klass 386+ Hit och till underklasserna bensinstationer och spedition ur andra synvinklar än landtrafikens Transport av farliga ämnen på andra sätt än till lands @sv

Eläintarhat
type: Class
type: Concept
subclass of: URN:NBN:fi:au:hklj:590
alternative label: Akvaariot, eläintarhat (590.85)
alternative label: Delfinaariot (590.85)
alternative label: Eläimet, eläintarhat (590.85)
alternative label: Eläinhoitajan työ, eläintarhat (590.85)
alternative label: Eläinpuistot (590.85)
alternative label: Eläintarhat (590.85)
alternative label: Korkeasaari (590.85)
alternative label: Terraariot, eläintarhat (590.85)
alternative label: Akvarier, djurparker (590.85) @sv
alternative label: Delfinarier (590.85) @sv
alternative label: Djur, djurparker (590.85) @sv
alternative label: Djurparker (590.85) @sv
alternative label: Djurskötarens arbete, djurparker (590.85) @sv
alternative label: Högholmen (590.85) @sv
alternative label: Terrarier, djurparker (590.85) @sv
alternative label: Zoon (590.85) @sv
broader: URN:NBN:fi:au:hklj:590
in scheme: URN:NBN:fi:au:hklj:
notation: 590.85
preferred label: Zoological gardens @en
preferred label: Zoologiska trädgårdar @sv
related: Uhanalaiset lajit. Luonnonsuojelualueet
related: URN:NBN:fi:au:hklj:508.86
related: Kalat
related: URN:NBN:fi:au:hklj:654
related: Hevoset
related: Nautaeläimet
related: Vuohet ja lampaat
related: Siat
related: Siipikarja
related: Turkiseläimet
related: Porot
related: Hyönteiset
related: Lemmikkieläimet
related: Koirat
related: Kissat
related: Pikkunisäkkäät
related: Häkkilinnut
related: Akvaariot
related: Metsästys
related: Eläinlääketiede
scope note: Eläintarhat. Eläinpuistot. Delfinaariot. Julkiset akvaariot Eläinten hoito eläintarhoissa Eläinten hankkiminen eläintarhoihin Luonnonvaraisten eläinten tarhaus yleensä
scope note: Zoologiska trädgårdar. Djurparker. Delfinarier. Allmänna akvarier Skötsel av djur i zoologiska trädgårdar Anskaffning av djur till zoologiska trädgårdar Uppfödning av vilda djur i allmänhet @sv

Tekstinkäsittelyohjelmat
type: Class
type: Concept
subclass of: URN:NBN:fi:au:hklj:627.73
alternative label: Korjausluku, tekstinkäsittely (627.732)
alternative label: Oikoluku, tekstinkäsittelyohjelmat (627.732)
alternative label: Tekstinkäsittely (627.732)
alternative label: Tekstinkäsittelyohjelmat (627.732)
alternative label: Tekstinvalmistus, tekstinkäsittely (627.732)
alternative label: Korrekturläsning, korjausluku, ordbehandlingsprogram (627.732) @sv
alternative label: Korrekturläsning, oikoluku, ordbehandlingsprogram (627.732) @sv
alternative label: Textbehandling (627.732) @sv
alternative label: Textbehandlingsprogram (627.732) @sv
alternative label: Textproduktion, textbehandling (627.732) @sv
broader: URN:NBN:fi:au:hklj:627.73
in scheme: URN:NBN:fi:au:hklj:
notation: 627.732
preferred label: Word processing programs @en
preferred label: Textbehandlingsprogram @sv
related: Konekirjoitus
related: Kustannustoimi. Kirjakauppa
related: Kirjapainotaito. Graafinen teollisuus
related: LOGIIKKA
related: Logistiikka. Looginen kalkyyli
related: URN:NBN:fi:au:hklj:182
related: URN:NBN:fi:au:hklj:332.1
related: URN:NBN:fi:au:hklj:384
related: Sähköoppi. Magnetismi
related: URN:NBN:fi:au:hklj:620.88
related: Systeemityö
related: Ohjelmointi. Ohjelmointikielet
related: Säätö- ja systeemitekniikka. Teollinen automaatio
related: Elektroniikka
related: URN:NBN:fi:au:hklj:667.7
related: URN:NBN:fi:au:hklj:667.71
related: Toimistotyö
related: URN:NBN:fi:au:hklj:681
related: Toimistokoneet
related: Pelit

Taulukkolaskentaohjelmat
type: Class
type: Concept
subclass of: URN:NBN:fi:au:hklj:627.73
alternative label: Excel, taulukkolaskentaohjelma (627.733)
alternative label: Laskelmat, laskentaohjelmat (627.733)
alternative label: Laskeminen, laskentaohjelmat (627.733)
alternative label: Laskenta, laskentaohjelmat (627.733)
alternative label: Laskentaohjelmat (627.733)
alternative label: Lotus 1-2-3, taulukkolaskentaohjelma (627.733)
alternative label: Ruudukkolaskenta, taulukkolaskentaohjelmat (627.733)
alternative label: SPSS, tilasto-ohjelma (627.733)
alternative label: Taulukkolaskenta, laskentaohjelmat (627.733)
alternative label: Taulukkolaskentaohjelmat (627.733)
alternative label: Excel, kalkyleringsprogram (627.733) @sv
alternative label: Kalkyl, räkningsprogram (627.733) @sv
alternative label: Kalkyler, räkningsprogram (627.733) @sv
alternative label: Kalkylering, räkningsprogram (627.733) @sv
alternative label: Kalkylprogram (627.733) @sv
alternative label: Lotus 1-2-3, kalkyleringsprogram (627.733) @sv
alternative label: Matriskalkylering, kalkylprogram (627.733) @sv
alternative label: Räkning, räkningsprogram (627.733) @sv
alternative label: Räkningsprogram (627.733) @sv
alternative label: SPSS, statistikprogram (627.733) @sv
broader: URN:NBN:fi:au:hklj:627.73
in scheme: URN:NBN:fi:au:hklj:
notation: 627.733
preferred label: Spreadsheet programs @en
preferred label: Kalkylprogram @sv
related: Kustannustoimi. Kirjakauppa
related: LOGIIKKA
related: Logistiikka. Looginen kalkyyli
related: URN:NBN:fi:au:hklj:182
related: Teoria. Tutkimusmenetelmät. Tilastomatematiikka
related: URN:NBN:fi:au:hklj:332.1
related: URN:NBN:fi:au:hklj:384
related: Matematiikan taulukot ja kaavakokoelmat. Laskumenetelmät
related: Sähköoppi. Magnetismi
related: URN:NBN:fi:au:hklj:620.88
related: Systeemityö
related: Ohjelmointi. Ohjelmointikielet
related: Säätö- ja systeemitekniikka. Teollinen automaatio
related: Elektroniikka
related: URN:NBN:fi:au:hklj:667.7
related: URN:NBN:fi:au:hklj:667.71
related: Toimistotyö
related: URN:NBN:fi:au:hklj:681
related: Toimistokoneet
related: Pelit

METALLITEOLLISUUS. PUUNJALOSTUSTEOLLISUUSSÄHKÖTEKNINEN TEOLLISUUS TEKSTIILI- JA NAHKATEOLLISUUS
type: Class
type: Concept
subclass of: SOVELLETUT TIETEET
broader: SOVELLETUT TIETEET
in scheme: URN:NBN:fi:au:hklj:
narrower: URN:NBN:fi:au:hklj:631
narrower: Puuteollisuus
narrower: Paperi- ja selluloosateollisuus
narrower: Tekstiili- ja vaatetusteollisuus
narrower: Nahka- ja jalkineteollisuus
notation: 630
preferred label: METAL INDUSTRY. WOOD PROCESSING INDUSTRY ELECTROTECHNOLOGY INDUSTRYTEXTILE AND LEATHER INDUSTRY @en
preferred label: METALLINDUSTRI. TRÄFÖRÄDLINGSINDUSTRI. ELEKTROTEKNISK INDUSTRI. TEXTIL- OCH LÄDERINDUSTRI @sv
related: URN:NBN:fi:au:hklj:620
related: URN:NBN:fi:au:hklj:620.09
related: Liiketalouden hallinto ja organisaatio
related: Johtamisen tekniikka ja menetelmät
related: Laskentatoimi. Rahoitus. Talousarviot
related: Työntutkimukset. Työanalyysi
related: Toimistotyö
related: Henkilöstöpolitiikka
scope note: Teokset, jotka koskevat useampaa seuraavista teollisuuden aloista: metalliteollisuus, puunjalostusteollisuus, sähkötekninen teollisuus, tekstiili- ja nahkateollisuus Jos teos kuitenkin painottuu johonkin alaan, on etusija alan mukaisella luokalla
scope note: Verk som behandlar flera av följande områden: metallindustri, träförädlingsindustri, elektroteknisk industri, textilindustri och läderindustri Om något område trots allt dominerar i verket ges företräde åt klassen för det området @sv

Nahka- ja jalkineteollisuus
type: Class
type: Concept
subclass of: METALLITEOLLISUUS. PUUNJALOSTUSTEOLLISUUSSÄHKÖTEKNINEN TEOLLISUUS TEKSTIILI- JA NAHKATEOLLISUUS
alternative label: Ammattijalkineet, jalkineteollisuus (639)
alternative label: Chinchillat, turkikset (639)
alternative label: Jalkineet, jalkineteollisuus (639)
alternative label: Jalkineteollisuus (639)
alternative label: Kalannahka, nahkateollisuus (639)
alternative label: Kengät, kenkäteollisuus (639)
alternative label: Kenkäkaupat (639)
alternative label: Kenkäteollisuus (639)
alternative label: Käsilaukut, nahkateollisuus (639)
alternative label: Käsineet, nahkateollisuus (639)
alternative label: Lapaset, nahkateollisuus (639)
alternative label: Laukut, nahkateollisuus (639)
alternative label: Matkalaukut, nahkateollisuus (639)
alternative label: Nahka, nahkateollisuus (639)
alternative label: Nahkateollisuus (639)
alternative label: Nahkatuotteet (639)
alternative label: Nahkavaatteet, nahkateollisuus (639)
alternative label: Nailon, tekstiiliteollisuus (639)
alternative label: Napit, vaatetusteollisuus (639)
alternative label: Nutria, turkisteollisuus (639)
alternative label: Parkitus (639)
alternative label: Piisami, turkisteollisuus (639)
alternative label: Puukengät, kenkäteollisuus (639)
alternative label: Rämemajava, turkisteollisuus (639)
alternative label: Sinsillat, turkikset (639)
alternative label: Soljet, jalkineteollisuus (639)
alternative label: Soljet, nahkateollisuus (639)
alternative label: Taljat, turkisteollisuus ja -kauppa (639)
alternative label: Tekonahka (639)
alternative label: Tekonahkateollisuus (639)
alternative label: Tekonahkavaatteet, nahkateollisuus (639)
alternative label: Tekoturkikset (639)
alternative label: Tossut, jalkineteollisuus (639)
alternative label: Turkiskauppa (639)
alternative label: Turkisteollisuus (639)
alternative label: Turkistuotteet (639)
alternative label: Turkit, teollisesti valmistetut (639)
alternative label: Turkki, eläimet, turkiskauppa (639)
alternative label: Työjalkineet, jalkineteollisuus (639)
alternative label: Vuodat, nahka, jalkineteollisuus (639)
alternative label: Vuodat, nahkateollisuus (639)
alternative label: Vuodat, nahkatuotteet (639)
alternative label: Vuotateollisuus (639)
alternative label: Vyöt, nahkateollisuus (639)
alternative label: Arbetsskor, skoindustri (639) @sv
alternative label: Bisamråtta, pälsindustri (639) @sv
alternative label: Bälten, läderindustri (639) @sv
alternative label: Chinchilla, pälsar (639) @sv
alternative label: Fiskskinn, läderindustri (639) @sv
alternative label: Fällar, pälsindustri och -handel (639) @sv
alternative label: Garvning (639) @sv
alternative label: Handskar, läderindustri (639) @sv
broader: METALLITEOLLISUUS. PUUNJALOSTUSTEOLLISUUSSÄHKÖTEKNINEN TEOLLISUUS TEKSTIILI- JA NAHKATEOLLISUUS
in scheme: URN:NBN:fi:au:hklj:
notation: 639
related: Esineellinen kulttuuri
related: URN:NBN:fi:au:hklj:473
related: URN:NBN:fi:au:hklj:473.1
related: URN:NBN:fi:au:hklj:475
related: URN:NBN:fi:au:hklj:475.1
related: URN:NBN:fi:au:hklj:476
related: URN:NBN:fi:au:hklj:476.1
related: URN:NBN:fi:au:hklj:476.11
related: URN:NBN:fi:au:hklj:476.12
related: URN:NBN:fi:au:hklj:476.5
related: URN:NBN:fi:au:hklj:476.6
related: URN:NBN:fi:au:hklj:476.7
related: URN:NBN:fi:au:hklj:476.8
related: Tekstiili- ja vaatetusteollisuus
related: Turkiseläimet
related: Porot
related: Pukeutuminen. Kauneudenhoito
related: Ompelu
related: Nahkatyöt. Turkistyöt
related: Muodin historia
scope note: Nahka- ja jalkineteollisuuden liiketalous, tuotantomenetelmät, rationalisointi, työt, prosessit, koneet, raaka-aineet, tuotanto ja tuotteiden kauppa Tekonahka-, turkis- ja vuotateollisuus. Nahkojen, turkisten ja vuotien kauppa Nahkavaatteet ja -asusteet, turkit, jalkineet ja kengät, niiden teollinen valmistus ja kauppa Nahka- ja tekonahkaesineet, niiden teollinen valmistus ja kauppa
scope note: Företagsekonomi, produktionsmetoder, rationalisering, arbete, processer, maskiner, råmaterial, produktion och handel inom läder- och skoindustri Industriell tillverkning av konstläder Pälsvaruindustri. Industriell beredning av hudar. Handel med skinn, pälsar och hudar Industriell tillverkning av och handel med läderplagg och skinnplagg, pälsar och skor Industriell tillverkning av och handel med föremål av läder eller konstläder @sv

Koristekasvit
type: Class
type: Concept
subclass of: Puutarhanhoito. Hyötykasvit. Huone- ja koristekasvit
alternative label: Auringonkukka, koristekasvit (653.1)
alternative label: Havupensaat, koristepensaat (653.1)
alternative label: Hybridit, koristekasvit (653.1)
alternative label: Jalava, puutarhanhoito (653.1)
alternative label: Jalopuut, puutarhanhoito (653.1)
alternative label: Jalostaminen, koristekasvit (653.1)
alternative label: Jalostus, koristekasvit (653.1)
alternative label: Kaksivuotiset kasvit, koristekasvit (653.1)
alternative label: Kasvien jalostus, koristekasvit (653.1)
alternative label: Kasviharrastus, koristekasvit (653.1)
alternative label: Kasvinjalostus, koristekasvit (653.1)
alternative label: Kattopuutarhat, koristekasvit (653.1 +)
alternative label: Kivikkokasvit (653.1)
alternative label: Koristekasvit, puutarhakasvit (653.1)
alternative label: Koristepensaat (653.1)
alternative label: Koristepuut, puutarhanhoito (653.1)
alternative label: Kuivuudenkestävyys, koristekasvit (653.1)
alternative label: Kukat, koristekasvit (653.1)
alternative label: Kukinta, koristekasvit (653.1)
alternative label: Kukkasipulit (653.1)
alternative label: Kukkien viljely, koristekasvit (653.1)
alternative label: Köynnöskasvit, puutarhakasvit (653.1)
alternative label: Lajimääritys, koristekasvit (653.1)
alternative label: Lajinmääritys, koristekasvit (653.1)
alternative label: Leikkaus, puiden ja pensaiden (653.1)
alternative label: Leikkokukat, viljely (653.1)
alternative label: Luonto-oppaat, metsästys (653.1)
alternative label: Maanpeitekasvit, koristekasvit (653.1)
alternative label: Maanpeittokasvit, koristekasvit (653.1)
alternative label: Maatiaislajikkeet, koristekasvit (653.1)
alternative label: Mehikasvit, koristekasvit (653.1)
alternative label: Monivuotiset kasvit, koristekasvit (653.1)
alternative label: Määritys, koristekasvit (653.1)
alternative label: Pensaat, koristepensaat (653.1)
alternative label: Pensasaidat, hoito (653.1)
alternative label: Perennat, koristekasvit (653.1)
alternative label: Perinnekasvit, koristekasvit (653.1)
alternative label: Pihlaja, koristepuut (653.1)
alternative label: Puutarhakasvit, koristekasvit (653.1)
alternative label: Risteytys, koristekasvit (653.1)
alternative label: Rodut, jalostus, koristekasvit (653.1)
alternative label: Ruusut, puutarhanhoito (653.1)
alternative label: Sipulikasvit, koristekasvit (653.1)
alternative label: Sipulit, koristekasvit (653.1)
alternative label: Tammi, koristepuut (653.1)
alternative label: Trimmaus, koristekasvit (653.1)
alternative label: Vaahtera, koristepuut (653.1)
alternative label: Viherkasvit, puutarhakasvit (653.1)
alternative label: Yksivuotiset kasvit, koristekasvit (653.1)
alternative label: Alm, trädgårdsskötsel (653.1) @sv
alternative label: Artbestämning, prydnadsväxter (653.1) @sv
alternative label: Barrbuskar, prydnadsbuskar (653.1) @sv
broader: Puutarhanhoito. Hyötykasvit. Huone- ja koristekasvit
in scheme: URN:NBN:fi:au:hklj:
notation: 653.1
related: Antroposofia
related: URN:NBN:fi:au:hklj:342
related: URN:NBN:fi:au:hklj:576
related: KASVITIEDE
related: Systemaattinen kasvitiede
related: Putkilokasvit
related: Hyönteiset
related: Kivihiili. Turve
related: URN:NBN:fi:au:hklj:649.91
related: Maatalouspolitiikka
related: URN:NBN:fi:au:hklj:650.2
related: URN:NBN:fi:au:hklj:651
related: Maanviljely
related: Hyötykasvit
related: Huonekasvit
related: URN:NBN:fi:au:hklj:657
related: Rakennusten erillistilat
related: URN:NBN:fi:au:hklj:691.12
related: Luonnon- ja kulttuurimaiseman suunnittelu
related: Kukkien asettelu ja sidonta. Ikebana
scope note: Koristekasvit, niiden viljely puutarha-, kasvihuone- ja peltoviljelyn kannalta Koristekasvioppaat Kukkien viljely. Koristepuut ja -pensaat, niiden viljely Jos teoksessa on sekä puutarhassa viljeltäviä koristekasveja että huonekasveja, on etusija luokalla 653.1
scope note: Prydnadsväxter, odling av dem i trädgårdar, växthus och på åker Handledningar som rör prydnadsväxter Blomsterodling. Prydnadsträd och prydnadsbuskar, odling av dem Om verket handlar om både trädgårdsodlade prydnadsväxter och rumsväxter, ges företräde åt klass 653.1 @sv

Turkiseläimet
type: Class
type: Concept
subclass of: URN:NBN:fi:au:hklj:654
alternative label: Chinchillat, turkiseläimet (654.6)
alternative label: Kaniinit, turkistarhaus (654.6)
alternative label: Kettu, turkistarhaus (654.6)
alternative label: Minkki, turkistarhaus (654.6)
alternative label: Nutria, turkistarhaus (654.6)
alternative label: Rämemajava, turkistarhaus (654.6)
alternative label: Sinsillat, turkiseläimet (654.6)
alternative label: Tarhaus, turkistarhaus (654.6)
alternative label: Turkiseläimet, turkistarhaus (654.6)
alternative label: Turkistalous (654.6)
alternative label: Turkistarhat, turkistarhaus (654.6)
alternative label: Turkistarhaus (654.6)
alternative label: Turkki, eläimet, turkistalous (654.6)
alternative label: Chinchilla, pälsdjur (654.6) @sv
alternative label: Farmning, pälsdjursuppfödning (654.6) @sv
alternative label: Harmöss, pälsdjur (654.6) @sv
alternative label: Kaniner, pälsdjursuppfödning (654.6) @sv
alternative label: Mink, pälsdjursuppfödning (654.6) @sv
alternative label: Nutria, pälsdjursuppfödning (654.6) @sv
alternative label: Päls, pälsdjursuppfödning (654.6) @sv
alternative label: Pälsdjur, pälsdjursuppfödning (654.6) @sv
alternative label: Pälsdjursfarmer, pälsdjursuppfödning (654.6) @sv
alternative label: Pälsdjursuppfödning (654.6) @sv
alternative label: Pälsnäring (654.6) @sv
alternative label: Räv, pälsdjursuppfödning (654.6) @sv
alternative label: Sumpbäver, pälsdjursuppfödning (654.6) @sv
broader: URN:NBN:fi:au:hklj:654
in scheme: URN:NBN:fi:au:hklj:
notation: 654.6
preferred label: Fur animals @en
preferred label: Pälsdjur @sv
related: URN:NBN:fi:au:hklj:576
related: URN:NBN:fi:au:hklj:590
related: Eläintarhat
related: Eläinsuojelu
related: Systemaattinen eläintiede
related: Nisäkkäät
related: Eläinten vetämät kulkuneuvot
related: Nahka- ja jalkineteollisuus
related: URN:NBN:fi:au:hklj:649.91
related: Maatalouspolitiikka
related: URN:NBN:fi:au:hklj:650.2
related: URN:NBN:fi:au:hklj:651
related: Pikkunisäkkäät
related: URN:NBN:fi:au:hklj:657
related: Metsästys
related: Eläinlääketiede
related: Rakennusten erillistilat
related: URN:NBN:fi:au:hklj:687.4
related: URN:NBN:fi:au:hklj:691.13
related: Nahkatyöt. Turkistyöt
scope note: Turkiseläimet ja niiden hoito. Turkiseläinlajit ja -rodut Kanit, ketut, minkit ja muut nisäkkäät turkiseläiminä Turkistarhaus. Turkistarhat. Turkistalous Turkiseläinten sairaudet ja niiden hoito
scope note: Pälsdjur och pälsdjursskötsel. Pälsdjursarter och pälsdjursraser Hardjur, räv, mink och andra däggdjur som pälsdjur Pälsdjursuppfödning. Pälsdjursfarmer. Pälsnäring Pälsdjurens sjukdomar och behandling av dem @sv

Johtamisen tekniikka ja menetelmät
type: Class
type: Concept
subclass of: Liiketalouden hallinto ja organisaatio
alternative label: Aineeton omaisuus, johtaminen (674.1)
alternative label: Aineeton pääoma, johtaminen (674.1)
alternative label: Aineeton varallisuus, johtaminen (674.1)
alternative label: Alaiset, johtaminen (674.1)
alternative label: Alaiset, kehityskeskustelut (674.1)
alternative label: Ammatillinen tausta, johtamistaito (674.1)
alternative label: Ammattitausta, johtamistaito (674.1)
alternative label: Ammattiura, johtamistaito (674.1)
alternative label: Arvovalta, johtaminen (674.1)
alternative label: Auktoriteetti, johtaminen (674.1)
alternative label: Autoritaarisuus, johtaminen (674.1)
alternative label: Bonukset, johtamistaito (674.1)
alternative label: Business intelligence (674.1)
alternative label: Competitive intelligence (674.1)
alternative label: Delegointi, johtaminen (674.1)
alternative label: Esimiehet, johtamistaito (674.1)
alternative label: Esimies-alaiskeskustelut (674.1)
alternative label: Esimiestaidot, johtamistaito (674.1)
alternative label: Esimiestyö, johtamistaito (674.1)
alternative label: Etäjohtaminen (674.1)
alternative label: Hallintopäätökset, johtamistaito (674.1)
alternative label: Hallintopäätökset, yritysorganisaatio (674.1)
alternative label: Henkilöstöjohtaminen, johtamistaito (674.1)
alternative label: Hotellinjohtajat, johtamistaito (674.1)
alternative label: Johtajakoulutus (674.1)
alternative label: Johtajasopimukset (674.1)
alternative label: Johtajat, johtamistaito (674.1)
alternative label: Johtajuus, johtamistaito (674.1)
alternative label: Johtaminen, johtamistaito (674.1)
alternative label: Johtamisjärjestelmät (674.1)
alternative label: Johtamiskoulutus (674.1)
alternative label: Johtamismenetelmät (674.1)
alternative label: Johtamissopimukset (674.1)
alternative label: Johtamistaito (674.1)
alternative label: Johtoryhmät (674.1)
alternative label: Kannustimet, johtamistaito (674.1)
alternative label: Kannustus, johtamistaito (674.1)
alternative label: Karismaattisuus, johtamistaito (674.1)
alternative label: Kehityskeskustelut (674.1)
alternative label: Keskijohto (674.1)
alternative label: Knowledge management (674.1)
alternative label: Konsernijohtajat, johtamistaito (674.1)
alternative label: Käskyvalta, johtaminen (674.1)
alternative label: Laatu, laatujohtaminen (674.1)
alternative label: Laatujohtaminen (674.1)
alternative label: Laatujärjestelmät, laatujohtaminen (674.1)
alternative label: Lanseeraus, sisäinen markkinointi (674.1)
alternative label: Lean-ajattelu, johtaminen (674.1)
alternative label: Lean-johtaminen (674.1)
alternative label: Lean-toiminta, johtaminen (674.1)
alternative label: Liiketoimintatiedon hallinta (674.1)
alternative label: Liikkeenjohto (674.1)
broader: Liiketalouden hallinto ja organisaatio
in scheme: URN:NBN:fi:au:hklj:
notation: 674.1
related: Sosiaalipsykologia. Kulttuuripsykologia
related: Ihmissuhteiden psykologia
related: Sovellettu psykologia
related: URN:NBN:fi:au:hklj:340
related: Organisaatioiden ja laitosten sosiologia
related: Työn sosiologia
related: URN:NBN:fi:au:hklj:360
related: URN:NBN:fi:au:hklj:363
related: URN:NBN:fi:au:hklj:368
related: Tuotanto. Tuottavuus
related: Järjestötoiminta. Kokoustekniikka
related: Ympäristönsuojelu. Luonnonsuojelu
related: URN:NBN:fi:au:hklj:620
related: URN:NBN:fi:au:hklj:627.751
related: METALLITEOLLISUUS. PUUNJALOSTUSTEOLLISUUSSÄHKÖTEKNINEN TEOLLISUUS TEKSTIILI- JA NAHKATEOLLISUUS
related: KEMIAN TEOLLISUUS. KAIVOSTEOLLISUUS
related: URN:NBN:fi:au:hklj:650.2
related: Työntutkimukset. Työanalyysi
related: Henkilöstöpolitiikka
related: URN:NBN:fi:au:hklj:675
scope note: Johtamisen tekniikka ja menetelmät sekä yksityisen että julkisen yrityksen tai organisaation kannalta yleensä Johtamistaito yleensä. Sisäinen markkinointi yleensä Tavoite-, tulos- ja laatu- ja ympäristöjohtaminen yleensä Tulosvastuu yleensä Johtamisen ja alaisten käsittelyn psykologia yleensä Työnjohtaminen, päätöksenteko ja delegointi yleensä Erikoisalojen yrityksiä ja organisaatioita koskevat teokset alan mukaisessa luokassa
scope note: Teknik och metoder för ledarskap inom privata och offentliga företag eller organisationer i allmänhet. Ledarförmåga i allmänhet. Intern marknadsföring i allmänhet Målstyrning, resultatorienterad styrning, kvalitetsstyrning, kunskapsledning och miljöledarskap i allmänhet Resultatansvar i allmänhet Psykologiska aspekter på ledarskap och bemötande av underordnade i allmänhet Arbetsledning, beslutsfattande och delegering i allmänhet Verk som handlar om företag och organisationer inom specialområden klassificeras enligt område @sv

Mainonta. Kuluttajanvalistus
type: Class
type: Concept
subclass of: LIIKETALOUS. KAUPPA. MARKKINOINTI. LIIKENNEOPETUS
alternative label: Inhimilliset tekijät, organisaatioviestintä (676)
alternative label: Integroitu raportointi, yritysviestintä (676)
alternative label: Kriisiviestintä, organisaatioviestintä (676)
alternative label: Kriisiviestintä, yritysviestintä (676)
alternative label: Lobbarit, suhdetoiminta (676 +)
alternative label: Lobbaus, suhdetoiminta (676 +)
alternative label: Organisaatioviestintä (676)
alternative label: PR-toiminta (676)
alternative label: PR-toiminta, suhdetoiminta (676)
alternative label: Suhdetoiminta (676)
alternative label: Suhdetoiminta, PR-toiminta (676)
alternative label: Tiedotus, yritykset (676)
alternative label: Ulkoinen tiedotus (676)
alternative label: Uutuustiedotteet, yritykset (676)
alternative label: Yhteisöviestintä (676)
alternative label: Yrityskuva, yritysviestintä (676)
alternative label: Yritysviestintä (676)
alternative label: Extern information (676) @sv
alternative label: Företagsbild, företagskommunikation (676) @sv
alternative label: Företagskommunikation (676) @sv
alternative label: Informering, företag (676) @sv
alternative label: Integrerad rapportering, företagskommunikation (676) @sv
alternative label: Kriskommunikation, företagskommunikation (676) @sv
alternative label: Lobbare, PR-verksamhet (676 +) @sv
alternative label: Lobbying, PR-verksamhet (676 +) @sv
alternative label: Mänskliga faktorer, organisationskommunikation (676) @sv
alternative label: Nyhetsmeddelanden, företag (676) @sv
alternative label: Organisationskommunikation (676) @sv
alternative label: PR-verksamhet (676) @sv
alternative label: PR-verksamhet, PR (676) @sv
alternative label: Public relations (676) @sv
alternative label: Public relations, PR-verksamhet (676) @sv
alternative label: Samfundskommunikation (676) @sv
broader: LIIKETALOUS. KAUPPA. MARKKINOINTI. LIIKENNEOPETUS
in scheme: URN:NBN:fi:au:hklj:
narrower: Mainonta
narrower: Kuluttajanvalistus
notation: 676
preferred label: Advertising. Consumer information @en
preferred label: Reklam. Konsumentupplysning @sv
related: URN:NBN:fi:au:hklj:360
related: URN:NBN:fi:au:hklj:363
related: URN:NBN:fi:au:hklj:368
related: Hinnat. Hintapolitiikka
related: Elintaso. Kulutus
related: URN:NBN:fi:au:hklj:649.91
related: URN:NBN:fi:au:hklj:650.2
related: Tavaraoppi
related: Henkilöstöpolitiikka
related: URN:NBN:fi:au:hklj:675
related: Liiketaloudellinen kirjanpito ja tilintarkastus
related: Kauppakirjeenvaihto
related: Kauppamatematiikka
related: Materiaalitoiminnot. Logistiikka
related: Markkinointi. Asiakaspalvelu
scope note: Yleisteokset, jotka koskevat sekä mainontaa että kuluttajanvalistusta tai kuluttajansuojelua Yksityisen tai julkisen yrityksen suhdetoiminta ja tiedottaminen yleensä Yritysviestintä yleensä Yrityksen suhdetoiminnan ja tiedottamisen suhteet tiedotusvälineisiin ja joukkotiedotukseen yleensä Erikoisalojen mainonta, tiedotus- ja suhdetoiminta sekä kuluttajanvalistus alan mukaisessa luokassa
scope note: Allmänna verk om både reklam och konsumentupplysning eller konsumentskydd Public relations och information inom privata eller offentliga företag i allmänhet Företagsinformation i allmänhet Företagens PR och information i förhållande till massmedier och masskommunikation i allmänhet Reklam, information och PR samt konsumentupplysning inom specialområden klassificeras enligt område @sv

Mainonta
type: Class
type: Concept
subclass of: Mainonta. Kuluttajanvalistus
alternative label: Advertoriaalit, mainonta (676.1)
alternative label: Alkuperämerkinnät (676.1)
alternative label: Brandit (676.1)
alternative label: Brändit (676.1)
alternative label: Esitteet, mainonta (676.1)
alternative label: Ilmoittelu (676.1)
alternative label: Ilmoitukset (676.1)
alternative label: Julisteet, mainonta (676.1)
alternative label: Kampanjat, mainonta (676.1)
alternative label: Kaupan omat tuotemerkit (676.1)
alternative label: Kaupankäynti, mainonta (676.1)
alternative label: Kauppa, mainonta (676.1)
alternative label: Kohderyhmät, mainonta (676.1)
alternative label: Kohderyhmätutkimukset, mainonta (676.1)
alternative label: Kotelot, mainonta (676.1)
alternative label: Kotimaiset tuotteet, mainonta (676.1)
alternative label: Kulttuurihäirintä, vastamainonta (676.1)
alternative label: Kuvallinen viestintä, mainonta (676.1)
alternative label: Käsikirjoittaminen, mainokset (676.1)
alternative label: Lehti-ilmoitukset, mainonta (676.1)
alternative label: Lehtimainonta (676.1)
alternative label: Levitys, mainonta (676.1)
alternative label: Liikemerkit (676.1)
alternative label: Liiketunnukset (676.1)
alternative label: Logot (676.1)
alternative label: Mainokset (676.1)
alternative label: Mainonnan psykologia (676.1)
alternative label: Mainonta (676.1)
alternative label: Mainosala (676.1)
alternative label: Mainoselokuvat (676.1)
alternative label: Mainoskuvaus, mainonta (676.1)
alternative label: Mainosmusiikki (676.1)
alternative label: Mainosnuket (676.1)
alternative label: Mainospiirtäjän työ (676.1)
alternative label: Mainostajat (676.1)
alternative label: Mainostaminen (676.1)
alternative label: Mainostoimistot (676.1)
alternative label: Mainostus (676.1)
alternative label: Mainosvalot (676.1)
alternative label: Mallinuket (676.1)
alternative label: Manipulaatio, mainonta (676.1)
alternative label: Markkinointiviestintä, mainonta (676.1)
alternative label: Merkinnät, myyntipäällysmerkinnät (676.1)
alternative label: Merkintä, myyntipäällysmerkinnät (676.1)
alternative label: Merkit, liikemerkit (676.1)
alternative label: Merkkitavarat (676.1)
alternative label: Mielikuvamarkkinointi, mainonta (676.1)
alternative label: Mielikuvat, mainonta, tuote- ja liikemerkit, brandit ja merkkitavarat (676.1)
alternative label: Myyntipäällysmerkinnät (676.1)
alternative label: Neuromarkkinointi, markkinointiviestintä, mainonta (676.1)
alternative label: Näyteikkunat (676.1)
alternative label: Pakkaukset, mainonta (676.1)
broader: Mainonta. Kuluttajanvalistus
in scheme: URN:NBN:fi:au:hklj:
notation: 676.1
related: Kauppaoikeus. Yhtiölainsäädäntö. Pankki- ja vakuutuslainsäädäntö
related: URN:NBN:fi:au:hklj:360
related: URN:NBN:fi:au:hklj:363
related: URN:NBN:fi:au:hklj:368
related: Elintaso. Kulutus
related: URN:NBN:fi:au:hklj:384
related: Posti
related: Radio- ja televisiotoiminta
related: Radiotoiminta
related: URN:NBN:fi:au:hklj:384.42
related: Lehdistöoppi
related: URN:NBN:fi:au:hklj:649.91
related: URN:NBN:fi:au:hklj:650.2
related: Tavaraoppi
related: Liiketalouden hallinto ja organisaatio
related: URN:NBN:fi:au:hklj:675
related: Markkinointi. Asiakaspalvelu
related: URN:NBN:fi:au:hklj:676.103
related: Kuluttajanvalistus
related: Käyttögrafiikka
scope note: Mainonnan yleisteokset. Mainosten suunnittelu yleensä Mainonnan psykologia ja tekniikka yleensä Yksityisen tai julkisen yrityksen tai organisaation harjoittama mainonta ja ilmoittelu yleensä Mainostoimistot. Mainonnan lajit ja kohteet yleensä Somistus, näyteikkunat ja pakkaussuunnittelu yleensä Tavara- ja liikemerkit, brandit sekä tuotekuvat yleensä Myyntipäällysmerkinnät yleensä. Merkkitavarat yleensä Tuote-esittelyt, tv-, radio-, lehti- ja verkkomainonta yleensä Mainonta tiedotusvälineissä ja joukkotiedotuksessa yleensä Tiettyä tuotetta, tuoteryhmää tai erikoisalaa koskeva mainonta alan mukaisessa luokassa
scope note: Allmänna verk om reklam. Planering av reklam i allmänhet Reklamens psykologi och teknik i allmänhet Privata eller offentliga företags eller organisationers reklam och annonsering i allmänhet Reklambyråer. Reklamens former och målgrupper i allmänhet Dekoration, skyltfönster, förpackningsplanering i allmänhet Varu- och firmamärken, brandyn och produktionsbilder i allmänhet Förpackningstexter i allmänhet. Märkesvaror i allmänhet Produktdemonstrationer, televisions-, radio- och tidningsreklam i allmänhet. Reklam på nätet i allmänhet Reklamen i massmedier och masskommunikation i allmänhet Reklam som rör enskilda produkter och produktgrupper eller ett bestämt specialområde klassificeras enligt område @sv

Pohjoismaat. Baltian maat
type: Class
type: Concept
subclass of: URN:NBN:fi:au:hklj:740.9
alternative label: Pohjoismaat, maalaustaide (740.92 +)
alternative label: Pohjola, maalaustaide (740.92 +)
alternative label: Norden, målarkonst (740.92 +) @sv
alternative label: Nordiska länderna, målarkonst (740.92 +) @sv
broader: URN:NBN:fi:au:hklj:740.9
in scheme: URN:NBN:fi:au:hklj:
narrower: Suomi
narrower: Ruotsi
narrower: Tanska
narrower: Norja
narrower: Islanti
narrower: Baltian maat
notation: 740.92
preferred label: Nordic countries. Baltic countries @en
preferred label: Norden. Baltikum @sv
related: URN:NBN:fi:au:hklj:709
related: URN:NBN:fi:au:hklj:741
related: URN:NBN:fi:au:hklj:741.1
related: URN:NBN:fi:au:hklj:741.2
related: URN:NBN:fi:au:hklj:742
related: URN:NBN:fi:au:hklj:749
related: URN:NBN:fi:au:hklj:749.1
scope note: Teokset, jotka koskevat Pohjoismaiden maalaustaidetta yleensä Teokset, jotka koskevat sekä Pohjoismaiden että Baltian maiden maalaustaidetta
scope note: Verk som handlar om de nordiska ländernas målarkonst i allmänhet Verk som handlar om både de nordiska ländernas och de baltiska ländernas målarkonst @sv

Oopperoiden solistiset lauluosat
type: Class
type: Concept
subclass of: Oopperat
alternative label: Aariat, ooppera-aariat (783.612)
alternative label: Laulut, ooppera-aariat (783.612)
alternative label: Ooppera, aariat (783.612)
alternative label: Oopperat, aariat (783.612)
alternative label: Arior, operaarior (783.612) @sv
alternative label: Opera, arior (783.612) @sv
alternative label: Operor, arior (783.612) @sv
alternative label: Sånger, operaarior (783.612) @sv
broader: Oopperat
in scheme: URN:NBN:fi:au:hklj:
notation: 783.612
preferred label: Vocal parts with solo elements from operas @en
preferred label: Sångpartier med solistinslag ur operor @sv
related: URN:NBN:fi:au:hklj:1.3
related: URN:NBN:fi:au:hklj:1.83
related: URN:NBN:fi:au:hklj:1.943
related: URN:NBN:fi:au:hklj:2.3
related: URN:NBN:fi:au:hklj:2.83
related: URN:NBN:fi:au:hklj:2.93
related: URN:NBN:fi:au:hklj:3.3
related: URN:NBN:fi:au:hklj:4.3
related: URN:NBN:fi:au:hklj:5.3
related: URN:NBN:fi:au:hklj:6.3
related: URN:NBN:fi:au:hklj:7.3
related: URN:NBN:fi:au:hklj:770
related: Teatterimuodot
related: Yksinlaulu orkesterin ja/tai kuoron säestyksellä
related: URN:NBN:fi:au:hklj:783.5
related: URN:NBN:fi:au:hklj:784
related: URN:NBN:fi:au:hklj:784.111
related: URN:NBN:fi:au:hklj:788
related: URN:NBN:fi:au:hklj:789
related: URN:NBN:fi:au:hklj:8.3
scope note: Ooppera-aariat
scope note: Operaarior @sv

Oopperoiden kuoro-osat
type: Class
type: Concept
subclass of: Oopperat
alternative label: Ooppera, kuoro-osat (783.613)
alternative label: Oopperat, kuoro-osat (783.613)
alternative label: Opera, körpartier (783.613) @sv
alternative label: Operor, körpartier (783.613) @sv
broader: Oopperat
in scheme: URN:NBN:fi:au:hklj:
notation: 783.613
preferred label: Choral parts from operas @en
preferred label: Körpartier ur operor @sv
related: URN:NBN:fi:au:hklj:1.3
related: URN:NBN:fi:au:hklj:1.83
related: URN:NBN:fi:au:hklj:1.943
related: URN:NBN:fi:au:hklj:2.3
related: URN:NBN:fi:au:hklj:2.83
related: URN:NBN:fi:au:hklj:2.93
related: URN:NBN:fi:au:hklj:3.3
related: URN:NBN:fi:au:hklj:4.3
related: URN:NBN:fi:au:hklj:5.3
related: URN:NBN:fi:au:hklj:6.3
related: URN:NBN:fi:au:hklj:7.3
related: URN:NBN:fi:au:hklj:770
related: Teatterimuodot
related: Kuorot (yli 9 laulajaa)
related: URN:NBN:fi:au:hklj:783.5
related: URN:NBN:fi:au:hklj:784
related: URN:NBN:fi:au:hklj:784.111
related: URN:NBN:fi:au:hklj:788
related: URN:NBN:fi:au:hklj:789
related: URN:NBN:fi:au:hklj:8.3

Operetit
type: Class
type: Concept
subclass of: URN:NBN:fi:au:hklj:783.6
alternative label: Libretistit, operetti (783.62)
alternative label: Libretot, operetti (783.62)
alternative label: Operetit (783.62)
alternative label: Librettister, operett (783.62) @sv
alternative label: Libretton, operett (783.62) @sv
alternative label: Operetter (783.62) @sv
broader: URN:NBN:fi:au:hklj:783.6
in scheme: URN:NBN:fi:au:hklj:
notation: 783.62
preferred label: Operettas @en
preferred label: Operetter @sv
related: URN:NBN:fi:au:hklj:1.3
related: URN:NBN:fi:au:hklj:1.83
related: URN:NBN:fi:au:hklj:1.943
related: URN:NBN:fi:au:hklj:2.3
related: URN:NBN:fi:au:hklj:2.83
related: URN:NBN:fi:au:hklj:2.93
related: URN:NBN:fi:au:hklj:3.3
related: URN:NBN:fi:au:hklj:4.3
related: URN:NBN:fi:au:hklj:5.3
related: URN:NBN:fi:au:hklj:6.3
related: URN:NBN:fi:au:hklj:7.3
related: URN:NBN:fi:au:hklj:770
related: Teatterimuodot
related: URN:NBN:fi:au:hklj:783.5
related: URN:NBN:fi:au:hklj:784
related: URN:NBN:fi:au:hklj:784.111
related: URN:NBN:fi:au:hklj:788
related: URN:NBN:fi:au:hklj:789
related: URN:NBN:fi:au:hklj:8.3
scope note: Operettien yksittäisistä lauluista tai muista osista sovitetut kokoelmat soitinnuksen mukaisessa luokassa
scope note: Samlingar arrangerade som enskilda sånger eller andra partier ur operetter klassificeras enligt instrumentering @sv

Baltian maat
type: Class
type: Concept
subclass of: Pohjoismaat. Baltian maat
alternative label: Baltia, kansanmusikki (784.116 +)
alternative label: Baltikum, folkmusik (784.116 +) @sv
broader: Pohjoismaat. Baltian maat
in scheme: URN:NBN:fi:au:hklj:
narrower: Viro
narrower: Latvia
narrower: Liettua
notation: 784.116
preferred label: Baltic countries @en
preferred label: Baltikum @sv
related: URN:NBN:fi:au:hklj:473.1
related: URN:NBN:fi:au:hklj:769
related: URN:NBN:fi:au:hklj:783
related: URN:NBN:fi:au:hklj:783.1
related: URN:NBN:fi:au:hklj:787
related: URN:NBN:fi:au:hklj:787.2
related: URN:NBN:fi:au:hklj:787.29
related: URN:NBN:fi:au:hklj:788.8
related: URN:NBN:fi:au:hklj:789
related: URN:NBN:fi:au:hklj:795.1
related: URN:NBN:fi:au:hklj:797.2
related: URN:NBN:fi:au:hklj:807
scope note: Yleisteokset ja sekasisältöiset kokoelmat
scope note: Allmänna verk och samlingar med blandat innehåll @sv

Kaukasuksen maat
type: Class
type: Concept
subclass of: Itsenäisten valtioiden yhteisön Aasian puoleiset alueet
broader: Itsenäisten valtioiden yhteisön Aasian puoleiset alueet
in scheme: URN:NBN:fi:au:hklj:
notation: 784.2511
preferred label: Caucasus @en
preferred label: Kaukasus @sv
related: URN:NBN:fi:au:hklj:473.1
related: URN:NBN:fi:au:hklj:769
related: URN:NBN:fi:au:hklj:783
related: URN:NBN:fi:au:hklj:783.1
related: Itsenäisten valtioiden yhteisö
related: Venäjä
related: URN:NBN:fi:au:hklj:784.9
related: URN:NBN:fi:au:hklj:787
related: URN:NBN:fi:au:hklj:787.2
related: Itämaisten uskontojen musiikki
related: Islamilaisten uskonnollinen musiikki
related: URN:NBN:fi:au:hklj:787.29
related: URN:NBN:fi:au:hklj:788.8
related: URN:NBN:fi:au:hklj:789
related: Varhaiskansojen musiikki
related: URN:NBN:fi:au:hklj:795.1
related: URN:NBN:fi:au:hklj:797.2
related: URN:NBN:fi:au:hklj:807
scope note: Armenia. Azerbaidzan. Georgia Tässä myös Abhasia
scope note: Armenien. Azerbajdjan. Georgien Hit också Abchazien @sv

Intiaanit
type: Class
type: Concept
subclass of: URN:NBN:fi:au:hklj:784.9
alternative label: Amerikka, kansanmusiikki, intiaanit (784.93)
alternative label: Amerikka, musiikki, intiaanit (784.93)
alternative label: Etelä-Amerikka, kansanmus., intiaanit (784.93)
alternative label: Etelä-Amerikka, musiikki, intiaanit (784.93)
alternative label: Intiaanit, musiikki (784.93)
alternative label: Pohjois-Amerikka, kansanmusiikki, intiaanit (784.93)
alternative label: Pohjois-Amerikka, musiikki, intiaanit (784.93)
alternative label: Amerika, folkmusik, indianer (784.93) @sv
alternative label: Amerika, musik, indianer (784.93) @sv
alternative label: Indianer, musik (784.93) @sv
alternative label: Nordamerika, folkmusik, indianer (784.93) @sv
alternative label: Nordamerika, musik, indianer (784.93) @sv
alternative label: Sydamerika, folkmusik, indianer (784.93) @sv
alternative label: Sydamerika, musik, indianer (784.93) @sv
broader: URN:NBN:fi:au:hklj:784.9
in scheme: URN:NBN:fi:au:hklj:
notation: 784.93
preferred label: North American Indians @en
preferred label: Indianer @sv
related: URN:NBN:fi:au:hklj:473.1
related: URN:NBN:fi:au:hklj:769
related: URN:NBN:fi:au:hklj:783
related: URN:NBN:fi:au:hklj:783.1
related: Pohjois-Amerikka
related: Kanada
related: Yhdysvallat
related: Väli-Amerikka
related: Karibianmeren saaret
related: Etelä-Amerikka
related: URN:NBN:fi:au:hklj:787
related: URN:NBN:fi:au:hklj:787.2
related: URN:NBN:fi:au:hklj:787.29
related: URN:NBN:fi:au:hklj:788.8
related: URN:NBN:fi:au:hklj:789
related: URN:NBN:fi:au:hklj:795.1
related: URN:NBN:fi:au:hklj:797.2
related: URN:NBN:fi:au:hklj:807

Muut duot
type: Class
type: Concept
subclass of: URN:NBN:fi:au:hklj:785.11
broader: URN:NBN:fi:au:hklj:785.11
in scheme: URN:NBN:fi:au:hklj:
notation: 785.119
preferred label: Other duets @en
preferred label: Annan duomusik @sv
related: URN:NBN:fi:au:hklj:789

Sekstetit
type: Class
type: Concept
subclass of: Kamariyhtyeet (2-9 soittajaa)
alternative label: Sekstetit, kamarimusiikki (785.15)
alternative label: Sekstetot (785.15)
alternative label: Sextetter, ensembler, kammarmusik (785.15) @sv
alternative label: Sextetter, kompositioner (785.15) @sv
broader: Kamariyhtyeet (2-9 soittajaa)
in scheme: URN:NBN:fi:au:hklj:
notation: 785.15
preferred label: Sextets @en
preferred label: Sextetter @sv
related: URN:NBN:fi:au:hklj:789

Septetit
type: Class
type: Concept
subclass of: Kamariyhtyeet (2-9 soittajaa)
alternative label: Septetit, soitinyhtyeet (785.16)
alternative label: Septetot (785.16)
alternative label: Torviseitsikot (785.16)
alternative label: Blåsarseptetter (785.16) @sv
alternative label: Septetter, ensembler, instrumentalensembler (785.16) @sv
alternative label: Septetter, kompositioner (785.16) @sv
broader: Kamariyhtyeet (2-9 soittajaa)
in scheme: URN:NBN:fi:au:hklj:
notation: 785.16
preferred label: Septets @en
preferred label: Septetter @sv
related: URN:NBN:fi:au:hklj:789

Oktetit
type: Class
type: Concept
subclass of: Kamariyhtyeet (2-9 soittajaa)
alternative label: Oktetit (785.17)
alternative label: Oktetot (785.17)
alternative label: Oktetter, ensembler (785.17) @sv
alternative label: Oktetter, kompositioner (785.17) @sv
broader: Kamariyhtyeet (2-9 soittajaa)
in scheme: URN:NBN:fi:au:hklj:
notation: 785.17
preferred label: Octets @en
preferred label: Oktetter @sv
related: URN:NBN:fi:au:hklj:789

Nonetit
type: Class
type: Concept
subclass of: Kamariyhtyeet (2-9 soittajaa)
alternative label: Nonetit (785.18)
alternative label: Nonetot (785.18)
alternative label: Nonetter, ensembler (785.18) @sv
alternative label: Nonetter, kompositioner (785.18) @sv
broader: Kamariyhtyeet (2-9 soittajaa)
in scheme: URN:NBN:fi:au:hklj:
notation: 785.18
preferred label: Nonets @en
preferred label: Nonetter @sv
related: URN:NBN:fi:au:hklj:789

Kokoonpanoltaan poikkeukselliset yhtyeet
type: Class
type: Concept
subclass of: Kamariyhtyeet (2-9 soittajaa)
alternative label: Lyömäsoitinyhtyeet (785.19)
alternative label: Slaginstrumentensembler (785.19) @sv
broader: Kamariyhtyeet (2-9 soittajaa)
in scheme: URN:NBN:fi:au:hklj:
notation: 785.19
preferred label: Ensembles of unusual composition @en
preferred label: Ensembler i ovanliga sammansättningar @sv
related: URN:NBN:fi:au:hklj:789
scope note: Pääasiassa lyömä- tai etnisiä soittimia sisältävät sekstetit, septetit, oktetit ja nonetit
scope note: Sextetter, septetter, oktetter och nonetter med ett huvudsakligt inslag av trummor eller etniska instrument @sv

Jousisoittimet
type: Class
type: Concept
subclass of: URN:NBN:fi:au:hklj:786
alternative label: Jouset, jousisoittimet (786.3 +)
alternative label: Jousisoittimet (786.3 +)
alternative label: Kielisoittimet, jousisoittimet (786.3 +)
alternative label: Pilbågar, (786.3 +) @sv
alternative label: Stränginstrument, stråkinstrument (786.3 +) @sv
alternative label: Stråkinstrument (786.3 +) @sv
broader: URN:NBN:fi:au:hklj:786
in scheme: URN:NBN:fi:au:hklj:
narrower: Viulu
narrower: Alttoviulu
narrower: Sello
narrower: Kontrabasso
narrower: Muut jousisoittimet
notation: 786.3
preferred label: Bowed-string instruments @en
preferred label: Stråkinstrument @sv
related: URN:NBN:fi:au:hklj:627.7531
related: URN:NBN:fi:au:hklj:681
related: URN:NBN:fi:au:hklj:781.5
related: URN:NBN:fi:au:hklj:782.6
related: URN:NBN:fi:au:hklj:785
related: URN:NBN:fi:au:hklj:785.11
related: URN:NBN:fi:au:hklj:788
related: URN:NBN:fi:au:hklj:789

Vaskipuhaltimet
type: Class
type: Concept
subclass of: URN:NBN:fi:au:hklj:786
alternative label: Ansatsi, puhallinsoittimet (786.4 ... 786.6 +)
alternative label: Asete, puhallinsoittimet (786.4 ... 786.6 +)
alternative label: Fanfaarit, vaskipuhaltimet (786.5 +)
alternative label: Puhallinsoittimet, vaskipuhaltimet (786.5 +)
alternative label: Puhallussoittimet, vaskipuhaltimet (786.5 +)
alternative label: Vaskipuhaltimet (786.5 +)
alternative label: Ansats, ansatsi (786.4 ... 786.6 +) @sv
alternative label: Ansats, asete (786.4 ... 786.6 +) @sv
alternative label: Bleckblåsinstrument (786.5 +) @sv
alternative label: Blåsinstrument, bleckblåsinstrument (786.5 +) @sv
alternative label: Fanfarer, bleckblåsinstrument (786.5 +) @sv
broader: URN:NBN:fi:au:hklj:786
in scheme: URN:NBN:fi:au:hklj:
narrower: Käyrätorvi
narrower: Trumpetti
narrower: Pasuuna
narrower: Tuuba
narrower: Muut vaskipuhaltimet
notation: 786.5
preferred label: Brass @en
preferred label: Bleckblåsinstrument @sv
related: URN:NBN:fi:au:hklj:627.7531
related: URN:NBN:fi:au:hklj:681
related: URN:NBN:fi:au:hklj:781.5
related: URN:NBN:fi:au:hklj:782.6
related: URN:NBN:fi:au:hklj:785
related: URN:NBN:fi:au:hklj:785.11
related: URN:NBN:fi:au:hklj:788
related: URN:NBN:fi:au:hklj:789

Virret. Hengelliset laulut
type: Class
type: Concept
subclass of: Protestanttinen musiikki
alternative label: Hengellinen musiikki, hengelliset laulut (787.111)
alternative label: Hengellinen musiikki, virret (787.111)
alternative label: Hengelliset laulut, laulukirjat, joissa nuotit (787.111)
alternative label: Koraalikirjat (787.111)
alternative label: Koraalivirsikirjat (787.111)
alternative label: Laulukirjat, virsikirjat, joissa nuotit (787.111)
alternative label: Laulumusiikki, virret (787.111)
alternative label: Psalmit, kirkkomusiikki (787.111)
alternative label: Veisuu (787.111)
alternative label: Virret, nuoteilla (787.111)
alternative label: Virsikirjat, nuoteilla (787.111)
alternative label: Virsilaulu (787.111)
alternative label: Andlig musik, andliga sånger (787.111) @sv
alternative label: Andlig musik, psalmer (787.111) @sv
alternative label: Andliga sånger, sångböcker med noter (787.111) @sv
alternative label: Koralböcker (787.111) @sv
alternative label: Koralpsalmböcker (787.111) @sv
alternative label: Psalmböcker, med noter (787.111) @sv
alternative label: Psalmer, med noter (787.111) @sv
alternative label: Psalmsjungande (787.111) @sv
alternative label: Psalmsång (787.111) @sv
alternative label: Psaltarpsalmer, kyrkomusik (787.111) @sv
alternative label: Sångböcker, psalmböcker, med noter (787.111) @sv
alternative label: Sångmusik, psalmer (787.111) @sv
broader: Protestanttinen musiikki
in scheme: URN:NBN:fi:au:hklj:
notation: 787.111
preferred label: Psalms. Hymns. Spiritual songs @en
preferred label: Psalmer. Andliga sånger @sv
related: Hartauskirjat
related: Rukouskirjat
related: Virsikirjat ja hengelliset laulukirjat
related: Henkilökohtainen hartaudenharjoitus
related: Sakramentit. Kirkolliset toimitukset
related: URN:NBN:fi:au:hklj:783
related: URN:NBN:fi:au:hklj:783.1
related: URN:NBN:fi:au:hklj:783.5
related: URN:NBN:fi:au:hklj:783.59
related: URN:NBN:fi:au:hklj:783.6
related: URN:NBN:fi:au:hklj:784
related: URN:NBN:fi:au:hklj:784.9
related: URN:NBN:fi:au:hklj:787.112
related: Spirituaalit. Gospel-musiikki
related: Roomalaiskatolinen musiikki
related: Ortodoksinen musiikki
related: Muiden kristillisten kirkkojen musiikki
related: URN:NBN:fi:au:hklj:787.2
related: URN:NBN:fi:au:hklj:789
scope note: Evankelis-luterilaisten ja muiden protestanttisten kirkkojen virret, psalmit ja hengelliset laulut sekä niitä koskeva kirjallisuus musiikin kannalta Virsikirjat ja hengelliset laulukirjat, joissa on nuotit
scope note: De evangelisk-lutherska kyrkornas och andra protestantiska kyrkors psalmer och andliga sånger samt litteratur om dem ur musikens synvinkel Psalmböcker och andliga sångböcker med noter @sv

Folk. Country
type: Class
type: Concept
subclass of: Folk. Country. Rock. Pop
broader: Folk. Country. Rock. Pop
in scheme: URN:NBN:fi:au:hklj:
narrower: Folk. Hootenanny
narrower: Country
notation: 788.32
related: URN:NBN:fi:au:hklj:782.4
related: URN:NBN:fi:au:hklj:783
related: URN:NBN:fi:au:hklj:783.1
related: URN:NBN:fi:au:hklj:785.7
related: URN:NBN:fi:au:hklj:786.8
related: URN:NBN:fi:au:hklj:787.112
related: Rock. Pop
related: Rock and roll. Rockabilly
related: Heavy rock. Hard rock
related: Elektroninen popmusiikki. Electronica
related: Progressiivinen rock. Psykedeelinen rock
related: Punk rock. Uusi aalto. Post-punk
related: URN:NBN:fi:au:hklj:789
related: URN:NBN:fi:au:hklj:795
scope note: Yleisteokset ja sekasisältöiset kokoelmat Tässä ja alaluokissa folk ja country sekä niitä koskeva kirjallisuus Tässä ja alaluokissa myös folkin ja countryn suuntaukset sekä niiden historia ja henkilöhistoria
scope note: Allmänna verk och samlingar med blandat innehåll Hit och till underklasserna folk och country samt litteratur om dem Hit och till underklasserna också olika riktningar inom folk och country samt deras historia och personhistoria @sv

Liikuntatiede ja -tutkimus. Liikuntapolitiikka
type: Class
type: Concept
subclass of: LIIKUNTA. URHEILU. LEIKIT. HUVIT
alternative label: Apurahat, urheilu (790.1)
alternative label: Biomekaniikka, liikuntatiede (790.1)
alternative label: Erityisliikunta, liikuntapolitiikka (790.1)
alternative label: Harjoitusvaste, urheilu- ja liikuntatutkimus (790.1)
alternative label: Henkinen valmennus, urheilupsykologia (790.1)
alternative label: Katsojat, urheilukilpailut (790.1)
alternative label: Kävijät, urheilukilpailut (790.1)
alternative label: Kävijätutkimukset, urheilukilpailut (790.1)
alternative label: Lihasmekaniikka, liikuntatiede (790.1)
alternative label: Liikunta, liikuntapolitiikka (790.1)
alternative label: Liikuntabiologia (790.1)
alternative label: Liikuntafilosofia (790.1)
alternative label: Liikuntahallinto (790.1)
alternative label: Liikuntapalvelut, liikuntapolitiikka (790.1)
alternative label: Liikuntapolitiikka (790.1)
alternative label: Liikuntapsykologia (790.1)
alternative label: Liikuntasosiologia (790.1)
alternative label: Liikuntasuunnittelu (790.1)
alternative label: Liikuntateknologia (790.1)
alternative label: Liikuntatiede (790.1)
alternative label: Liikuntatoimi (790.1)
alternative label: Psyykkinen valmennus, urheilupsykologia (790.1)
alternative label: Pyrkimykset, urheilupsykologia (790.1)
alternative label: Rahoittajat, urheilu (790.1)
alternative label: Ruumiinkulttuuri, liikuntapolitiikka (790.1)
alternative label: SVUL (790.1)
alternative label: Sponsorointi, urheilu (790.1)
alternative label: Stipendit, urheilu (790.1)
alternative label: Suorituskyky, urheilu- ja liikuntatutkimus (790.1)
alternative label: Suoritusmotivaatio, urheilu ja liikunta (790.1)
alternative label: Tavoitteet, urheilupsykologia (790.1)
alternative label: Urheilu, urheilupolitiikka (790.1)
alternative label: Urheiluhallinto (790.1)
alternative label: Urheilujohtajat, urheilupolitiikka (790.1)
alternative label: Urheilujärjestöt, urheilupolitiikka (790.1)
alternative label: Urheilupolitiikka (790.1)
alternative label: Urheilupsykologia (790.1)
alternative label: Urheiluvaikuttajat, urheilupolitiikka (790.1)
alternative label: Vammaisliikunta, liikuntapolitiikka (790.1)
alternative label: Vammaisurheilu, urheilupolitiikka (790.1)
alternative label: Besökare, idrottstävlingar (790.1) @sv
alternative label: Besökarundersökningar, idrottstävlingar (790.1) @sv
alternative label: Biomekanik, gymnastik- och idrottsvetenskap (790.1) @sv
alternative label: FRIF (790.1) @sv
alternative label: Finansiärer, idrott (790.1) @sv
alternative label: Gymnastik- och idrottsvetenskap (790.1) @sv
alternative label: Handikappidrott, idrottspolitik (790.1) @sv
alternative label: Handikappmotion, idrottspolitik (790.1) @sv
alternative label: Idrott, idrottspolitik (790.1) @sv
alternative label: Idrottsförvaltning (790.1) @sv
alternative label: Idrottsledare, idrottspolitik (790.1) @sv
alternative label: Idrottsorganisationer, idrottspolitik (790.1) @sv
alternative label: Idrottspersonligheter, idrottspolitik (790.1) @sv
broader: LIIKUNTA. URHEILU. LEIKIT. HUVIT
in scheme: URN:NBN:fi:au:hklj:
notation: 790.1
related: URN:NBN:fi:au:hklj:120
related: KASVATUS. OPETUS. KASVATUSTIEDE
related: Urheilulääketiede
related: Liikunta. Urheilu
related: Yleisurheilu
related: Uinti. Sukellus
related: Pyöräily
related: Luistelu
related: Hiihto. Alppihiihto. Ampumahiihto
related: Purjehdus. Soutu. Melonta
related: Hevosurheilu. Ratsastus
related: Moottoriurheilu. Lentourheilu
related: Autourheilu
related: Moottoripyöräurheilu
related: Moottoriveneurheilu
related: Lentourheilu
related: Muut urheilu- ja liikuntamuodot
related: Miekkailu
related: Ammunta
scope note: Liikunta- ja urheilutiede, liikunta- ja urheilututkimus sekä liikunta- ja urheilupsykologia ja -sosiologia kilpa-, huippu-, kunto- ja vammaisurheilun kannalta yleensä Kilpa-, huippu-, kunto- ja vammaisurheilun liikuntapolitiikka yleensä Tiettyyn urheilulajiin tai -muotoon littyvä liikuntatiede- ja tutkimus, psykologia ja sosiologia sekä urheilupolitiikka ko. urheilulajin tai -muodon luokassa
scope note: Gymnastik- och idrottsvetenskap, forskning kring sport, idrott och motion samt idrottspsykologi och idrottssociologi ur tävlings-, elit-, motions- och handikappidrottens synvinkel i allmänhet Idrottspolitik som rör tävlings-, elit-, motions- och handikappidrott i allmänhet Gymnastik- och idrottsvetenskap, idrottspsykologi och idrottssociologi samt idrottspolitik som hänför sig till en bestämd sportgren eller idrottsform förs till klassen för sportgrenen eller idrottsformen i fråga @sv

Lasten- ja nuortenkirjallisuuden historia ja tutkimus
type: Class
type: Concept
subclass of: Kirjallisuuden aihepiirejä ja kirjallisuustyyppejä koskeva historia ja tutkimus
alternative label: Aarnikotkat, lastenkirjallisuuden tutkimus (805.1)
alternative label: Ensikirjat, lastenkirjallisuuden tutkimus (805.1)
alternative label: Feeniks-lintu, lastenkirjallisuuden tutkimus (805.1)
alternative label: Feniks, lastenkirjallisuuden tutkimus (805.1)
alternative label: Griipit, lastenkirjallisuuden tutkimus (805.1)
alternative label: Haltiat, lastenkirj.tutk. (805.1)
alternative label: Haltijat, lastenkirjallisuuden tutkimus (805.1)
alternative label: Hevoskirjat, nuortenkirj.tutk. (805.1)
alternative label: Ihmesadut, lastenkirj.tutk. (805.1)
alternative label: Jättiläiset, lastenkirjallisuuden tutkimus (805.1)
alternative label: Kansansadut, lastenkirj.tutk. (805.1)
alternative label: Kansantarinat, lastenkirj.tutk. (805.1)
alternative label: Katselukirjat, lastenkirjallisuden tutkimus (805.1)
alternative label: Keijukaiset, lastenkirjallisuuden tutkimus (805.1)
alternative label: Keijut, lastenkirjallisuuden tutkimus (805.1)
alternative label: Koskettelukirjat, lastenkirjallisuuden tutkimus (805.1)
alternative label: Kuvakirjat, lastenkirj. tutk. (805.1)
alternative label: Lastenkirjailijat, lastenkirjallisuuden tutkimus (805.1)
alternative label: Lastenkirjallisuus, lastenkirj.tutk. (805.1)
alternative label: Lastenkulttuuri, lastenkirjallisuuden tutkimus (805.1)
alternative label: Lastenlorut, lastenkirjallisuuden tutkimus (805.1)
alternative label: Lastennäytelmät, lastenkirj.tutk. (805.1)
alternative label: Lastenrunot, lastenkirj.tutk. (805.1)
alternative label: Lorut, lastenkirjallisuuden tutkimus (805.1)
alternative label: Merenneidot, lastenkirjallisuuden tutkimus (805.1)
alternative label: Nuorisonäytelmät, kirjallisuudentutkimus (805.1)
alternative label: Nuorisoromaanit, kirjallisuudentutkimus (805.1)
alternative label: Nuortenkirjailijat, lastenkirjallisuuden tutkimus (805.1)
alternative label: Nuortenkirjallisuus, kirjallisuudentutkimus (805.1)
alternative label: Peikot, lastenkirj.tutk. (805.1)
alternative label: Pilasadut, lastenkirj.tutk. (805.1)
alternative label: Poikakirjat, kirjallisuudentutkimus (805.1)
alternative label: Prinsessat, lastenkirjallisuuden tutkimus (805.1)
alternative label: Prinssit, lastenkirjallisuuden tutkimus (805.1)
alternative label: Puuhakirjat, lastenkirjallisuuden tutkimus (805.1)
alternative label: Runokuvakirjat, lastenkirj.tutk. (805.1)
alternative label: Sadut, lastenkirjallisuuden tutkimus (805.1)
alternative label: Satuhahmot, lastenkirjallisuuden tutkimus (805.1)
alternative label: Satuolennot, lastenkirjallisuuden tutkimus (805.1)
alternative label: Taruolennot, lastenkirjallisuuden tutkimus (805.1)
alternative label: Tyttökirjat, nuortenkirj.tutk. (805.1)
alternative label: Vedenhaltijat , lastenkirjallisuuden tutkimus (805.1)
alternative label: Vedenneidot, lastenkirjallisuuden tutkimus (805.1)
alternative label: Alfer, barnlitteraturforskning (805.1) @sv
alternative label: Barnboksförfattare, barnlitteraturforskning (805.1) @sv
alternative label: Barnkultur, barnlitteraturforskning (805.1) @sv
alternative label: Barnlitteratur, barnlitt.forskning (805.1) @sv
alternative label: Barnlyrik, barnlitt.forskning (805.1) @sv
alternative label: Barnpjäser, barnlitt.forskning (805.1) @sv
alternative label: Barnramsor, barnlitteraturforskning (805.1) @sv
alternative label: Bilderböcker, barnlitt.forskning (805.1) @sv
alternative label: Diktbilderböcker, barnlitt.forskning (805.1) @sv
alternative label: Fenix, barnlitteratur, forskning (805.1) @sv
broader: Kirjallisuuden aihepiirejä ja kirjallisuustyyppejä koskeva historia ja tutkimus
in scheme: URN:NBN:fi:au:hklj:
notation: 805.1
related: URN:NBN:fi:au:hklj:060
related: URN:NBN:fi:au:hklj:357.1
related: URN:NBN:fi:au:hklj:749.1
related: Piirustuksen materiaalit ja tekniikka
related: Pilapiirrokset. Karikatyyrit
related: Kuvitustaide
related: Yleinen kirjallisuudenhistoria
related: SUOMALAIS-UGRILAISTEN KIELTEN KIRJALLISUUDEN HISTORIA JA TUTKIMUS
related: Suomenkielisen kirjallisuuden aihepiirejä ja kirjallisuustyyppejä koskeva historia ja tutkimus
related: Suomenkielisen lasten- ja nuortenkirjallisuuden historia ja tutkimus
related: GERMAANISTEN KIELTEN KIRJALLISUUDEN HISTORIA JA TUTKIMUS
related: Pohjoismaisten kielten kirjallisuuden historia ja tutkimus
related: Ruotsinkielisen kirjallisuuden historia ja tutkimus
related: Suomenruotsalaisen kirjallisuuden historia ja tutkimus
related: Saksankielisen kirjallisuuden historia ja tutkimus
related: Englanninkielisen kirjallisuuden historia ja tutkimus
related: Amerikan englanninkielisen kirjallisuuden historia ja tutkimus
related: ROMAANISTEN, SLAAVILAISTEN JA BALTTILAISTEN KIELTEN KIRJALLISUUDEN HISTORIA JA TUTKIMUS
related: MUIDEN KIELTEN KIRJALLISUUDEN HISTORIA JA TUTKIMUS
scope note: Lasten- ja nuortenkirjallisuuden historia ja tutkimus kielestä maasta ja aikakaudesta riippumatta; suomenkielisen lasten- ja nuortenkirjallisuuden tutkimuksella on kuitenkin oma luokkansa 816.1 Satujen ja kuvakirjojen historia ja tutkimus Lapsille ja nuorille tarkoitettujen runojen, näytelmä- ja kertomakirjallisuuden sekä sarjakuvien historia ja tutkimus Lasten- ja nuortenkirjallisuuden eri aihepiirien historia ja tutkimus Yksittäistä kirjailijaa tai hänen tuotantoaan koskevat teokset ovat kuitenkin aina ko. kirjailijan käyttämän kielen mukaisessa kirjallisuuden historian ja tutkimuksen luokassa Tässä myös lasten- ja nuorten tietokirjallisuuden historia ja tutkimus Tietyn alan tietokirjallisuus sekä sen historia ja tutkimus alan mukaisessa luokassa
scope note: Litteraturhistoria och litteraturforskning som rör barn- och ungdomslitteratur oavsett språk, land och tidsperiod; forskning i den finska barn- och ungdomslitteraturen förs dock till sin speciella klass 816.1 Sagornas och bilderböckernas litteraturhistoria och forskning i sagor och bilderböcker Litteraturhistoria och litteraturforskning som rör poesi, dramalitteratur, episk litteratur och tecknade serier skrivna för barn och unga Litteraturhistoria och litteraturforskning som rör olika temaområden inom barn- och ungdomslitteratur Verk som handlar om enskilda författare och deras produktion klassificeras dock alltid enligt författarens språk i klassen för litteraturhistoria och litteraturforskning Hit också litteraturhistoria och litteraturforskning som rör facklitteratur för barn och unga Facklitteratur som hänför sig till ett bestämt specialområde samt litteraturhistoria och litteraturforskning som rör sådan facklitteratur klassificeras enligt område @sv

Yleinen kirjallisuudenhistoria
type: Class
type: Concept
subclass of: URN:NBN:fi:au:hklj:800
alternative label: Absurdi, kirjallisuudenhistoria (809 +)
alternative label: Absurdismi, kirjallisuudenhistoria (809 +)
alternative label: Ajankuvaus (809)
alternative label: Akrostikonit, runot, kirjallisuudenhistoria (809 +)
alternative label: Antiromaanit, kirjallisuudenhistoria (809 +)
alternative label: Balladit, kirjallisuudenhistoria (809 +)
alternative label: Baltia, kirjallisuudenhistoria (809 +)
alternative label: Carmen figuratum, kirjallisuudenhistoria (809 +)
alternative label: Chick lit, naiskirjallisuus, kirjallisuudenhistoria (809)
alternative label: Dekadenssi, kirjallisuudenhistoria (809 +)
alternative label: Dokumenttinäytelmät, kirjallisuudenhistoria (809 +)
alternative label: Draaman historia (809 +)
alternative label: Elegiat, kirjallisuudenhistoria (809 +)
alternative label: Epiikka, kirjallisuudenhistoria (809 +)
alternative label: Esikuvat, kirjallisuudenhistoria (809 +)
alternative label: Fabliaut, runot, kirjallisuudenhistoria (809)
alternative label: Fanifiktio, kirjallisuudenhistoria (809 +)
alternative label: Fiktiiviset henkilöt, kirjallisuudenhistoria (809 +)
alternative label: Fiktiiviset paikat, kirjallisuudenhistoria (809 +)
alternative label: Fiktio, kirjallisuudenhistoria (809 +)
alternative label: Formalismi, kirjallisuudenhistoria (809 +)
alternative label: Genret, kirjallisuudenhistoria (809 +)
alternative label: Henkilökuvaus, kirjallisuudenhistoria (809 +)
alternative label: Huvinäytelmät, kirjallisuudenhistoria (809 +)
alternative label: Idyllit, runot, kirjallisuudenhistoria (809 +)
alternative label: Impressionismi, kirjallisuudenhistoria (809 +)
alternative label: Kaanonit, kirjallisuudenhistoria (809 +)
alternative label: Kamarinäytelmät, kirjallisuudenhistoria (809 +)
alternative label: Kansalliskirjailijat, kirjallisuudenhistoria (809 +)
alternative label: Kansalliskirjallisuus, kirj. historia (809 +)
alternative label: Kansankirjailijat (809 +)
alternative label: Kaunokirjallisuus, kirjallisuudenhistoria (809 +)
alternative label: Kerronta, kirjallisuudenhistoria (809 +)
alternative label: Kertoja, kirjallisuudenhistoria (809 +)
alternative label: Kertomakirjallisuus, kirjallisuudenhistoria (809 +)
alternative label: Kertominen, kirjallisuudenhistoria (809 +)
alternative label: Kertomukset, kirjallisuudenhistoria (809 +)
alternative label: Kirjallisuuden lajit, kirjallisudenhistoria. (809 +)
alternative label: Kirjallisuuden tyylit, kirjallisuudenhistoria (809 +)
alternative label: Kirjallisuudenhistoria (809 +)
alternative label: Kirjallisuudenlaji, tutkimus (809)
alternative label: Kirjallisuudentutkimus, kirjallisuudenhistoria (809 +)
alternative label: Kirjallisuus, kirjallisuudenhistoria (809 +)
alternative label: Kirjallisuushistoria (809 +)
alternative label: Kirjallisuustiede, kirjallisuudenhistoria (809 +)
alternative label: Klassikot, kirjallisuudenhistoria (809 +)
alternative label: Kokeellinen kirjallisuus , kirjallisuuden historia (809 +)
alternative label: Kokeelliset romaanit , kirjallisuudenhistoria (809 +)
alternative label: Kommentaarit, kirjallisuudenhistoria (809 +)
alternative label: Kuvarunot, kirjallisuudenhistoria (809 +)
alternative label: Kuviorunot, kirjallisuudenhistoria (809 +)
alternative label: Kuvitteelliset henkilöt, kirjallisuudenhistoria (809 +)
alternative label: Kuvitteelliset paikat, kirjallisuudenhistoria (809 +)
alternative label: Lyhytproosa, kirjallisuudenhistoria (809 +)
alternative label: Lyriikka, kirjallisuudenhistoria (809 +)
alternative label: Länsimainen kirjallisuus (809 +)
alternative label: Naiskirjallisuus, kirjallisuudenhistoria (809 +)
broader: URN:NBN:fi:au:hklj:800
in scheme: URN:NBN:fi:au:hklj:
narrower: Vanha aika
narrower: Keskiaika
narrower: Uusi aika
narrower: Nykyaika
notation: 809
related: Symbolit. Koodit. Merkkijärjestelmät
related: URN:NBN:fi:au:hklj:709
related: URN:NBN:fi:au:hklj:770.9
related: Kirjallisuuden aihepiirejä ja kirjallisuustyyppejä koskeva historia ja tutkimus
related: Lasten- ja nuortenkirjallisuuden historia ja tutkimus
related: URN:NBN:fi:au:hklj:807
related: SUOMALAIS-UGRILAISTEN KIELTEN KIRJALLISUUDEN HISTORIA JA TUTKIMUS
related: GERMAANISTEN KIELTEN KIRJALLISUUDEN HISTORIA JA TUTKIMUS
related: ROMAANISTEN, SLAAVILAISTEN JA BALTTILAISTEN KIELTEN KIRJALLISUUDEN HISTORIA JA TUTKIMUS
related: MUIDEN KIELTEN KIRJALLISUUDEN HISTORIA JA TUTKIMUS
related: URN:NBN:fi:au:hklj:919
scope note: Kirjallisuudenhistorian yleisteokset Eurooppalaisen ja länsimaisen kirjallisuuden sekä Aasian, Afrikan ja Amerikan kirjallisuuden historian yleisteokset Runouden, näytelmäkirjallisuuden, kertomakirjallisuuden sekä romaanin yleinen historia Jos teos koskee tiettyä tarkempaa kirjallisuustyyppiä tai aihepiiriä, tietyn kielen tai tietyn aikakauden kirjallisuutta, on etusija järjestyksessä: kirjallisuustyyppi tai aihepiiri, kieli, aikakausi Yksittäistä kirjailijaa tai hänen tuotantoaan koskevat teokset ovat kuitenkin aina ko. kirjailijan käyttämän kielen mukaisessa kirjallisuuden historian ja tutkimuksen luokassa
scope note: Allmänna verk om litteraturhistoria Allmänna verk om europeisk och västerländsk litteraturhistoria samt asiatisk, afrikansk och amerikansk litteraturhistoria Poesins, dramalitteraturens, den episka litteraturens samt romanens allmänna litteraturhistoria Om verket representerar en viss specificerad genre eller ett visst specificerat temaområde inom litteraturen eller om det hänför sig till litteraturen på ett bestämt språk eller under en bestämd tidsperiod, är prioritetsordningen följande: litterär genre eller temaområde, språk, tidsperiod Verk som handlar om enskilda författare och deras produktion klassificeras dock alltid enligt författarens språk i klassen för litteraturhistoria och litteraturforskning @sv

Slaavilaisten kielten kirjallisuuden historia ja tutkimus
type: Class
type: Concept
subclass of: ROMAANISTEN, SLAAVILAISTEN JA BALTTILAISTEN KIELTEN KIRJALLISUUDEN HISTORIA JA TUTKIMUS
alternative label: Bosnian kieli, kirjallisuudenhistoria (835)
alternative label: Bulgarian kieli, kirjallisuudenhistoria (835)
alternative label: Kirkkoslaavi, kirjallisuuden historia (835)
alternative label: Kroaatin kieli, kirjallisuuden historia (835)
alternative label: Kroatoserbian kieli, kirjallisuuden historia (835)
alternative label: Makedonian kieli, kirjallisuuden historia (835)
alternative label: Montenegron kieli, kirjallisuuden historia (835)
alternative label: Puolan kieli, kirjallisuuden historia (835)
alternative label: Serbian kieli, kirjallisuuden historia (835)
alternative label: Serbokroaatin kieli, kirjallisuuden historia (835)
alternative label: Slaavilaiset kielet, kirjallisuuden historia (835 ... 836)
alternative label: Slavistiikka, kirjallisuuden historia (835 ... 836)
alternative label: Slavofiilit, kirjallisuudenhistoria (835 ... 836)
alternative label: Slovakin kieli, kirjallisuuden historia (835)
alternative label: Sloveenin kieli, kirjallisuuden historia (835)
alternative label: Tsekin kieli, kirjallisuuden historia (835)
alternative label: Ukrainan kieli, kirjallisuuden historia (835)
alternative label: Valkovenäjän kieli, kirjallisuuden historia (835)
alternative label: Bosniska, litteraturhistoria (835) @sv
alternative label: Bulgariska, litteraturhistoria (835) @sv
alternative label: Kroatiska, litteraturhistoria (835) @sv
alternative label: Kroatoserbiska, litteraturhistoria (835) @sv
alternative label: Kyrkoslaviska, litteraturhistoria (835) @sv
alternative label: Makedoniska, litteraturhistoria (835) @sv
alternative label: Montenegrinska, litteraturhistoria (835) @sv
alternative label: Polska, litteraturhistoria (835) @sv
alternative label: Serbiska, litteraturhistoria (835) @sv
alternative label: Serbokroatiska, litteraturhistoria (835) @sv
alternative label: Slaviska språk, litteraturhistoria (835 ... 836) @sv
alternative label: Slavistik, litteraturhistoria (835 ... 836) @sv
alternative label: Slavofiler, litteraturhistoria (835 ... 836) @sv
alternative label: Slovakiska, litteraturhistoria (835) @sv
alternative label: Slovenska, litteraturhistoria (835) @sv
alternative label: Tjeckiska, litteraturhistoria (835) @sv
alternative label: Ukrainska, litteraturhistoria (835) @sv
alternative label: Vitryska, litteraturhistoria (835) @sv
broader: ROMAANISTEN, SLAAVILAISTEN JA BALTTILAISTEN KIELTEN KIRJALLISUUDEN HISTORIA JA TUTKIMUS
in scheme: URN:NBN:fi:au:hklj:
notation: 835
preferred label: Slavic literature: history and research @en
preferred label: De slaviska språkens litteraturhistoria och forskning i de slaviska språkens litteratur @sv
related: URN:NBN:fi:au:hklj:8.8
related: URN:NBN:fi:au:hklj:8.9
related: URN:NBN:fi:au:hklj:8.91
related: URN:NBN:fi:au:hklj:8.92
related: URN:NBN:fi:au:hklj:8.94
related: URN:NBN:fi:au:hklj:8.95
related: URN:NBN:fi:au:hklj:8.97
related: URN:NBN:fi:au:hklj:8.98
related: Venäjänkielisen kirjallisuuden historia ja tutkimus
scope note: Slaavilaisten kielten kirjallisuuden historian ja tutkimuksen yleisteokset Bosnian-, bulgarian-, kroatian-, makedonian-, puolan-, serbian-, slovakin-, sloveenin-, tsekin- , ukrainan- ja valkovenäjänkielisen kirjallisuuden historia ja tutkimus
scope note: Allmänna verk om slavisk litteraturhistoria och forskning i slavisk litteratur Litteraturhistoria och litteraturforskning som rör bulgariska, kroatiska, makedoniska, polska, serbiska, slovakiska, slovenska, tjeckiska, ukrainska och vitryska samt bosnisk litteraturhistoria och forskning i bosnisk litteratur @sv

Suomenruotsi
type: Class
type: Concept
subclass of: Ruotsin kieli
alternative label: Finlandismit (872.7)
alternative label: Ruotsin kieli, murteet, suomenruotsi (872.7)
alternative label: Ruotsin kieli, suomenruotsi, kielitiede (872.7)
alternative label: Suomenruotsalaiset, kielipolitiikka, suomenruotsi (872.7)
alternative label: Suomenruotsalaisuus, kielipolitiikka, suomenruotsi (872.7)
alternative label: Suomenruotsi (872.7)
alternative label: Suomenruotsi, kielitiede (872.7)
alternative label: Suomenruotsi, suomenruotsin murteet (872.7)
alternative label: Finlandismer (872.7) @sv
alternative label: Finlandssvenska (872.7) @sv
alternative label: Finlandssvenska, finlandssvenska dialekter (872.7) @sv
alternative label: Finlandssvenska, lingvistik (872.7) @sv
alternative label: Finlandssvenskar, språkpolitik, finlandssvenska (872.7) @sv
alternative label: Finlandssvenskhet, språkpolitik, finlandssvenska (872.7) @sv
alternative label: Svenska, dialekter, finlandssvenska (872.7) @sv
alternative label: Svenska, finlandssvenska, språkvetenskap (872.7) @sv
broader: Ruotsin kieli
in scheme: URN:NBN:fi:au:hklj:
notation: 872.7
preferred label: Finnish-Swedish @en
preferred label: Finlandssvenska @sv
related: URN:NBN:fi:au:hklj:188.4
related: URN:NBN:fi:au:hklj:2.5
related: Sähköposti. Verkkojuttelu
related: URN:NBN:fi:au:hklj:627.7512
related: KIELITIEDE
related: Kielipsykologia. Kielisosiologia. Kielipolitiikka
related: URN:NBN:fi:au:hklj:860
related: Pohjoismaiset kielet
related: Ruotsin kielen äänneoppi
related: Ruotsin kielen etymologia ja onomastiikka
related: Ruotsin kielen kielioppi ja semantiikka
related: Ruotsin kielen murteet
related: URN:NBN:fi:au:hklj:872.703
related: URN:NBN:fi:au:hklj:872.709
related: Ruotsin kielen historia
related: Suomen kielen äänneoppi
scope note: Suomenruotsi yleensä. Murteet. Murretutkimus. Murrealueet Slangit. Slangitutkimus. Maantieteelliset slangit Eri ammattien ja alojen slangit Äänne-, kieli-, muoto- ja sanaoppi Semantiikka. Etymologia. Onomastiikka Kielipsykologia, -sosiologia ja -politiikka suomenruotsin kannalta Murrenäytteet. Murrenäytekokoelmat
scope note: Finlandssvenska i allmänhet. Dialekter. Dialektforskning. Dialektområden Slang. Slangforskning. Regional och lokal slang Yrkesjargong och jargong inom olika branscher Ljudlära, satslära, formlära och ordlära Betydelselära (semantik). Etymologi. Onomastik Språkpsykologi, språksociologi och språkpolitik i finlandssvenska Dialektprov. Dialektarkiv @sv

Uusimman ajan historia 1789-1913
type: Class
type: Concept
subclass of: URN:NBN:fi:au:hklj:909
alternative label: Itämainen sota (909.4)
alternative label: Krimin sota (909.4)
alternative label: Maailmanhistoria, 1789-1913 (909.4)
alternative label: Tanssiva kongressi, Uusimman ajan historia 1789-1913 (909.4)
alternative label: Teollistumisen aikakausi, historia (909.4)
alternative label: Valistuksen aika, historia (909.3 ... 909.4)
alternative label: Vuosisadan vaihde, historia (909.4)
alternative label: Wienin kongressi, Uusimman ajan historia 1789-1913 (909.4)
alternative label: Wienin tanssiva kongressi, Uusimman ajan historia 1789-1913 (909.4)
alternative label: Industrialiseringens tidevarv, historia (909.4) @sv
alternative label: Krimkriget (909.4) @sv
alternative label: Sekelskiftet, historia (909.4) @sv
alternative label: Upplysningstiden, historia (909.3 ... 909.4) @sv
alternative label: Världshistoria, 1789-1913 (909.4) @sv
alternative label: Wienkongressen, Nya tidens historia 1789-1913 (909.4) @sv
alternative label: Österländska kriget (909.4) @sv
broader: URN:NBN:fi:au:hklj:909
in scheme: URN:NBN:fi:au:hklj:
notation: 909.4
preferred label: History of the later modern period 1789-1913 @en
preferred label: Nya tidens historia 1789-1913 @sv
related: URN:NBN:fi:au:hklj:300
related: Yhteiskuntatieteiden historia
related: URN:NBN:fi:au:hklj:320
related: URN:NBN:fi:au:hklj:325
related: URN:NBN:fi:au:hklj:370
related: URN:NBN:fi:au:hklj:371
related: URN:NBN:fi:au:hklj:390
related: Sotien yhteiskunnalliset vaikutukset
related: Muiden maiden puolustusvoimat
related: Sotahistoria
related: EUROOPPA
related: Keski-Eurooppa
related: Historialliset kartat. Historiallinen maantiede
related: Yleinen arkeologia
related: URN:NBN:fi:au:hklj:919
related: Uusimman ajan kulttuurihistoria 1789-1913
related: URN:NBN:fi:au:hklj:970
related: Muiden Keski-Euroopan maiden historia
related: URN:NBN:fi:au:hklj:979
scope note: Uusimman ajan historian ja arkeologian yleisteokset Euroopan uuden ajan historian ja arkeologian yleisteokset Tietyn maan tai alueen uuden ajan historia ja arkeologia ko. maanosan, maan tai alueen historian luokassa
scope note: Allmänna verk om den senare nya tidens historia och arkeologi Allmänna verk om europeisk historia och arkeologi under den senare nya tiden Verk om den senare nya tidens historia eller arkeologi i ett bestämt land eller geografiskt område förs till klassen för världsdelens, landets eller det geografiska områdets historia @sv

Historian tutkimusmenetelmät
type: Class
type: Concept
subclass of: HISTORIAN TUTKIMUSMENETELMÄT. ARKEOLOGIA. KULTTUURIHISTORIA
alternative label: Annalistinen historiantutkimus (910.1)
alternative label: Biografiatutkimus, historian tutkimusmenetelmät (910.1)
alternative label: Dokumentit, historiantutkimus (910.1)
alternative label: Elämäkerrallinen tutkimus, historian tutkimusmenetelmät (910.1)
alternative label: Elämäkertatutkimus, historian tutkimusmenetelmät (910.1)
alternative label: Elämänkertatutkimus, historian tutkimusmenetelmät (910.1)
alternative label: Henkilöhistoriallinen tutkimus, historian tutkimusmenetelmät (910.1)
alternative label: Historia, historian tutkimusmenetelmät (910.1)
alternative label: Historian tutkimusmenetelmät (910.1)
alternative label: Historiankirjoitus (910.1)
alternative label: Historiankäsitys, historiantutkimus (910.1)
alternative label: Historiantutkimus (910.1)
alternative label: Historiantutkimus, historiantutkimuksen lähteet (910.1)
alternative label: Kirjalliset lähteet, historiantutkimus (910.1)
alternative label: Kirjoitetut lähteet, historiantutkimus (910.1)
alternative label: Kirjoittamattomat lähteet, historiantutkimus (910.1)
alternative label: Konteksti, historiantutkimus (910.1)
alternative label: Kronikat, historian lähteet (910.1)
alternative label: Lähdeaineisto, historiantutkimus (910.1)
alternative label: Lähdejulkaisut, historiantutkimus (910.1)
alternative label: Lähdekritiikki, historiantutkimus (910.1)
alternative label: Lähteet, historiantutkimus (910.1)
alternative label: Menneisyys, historian tutkimusmenetelmät (910.1)
alternative label: Painamattomat lähteet, historian tutkimusmenetelmät (910.1)
alternative label: Psykohistoria, historian tutkimusmenetelmät (910.1)
alternative label: Tekstijulkaisut, historiantutkimus (910.1)
alternative label: Tekstit, historian lähteet (910.1)
alternative label: Tiedonlähteet, historian lähteet (910.1)
alternative label: Vaihtoehtohistoria, historian tutkimusmenetelmät (910.1)
alternative label: Vaihtoehtoinen historia, historian tutkimusmenetelmät (910.1)
alternative label: Alternativ historia, historieforskningens metoder (910.1) @sv
alternative label: Annalistisk historieforskning (910.1) @sv
alternative label: Biographical research, historieforskningens metoder (910.1) @sv
alternative label: Dokument, historieforskning (910.1) @sv
alternative label: Förflutet, historieforskningens metoder (910.1) @sv
alternative label: Historia, historieforskningens metoder (910.1) @sv
alternative label: Historieforskning (910.1) @sv
alternative label: Historieforskning, historieforskningens källor (910.1) @sv
alternative label: Historiens forskningsmetoder (910.1) @sv
alternative label: Historieskrivning (910.1) @sv
alternative label: Historieuppfattning, historieforskning (910.1) @sv
alternative label: Informationskällor, historiska källor (910.1) @sv
alternative label: Kontext, historieforskning (910.1) @sv
alternative label: Krönikor, historiens källor (910.1) @sv
alternative label: Källkritik, historieforskning (910.1) @sv
alternative label: Källmaterial, historieforskning (910.1) @sv
alternative label: Källor, historieforskning (910.1) @sv
alternative label: Livsberättelseforskning, historieforskningens metoder (910.1) @sv
alternative label: Livshistorieforskning, historieforskningens metoder (910.1) @sv
alternative label: Otryckta källor, historieforskning (910.1) @sv
alternative label: Otryckta källor, historieforskningens metoder (910.1) @sv
alternative label: Psykohistoria, historieforskningens metoder (910.1) @sv
broader: HISTORIAN TUTKIMUSMENETELMÄT. ARKEOLOGIA. KULTTUURIHISTORIA
in scheme: URN:NBN:fi:au:hklj:
notation: 910.1
related: Kirjoituksen historia. Paleografia. Epigrafia
related: URN:NBN:fi:au:hklj:900.09
related: Historian aputieteet
related: Yleinen kronologia ja kronografia
related: Diplomatiikka
related: Rahatiede
related: Vaakunatiede. Liput
related: Sinettitiede
related: Kunniamerkit. Arvonimet. Mitalitiede
related: Yleinen arkeologia
related: URN:NBN:fi:au:hklj:919
related: Vanhan ajan kulttuurihistoria
related: Keskiajan kulttuurihistoria 400-1499
related: Uuden ajan kulttuurihistoria 1500-1788
related: Uusimman ajan kulttuurihistoria 1789-1913
related: Nykyajan kulttuurihistoria 1914-1938
related: Nykyajan kulttuurihistoria 1939-
related: Erotiikan historia
related: Muodin historia
related: Sukututkimuksen historia ja menetelmät
scope note: Historian tutkimusmenetelmiä koskevat yleisteokset Historian metodioppi yleensä Historiallisen tutkimuksen lähteet ja lähdeaineistot yleensä Lähdekritiikki yleensä
scope note: Allmänna verk om historiska forskningsmetoder Historisk metodologi i allmänhet Källor och källmaterial i historisk forskning i allmänhet Källkritik i allmänhet @sv

Neuvostoliiton historia 1945-1991
type: Class
type: Concept
subclass of: Neuvostoliiton historia 1917-1991
alternative label: Moldova, historia (971.73)
alternative label: Viipuri, historia 1945-1991 (971.73)
alternative label: Viipurin lääni, historia 1945-1991 (971.73)
alternative label: Viborg, historia 1945-1991 (971.73) @sv
alternative label: Viborgs län, historia 1945-1991 (971.73) @sv
broader: Neuvostoliiton historia 1917-1991
in scheme: URN:NBN:fi:au:hklj:
notation: 971.73
preferred label: History of the Soviet Union 1945-1991 @en
preferred label: Sovjetunionens historia 1945-1991 @sv
related: Menetetty Karjalan alue
related: Lappi
related: Armenia. Azerbaidzan. Georgia. Kazakstan. Kirgisia. Tadzikistan. Turkmenistan. Uzbekistan
related: URN:NBN:fi:au:hklj:909
related: URN:NBN:fi:au:hklj:919
related: URN:NBN:fi:au:hklj:920
related: Esi- ja varhaishistoria vuoteen 1154
related: Keskiaika 1155-1522
related: Reformaation aika 1523-1617
related: Ruotsin suurvalta-aika 1618-1721
related: Vapauden aika ja kustavilainen aika 1722-1809
related: Autonomian aika 1810-1917
related: Itsenäisyyden aika 1917-1938
related: Vuoden 1918 sota
related: Itsenäisyyden aika 1939-
related: Sodat 1939-1945
related: URN:NBN:fi:au:hklj:929
related: Helsinki. Pääkaupunkiseutu
related: Aasian historia
related: URN:NBN:fi:au:hklj:989
scope note: Tässä myös menetettyjen Karjalan, Petsamon ja Sallan alueiden historia 1945-1991 Neuvosto-Karjalan ja Murmanskin alueen historia 1945-1991
scope note: Hit också det avträdda Karelens och de avträdda Petsamo- och Sallaområdenas historia 1945-1991 Sovjetkarelens och Murmanskregionens historia 1945-1991 @sv

Kustannustoimi. Kirjakauppa
type: Class
type: Concept
subclass of: KIRJA-ALA
alternative label: Antikvariaatit (004)
alternative label: DOI-järjestelmä (004)
alternative label: Digitaalinen julkaisutoiminta, kustannustoimi (004)
alternative label: Editointi, kirjan toimittaminen (004)
alternative label: Elektroninen julkaisutoiminta, kustannustoimi (004)
alternative label: Eripainokset, kustannustoiminta (004)
alternative label: Esikoiskirjailijat, kustannustoimi (004)
alternative label: Esikoisteokset, kustannustoimi (004)
alternative label: ISBN-järjestelmä (004)
alternative label: ISSN-järjestelmä (004)
alternative label: Julkaisijat (004)
alternative label: Julkaisijat, kirjat, lehdet, kartat (004)
alternative label: Julkaisut, julkaisutoiminta (004)
alternative label: Julkaisutoiminta (004)
alternative label: Julkaisutoiminta, kirjat, lehdet, kartat (004)
alternative label: Kirjahuutokaupat (004)
alternative label: Kirjakaupat (004)
alternative label: Kirjakerhot (004)
alternative label: Kirjallisuusagentit, kustannustoimi (004)
alternative label: Kirjallisuustilaisuudet, kirjan markkinointi (004)
alternative label: Kirjamessut (004)
alternative label: Kirjankustantajat, kustannusliikkeet (004)
alternative label: Kirjanäyttelyt (004)
alternative label: Kirjasarjat, kirjankustannus (004)
alternative label: Kirjatuotanto (004)
alternative label: Kirjoitettu sana, kustannustoiminta (004)
alternative label: Kopistit, julkaisutoiminta (004)
alternative label: Korjausluku, kirjan toimittaminen (004)
alternative label: Kriittiset editiot, julkaisutoiminta (004)
alternative label: Kustannusala (004)
alternative label: Kustannusala, kirjankustannus (004)
alternative label: Kustannusala, lehtien kustantaminen (004)
alternative label: Kustannuspolitiikka (004)
alternative label: Kustannussopimukset (004)
alternative label: Kustannustoiminta (004)
alternative label: Kustannustoimittajat, kustannustoimittajan työ (004)
alternative label: Kustantajat (004)
alternative label: Kustantajat, kirjankustantajat (004)
alternative label: Kustantajat, lehtien kustantajat (004)
alternative label: Kustantamot (004)
alternative label: Kuvapainatus (004)
alternative label: Käsipaino, kirjapainotaito (004)
alternative label: Nimekkeet, kirjakauppa (004)
alternative label: Nimekkeet, kustannustoiminta (004)
alternative label: Nimiösivut (004)
alternative label: Näköispainokset, kustannustoimi (004)
alternative label: Oikoluku, kirjan toimittaminen (004)
alternative label: Omakustanteet, kustannustoimi (004)
alternative label: Osto- ja myyntiliikkeet, antikvariaatit (004)
alternative label: Painatteet, kustantaminen (004)
alternative label: Painetut julkaisut, kustantaminen (004)
broader: KIRJA-ALA
in scheme: URN:NBN:fi:au:hklj:
notation: 004
related: Kirjapainotaito. Graafinen teollisuus
related: URN:NBN:fi:au:hklj:010
related: Kustantajien ja kirjakauppojen luettelot
related: URN:NBN:fi:au:hklj:018
related: KIRJASTOT. KIRJASTOTOIMI
related: Valinta ja hankinta
related: Esine- ja velvoiteoikeus. Immateriaalioikeudet. Huoneen- ja maanvuokralainsäädäntö
related: URN:NBN:fi:au:hklj:627.73
related: Käyttöjärjestelmät
related: Tekstinkäsittelyohjelmat
related: Taulukkolaskentaohjelmat
related: Tietokantaohjelmat
related: Kuvankäsittelyohjelmat. Grafiikkaohjelmat. Taitto-ohjelmat
related: Tietoliikenneohjelmat
related: Tietokoneiden lisälaitteet
related: URN:NBN:fi:au:hklj:627.753
related: URN:NBN:fi:au:hklj:627.7531
related: URN:NBN:fi:au:hklj:627.7532
related: Antiikkiesineiden keräily
related: Konsertit. Musiikkijuhlat. Musiikkikilpailut. Nuottien ja äänitteiden kustantaminen
related: URN:NBN:fi:au:hklj:800
scope note: Kustannus- ja julkaisupolitiikka Kustannusliikkeet. Omakustannus Kirjan markkinointi, mainonta ja jakelu Lehtien ja karttojen kustantaminen, mainonta ja jakelu Kirjakaupat. Antikvariaatit. Kirjahuutokaupat Kirjakerhot. Kirjanäyttelyt. Kirjamessut Kirjan toimittaminen. Kustannustoimittajan työ Nimiölehden laatiminen. ISBN- ja ISSN-järjestelmät
scope note: Förlags- och publikationspolitik Förlag. Utgivning på eget förlag Marknadsföring och distribution av böcker Utgivning, marknadsföring och distribution av tidningar och kartor Bokhandlar. Antikvariat. Bokauktioner Bokklubbar. Bokutställningar. Bokmässor Att redigera böcker. Förlagsredaktörens arbete Att göra titelblad. ISBN- och ISSN-systemen @sv

Paikallisbibliografiat. Henkilöbibliografiat
type: Class
type: Concept
subclass of: URN:NBN:fi:au:hklj:010
alternative label: Aluebibliografiat (016)
alternative label: Bibliografiat, henkilöbibliografiat (016)
alternative label: Bibliografiat, paikallisbibliografiat (016)
alternative label: Bibliografiset tietokannat, henkilöbibliografiat (016)
alternative label: Bibliografiset tietokannat, paikallisbibliografiat (016)
alternative label: Gradut, bibliografiat (016)
alternative label: Henkilöbibliografiat (016)
alternative label: Kirjaluettelot, henkilöbibliografiat (016)
alternative label: Kirjaluettelot, paikallisbibliografiat (016)
alternative label: Laudaturtyöt, bibliografiat (016)
alternative label: Opinnäyteluettelot (016)
alternative label: Opinnäytetyöt, bibliografiat (016)
alternative label: Opinnäytetyöt, opinnäyteluettelot (016)
alternative label: Opinnäytteet, bibliografiat (016)
alternative label: Opinnäytteet, opinnäyteluettelot (016)
alternative label: Oppilastyöt, bibliografiat (016)
alternative label: Paikallisbibliografiat (016)
alternative label: Pro gradu -tutkielmat, bibliografiat (016)
alternative label: Teemaluettelot, henkilöbibliografiat (016)
alternative label: Teemaluettelot, paikallisbibliografiat (016)
alternative label: Tutkimusluettelot, opinnäyte- ja väitöskirjaluettelot (016)
alternative label: Tutkimusrekisterit, opinnäyte- ja väitöskirjaluettelot (016)
alternative label: Valikoimaluettelot, henkilöbibliografiat (016)
alternative label: Valikoimaluettelot, paikallisbibliografiat (016)
alternative label: Väitöskirjaluettelot (016)
alternative label: Väitöskirjat, väitöskirjaluettelot (016)
alternative label: Avhandlingskataloger (016) @sv
alternative label: Bibliografier, lokalbibliografier (016) @sv
alternative label: Bibliografier, personbibliografier (016) @sv
alternative label: Bibliografiska databaser, lokalbibliografier (016) @sv
alternative label: Bibliografiska databaser, personbibliografier (016) @sv
alternative label: Bokkataloger, lokalbibliografier (016) @sv
alternative label: Bokkataloger, personbibliografier (016) @sv
alternative label: Doktorsavhandlingar, register över doktorsavhandlingar (016) @sv
alternative label: Elevarbeten, bibliografier (016) @sv
alternative label: Forskningskataloger, register över lärdomsprov och doktorsavhandlingar (016) @sv
alternative label: Forskningsregister, register över lärdomsprov och doktorsavhandlingar (016) @sv
alternative label: Förteckningar över lärdomsprov (016) @sv
alternative label: Gradun, bibliografier (016) @sv
alternative label: Lokalbibliografier (016) @sv
alternative label: Lärdomsprov, bibliografier (016) @sv
alternative label: Lärdomsprov, förteckningar över lärdomsprov (016) @sv
alternative label: Personbibliografier (016) @sv
alternative label: Pro gradu-avhandlingar, bibliografier (016) @sv
alternative label: Regionala bibliografier (016) @sv
alternative label: Temakataloger, lokalbibliografier (016) @sv
alternative label: Temakataloger, personbibliografier (016) @sv
alternative label: Urvalskataloger, lokalbibliografier (016) @sv
alternative label: Urvalskataloger, personbibliografier (016) @sv
broader: URN:NBN:fi:au:hklj:010
in scheme: URN:NBN:fi:au:hklj:
notation: 016
preferred label: Local bibliographies. Personal bibliographies @en
preferred label: Lokalbibliografier. Personbibliografier @sv
related: Anonyymi- ja pseudonyymiluettelot
related: Yleisbibliografiat. Kansallisbibliografiat
related: Kirjastojen luettelot
related: Erikoisalojen bibliografiat
related: Sanakirjat. Hakuteokset
related: Esseet. Taidearvostelut
related: Kausijulkaisut
related: Yhdistykset. Laitokset. Kokoukset
related: Taideopinnot
related: Kokoomateokset
related: URN:NBN:fi:au:hklj:709
related: URN:NBN:fi:au:hklj:710
related: URN:NBN:fi:au:hklj:720
related: KUVANVEISTOTAIDE
related: MAALAUSTAIDE. PIIRUSTUSTAIDE
related: GRAAFINEN TAIDE. VALOKUVAUS
related: URN:NBN:fi:au:hklj:760
related: URN:NBN:fi:au:hklj:770
related: Musiikkibibliografiat. Diskografiat
scope note: Yleiset paikallis- ja aluebibliografiat bibliografian aineistotyypistä riippumatta Tiettyä paikkakuntaa tai aluetta koskevien julkaisujen luettelot ja valikoimaluettelot Kaikki henkilöbibliografiat bibliografian materiaalityypistä tai henkilön edustamasta alasta riippumatta; poikkeuksena kuitenkin taiteilijoiden teosluettelot, jotka ovat ko. taiteenalan luokassa Tiettyä henkilöä tai henkilöryhmää koskevien julkaisujen luettelot ja valikoimaluettelot sekä tietyn henkilön tai henkilöryhmän julkaisemien teosten luettelot ja valikoimaluettelot Opinnäyteluettelot ja väitöskirjaluettelot alasta riippumatta Aikakausjulkaisujen, sanomalehtien, mikrofilmien ja -korttien luettelot samassa luokassa kuin vastaavat kirjaluettelot
scope note: Allmänna lokal- och personbibliografier oavsett bibliografins mediatyp Kataloger och urvalsförteckningar över publikationer som rör bestämda orter eller områden Alla personbibliografier oavsett bibliografins mediatyp eller personernas verksamhetsområde, undantaget konstnärers opusförteckningar, som klassificeras enligt området i fråga inom konsten Kataloger och urvalsförteckningar över publikationer som rör enskilda personer eller persongrupper samt kataloger och urvalsförteckningar över verk publicerade av enskilda personer eller persongrupper Kataloger över lärdomsprov och dissertationer oavsett område Kataloger över seriella publikationer, tidningar, mikrofilmer och mikrokort förs till samma klass som motsvarande litteraturförteckningar @sv

Tietopalvelu. Informaatiopalvelu
type: Class
type: Concept
subclass of: Yleisönpalvelu
alternative label: Boolen haut (024.2)
alternative label: Dokumentaatio, kirjaston informaatiopalvelu (024.2)
alternative label: Dokumentaatiopalvelu, kirjastot (024.2)
alternative label: Dokumentointi, kirjaston informaatiopalvelu (024.2)
alternative label: Haku, tiedonhaku, kirjastot (024.2)
alternative label: Hakujärjestelmät, tiedonhaku, kirjastot (024.2)
alternative label: Hakupalvelut, tiedonhaku, kirjastot (024.2)
alternative label: Hakusanat, tiedonhaku, kirjastot (024.2)
alternative label: Hakuteosten käyttö, kirjaston tietopalvelu (024.2)
alternative label: Informaatikot, kirjastotoiminta (024.2)
alternative label: Informaatiopalvelu, kirjastot (024.2)
alternative label: Informatiikka, kirjaston tietopalvelu (024.2)
alternative label: Jäljennepalvelu, tietopalvelu, kirjastot (024.2)
alternative label: Kirjallisuuspalvelu, kirjastot (024.2)
alternative label: Kirjastot, käsikirjastot (024.2)
alternative label: Käsikirjastot (024.2)
alternative label: Laajennettu kirjastotoiminta, tietokannat ja -verkot (024.2)
alternative label: Lukusalit, kirjastotoiminta (024.2)
alternative label: Opintosalitoiminta (024.2)
alternative label: Referenssipalvelu, kirjaston tietopalvelu (024.2)
alternative label: Tiedonhaku, kirjastot (024.2)
alternative label: Tiedonhakujärjestelmät, kirjastot (024.2)
alternative label: Tiedonhankinta, kirjastot (024.2)
alternative label: Tiedonkeruu, kirjastot (024.2)
alternative label: Tiedonkulku, kirjastot (024.2)
alternative label: Tiedonlähteet, kirjastot (024.2)
alternative label: Tiedonsaanti, kirjastot (024.2)
alternative label: Tietohuolto, kirjastot (024.2)
alternative label: Tietopalvelu, kirjastot (024.2)
alternative label: Bibliotek, referensbibliotek (024.2) @sv
alternative label: Booleska sökningar (024.2) @sv
alternative label: Datainsamling, bibliotek (024.2) @sv
alternative label: Dokumentation, bibliotekets informationstjänst (024.2) @sv
alternative label: Dokumentationstjänst, bibliotek (024.2) @sv
alternative label: Dokumentering, bibliotekets informationstjänst (024.2) @sv
alternative label: Informatik, bibliotekets informationstjänst (024.2) @sv
alternative label: Informatiker, biblioteksverksamhet (024.2) @sv
alternative label: Informationens gång, bibliotek (024.2) @sv
alternative label: Informationsanskaffning, bibliotek (024.2) @sv
alternative label: Informationsförsörjning, bibliotek (024.2) @sv
alternative label: Informationskällor, bibliotek (024.2) @sv
alternative label: Informationsservice, bibliotek (024.2) @sv
alternative label: Informationssökning, bibliotek (024.2) @sv
alternative label: Informationssökningssystem, bibliotek (024.2) @sv
alternative label: Informationstjänst, bibliotek (024.2) @sv
alternative label: Kopieringstjänst, informationstjänst, bibliotek (024.2) @sv
alternative label: Litteraturtjänst, bibliotek (024.2) @sv
alternative label: Läsesalar, biblioteksverksamhet (024.2) @sv
alternative label: Referensbibliotek (024.2) @sv
alternative label: Referenstjänst, bibliotekets informationstjänst (024.2) @sv
alternative label: Studiesalsverksamhet (024.2) @sv
broader: Yleisönpalvelu
in scheme: URN:NBN:fi:au:hklj:
notation: 024.2
related: URN:NBN:fi:au:hklj:010
related: URN:NBN:fi:au:hklj:018
related: Kirjaston käyttö. Kirjastososiologia
related: Lastenkirjastot
related: Koulukirjastot
related: Erityisten väestöryhmien kirjastopalvelut
related: Sairaalakirjastot
related: Erikoiskokoelmat
related: Paikalliskokoelmat
related: Musiikkikirjastot
related: Kirjastoautot. Kirjastoveneet
related: Muu kirjastotoiminta
related: Kirjastonkäytön opastus
related: Yleiset kirjastot
related: Erikoiskirjastot. Yhdistysten, laitosten ja yritysten kirjastot
related: URN:NBN:fi:au:hklj:028
related: Dokumentaatio ja informaatiopalvelu yleensä
related: Museonhoito
related: Arkistonhoito
related: URN:NBN:fi:au:hklj:061
related: URN:NBN:fi:au:hklj:063
scope note: Tieto- ja informaatiopalvelu kirjastossa Tiedonhakujärjestelmät ja -menetelmät Hakuteosten, hakemistojen, tiedostojen, tietokantojen ja tietoverkkojen käyttö tietopalvelussa ja kirjastossa Kirjallisuus-, referenssi- ja jäljennepalvelu Kirjallisuuskatsausten ja tiivistelmien laatiminen tieto- ja informaatiopalvelun kannalta Käsikirjasto- ja lukusalitoiminta
scope note: Informationsåtervinning och informationstjänst i bibliotek Söksystem och -metoder Användning av uppslagsverk, index, register, databaser och datanät för informationssökning och i bibliotek Litteratur-, referens- och kopieringstjänst Utarbetande av litteraturöversikter och referat för informationsåtervinning och informationstjänst Referensbibliotek och läsesalar @sv

Itämainen filosofia
type: Class
type: Concept
subclass of: Filosofian historia
alternative label: Aasia, itämainen filosofia (108.1)
alternative label: Arabialainen filosofia (108.1)
alternative label: Askeesi, itämainen filosofia (108.1)
alternative label: Filosofian historia, itämainen, vuoteen 1900 (108.1)
alternative label: Intia, filosofia vuoteen 1900 (108.1)
alternative label: Itämainen filosofia, vuoteen 1900 (108.1)
alternative label: Itämainen kulttuuri, itämainen filosofia (108.1)
alternative label: Itämaisuus, itämainen filosofia (108.1)
alternative label: Jang ja jin, itämainen filosofia (108.1)
alternative label: Jin ja jang, itämainen filosofia (108.1)
alternative label: Orientalismi, itämainen filosofia (108.1)
alternative label: Qi, itämainen filosofia (108.1)
alternative label: Skeptikot, antiikin filosofia (108.1)
alternative label: Sofismi (108.1)
alternative label: Sofistit (108.1)
alternative label: Stoalaisuus (108.1)
alternative label: Viisi elementtiä, itämainen filosofia (108.1)
alternative label: Yang ja yin, itämainen filosofia (108.1)
alternative label: Yin ja yang, itämainen filosofia (108.1)
alternative label: Arabisk filosofi (108.1) @sv
alternative label: Asien, österländsk filosofi (108.1) @sv
alternative label: Askes, österländsk filosofi (108.1) @sv
alternative label: Fem elementen, österländsk filosofi (108.1) @sv
alternative label: Filosofins historia, österländsk, till år 1900 (108.1) @sv
alternative label: Indien, filosofi till år 1900 (108.1) @sv
alternative label: Jang och jin, österländsk filosofi (108.1) @sv
alternative label: Jin och jang, österländsk filosofi (108.1) @sv
alternative label: Orientalisk kultur, österländsk filosofi (108.1) @sv
alternative label: Orientalism, österländsk filosofi (108.1) @sv
alternative label: Qi, österländsk filosofi (108.1) @sv
alternative label: Skeptiker, antikens filosofi (108.1) @sv
alternative label: Sofism (108.1) @sv
alternative label: Sofister (108.1) @sv
alternative label: Stoicism (108.1) @sv
alternative label: Yang och yin, österländsk filosofi (108.1) @sv
alternative label: Yin och yang, österländsk filosofi (108.1) @sv
alternative label: Österländsk filosofi, till år 1900 (108.1) @sv
broader: Filosofian historia
in scheme: URN:NBN:fi:au:hklj:
notation: 108.1
preferred label: Eastern philosophy @en
preferred label: Österländsk filosofi @sv
related: Oppikirjat. Johdatukset filosofiaan
related: Esseet
related: Vanhan ajan filosofia
related: Nykyajan filosofia
related: URN:NBN:fi:au:hklj:110
related: Tietoteorian historia ja suunnat
related: URN:NBN:fi:au:hklj:280
related: Itä-Aasian uskonnot ja mytologiat
related: Intian uskonnot ja mytologiat
related: Buddhalaisuus ja sen mytologia
related: Jooga
related: Itämaisperäiset lajit. Budo
related: URN:NBN:fi:au:hklj:919
related: Vanhan ajan kulttuurihistoria
related: Keskiajan kulttuurihistoria 400-1499
related: Uuden ajan kulttuurihistoria 1500-1788
related: Uusimman ajan kulttuurihistoria 1789-1913
related: Nykyajan kulttuurihistoria 1914-1938
related: Nykyajan kulttuurihistoria 1939-
related: Erotiikan historia
related: Muodin historia
scope note: Intian, Kiinan ja Japanin perinteinen itämainen filosofia ja sen historia vuoteen 1900 Filosofian erikoisalojen kysymykset alan mukaisessa luokassa
scope note: Traditionell österländsk filosofi i Indien, Kina och Japan och dess historia till år 1900 Specialfrågor inom filosofin klassificeras enligt område @sv

Kasvatuspsykologia
type: Class
type: Concept
subclass of: KASVATUS. OPETUS. KASVATUSTIEDE
alternative label: Aggressiivisuus, kasvatuspsykologia (180.2)
alternative label: Emotionaalinen kehitys, kasvatuspsykologia (180.2)
alternative label: Esimurrosikä, kasvatuspsykologi (180.2)
alternative label: Esipuberteetti, kasvatuspsykologia (180.2)
alternative label: Hyperaktiivisuus, kasvatuspsykologia (180.2)
alternative label: Hyväksyminen, kasvatuspsykologia (180.2)
alternative label: Hyväksyntä, kasvatuspsykologia (180.2)
alternative label: Itsesäätely, kasvatuspsykologia (180.2)
alternative label: Kannustimet, kasvatuspsykologia (180.2)
alternative label: Kannustus, kasvatuspsykologia (180.2)
alternative label: Kasvatus, kasvatuspsykologia (180.2)
alternative label: Kasvatusala, kasvatuspsykologia (180.2)
alternative label: Kasvatuspsykologia (180.2)
alternative label: Keskittymiskyky, kasvatuspsykologia (180.2)
alternative label: Keskittymiskyky, oppimisvaikeudet (180.2)
alternative label: Kiintymys, kasvatuspsykologia (180.2)
alternative label: Kotitausta, kasvatuspsykologia (180.2)
alternative label: Kouluikäiset, kasvatuspsykologia (180.2)
alternative label: Kouluikäiset, koulukypsyys (180.2)
alternative label: Koulukypsyys (180.2)
alternative label: Koulukypsyystestit (180.2)
alternative label: Koululaiset, kasvatuspsykologia (180.2)
alternative label: Koululaiset, koulukypsyys (180.2)
alternative label: Koulutettavuus, kasvatuspsykologia (180.2)
alternative label: Koulutushalukkuus, kasvatuspsykologia (180.2)
alternative label: Kouluvaikeudet, kasvatuspsykologia (180.2)
alternative label: Kouluvalmius (180.2)
alternative label: Käyttäytymishäiriöt, kasvatuspsykologia (180.2)
alternative label: Käytöshäiriöt, kasvatuspsykologia (180.2)
alternative label: Lapsen kehitys, kasvatuspsykologia (180.2)
alternative label: Lapset, kasvatuspsykologia (180.2)
alternative label: Lapsipsykologia, kasvatuspsykologia (180.2)
alternative label: Lasten kehitys, kasvatuspsykologia (180.2)
alternative label: Lastenkasvatus, kasvatuspsykologia (180.2)
alternative label: Learning by doing, kasvatuspsykologia (180.2)
alternative label: Motivaatio, kasvatuspsykologia (180.2)
alternative label: Motivaatioilmasto, kasvatuspsykologia (180.2)
alternative label: Motivaatiopsykologia, kasvatuspsykologia (180.2)
alternative label: Motivointi, kasvatuspsykologia (180.2)
alternative label: Murrosikä, kasvatuspsykologia (180.2)
alternative label: Murrosikäiset, kasvatuspsykologia (180.2)
alternative label: Nuoriso-ongelmat, kasvatuspsykologia (180.2)
alternative label: Omaksuminen, kasvatuspsykologia (180.2)
alternative label: Ongelmalapset, kasvatuspsykologia (180.2)
alternative label: Ongelmanuoret, kasvatuspsykologia (180.2)
alternative label: Opiskelumotivaatio, kasvatuspsykologia (180.2)
alternative label: Oppiminen, kasvatuspsykologia (180.2)
alternative label: Oppimiskyky, kasvatuspsykologia (180.2)
alternative label: Oppimiskäsitykset, kasvatuspsykologia (180.2)
alternative label: Oppimisvaikeudet, kasvatuspsykologia (180.2)
alternative label: Oppimisvalmiudet, koulukypsyys (180.2)
broader: KASVATUS. OPETUS. KASVATUSTIEDE
in scheme: URN:NBN:fi:au:hklj:
notation: 180.2
related: URN:NBN:fi:au:hklj:120
related: Ajattelu. Älykkyys. Mielikuvitus
related: Oppimisen psykologia
related: Kokeellinen psykologia. Psykometriikka
related: Lapsuuden ja nuoruuden psykologia
related: Kasvatusfilosofia. Kasvatustavoitteet
related: Käytännön kasvatus
related: Kokeellinen kasvatus
related: Kasvatusneuvonta. Kasvatusneuvolat
related: Perhe- ja kotikasvatus
related: URN:NBN:fi:au:hklj:181.7
related: Erityislahjakkaiden opetus
related: URN:NBN:fi:au:hklj:181.9
related: Luku-, kirjoitus- ja puhehäiriöiset
related: Kuulovammaiset
related: Näkövammaiset
related: Liikuntavammaiset
related: Kehitysvammaiset
related: URN:NBN:fi:au:hklj:182
related: URN:NBN:fi:au:hklj:183.5
related: URN:NBN:fi:au:hklj:183.7
scope note: Kasvatuspsykologian yleisteokset Oppimis- ja kasvatusvaikeudet yleensä Koulukypsyys. Koulukypsyystestit Kasvatuspsykologian sovellukset kasvatuksen eri aloille alan mukaisessa luokassa Jos teoksessa on sekä kasvatuspsykologiaa että oppimisen psykologiaa tai lapsipsykologiaa, on etusija luokalla 180.2 Jos teoksessa on sekä kasvatuspsykologiaa että käytännön kasvatusohjeita, on etusija luokalla 181+
scope note: Allmänna verk om pedagogisk psykologi Inlärningssvårigheter och uppfostringssvårigheter i allmänhet Skolmognad. Skolmognadstest Tillämpningar av pedagogisk psykologi på olika områden som rör fostran klassificeras enligt område Om verket innehåller både pedagogisk psykologi och inlärningspsykologi eller barnpsykologi, ges företräde åt klass 180.2 Om verket innehåller både pedagogisk psykologi och praktiska uppfostringsråd, ges företräde åt klass 181+ @sv

Perhe- ja kotikasvatus
type: Class
type: Concept
subclass of: Käytännön kasvatus
alternative label: Ainoa lapsi, kasvatusoppaat (181.6)
alternative label: Biologiset lapset, koti- ja perhekasvatus (181.6 +)
alternative label: Biologiset vanhemmat, koti-ja perhekasvatus (181.6 +)
alternative label: Emotionaalinen kehitys, koti- ja perhekasvatus (181.6)
alternative label: Erilaisuus, koti-ja perhekasvatus (181.6)
alternative label: Esikouluikäiset, koti- ja perhekasvatus (181.6)
alternative label: Esimurrosikä, koti- ja perhekasvatus (181.6)
alternative label: Esipuberteetti, koti- ja perhekasvatus (181.6)
alternative label: Hyperaktiivisuus, koti- ja perhekasvatus (181.6)
alternative label: Hyväksyminen, koti- ja perhekasvatus (181.6)
alternative label: Hyväksyntä, koti- ja perhekasvatus (181.6)
alternative label: Häiriökäyttäytyminen, koti- ja perhekasvatus (181.6)
alternative label: Identtiset kaksoset, koti- ja perhekasvatus (181.6)
alternative label: Ikäkaudet, koti-ja perhekasvatus (181.6)
alternative label: Interaktiivisuus, koti- ja perhekasvatus (181.6)
alternative label: Kaksoset, koti- ja perhekasvatus (181.6)
alternative label: Kannustimet, koti- ja perhekasvatus (181.6)
alternative label: Kannustus, koti- ja perhekasvatus (181.6)
alternative label: Karkaaminen, karkaaminen kotoa (181.6)
alternative label: Kasvattilapset, koti- ja perhekasvatus (181.6)
alternative label: Kasvatus, koti- ja perhekasvatus (181.6)
alternative label: Kasvatusala, koti- ja perhekasvatus (181.6)
alternative label: Kasvatuskodit, koti- ja perhekasvatus (181.6)
alternative label: Kasvatusoppaat, koti- ja perhekasvatus (181.6)
alternative label: Kasvatusvanhemmat, koti- ja perhekasvatus (181.6)
alternative label: Kasvuympäristö, koti-ja perhekasvatus (181.6)
alternative label: Kaveruus, koti- ja perhekasvatus (181.6)
alternative label: Koti, koti- ja perhekasvatus (181.6)
alternative label: Kotikasvatus (181.6)
alternative label: Kouluikäiset, koti- ja perhekasvatus (181.6)
alternative label: Koululaiset, koti- ja perhekasvatus (181.6)
alternative label: Kuri, koti- ja perhekasvatus (181.6)
alternative label: Käyttäytymishäiriöt, koti- ja perhekasvatus (181.6)
alternative label: Käytännöllinen kasvatus, koti- ja perhekasvatus (181.6)
alternative label: Käytöshäiriöt, koti- ja perhekasvatus (181.6)
alternative label: Lapsen kehitys, koti- ja perhekasvatus (181.6)
alternative label: Lapset, koti- ja perhekasvatus (181.6)
alternative label: Lapsi-vanhempisuhde, koti- ja perhekasvatus (181.6)
alternative label: Lasten kehitys, koti- ja perhekasvatus (181.6)
alternative label: Lastenkasvatus, koti- ja perhekasvatus (181.6)
alternative label: Leikki-ikäiset, koti- ja perhekasvatus (181.6)
alternative label: Murrosikä, koti- ja perhekasvatus (181.6)
alternative label: Murrosikäiset, koti- ja perhekasvatus (181.6)
alternative label: Nuoret, koti- ja perhekasvatus (181.6)
alternative label: Nuoriso-ongelmat, koti- ja perhekasvatus (181.6)
alternative label: Ongelmalapset, koti- ja perhekasvatus (181.6)
alternative label: Ongelmanuoret, koti- ja perhekasvatus (181.6)
alternative label: Perhekasvatus (181.6)
alternative label: Perhetausta, koti- ja perhekasvatus (181.6)
alternative label: Persoonallisuuden kehitys, koti- ja perhekasvatus (181.6)
alternative label: Perusturvallisuus, koti- ja perhekasvatus (181.6)
broader: Käytännön kasvatus
in scheme: URN:NBN:fi:au:hklj:
notation: 181.6
related: Lapsuuden ja nuoruuden psykologia
related: Ihmissuhteiden psykologia
related: Kasvatusfilosofia. Kasvatustavoitteet
related: Kasvatuspsykologia
related: Kasvatusneuvonta. Kasvatusneuvolat
related: URN:NBN:fi:au:hklj:181.7
related: URN:NBN:fi:au:hklj:182
related: URN:NBN:fi:au:hklj:183.5
related: URN:NBN:fi:au:hklj:183.7
related: Elämänohjeet
related: Kristillinen etiikka
related: Sielunhoito
related: Perhe- ja holhousoikeus
related: Perhesosiologia
related: Perhepolitiikka. Lapsipolitiikka. Nuorisopolitiikka
related: Päivähoito
related: Lastenhoito
related: Seksologia
related: Raskaus. Sikiönkehitys. Synnytys. Gynekologia
related: Lapsi- ja nuorisopsykiatria
related: URN:NBN:fi:au:hklj:618.85
scope note: Vanhemmille tarkoitetut kasvatusoppaat sekä perhe ja kotikasvatusta koskeva kasvatustieteellinen tutkimus Varhaiskasvatus perhe- ja kotikasvatuksen kannalta Varhaiskasvatuksen yleisteokset Leikki-, koulu- ja murrosikäiset perhe- ja kotikasvatuksen kannalta Jos teoksessa on sekä käytännön kasvatusohjeita että lapsipsykologiaa tai kasvatuspsykologiaa, on etusija luokalla 181.6
scope note: Uppfostringsråd till föräldrar samt pedagogisk forskning som rör hemuppfostran Uppfostran under de första åren ur familjefostrans och hemuppfostrans synvinkel Allmänna verk som rör uppfostran under de första åren Barn i lek- och skolåldern samt tonåringar ur familjefostrans och hemuppfostrans synvinkel Om verket innehåller både praktiska uppfostringsråd och barnpsykologi eller pedagogisk psykologi ges företräde åt klass 181.6 @sv

Uskonnon opetusoppi
type: Class
type: Concept
subclass of: URN:NBN:fi:au:hklj:182
alternative label: Kristinusko, opetusoppi (182.2)
alternative label: Uskonnollinen kasvatus, uskonnonopetus, didaktiikka (182.2)
alternative label: Uskonnonpedagogiikka, didaktiikka (182.2)
alternative label: Uskonto, opetusoppi (182.2)
alternative label: Uskontokasvatus, uskonnon opetusoppi (182.2)
alternative label: Uskontopedagogiikka, didaktiikka (182.2)
alternative label: Kristendom, didaktik (182.2) @sv
alternative label: Religion, didaktik (182.2) @sv
alternative label: Religionsfostran, religionens didaktik (182.2) @sv
alternative label: Religionspedagogik, didaktik (182.2) @sv
alternative label: Religiös uppfostran, religionsundervisning didaktik (182.2) @sv
broader: URN:NBN:fi:au:hklj:182
in scheme: URN:NBN:fi:au:hklj:
notation: 182.2
preferred label: Didactics in religions @en
preferred label: Religionens didaktik @sv
related: Oppimisen psykologia
related: Hypnoosi. Suggestio
related: URN:NBN:fi:au:hklj:181.7
related: URN:NBN:fi:au:hklj:181.9
related: URN:NBN:fi:au:hklj:183
related: URN:NBN:fi:au:hklj:183.5
related: URN:NBN:fi:au:hklj:183.7
related: Erikoiskoulut. Kokeilukoulut
related: URN:NBN:fi:au:hklj:184
related: Muiden maiden yliopistot ja korkeakoulut
related: URN:NBN:fi:au:hklj:185
related: URN:NBN:fi:au:hklj:188.4
related: Radio- ja televisiotoiminta
related: Radiotoiminta
related: URN:NBN:fi:au:hklj:384.42
related: URN:NBN:fi:au:hklj:627.7
related: URN:NBN:fi:au:hklj:627.73
related: URN:NBN:fi:au:hklj:627.751
related: URN:NBN:fi:au:hklj:627.753
related: URN:NBN:fi:au:hklj:627.7531
related: URN:NBN:fi:au:hklj:627.7532
scope note: Pääluokkaan 200 kuuluvien erikoisalojen tai aineiden opetusppi Tässä esim. uskonnon, uskontotieteen ja kirkkohistorian opetusoppi
scope note: Didaktik som rör specialområden eller ämnen som hör till huvudklass 200 Hit didaktik inom t.ex. religion, religionsvetenskap och kyrkohistoria @sv

Historian opetusoppi
type: Class
type: Concept
subclass of: URN:NBN:fi:au:hklj:182
alternative label: Historian opetusoppi (182.9)
alternative label: Historiens didaktik (182.9) @sv
broader: URN:NBN:fi:au:hklj:182
in scheme: URN:NBN:fi:au:hklj:
notation: 182.9
preferred label: Didactics in history @en
preferred label: Historiens didaktik @sv
related: Oppimisen psykologia
related: Hypnoosi. Suggestio
related: URN:NBN:fi:au:hklj:181.7
related: URN:NBN:fi:au:hklj:181.9
related: URN:NBN:fi:au:hklj:183
related: URN:NBN:fi:au:hklj:183.5
related: URN:NBN:fi:au:hklj:183.7
related: Erikoiskoulut. Kokeilukoulut
related: URN:NBN:fi:au:hklj:184
related: Muiden maiden yliopistot ja korkeakoulut
related: URN:NBN:fi:au:hklj:185
related: URN:NBN:fi:au:hklj:188.4
related: Radio- ja televisiotoiminta
related: Radiotoiminta
related: URN:NBN:fi:au:hklj:384.42
related: URN:NBN:fi:au:hklj:627.7
related: URN:NBN:fi:au:hklj:627.73
related: URN:NBN:fi:au:hklj:627.751
related: URN:NBN:fi:au:hklj:627.753
related: URN:NBN:fi:au:hklj:627.7531
related: URN:NBN:fi:au:hklj:627.7532
scope note: Tässä pääluokkaan 9 kuuluvien erikoisalojen tai aineiden opetusoppi Tässä esim. historian, kulttuurihistorian ja arkeologian opetusoppi
scope note: Hit och till underklasserna didaktik som rör specialområden eller ämnen som hör till huvudklass 900 Hit didaktik inom t.ex. historia, kulturhistoria och arkeologi @sv

Muut yliopistot ja korkeakoulut
type: Class
type: Concept
subclass of: URN:NBN:fi:au:hklj:184
alternative label: Joensuun korkeakoulu (184.8)
alternative label: Joensuun yliopisto (184.8)
alternative label: Lapin korkeakoulu (184.8)
alternative label: Joensuu högskola (184.8) @sv
alternative label: Joensuu universitet (184.8) @sv
alternative label: Lapplands högskola (184.8) @sv
broader: URN:NBN:fi:au:hklj:184
in scheme: URN:NBN:fi:au:hklj:
narrower: Teknilliset korkeakoulut
narrower: Kauppakorkeakoulut
notation: 184.8
preferred label: Other higher education institutes @en
preferred label: Övriga universitet och högskolor @sv
related: Tiedepolitiikka. Tieteen sosiologia
related: URN:NBN:fi:au:hklj:181.7
related: URN:NBN:fi:au:hklj:182
related: URN:NBN:fi:au:hklj:183
related: URN:NBN:fi:au:hklj:183.5
related: URN:NBN:fi:au:hklj:183.7
related: Muiden maiden yliopistot ja korkeakoulut
related: URN:NBN:fi:au:hklj:185
related: Oppikirjat. Oppaat. Harjoituskirjat. Tehtäväkokoelmat
related: URN:NBN:fi:au:hklj:330
related: Asiakirjakaavat ja -ohjeet. Oikeusoppaat
related: URN:NBN:fi:au:hklj:340
related: URN:NBN:fi:au:hklj:390
related: Eläinlääketiede
related: URN:NBN:fi:au:hklj:760
related: URN:NBN:fi:au:hklj:770
related: MUSIIKKI
scope note: Tässä ja alaluokissa Suomen muut yliopistot ja korkeakoulut Joensuun, Kuopion ja Lapin korkeakoulut
scope note: Hit och till underklasserna övriga universitet och högskolor i Finland Joensuu, Kuopio och Lapplands högskola @sv

Kuolema ja kuolemanjälkeinen elämä
type: Class
type: Concept
subclass of: KRISTILLINEN DOGMATIIKKA
alternative label: Helvetti, kristinusko (237)
alternative label: Ikuinen elämä, kristinusko (237)
alternative label: Inkarnaatio, kristinusko (237)
alternative label: Kadotus, kristillinen oppi (237)
alternative label: Kuolema, kristinuskon dogmatiikka (237)
alternative label: Kuolemanjälkeinen elämä, kristinusko (237)
alternative label: Kuolemanpelko, kristillinen dogmatiikka (237)
alternative label: Kuolemattomuus, kristinusko (237)
alternative label: Kuolleet, kristinusko (237)
alternative label: Paratiisi, kristinusko (237)
alternative label: Sielu, kristinusko (237)
alternative label: Sielun kuolemattomuus, kristinusko (237)
alternative label: Taivas, kristillinen dogmatiikka (237)
alternative label: Ylösnousemus (237)
alternative label: Avlidna, kristendom (237) @sv
alternative label: Döden, kristendomens dogmatik (237) @sv
alternative label: Dödsfruktan, kristen dogmatik (237) @sv
alternative label: Evigt liv, kristendom (237) @sv
alternative label: Förtappelse, kristen lära (237) @sv
alternative label: Helvetet, kristendom (237) @sv
alternative label: Himlen, kristen dogmatik (237) @sv
alternative label: Inkarnation, kristendom (237) @sv
alternative label: Livet efter döden, kristendom (237) @sv
alternative label: Odödlighet, kristendom (237) @sv
alternative label: Paradiset, kristendom (237) @sv
alternative label: Själ, kristendom (237) @sv
alternative label: Själens odödlighet, kristendom (237) @sv
alternative label: Uppståndelse (237) @sv
broader: KRISTILLINEN DOGMATIIKKA
in scheme: URN:NBN:fi:au:hklj:
notation: 237
preferred label: Death and the afterlife @en
preferred label: Döden och livet efter detta @sv
related: URN:NBN:fi:au:hklj:192
related: Kuolemakokemukset
related: Elämä. Kuolema
related: Pelastusoppi. Kristillinen antropologia
related: URN:NBN:fi:au:hklj:280
related: Itä-Aasian uskonnot ja mytologiat
related: Intian uskonnot ja mytologiat
related: Buddhalaisuus ja sen mytologia
related: Muinais-Egyptin ja Etu-Aasian uskonnot ja mytologiat
related: Antiikin Kreikan ja Rooman uskonnot ja mytologiat
related: Persian uskonnot ja mytologiat
related: Islam ja sen mytologia
related: Juutalaisten uskonto ja sen mytologia
related: Muut uskonnot ja mytologiat
related: Afrikan alkuperäiskansojen uskonnot
related: Amerikan alkuperäiskansojen uskonnot ja mytologiat
related: Australian ja Oseanian alkuperäiskansojen uskonnot ja mytologiat
related: Muinaissuomalaiset ja suomalais-ugrilaiset uskonnot ja mytologiat
related: Muinaisgermaaniset, -balttilaiset, -slaavilaiset ja -kelttiläiset uskonnot ja mytologiat
related: Muinaispohjoismaiset uskonnot ja mytologiat
related: URN:NBN:fi:au:hklj:618.24
scope note: Kuolema ja kuolemanjälkeinen elämä kristinuskon kannalta Sielun kuolemattomuus. Iankaikkinen elämä. Taivas. Helvetti
scope note: Döden och livet efter detta ur kristendomens synvinkel Själens odödlighet. Det eviga livet. Himlen. Helvetet @sv

Juutalaisten uskonto ja sen mytologia
type: Class
type: Concept
subclass of: URN:NBN:fi:au:hklj:280
alternative label: Avioliittoon vihkiminen, uskontotiede, eri uskonnot (282 ... 289 +)
alternative label: Juutalainen kirjallisuus (288)
alternative label: Juutalaiset, uskonto (288)
alternative label: Juutalaisuus, uskonto (288)
alternative label: Karaiitit, juutalaisuus (288)
alternative label: Maailmanuskonnot, juutalaisuus (288)
alternative label: Mizrahijuutalaiset, juutalaisuus (288)
alternative label: Myöhäisjuutalaisuus, uskonto (288)
alternative label: Patriarkat, juutalaisuus (288)
alternative label: Sefardijuutalaiset, uskonto (288)
alternative label: Sionismi (288)
alternative label: Synagogat, juutalaisuus (288)
alternative label: Talmud (288)
alternative label: Uskonnot, juutalaisuus (288)
alternative label: Uskontokunnat, juutalaisuus (288)
alternative label: Varhaisjuutalaisuus, uskonto (288)
alternative label: Judar, religion (288) @sv
alternative label: Judendom, religion (288) @sv
alternative label: Judisk litteratur (288) @sv
alternative label: Karaiter, judendom (288) @sv
alternative label: Mizrahi, judendom (288) @sv
alternative label: Patriarker, judendom (288) @sv
alternative label: Religioner, judendom (288) @sv
alternative label: Religionssamfund, judendom (288) @sv
alternative label: Sefardijudar, religion (288) @sv
alternative label: Senjudendom, religion (288) @sv
alternative label: Sionism (288) @sv
alternative label: Synagogor, judendom (288) @sv
alternative label: Tidig judendom, religion (288) @sv
alternative label: Världsreligioner, judendom (288) @sv
broader: URN:NBN:fi:au:hklj:280
in scheme: URN:NBN:fi:au:hklj:
notation: 288
preferred label: Judaism and Jewish mythology @en
preferred label: Judendom och judisk mytologi @sv
related: URN:NBN:fi:au:hklj:110
related: RAJATIETO
related: URN:NBN:fi:au:hklj:192
related: Kuolemakokemukset
related: Uskonnonfilosofia
related: Elämä. Kuolema
related: Luominen. Kehitys
related: URN:NBN:fi:au:hklj:209
related: URN:NBN:fi:au:hklj:210
related: Vanha Testamentti
related: Vanhan Testamentin historialliset kirjat
related: Vanhan Testamentin runolliset kirjat
related: Vanhan Testamentin profeetalliset kirjat
related: Jumalan olemus
related: Enkelit. Paholaiset. Demonit
related: Kuolema ja kuolemanjälkeinen elämä
related: Lähetystyö
related: Juutalaisten asema. Antisemitismi
related: URN:NBN:fi:au:hklj:807
related: Israelin ja Palestiinan historia
related: URN:NBN:fi:au:hklj:992
scope note: Talmud

Kansainvälinen yhteistyö
type: Class
type: Concept
subclass of: URN:NBN:fi:au:hklj:320
alternative label: Alueellinen yhteistyö, kansainvälinen yhteistyö (326 +)
alternative label: Alueyhteistyö, kansainvälinen yhteistyö (326 +)
alternative label: Avustusjärjestöt, kansainväliset (326 +)
alternative label: Delegaatiot, kansainvälinen yhteistyö (326 +)
alternative label: Demokratiavaje, kansainvälinen yhteistyö (326 +)
alternative label: EU-kriittisyys, poliittiset asenteet, kansainvälinen yhteistyö (326)
alternative label: Eurooppalaistuminen, kansainvälinen yhteistyö (326 +)
alternative label: Globaali hallinta, kansainvälinen yhteistyö (326 +)
alternative label: Globaalihallinta, kansainvälinen yhteistyö (326 +)
alternative label: Global governance, kansainvälinen yhteistyö (326 +)
alternative label: Globalisaatio, kansainvälinen yhteistyö (326 +)
alternative label: Globalisaation hallinta, kansainvälinen yhteistyö (326 +)
alternative label: Harmonisointi, kansainvälinen yhteistyö (326 +)
alternative label: Helsingin sopimus, kansainvälinen yhteistyö (326)
alternative label: Henkilöapu, Punainen Risti (326)
alternative label: Henkilösuhteet, kansainvälinen yhteistyö (326 +)
alternative label: Huippukokoukset, kansainvälinen yhteistyö (326 +)
alternative label: Humanitaarinen apu, kansainvälinen apu (326 +)
alternative label: Integraatio, kansainvälinen yhteistyö (326 +)
alternative label: Julistukset, kansainvälinen yhteistyö (326 +)
alternative label: Jäsenvaltiot, kansainvälinen yhteistyö (326 +)
alternative label: Kansainvälinen apu (326 +)
alternative label: Kansainvälinen järjestelmä, kansainvälinen yhteistyö (326 +)
alternative label: Kansainvälinen toiminta (326 +)
alternative label: Kansainvälinen yhteistyö (326 +)
alternative label: Kansainväliset järjestöt (326 +)
alternative label: Kansainväliset järjestöt, avustusjärjestöt (326 +)
alternative label: Kansainväliset selkkaukset, kansainvälinen yhteistyö (326 +)
alternative label: Kansainväliset suhteet, yhteistyö (326 +)
alternative label: Kansainvälistyminen, kansainvälinen yhteistyö (326 +)
alternative label: Kansainvälisyys, kansainvälinen yhteistyö (326 +)
alternative label: Kansallisvaltiot, kansainvälinen yhteistyö (326 +)
alternative label: Katastrofiapu (326 +)
alternative label: Katastrofiapu, kansainvälinen yhteistyö (326 +)
alternative label: Keruu, kansainvälinen apu (326 +)
alternative label: Keräys, kansainvälinen apu (326 +)
alternative label: Kolmannet maat, kansainvälinen yhteistyö (326 +)
alternative label: Kosmopoliittisuus, kansainvälinen yhteistyö (326 +)
alternative label: Laajeneminen, kansainvälinen yhteistyö (326 +)
alternative label: Laajentuminen, kansainvälinen yhteistyö (326 +)
alternative label: Läpinäkyvyys, kansainvälinen yhteistyö (326 +)
alternative label: Maailma, kansainvälinen yhteistyö (326 +)
alternative label: Maailmanhallinta, kansainvälinen yhteistyö (326 +)
alternative label: Maailmankansalaisuus, kansainvälinen yhteistyö (326 +)
alternative label: Maailmanlaajuinen hallinta, kansainvälinen yhteistyö (326 +)
alternative label: Materiaaliapu, kansainvälinen apu (326 +)
alternative label: Poliittinen integraatio (326 +)
alternative label: Poliittinen kulttuuri, kansainvälinen yhteistyö (326 +)
alternative label: Poliittinen maantiede, kansainvälinen yhteistyö (326 +)
alternative label: Poliittinen osallistuminen, kansainvälinen yhteistyö (326 +)
alternative label: Poliittinen toiminta, kansainvälinen yhteistyö (326 +)
alternative label: Poliittinen yhdentyminen (326 +)
alternative label: Poliittiset asenteet, kansainvälinen yhteistyö (326 +)
alternative label: Poliittiset kriisit, kansainvälinen yhteistyö (326 +)
alternative label: Poliittiset suhteet, kansainvälinen yhteistyö (326 +)
alternative label: Politiikka, kansainvälinen yhteistyö (326 +)
broader: URN:NBN:fi:au:hklj:320
in scheme: URN:NBN:fi:au:hklj:
narrower: URN:NBN:fi:au:hklj:326.2
narrower: Muiden maanosien valtioiden keskinäinen yhteistyö
narrower: Yhdistyneet Kansakunnat
narrower: Rauhankysymys. Rauhantutkimus
notation: 326
related: URN:NBN:fi:au:hklj:060
related: Kasvatusfilosofia. Kasvatustavoitteet
related: Poliittiset ja aatteelliset vähemmistöt
related: URN:NBN:fi:au:hklj:325
related: Suomen ulkopolitiikka
related: Kansainväliset taloudelliset suhteet. Maailmantalous
related: Suomen ulkomaankauppa
related: Maailmankauppa. Kansainväliset talousjärjestöt
related: Monikansalliset yritykset
related: Kehitysmaiden taloudelliset olot
related: Yksityinen avustus- ja huoltotyö
related: Väestönsuojelu
scope note: Kansainvälisiä järjestöjä koskevat yleisteokset Tässä ja alaluokissa myös ne kansainväliset järjestöt, joita ei voi luokittaa aloittain Tässä ja alaluokissa kansainvälinen yhteistyö myös tietyn maan, esim. Suomen, kannalta Ystävyysseurat. Ystävyyskaupungit. Kummikuntatoiminta Kansainvälinen avustustoiminta yleensä. Punainen Risti Eri alojen kansainvälinen yhteistyö alan mukaisessa luokassa Jos teos koskee sekä kansainvälistä politiikkaa että muuta kansainvälistä yhteistyötä, on etusija luokalla 326+ Kansainvälisen yhteistyön erikoisaloja koskevat teokset alan mukaisessa luokassa
scope note: Allmänna verk som rör internationella organisationer Hit och till underklasserna också sådana internationella organisationer som inte kan klassificeras enligt område Hit och till underklasserna internationellt samarbete sett också ur ett bestämt lands synvinkel, t.ex. Finlands Vän- och fadderorter Internationell biståndsverksamhet i allmänhet. Röda Korset Internationellt samarbete som rör olika områden klassificeras enligt område Om verket handlar om både internationell politik och annat internationellt samarbete ges företräde åt klasserna 326+ Internationellt samarbete som rör specialområden klassificeras enligt område @sv

Helsinki. Pääkaupunkiseutu
type: Class
type: Concept
subclass of: URN:NBN:fi:au:hklj:345
alternative label: Helsinki, ympäristöineen, kunnallishallinto (345.11)
alternative label: Pääkaupunkiseudun yhteistyövaltuuskunta (345.11)
alternative label: Seudullinen yhteistyö, pääkaupunkiseudun yhteistyö (345.11)
alternative label: Seutuyhteistyö, pääkaupunkiseudun yhteistyö (345.11)
alternative label: YTV (345.11)
alternative label: Bygdegemenskap, samarbete inom huvudstadsregionen (345.11) @sv
alternative label: Helsingfors, med omnejd, kommunalförvaltning (345.11) @sv
alternative label: Huvudstadsregionens samarbetsdelegation (345.11) @sv
alternative label: Regionalt samarbete, seudullinen yhteistyö, samarbete inom huvudstadsregionen (345.11) @sv
alternative label: SAD (345.11) @sv
broader: URN:NBN:fi:au:hklj:345
in scheme: URN:NBN:fi:au:hklj:
notation: 345.11
preferred label: Helsinki. The metropolitan area @en
preferred label: Helsingfors. Huvudstadsregionen @sv
related: URN:NBN:fi:au:hklj:320
related: Suomen valtiojärjestelmä
related: URN:NBN:fi:au:hklj:330
related: Vero-oikeus
related: URN:NBN:fi:au:hklj:345.1105
related: Muiden maiden kunnallis-, läänin- ja valtionhallinto
related: URN:NBN:fi:au:hklj:363
related: Valtionverotus. Veropolitiikka
related: Talouselämän kehitysilmiöt
related: URN:NBN:fi:au:hklj:370
related: Helsinki. Pääkaupunkiseutu
related: Laskentatoimi. Rahoitus. Talousarviot
related: Liiketaloudellinen kirjanpito ja tilintarkastus
scope note: Pääkaupunkiseudun yhteistyövaltuuskunta (YTV)
scope note: Samarbetsdelegationen för huvudstadsregionen (SAD) @sv

Talousjärjestelmät
type: Class
type: Concept
subclass of: URN:NBN:fi:au:hklj:360
alternative label: Avoin talousjärjestelmä, talousjärjestelmät (366)
alternative label: Kapitalismi, talousjärjestelmät (366)
alternative label: Kapitalistiset maat, talousjärjestelmät (366)
alternative label: Kehittyvät markkinat, markkinatalous (366)
alternative label: Kollektivisointi, talousjärjestelmät (366)
alternative label: Kommunismi, talousjärjestelmät (366)
alternative label: Markkinatalous (366)
alternative label: Marksilaisuus, talousjärjestelmät (366)
alternative label: Marksismi, talousjärjestelmät (366)
alternative label: Marxismi, talousjärjestelmät (366)
alternative label: Poliittinen taloustiede, talousjärjestelmät (366)
alternative label: Rahatalous, talousjärjestelmät (366)
alternative label: Riisto, talousjärjestelmät (366)
alternative label: Riistäminen, talousjärjestelmät (366)
alternative label: Sekatalous, talousjärjestelmät (366)
alternative label: Siirtymätalous, talousjärjestelmät (366)
alternative label: Sosialismi, talousjärjestelmä (366)
alternative label: Sosialistiset yhteiskunnat, talousjärjestelmät (366)
alternative label: Suljettu talousjärjestelmä (366)
alternative label: Suunnitelmatalous (366)
alternative label: Talousjärjestelmät (366)
alternative label: Berövande, ekonomiska system (366) @sv
alternative label: Blandekonomi, ekonomiska system (366) @sv
alternative label: Ekonomiska system (366) @sv
alternative label: Kapitalism, ekonomiska system (366) @sv
alternative label: Kapitalistländer, ekonomiska system (366) @sv
alternative label: Kollektivisering, ekonomiska system (366) @sv
alternative label: Kommunism, ekonomiska system (366) @sv
alternative label: Marknadsekonomi (366) @sv
alternative label: Marksism, ekonomiska system (366) @sv
alternative label: Marxism, ekonomiska system (366) @sv
alternative label: Penninghushållning, ekonomiska system (366) @sv
alternative label: Planekonomi (366) @sv
alternative label: Politisk ekonomi, ekonomiska system (366) @sv
alternative label: Sluten ekonomi (366) @sv
alternative label: Socialism, ekonomiskt system (366) @sv
alternative label: Socialistiska samhällen, ekonomiska system (366) @sv
alternative label: Tillväxtmarknader, marknadsekonomi (366) @sv
alternative label: Utsugning, ekonomiska system (366) @sv
alternative label: Öppen ekonomi, ekonomiska system (366) @sv
alternative label: Övergångsekonomi, ekonomiska system (366) @sv
broader: URN:NBN:fi:au:hklj:360
in scheme: URN:NBN:fi:au:hklj:
notation: 366
preferred label: Economic systems @en
preferred label: Ekonomiska system @sv
related: Yhteiskuntafilosofia
related: Yhteiskunnan rakenne
related: Alueellinen sosiologia. Maassamuutto
related: Pääoma. Työ. Luonnonvarat
related: Kansainväliset taloudelliset suhteet. Maailmantalous
related: Suomen ulkomaankauppa
related: Maailmankauppa. Kansainväliset talousjärjestöt
related: Monikansalliset yritykset
related: Kehitysmaiden taloudelliset olot
related: URN:NBN:fi:au:hklj:368
related: Tuotanto. Tuottavuus
related: Hinnat. Hintapolitiikka
related: Elintaso. Kulutus
related: Talouselämän kehitysilmiöt
related: Talousmaantiede. Taloushistoria
related: Yhteiskunnalliset aatesuunnat. Poliittiset ideologiat
related: Sosialismi. Kommunismi
related: Konservatismi
related: Liberalismi
related: Fasismi
related: Muut aatesuunnat
scope note: Markkinatalous, kapitalismi ja sosialismi talousjärjestelminä. Sekatalousjärjestelmä Talousjärjestelmiä koskevat erikoisalojen kysymykset alan mukaisessa luokassa
scope note: Marknadsekonomi, kapitalism och socialism som ekonomiska system. Blandekonomi Frågor om ekonomiska system som rör specialområden klassificeras enligt område @sv

Menetetty Karjalan alue
type: Class
type: Concept
subclass of: Kymenlaakso. Etelä-Karjala
alternative label: Karjala, Suomi, menetetty alue v:een 1944 (412.51)
alternative label: Karjalan kannas, vuoteen 1944 (412.51)
alternative label: Karjalankannas, vuoteen 1944 (412.51)
alternative label: Luovutettu Karjala, vuoteen 1944 (412.51)
alternative label: Luovutetut alueet, vuoteen 1944, Karjala (412.51)
alternative label: Viipuri, vuoteen 1944 (412.51)
alternative label: Viipurin lääni, vuoteen 1944 (412.51)
alternative label: Avträdda Karelen, till år 1944 (412.51) @sv
alternative label: Avträdda områden, till år 1944, Karelen (412.51) @sv
alternative label: Karelen, Finland, förlorat område till år 1944 (412.51) @sv
alternative label: Karelska näset, till år 1944 (412.51) @sv
alternative label: Viborg, till år 1944 (412.51) @sv
alternative label: Viborgs län, till år 1944 (412.51) @sv
broader: Kymenlaakso. Etelä-Karjala
in scheme: URN:NBN:fi:au:hklj:
notation: 412.51
preferred label: The ceded Karelian territory @en
preferred label: De avträdda karelska områdena @sv
related: URN:NBN:fi:au:hklj:411
related: Venäjä
related: URN:NBN:fi:au:hklj:460
related: URN:NBN:fi:au:hklj:920
related: URN:NBN:fi:au:hklj:929
related: Venäjän historia
related: Venäjän historia vuoteen 1917
related: Venäjän vanha ja keskiaika
related: Venäjän historia 1682-1856
related: Venäjän historia 1857-1917
related: Neuvostoliiton historia 1917-1991
related: Neuvostoliiton historia 1917-1938
related: Neuvostoliiton historia 1939-1945
related: Neuvostoliiton historia 1945-1991
related: Venäjän historia 1992-
related: Ukrainan, Valko-Venäjän ja Moldovan historia
related: Ukrainan historia
related: Valko-Venäjän historia
related: Moldovan historia
scope note: Menetetty Karjalan alue vuoteen 1944. Viipuri vuoteen 1944
scope note: De avträdda områdena i Karelen till 1944. Viborg till 1944 @sv

AUSTRALIA. OSEANIA. NAPAMAAT
type: Class
type: Concept
subclass of: URN:NBN:fi:au:hklj:400
alternative label: Atollit, Australia ja Oseania (450 ... 456)
alternative label: Australia ja Oseania (450 ... 456)
alternative label: Australia ja Oseania, maantiede, matkat (450 ... 456)
alternative label: Kansanelämä, eri kansat, maantiede (410 ... 459)
alternative label: Kansanluonne, maakuvaukset (410 ... 459)
alternative label: Kotimaa, maakuvaukset (410 ... 459)
alternative label: Maanosat, Australia ja Oseania (450)
alternative label: Oseania (450)
alternative label: Oseania, maantiede, matkat (450)
alternative label: Tyyni meri (450 ... 456)
alternative label: Tyyni meri, maantiede, matkat (450 ... 456)
alternative label: Atoller, Australia och Oceania (450 ... 456) @sv
alternative label: Australien och Oceanien (450 ... 456) @sv
alternative label: Australien och Oceanien, geografi, resor (450 ... 456) @sv
alternative label: Folkliv, olika folk, geografi (410 ... 459) @sv
alternative label: Hemland, landsskildringar (410 ... 459) @sv
alternative label: Nationalkaraktär, landsskildringar (410 ... 459) @sv
alternative label: Oceanien (450) @sv
alternative label: Oceanien, geografi, resor (450) @sv
alternative label: Stilla havet (450 ... 456) @sv
alternative label: Stilla havet, geografi, resor (450 ... 456) @sv
alternative label: Världsdelar, Australien och Oceanien (450) @sv
broader: URN:NBN:fi:au:hklj:400
in scheme: URN:NBN:fi:au:hklj:
narrower: Australia. Uusi-Seelanti. Uusi-Guinea
narrower: Havaiji
narrower: Tyynen meren saaret
narrower: Arktis, pohjoiset napamaat
narrower: Antarktis, eteläiset napamaat
notation: 450
preferred label: AUSTRALIA. OCEANIA. POLAR REGIONS @en
preferred label: AUSTRALIEN. OCEANIEN. POLARLÄNDERNA @sv
related: URN:NBN:fi:au:hklj:061
related: URN:NBN:fi:au:hklj:063
related: Yleinen aluemaantiede. Yleinen kulttuurimaantiede. Yleinen poliittinen maantiede
related: URN:NBN:fi:au:hklj:460
related: Ekologia. Eliömaantiede
related: Merenkulkuoppi
related: Hotelli- ja ravintolatalous
related: URN:NBN:fi:au:hklj:900
related: MUIDEN MAANOSIEN HISTORIA
related: URN:NBN:fi:au:hklj:989
scope note: Teokset, jotka koskevat sekä Australiaa että Oseaniaa tai napamaita Tässä ja luokissa 451-459 Australiaa, Oseaniaa ja napamaita koskeva matkailu ja matkakertomukset Tässä ja luokissa 451-459 matkailijoille tarkoitetut Australiaa, Oseaniaa tai napamaita koskevat matkaoppaat, leirintäalue-, hotelli-, motelli-, retkeilymaja-, nähtävyys- ja museo-oppaat Jos teoksessa on sekä maantiedettä että historiaa, on etusija luokilla 450-459
scope note: Allmänna verk som rör både Australien, Oceanien och polarländerna Hit och till klasserna 451-459 turism och reseskildringar som rör Australien, Oceanien och polarländerna Hit och till klasserna 451-459 resehandböcker och guideböcker om campingområden, hotell, motell, vandrarhem, sevärdheter och museer avsedda för turister i Australien, Oceanien och polarländerna Om verket handlar om både geografi och historia ges företräde åt klasserna 450-459 @sv

Avaruustutkimus. Avaruuslennot. Avaruusteknologia
type: Class
type: Concept
subclass of: TÄHTITIEDE
alternative label: Astronautiikka (529)
alternative label: Astronautit, avaruuslennot (529)
alternative label: Astronomia, avaruustutkimus (529)
alternative label: Avaruusalukset (529)
alternative label: Avaruusasemat (529)
alternative label: Avaruuskulkuneuvot (529)
alternative label: Avaruuslennot (529)
alternative label: Avaruusliikenne (529)
alternative label: Avaruusluotaimet (529)
alternative label: Avaruusmatkat (529)
alternative label: Avaruusraketit (529)
alternative label: Avaruusromu (529)
alternative label: Avaruussukkulat (529)
alternative label: Avaruustekniikka (529)
alternative label: Avaruusturismi (529)
alternative label: Avaruustutkimus (529)
alternative label: Kantoraketit (529)
alternative label: Kosmonautit, kosmonautiikka (529)
alternative label: Kuu, kuulennot (529)
alternative label: Kuulennot (529)
alternative label: Kuumatkat (529)
alternative label: Kuututkimus, kuulennot (529)
alternative label: Laukaisualustat (529)
alternative label: Luotaimet (529)
alternative label: Luotaimet, avaruustutkimus, avaruusteknologia (529)
alternative label: Modulaarisuus, avaruustekniikka (529)
alternative label: Moduulit, avaruustekniikka (529)
alternative label: Painottomuus (529)
alternative label: Raketit (529)
alternative label: Satelliitit (529)
alternative label: Satelliitit, avaruusteknologia (529)
alternative label: Sondit (529)
alternative label: Sondit, avaruusteknologia (529)
alternative label: Telakointi (529)
alternative label: Tutkimussatelliitit (529)
alternative label: Tähtitiede, avaruustutkimus (529)
alternative label: Astronauter, rymdfärder (529) @sv
alternative label: Astronautik (529) @sv
alternative label: Astronomi, rymdforskning (529) @sv
alternative label: Avfyrningsramper (529) @sv
alternative label: Bärraketer (529) @sv
alternative label: Dockning (529) @sv
alternative label: Forskningssatelliter (529) @sv
alternative label: Kosmonauter, kosmonautik (529) @sv
alternative label: Modularitet, rymdteknik (529) @sv
alternative label: Moduler, rymdteknik (529) @sv
alternative label: Månen, månflygningar (529) @sv
alternative label: Månflygningar (529) @sv
alternative label: Månforskning, månflygningar (529) @sv
alternative label: Månfärder (529) @sv
alternative label: Perpendiklar (529) @sv
alternative label: Perpendiklar, rymdforskning, rymdteknologi (529) @sv
alternative label: Raketer (529) @sv
broader: TÄHTITIEDE
in scheme: URN:NBN:fi:au:hklj:
narrower: Ufot. Ilmakehän tunnistamattomat ilmiöt
notation: 529
related: Astrologia. Horoskoopit
related: Ilmaliikenne. Ilmailu
related: Sotataito. Strategia. Taktiikka
related: Aseteknologia
related: Meteorologia. Klimatologia
related: Tähtitieteelliset kojeet
related: Tähtijärjestelmät. Aurinkokunnat
related: URN:NBN:fi:au:hklj:529.09
related: Ilmakulkuneuvot
related: Muut ilmakulkuneuvot
related: Tietoliikenne. Viestintätekniikka. Multimedia
related: URN:NBN:fi:au:hklj:627.751
related: Sähköposti. Verkkojuttelu
related: URN:NBN:fi:au:hklj:627.7512
related: Matkaviestinpalvelut. Puhelinliikenne
related: URN:NBN:fi:au:hklj:627.753
related: URN:NBN:fi:au:hklj:627.7531
related: URN:NBN:fi:au:hklj:627.7532
scope note: Astronautiikka. Kosmonautiikka. Miehitetyt ja miehittämättömät avaruuslennot Avaruusalukset, niiden suunnittelu, tekniikka, rakenne ja osat Avaruusalusten käyttö avaruustutkimuksessa Avaruustekniikka. Avaruusteollisuus Siviili- ja sotilaskäyttöön tarkoitetut avaruusalukset Laukaisualustat. Raketit. Kantoraketit. Avaruusuotaimet. Avaruussukkulat. Avaruusasemat Satelliitit yleensä Erikoisaloihin liittyvät satelliitit alan mukaisessa luokassa
scope note: Astronautik. Kosmonautik. Bemannade och obemannade rymdfärder Rymdfarkoster, deras planering, teknik, konstruktion och delar Användning av rymdfarkoster inom rymdforskning Rymdteknik. Rymdindustri Avskjutningsramper. Raketer. Bärraketer. Rymdsonder. Rymdskyttlar. Rymdstationer Satelliter i allmänhet Satelliter inom specialområden klassificeras enligt område @sv

Ilmakulkuneuvot
type: Class
type: Concept
subclass of: URN:NBN:fi:au:hklj:620
alternative label: Ilmakulkuneuvot (626 +)
alternative label: Koneet, kulkuneuvot (624 ... 626 +)
alternative label: Käyttöönotto, liikennevälineet (624 ... 626 +)
alternative label: Laskutelineet (626 +)
alternative label: Lentotekniikka (626 +)
alternative label: Lentäminen (626 +)
alternative label: Miehittämättömät ilma-alukset (626 +)
alternative label: Miehittämättömät ilmakulkuneuvot (626 +)
alternative label: Viat, kulkuneuvojen viat (624 ... 626 +)
alternative label: Fel, viat, fel på fordon (624 ... 626 +) @sv
alternative label: Flygning (626 +) @sv
alternative label: Flygteknik (626 +) @sv
alternative label: Ibruktagande, färdmedel (624 ... 626 +) @sv
alternative label: Landningsställ (626 +) @sv
alternative label: Luftfarkoster (626 +) @sv
alternative label: Maskiner, färdmedel (624 ... 626 +) @sv
alternative label: Obemannade luftfarkoster (626 +) @sv
broader: URN:NBN:fi:au:hklj:620
in scheme: URN:NBN:fi:au:hklj:
narrower: Lentokoneet
narrower: Muut ilmakulkuneuvot
notation: 626
preferred label: Aircraft @en
preferred label: Luftfarkoster @sv
related: URN:NBN:fi:au:hklj:332.2
related: URN:NBN:fi:au:hklj:380
related: Ilmaliikenne. Ilmailu
related: Sotataito. Strategia. Taktiikka
related: URN:NBN:fi:au:hklj:460
related: Avaruustutkimus. Avaruuslennot. Avaruusteknologia
related: URN:NBN:fi:au:hklj:620.88
related: Yleinen konetekniikka
related: Koneenrakennus. Pneumatiikka. Hydrauliikka
related: Voimakoneet. Moottorit. Nosto- ja kuljetuslaitteet
related: URN:NBN:fi:au:hklj:626.09
related: URN:NBN:fi:au:hklj:631
related: Lento-opetus. Lentotaito
related: Moottoriurheilu. Lentourheilu
related: Lentourheilu
related: URN:NBN:fi:au:hklj:798
scope note: Tässä ja alaluokissa sekä siviili- että sotilaskäyttöön tarkoitetut ilmakulkuneuvot Jos teos koskee sekä ilmaliikennettä tai ilmailua että ilmakulkuneuvoja, on etusija luokalla 386.2 Jos teos koskee sekä lentourheilua että lentokoneita, on etusija luokalla 791.84
scope note: Hit och till underklasserna luftfarkoster för både civilt och militärt bruk Om verket handlar om såväl lufttrafik och luftfart som luftfarkoster ges företräde åt klass 386.2 Om verket handlar om både flygsport och flygplan ges företräde åt klass 791.84 @sv

Kuvankäsittelyohjelmat. Grafiikkaohjelmat. Taitto-ohjelmat
type: Class
type: Concept
subclass of: URN:NBN:fi:au:hklj:627.73
alternative label: Creo Simulate (627.735)
alternative label: Desktop publishing (627.735)
alternative label: Digitaalinen kuvankäsittely, grafiikkaohjelmat (627.735)
alternative label: Editointi, taitto, desktop publishing (627.735)
alternative label: Elektroniset julkaisut, desktop publishing (627.735)
alternative label: Graafinen suunnittelu, tietokoneohjelmat (627.735)
alternative label: Grafiikka, tietokonegrafiikka, tietokoneohjelmat (627.735)
alternative label: Grafiikkaohjelmat (627.735)
alternative label: Julkaisujärjestelmät (627.735)
alternative label: Julkaisuohjelmat (627.735)
alternative label: Kuvamanipulaatio, grafiikkaohjelmat (627.735)
alternative label: Kuvankäsittely, grafiikkaohjelmat (627.735)
alternative label: Kuvantaminen, lääketiede, grafiikkaohjelmat (627.735)
alternative label: Layout, desktop publishing (627.735)
alternative label: Näyttötaitto (627.735)
alternative label: Pöytäpaino (627.735)
alternative label: Sähköiset julkaisut, desktop publishing (627.735)
alternative label: Taitto, näyttötaitto (627.735)
alternative label: Taitto-ohjelmat (627.735)
alternative label: e-julkaisut, desktop publishing (627.735)
alternative label: Bildbehandling, grafikprogram (627.735) @sv
alternative label: Bildmanipulation, grafikprogram (627.735) @sv
alternative label: Datorstödd originalproduktion (627.735) @sv
alternative label: Diagnostisk avbildning, grafikprogram (627.735) @sv
alternative label: Digital bildbehandling, grafikprogram (627.735) @sv
alternative label: Digitala publikationer, desktop publishing (627.735) @sv
alternative label: Editering, ombrytning, desktop publishing (627.735) @sv
alternative label: Elektroniska publikationer, desktop publishing (627.735) @sv
alternative label: Grafik, datorgrafik, dataprogram (627.735) @sv
alternative label: Grafikprogram (627.735) @sv
alternative label: Grafisk design, dataprogram (627.735) @sv
alternative label: Layoutprogram (627.735) @sv
alternative label: Ombrytning, desktop publishing (627.735) @sv
alternative label: Sidombrytningsprogram (627.735) @sv
alternative label: e-publikationer, desktop publishing (627.735) @sv
broader: URN:NBN:fi:au:hklj:627.73
in scheme: URN:NBN:fi:au:hklj:
notation: 627.735
preferred label: Image processing programs. Graphic programs. Layout programs @en
preferred label: Bildbehandlingsprogram. Grafikprogram. Sidombrytningsprogram @sv
related: Kustannustoimi. Kirjakauppa
related: Kirjapainotaito. Graafinen teollisuus
related: LOGIIKKA
related: Logistiikka. Looginen kalkyyli
related: URN:NBN:fi:au:hklj:182
related: URN:NBN:fi:au:hklj:332.1
related: URN:NBN:fi:au:hklj:384
related: Sähköoppi. Magnetismi
related: URN:NBN:fi:au:hklj:620.88
related: Systeemityö
related: Ohjelmointi. Ohjelmointikielet
related: Säätö- ja systeemitekniikka. Teollinen automaatio
related: URN:NBN:fi:au:hklj:627.7532
related: Elektroniikka
related: URN:NBN:fi:au:hklj:667.7
related: URN:NBN:fi:au:hklj:667.71
related: Toimistotyö
related: URN:NBN:fi:au:hklj:681
related: Toimistokoneet
related: Pelit

Huonekasvit
type: Class
type: Concept
subclass of: Puutarhanhoito. Hyötykasvit. Huone- ja koristekasvit
alternative label: Bonsai (653.9)
alternative label: Epifyytit, huonekasvit (653.9)
alternative label: Huonekasvit (653.9)
alternative label: Hybridit, huonekasvit (653.9)
alternative label: Isokirjopeippi, huonekasvit (653.9)
alternative label: Istutus, huonekasvit (653.9)
alternative label: Jaloritarinkukka, koristekasvit, huonekasvit (653.9)
alternative label: Jalostaminen, huonekasvit (653.9)
alternative label: Jalostus, huonekasvit (653.9)
alternative label: Kahvipensas, huonekasvit (653.9)
alternative label: Kaktukset, huonekasvit (653.9)
alternative label: Kastelu, huonekasvit (653.9)
alternative label: Kastelumenetelmät, huonekasvit (653.9)
alternative label: Kasvien jalostus, huonekasvit (653.9)
alternative label: Kasviharrastus, huonekasvit (653.9)
alternative label: Kasvinjalostus, huonekasvit (653.9)
alternative label: Kasvinravinteet, huonekasvien hoito (653.9)
alternative label: Kasvipatologia, huonekasvit (653.9)
alternative label: Kasviravinteet, huonekasvien hoito (653.9)
alternative label: Kasvit, huonekasvit (653.9)
alternative label: Kasvit, koristekasvit (653.9)
alternative label: Kasvitaudit, huonekasvit (653.9)
alternative label: Kasvituholaiset, huonekasvit (653.9)
alternative label: Kasvualustat, huonekasvit (653.9)
alternative label: Kasvullinen lisäys, huonekasvien hoito (653.9)
alternative label: Kasvullinen lisääntyminen, huonekasvit (653.9)
alternative label: Kasvunsääteet, huonekasvit (653.9)
alternative label: Kasvutekijät, huonekasvit (653.9)
alternative label: Kasvuturve, huonekasvit (653.9)
alternative label: Koristekasvit, huonekasvit (653.9)
alternative label: Koristepuut, bonsaipuut (653.9)
alternative label: Kuivuudenkestävyys, huonekasvit (653.9)
alternative label: Kukat, huonekasvit (653.9)
alternative label: Kukinta, huonekasvit (653.9)
alternative label: Kukkakaupat (653.9)
alternative label: Kukkalaatikot (653.9)
alternative label: Kukkaruukut (653.9)
alternative label: Kukkaterraariot (653.9)
alternative label: Kukkien viljely, huonekasvit (653.9)
alternative label: Kukkivat ruukkukasvit (653.9)
alternative label: Kylmänkestävyys, huonekasvit (653.9)
alternative label: Kääpiöpuut, bonsai (653.9)
alternative label: Köynnöskasvit, huonekasvit (653.9)
alternative label: Lajikekokeet, huonekasvit (653.9)
alternative label: Lajikkeet, huonekasvit (653.9)
alternative label: Lajimääritys, huonekasvit (653.9)
alternative label: Lajinmääritys, huonekasvit (653.9)
alternative label: Lajiristeymät, huonekasvit (653.9)
alternative label: Lajit, huonekasvilajit (653.9)
alternative label: Lajit, koristekasvilajit (653.9)
alternative label: Lannoitus, huonekasvit (653.9)
broader: Puutarhanhoito. Hyötykasvit. Huone- ja koristekasvit
in scheme: URN:NBN:fi:au:hklj:
notation: 653.9
related: Antroposofia
related: URN:NBN:fi:au:hklj:342
related: URN:NBN:fi:au:hklj:576
related: KASVITIEDE
related: Systemaattinen kasvitiede
related: Putkilokasvit
related: Hyönteiset
related: Kivihiili. Turve
related: URN:NBN:fi:au:hklj:649.91
related: Maatalouspolitiikka
related: URN:NBN:fi:au:hklj:650.2
related: URN:NBN:fi:au:hklj:651
related: Maanviljely
related: Koristekasvit
related: Hyötykasvit
related: URN:NBN:fi:au:hklj:657
related: Rakennusten erillistilat
related: URN:NBN:fi:au:hklj:691.12
related: Sisustusoppaat
related: Luonnon- ja kulttuurimaiseman suunnittelu
related: Kukkien asettelu ja sidonta. Ikebana
scope note: Kodin viher- ja kukkakasvit sekä niiden hoito-ohjeet Ruukkukasvit, myös ulkona kasvatettavat. Parvekekasvit Kukkaruukut. Parvekelaatikot. Kukkaterraariot Kukkakauppatoiminta
scope note: Gröna växter och blomster för hemmet samt råd om skötseln av dem Krukväxter, också de som odlas utomhus. Balkongväxter Blomkrukor. Balkonglådor. Blomsterterrarier Blomsteraffärernas verksamhet @sv

Geotekniikka. Maatyöt
type: Class
type: Concept
subclass of: URN:NBN:fi:au:hklj:660
alternative label: Esirakentaminen (665)
alternative label: Esirakentaminen, maatyöt (665)
alternative label: Geotekniikka (665)
alternative label: Jää, geotekniikka (665)
alternative label: Kaivu, rakennustekniikka (665)
alternative label: Kaivutekniikka, rakennustekniikka (665)
alternative label: Kalliomekaniikka (665)
alternative label: Kallionleikkaus (665)
alternative label: Kallionrakennus (665)
alternative label: Kalliorakentaminen (665)
alternative label: Kalliotilat, rakennus (665)
alternative label: Louhinta, rakennustyö (665)
alternative label: Läjitys (665)
alternative label: Maamekaniikka, rakennustekniikka (665)
alternative label: Maanalaiset rakenteet, rakennustekniikka (665)
alternative label: Maankaivu, rakennustekniikka. (665)
alternative label: Maanrakennus (665)
alternative label: Maanrakennustekniikka (665)
alternative label: Maansiirto (665)
alternative label: Maansiirtokoneet, maanrakennus (665)
alternative label: Maantasaus (665)
alternative label: Maantäyttö (665)
alternative label: Maanvahvistus (665)
alternative label: Maarakennus (665)
alternative label: Maarakenteet, rakennustekniikka (665)
alternative label: Maatyöt (665)
alternative label: Meluesteet, rakentaminen (665)
alternative label: Meluvallit, rakentaminen (665)
alternative label: Paalutus, geotekniikka (665)
alternative label: Perustustyöt (665)
alternative label: Pohjarakennus (665)
alternative label: Pohjatutkimus (665)
alternative label: Rakennustekniikka, maarakennus (665)
alternative label: Räjäytystyöt, geotekniikka (665)
alternative label: Räjäytystyöt, tunnelinrakennus (665)
alternative label: Suojaus, routasuojaus (665)
alternative label: Tiejyrät, maatyöt (665)
alternative label: Tunnelinrakennus (665)
alternative label: Tunnelit (665)
alternative label: Tunnelit, maarakennus (665)
alternative label: Täytemaa, geotekniikka, maarakennus (665)
alternative label: Täyttö, maantäyttö (665)
alternative label: Täyttömaa, geotekniikka, maarakennus (665)
alternative label: Ympäristörakentaminen, meluesteiden rakentaminen (665)
alternative label: Bergbyggnad (665) @sv
alternative label: Bergmekanik (665) @sv
alternative label: Bergrum, byggnad (665) @sv
alternative label: Bergsbyggnad (665) @sv
alternative label: Bergskärning (665) @sv
alternative label: Brytning av metallmalmer, byggande (665) @sv
alternative label: Bullerskydd, byggande (665) @sv
broader: URN:NBN:fi:au:hklj:660
in scheme: URN:NBN:fi:au:hklj:
notation: 665
related: URN:NBN:fi:au:hklj:342
related: Maaperän, metsien ja soiden suojelu
related: URN:NBN:fi:au:hklj:613.3
related: Voimakoneet. Moottorit. Nosto- ja kuljetuslaitteet
related: Tiet. Kadut. Tienrakennus. Kadunrakennus
related: Sillat. Sillanrakennus
related: Raideliikenneväylät. Junat. Raitiovaunut. Metro
related: Vesirakennus. Vesikulkuneuvot
related: Satamat. Satamatekniikka
related: Vesiväylät. Vesien säännöstely
related: Vesijohto-, viemäri- ja vedenpuhdistustekniikka
related: Vesikulkuneuvot
related: Laivat. Laivanrakennus
related: URN:NBN:fi:au:hklj:625.72
related: Muut vesikulkuneuvot
related: Kaivos- ja kaivannaisteollisuus
related: Kemian teollisuus
related: Rakennustyöt. Rakennusaineet. Rakennustarvikkeet
related: Muuraus. Rappaus
related: Maalaustyöt
related: Rakennuksen kunnossapito
scope note: Geotekniikan ja maatöiden yleisteokset Teokset, jotka koskevat geotekniikkaa tai maatöitä sekä talonrakennuksen että muun rakennustekniikan kannalta Maanrakennus, kallionrakennus ja tunnelinrakennus yleensä Meluesteiden rakentaminen Perustukset, tukirakenteet ja pohjarakennus yleensä Maan tai kallioperän kaivu, louhinta, leikkaus, siirto, täyttö, tasaus, pengerrys ja vahvistaminen yleensä Vesi, lumi, jää, routa ja maaperän laatu maatöiden kannalta yleensä Geotekniikka ja maatyöt rakennuksen kunnossapidon ja korjauksen kannalta
scope note: Allmänna verk om geoteknik och anläggningsarbete Verk som handlar om geoteknik eller anläggningsarbete med hänsyn till både husbyggnad och annan byggnadsteknik Markarbeten, bergsbyggnad och tunnelbyggnad i allmänhet Byggnad av bullerskydd Fundament, stödkonstruktioner och grundarbeten i allmänhet Grävning, sprängning, schaktning, transport, fyllning, utjämning, terrassering och förstärkning av mark eller berggrund i allmänhet Vatten, snö, is, tjäle och jordmånens kvalitet ur anläggningsarbetenas synvinkel i allmänhet Geoteknik och anläggningsarbete som hänför sig till underhåll och reparationer av byggnader @sv

Laskentatoimi. Rahoitus. Talousarviot
type: Class
type: Concept
subclass of: Liiketalouden hallinto ja organisaatio
alternative label: Alijäämä, kannattavuus (674.2)
alternative label: Budjetit, yritystalous (674.2)
alternative label: Budjetointi, yritykset, budjettipolitiikka (674.2)
alternative label: Budjettialijäämä, yritykset (674.2)
alternative label: Budjettipolitiikka, yritykset (674.2)
alternative label: Budjettivaje, yritykset (674.2)
alternative label: Elektroninen laskutus (674.2)
alternative label: Factoring (674.2)
alternative label: Hallinnollinen talouslaskenta (674.2)
alternative label: Insolvenssi, yrityksen (674.2)
alternative label: Julkinen rahoitus, yrityksen rahoitus (674.2)
alternative label: Kannattavuus, liiketalous (674.2)
alternative label: Kannattavuuslaskenta (674.2)
alternative label: Kansainvälinen laskentatoimi, yritystalous (674.2)
alternative label: Kassahallinto (674.2)
alternative label: Kassanhallinta (674.2)
alternative label: Katetuottolaskenta (674.2)
alternative label: Kokonaistoimitus, liiketalous (674.2)
alternative label: Kuljetuskustannukset, kustannuslaskenta (674.2)
alternative label: Kustannukset, yritystalous (674.2)
alternative label: Kustannus-hyötyanalyysi, yritystalous (674.2)
alternative label: Kustannusarviot, kustannuslaskenta (674.2)
alternative label: Kustannuslaskenta (674.2)
alternative label: Käyttöarvoanalyysi, yritystalous (674.2)
alternative label: Käyttökustannukset, kustannuslaskenta (674.2)
alternative label: Laatukäsikirjat, liiketalous (674.2 +)
alternative label: Laskelmat, laskentatoimi (674.2)
alternative label: Laskentajärjestelmät, talousmatematiikka (674.2)
alternative label: Laskentatoimi (674.2)
alternative label: Laskut (674.2)
alternative label: Laskutus (674.2)
alternative label: Liikelaskenta (674.2)
alternative label: Liiketaloudellinen kirjanpito (674.2)
alternative label: Liiketaloudellinen laskentatoimi (674.2)
alternative label: Liiketalous (674.2)
alternative label: Liikevaihto (674.2)
alternative label: Likviditeetti, yrityksen (674.2)
alternative label: Luottoluokitukset. liiketalous (674.2 +)
alternative label: Luottoluokituslaitokset, liiketalous (674.2 +)
alternative label: Maksuhäiriöt, yrityksen (674.2)
alternative label: Maksukyky, yrityksen (674.2)
alternative label: Maksukyvyttömyys, yrityksen (674.2)
alternative label: Maksuvaikeudet, yrityksen (674.2)
alternative label: Maksuvalmius, yrityksen (674.2)
alternative label: Matemaattiset menetelmät, liikelaskenta (674.2)
alternative label: Myyntivoitot, yritystalous (674.2)
alternative label: Oma pääoma, yritystalous (674.2)
alternative label: Omaisuus, yritystalous (674.2)
alternative label: Omakustannuslaskenta (674.2)
alternative label: Osakepääoma, yritystalous (674.2)
alternative label: Palkanlaskenta (674.2)
alternative label: Palkkakustannukset, yritystalous (674.2)
broader: Liiketalouden hallinto ja organisaatio
in scheme: URN:NBN:fi:au:hklj:
notation: 674.2
related: URN:NBN:fi:au:hklj:340
related: URN:NBN:fi:au:hklj:345
related: Helsinki. Pääkaupunkiseutu
related: Organisaatioiden ja laitosten sosiologia
related: URN:NBN:fi:au:hklj:360
related: URN:NBN:fi:au:hklj:363
related: URN:NBN:fi:au:hklj:368
related: Tuotanto. Tuottavuus
related: Elintaso. Kulutus
related: MATEMATIIKKA
related: Matematiikan taulukot ja kaavakokoelmat. Laskumenetelmät
related: Matematiikan muut alat
related: URN:NBN:fi:au:hklj:620
related: URN:NBN:fi:au:hklj:627.751
related: METALLITEOLLISUUS. PUUNJALOSTUSTEOLLISUUSSÄHKÖTEKNINEN TEOLLISUUS TEKSTIILI- JA NAHKATEOLLISUUS
related: KEMIAN TEOLLISUUS. KAIVOSTEOLLISUUS
related: URN:NBN:fi:au:hklj:650.2
related: URN:NBN:fi:au:hklj:675
related: Liiketaloudellinen kirjanpito ja tilintarkastus
related: Kauppamatematiikka
scope note: Yrityksen tai organisaation toimintaa, toiminnan suunnittelua ja pääomankiertoa koskeva laskentatoimi yleensä Liike-, talous-, kustannus-, kannattavuus ja palkanlaskenta yleensä Talousmatematiikka yleensä Yrityksen tai organisaation rahoitus, talousarviot ja talousarvion laadinta yleensä Erikoisalojen yrityksiä koskeva laskentatoimi, rahoitus ja talousarviot alan mukaisessa luokassa
scope note: Redovisning och kalkyler som rör företags eller organisationers verksamhet, verksamhetsplanering och kapitalomsättning i allmänhet Ekonomiska kalkyler och kostnads-, lönsamhets- och lönekalkyler i allmänhet Ekonomisk matematik i allmänhet Finansiering, budgetar och uppgörande av budget inom företag eller organisationer i allmänhet Hit också ekonomisk matematik och handelsmatematik i allmänhet Redovisning och kalkyler samt finansiering och budgetar som rör företag inom specialområden klassificeras enligt område @sv

Sisustusoppaat
type: Class
type: Concept
subclass of: KOTITALOUS. LAITOSTALOUS. KAUNEUDENHOITO
alternative label: Asuinhuoneistot, sisustusoppaat (695)
alternative label: Asunnot, sisustusoppaat (695)
alternative label: Bonkei, sisustus, kodinsisustus (695)
alternative label: Entistäminen, sisustusoppaat (695)
alternative label: Huoneet, sisustusoppaat (695)
alternative label: Huoneistot, sisustusoppaat (695)
alternative label: Huonekalut, sisustusoppaat (695)
alternative label: Hygieniatilat, sisustusoppaat (695)
alternative label: Hyllyt, sisustusoppaat (695)
alternative label: Hyvä maku, sisustusoppaat (695)
alternative label: Ikkunaverhot, sisustusoppaat (695)
alternative label: Interiöörit, kodinsisustus (695)
alternative label: Istuimet, sisustusoppaat (695)
alternative label: Kaapit, sisustusoppaat (695)
alternative label: Kaihtimet, sisustusoppaat (695)
alternative label: Kakkosasunnot, sisustusoppaat (695)
alternative label: Kalusteet, sisustusoppaat (695)
alternative label: Keittiökalusteet, sisustusoppaat (695)
alternative label: Keittiöt, sisustusoppaat (695)
alternative label: Kodin työt, sisustusoppaat (695)
alternative label: Kodinsisustus, käytännön oppaat (695)
alternative label: Kodintekstiilit, sisustusoppaat (695)
alternative label: Koti, sisustusoppaat (695)
alternative label: Kylpyhuoneet, sisustusoppaat (695)
alternative label: Lampunvarjostimet, sisustusoppaat (695)
alternative label: Lamput, sisustusoppaat (695)
alternative label: Lastenhuoneet, sisustusoppaat (695)
alternative label: Loft-asunnot, sisustusoppaat (695)
alternative label: Lyhdyt, sisustusoppaat (695)
alternative label: Makuuhuoneet, sisustusoppaat (695)
alternative label: Olohuoneet, sisustusoppaat (695)
alternative label: Parvekkeet, sisustusoppaat (695)
alternative label: Peilit, sisustusoppaat (695)
alternative label: Peitot, sisustusoppaat (695)
alternative label: Peitteet, tekstiilit, sisustusoppaat (695)
alternative label: Peseytymistilat, sisustusoppaat (695)
alternative label: Pesutilat, sisustusoppaat (695)
alternative label: Puutarhakalusteet, sisustusoppaat (695)
alternative label: Pyyheliinat, sisustusoppaat (695)
alternative label: Pyyhkeet, sisustusoppaat (695)
alternative label: Restaurointi, sisustusoppaat (695)
alternative label: Rullaverhot, sisustusoppaat (695)
alternative label: Ruokailutilat, sisustusoppaat (695)
alternative label: Saniteettitilat, sisustusoppaat (695)
alternative label: Sisustus, kodinsisustus (695)
alternative label: Sisustusoppaat, kodinsisustus (695)
alternative label: Sisustustekstiilit, sisustusoppaat (695)
alternative label: Sisätilat, kodinsisustus (695)
alternative label: Sisävalaistus, sisustusoppaat (695)
alternative label: Talonpoikaistyyli, sisustusoppaat (695)
alternative label: Tapetit, sisustusoppaat (695)
broader: KOTITALOUS. LAITOSTALOUS. KAUNEUDENHOITO
in scheme: URN:NBN:fi:au:hklj:
notation: 695
related: Sähkövalo
related: Puuteollisuus
related: Paperi- ja selluloosateollisuus
related: Huonekasvit
related: Talonrakennus
related: Rakennustyöt. Rakennusaineet. Rakennustarvikkeet
related: Muuraus. Rappaus
related: Maalaustyöt
related: Rakenneosat
related: URN:NBN:fi:au:hklj:667.7
related: URN:NBN:fi:au:hklj:667.71
related: Uunit. Takat
related: Huoneakustiikka
related: Rakennusten erillistilat
related: Puutyö. Huonekalut. Verhoilu
related: Kotitalous. Kodinhoito
related: Sisustusarkkitehtuuri
related: Antiikkiesineiden keräily
related: Huonekalutaide
related: Ompelu
related: Kukkien asettelu ja sidonta. Ikebana
scope note: Kodin tilojen, kuten olohuoneen, makuuhuoneen, lastenhuoneen, keittiön tai kylpyhuoneen käyttöä, kalustamista tai sisustamista koskevat ohjeet Huonekalut sekä parveke-, piha- ja puutarhakalusteet kodinsisustuksen kannalta Kesämökin sisustusoppaat Vammaisten asuntojen sisustusoppaat Jos teoksessa on sekä käytännön sisustusohjeita että sisustusarkkitehtuuria, on etusija luokalla 695
scope note: Handböcker som rör användning, inredning och ommöblering av rum i hemmet såsom vardagsrum, sovrum, barnkammare, kök eller badrum Möbler samt balkong-, ute- och trädgårdsmöblemang ur heminredningssynvinkel Inredningshandböcker för sommarstugor Handböcker om inredning av bostäder för handikappade Om verket innehåller både praktiska inredningsråd och inredningsarkitektur ges företräde åt klass 695 @sv

Keskiajan taidehistoria
type: Class
type: Concept
subclass of: URN:NBN:fi:au:hklj:709
alternative label: Bysantti, taidehistoria (709.3)
alternative label: Bysanttilainen taide (709.3)
alternative label: Gotiikka, taidehistoria (709.3)
alternative label: Karolinginen taide (709.3)
alternative label: Keskiaika, taidehistoria (709.3)
alternative label: Myöhäiskeskiaika, taidehistoria (709.3)
alternative label: Ottolainen taide (709.3)
alternative label: Romaaninen tyyli, taidehistoria (709.3)
alternative label: Taidehistoria, keskiaika (709.3)
alternative label: Varhaiskeskiaika, taidehistoria (709.3)
alternative label: Viikingit, taidehistoria (709.3)
alternative label: Bysans, konsthistoria (709.3) @sv
alternative label: Bysantisk konst (709.3) @sv
alternative label: Gotik, konsthistoria (709.3) @sv
alternative label: Karolingisk konst (709.3) @sv
alternative label: Konsthistoria, medeltiden (709.3) @sv
alternative label: Medeltiden, konsthistoria (709.3) @sv
alternative label: Ottonisk konst (709.3) @sv
alternative label: Romansk stil, konsthistoria (709.3) @sv
alternative label: Senmedeltiden, konsthistoria (709.3) @sv
alternative label: Tidig medeltid, konsthistoria (709.3) @sv
alternative label: Vikingar, konsthistoria (709.3) @sv
broader: URN:NBN:fi:au:hklj:709
in scheme: URN:NBN:fi:au:hklj:
notation: 709.3
preferred label: Medieval art @en
preferred label: Medeltidens konsthistoria @sv
related: Keskiajan arkkitehtuuri
related: URN:NBN:fi:au:hklj:730.9
related: Keskiajan kuvanveistotaide
related: URN:NBN:fi:au:hklj:740.9
related: Keskiajan maalaustaide
related: URN:NBN:fi:au:hklj:770.9
related: URN:NBN:fi:au:hklj:789
related: URN:NBN:fi:au:hklj:789.1
related: Keskiajan musiikki
related: URN:NBN:fi:au:hklj:919
related: Keskiajan kulttuurihistoria 400-1499
scope note: Euroopan keskiajan taide yleensä Romaaninen ja goottilainen taide yleensä Bysantin taide yleensä Keskiajan taiteen eri aloja koskevat teokset alan mukaisessa luokassa Yksittäisiä taiteilijoita tai heidän tuotantoaan koskevat teokset ovat aina ko. taiteenalan tai sen historian luokassa
scope note: Europeisk medeltidskonst i allmänhet Romansk och gotisk konst i allmänhet Bysantinsk konst i allmänhet Verk som handlar om olika medeltida konstarter klassificeras enligt konstart Verk som handlar om enskilda konstnärer och deras produktion klassificeras alltid enligt konstarten eller dess historia @sv

Renessanssin taidehistoria
type: Class
type: Concept
subclass of: URN:NBN:fi:au:hklj:709
alternative label: Manierismi, taidehistoria (709.4)
alternative label: Myöhäisrenessanssi, taidehistoria (709.4)
alternative label: Renessanssi, taidehistoria (709.4)
alternative label: Taidehistoria, renessanssi (709.4)
alternative label: Täysrenessanssi, taidehistoria (709.4)
alternative label: Varhaisrenessanssi, taidehistoria (709.4)
alternative label: Högrenässansen, konsthistoria (709.4) @sv
alternative label: Konsthistoria, renässans (709.4) @sv
alternative label: Manierism, konsthistoria (709.4) @sv
alternative label: Renässans, konsthistoria (709.4) @sv
alternative label: Senrenässansen, konsthistoria (709.4) @sv
alternative label: Ungrenässansen, konsthistoria (709.4) @sv
broader: URN:NBN:fi:au:hklj:709
in scheme: URN:NBN:fi:au:hklj:
notation: 709.4
preferred label: Renaissance art @en
preferred label: Renässansens konsthistoria @sv
related: Renessanssin arkkitehtuuri
related: URN:NBN:fi:au:hklj:730.9
related: Renessanssin kuvanveistotaide
related: URN:NBN:fi:au:hklj:740.9
related: Renessanssin maalaustaide
related: URN:NBN:fi:au:hklj:770.9
related: URN:NBN:fi:au:hklj:789
related: URN:NBN:fi:au:hklj:789.1
related: Renessanssimusiikki
related: URN:NBN:fi:au:hklj:919
related: Uuden ajan kulttuurihistoria 1500-1788
scope note: Euroopan renessanssiajan taide yleensä Renessanssiajan taiteen eri aloja koskevat teokset alan mukaisessa luokassa Yksittäisiä taiteilijoita tai heidän tuotantoaan koskevat teokset ovat aina ko. taiteenalan tai sen historian luokassa
scope note: Europeisk konst från renässansens tid i allmänhet Verk som handlar om renässansens enskilda konstarter klassificeras enligt konstart Verk som handlar om enskilda konstnärer och deras produktion klassificeras alltid enligt konstarten eller dess historia @sv

KUVANVEISTOTAIDE
type: Class
type: Concept
subclass of: URN:NBN:fi:au:hklj:700
alternative label: Biografiat, taiteilijat (710 ... 789 +)
alternative label: Edelläkävijät, taiteilijat (710 ... 789 +)
alternative label: Elämäkerrat, taiteilijat ja musiikki (710 ... 789 +)
alternative label: Elämänhistoria, henkilöhistoria, taiteilijat (710 ... 789 +)
alternative label: Haastattelut, henkolöhistoria, taiteilijat (710 ... 789 +)
alternative label: Henkilöhistoria, taiteilijat (710 ... 789 +)
alternative label: Henkilökuvat, taiteilijat (710 ... 789 +)
alternative label: Henkilöt, taiteilijat (710 ... 789 +)
alternative label: Historia, henkilöhistoria, taiteilijat (710 ... 789 +)
alternative label: Julkisuuden henkilöt, taiteilijat (710 ... 789 +)
alternative label: Kansalliset suurmiehet, taiteilijat ja musiikki (710 ... 789 +)
alternative label: Kirjeet, taiteilijat (710 ... 789 +)
alternative label: Kivenveisto, kuvanveisto (730 ... 739)
alternative label: Kuvaamataiteet, kuvanveistotaide (730 ... 739)
alternative label: Kuvanveisto (730 ... 739)
alternative label: Kuvataide, kuvanveistotaide (730 ... 739)
alternative label: Lapsitähdet, julkisuuden henkilöt, taiteilijat (710 ... 789 +)
alternative label: Lapsuus, taiteilijat (710 ... 789 +)
alternative label: Maahanmuuttajat, henkilöhistoria, taiteilijat (710 ... 789 +)
alternative label: Maanpako, henkilöhistoria, taiteilijat (710 ... 789 +)
alternative label: Merkkihenkilöt, taiteilijat ja musiikki (710 ... 789 +)
alternative label: Mielipidevangit, taiteilijat, elämäkerrat ja muistelmat (710 ... 789 +)
alternative label: Muistelmat, taiteilijat (710 ... 789 +)
alternative label: Muistokirjoitukset, taiteilijat (710 ... 789 +)
alternative label: Nekrologit, taiteilijat (710 ... 789 +)
alternative label: Omaelämäkerrat, taiteilijat (710 ... 789 +)
alternative label: Pakolaiset, henkilöhistoria, taiteilijat (710 ... 789 +)
alternative label: Professorit, taiteilijat (710 ... 789 +)
alternative label: Päiväkirjat, taiteilijat (710 ... 789 +)
alternative label: Rakkauskirjeet, taiteilijat (710 ... 789 +)
alternative label: Siirtolaiset, henkilöhistoria, taiteilijat (710 ... 789 +)
alternative label: Suurmiehet, taiteilijat ja musiikki (710 ... 789 +)
alternative label: Taiteet, kuvanveisto (730 ... 739)
alternative label: Teokset, taiteilijoiden teosluettelot (703 ... 776.03)
alternative label: Uranuurtajat, taiteilijat (710 ... 789 +)
alternative label: Vaihtoehtohistoria, henkilöhistoria, taiteilijat (710 ... 789 +)
alternative label: Vaihtoehtoinen historia, henkilöhistoria, taiteilijat (710 ... 789 +)
alternative label: Veistotaide (730)
alternative label: Alternativ historia, personhistoria, konstnärer (710 ... 789 +) @sv
alternative label: Barndom, konstnärer (710 ... 789 +) @sv
alternative label: Barnstjärnor, offentliga personer, konstnärer (710 ... 789 +) @sv
alternative label: Bemärkta personer, konstnärer och musik (710 ... 789 +) @sv
alternative label: Bildhuggeri (730) @sv
alternative label: Bildkonst, skulptur (730 ... 739) @sv
alternative label: Bildkonster, skulptur (730 ... 739) @sv
alternative label: Biografier, konstnärer (710 ... 789 +) @sv
alternative label: Brev, konstnärer (710 ... 789 +) @sv
alternative label: Dagböcker, konstnärer (710 ... 789 +) @sv
alternative label: Flyktingar, personhistoria, konstnärer (710 ... 789 +) @sv
alternative label: Föregångare, konstnärer (710 ... 789 +) @sv
alternative label: Historia, personhistoria, konstnärer (710 ... 789 +) @sv
alternative label: Immigranter, personhistoria, konstnärer (710 ... 789 +) @sv
alternative label: Intervjuer, personhistoria, konstnärer (710 ... 789 +) @sv
alternative label: Invandrare, personhistoria, konstnärer (710 ... 789 +) @sv
alternative label: Konstarter, skulptur (730 ... 739) @sv
broader: URN:NBN:fi:au:hklj:700
in scheme: URN:NBN:fi:au:hklj:
narrower: Kuvanveistotaiteen teoria, estetiikka ja filosofia
narrower: URN:NBN:fi:au:hklj:730.9
narrower: Kuvanveistotaiteen materiaalit ja tekniikka
narrower: URN:NBN:fi:au:hklj:739
notation: 730
related: Symbolit. Koodit. Merkkijärjestelmät
related: URN:NBN:fi:au:hklj:010
related: Yleisbibliografiat. Kansallisbibliografiat
related: Kustantajien ja kirjakauppojen luettelot
related: Erikoisalojen bibliografiat
related: Taiteet. Liikunta
related: Paikallisbibliografiat. Henkilöbibliografiat
related: URN:NBN:fi:au:hklj:710
related: Taidepuutyöt
related: Huonekalutaide
related: Keramiikkataide. Posliinitaide
related: Keramiikkataide
related: Posliinitaide. Posliinimaalaus
scope note: Kuvanveistotaiteen yleisteokset, joissa on sekä kuvanveiston materiaaleja ja tekniikkaa että historiaa tai estetiikkaa
scope note: Allmänna verk som rör skulptur och som innehåller såväl skulpturens material och tekniker som historia och estetik @sv

Eurooppa
type: Class
type: Concept
subclass of: URN:NBN:fi:au:hklj:777.9
broader: URN:NBN:fi:au:hklj:777.9
in scheme: URN:NBN:fi:au:hklj:
notation: 777.91
preferred label: Europe @en
preferred label: Europa @sv
related: URN:NBN:fi:au:hklj:1.4
related: URN:NBN:fi:au:hklj:1.84
related: URN:NBN:fi:au:hklj:1.944
related: URN:NBN:fi:au:hklj:2.84
related: URN:NBN:fi:au:hklj:2.94
related: URN:NBN:fi:au:hklj:3.4
related: URN:NBN:fi:au:hklj:384.42
related: URN:NBN:fi:au:hklj:4.4
related: URN:NBN:fi:au:hklj:5.4
related: URN:NBN:fi:au:hklj:6.4
related: URN:NBN:fi:au:hklj:7.4
related: URN:NBN:fi:au:hklj:709
related: URN:NBN:fi:au:hklj:710
related: URN:NBN:fi:au:hklj:756
related: Teatteri- ja näyttämötaiteen teoria, estetiikka ja filosofia
related: URN:NBN:fi:au:hklj:770.9
related: Elokuvatekniikka. Videokuvauksen tekniikka
related: URN:NBN:fi:au:hklj:783.67
related: URN:NBN:fi:au:hklj:783.68
scope note: Euroopan elokuvan ja elokuvataiteen yleisteokset
scope note: Allmänna verk om europeisk film och filmkonst @sv

Saksa
type: Class
type: Concept
subclass of: Länsi- ja Keski-Eurooppa
alternative label: Saksa, elokuvataide (777.931)
alternative label: Tyskland, filmkonst (777.931) @sv
broader: Länsi- ja Keski-Eurooppa
in scheme: URN:NBN:fi:au:hklj:
notation: 777.931
preferred label: Germany @en
preferred label: Tyskland @sv
related: URN:NBN:fi:au:hklj:1.4
related: URN:NBN:fi:au:hklj:1.84
related: URN:NBN:fi:au:hklj:1.944
related: URN:NBN:fi:au:hklj:2.84
related: URN:NBN:fi:au:hklj:2.94
related: URN:NBN:fi:au:hklj:3.4
related: URN:NBN:fi:au:hklj:384.42
related: URN:NBN:fi:au:hklj:4.4
related: URN:NBN:fi:au:hklj:5.4
related: URN:NBN:fi:au:hklj:6.4
related: URN:NBN:fi:au:hklj:7.4
related: URN:NBN:fi:au:hklj:709
related: URN:NBN:fi:au:hklj:710
related: URN:NBN:fi:au:hklj:756
related: Teatteri- ja näyttämötaiteen teoria, estetiikka ja filosofia
related: URN:NBN:fi:au:hklj:770.9
related: Elokuvatekniikka. Videokuvauksen tekniikka
related: URN:NBN:fi:au:hklj:783.67
related: URN:NBN:fi:au:hklj:783.68

Brittein saaret
type: Class
type: Concept
subclass of: Länsi- ja Keski-Eurooppa
alternative label: Britannia, elokuvataide (777.934)
alternative label: Eire, elokuva (777.934)
alternative label: Englanti, elokuvataide (777.934)
alternative label: Irlanti, elokuvataide (777.934)
alternative label: Iso-Britannia, elokuvataide (777.934)
alternative label: Yhdistynyt kuningaskunta, elokuvataide (777.934)
alternative label: Britannien, filmkonst (777.934) @sv
alternative label: Eire, film (777.934) @sv
alternative label: England, filmkonst (777.934) @sv
alternative label: Förenade konungariket, filmkonst (777.934) @sv
alternative label: Irland, filmkonst (777.934) @sv
alternative label: Storbritannien, filmkonst (777.934) @sv
broader: Länsi- ja Keski-Eurooppa
in scheme: URN:NBN:fi:au:hklj:
notation: 777.934
preferred label: British Isles @en
preferred label: Brittiska öarna @sv
related: URN:NBN:fi:au:hklj:1.4
related: URN:NBN:fi:au:hklj:1.84
related: URN:NBN:fi:au:hklj:1.944
related: URN:NBN:fi:au:hklj:2.84
related: URN:NBN:fi:au:hklj:2.94
related: URN:NBN:fi:au:hklj:3.4
related: URN:NBN:fi:au:hklj:384.42
related: URN:NBN:fi:au:hklj:4.4
related: URN:NBN:fi:au:hklj:5.4
related: URN:NBN:fi:au:hklj:6.4
related: URN:NBN:fi:au:hklj:7.4
related: URN:NBN:fi:au:hklj:709
related: URN:NBN:fi:au:hklj:710
related: URN:NBN:fi:au:hklj:756
related: Teatteri- ja näyttämötaiteen teoria, estetiikka ja filosofia
related: URN:NBN:fi:au:hklj:770.9
related: Elokuvatekniikka. Videokuvauksen tekniikka
related: URN:NBN:fi:au:hklj:783.67
related: URN:NBN:fi:au:hklj:783.68
scope note: Iso-Britannia. Irlanti
scope note: Storbritannien. Irland @sv

Italia
type: Class
type: Concept
subclass of: Etelä-Eurooppa
alternative label: Italia, elokuvataide (777.941)
alternative label: Neorealismi, elokuvan historia, Italia (777.941)
alternative label: Spagettiwesternit (777.941 +)
alternative label: Italien, filmkonst (777.941) @sv
alternative label: Neorealism, filmhistoria, Italien (777.941) @sv
alternative label: Spagettiwestern (777.941 +) @sv
broader: Etelä-Eurooppa
in scheme: URN:NBN:fi:au:hklj:
notation: 777.941
preferred label: Italy @en
preferred label: Italien @sv
related: URN:NBN:fi:au:hklj:1.4
related: URN:NBN:fi:au:hklj:1.84
related: URN:NBN:fi:au:hklj:1.944
related: URN:NBN:fi:au:hklj:2.84
related: URN:NBN:fi:au:hklj:2.94
related: URN:NBN:fi:au:hklj:3.4
related: URN:NBN:fi:au:hklj:384.42
related: URN:NBN:fi:au:hklj:4.4
related: URN:NBN:fi:au:hklj:5.4
related: URN:NBN:fi:au:hklj:6.4
related: URN:NBN:fi:au:hklj:7.4
related: URN:NBN:fi:au:hklj:709
related: URN:NBN:fi:au:hklj:710
related: URN:NBN:fi:au:hklj:756
related: Teatteri- ja näyttämötaiteen teoria, estetiikka ja filosofia
related: URN:NBN:fi:au:hklj:770.9
related: Elokuvatekniikka. Videokuvauksen tekniikka
related: URN:NBN:fi:au:hklj:783.67
related: URN:NBN:fi:au:hklj:783.68
scope note: Tässä myös San Marino ja Vatikaanivaltio
scope note: Hit också San Marino och Vatikanstaten @sv

Espanja
type: Class
type: Concept
subclass of: Etelä-Eurooppa
alternative label: Espanja, elokuvataide (777.942)
alternative label: Spanien, filmkonst (777.942) @sv
broader: Etelä-Eurooppa
in scheme: URN:NBN:fi:au:hklj:
notation: 777.942
preferred label: Spain @en
preferred label: Spanien @sv
related: URN:NBN:fi:au:hklj:1.4
related: URN:NBN:fi:au:hklj:1.84
related: URN:NBN:fi:au:hklj:1.944
related: URN:NBN:fi:au:hklj:2.84
related: URN:NBN:fi:au:hklj:2.94
related: URN:NBN:fi:au:hklj:3.4
related: URN:NBN:fi:au:hklj:384.42
related: URN:NBN:fi:au:hklj:4.4
related: URN:NBN:fi:au:hklj:5.4
related: URN:NBN:fi:au:hklj:6.4
related: URN:NBN:fi:au:hklj:7.4
related: URN:NBN:fi:au:hklj:709
related: URN:NBN:fi:au:hklj:710
related: URN:NBN:fi:au:hklj:756
related: Teatteri- ja näyttämötaiteen teoria, estetiikka ja filosofia
related: URN:NBN:fi:au:hklj:770.9
related: Elokuvatekniikka. Videokuvauksen tekniikka
related: URN:NBN:fi:au:hklj:783.67
related: URN:NBN:fi:au:hklj:783.68
scope note: Tässä myös Gibraltar
scope note: Hit också Gibraltar @sv

Venäjä
type: Class
type: Concept
subclass of: Itä-Eurooppa
broader: Itä-Eurooppa
in scheme: URN:NBN:fi:au:hklj:
notation: 777.951
preferred label: Russia @en
preferred label: Ryssland @sv
related: URN:NBN:fi:au:hklj:1.4
related: URN:NBN:fi:au:hklj:1.84
related: URN:NBN:fi:au:hklj:1.944
related: URN:NBN:fi:au:hklj:2.84
related: URN:NBN:fi:au:hklj:2.94
related: URN:NBN:fi:au:hklj:3.4
related: URN:NBN:fi:au:hklj:384.42
related: URN:NBN:fi:au:hklj:4.4
related: URN:NBN:fi:au:hklj:5.4
related: URN:NBN:fi:au:hklj:6.4
related: URN:NBN:fi:au:hklj:7.4
related: URN:NBN:fi:au:hklj:709
related: URN:NBN:fi:au:hklj:710
related: URN:NBN:fi:au:hklj:756
related: Teatteri- ja näyttämötaiteen teoria, estetiikka ja filosofia
related: URN:NBN:fi:au:hklj:770.9
related: Elokuvatekniikka. Videokuvauksen tekniikka
related: URN:NBN:fi:au:hklj:783.67
related: URN:NBN:fi:au:hklj:783.68
scope note: Tässä myös Venäjän Aasian puoleiset alueet
scope note: Hit också de asiatiska områdena av Ryssland @sv

Aasia
type: Class
type: Concept
subclass of: URN:NBN:fi:au:hklj:777.9
alternative label: Aasia, elokuva (777.96)
alternative label: Intia, elokuvataide (777.96)
alternative label: Japani, elokuvataide (777.96)
alternative label: Kiina, elokuvataide (777.96)
alternative label: Asien, film (777.96) @sv
alternative label: Indien, filmkonst (777.96) @sv
alternative label: Japan, filmkonst (777.96) @sv
alternative label: Kina, filmkonst (777.96) @sv
broader: URN:NBN:fi:au:hklj:777.9
in scheme: URN:NBN:fi:au:hklj:
notation: 777.96
preferred label: Asia @en
preferred label: Asien @sv
related: URN:NBN:fi:au:hklj:1.4
related: URN:NBN:fi:au:hklj:1.84
related: URN:NBN:fi:au:hklj:1.944
related: URN:NBN:fi:au:hklj:2.84
related: URN:NBN:fi:au:hklj:2.94
related: URN:NBN:fi:au:hklj:3.4
related: URN:NBN:fi:au:hklj:384.42
related: URN:NBN:fi:au:hklj:4.4
related: URN:NBN:fi:au:hklj:5.4
related: URN:NBN:fi:au:hklj:6.4
related: URN:NBN:fi:au:hklj:7.4
related: URN:NBN:fi:au:hklj:709
related: URN:NBN:fi:au:hklj:710
related: URN:NBN:fi:au:hklj:756
related: Teatteri- ja näyttämötaiteen teoria, estetiikka ja filosofia
related: URN:NBN:fi:au:hklj:770.9
related: Elokuvatekniikka. Videokuvauksen tekniikka
related: URN:NBN:fi:au:hklj:783.67
related: URN:NBN:fi:au:hklj:783.68

Afrikka
type: Class
type: Concept
subclass of: URN:NBN:fi:au:hklj:777.9
alternative label: Afrikka, elokuva (777.97)
alternative label: Afrika, film (777.97) @sv
broader: URN:NBN:fi:au:hklj:777.9
in scheme: URN:NBN:fi:au:hklj:
notation: 777.97
preferred label: Africa @en
preferred label: Afrika @sv
related: URN:NBN:fi:au:hklj:1.4
related: URN:NBN:fi:au:hklj:1.84
related: URN:NBN:fi:au:hklj:1.944
related: URN:NBN:fi:au:hklj:2.84
related: URN:NBN:fi:au:hklj:2.94
related: URN:NBN:fi:au:hklj:3.4
related: URN:NBN:fi:au:hklj:384.42
related: URN:NBN:fi:au:hklj:4.4
related: URN:NBN:fi:au:hklj:5.4
related: URN:NBN:fi:au:hklj:6.4
related: URN:NBN:fi:au:hklj:7.4
related: URN:NBN:fi:au:hklj:709
related: URN:NBN:fi:au:hklj:710
related: URN:NBN:fi:au:hklj:756
related: Teatteri- ja näyttämötaiteen teoria, estetiikka ja filosofia
related: URN:NBN:fi:au:hklj:770.9
related: Elokuvatekniikka. Videokuvauksen tekniikka
related: URN:NBN:fi:au:hklj:783.67
related: URN:NBN:fi:au:hklj:783.68

Yhdysvallat
type: Class
type: Concept
subclass of: Amerikka
alternative label: Hollywood, elokuva historia (777.981)
alternative label: USA, elokuvataide (777.981)
alternative label: Yhdysvallat, elokuvataide (777.981)
alternative label: Förenta staterna, filmkonst (777.981) @sv
alternative label: Hollywood, filmhistoria (777.981) @sv
alternative label: USA, filmkonst (777.981) @sv
broader: Amerikka
in scheme: URN:NBN:fi:au:hklj:
notation: 777.981
preferred label: United States of America @en
preferred label: Förenta staterna @sv
related: URN:NBN:fi:au:hklj:1.4
related: URN:NBN:fi:au:hklj:1.84
related: URN:NBN:fi:au:hklj:1.944
related: URN:NBN:fi:au:hklj:2.84
related: URN:NBN:fi:au:hklj:2.94
related: URN:NBN:fi:au:hklj:3.4
related: URN:NBN:fi:au:hklj:384.42
related: URN:NBN:fi:au:hklj:4.4
related: URN:NBN:fi:au:hklj:5.4
related: URN:NBN:fi:au:hklj:6.4
related: URN:NBN:fi:au:hklj:7.4
related: URN:NBN:fi:au:hklj:709
related: URN:NBN:fi:au:hklj:710
related: URN:NBN:fi:au:hklj:756
related: Teatteri- ja näyttämötaiteen teoria, estetiikka ja filosofia
related: URN:NBN:fi:au:hklj:770.9
related: Elokuvatekniikka. Videokuvauksen tekniikka
related: URN:NBN:fi:au:hklj:783.67
related: URN:NBN:fi:au:hklj:783.68

Australia. Oseania
type: Class
type: Concept
subclass of: URN:NBN:fi:au:hklj:777.9
alternative label: Australia, elokuva (777.99)
alternative label: Oseania, elokuva (777.99)
alternative label: Australien, film (777.99) @sv
alternative label: Oceanien, film (777.99) @sv
broader: URN:NBN:fi:au:hklj:777.9
in scheme: URN:NBN:fi:au:hklj:
notation: 777.99
preferred label: Australia. Oceania @en
preferred label: Australien. Oceanien @sv
related: URN:NBN:fi:au:hklj:1.4
related: URN:NBN:fi:au:hklj:1.84
related: URN:NBN:fi:au:hklj:1.944
related: URN:NBN:fi:au:hklj:2.84
related: URN:NBN:fi:au:hklj:2.94
related: URN:NBN:fi:au:hklj:3.4
related: URN:NBN:fi:au:hklj:384.42
related: URN:NBN:fi:au:hklj:4.4
related: URN:NBN:fi:au:hklj:5.4
related: URN:NBN:fi:au:hklj:6.4
related: URN:NBN:fi:au:hklj:7.4
related: URN:NBN:fi:au:hklj:709
related: URN:NBN:fi:au:hklj:710
related: URN:NBN:fi:au:hklj:756
related: Teatteri- ja näyttämötaiteen teoria, estetiikka ja filosofia
related: URN:NBN:fi:au:hklj:770.9
related: Elokuvatekniikka. Videokuvauksen tekniikka
related: URN:NBN:fi:au:hklj:783.67
related: URN:NBN:fi:au:hklj:783.68

Oratoriot
type: Class
type: Concept
subclass of: URN:NBN:fi:au:hklj:783.5
alternative label: Ariosot, oratoriot (783.51)
alternative label: Libretistit, oratorio (783.51)
alternative label: Libretot, oratorio (783.51)
alternative label: Oratoriot (783.51)
alternative label: Arioson, oratorier (783.51) @sv
alternative label: Librettister, oratorium (783.51) @sv
alternative label: Libretton, oratorium (783.51) @sv
alternative label: Oratorier (783.51) @sv
broader: URN:NBN:fi:au:hklj:783.5
in scheme: URN:NBN:fi:au:hklj:
notation: 783.51
preferred label: Oratorios @en
preferred label: Oratorier @sv
related: URN:NBN:fi:au:hklj:1.3
related: URN:NBN:fi:au:hklj:1.83
related: URN:NBN:fi:au:hklj:1.943
related: URN:NBN:fi:au:hklj:2.3
related: URN:NBN:fi:au:hklj:2.83
related: URN:NBN:fi:au:hklj:2.93
related: URN:NBN:fi:au:hklj:3.3
related: URN:NBN:fi:au:hklj:4.3
related: URN:NBN:fi:au:hklj:5.3
related: URN:NBN:fi:au:hklj:6.3
related: URN:NBN:fi:au:hklj:7.3
related: URN:NBN:fi:au:hklj:770
related: Kuorot (yli 9 laulajaa)
related: URN:NBN:fi:au:hklj:783.6
related: URN:NBN:fi:au:hklj:784
related: URN:NBN:fi:au:hklj:784.111
related: URN:NBN:fi:au:hklj:787
related: Spirituaalit. Gospel-musiikki
related: URN:NBN:fi:au:hklj:788
related: URN:NBN:fi:au:hklj:789
related: URN:NBN:fi:au:hklj:8.3

Passiot
type: Class
type: Concept
subclass of: URN:NBN:fi:au:hklj:783.5
alternative label: Passiot (783.52)
alternative label: Passioner, musik (783.52) @sv
broader: URN:NBN:fi:au:hklj:783.5
in scheme: URN:NBN:fi:au:hklj:
notation: 783.52
preferred label: Passions @en
preferred label: Passioner @sv
related: URN:NBN:fi:au:hklj:1.3
related: URN:NBN:fi:au:hklj:1.83
related: URN:NBN:fi:au:hklj:1.943
related: URN:NBN:fi:au:hklj:2.3
related: URN:NBN:fi:au:hklj:2.83
related: URN:NBN:fi:au:hklj:2.93
related: URN:NBN:fi:au:hklj:3.3
related: URN:NBN:fi:au:hklj:4.3
related: URN:NBN:fi:au:hklj:5.3
related: URN:NBN:fi:au:hklj:6.3
related: URN:NBN:fi:au:hklj:7.3
related: URN:NBN:fi:au:hklj:770
related: Kuorot (yli 9 laulajaa)
related: URN:NBN:fi:au:hklj:783.6
related: URN:NBN:fi:au:hklj:784
related: URN:NBN:fi:au:hklj:784.111
related: URN:NBN:fi:au:hklj:787
related: Spirituaalit. Gospel-musiikki
related: URN:NBN:fi:au:hklj:788
related: URN:NBN:fi:au:hklj:789
related: URN:NBN:fi:au:hklj:8.3

Messut. Requiemit
type: Class
type: Concept
subclass of: URN:NBN:fi:au:hklj:783.5
alternative label: Messut, musiikki (783.53)
alternative label: Requiemit (783.53)
alternative label: Sielunmessut (783.53)
alternative label: Mässor, musik (783.53) @sv
alternative label: Rekviem (783.53) @sv
alternative label: Själamässor (783.53) @sv
broader: URN:NBN:fi:au:hklj:783.5
in scheme: URN:NBN:fi:au:hklj:
notation: 783.53
preferred label: Masses. Requiems @en
preferred label: Mässor. Rekviem @sv
related: URN:NBN:fi:au:hklj:1.3
related: URN:NBN:fi:au:hklj:1.83
related: URN:NBN:fi:au:hklj:1.943
related: URN:NBN:fi:au:hklj:2.3
related: URN:NBN:fi:au:hklj:2.83
related: URN:NBN:fi:au:hklj:2.93
related: URN:NBN:fi:au:hklj:3.3
related: URN:NBN:fi:au:hklj:4.3
related: URN:NBN:fi:au:hklj:5.3
related: URN:NBN:fi:au:hklj:6.3
related: URN:NBN:fi:au:hklj:7.3
related: URN:NBN:fi:au:hklj:770
related: Kuorot (yli 9 laulajaa)
related: URN:NBN:fi:au:hklj:783.6
related: URN:NBN:fi:au:hklj:784
related: URN:NBN:fi:au:hklj:784.111
related: URN:NBN:fi:au:hklj:787
related: Spirituaalit. Gospel-musiikki
related: URN:NBN:fi:au:hklj:788
related: URN:NBN:fi:au:hklj:789
related: URN:NBN:fi:au:hklj:8.3

Kantaatit
type: Class
type: Concept
subclass of: URN:NBN:fi:au:hklj:783.5
alternative label: Kantaatit (783.54)
alternative label: Kantater (783.54) @sv
broader: URN:NBN:fi:au:hklj:783.5
in scheme: URN:NBN:fi:au:hklj:
notation: 783.54
preferred label: Cantatas @en
preferred label: Kantater @sv
related: URN:NBN:fi:au:hklj:1.3
related: URN:NBN:fi:au:hklj:1.83
related: URN:NBN:fi:au:hklj:1.943
related: URN:NBN:fi:au:hklj:2.3
related: URN:NBN:fi:au:hklj:2.83
related: URN:NBN:fi:au:hklj:2.93
related: URN:NBN:fi:au:hklj:3.3
related: URN:NBN:fi:au:hklj:4.3
related: URN:NBN:fi:au:hklj:5.3
related: URN:NBN:fi:au:hklj:6.3
related: URN:NBN:fi:au:hklj:7.3
related: URN:NBN:fi:au:hklj:770
related: Kuorot (yli 9 laulajaa)
related: URN:NBN:fi:au:hklj:783.6
related: URN:NBN:fi:au:hklj:784
related: URN:NBN:fi:au:hklj:784.111
related: URN:NBN:fi:au:hklj:787
related: Spirituaalit. Gospel-musiikki
related: URN:NBN:fi:au:hklj:788
related: URN:NBN:fi:au:hklj:789
related: URN:NBN:fi:au:hklj:8.3

Motetit
type: Class
type: Concept
subclass of: URN:NBN:fi:au:hklj:783.5
alternative label: Motetit (783.55)
alternative label: Motetter (783.55) @sv
broader: URN:NBN:fi:au:hklj:783.5
in scheme: URN:NBN:fi:au:hklj:
notation: 783.55
preferred label: Motets @en
preferred label: Motetter @sv
related: URN:NBN:fi:au:hklj:1.3
related: URN:NBN:fi:au:hklj:1.83
related: URN:NBN:fi:au:hklj:1.943
related: URN:NBN:fi:au:hklj:2.3
related: URN:NBN:fi:au:hklj:2.83
related: URN:NBN:fi:au:hklj:2.93
related: URN:NBN:fi:au:hklj:3.3
related: URN:NBN:fi:au:hklj:4.3
related: URN:NBN:fi:au:hklj:5.3
related: URN:NBN:fi:au:hklj:6.3
related: URN:NBN:fi:au:hklj:7.3
related: URN:NBN:fi:au:hklj:770
related: Kuorot (yli 9 laulajaa)
related: URN:NBN:fi:au:hklj:783.6
related: URN:NBN:fi:au:hklj:784
related: URN:NBN:fi:au:hklj:784.111
related: URN:NBN:fi:au:hklj:787
related: Spirituaalit. Gospel-musiikki
related: URN:NBN:fi:au:hklj:788
related: URN:NBN:fi:au:hklj:789
related: URN:NBN:fi:au:hklj:8.3

Musikaalit
type: Class
type: Concept
subclass of: URN:NBN:fi:au:hklj:783.6
alternative label: Kabareet (783.63)
alternative label: Libretistit, musikaali (783.63)
alternative label: Libretot, musikaali (783.63)
alternative label: Musikaalit (783.63)
alternative label: Revyyt, musiikki (783.63)
alternative label: Showt, musiikki (783.63)
alternative label: Varieteet, näyttämömusiikki (783.63)
alternative label: Kabaréer (783.63) @sv
alternative label: Librettister, musikal (783.63) @sv
alternative label: Libretton, musikal (783.63) @sv
alternative label: Musikaler (783.63) @sv
alternative label: Revyer, musik (783.63) @sv
alternative label: Shower, musik (783.63) @sv
alternative label: Varietéer, scenmusik (783.63) @sv
broader: URN:NBN:fi:au:hklj:783.6
in scheme: URN:NBN:fi:au:hklj:
notation: 783.63
preferred label: Musicals @en
preferred label: Musikaler @sv
related: URN:NBN:fi:au:hklj:1.3
related: URN:NBN:fi:au:hklj:1.83
related: URN:NBN:fi:au:hklj:1.943
related: URN:NBN:fi:au:hklj:2.3
related: URN:NBN:fi:au:hklj:2.83
related: URN:NBN:fi:au:hklj:2.93
related: URN:NBN:fi:au:hklj:3.3
related: URN:NBN:fi:au:hklj:4.3
related: URN:NBN:fi:au:hklj:5.3
related: URN:NBN:fi:au:hklj:6.3
related: URN:NBN:fi:au:hklj:7.3
related: URN:NBN:fi:au:hklj:770
related: Teatterimuodot
related: URN:NBN:fi:au:hklj:783.5
related: URN:NBN:fi:au:hklj:784
related: URN:NBN:fi:au:hklj:784.111
related: URN:NBN:fi:au:hklj:788
related: URN:NBN:fi:au:hklj:789
related: URN:NBN:fi:au:hklj:8.3
scope note: Kabareet. Revyyt. Showt Musikaalien, kabareiden, revyiden ja show-esitysten yksittäisistä lauluista tai muista osista sovitetut kokoelmat soitinnuksen mukaisessa luokassa
scope note: Kabaréer. Revyer. Shower Samlingar arrangerade som enskilda sånger eller andra partier ur musikaler, kabaréer och shower klassificeras enligt instrumentering @sv

Näytelmämusiikki
type: Class
type: Concept
subclass of: URN:NBN:fi:au:hklj:783.6
alternative label: Intermezzot, näytelmämusiikki (783.65)
alternative label: Laulunäytelmät (783.65)
alternative label: Näytelmämusiikki (783.65)
alternative label: Tonadillat (783.65)
alternative label: Välisoitot, näytelmämusiikki (783.65)
alternative label: Zarzuelat, näyttämömusiikki (783.65)
alternative label: Intermezzon, skådespelsmusik (783.65) @sv
alternative label: Mellanspel, skådespelsmusik (783.65) @sv
alternative label: Skådespelsmusik (783.65) @sv
alternative label: Sångspel (783.65) @sv
alternative label: Teatermusik (783.65) @sv
alternative label: Tonadilla (783.65) @sv
alternative label: Zarzuela, scenmusik (783.65) @sv
broader: URN:NBN:fi:au:hklj:783.6
in scheme: URN:NBN:fi:au:hklj:
notation: 783.65
preferred label: Theatrical music @en
preferred label: Skådespelsmusik @sv
related: URN:NBN:fi:au:hklj:1.3
related: URN:NBN:fi:au:hklj:1.83
related: URN:NBN:fi:au:hklj:1.943
related: URN:NBN:fi:au:hklj:2.3
related: URN:NBN:fi:au:hklj:2.83
related: URN:NBN:fi:au:hklj:2.93
related: URN:NBN:fi:au:hklj:3.3
related: URN:NBN:fi:au:hklj:4.3
related: URN:NBN:fi:au:hklj:5.3
related: URN:NBN:fi:au:hklj:6.3
related: URN:NBN:fi:au:hklj:7.3
related: URN:NBN:fi:au:hklj:770
related: Teatterimuodot
related: URN:NBN:fi:au:hklj:783.5
related: URN:NBN:fi:au:hklj:784
related: URN:NBN:fi:au:hklj:784.111
related: URN:NBN:fi:au:hklj:785.4
related: URN:NBN:fi:au:hklj:788
related: URN:NBN:fi:au:hklj:789
related: URN:NBN:fi:au:hklj:8.3
scope note: Näytelmämusiikin yksittäisistä osista sovitetut kokoelmat soitinnuksen mukaisessa luokassa
scope note: Samlingar arrangerade som enskilda partier ur skådespelsmusik klassificeras enligt instrumentering @sv

Venäjä
type: Class
type: Concept
subclass of: Itsenäisten valtioiden yhteisö
alternative label: Venäjä, kansanmusiikki (784.171 +)
alternative label: Ryssland, folkmusik (784.171 +) @sv
broader: Itsenäisten valtioiden yhteisö
in scheme: URN:NBN:fi:au:hklj:
narrower: Karjalan tasavalta
notation: 784.171
preferred label: Russia @en
preferred label: Ryssland @sv
related: URN:NBN:fi:au:hklj:473.1
related: URN:NBN:fi:au:hklj:769
related: URN:NBN:fi:au:hklj:783
related: URN:NBN:fi:au:hklj:783.1
related: URN:NBN:fi:au:hklj:784.111
related: Itä-Eurooppa
related: Itsenäisten valtioiden yhteisön Aasian puoleiset alueet
related: Kaukasuksen maat
related: URN:NBN:fi:au:hklj:787
related: URN:NBN:fi:au:hklj:787.2
related: URN:NBN:fi:au:hklj:787.29
related: URN:NBN:fi:au:hklj:788.8
related: URN:NBN:fi:au:hklj:789
related: URN:NBN:fi:au:hklj:795.1
related: URN:NBN:fi:au:hklj:797.2
related: URN:NBN:fi:au:hklj:807
scope note: Yleisteokset ja sekasisältöiset kokoelmat, jotka koskevat sekä Venäjän Euroopan että Aasian puoleisia alueita Venäjän Euroopan puoleiset alueet
scope note: Allmänna verk och samlingar med blandat innehåll som rör både de asiatiska och europeiska områdena av Ryssland De europeiska områdena av Ryssland @sv

Väli-Amerikka
type: Class
type: Concept
subclass of: URN:NBN:fi:au:hklj:784
alternative label: Afroamerikkalainen musiikki, kansanmusiikki (784.4 ... 784.6)
alternative label: Afroamerikkalaiset, kansanmusiikki (784.4 ... 784.6)
alternative label: Amerikka, kansanmusiikki, Väli-Amerikka (784.5 +)
alternative label: Latinalaisamerikkalainen musiikki, kansanmusiikki, Keski-Amerikka (784.5)
alternative label: Mariachimusiikki, perinnemusiikki (784.5)
alternative label: Son, kansanmusiikki (784.5 +)
alternative label: Son-musiikki, kansanmusiikki (784.5 +)
alternative label: Afroamerikaner, folkmusik (784.4 ... 784.6) @sv
alternative label: Afroamerikansk musik, folkmusik (784.4 ... 784.6) @sv
alternative label: Amerika, folkmusik, Mellanamerika (784.5 +) @sv
alternative label: Latinamerikansk musik, folkmusik, Centralamerika (784.5) @sv
alternative label: Mariachimusik, traditionell musik (784.5) @sv
alternative label: Son, folkmusik (784.5 +) @sv
alternative label: Son-musik, folkmusik (784.5 +) @sv
broader: URN:NBN:fi:au:hklj:784
in scheme: URN:NBN:fi:au:hklj:
narrower: Karibianmeren saaret
notation: 784.5
preferred label: Central America @en
preferred label: Centralamerika @sv
related: URN:NBN:fi:au:hklj:473.1
related: URN:NBN:fi:au:hklj:769
related: URN:NBN:fi:au:hklj:783
related: URN:NBN:fi:au:hklj:783.1
related: Pohjois-Amerikka
related: Etelä-Amerikka
related: Intiaanit
related: URN:NBN:fi:au:hklj:787
related: URN:NBN:fi:au:hklj:787.2
related: URN:NBN:fi:au:hklj:787.29
related: URN:NBN:fi:au:hklj:788.8
related: URN:NBN:fi:au:hklj:789
related: URN:NBN:fi:au:hklj:795.1
related: URN:NBN:fi:au:hklj:797.2
related: URN:NBN:fi:au:hklj:807
scope note: Väli-Amerikka yleensä. Keski-Amerikka Belize. Costa Rica. El Salvador. Guatemala. Honduras. Meksiko. Nicaragua. Panama
scope note: Centralamerika i allmänhet. Mellanamerika Belize. Costa Rica. El Salvador. Guatemala. Honduras. Mexico. Nicaragua. Panama @sv

Muut triot
type: Class
type: Concept
subclass of: Triot
broader: Triot
in scheme: URN:NBN:fi:au:hklj:
notation: 785.129
preferred label: Other trios @en
preferred label: Annan triomusik @sv
related: URN:NBN:fi:au:hklj:789

Muut kvartetit
type: Class
type: Concept
subclass of: Kvartetit
broader: Kvartetit
in scheme: URN:NBN:fi:au:hklj:
notation: 785.139
preferred label: Other quartets @en
preferred label: Annan kvartettmusik @sv
related: URN:NBN:fi:au:hklj:789

Konsertot
type: Class
type: Concept
subclass of: Sinfoniat. Konsertot
alternative label: Kadenssit, konserttojen (785.62 +)
alternative label: Kamarikonsertot (785.62 +)
alternative label: Konsertot (785.62 +)
alternative label: Kadenser, konserternas (785.62 +) @sv
alternative label: Kammarkonserter (785.62 +) @sv
alternative label: Konserter, kompositioner (785.62 +) @sv
broader: Sinfoniat. Konsertot
in scheme: URN:NBN:fi:au:hklj:
narrower: Concerto grossot. Sinfonia concertantet
narrower: Konsertot kolmelle tai useammalle soittimelle
narrower: Konsertot kahdelle soittimelle
narrower: Konsertot yhdelle kosketinsoittimelle
narrower: Konsertot yhdelle näppäinsoittimelle
narrower: Konsertot yhdelle jousisoittimelle
narrower: Konsertot yhdelle puupuhaltimelle
narrower: Konsertot yhdelle vaskipuhaltimelle
narrower: Konsertot muille soolosoittimille
notation: 785.62
preferred label: Concerti @en
preferred label: Konserter @sv
related: URN:NBN:fi:au:hklj:785.4
related: URN:NBN:fi:au:hklj:786
related: URN:NBN:fi:au:hklj:789
scope note: Yleisteokset ja sekasisältöiset kokoelmat Tässä ja alaluokissa myös soolot orkesterin säestämänä
scope note: Allmänna verk och samlingar med blandat innehåll Hit och till underklasserna också solopartier till orkesterackompanjemang @sv

Palloilu
type: Class
type: Concept
subclass of: LIIKUNTA. URHEILU. LEIKIT. HUVIT
alternative label: Erotuomarit (796 +)
alternative label: Joukkueet, urheilujoukkueet, palloilu (796 +)
alternative label: Joukkuelajit, palloilu (796 +)
alternative label: Joukkuepelit (796 +)
alternative label: Joukkueurheilu, palloilu (796 +)
alternative label: Liikuntamuodot, eri liikuntamuodot (791 ... 796 +)
alternative label: Maailmanmestaruuskisat, lajeittain (791 ... 796 +)
alternative label: Maajoukkueet, eri urheilulajit (791 ... 796 +)
alternative label: Maalivahdit (796)
alternative label: Mailapelit (796 +)
alternative label: Mailat (796 +)
alternative label: Palloilu (796 +)
alternative label: Pallopelit (796 +)
alternative label: Pallot, palloilu (796 +)
alternative label: Pelaaminen, palloilu (796 +)
alternative label: Pelit, palloilu (796 +)
alternative label: Puolustus, joukkuepelit (796 +)
alternative label: Ruumiinkulttuuri, liikunta, eri lajit (791 ... 796 +)
alternative label: Turnaukset, palloilulajit (796 +)
alternative label: Urheilulajit, eri urheilulajit (791 ... 796 +)
alternative label: Bollar, bollspel (796 +) @sv
alternative label: Bollspel (796 +) @sv
alternative label: Bollsport (796 +) @sv
alternative label: Försvar, lagspel (796 +) @sv
alternative label: Idrottsgrenar, olika idrottsgrenar (791 ... 796 +) @sv
alternative label: Klubbor (796 +) @sv
alternative label: Kroppskultur, motion, olika grenar (791 ... 796 +) @sv
alternative label: Lag, idrottslag, bollspel (796 +) @sv
alternative label: Lagidrott, bollspel (796 +) @sv
alternative label: Lagspel (796 +) @sv
alternative label: Lagsporter, bollspel (796 +) @sv
alternative label: Landslag, olika idrottsgrenar (791 ... 796 +) @sv
alternative label: Motionsformer, olika motionsformer (791 ... 796 +) @sv
alternative label: Målvakter (796) @sv
alternative label: Racketsport (796 +) @sv
alternative label: Skiljedomare (796 +) @sv
alternative label: Spel, bollspel (796 +) @sv
alternative label: Spelande, bollspel (796 +) @sv
alternative label: Turneringar, bollsporter (796 +) @sv
alternative label: Världsmästerskapstävlingar, grenvis (791 ... 796 +) @sv
broader: LIIKUNTA. URHEILU. LEIKIT. HUVIT
in scheme: URN:NBN:fi:au:hklj:
narrower: Jalkapallo
narrower: Jääkiekko
narrower: Muut joukkuepelit
narrower: Tennis. Squash. Sulkapallo
narrower: Pöytätennis
narrower: Golf
narrower: Keilailu
narrower: Muut pallopelit
notation: 796
preferred label: Ball games @en
preferred label: Bollspel @sv
related: Muut urheilu- ja liikuntamuodot
related: Pelit
related: Korttipelit. Pasianssit
related: Shakki
related: Roolipelit
scope note: Palloilun yleisteokset. Joukkuepelien yleisteokset Tässä ja alaluokissa palloilu ja joukkuepelit kilpa-, huippu- ja kuntourheilun kannalta Tässä ja alaluokissa palloilulajien ja joukkuepelien ottelut, turnaukset, säännöt, valmennus ja välineet Tässä ja alaluokissa palloiluun ja joukkuepeleihin tarkoitetut kentät ja stadionit urheilun kannalta Tässä ja alaluokissa palloilulajien ja joukkuepelien seurat ja -järjestöt
scope note: Allmänna verk om bollspel. Allmänna verk om lagspel Hit och till underklasserna bollspel och lagspel ur tävlings-, elit- och motionsidrottens synvinkel Hit och till underklasserna matcher, turneringar, regler, träning och utrustning inom bollspelsgrenar och lagspel Hit och till underklasserna planer och stadion avsedda för bollspel och lagspel ur sportens synvinkel Hit och till underklasserna klubbar och förbund för bollspelsgrenar och lagspel 796.09-796.909 @sv

Nykyajan historia 1914-1938
type: Class
type: Concept
subclass of: URN:NBN:fi:au:hklj:909
alternative label: Maailmanhistoria, 1914-1938 (909.5)
alternative label: Världshistoria, 1914-1938 (909.5) @sv
broader: URN:NBN:fi:au:hklj:909
in scheme: URN:NBN:fi:au:hklj:
narrower: I maailmansodan historia 1914-1918
notation: 909.5
preferred label: Recent history 1914-1938 @en
preferred label: Nutidens historia 1914-1938 @sv
related: URN:NBN:fi:au:hklj:300
related: Yhteiskuntatieteiden historia
related: URN:NBN:fi:au:hklj:320
related: URN:NBN:fi:au:hklj:325
related: URN:NBN:fi:au:hklj:370
related: URN:NBN:fi:au:hklj:371
related: URN:NBN:fi:au:hklj:390
related: Sotien yhteiskunnalliset vaikutukset
related: Muiden maiden puolustusvoimat
related: Sotahistoria
related: EUROOPPA
related: Keski-Eurooppa
related: Historialliset kartat. Historiallinen maantiede
related: Yleinen arkeologia
related: URN:NBN:fi:au:hklj:919
related: Nykyajan kulttuurihistoria 1914-1938
related: URN:NBN:fi:au:hklj:970
related: Muiden Keski-Euroopan maiden historia
related: URN:NBN:fi:au:hklj:979
scope note: Nykyajan historian yleisteokset 1914-1938 Euroopan nykyajan historian yleisteokset 1914-1938 Tietyn maan tai alueen nykyajan historia ja arkeologia ko. maanosan, maan tai alueen historian luokassa
scope note: Allmänna verk om nutidens historia 1914-1938 Allmänna verk om den europeiska nutidens historia 1914-1938 Verk om nutidens historia eller arkeologi i ett bestämt land eller geografiskt område förs till klassen för världsdelen, landet eller det geografiska området @sv

Nykyajan historia 1939-
type: Class
type: Concept
subclass of: URN:NBN:fi:au:hklj:909
alternative label: Kylmä sota, historia (909.6)
alternative label: Liennytys, maailmanhistoria (909.6)
alternative label: Lähihistoria, historia (909.6)
alternative label: Maailmanhistoria, 1939- (909.6)
alternative label: Nykyaika, historia (909.6 +)
alternative label: Partisaanit, 2. maailmansodan historia (909.6 +)
alternative label: Teollistuneet maat, historia (909.6 +)
alternative label: Vuosituhannen vaihde, historia (909.6)
alternative label: Ydinaseettomat valtiot, historia (909.6 +)
alternative label: Ydinasevaltiot, historia (909.6 +)
alternative label: Avspänning, världshistoria (909.6) @sv
alternative label: Industrialiserade länder, historia (909.6 +) @sv
alternative label: Kalla kriget, historia (909.6) @sv
alternative label: Kärnvapenfria stater, historia (909.6 +) @sv
alternative label: Kärnvapenmakter, historia (909.6 +) @sv
alternative label: Millennieskiftet, historia (909.6) @sv
alternative label: Nutiden, historia (909.6 +) @sv
alternative label: Närhistoria, historia (909.6) @sv
alternative label: Partisaner, 2:a världskrigets historia (909.6 +) @sv
alternative label: Världshistoria, 1939- (909.6) @sv
broader: URN:NBN:fi:au:hklj:909
in scheme: URN:NBN:fi:au:hklj:
narrower: II maailmansodan historia 1939-1945
notation: 909.6
preferred label: Modern history 1939- @en
preferred label: Nutidens historia 1939- @sv
related: URN:NBN:fi:au:hklj:300
related: Yhteiskuntatieteiden historia
related: URN:NBN:fi:au:hklj:320
related: URN:NBN:fi:au:hklj:325
related: URN:NBN:fi:au:hklj:370
related: URN:NBN:fi:au:hklj:371
related: URN:NBN:fi:au:hklj:390
related: Sotien yhteiskunnalliset vaikutukset
related: Muiden maiden puolustusvoimat
related: Sotahistoria
related: EUROOPPA
related: Keski-Eurooppa
related: Historialliset kartat. Historiallinen maantiede
related: Yleinen arkeologia
related: URN:NBN:fi:au:hklj:919
related: Nykyajan kulttuurihistoria 1939-
related: URN:NBN:fi:au:hklj:970
related: Muiden Keski-Euroopan maiden historia
related: URN:NBN:fi:au:hklj:979
scope note: Nykyajan historian yleisteokset 1939- Euroopan nykyajan historian yleisteokset 1939- Tietyn maan tai alueen nykyajan historia ja arkeologia ko. maanosan, maan tai alueen historian luokassa
scope note: Allmänna verk om nutidens historia 1939- Allmänna verk om den europeiska nutidens historia 1939- Verk om nutidens historia eller arkeologi i ett bestämt land eller geografiskt område förs till klassen för världsdelens, landets eller det geografiska områdets historia @sv

Suomenkielinen murrekirjallisuus (Kaunoluokka)
type: Class
type: Concept
type: FormClass
subclass of: SUOMENKIELINEN KAUNOKIRJALLISUUS (Kaunoluokka)
broader: SUOMENKIELINEN KAUNOKIRJALLISUUS (Kaunoluokka)
in scheme: URN:NBN:fi:au:hklj:
notation: 1.5
preferred label: Dialectal literature (Fiction class) @en
preferred label: Bygdemålslitteratur på finska (Skönklass) @sv

Luettelointi
type: Class
type: Concept
subclass of: Kirjastoaineisto. Kokoelmatyö
alternative label: Bibliografinen kuvailu (022.4)
alternative label: Bibliografinen valvonta, luettelointi (022.4)
alternative label: Kuvailu, luettelointi (022.4)
alternative label: Luettelointi, kirjastonhoito (022.4)
alternative label: Luettelointisäännöt (022.4)
alternative label: Marc-formaatit (022.4)
alternative label: Metadata, luettelointi (022.4)
alternative label: Metatieto, luettelointi (022.4)
alternative label: Musiikin luettelointi (022.4)
alternative label: Musiikkiaineisto, luettelointi (022.4)
alternative label: Musiikkikirjastotyö, luettelointi (022.4)
alternative label: Nimiösivut, luettelointi (022.4)
alternative label: Beskrivning, katalogisering (022.4) @sv
alternative label: Bibliografisk beskrivning (022.4) @sv
alternative label: Bibliografisk kontroll, katalogisering (022.4) @sv
alternative label: Katalogisering, biblioteksarbete (022.4) @sv
alternative label: Katalogiseringsregler (022.4) @sv
alternative label: Marc-format (022.4) @sv
alternative label: Metadata, katalogisering (022.4) @sv
alternative label: Metakunskap, katalogisering (022.4) @sv
alternative label: Musik, katalogisering (022.4) @sv
alternative label: Musikbiblioteksarbete, katalogisering (022.4) @sv
alternative label: Musikmedier, katalogisering (022.4) @sv
alternative label: Titelblad, katalogisering (022.4) @sv
broader: Kirjastoaineisto. Kokoelmatyö
in scheme: URN:NBN:fi:au:hklj:
notation: 022.4
preferred label: Cataloguing @en
preferred label: Katalogisering @sv
related: URN:NBN:fi:au:hklj:010
related: Kirjastojen luettelot
related: Suomi
related: URN:NBN:fi:au:hklj:018
related: Sisällönkuvailu
related: Muu kuin kirja-aineisto kirjastossa
related: Lastenkirjastot
related: Koulukirjastot
related: Erityisten väestöryhmien kirjastopalvelut
related: Sairaalakirjastot
related: Erikoiskokoelmat
related: Paikalliskokoelmat
related: Musiikkikirjastot
related: Kirjastoautot. Kirjastoveneet
related: Yleiset kirjastot
related: Erikoiskirjastot. Yhdistysten, laitosten ja yritysten kirjastot
related: URN:NBN:fi:au:hklj:028
related: Dokumentaatio ja informaatiopalvelu yleensä
related: Museonhoito
related: Arkistonhoito
related: URN:NBN:fi:au:hklj:061
related: URN:NBN:fi:au:hklj:063
scope note: Kirjastoaineiston (myös musiikin) luettelointi aineistotyypistä riippumatta Luettelointisäännöt. Luettelointiformaatit
scope note: Katalogisering av biblioteksmedier (också musikmedier) oavsett mediatyp Katalogiseringsregler. Katalogiseringsformat @sv

Erikoiskokoelmat
type: Class
type: Concept
subclass of: Yleisönpalvelu
alternative label: Aineistonvalinta, kirjastoaineisto, musiikki (024.5)
alternative label: Helppolukuiset kirjat, kirjastoaineistona (024.5)
alternative label: Isotekstiset kirjat, kirjastoaineistona (024.5)
alternative label: Kirjastot, artoteekit (024.5)
alternative label: Kirjastot, kartoteekit (024.5)
alternative label: Selkokirjat, kirjastoaineistona (024.5)
alternative label: Selkolehdet, kirjastoaineistona (024.5)
alternative label: Bibliotek, artotek (024.5) @sv
alternative label: Bibliotek, kartotek (024.5) @sv
alternative label: Lättlästa böcker, helppolukuiset kirjat, som biblioteksmedier (024.5) @sv
alternative label: Lättlästa böcker, selkokirjat, som biblioteksmedier (024.5) @sv
alternative label: Lättlästa tidningar, som biblioteksmedier (024.5) @sv
alternative label: Medieval, biblioteksmedier, musik (024.5) @sv
alternative label: Storstilsböcker, som biblioteksmedier (024.5) @sv
broader: Yleisönpalvelu
in scheme: URN:NBN:fi:au:hklj:
narrower: Paikalliskokoelmat
narrower: Musiikkikirjastot
notation: 024.5
preferred label: Hospital libraries @en
preferred label: Specialsamlingar @sv
related: URN:NBN:fi:au:hklj:018
related: Kirjastoaineisto. Kokoelmatyö
related: Valinta ja hankinta
related: Luettelointi
related: Sisällönkuvailu
related: Muu kuin kirja-aineisto kirjastossa
related: Kirjaston käyttö. Kirjastososiologia
related: Lainaus
related: Tietopalvelu. Informaatiopalvelu
related: Kirjastonkäytön opastus
related: Yleiset kirjastot
related: Erikoiskirjastot. Yhdistysten, laitosten ja yritysten kirjastot
related: URN:NBN:fi:au:hklj:028
related: Dokumentaatio ja informaatiopalvelu yleensä
related: Museonhoito
related: Arkistonhoito
related: URN:NBN:fi:au:hklj:061
related: URN:NBN:fi:au:hklj:063
scope note: Tässä ja alaluokissa yleisten, tieteellisten tai yksityisten kirjastojen erikoiskokoelmia koskevat yleisteokset
scope note: Hit och till underklasserna allmänna verk som rör specialsamlingar i allmänna, vetenskapliga eller privata bibliotek @sv

Kirjastonkäytön opastus
type: Class
type: Concept
subclass of: KIRJASTOT. KIRJASTOTOIMI
broader: KIRJASTOT. KIRJASTOTOIMI
in scheme: URN:NBN:fi:au:hklj:
notation: 025
preferred label: Introduction to library use @en
preferred label: Biblioteksintroduktion @sv
related: URN:NBN:fi:au:hklj:018
related: Muu kuin kirja-aineisto kirjastossa
related: Kirjaston käyttö. Kirjastososiologia
related: Yleisönpalvelu
related: Lainaus
related: Tietopalvelu. Informaatiopalvelu
related: Lastenkirjastot
related: Koulukirjastot
related: Erityisten väestöryhmien kirjastopalvelut
related: Sairaalakirjastot
related: Erikoiskokoelmat
related: Paikalliskokoelmat
related: Musiikkikirjastot
related: Kirjastoautot. Kirjastoveneet
related: Yleiset kirjastot
related: Erikoiskirjastot. Yhdistysten, laitosten ja yritysten kirjastot
related: URN:NBN:fi:au:hklj:028
related: Dokumentaatio ja informaatiopalvelu yleensä
related: Museonhoito
related: Arkistonhoito
related: URN:NBN:fi:au:hklj:061
related: URN:NBN:fi:au:hklj:063
scope note: Yleisten, tieteellisten, yksityisten ja erikoiskirjastojen käytön opastus kirjaston eri toimintojen osalta
scope note: Introduktion som rör olika biblioteksfunktioner i allmänna, vetenskapliga och privata bibliotek samt specialbibliotek @sv

YLEISET TIETOSANAKIRJAT
type: Class
type: Concept
subclass of: KIRJA-ALA
alternative label: Aihehakemistot (030 ... 038)
alternative label: Asiakasrekisterit, rekisterit (030 ... 031)
alternative label: Ennätykset (030 ... 038)
alternative label: Ensyklopediat (030 ... 038)
alternative label: Faktatietokannat (030 ... 038)
alternative label: Hakemistot (030 ... 038)
alternative label: Hakuteokset (030 ... 038)
alternative label: Kirjasarjat, tietosanakirjat (030 ... 038)
alternative label: Kuvasanakirjat (030 ... 038)
alternative label: Käsikirjat (030 ... 038)
alternative label: Leksikografia (030 ... 038)
alternative label: Rekisterit (030 ... 031)
alternative label: Relaatiotietokannat (030 ... 038)
alternative label: Tekstitietokannat (030 ... 038)
alternative label: Tiedostot (030 ... 038)
alternative label: Tietokannat (030 ... 038)
alternative label: Tietopankit (030 ... 038)
alternative label: Tietorekisterit (030 ... 038)
alternative label: Tietosanakirjat (030 ... 038)
alternative label: Tietovarastot (030 ... 038)
alternative label: Bildordböcker (030 ... 038) @sv
alternative label: Bokserier, encyklopedier (030 ... 038) @sv
alternative label: Databanker (030 ... 038) @sv
alternative label: Databaser (030 ... 038) @sv
alternative label: Datalager (030 ... 038) @sv
alternative label: Dataregister (030 ... 038) @sv
alternative label: Encyklopedier (030 ... 038) @sv
alternative label: Faktadatabaser (030 ... 038) @sv
alternative label: Filer (030 ... 038) @sv
alternative label: Fulltextdatabaser (030 ... 038) @sv
alternative label: Handböcker (030 ... 038) @sv
alternative label: Index, register (030 ... 038) @sv
alternative label: Konversationslexikon (030 ... 038) @sv
alternative label: Kundregister, register (030 ... 031) @sv
alternative label: Lexikografi (030 ... 038) @sv
alternative label: Register (030 ... 031) @sv
alternative label: Rekord (030 ... 038) @sv
alternative label: Relationsdatabaser (030 ... 038) @sv
alternative label: Uppslagsverk (030 ... 038) @sv
alternative label: Ämnesindex (030 ... 038) @sv
broader: KIRJA-ALA
in scheme: URN:NBN:fi:au:hklj:
narrower: Suomenkieliset
narrower: Ruotsinkieliset
narrower: Saksankieliset
narrower: Englanninkieliset
narrower: Ranskankieliset
narrower: Italiankieliset
narrower: Espanjankieliset
narrower: Venäjänkieliset
notation: 030
preferred label: GENERAL REFERENCE WORKS @en
preferred label: ALLMÄNNA UPPSLAGSVERK @sv
related: Kirjan historia
related: Johdatukset tieteisiin
related: URN:NBN:fi:au:hklj:010
related: YLEISET KOKOOMATEOKSET
related: Dokumentaatio ja informaatiopalvelu yleensä
related: Systeemityö
scope note: Tässä ja alaluokissa aineistotyypistä riippumatta yleiset tietosanakirjat, ensyklopediat, hakuteokset, tiedostot, tietokannat ja rekisterit Erikoisalojen tietosanakirjat, ensyklopediat, hakuteokset, tiedostot, tietokannat ja rekisterit alan mukaisessa luokassa
scope note: Hit allmänna uppslagsverk, encyklopedier, uppslagsböcker, index, databaser och register oavsett mediatyp Uppslagsverk, encyklopedier, uppslagsböcker, index, databaser och register som rör specialområden klassificeras enligt område @sv

Hypnoosi. Suggestio
type: Class
type: Concept
subclass of: Tiedostamaton sielunelämä
alternative label: Hypnoosi, psykologia (121.93)
alternative label: Itsesuggestio (121.93)
alternative label: Itsesuggestio, psykologia (121.93)
alternative label: Suggestio, psykologia (121.93)
alternative label: Hypnos, psykologi (121.93) @sv
alternative label: Självsuggestion (121.93) @sv
alternative label: Självsuggestion, psykologi (121.93) @sv
alternative label: Suggestion, psykologi (121.93) @sv
broader: Tiedostamaton sielunelämä
in scheme: URN:NBN:fi:au:hklj:
notation: 121.93
preferred label: Hypnosis. Suggestion @en
preferred label: Hypnos. Suggestion @sv
related: Tunne- ja tahtotoiminnot
related: Psykologian suunnat
related: Syvyyspsykologia
related: Lapsuuden ja nuoruuden psykologia
related: Muita psykologian aloja
related: Kehityspsykologia. Eri ikäkausien psykologia
related: URN:NBN:fi:au:hklj:182
related: Filosofian ja psykologian opetusoppi
related: Uskonnon opetusoppi
related: Yhteiskuntatieteiden opetusoppi
related: Maantieteen ja kansatieteen opetusoppi
related: Matematiikan ja luonnontieteiden opetusoppi
related: Sovellettujen tieteiden opetusoppi
related: Taideaineiden opetusoppi
related: Musiikin opetusoppi
related: Liikunnan ja urheilun opetusoppi
related: Kirjallisuuden ja kielten opetusoppi
related: Historian opetusoppi
related: Parapsykologia
related: Kuolemakokemukset
related: URN:NBN:fi:au:hklj:618.8
related: Analyyttinen psykoterapia
scope note: Hypnoosi ja suggestio psykologisina ilmiöinä
scope note: Hypnos och suggestion som psykologiska fenomen @sv

Yhteiskuntatieteiden opetusoppi
type: Class
type: Concept
subclass of: URN:NBN:fi:au:hklj:182
alternative label: Kansainvälisyyskasvatus, opetusoppi (182.3)
alternative label: Kansalaistaito, opetusoppi (182.3)
alternative label: Kotiseutuoppi, opetusoppi (182.3)
alternative label: Rauhankasvatus, opetusoppi (182.3)
alternative label: Viestintäkasvatus, didaktiikka (182.3)
alternative label: Yhteiskuntaoppi, opetusoppi (182.3)
alternative label: Yhteiskuntatieteet, opetusoppi (182.3)
alternative label: Yhteiskuntatieto, opetusoppi (182.3)
alternative label: Yhteisökasvatus, opetusoppi (182.3)
alternative label: Ympäristöoppi, opetusoppi (182.3)
alternative label: Fostran till internationalism, didaktik (182.3) @sv
alternative label: Fredsfostran, didaktik (182.3) @sv
alternative label: Hembygdslära, didaktik (182.3) @sv
alternative label: Kommunikationsfostran, didaktik (182.3) @sv
alternative label: Medborgarfärdighet, didaktik (182.3) @sv
alternative label: Omgivningslära, didaktik (182.3) @sv
alternative label: Samhällskunskap, didaktik (182.3) @sv
alternative label: Samhällslära, didaktik (182.3) @sv
alternative label: Samhällsvetenskaper, didaktik (182.3) @sv
alternative label: Samlevnadskunskap, didaktik (182.3) @sv
broader: URN:NBN:fi:au:hklj:182
in scheme: URN:NBN:fi:au:hklj:
notation: 182.3
preferred label: Didactics in the social sciences @en
preferred label: Samhällsvetenskapernas didaktik @sv
related: Oppimisen psykologia
related: Hypnoosi. Suggestio
related: URN:NBN:fi:au:hklj:181.7
related: URN:NBN:fi:au:hklj:181.9
related: URN:NBN:fi:au:hklj:183
related: URN:NBN:fi:au:hklj:183.5
related: URN:NBN:fi:au:hklj:183.7
related: Erikoiskoulut. Kokeilukoulut
related: URN:NBN:fi:au:hklj:184
related: Muiden maiden yliopistot ja korkeakoulut
related: URN:NBN:fi:au:hklj:185
related: URN:NBN:fi:au:hklj:188.4
related: Radio- ja televisiotoiminta
related: Radiotoiminta
related: URN:NBN:fi:au:hklj:384.42
related: URN:NBN:fi:au:hklj:627.7
related: URN:NBN:fi:au:hklj:627.73
related: URN:NBN:fi:au:hklj:627.751
related: URN:NBN:fi:au:hklj:627.753
related: URN:NBN:fi:au:hklj:627.7531
related: URN:NBN:fi:au:hklj:627.7532
scope note: Pääluokkaan 300 kuuluvien erikoisalojen tai aineiden opetusoppi Tässä esim. yhteiskuntaopin ja -tieteen, kansalaistaidon, ympäristöopin, tilastotieteen, valtiotieteen, oikeustieteen, sosiologian, sosiaalipolitiikan ja sotilaskoulutuksen opetusoppi
scope note: Didaktik som rör specialområden eller ämnen som hör till huvudklass 300 Hit didaktik inom t.ex. samhällslära och samhällsvetenskaperna, medborgarkunskap, miljökunskap, statistik, statslära, juridik, sociologi, socialpolitik och militärutbilning @sv

Matematiikan ja luonnontieteiden opetusoppi
type: Class
type: Concept
subclass of: URN:NBN:fi:au:hklj:182
alternative label: Biologia, opetusoppi (182.5)
alternative label: Kemia, opetusoppi (182.5)
alternative label: Kemian opetusoppi (182.5)
alternative label: Luonnontieteiden opetusoppi (182.5)
alternative label: Luonto-opetus, didaktiikka (182.5)
alternative label: Luontokoulut, didaktiikka (182.5)
alternative label: Matematiikan opetusoppi (182.5)
alternative label: Ympäristö- ja luonnontieto, opetusoppi (182.5)
alternative label: Ympäristökasvatus, opetusoppi (182.5)
alternative label: Ympäristötieto, opetusoppi (182.5)
alternative label: Biologi, didaktik (182.5) @sv
alternative label: Kemi, didaktik (182.5) @sv
alternative label: Kemins didaktik (182.5) @sv
alternative label: Matematikens didaktik (182.5) @sv
alternative label: Miljöfostran, didaktik (182.5) @sv
alternative label: Miljölära, didaktik (182.5) @sv
alternative label: Naturskolor, didaktik (182.5) @sv
alternative label: Naturvetenskapernas didaktik (182.5) @sv
alternative label: Omgivnings- och naturlära, didaktik (182.5) @sv
alternative label: Uteundervisning, didaktik (182.5) @sv
broader: URN:NBN:fi:au:hklj:182
in scheme: URN:NBN:fi:au:hklj:
notation: 182.5
preferred label: Didactics in mathematics and the natural sciences @en
preferred label: Matematikens och naturvetenskapernas didaktik @sv
related: Oppimisen psykologia
related: Hypnoosi. Suggestio
related: URN:NBN:fi:au:hklj:181.7
related: URN:NBN:fi:au:hklj:181.9
related: URN:NBN:fi:au:hklj:183
related: URN:NBN:fi:au:hklj:183.5
related: URN:NBN:fi:au:hklj:183.7
related: Erikoiskoulut. Kokeilukoulut
related: URN:NBN:fi:au:hklj:184
related: Muiden maiden yliopistot ja korkeakoulut
related: URN:NBN:fi:au:hklj:185
related: URN:NBN:fi:au:hklj:188.4
related: Radio- ja televisiotoiminta
related: Radiotoiminta
related: URN:NBN:fi:au:hklj:384.42
related: Opinnot
related: URN:NBN:fi:au:hklj:627.7
related: URN:NBN:fi:au:hklj:627.73
related: URN:NBN:fi:au:hklj:627.751
related: URN:NBN:fi:au:hklj:627.753
related: URN:NBN:fi:au:hklj:627.7531
related: URN:NBN:fi:au:hklj:627.7532
scope note: Pääluokkaan 500 kuuluvien erikoisalojen tai aineiden opetusoppi Tässä esim. luonnontieteiden, luonnon- ja ympäristönsuojelun, matematiikan, tähtitieteen, fysiikan, kemian ja biologian opetusoppi
scope note: Didaktik som rör specialområden eller ämnen som hör till huvudklass 500 Hit didaktik inom t.ex. naturvetenskaperna, naturskydd, miljövård, matematik, astronomi, fysik, kemi och biologi @sv

Liikunnan ja urheilun opetusoppi
type: Class
type: Concept
subclass of: Taideaineiden opetusoppi
alternative label: Koululiikunta, liikunnan opetusoppi (182.79)
alternative label: Liikkuminen, liikunnan opetusoppi (182.79)
alternative label: Liikunta, opetusoppi (182.79)
alternative label: Opiskelijaliikunta, liikunnan didaktiikka (182.79)
alternative label: Urheilu, opetusoppi (182.79)
alternative label: Voimistelu, opetusoppi (182.79)
alternative label: Gymnastik, didaktik (182.79) @sv
alternative label: Idrott, didaktik (182.79) @sv
alternative label: Motion, didaktik (182.79) @sv
alternative label: Motionerande, motionens didaktik (182.79) @sv
alternative label: Skolidrott, motionens didaktik (182.79) @sv
alternative label: Studentidrott, motionens didaktik (182.79) @sv
broader: Taideaineiden opetusoppi
in scheme: URN:NBN:fi:au:hklj:
notation: 182.79
preferred label: Didactics in physical education and sport @en
preferred label: Motionens och sportens didaktik @sv
related: Oppimisen psykologia
related: Hypnoosi. Suggestio
related: URN:NBN:fi:au:hklj:181.7
related: URN:NBN:fi:au:hklj:181.9
related: URN:NBN:fi:au:hklj:183
related: URN:NBN:fi:au:hklj:183.5
related: URN:NBN:fi:au:hklj:183.7
related: Erikoiskoulut. Kokeilukoulut
related: URN:NBN:fi:au:hklj:184
related: Muiden maiden yliopistot ja korkeakoulut
related: URN:NBN:fi:au:hklj:185
related: URN:NBN:fi:au:hklj:188.4
related: Radio- ja televisiotoiminta
related: Radiotoiminta
related: URN:NBN:fi:au:hklj:384.42
related: URN:NBN:fi:au:hklj:627.7
related: URN:NBN:fi:au:hklj:627.73
related: URN:NBN:fi:au:hklj:627.751
related: URN:NBN:fi:au:hklj:627.753
related: URN:NBN:fi:au:hklj:627.7531
related: URN:NBN:fi:au:hklj:627.7532
related: Liikunta. Urheilu
scope note: Luokkiin 790-796+ kuuluvien erikoisalojen tai aineiden opetusoppi Tässä esim. liikunnan ja urheilun, liikunta- ja urheilulajien sekä urheiluvalmennuksen opetusoppi
scope note: Didaktik som rör specialområden eller ämnen som hör till klasserna 790-796+ Hit didaktik inom t.ex. motion och idrott, olika sport- och idrottsgrenar samt idrottsträning @sv

Valtiofilosofia. Valtiomuodot
type: Class
type: Concept
subclass of: URN:NBN:fi:au:hklj:320
alternative label: Aktivismi, poliittinen filosofia (321)
alternative label: Antiutopiat, valtiofilosofia (321)
alternative label: Aristokratia, valtiofilosofia (321)
alternative label: Autonomia, valtiofilosofia (321)
alternative label: Biopolitiikka, poliittinen valta (321)
alternative label: Deliberatiivinen demokratia, valtiofilosofia (321)
alternative label: Demokratia (321)
alternative label: Demokratia, valtiofilosofia (321)
alternative label: Demokratiavaje, demokratia (321)
alternative label: Demokratisoituminen, demokratia (321)
alternative label: Demokratisoituminen, valtiofilosofia (321)
alternative label: Diktaattorit, valtiofilosofia (321)
alternative label: Diktatuuri, valtiofilosofia (321)
alternative label: Doktriinit, poliittinen filosofia (321)
alternative label: Dystopiat, valtiofilosofia (321)
alternative label: Edustuksellinen demokratia, politiikan filosofia (321)
alternative label: Enemmistöperiaate (321)
alternative label: Enemmistöperiaate, politiikan filosofia (321)
alternative label: Ennakkoäänestys, valtiofilosofia (321)
alternative label: Ennakkoäänestäminen, valtiofilosofia (321)
alternative label: Etiikka, politiikan (321)
alternative label: Federalismi (321)
alternative label: Filosofia, valtiofilosofia (321)
alternative label: Hallitusmuodot (321)
alternative label: Harvainvalta (321)
alternative label: Hegemonia, valtiofilosofia (321)
alternative label: Isänmaallisuus, kansallisvaltio (321)
alternative label: Itsehallinto, demokratia (321)
alternative label: Itsemäärääminen, valtiofilosofia (321)
alternative label: Itsemääräämisoikeus, valtiofilosofia (321)
alternative label: Itsevaltiaat, valtiofilosofia (321)
alternative label: Itsevaltius, valtiofilosofia (321)
alternative label: Julkinen keskustelu, politiikan filosofia (321)
alternative label: Kaksikamarijärjestelmä (321)
alternative label: Kaksikamarijärjestelmä, valtiofilosofia (321)
alternative label: Kansalaiskeskustelu, politiikan filosofia (321)
alternative label: Kansallinen identiteetti, kansallisvaltioaate (321)
alternative label: Kansallismielisyys, kansallisvaltioaate (321)
alternative label: Kansallisuusaate, kansallisvaltioaate (321)
alternative label: Kansallisuusliikkeet, kansallisvaltioaate (321)
alternative label: Kansallisuuspolitiikka, valtiofilosofia (321)
alternative label: Kansallisvaltio, valtiofilosofia (321)
alternative label: Kansallisvaltiot, valtiofilosofia (321)
alternative label: Kansandemokratia, valtiomuodot (321)
alternative label: Kansanvalta (321)
alternative label: Kansanäänestykset, valtiofilosofia (321)
alternative label: Kaupunkivaltiot, valtiofilosofia (321)
alternative label: Konsensus, valtiofilosofia (321)
alternative label: Kosmopolitismi, politiikan filosofia (321)
alternative label: Kriittisyys, politiikan filosofia (321)
alternative label: Kyseenalaistaminen, politiikan filosofia (321)
broader: URN:NBN:fi:au:hklj:320
in scheme: URN:NBN:fi:au:hklj:
notation: 321
related: Etiikka. Moraalifilosofia
related: URN:NBN:fi:au:hklj:321.09
related: URN:NBN:fi:au:hklj:323
related: Rotujen asema. Rotusyrjintä
related: Juutalaisten asema. Antisemitismi
related: Poliittiset ja aatteelliset vähemmistöt
related: Orjuus
related: Sisäpolitiikka. Puolueet
related: Suomi
related: Suomen valtiojärjestelmä
related: Muiden maiden valtiojärjestelmät
related: URN:NBN:fi:au:hklj:332.1
related: URN:NBN:fi:au:hklj:340
related: Yhteiskuntafilosofia
related: Yhteiskunnan rakenne
related: Yhteiskunnalliset aatesuunnat. Poliittiset ideologiat
related: Sosialismi. Kommunismi
related: Konservatismi
related: Liberalismi
related: Fasismi
related: Muut aatesuunnat
scope note: Valtiofilosofia ja -teoria. Politiikan filosofia ja teoria Poliittinen valta. Poliittinen etiikka Poliittisia ja valtiollisia järjestelmiä koskevat yleisteokset Valtiomuodot. Hallitusmuodot. Valtioteoriat Tasavalta. Monarkia. Kansallisvaltio. Liittovaltio. Demokratia. Parlamentarismi. Oikeusvaltio. Yksinvalta. Harvainvalta. Diktatuuri Vaalit ja vaalijärjestelmät yleensä. Kansanäänestys
scope note: Statsfilosofi och statsteori. Politikens filosofi och teori Politisk makt. Politisk etik Allmänna verk som rör politiska system och statsskick Statsformer. Regeringsformer. Statsteorier Republik. Monarki. Nationalstat. Förbundsrepublik. Demokrati. Parlamentarism. Rättsstat. Envälde. Oligarki. Diktatur Val och valsystem i allmänhet. Folkomröstning @sv

Järjestötoiminta. Kokoustekniikka
type: Class
type: Concept
subclass of: URN:NBN:fi:au:hklj:370
alternative label: Aatteelliset järjestöt, järjestötoiminta (377 +)
alternative label: Aatteelliset yhdistykset, järjestötoiminta (377 +)
alternative label: Audiokokoukset, neuvottelutekniikka (377)
alternative label: Audiokonferenssit, neuvottelutekniikka (377)
alternative label: Audioneuvottelut, neuvottelutekniikka (377)
alternative label: Elektroniset kokoukset, kokoustekniikka (377)
alternative label: Ennakkoäänestys, järjestötekniikka (377)
alternative label: Ennakkoäänestäminen, järjestötekniikka (377)
alternative label: Etäkokoukset, kokoustekniikka (377)
alternative label: Etäosallistuminen, kokoustekniikka (377)
alternative label: Hajaannus, järjestötoiminta (377 +)
alternative label: Johtaminen, kokoustekniikka (377)
alternative label: Johtokunnat, yhdistykset (377)
alternative label: Julkinen keskustelu, kansalaisjärjestöt (377 +)
alternative label: Järjestäminen, kokoukset (377)
alternative label: Järjestödemokratia (377 +)
alternative label: Järjestöt, järjestötoiminta (377 +)
alternative label: Järjestötoiminta (377 +)
alternative label: Jäsenistö (377 +)
alternative label: Jäsenyys (377 +)
alternative label: Kansalaisjärjestöt (377 +)
alternative label: Kansalaisjärjestöt, järjestötoiminta (377 +)
alternative label: Kansalaiskeskustelu, kansalaisjärjestöt (377 +)
alternative label: Kansalaisliikkeet, järjestötoiminta (377 +)
alternative label: Kansalaisosallistuminen, järjestötoiminta (377 +)
alternative label: Kansalaisten osallistuminen, järjestötoiminta (377 +)
alternative label: Kansalaistoiminta, järjestötoiminta (377 +)
alternative label: Kansanliikkeet, järjestötoiminta (377 +)
alternative label: Kerhot, kerhotoiminta (377 +)
alternative label: Kerhotoiminta (377 +)
alternative label: Keskustelutaito, kokoustekniikka (377)
alternative label: Klubit, kerhotoiminta (377 +)
alternative label: Kokoustekniikka (377)
alternative label: Kokoustilat, kokoustekniikka (377)
alternative label: Konferenssit, kokoustekniikka (377)
alternative label: Kunnallinen kokoustekniikka (377)
alternative label: Kyläyhdistykset, kansalaisjärjestöt (377 +)
alternative label: NGO (377 +)
alternative label: Neuvostot, järjestötoiminta (377)
alternative label: Neuvottelut, neuvottelutaito (377)
alternative label: Neuvottelutaito (377)
alternative label: Non-profit-organisaatiot, järjestötoiminta (377 +)
alternative label: Postiäänestys, järjestötekniikka (377)
alternative label: Postiäänestäminen, järjestötekniikka (377)
alternative label: Protestiliikkeet, järjestötoiminta (377)
alternative label: Puheenjohtajat, kokoustekniikka (377 +)
alternative label: Puheenjohtajuus, kokoustekniikka (377 +)
alternative label: Puhelinneuvottelut, kokoustekniikka (377 +)
alternative label: Pääteneuvottelut, neuvottelutaito (377)
alternative label: Pöytäkirjat (377)
alternative label: Pöytäkirjat, pöytäkirjan laatiminen (377)
alternative label: Round table -järjestöt (377)
alternative label: Salaseurat (377)
alternative label: Seurat, järjestötoiminnan tekniikka (377)
alternative label: Seuratoiminta (377 +)
broader: URN:NBN:fi:au:hklj:370
in scheme: URN:NBN:fi:au:hklj:
narrower: Työväenliike
narrower: Työmarkkinajärjestöt
narrower: Yksityinen avustus- ja huoltotyö
narrower: Nuorisoseuratoiminta
narrower: Partioliike
notation: 377
related: URN:NBN:fi:au:hklj:060
related: URN:NBN:fi:au:hklj:061
related: URN:NBN:fi:au:hklj:063
related: Sisälähetys. Evankelioiminen
related: Sisäpolitiikka. Puolueet
related: Suomi
related: URN:NBN:fi:au:hklj:345
related: URN:NBN:fi:au:hklj:371
related: Käytös- ja tapatieto
related: Juhlien järjestäminen
related: Johtamisen tekniikka ja menetelmät
related: Ilmaisutaito. Puhetaito. Lausuntataide
scope note: Neuvottelutekniikka. Kokouksen asiakirjatekniikka Tässä myös kunnallinen ja valtionhallinnollinen kokoustekniikka Yleisten järjestöllisten tilaisuuksien järjestäminen Jos teoksessa on sekä yhdistysten kokoustekniikkaa että taloudenhoitoa, on etusija luokalla 377 Jos teoksessa on sekä järjestö- tai kokoustekniikkaa että puhetaitoa, on etusija luokalla 377 Eri alojen järjestöt, kokoukset ja kongressit alan mukaisessa luokassa
scope note: Förhandlingsteknik. Hur man upprättar mötesdokument Hit också mötesteknik som rör kommunal- och statsförvaltningen Anordnande av allmänna organisationssammankomster Om verket innehåller både mötesteknik och ekonomi för föreningar ges företräde åt klass 377 Om verket handlar om både organisations- eller mötesteknik och talarkonst ges företräde åt klass 377 Organisationer, möten och kongresser som rör olika områden klassificeras enligt område @sv

Posti
type: Class
type: Concept
subclass of: URN:NBN:fi:au:hklj:384
alternative label: Kenttäposti (384.1)
alternative label: Kenttäposti, postiliikenne (384.1)
alternative label: Kotelointi, posti (384.1)
alternative label: Matka-aika, posti (384.1)
alternative label: Osoitejärjestelmät (384.1)
alternative label: Osoitteet, postiliikenne (384.1)
alternative label: Paketointi, posti (384.1)
alternative label: Posti (384.1)
alternative label: Postiautot, postiliikenne (384.1)
alternative label: Postilaatikot (384.1)
alternative label: Postilaitokset (384.1)
alternative label: Postiliikenne (384.1)
alternative label: Postilähetykset (384.1)
alternative label: Postimaksut (384.1)
alternative label: Postinjakelu (384.1)
alternative label: Postinumeroalueet (384.1)
alternative label: Postinumerot (384.1)
alternative label: Postiosoitteet (384.1)
alternative label: Postiosoitteet, posti (384.1)
alternative label: Postipalvelut (384.1)
alternative label: Postitoimipaikat (384.1)
alternative label: Postitoimipaikat, posti (384.1)
alternative label: Putkiposti (384.1)
alternative label: Välimatkat, postiliikenne (384.1)
alternative label: Adresser, osoitteet, posttrafik (384.1) @sv
alternative label: Adressystem (384.1) @sv
alternative label: Distanser, posttrafik (384.1) @sv
alternative label: Fältpost (384.1) @sv
alternative label: Fältpost, posttrafik (384.1) @sv
alternative label: Inkapsling, post (384.1) @sv
alternative label: Paketering, post (384.1) @sv
alternative label: Post (384.1) @sv
alternative label: Postadresser (384.1) @sv
alternative label: Postadresser, post (384.1) @sv
alternative label: Postanstalter (384.1) @sv
alternative label: Postanstalter, post (384.1) @sv
alternative label: Postavgifter (384.1) @sv
alternative label: Postbussar, posttrafik (384.1) @sv
alternative label: Postdistribution (384.1) @sv
alternative label: Postförsändelser (384.1) @sv
alternative label: Postlådor (384.1) @sv
alternative label: Postnummer (384.1) @sv
alternative label: Postnummerområden (384.1) @sv
alternative label: Postservice (384.1) @sv
alternative label: Posttrafik (384.1) @sv
alternative label: Postverk (384.1) @sv
alternative label: Resetid, post (384.1) @sv
alternative label: Rörpost (384.1) @sv
broader: URN:NBN:fi:au:hklj:384
in scheme: URN:NBN:fi:au:hklj:
notation: 384.1
preferred label: Post @en
related: Kasvatusfilosofia. Kasvatustavoitteet
related: URN:NBN:fi:au:hklj:320
related: URN:NBN:fi:au:hklj:332.1
related: Elämäntapojen sosiologia. Kulttuurisosiologia
related: URN:NBN:fi:au:hklj:384.103
related: URN:NBN:fi:au:hklj:384.109
related: URN:NBN:fi:au:hklj:627.7
related: Tietoliikenne. Viestintätekniikka. Multimedia
related: URN:NBN:fi:au:hklj:627.751
related: Sähköposti. Verkkojuttelu
related: URN:NBN:fi:au:hklj:627.7512
related: Matkaviestinpalvelut. Puhelinliikenne
related: URN:NBN:fi:au:hklj:627.753
related: URN:NBN:fi:au:hklj:627.7531
related: URN:NBN:fi:au:hklj:627.7532
related: Öljy. Maakaasu
related: Materiaalitoiminnot. Logistiikka
related: Mainonta
related: URN:NBN:fi:au:hklj:721
related: Kaupunkisuunnittelu. Kaupunkiarkkitehtuuri
related: Ilmaisutaito. Puhetaito. Lausuntataide
related: Postimerkkeily
scope note: Posti. Postiliikenne. Postimaksut. Postinjakelu Postilaitokset ja niiden palvelumuodot Postiosoitejärjestelmät
scope note: Post. Posttrafik. Postavgifter. Postdistribution Postväsendet och dess serviceformer Postadressystem @sv

Suomen puolustusvoimat
type: Class
type: Concept
subclass of: URN:NBN:fi:au:hklj:390
alternative label: Aliupseerikoulut, Suomi (397)
alternative label: Aliupseerikoulutus, Suomi (397)
alternative label: Aliupseerit, Suomen armeija (397)
alternative label: Alokkaat, Suomen armeija (397)
alternative label: Ampumaradat, Suomen armeija (397)
alternative label: Armeija, armeijat, Suomi (397)
alternative label: Armeijat, Suomi (397)
alternative label: Arvomerkit, sotilasarvot (397 ... 398)
alternative label: Aseeton palvelus, Suomen armeija (397)
alternative label: Aseistakieltäytyminen, Suomen armeija (397)
alternative label: Aselajit, Suomen armeija (397)
alternative label: Asepalvelus, Suomen armeija (397)
alternative label: Asevelvolliset, Suomen armeija (397)
alternative label: Asevelvollisuus, Suomi (397)
alternative label: Asevoimat, Suomen armeija (397)
alternative label: Divisioonat , Suomen armeija (397)
alternative label: Erikoisjoukot, Suomen armeija (397)
alternative label: Erityisalueet, sotilasalueet, Suomi (397)
alternative label: Henkivartiokaartit, joukko-osastot, Suomen armeija (397)
alternative label: Huoltojoukot, Suomen armeija (397)
alternative label: Huumetestit, puolustusvoimat, Suomi (397)
alternative label: Hälytystila, liikekannallepano, Suomi (397)
alternative label: Hävittäjälentäjät, Suomen armeija (397)
alternative label: Ilmailu, ilmavoimat, Suomi (397)
alternative label: Ilmailu, sotilasilmailu, Suomi (397)
alternative label: Ilmapuolustus, Suomen armeija (397)
alternative label: Ilmatorjunta, Suomen armeija (397)
alternative label: Ilmatorjuntajoukot, Suomen armeija (397)
alternative label: Ilmatorjuntatykistö, Suomen armeija (397)
alternative label: Ilmavalvonta, Suomen ilmavoimat (397)
alternative label: Ilmavoimat, Suomen armeija (397)
alternative label: Insinöörijoukot, Suomen armeija (397)
alternative label: Iskujoukot, Suomen armeija (397)
alternative label: Jalkaväki, Suomen armeija (397)
alternative label: Joukko-osastot, Suomen armeija (397)
alternative label: Joukkueet, Suomen armeija (397)
alternative label: Jääkärit, Suomen armeija, joukko-osastot (397)
alternative label: Kadettikoulut, Suomi (397)
alternative label: Kasarmit, Suomen armeija (397)
alternative label: Kenttätykistö, Suomen armeija (397)
alternative label: Kertausharjoitukset, Suomen armeija (397)
alternative label: Kevyet joukot, Suomen armeija (397)
alternative label: Kieltäytyminen, aseistakieltäytyminen, Suomen armeija (397)
alternative label: Kodinturvajoukot, Suomi (397)
alternative label: Komentajat , Suomen armeija (397)
alternative label: Kommandojoukot, Suomen armeija (397)
alternative label: Komppaniat, Suomen armeija (397)
alternative label: Kotiutus, sotilaat, Suomen armeija (397)
alternative label: Kouluttajat, armeija, Suomi (397)
alternative label: Koulutus, armeija, Suomi (397)
alternative label: Kuljetusjoukot, Suomen armeija (397)
alternative label: Kutsunnat, Suomen armeija (397)
alternative label: Laivasto, merivoimat, Suomi (397)
alternative label: Laivastotukikohdat, merivoimat, Suomi (397)
alternative label: Lapsisotilaat, armeijat (397 ... 398)
alternative label: Laskuvarjojoukot, Suomen armeija (397)
broader: URN:NBN:fi:au:hklj:390
in scheme: URN:NBN:fi:au:hklj:
notation: 397
related: URN:NBN:fi:au:hklj:320
related: URN:NBN:fi:au:hklj:325
related: Suomen ulkopolitiikka
related: Yhdistyneet Kansakunnat
related: Rauhankysymys. Rauhantutkimus
related: URN:NBN:fi:au:hklj:332.2
related: URN:NBN:fi:au:hklj:340
related: Organisaatioiden ja laitosten sosiologia
related: Ilmaliikenne. Ilmailu
related: Asevarustelu. Asekauppa
related: Sotataito. Strategia. Taktiikka
related: URN:NBN:fi:au:hklj:397.09
related: Muiden maiden puolustusvoimat
related: Suomi
related: Vuoden 1918 sota
related: Sodat 1939-1945
scope note: Suomen armeija, sen maa-, meri- ja ilmavoimat Suomen armeijan yksiköt ja joukko-osastot. Ohjesäännöt Kantahenkilökunta. Asevelvolliset. Reservi. Sotaveteraanit Jalkaväki. Tykistö. Rannikkotykistö. Panssarijoukot. Ilmatorjuntajoukot. Ilmavoimat. Laskuvarjojoukot. Laivasto Asevelvollisuus. Siviilipalvelu. Aseistakieltäytyminen. Kutsunnat. Liikekannallepano Vapaaehtoinen maanpuolustustyö. Naisten asepalvelu Sotilaskoulutus. Upseeri- ja reserviupseerikoulut. Asevelvollisten asema. Simputus. Sotilaskoti- ja viihdytystoiminta
scope note: Finlands armé, dess land-, sjö- och luftstridskrafter Finlands armés enheter och truppförband. Fältreglemente Stampersonal. Värnpliktiga. Reserven. Krigsveteraner Infanteri. Artilleri. Kustartilleri. Pansartrupper. Luftvärnstrupper. Luftstridskrafterna. Fallskärmstrupper. Flottan Värnplikt. Civiltjänst. Vapenvägran. Uppbåd. Mobilisering Frivilligt försvarsarbete. Kvinnlig militärtjänst Militärutbildning. Officers- och reservofficersskolor. Beväringarnas ställning. Mobbning och pennalism. Soldathem och underhållning @sv

Pyreneiden niemimaa
type: Class
type: Concept
subclass of: Etelä-Eurooppa
alternative label: Pyreneiden niemimaa (419.1 +)
alternative label: Pyreneiden niemimaa, maantiede, matkat (419.1 +)
alternative label: Pyreneiska halvön (419.1 +) @sv
alternative label: Pyreneiska halvön, geografi, resor (419.1 +) @sv
broader: Etelä-Eurooppa
in scheme: URN:NBN:fi:au:hklj:
narrower: Espanja
narrower: Portugali
notation: 419.1
preferred label: Iberian Peninsula @en
preferred label: Pyreneiska halvön @sv
related: Ranska
related: URN:NBN:fi:au:hklj:460
related: URN:NBN:fi:au:hklj:979
related: Espanjan historia
related: Portugalin historia
related: Italian historia
related: Kreikan nykyhistoria
related: Entisen Jugoslavian alueen historia
related: Slovenian historia
related: Kroatian historia
related: Bosnian ja Hertsegovinan historia
related: Serbian historia
related: Makedonian historia
related: Montenegron historia
related: Kosovon historia
related: Bulgarian historia
related: Albanian historia
related: Maltan historia

KANSATIEDE. ANTROPOLOGIA
type: Class
type: Concept
subclass of: URN:NBN:fi:au:hklj:400
alternative label: Diversiteetti, kansatiede (470 ... 479 +)
alternative label: Erot, kansatiede, antropologia (470 ... 479 +)
alternative label: Etnologia (470)
alternative label: Etnologia, kansatiede (470)
alternative label: Häviäminen, kansanperinne (470 ... 476 +)
alternative label: Ihminen-luontosuhde, kansatiede (470 ... 479 +)
alternative label: Kansa, kansatiede (470 ... 476 +)
alternative label: Kansallinen kulttuuri, kansatiede (470)
alternative label: Kansat, kansatiede (470)
alternative label: Kansatiede (470)
alternative label: Kansatiede, etnologia (470)
alternative label: Kaupunkikansatiede (470)
alternative label: Kaupunkikansatiede, kansatiede (470)
alternative label: Kaupunkilaiset, kaupunkikansatiede (470 ... 476 +)
alternative label: Kulttuurijärjestelmät, kansatiede (470)
alternative label: Kulttuurimuodot, kansatiede (470)
alternative label: Kulttuurintutkimus, kansatiede (470)
alternative label: Kulttuuriperintö, kansatiede, eri kansat (470 ... 476 +)
alternative label: Kulttuurisidonnaisuus, kansatiede (470 ... 479 +)
alternative label: Kulttuurit, kansatiede (470)
alternative label: Kulttuuriteoriat, kansatiede (470)
alternative label: Luonnonkansat, kansatiede (470)
alternative label: Luontosuhde, kansatiede (470 ... 479 +)
alternative label: Monimuotoisuus, kansatiede (470 ... 479 +)
alternative label: Museot, kansatieteelliset (470)
alternative label: Nykyaika, kansatiede (470 ... 473 +)
alternative label: Paimentolaisuus, kansatiede (470)
alternative label: Perinnetieteet, kansatiede (470 ... 473 +)
alternative label: Saaristolaiset, kansatiede (470 ... 479 +)
alternative label: Ulkomuseot (470)
alternative label: Diversitet, etnologi (470 ... 479 +) @sv
alternative label: Etnologi (470) @sv
alternative label: Etnologi, etnologi (470) @sv
alternative label: Folk, population, etnologi (470) @sv
alternative label: Folket, etnologi (470 ... 476 +) @sv
alternative label: Folklivsforskning (470) @sv
alternative label: Folklivsforskning, etnologi (470) @sv
alternative label: Friluftsmuseer (470) @sv
alternative label: Kulturarv, etnologi, olika folk (470 ... 476 +) @sv
alternative label: Kulturbundenhet, etnologi (470 ... 479 +) @sv
alternative label: Kulturer, etnologi (470) @sv
alternative label: Kulturformer, etnologi (470) @sv
alternative label: Kulturforskning, etnologi (470) @sv
alternative label: Kultursystem, etnologi (470) @sv
alternative label: Kulturteorier, etnologi (470) @sv
alternative label: Museer, etnologiska (470) @sv
alternative label: Människa-naturförhållande, etnologi (470 ... 479 +) @sv
alternative label: Mångformighet, etnologi (470 ... 479 +) @sv
alternative label: Nationell kultur, etnologi (470) @sv
alternative label: Naturfolk, etnologi (470) @sv
alternative label: Naturrelation, etnologi (470 ... 479 +) @sv
alternative label: Nomadism, etnologi (470) @sv
alternative label: Nutiden, etnologi (470 ... 473 +) @sv
alternative label: Skillnader, etnologi, antropologi (470 ... 479 +) @sv
alternative label: Skärgårdsbor, etnologi (470 ... 479 +) @sv
alternative label: Stadsbor, stadsetnologi (470 ... 476 +) @sv
broader: URN:NBN:fi:au:hklj:400
in scheme: URN:NBN:fi:au:hklj:
narrower: Kotiseutututkimus
narrower: Esineellinen kulttuuri
narrower: URN:NBN:fi:au:hklj:473
narrower: URN:NBN:fi:au:hklj:475
narrower: URN:NBN:fi:au:hklj:476
narrower: Antropologia
notation: 470
related: URN:NBN:fi:au:hklj:061
related: URN:NBN:fi:au:hklj:063
related: URN:NBN:fi:au:hklj:1.1
related: HIENOMEKANIIKKA. KÄSI- JA KOTITEOLLISUUS
related: URN:NBN:fi:au:hklj:769
related: URN:NBN:fi:au:hklj:807
related: Suomenkielisen kansanrunouden historia ja tutkimus
related: Suomenruotsalaisen kirjallisuuden historia ja tutkimus
related: URN:NBN:fi:au:hklj:900
related: URN:NBN:fi:au:hklj:919
scope note: Yleisteokset kansatieteestä eli etnologiasta Tässä ja alaluokissa myös kansatieteelliset museot, kokoelmat ja näyttelyt Jos teoksessa on sekä historiaa että kansatiedettä, on etusija historian luokilla
scope note: Allmänna verk som rör etnologi Hit och till underklasserna också etnografiska museer, samlingar och utställningar Om verket handlar om både etnologi och historia ges företräde åt klassen för historia @sv

Luonto-oppaat. Oppikirjat
type: Class
type: Concept
subclass of: LUONNONTIETEET
alternative label: Aistihavainnot, luontoharrastus (502)
alternative label: Elävä luonto, yleiset luonto-oppaat (502)
alternative label: Fenologia, luonto-oppaat (502)
alternative label: Harrastukset, elävä luonto (502)
alternative label: Havainnot, luontoharrastus (502)
alternative label: Kaupunkiluonto, luonto-oppaat (502)
alternative label: Kesä, luonto-oppaat (502)
alternative label: Kevät, luonto-oppaat (502)
alternative label: Lajimääritys (502)
alternative label: Lajimääritys, luonto-oppaat (502)
alternative label: Lajinmääritys (502)
alternative label: Lajinmääritys, luonto-oppaat (502)
alternative label: Lintutornit, luontoretkioppaat (502)
alternative label: Luonnon virkistyskäyttö, luontoharrastus (502)
alternative label: Luonnonopin oppikirjat (502)
alternative label: Luonnontieto, luonto-oppaat, oppikirjat (502)
alternative label: Luonnontutkimus, oppaat (502)
alternative label: Luonto, luonto-oppaat (502)
alternative label: Luonto-opetus, luonto-oppaat (502)
alternative label: Luonto-oppaat (502)
alternative label: Luonto-oppaat, luonnonharrastus (502)
alternative label: Luontoharrastus (502)
alternative label: Luontokeskukset, luonto-oppaat (502)
alternative label: Luontokohteet, luonto-oppaat (502)
alternative label: Luontopolkuoppaat (502)
alternative label: Luontopolut (502)
alternative label: Luontoretkioppaat (502)
alternative label: Määritys, luonto-oppaat (502)
alternative label: Syksy, luonto-oppaat (502)
alternative label: Talvi, luonto-oppaat (502)
alternative label: Tuntomerkit, lajinmääritys, luonto (502)
alternative label: Vuodenajat, luonto-oppaat (502)
alternative label: Ympäristö- ja luonnontieto, kouluaine (502)
alternative label: Artbestämning (502) @sv
alternative label: Artbestämning, naturhandböcker (502) @sv
alternative label: Bestämning, naturhandböcker (502) @sv
alternative label: Fenologi, naturhandböcker (502) @sv
alternative label: Fågeltorn, naturutflyktsguider (502) @sv
alternative label: Hobbyer, levande natur (502) @sv
alternative label: Höst, naturhandböcker (502) @sv
alternative label: Levande natur, allmänna naturhandböcker (502) @sv
alternative label: Natur, användning för rekreationsändamål, naturintresse (502) @sv
alternative label: Naturen, naturhandböcker (502) @sv
alternative label: Naturforskning, handböcker (502) @sv
alternative label: Naturguider (502) @sv
alternative label: Naturguider, naturintresse (502) @sv
alternative label: Naturintresse (502) @sv
alternative label: Naturlära, läroböcker (502) @sv
alternative label: Naturlära, naturhandböcker (502) @sv
alternative label: Naturobjekt, naturhandböcker (502) @sv
alternative label: Naturstigar (502) @sv
broader: LUONNONTIETEET
in scheme: URN:NBN:fi:au:hklj:
notation: 502
related: Kokoomateokset
related: Matematiikka harrasteena ja ajanvietteenä
related: TÄHTITIEDE
related: Fysiikka harrasteena ja ajanvietteenä
related: Kemia harrasteena ja ajanvietteenä
related: BIOLOGIA
related: Ekologia. Eliömaantiede
related: KASVITIEDE
related: Systemaattinen kasvitiede
related: Sekovartiset kasvit
related: Sienet
related: Putkilokasvit
related: URN:NBN:fi:au:hklj:590
related: Systemaattinen eläintiede
related: Selkärangattomat
related: Hyönteiset
related: Selkärankaiset
related: Kalat
related: Linnut
related: Nisäkkäät
related: Retkeily. Ulkoilu. Vuorikiipeily. Suunnistus
scope note: Yleiset luonto-oppaat Luonto-oppaat, jotka koskevat sekä elävää että elotonta luontoa Luonto-oppaat, jotka koskevat elävää luontoa yleensä Luonto-oppaat, jotka koskevat sekä eläimiä että kasveja Yleiset luontoretki-, luontopolku- ja lajinmääritysoppaat sekä yleiset luonnonharrastuskirjat Luonnontieteiden, luonnontiedon ja luonto-opin yleiset oppikirjat, harjoituskirjat ja tehtäväkokoelmat Eri alojen luonto-oppaat ja lajinmääritysoppaat sekä oppikirjat, harjoituskirjat ja tehtäväkokoelmat alan mukaisessa luokassa
scope note: Allmänna naturhandböcker Naturhandböcker som rör både den biotiska och den abiotiska naturen Naturhandböcker som rör den biotiska naturen i allmänhet Naturhandböcker som rör både djur och växter Allmänna handledningar för utflykter i naturen och längs naturstigar, handböcker i artbestämning samt allmänna verk om naturen som hobby Allmänna läroböcker, övningsböcker och samlingar av provuppgifter i naturvetenskaperna och naturlära Naturhandböcker och handböcker i artbestämning samt läroböcker, övningsböcker och samlingar av provuppgifter inom olika områden klassificeras enligt område @sv

Satamat. Satamatekniikka
type: Class
type: Concept
subclass of: Vesirakennus. Vesikulkuneuvot
alternative label: Aallonmurtajat (625.1)
alternative label: Jäävauriot, satamat, laiturit (625.1)
alternative label: Laiturit (625.1)
alternative label: Liikennealueet, rakentaminen, satamat (625.1)
alternative label: Paalutus, laiturit, satamanrakennus (625.1)
alternative label: Pengerrykset, satamarakennus (625.1)
alternative label: Pylväät, satamarakennus, laiturit (625.1)
alternative label: Satama-altaat (625.1)
alternative label: Satamalaitteet (625.1)
alternative label: Satamat, tekniikka ja rakentaminen (625.1)
alternative label: Satamatekniikka (625.1)
alternative label: Syväsatamat, satamat, satamatekniikka (625.1)
alternative label: Telakat, satamatekniikka (625.1)
alternative label: Venesatamat, satamatekniikka (625.1)
alternative label: Vesirakennus, satamarakennus (625.1)
alternative label: Vesirakentaminen, satamarakennus (625.1)
alternative label: Bryggor (625.1) @sv
alternative label: Djuphamnar, hamnar, hamnteknik (625.1) @sv
alternative label: Hamnanordningar (625.1) @sv
alternative label: Hamnar, teknik och byggande (625.1) @sv
alternative label: Hamnbassänger (625.1) @sv
alternative label: Hamnteknik (625.1) @sv
alternative label: Isskador, hamnar, bryggor (625.1) @sv
alternative label: Kolonner, pelare, hamnbyggnad, bryggor (625.1) @sv
alternative label: Pålning, bryggor, hamnbyggnad (625.1) @sv
alternative label: Skeppsvarv, hamnteknik (625.1) @sv
alternative label: Småbåtshamnar, hamnteknik (625.1) @sv
alternative label: Terrassering, hamnbygge (625.1) @sv
alternative label: Trafikområden, byggande, hamnar (625.1) @sv
alternative label: Vattenbyggande, hamnbyggnad (625.1) @sv
alternative label: Vattenbyggnad, hamnbyggnad (625.1) @sv
alternative label: Vågbrytare (625.1) @sv
broader: Vesirakennus. Vesikulkuneuvot
in scheme: URN:NBN:fi:au:hklj:
notation: 625.1
preferred label: Harbours. Harbour technology @en
preferred label: Hamnar. Hamnteknik @sv
related: URN:NBN:fi:au:hklj:342
related: Tullilaitos
related: URN:NBN:fi:au:hklj:380
related: Vesiliikenne
related: URN:NBN:fi:au:hklj:460
related: Hydrologia
related: Vesien suojelu
related: Yleinen konetekniikka
related: Koneenrakennus. Pneumatiikka. Hydrauliikka
related: Voimakoneet. Moottorit. Nosto- ja kuljetuslaitteet
related: URN:NBN:fi:au:hklj:624
related: Vesiväylät. Vesien säännöstely
related: Vesikulkuneuvot
related: Laivat. Laivanrakennus
related: URN:NBN:fi:au:hklj:625.72
related: URN:NBN:fi:au:hklj:631
related: URN:NBN:fi:au:hklj:660
related: Rakennusstatiikka. Rakennusaineet
related: Tekninen rakennussuunnittelu
related: Geotekniikka. Maatyöt
related: Merenkulkuoppi
related: Moottoriurheilu. Lentourheilu
scope note: Satamat, satama-altaat, satamalaitteet, aallonmurtajat, laiturit ja telakat, niiden rakentaminen ja kunnossapito Rakennusstatiikka, tekninen rakennussuunnittelu sekä geotekniikka ja maatyöt satamanrakennuksessa yleensä Jos teos koskee satamia sekä satamanrakennuksen tai satamatekniikan että vesiliikenteen kannalta, on etusija luokalla 386.1
scope note: Hamnar, hamnbassänger, hamnanläggningar, vågbrytare, bryggor och skeppsdockor, byggande och underhåll av dem Byggnadsstatik, teknisk byggnadsplanering samt geoteknik och anläggningsarbeten ur hamnbyggnadssynvinkel i allmänhet Om verket handlar om hamnar med hänsyn till såväl hamnbygge eller hamnteknik som till sjötrafik, ges företräde åt klass 386.1 @sv

Sähköenergian tuottaminen. Voimalatekniikka
type: Class
type: Concept
subclass of: Sähkötekniikka
alternative label: Aaltoenergia, voimalat (627.5)
alternative label: Aaltovoima, voimalat (627.5)
alternative label: Aluelämpökeskukset (627.5)
alternative label: Atomienergia, voimalatekniikka (627.5)
alternative label: Atomireaktorit, ydinvoimalat (627.5)
alternative label: Atomitekniikka, ydinvoimalat (627.5)
alternative label: Atomivoima, voimalatekniikka (627.5)
alternative label: Atomivoimalat, tekniikka (627.5)
alternative label: Aurinkoenergia, voimalat (627.5)
alternative label: Aurinkovoima, voimalat (627.5)
alternative label: Aurinkovoimalat (627.5)
alternative label: Biopolttolaitokset (627.5)
alternative label: Biovoimalat (627.5)
alternative label: CHP, lämmöntuotanto (627.5)
alternative label: CHP, sähköntuotanto (627.5)
alternative label: Dieselvoimalat (627.5)
alternative label: Ekoenergia, voimalatekniikka (627.5)
alternative label: Energialaitokset (627.5)
alternative label: Energiantuotantolaitokset (627.5)
alternative label: Energiateknologia, voimalatekniikka (627.5)
alternative label: Energiateknologia, ydinvoimaloiden tekniikka (627.5)
alternative label: Fissio, ydinvoimalat (627.5)
alternative label: Fissioreaktorit, ydinvoimalat (627.5)
alternative label: Fossiiliset polttoaineet, voimalatekniikka (627.5)
alternative label: Fuusio, ydinvoimalat (627.5)
alternative label: Fuusioreaktorit, ydinvoimalat (627.5)
alternative label: Geoterminen energia, voimalatekniikka (627.5)
alternative label: Geoterminen lämpö, voimalatekniikka (627.5)
alternative label: Hake, hakevoimalat (627.5)
alternative label: Hakevoimalat (627.5)
alternative label: Hiili, hiilivoimalat (627.5)
alternative label: Hiilivoimalat (627.5)
alternative label: Hukkalämpö, voimalatekniikka (627.5)
alternative label: Höyryvoimalat (627.5)
alternative label: Joenuomat, vesivoimalat (627.5)
alternative label: Joet, vesivoimalat (627.5)
alternative label: Jokisuistot, vesivoimalat (627.5)
alternative label: Jäähdytysvesi, ydinvoimalat (627.5)
alternative label: Kaasuturbiinivoimalat (627.5)
alternative label: Kaasuvoimalat, voimalatekniikka (627.5)
alternative label: Kalliolämpö, voimalat (627.5)
alternative label: Kattilalaitteistot (627.5)
alternative label: Kaukolämpökeskukset (627.5)
alternative label: Ketjureaktio, ydinvoimalat (627.5)
alternative label: Kivihiili, voimalat (627.5)
alternative label: Kivihiilivoimalat (627.5)
alternative label: Kombivoimalaitokset, voimalatekniikka (627.5)
alternative label: Kombivoimalat, sähkötekniikka (627.5)
alternative label: Kombivoimalat, voimalatekniikka (627.5)
alternative label: Konemestarit, voimalat (627.5)
alternative label: Kosket, voimalatekniikka (627.5)
alternative label: Koskivoima, vesivoimalat (627.5)
alternative label: Lauhdutustekniikka, voimalat (627.5)
broader: Sähkötekniikka
in scheme: URN:NBN:fi:au:hklj:
notation: 627.5
related: Ympäristönsuojelu. Luonnonsuojelu
related: Uhanalaiset lajit. Luonnonsuojelualueet
related: Maaperän, metsien ja soiden suojelu
related: Vesien suojelu
related: Ilman suojelu
related: Ydinfysiikka. Atomifysiikka. Molekyylifysiikka
related: Sähköoppi. Magnetismi
related: Energia
related: URN:NBN:fi:au:hklj:620.88
related: Voimakoneet. Moottorit. Nosto- ja kuljetuslaitteet
related: Vesirakennus. Vesikulkuneuvot
related: Vesiväylät. Vesien säännöstely
related: Kaivos- ja kaivannaisteollisuus
related: Kivihiili. Turve
related: Öljy. Maakaasu
related: URN:NBN:fi:au:hklj:667.7
related: URN:NBN:fi:au:hklj:667.71
related: URN:NBN:fi:au:hklj:681
related: Toimistokoneet
scope note: Sähköenergian tuottamisen tekniikka. Sähköistäminen Voimalaitokset. Voimalatekniikka. Sähkö- ja lämmitysvoimaloiden tekniikka Eri energianlähteillä toimivat voimalat, niiden tekniikka Ydinvoimalat. Vesi- ja vuorovesivoimalat. Höyryvoimalat. Kaasuvoimalat. Öljyvoimalat. Hiilivoimalat. Turvevoimalat. Puukäyttöiset voimalat. Aurinkovoimalat. Aurinkopaneelit. Tuulivoimalat. Geotermisellä energialla toimivat voimalat
scope note: Elproduktionens teknik. Elektrifiering Kraftverk. Kraftverksteknik. Elkraftverkens och värmekraftverkens teknik Elkraftverk med olika energikällor, deras teknik Kärnkraftverk. Vatten- och tidvattenkraftverk. Ångkraftverk. Gaskraftverk. Öljekraftverk. Kolkraftverk. Torvkraftverk. Veddrivna kraftverk. Solkraftverk. Solpaneler. Vindkraftverk. Kraftverk drivna av geotermisk energi @sv

Tietokoneiden lisälaitteet
type: Class
type: Concept
subclass of: URN:NBN:fi:au:hklj:627.73
alternative label: 3D-tulostus (627.739)
alternative label: Atk-päätteet (627.739)
alternative label: Atk-tarvikkeet (627.739)
alternative label: CD-R-levyt, tietokoneiden oheislaitteet (627.739)
alternative label: CD-ROM-laitteet (627.739)
alternative label: CD-ROM-levyt, tietokoneiden oheislaitteet (627.739)
alternative label: CD-kuvalevyt, tietokoneiden oheislaitteet (627.739)
alternative label: CD-levyt, tietokoneiden oheislaitteet (627.739)
alternative label: CD-tietolevyt, tietokoneiden oheislaitteet (627.739)
alternative label: Dataprojektorit (627.739)
alternative label: Disketit (627.739)
alternative label: Elektroluminesenssinäytöt, tietokoneet (627.739)
alternative label: Flash-muistit, tietokoneet (627.739)
alternative label: Grafiikkatulostus (627.739)
alternative label: Haptinen teknologia, atk (627.739)
alternative label: Inkjet-tulostus (627.739)
alternative label: Kirjoittimet (627.739)
alternative label: Kompaktilevyt, tietokoneiden oheislaitteet (627.739)
alternative label: Kosketusnäyttö (627.739)
alternative label: Käyttömuistit (627.739)
alternative label: Laajennuskortit (627.739)
alternative label: Laserkirjoittimet (627.739)
alternative label: Laserlevyt, tietokoneiden oheislaitteet (627.739)
alternative label: Lasertulostimet (627.739)
alternative label: Levykkeet (627.739)
alternative label: Levymuistit (627.739)
alternative label: Lisälaitteet, tietokoneet (627.739)
alternative label: Litteät näytöt, tietokoneet (627.739)
alternative label: Lukijat, atk-lisälaitteet (627.739)
alternative label: Lukulaitteet, atk-lukulaitteet (627.739)
alternative label: Lukumuistit (627.739)
alternative label: Magneettiset tallenteet, atk-tekniikka (627.739)
alternative label: Massamuistit, tietokoneet (627.739)
alternative label: Muistikortit (627.739)
alternative label: Muistit, tietokoneet (627.739)
alternative label: Muistitikut, tietokoneet (627.739)
alternative label: Mustesuihkutulostus (627.739)
alternative label: Nauhat, tietotekniikka (627.739)
alternative label: Nestekidenäytöt, atk-laitteet (627.739)
alternative label: Näppäimistöt, tietokoneet (627.739)
alternative label: Näyttölaitteet, atk (627.739)
alternative label: Näytöt, atk (627.739)
alternative label: Oheislaitteet, atk (627.739)
alternative label: Optiset lukijat (627.739)
alternative label: Optiset tallenteet, atk-tekniikka (627.739)
alternative label: Piirturit, atk (627.739)
alternative label: Plasmanäytöt, tietokoneet (627.739)
alternative label: Päätteet (627.739)
alternative label: ROM, atk (627.739)
alternative label: Romput, oheislaitteet, atk (627.739)
broader: URN:NBN:fi:au:hklj:627.73
in scheme: URN:NBN:fi:au:hklj:
notation: 627.739
related: Kustannustoimi. Kirjakauppa
related: LOGIIKKA
related: Logistiikka. Looginen kalkyyli
related: URN:NBN:fi:au:hklj:182
related: URN:NBN:fi:au:hklj:332.1
related: URN:NBN:fi:au:hklj:384
related: Sähköoppi. Magnetismi
related: URN:NBN:fi:au:hklj:620.88
related: Systeemityö
related: Ohjelmointi. Ohjelmointikielet
related: Säätö- ja systeemitekniikka. Teollinen automaatio
related: Matkaviestinpalvelut. Puhelinliikenne
related: URN:NBN:fi:au:hklj:627.753
related: URN:NBN:fi:au:hklj:627.7531
related: URN:NBN:fi:au:hklj:627.7532
related: Elektroniikka
related: URN:NBN:fi:au:hklj:667.7
related: URN:NBN:fi:au:hklj:667.71
related: Toimistotyö
related: URN:NBN:fi:au:hklj:681
related: Toimistokoneet
related: Pelit
scope note: Tietokoneiden lisälaitteet sekä niiden elektroniikka, tekniikka ja teollinen valmistus Syöttö-, tallennus-, tulostus- ja muistilaitteet. Päätteet. Näyttölaitteet. Kosketusnäytöt. Litteät näytöt. Näppäimistöt. Hiiret. Lukulaitteet. Kirjoittimet. Piirturit. Blu ray-, CD-, DVD-, levyke- ja nauha-asemat Tekstin, grafiikan ja mikrotallenteiden tulostuslaitteet Lisälaitteiden käyttö erikoisalojen sovelluksissa alan mukaisessa luokassa
scope note: Kringutrustning för datorer samt elektronik och teknik i den och industriell framställning av den Utrustning för inmatning, registrering och utskrift. Minnen. Terminaler. Bildskärmar. Pekskärm. Flatskärmar. Tangentbord. Möss. Läsapparater. Skrivare. Kurvritare. Skivstationer för blu ray-, CD- och DVD-skivor, disketter och magnetband Skrivare för text, grafik och mikrokort Användning av kringutrustning inom datatillämpningar på specialområden klassificeras enligt område @sv

Liikenneopetus. Liikenneturvallisuus
type: Class
type: Concept
subclass of: LIIKETALOUS. KAUPPA. MARKKINOINTI. LIIKENNEOPETUS
alternative label: Ajo-oikeus , liikenneturvallisuus (677)
alternative label: Ajo-opetus (677)
alternative label: Ajokaistat, liikennesäännöt (677)
alternative label: Ajokielto, liikenneturvallisuus (677)
alternative label: Ajokortit (677)
alternative label: Ajokorttitutkinto (677)
alternative label: Ajokyky, maakulkuneuvot (677)
alternative label: Ajokäyttäytyminen (677)
alternative label: Ajokäyttäytyminen, maaliikenne (677)
alternative label: Ajonopeus, maaliikenne (677)
alternative label: Ajopiirturit, liikenneturvallisuus (677)
alternative label: Ajoratamerkinnät, liikennesäännöt (677)
alternative label: Ajotaito ja -tekniikka, maakulkuneuvot (677)
alternative label: Ajotapa, maakulkuneuvot (677)
alternative label: Alkolukot (677)
alternative label: Alkometrit, liikenneturvallisuus (677)
alternative label: Ammattiautoilijat, liikenteen ammatit (677)
alternative label: Auto-onnettomuudet, liikenneturvallisuus (677)
alternative label: Autoilijat, liikenteen ammatit (677)
alternative label: Autokatsastus (677)
alternative label: Autokoulut (677)
alternative label: Automaattiohjaus , maaliikenne (677)
alternative label: Autonkuljettajat, liikenteen ammatit (677)
alternative label: Erikoiskuljetus, liikenneturvallisuus (677)
alternative label: HIrvionnettomuudet (677)
alternative label: Heijastimet, liikenneturvallisuus (677)
alternative label: Hirvikolarit (677)
alternative label: Jalankulkijat, liikenneturvallisuus (677)
alternative label: Jarrutus, liikenneopetus (677)
alternative label: Kaistat, liikennesäännöt (677)
alternative label: Katsastus (677)
alternative label: Keli, liikenneturvallisuus (677)
alternative label: Kesärenkaat, liikenneturvallisuus (677)
alternative label: Koulumatkat, liikenneturvallisuus (677)
alternative label: Kuljettajaopetus (677)
alternative label: Kuljettajat, liikenteen ammatit (677)
alternative label: Kypärät, liikenneturvallisuus (677)
alternative label: Liikennejuopumus, liikenneturvallisuus (677)
alternative label: Liikennekasvatus (677)
alternative label: Liikennekasvatus, maaliikenne (677)
alternative label: Liikennekuolemat (677)
alternative label: Liikennekuolemat, liikenneturvallisuus (677)
alternative label: Liikennekäyttäytyminen (677)
alternative label: Liikennekäyttäytyminen, maaliikenne (677)
alternative label: Liikennelääketiede (677)
alternative label: Liikennemerkit (677)
alternative label: Liikennemerkit, maaliikenne (677)
alternative label: Liikennenopeus, maaliikenne (677)
alternative label: Liikenneonnettomuudet (677)
alternative label: Liikenneonnettomuudet, liikenneturvallisuus (677)
alternative label: Liikenneopetus (677)
broader: LIIKETALOUS. KAUPPA. MARKKINOINTI. LIIKENNEOPETUS
in scheme: URN:NBN:fi:au:hklj:
narrower: Lento-opetus. Lentotaito
notation: 677
related: KASVATUS. OPETUS. KASVATUSTIEDE
related: Kasvatusfilosofia. Kasvatustavoitteet
related: URN:NBN:fi:au:hklj:332.2
related: Rikosoikeus
related: Poliisitoimi. Yleinen turvallisuus
related: Kriminologia. Kriminaalisosiologia
related: URN:NBN:fi:au:hklj:360
related: URN:NBN:fi:au:hklj:363
related: URN:NBN:fi:au:hklj:368
related: Maaliikenne
related: Paikallisliikenne
related: URN:NBN:fi:au:hklj:624
related: Polkupyörät
related: Moottoripyörät. Mopedit
related: URN:NBN:fi:au:hklj:650.2
related: Moottoriurheilu. Lentourheilu
related: Autourheilu
related: Moottoripyöräurheilu
related: Moottoriveneurheilu
related: Lentourheilu
scope note: Maaliikennettä eli katu-, tie- ja raideliikennettä koskeva liikenneopetus, ajo-opetus, ajotaito, liikennesäännöt, liikenneoppaat, liikennekasvatus, liikenneturvallisuus ja liikenneonnettomuudet Autokoulut Liikenteen ammatit. Autonkuljettajan työ. Veturinkuljettajan työ Liikennerikkomukset ja -rikokset, kuten rattijuoppous, liikenneturvallisuuden kannalta
scope note: Trafikundervisning, körundervisning, körfärdighet, trafikregler, trafikhandböcker, trafikfostran, trafiksäkerhet och trafikolyckor som rör landtrafik, d.v.s. gatutrafik, vägtrafik och spårbunden trafik Bilskolor Yrken inom trafiken. Chaufförens arbete. Lokförarens arbete Trafikförseelser och trafikbrott såsom rattfylleri ur trafiksäkerhetens synvinkel @sv

Juomat
type: Class
type: Concept
subclass of: Ravintotalous. Gastronomia
alternative label: Absintti (691.3)
alternative label: Alkoholi, juomakulttuuri (691.3)
alternative label: Alkoholijuomat, juomakulttuuri (691.3)
alternative label: Alkoholijuomat, kotivalmistus (691.3)
alternative label: Alkoholijuomat, tarjoiluoppaat (691.3)
alternative label: Alkoholikulttuuri (691.3)
alternative label: Alkoholikulttuuri, juomakulttuuri (691.3)
alternative label: Alkoholinkäyttö, juomakulttuuri (691.3)
alternative label: Alkoholittomat juomat, juomakulttuuri (691.3)
alternative label: Alkoholittomat juomat, kotivalmistus (691.3)
alternative label: Alkoholittomat juomat, tarjoilu (691.3)
alternative label: Aperitiivit (691.3)
alternative label: Aperitiivit, juomakulttuuri (691.3)
alternative label: Boolit (691.3)
alternative label: Cocktailit (691.3)
alternative label: Drinkit (691.3)
alternative label: Energiajuomat , käyttö ja kotivalmistus (691.3)
alternative label: Enologia (691.3)
alternative label: Enologia , kotivalmistus (691.3)
alternative label: Enologia, juomakulttuuri (691.3)
alternative label: Enologia, viinit (691.3)
alternative label: Glögi (691.3)
alternative label: Herukat, viinin valmistus (691.3)
alternative label: Humalahakuisuus, alkoholikulttuuri, juomakulttuuri (691.3)
alternative label: Humalahakuisuus, juomatavat, juomakulttuuri (691.3)
alternative label: Jaloviina, juomakulttuuri (691.3)
alternative label: Jaloviina, maustaminen (691.3)
alternative label: Juomakulttuuri (691.3)
alternative label: Juomaperinne, juomakulttuuri (691.3)
alternative label: Juomat, kotivalmistus (691.3)
alternative label: Juomatavat, juomakulttuuri (691.3)
alternative label: Kaakao, juomakulttuuri (691.3)
alternative label: Kaakao, juomien valmistus (691.3)
alternative label: Kahvi, juomakulttuuri (691.3)
alternative label: Kahvi, juomien valmistus (691.3)
alternative label: Kahvinkeittimet, kotitalous (691.3)
alternative label: Kivennäisvesi , käyttö ja kotivalmistus (691.3)
alternative label: Koktailit (691.3)
alternative label: Kotipoltto, juomien valmistus (691.3)
alternative label: Kotitarve, juomien valmistus (691.3)
alternative label: Kotivalmistus, oluet (691.3)
alternative label: Kotivalmistus, viinit (691.3)
alternative label: Kotiviini (691.3)
alternative label: Kuohuviinit (691.3)
alternative label: Kuohuviinit, juomakulttuuri (691.3)
alternative label: Limonadit, käyttö ja kotivalmistus (691.3)
alternative label: Long drink (691.3)
alternative label: Mallasjuomat, kotivalmistus (691.3)
alternative label: Mate, juomat (691.3)
alternative label: Mehut, kotivalmistus (691.3)
broader: Ravintotalous. Gastronomia
in scheme: URN:NBN:fi:au:hklj:
notation: 691.3
related: Alkoholipolitiikka
related: Juhlien järjestäminen
related: URN:NBN:fi:au:hklj:473
related: URN:NBN:fi:au:hklj:473.1
related: URN:NBN:fi:au:hklj:475
related: URN:NBN:fi:au:hklj:475.1
related: URN:NBN:fi:au:hklj:476
related: URN:NBN:fi:au:hklj:476.1
related: URN:NBN:fi:au:hklj:476.11
related: URN:NBN:fi:au:hklj:476.12
related: URN:NBN:fi:au:hklj:476.5
related: URN:NBN:fi:au:hklj:476.6
related: URN:NBN:fi:au:hklj:476.7
related: URN:NBN:fi:au:hklj:476.8
related: URN:NBN:fi:au:hklj:613.1
related: URN:NBN:fi:au:hklj:649.91
related: Hotelli- ja ravintolatalous
related: Kotitalous. Kodinhoito
related: URN:NBN:fi:au:hklj:691.1
related: Säilöntä
related: Kotijuhlien järjestäminen. Kutsujen järjestäminen
related: Suurkeittiöt
scope note: Juomat, juomien valmistus ja sekoittaminen Juomakulttuuri. Juomatavat. Juomien tarjoilu Alkoholijuomat. Alkoholittomat oluet ja viinit Oluet. Kalja. Sahti. Viinit. Viinilistat. Viinikirjat. Kotiviinit. Aperitiivit. Boolit. Cocktailit. Drinkit. Glögit. Snapsit. Väkevät alkoholijuomat Kaakao. Kahvi. Maito. Mehut. Tee. Vesi. Virvoitusjuomat. Ruokajuomat Juomien ja ruoan yhteensopivuus Jos teoksessa on sekä käytännön juomien valmistusohjeita tai juomakulttuuria että kansatiedettä, on etusija luokalla 691.3
scope note: Drycker, beredning och blandning av drycker Dryckeskultur. Dryckesvanor. Servering av drycker Alkoholdrycker. Alkoholfritt öl och vin Öl. Svagdricka. Hembryggt öl. Viner. Vinlistor.Vinböcker. Hembryggt vin. Aperitifer. Bålar. Cocktailar. Drinkar. Glögg. Snaps. Spritdrycker Kakao. Kaffe. Läskedrycker. Mjölk. Saft. Te. Vatten. Måltidsdrycker Hur maträtter och drycker kombineras Om verket handlar om såväl dryckesrecept eller dryckeskultur som etnologi, ges företräde åt klass 691.3 @sv

Luonnon- ja kulttuurimaiseman suunnittelu
type: Class
type: Concept
subclass of: URN:NBN:fi:au:hklj:720
alternative label: Arkkitehtuuri, maisema-, puutarha- ja ympäristöarkkitehtuuri (729)
alternative label: Arkkitehtuuripiirustukset, maisema- ja puutarha-arkkitehtuuri (729)
alternative label: Arkkitehtuuripiirustukset, ympäristöarkkitehtuuri (729)
alternative label: Ekologiset käytävät, ympäristösuunnittelu (729)
alternative label: Ekologiset verkostot, ympäristösuunnittelu (729)
alternative label: Entistäminen, puistot (729)
alternative label: Erityisalueet, hautausmaat (729)
alternative label: Estetiikka, ympäristöestetiikka (729)
alternative label: Fyysinen ympäristö, viheralueiden suunnittelu (729)
alternative label: Golfkentät, maisemasuunnittelu (729)
alternative label: Haudat, hautausmaat (729)
alternative label: Hautakammiot, hautausmaat (729)
alternative label: Hautakirjoitukset, hautausmaat (729)
alternative label: Hautakivet, hautausmaat (729)
alternative label: Hautamuistomerkit, hautausmaat (729)
alternative label: Hautaus, hautausmaat (729)
alternative label: Hautausmaat, suunnittelu (729)
alternative label: Hautauspalvelut, hautausmaat (729)
alternative label: Havupensaat, puutarhataide (729)
alternative label: Hiljaiset alueet, maisemasuunnittelu (729)
alternative label: Istutukset, puutarhataide (729)
alternative label: Joutomaa, luonnon-ja kulttuurimaiseman suunnittelu (729)
alternative label: Kaava-alueet, viheralueet (729)
alternative label: Kaavoitus, viheralueet (729)
alternative label: Kaavoitusalueet, viheralueet (729)
alternative label: Kalalammikot, puutarhataide (729)
alternative label: Kansalliset kaupunkipuistot, maisemasuunnittelu (729)
alternative label: Kansalliset kaupunkipuistot, puistot, suunnittelu (729)
alternative label: Kansallismaisema, maisemasuunnittelu (729)
alternative label: Kasvihuoneet, puutarhataide (729)
alternative label: Kauneus, ympäristöestetiikka (729)
alternative label: Kauneusihanteet, ympäristöestetiikka (729)
alternative label: Kaupunkiarkkitehtuuri, viheralueet, puistot (729)
alternative label: Kaupunkiluonto, maisemasuunittelu (729)
alternative label: Kaupunkisuunnittelu, viheralueet, puistot (729)
alternative label: Kaupunkitila, maisemasuunittelu (729)
alternative label: Kaupunkiympäristö, maisemasuunittelu (729)
alternative label: Keinonurmi, urheilukentät, suunnittelu, alueet (729)
alternative label: Kenttähaudat, taistelupaikat, hautausmaat (729 +)
alternative label: Kivipuutarhat, puutarhataide (729 +)
alternative label: Koirapuistot, suunnittelu (729)
alternative label: Kolumbaariot, hautausmaat (729)
alternative label: Kulttuurihistorialliset suojelukohteet, maisemasuunnittelu (729)
alternative label: Kulttuurimaisema, maisemansuunnittelu (729)
alternative label: Kulttuuriympäristö, maisemansuunnittelu (729)
alternative label: Kuntopolut, ulkoilualueiden suunnittelu (729)
alternative label: Kuntoradat, ulkoilualueiden suunnittelu (729)
alternative label: Leikkikentät, suunnittelu (729)
alternative label: Leikkipaikat, suunnittelu (729)
alternative label: Leikkipuistot, suunnittelu (729)
broader: URN:NBN:fi:au:hklj:720
in scheme: URN:NBN:fi:au:hklj:
notation: 729
related: Yleinen estetiikka
related: Aluepolitiikka. Ympäristöpolitiikka
related: Ympäristönsuojelu. Luonnonsuojelu
related: Uhanalaiset lajit. Luonnonsuojelualueet
related: Maaperän, metsien ja soiden suojelu
related: Vesien suojelu
related: Ilman suojelu
related: KASVITIEDE
related: Puutarhanhoito. Hyötykasvit. Huone- ja koristekasvit
related: Koristekasvit
related: Hyötykasvit
related: Yrtti- ja maustekasvit
related: Hedelmä-, marja- ja vihanneskasvit
related: Huonekasvit
related: URN:NBN:fi:au:hklj:657
related: Rakennusten erillistilat
related: Arkkitehtuurin teoria, estetiikka ja filosofia
related: Arkkitehtuurikilpailut. Arkkitehtuurinäyttelyt. Arkkitehtuuripalkinnot
related: URN:NBN:fi:au:hklj:720.9
related: URN:NBN:fi:au:hklj:721
related: Kaupunkisuunnittelu. Kaupunkiarkkitehtuuri
related: Helsinki. Pääkaupunkiseutu
scope note: Maisemasuunnittelu ja sen historia, henkilöhistoria, tekniikka ja estetiikka Puutarha-arkkitehtuuri. Viherrakentaminen Viher-, urheilu-, ulkoilu- ja virkistysalueiden suunnittelu ja kaavoitus Puistojen, puutarhojen, pihojen, leikkikenttien ja hautausmaiden ja uimarantojen suunnittelu ja kaavoitus Ympäristöestetiikka yleensä Jos teoksessa on sekä puutarhan tai pihan hoitoa että suunnittelua on etusija luokalla 653+
scope note: Landskapsplanering och dess historia, personhistoria, teknik och estetik Trädgårdsarkitektur. Anläggning av grönområden Planering och fysisk planering av grönområden, friluftsområden, rekreationsområden samt områden reserverade för sport Planering och fysisk planering av parker, trädgårdar, gårdar, lekplatser, begravningsplatser och badstränder Miljöestetik i allmänhet Om verket handlar om såväl trädgårdsodling eller skötsel av gårdsplaner som planering av trädgårdar eller gårdar, ges företräde åt klass 653+ @sv

Kuvitustaide
type: Class
type: Concept
subclass of: GRAAFINEN TAIDE. VALOKUVAUS
alternative label: Aiheet, kuvitustaide (751)
alternative label: Graafikot, kuvittajat (751)
alternative label: Graafinen taide, kuvitustaide (751)
alternative label: Grafiikka, kuvitustaide (751)
alternative label: Kannet, kirjan, kuvitustaide (751)
alternative label: Kirjankannet, kuvitustaide (751)
alternative label: Kirjankuvitus (751)
alternative label: Kirjataide, kuvitustaide (751)
alternative label: Kuvat, kuvitus (751)
alternative label: Kuvittajat (751)
alternative label: Kuvitus (751)
alternative label: Piirrokset, kuvitustaide (751)
alternative label: Piirtäminen, kuvitustaide (751)
alternative label: Piirustukset, kuvitustaide (751)
alternative label: Piirustus, kuvitustaide (751)
alternative label: Vinjetit, kuvitustaide (751)
alternative label: Anledningar, illustrationskonst (751) @sv
alternative label: Bilder, illustrering (751) @sv
alternative label: Bokillustration (751) @sv
alternative label: Bokkonst, illustrationskonst (751) @sv
alternative label: Bokomslag, illustrationskonst (751) @sv
alternative label: Bokpärmar, illustrationskonst (751) @sv
alternative label: Grafik, illustrationskonst (751) @sv
alternative label: Grafiker, illustratörer (751) @sv
alternative label: Grafisk konst, illustrationskonst (751) @sv
alternative label: Illustration (751) @sv
alternative label: Illustratörer (751) @sv
alternative label: Pärmar, illustrationskonst (751) @sv
alternative label: Ritande, illustrationskonst (751) @sv
alternative label: Ritning, illustrationskonst (751) @sv
alternative label: Ritningar, illustrationskonst (751) @sv
alternative label: Teckningar, illustrationskonst (751) @sv
alternative label: Vinjetter, illustrationskonst (751) @sv
broader: GRAAFINEN TAIDE. VALOKUVAUS
in scheme: URN:NBN:fi:au:hklj:
notation: 751
preferred label: Art of illustration @en
preferred label: Illustrationskonst @sv
related: Kirjan historia
related: Kirjapainotaito. Graafinen teollisuus
related: Kirjansidonta. Kirjansidontataide
related: URN:NBN:fi:au:hklj:710
related: MAALAUSTAIDE. PIIRUSTUSTAIDE
related: Maalaustaiteen teoria, estetiikka ja filosofia
related: URN:NBN:fi:au:hklj:740.9
related: URN:NBN:fi:au:hklj:741
related: URN:NBN:fi:au:hklj:741.1
related: URN:NBN:fi:au:hklj:741.2
related: URN:NBN:fi:au:hklj:748
related: URN:NBN:fi:au:hklj:749.1
related: Piirustuksen materiaalit ja tekniikka
related: Pilapiirrokset. Karikatyyrit
related: Graafisen taiteen teoria, estetiikka ja filosofia
related: Graafisen taiteen historia
related: Käyttögrafiikka
related: Taidegrafiikka
related: Taidegrafiikan materiaalit ja tekniikka
related: URN:NBN:fi:au:hklj:756
related: Lasten- ja nuortenkirjallisuuden historia ja tutkimus
related: Suomenkielisen lasten- ja nuortenkirjallisuuden historia ja tutkimus
scope note: Kuvitus- ja kirjankuvitustaide, niiden historia, henkilöhistoria ja estetiikka Kuvitus- ja kirjankuvitustaiteen materiaalit ja tekniikka Tässä myös lastenkirjojen kuvitusta koskevat teokset
scope note: Illustrations- och bokillustrationskonst, deras historia, personhistoria och estetik Illustrations- och bokillustrationskonstens material och tekniker Hit också verk om illustration av barnböcker @sv

Suomi
type: Class
type: Concept
subclass of: Pohjoismaat. Baltian maat
alternative label: Rillumareielokuvat, Suomen elokuvan historia (777.921)
alternative label: Suomi, elokuvataide (777.921)
alternative label: Tukkilaiselokuvat, Suomen elokuvan historia (777.921)
alternative label: Finland, filmkonst (777.921) @sv
alternative label: Rillumareifilmer, finländska filmens historia (777.921) @sv
alternative label: Stockflottarfilmer, Finlands filmhistoria (777.921) @sv
broader: Pohjoismaat. Baltian maat
in scheme: URN:NBN:fi:au:hklj:
notation: 777.921
preferred label: Finland @en
related: URN:NBN:fi:au:hklj:1.4
related: URN:NBN:fi:au:hklj:1.84
related: URN:NBN:fi:au:hklj:1.944
related: URN:NBN:fi:au:hklj:2.84
related: URN:NBN:fi:au:hklj:2.94
related: URN:NBN:fi:au:hklj:3.4
related: URN:NBN:fi:au:hklj:384.42
related: URN:NBN:fi:au:hklj:4.4
related: URN:NBN:fi:au:hklj:5.4
related: URN:NBN:fi:au:hklj:6.4
related: URN:NBN:fi:au:hklj:7.4
related: URN:NBN:fi:au:hklj:709
related: Suomen yleinen taidehistoria
related: URN:NBN:fi:au:hklj:710
related: URN:NBN:fi:au:hklj:756
related: Teatteri- ja näyttämötaiteen teoria, estetiikka ja filosofia
related: URN:NBN:fi:au:hklj:770.9
related: Elokuvatekniikka. Videokuvauksen tekniikka
related: URN:NBN:fi:au:hklj:783.67
related: URN:NBN:fi:au:hklj:783.68

Ranska
type: Class
type: Concept
subclass of: Länsi- ja Keski-Eurooppa
alternative label: Ranska, elokuvataide (777.933)
alternative label: Frankrike, filmkonst (777.933) @sv
broader: Länsi- ja Keski-Eurooppa
in scheme: URN:NBN:fi:au:hklj:
notation: 777.933
preferred label: France @en
preferred label: Frankrike @sv
related: URN:NBN:fi:au:hklj:1.4
related: URN:NBN:fi:au:hklj:1.84
related: URN:NBN:fi:au:hklj:1.944
related: URN:NBN:fi:au:hklj:2.84
related: URN:NBN:fi:au:hklj:2.94
related: URN:NBN:fi:au:hklj:3.4
related: URN:NBN:fi:au:hklj:384.42
related: URN:NBN:fi:au:hklj:4.4
related: URN:NBN:fi:au:hklj:5.4
related: URN:NBN:fi:au:hklj:6.4
related: URN:NBN:fi:au:hklj:7.4
related: URN:NBN:fi:au:hklj:709
related: URN:NBN:fi:au:hklj:710
related: URN:NBN:fi:au:hklj:756
related: Teatteri- ja näyttämötaiteen teoria, estetiikka ja filosofia
related: URN:NBN:fi:au:hklj:770.9
related: Elokuvatekniikka. Videokuvauksen tekniikka
related: URN:NBN:fi:au:hklj:783.67
related: URN:NBN:fi:au:hklj:783.68
scope note: Tässä myös Andorra ja Monaco
scope note: Hit också Andorra och Monaco @sv

Keski-Eurooppa
type: Class
type: Concept
subclass of: Eurooppa
alternative label: Minnelaulajat, kansanmusiikki (784.12 +)
alternative label: Minnesångare, folkmusik (784.12 +) @sv
broader: Eurooppa
in scheme: URN:NBN:fi:au:hklj:
narrower: Saksa
narrower: Itävalta
narrower: Sveitsi
narrower: Benelux-maat
notation: 784.12
preferred label: Central Europe @en
preferred label: Centraleuropa @sv
related: URN:NBN:fi:au:hklj:473.1
related: URN:NBN:fi:au:hklj:769
related: URN:NBN:fi:au:hklj:783
related: URN:NBN:fi:au:hklj:783.1
related: URN:NBN:fi:au:hklj:787
related: URN:NBN:fi:au:hklj:787.2
related: URN:NBN:fi:au:hklj:787.29
related: URN:NBN:fi:au:hklj:788.8
related: URN:NBN:fi:au:hklj:789
related: URN:NBN:fi:au:hklj:795.1
related: URN:NBN:fi:au:hklj:797.2
related: URN:NBN:fi:au:hklj:807
scope note: Yleisteokset ja sekasisältöiset kokoelmat
scope note: Allmänna verk och samlingar med blandat innehåll @sv

Brittein saaret
type: Class
type: Concept
subclass of: Eurooppa
alternative label: Britannia, kansanmusiikki (784.13 +)
alternative label: Iso-Britannia, kansanmusiikki (784.13 +)
alternative label: Keltit, kansanmusiikki (784.13 +)
alternative label: Kelttiläinen kansanmusiikki, Brittein saaret (784.13 +)
alternative label: Minstrelit, englantilainen kansanmusiikki (784.13 +)
alternative label: Säkkipilli, kansanmusiikki, Britannia (784.13 +)
alternative label: Yhdistynyt kuningaskunta, kansanmusiikki (784.13 +)
alternative label: Britannien, folkmusik (784.13 +) @sv
alternative label: Förenade konungariket, folkmusik (784.13 +) @sv
alternative label: Kelter, folkmusik (784.13 +) @sv
alternative label: Keltisk folkmusik, Brittiska öarna (784.13 +) @sv
alternative label: Minstrels, engelsk folkmusik (784.13 +) @sv
alternative label: Storbritannien, folkmusik (784.13 +) @sv
alternative label: Säckpipa, folkmusik, Britannien (784.13 +) @sv
broader: Eurooppa
in scheme: URN:NBN:fi:au:hklj:
narrower: Englanti
narrower: Wales
narrower: Skotlanti
narrower: Irlanti
notation: 784.13
preferred label: British Isles @en
preferred label: Brittiska öarna @sv
related: URN:NBN:fi:au:hklj:473.1
related: URN:NBN:fi:au:hklj:769
related: URN:NBN:fi:au:hklj:783
related: URN:NBN:fi:au:hklj:783.1
related: URN:NBN:fi:au:hklj:787
related: URN:NBN:fi:au:hklj:787.2
related: URN:NBN:fi:au:hklj:787.29
related: URN:NBN:fi:au:hklj:788.8
related: URN:NBN:fi:au:hklj:789
related: URN:NBN:fi:au:hklj:795.1
related: URN:NBN:fi:au:hklj:797.2
related: URN:NBN:fi:au:hklj:807
scope note: Brittein saarten, Ison Britannian tai Yhdistyneen kuningaskunnan kansanmusiikkia koskevat yleisteokset ja sekasisältöiset kokoelmat Tässä ja alaluokissa sekä Brittein saarten anglosaksinen että kelttiläinen kansanmusiikki
scope note: Allmänna verk och samlingar med blandat innehåll som rör folkmusik från Brittiska öarna, Storbritannien eller Förenade kungadömet Hit och till underklasserna både anglosaxisk och keltisk folkmusik från Brittiska öarna @sv

Etelä-Aasia
type: Class
type: Concept
subclass of: Aasia
alternative label: Intia, kansanmusiikki (784.23)
alternative label: Qawwali (784.23)
alternative label: Tanpura, Intian kansanmusiikki (784.23)
alternative label: Indien, folkmusik (784.23) @sv
alternative label: Tanbur, indisk folkmusik (784.23) @sv
broader: Aasia
in scheme: URN:NBN:fi:au:hklj:
notation: 784.23
preferred label: Southern Asia @en
preferred label: Sydasien @sv
related: URN:NBN:fi:au:hklj:473.1
related: URN:NBN:fi:au:hklj:769
related: URN:NBN:fi:au:hklj:783
related: URN:NBN:fi:au:hklj:783.1
related: Keski- ja Itä-Aasia
related: URN:NBN:fi:au:hklj:784.9
related: URN:NBN:fi:au:hklj:787
related: URN:NBN:fi:au:hklj:787.2
related: Itämaisten uskontojen musiikki
related: Islamilaisten uskonnollinen musiikki
related: URN:NBN:fi:au:hklj:787.29
related: URN:NBN:fi:au:hklj:788.8
related: URN:NBN:fi:au:hklj:789
related: Varhaiskansojen musiikki
related: URN:NBN:fi:au:hklj:795.1
related: URN:NBN:fi:au:hklj:797.2
related: URN:NBN:fi:au:hklj:807
scope note: Bangladesh. Bhutan. Intia. Malediivit. Nepal. Pakistan. Sri Lanka Tässä myös Kashmir Tässä myös Andamaanit, Kookossaaret ja Nikobaarit
scope note: Bangladesh. Bhutan. Indien. Maldiverna. Nepal. Pakistan. Sri Lanka Hit också Kashmir Hit också Andamarerna, Kokosöarna och Nikobarerna @sv

Muut kvintetit
type: Class
type: Concept
subclass of: Kvintetit
broader: Kvintetit
in scheme: URN:NBN:fi:au:hklj:
notation: 785.149
preferred label: Other quintets @en
preferred label: Annan kvintettmusik @sv
related: URN:NBN:fi:au:hklj:789

Spirituaalit. Gospel-musiikki
type: Class
type: Concept
subclass of: Protestanttinen musiikki
alternative label: Gospelmusiikki (787.113)
alternative label: Hengellinen musiikki, gospel-musiikki (787.113)
alternative label: Hengellinen musiikki, spirituaalit (787.113)
alternative label: Negro spirituaalit (787.113)
alternative label: Spirituaalit (787.113)
alternative label: Andlig musik, gospelmusik (787.113) @sv
alternative label: Andlig musik, spirituals (787.113) @sv
alternative label: Gospelmusik (787.113) @sv
alternative label: Negro spirituals (787.113) @sv
alternative label: Spirituals (787.113) @sv
broader: Protestanttinen musiikki
in scheme: URN:NBN:fi:au:hklj:
notation: 787.113
preferred label: Spirituals. Gospel music @en
preferred label: Spirituals. Gospelmusik @sv
related: Hartauskirjat
related: Rukouskirjat
related: Virsikirjat ja hengelliset laulukirjat
related: Henkilökohtainen hartaudenharjoitus
related: Sakramentit. Kirkolliset toimitukset
related: URN:NBN:fi:au:hklj:783
related: URN:NBN:fi:au:hklj:783.1
related: URN:NBN:fi:au:hklj:783.5
related: Oratoriot
related: Passiot
related: Messut. Requiemit
related: Kantaatit
related: Motetit
related: URN:NBN:fi:au:hklj:783.59
related: URN:NBN:fi:au:hklj:783.6
related: URN:NBN:fi:au:hklj:784
related: URN:NBN:fi:au:hklj:784.9
related: Virret. Hengelliset laulut
related: URN:NBN:fi:au:hklj:787.112
related: URN:NBN:fi:au:hklj:787.2
related: URN:NBN:fi:au:hklj:789
scope note: Negrospirituaalit
scope note: Negro spirituals @sv

Itämaisten uskontojen musiikki
type: Class
type: Concept
subclass of: URN:NBN:fi:au:hklj:787.2
alternative label: Buddhalainen liturginen musiikki (787.21)
alternative label: Hindulainen liturginen musiikki (787.21)
alternative label: Itämaisten uskontojen musiikki (787.21)
alternative label: Shintolainen musiikki (787.21)
alternative label: Buddhistisk liturgisk musik (787.21) @sv
alternative label: Hinduisk liturgisk musik (787.21) @sv
alternative label: Shintoistisk musik (787.21) @sv
alternative label: Österländska religioners musik (787.21) @sv
broader: URN:NBN:fi:au:hklj:787.2
in scheme: URN:NBN:fi:au:hklj:
notation: 787.21
preferred label: Music of the Eastern religions @en
preferred label: De österländska religionernas musik @sv
related: URN:NBN:fi:au:hklj:280
related: URN:NBN:fi:au:hklj:783
related: URN:NBN:fi:au:hklj:783.1
related: URN:NBN:fi:au:hklj:783.5
related: URN:NBN:fi:au:hklj:783.59
related: URN:NBN:fi:au:hklj:783.6
related: URN:NBN:fi:au:hklj:784
related: Aasia
related: Etu-Aasia
related: Etelä-Aasia
related: Kaakkois-Aasia
related: Keski- ja Itä-Aasia
related: Itsenäisten valtioiden yhteisön Aasian puoleiset alueet
related: Kaukasuksen maat
related: Korea
related: Kiina
related: Japani
related: URN:NBN:fi:au:hklj:784.9
related: URN:NBN:fi:au:hklj:789
related: Varhaiskansojen musiikki
scope note: Tässä esim. Intian, Kiinan ja Japanin vanhojen uskontojen musiikki Buddhalainen, lamalainen, hindulainen, brahmalainen, jainalainen, sikhiläinen, taolainen ja sintolainen uskonnollinen musiikki
scope note: Hit t.ex. de gamla indiska, kinesiska och japanska religionernas musik Buddhismens, lamaismens, hinduismens, bramanismens, jainismens, sikhismens, taoismens och shintoismens religiösa musik @sv

Pohjoismaat. Baltian maat
type: Class
type: Concept
subclass of: Eurooppa
alternative label: Pohjoismaat, musiikinhistoria (789.21 +)
alternative label: Pohjola, musiikinhistoria (789.21 +)
alternative label: Norden, musikhistoria (789.21 +) @sv
alternative label: Nordiska länderna, musikhistoria (789.21 +) @sv
broader: Eurooppa
in scheme: URN:NBN:fi:au:hklj:
narrower: Suomi
narrower: Ruotsi
narrower: Norja
narrower: Tanska
narrower: Islanti
narrower: Baltian maat
notation: 789.21
preferred label: Nordic countries. Baltic countries @en
preferred label: Norden. Baltikum @sv
related: URN:NBN:fi:au:hklj:709
related: URN:NBN:fi:au:hklj:782.4
related: URN:NBN:fi:au:hklj:783
related: URN:NBN:fi:au:hklj:789.1
scope note: Yleisteokset, jotka koskevat Pohjoismaiden musiikin historiaa tai sekä Pohjoismaiden että Baltian maiden musiikin historiaa
scope note: Allmänna verk som rör den nordiska musikens historia eller både den nordiska och baltiska musikens historia @sv

Itä-Eurooppa
type: Class
type: Concept
subclass of: Eurooppa
broader: Eurooppa
in scheme: URN:NBN:fi:au:hklj:
narrower: Puola
narrower: Tsekkoslovakian alue
narrower: Unkari
notation: 789.26
preferred label: Eastern Europe @en
preferred label: Östeuropa @sv
related: URN:NBN:fi:au:hklj:709
related: URN:NBN:fi:au:hklj:782.4
related: URN:NBN:fi:au:hklj:783
related: URN:NBN:fi:au:hklj:789.1
related: Itsenäisten valtioiden yhteisö
related: Venäjä
related: Karjalan tasavalta
related: Ukraina
related: Valko-Venäjä
related: Moldova
related: Itsenäisten valtioiden yhteisön Aasian puoleiset maat
scope note: Itä-Euroopan musiikin historian yleisteokset
scope note: Allmänna verk som rör den östeuropeiska musikens historia @sv

Neuvostoliiton historia 1917-1991
type: Class
type: Concept
subclass of: Venäjän historia
alternative label: Kommunismi, (971.7 +)
alternative label: Luovutettu Karjala, historia 1945-1991 (971.7 +)
alternative label: Luovutetut alueet, historia 1945-1991 (971.7 +)
alternative label: Neuvosto-Karjala, historia (971.7 +)
alternative label: Neuvostoliitto, historia (971.7 +)
alternative label: Neuvostovallan aika, historia (971.7 +)
alternative label: Petsamo, historia 1944-1992 (971.7)
alternative label: Sallan alue, historia 1944-1992 (971.7)
alternative label: Sovjetologia, Neuvostoliiton historia (971.7 +)
alternative label: Stalinismi, Neuvostoliiton historia (971.7 +)
alternative label: Venäläistämispolitiikka, Neuvostoliiton historia (971.7 +)
alternative label: Avträdda Karelen, historia 1945-1991 (971.7 +) @sv
alternative label: Avträdda områden, historia 1945-1991 (971.7 +) @sv
alternative label: Förryskningspolitik, Sovjetunionens historia (971.7 +) @sv
alternative label: Kommunism, (971.7 +) @sv
alternative label: Sallaområdet, historia 1944-1992 (971.7) @sv
alternative label: Sovjetkarelen, historia (971.7 +) @sv
alternative label: Sovjetologi, Sovjetunionens historia (971.7 +) @sv
alternative label: Sovjettiden, historia (971.7 +) @sv
alternative label: Sovjetunionen, historia (971.7 +) @sv
alternative label: Stalinism, Sovjetunionens historia (971.7 +) @sv
broader: Venäjän historia
in scheme: URN:NBN:fi:au:hklj:
narrower: Neuvostoliiton historia 1917-1938
narrower: Neuvostoliiton historia 1939-1945
narrower: Neuvostoliiton historia 1945-1991
notation: 971.7
preferred label: History of the Soviet Union 1917-1991 @en
preferred label: Sovjetunionens historia 1917-1991 @sv
related: Menetetty Karjalan alue
related: Lappi
related: Armenia. Azerbaidzan. Georgia. Kazakstan. Kirgisia. Tadzikistan. Turkmenistan. Uzbekistan
related: URN:NBN:fi:au:hklj:909
related: URN:NBN:fi:au:hklj:919
related: Ukrainan, Valko-Venäjän ja Moldovan historia
related: Ukrainan historia
related: Valko-Venäjän historia
related: Moldovan historia
related: Baltian maiden historia
related: Viron historia
related: Latvian historia
related: Liettuan historia
related: Aasian historia
related: Armenian, Azerbaidzanin, Georgian, Kazakstanin, Kirgisian, Tadzikistanin, Turkmenistanin ja Uzbekistanin historia
related: URN:NBN:fi:au:hklj:989
scope note: Neuvostoliiton historian yleisteokset Tässä ja alaluokissa myös Siperian historia 1917-1991
scope note: Allmänna verk om Sovjetunionens historia Hit och till underklasserna också Sibiriens historia 1917-1991 @sv

Kirjastojen luettelot
type: Class
type: Concept
subclass of: URN:NBN:fi:au:hklj:010
alternative label: Bibliografiat, kirjastojen luettelot (012 +)
alternative label: Bibliografiset tietokannat, kirjastojen luettelot (012 +)
alternative label: Kaunokirjallisuusluettelot, kirjastojen luettelot (012 +)
alternative label: Kirjaluettelot, kirjastojen luettelot (012 +)
alternative label: Kirjastoluettelot, aineistoluettelot (012 +)
alternative label: Kokoelmaluettelot (012)
alternative label: Kokoelmat, kirjastojen luettelot (012 +)
alternative label: Valikoimaluettelot, kirjastojen luettelot (012 +)
alternative label: Varastoluettelot, kirjastot (012 +)
alternative label: Yhteisluettelot, kirjastojen (012 +)
alternative label: Bibliografier, bibliotekens kataloger (012 +) @sv
alternative label: Bibliografiska databaser, bibliotekens kataloger (012 +) @sv
alternative label: Bibliotekskataloger, mediekataloger (012 +) @sv
alternative label: Bokkataloger, bibliotekens kataloger (012 +) @sv
alternative label: Lagerkataloger, bibliotek (012 +) @sv
alternative label: Samkataloger, bibliotekens (012 +) @sv
alternative label: Samlingar, bibliotekens kataloger (012 +) @sv
alternative label: Samlingskataloger (012) @sv
alternative label: Skönlitteraturkataloger, bibliotekens kataloger (012 +) @sv
alternative label: Urvalskataloger, bibliotekens kataloger (012 +) @sv
broader: URN:NBN:fi:au:hklj:010
in scheme: URN:NBN:fi:au:hklj:
narrower: Suomi
notation: 012
preferred label: Library catalogues @en
preferred label: Bibliotekskataloger @sv
related: Yleisbibliografiat. Kansallisbibliografiat
related: Erikoisalojen bibliografiat
related: Filosofia. Psykologia. Kasvatustiede
related: Uskonto
related: Yhteiskunta
related: Maantiede. Matkat. Kansatiede
related: Luonnontieteet. Matematiikka
related: Lääketiede. Tekniikka. Teollisuus. Maa- ja metsätalous. Liiketalous. Kotitalous. Käsityö
related: Taiteet. Liikunta
related: Kirjallisuustiede. Kielitiede
related: Historia
related: Paikallisbibliografiat. Henkilöbibliografiat
related: URN:NBN:fi:au:hklj:018
related: KIRJASTOT. KIRJASTOTOIMI
related: Kirjastoaineisto. Kokoelmatyö
related: Luettelointi
related: Yleiset kirjastot
related: Erikoiskirjastot. Yhdistysten, laitosten ja yritysten kirjastot
related: URN:NBN:fi:au:hklj:028
related: Musiikkibibliografiat. Diskografiat
scope note: Yleisten ja tieteellisten kirjastojen yleiset kokoelmaluettelot luettelon aineistotyypistä riippumatta Yksityiskirjastojen yleiset luettelot Yksittäisten kirjastojen yleiset luettelot Kirjastojen yleiset yhteisluettelot Kirjastojen aikakausjulkaisujen, sanomalehtien, mikrofilmien ja -korttien luettelot samassa luokassa kuin vastaavat kirjaluettelot
scope note: Allmänna samlingskataloger på allmänna och vetenskapliga bibliotek oavsett katalogens mediatyp Allmänna kataloger på privata bibliotek Allmänna kataloger på enskilda bibliotek Allmänna samkataloger i bibliotek Bibliotekskataloger över seriella publikationer, tidningar, mikrofilmer och mikrokort förs till samma klass som motsvarande litteraturförteckningar @sv

Kirjaston käyttö. Kirjastososiologia
type: Class
type: Concept
subclass of: KIRJASTOT. KIRJASTOTOIMI
alternative label: Kirjastonkäyttö, tutkimukset (023)
alternative label: Kirjastososiologia (023)
alternative label: Kävijät, kirjasto (023)
alternative label: Kävijätutkimukset, kirjasto (023)
alternative label: Käyttäjät, kirjastot (023)
alternative label: Käyttö, kirjastot (023)
alternative label: Käyttötutkimus, kirjastot (023)
alternative label: Lainaajat, lainaajatutkimukset, kirjastot (023)
alternative label: Lainaustoiminta, kirjaston käyttö (023)
alternative label: Varaukset, kirjaston käytön tutkimus (023)
alternative label: Yleisö, kirjaston käyttäjät (023)
alternative label: Användare, bibliotek (023) @sv
alternative label: Användning, bibliotek (023) @sv
alternative label: Besökare, bibliotek (023) @sv
alternative label: Besökarundersökningar, bibliotek (023) @sv
alternative label: Biblioteksanvändning, undersökningar (023) @sv
alternative label: Bibliotekssociologi (023) @sv
alternative label: Bruksundersökning, bibliotek (023) @sv
alternative label: Låntagare, låntagarundersökningar, bibliotek (023) @sv
alternative label: Publik, bibliotekets användare (023) @sv
alternative label: Reserveringar, användarundersökningar vid bibliotek (023) @sv
alternative label: Utlåningsverksamhet, användning av bibliotek (023) @sv
broader: KIRJASTOT. KIRJASTOTOIMI
in scheme: URN:NBN:fi:au:hklj:
notation: 023
preferred label: Library use. Library sociology @en
preferred label: Biblioteksanvändning. Bibliotekssociologi @sv
related: URN:NBN:fi:au:hklj:018
related: Muu kuin kirja-aineisto kirjastossa
related: Yleisönpalvelu
related: Lainaus
related: Tietopalvelu. Informaatiopalvelu
related: Lastenkirjastot
related: Koulukirjastot
related: Erityisten väestöryhmien kirjastopalvelut
related: Sairaalakirjastot
related: Erikoiskokoelmat
related: Paikalliskokoelmat
related: Musiikkikirjastot
related: Kirjastoautot. Kirjastoveneet
related: Kirjastonkäytön opastus
related: Yleiset kirjastot
related: Erikoiskirjastot. Yhdistysten, laitosten ja yritysten kirjastot
related: URN:NBN:fi:au:hklj:028
related: Dokumentaatio ja informaatiopalvelu yleensä
related: Museonhoito
related: Arkistonhoito
related: URN:NBN:fi:au:hklj:061
related: URN:NBN:fi:au:hklj:063
related: Organisaatioiden ja laitosten sosiologia
scope note: Yleisten, tieteellisten, yksityisten ja erikoiskirjastojen käytön tutkimukset Tässä myös kirjastojen erityispalvelujen, -aineistojen ja -osastojen käytön tutkimus Lasten- ja koulukirjastojen käytön tutkimus Musiikkikirjastojen käytön tutkimus
scope note: Undersökningar som gäller användning av allmänna, vetenskapliga och privata bibliotek samt specialbibliotek Undersökningar som gäller användning av specialtjänster, specialmedier och specialavdelningar på bibliotek Undersökningar som gäller användning av barn- och skolbibliotek Undersökningar som gäller användning av musikbibliotek @sv

Musiikin opetusoppi
type: Class
type: Concept
subclass of: Taideaineiden opetusoppi
alternative label: Laulu, opetusoppi (182.78)
alternative label: Laulun opetusoppi (182.78)
alternative label: Musiikin opetusoppi (182.78)
alternative label: Musiikin oppimateriaalit, musiikin opetusoppi (182.78)
alternative label: Musiikki, opetusoppi (182.78)
alternative label: Musiikkipedagogiikka, musiikin opetusoppi (182.78)
alternative label: Säveltaide, opetusoppi (182.78)
alternative label: Musik, didaktik (182.78) @sv
alternative label: Musikens didaktik (182.78) @sv
alternative label: Musikkonst, didaktik (182.78) @sv
alternative label: Musikläromedel, musikens didaktik (182.78) @sv
alternative label: Musikpedagogik, musikens didaktik (182.78) @sv
alternative label: Sång, didaktik (182.78) @sv
alternative label: Sångens didaktik (182.78) @sv
broader: Taideaineiden opetusoppi
in scheme: URN:NBN:fi:au:hklj:
notation: 182.78
preferred label: Didactics in music @en
preferred label: Musikens didaktik @sv
related: Oppimisen psykologia
related: Hypnoosi. Suggestio
related: URN:NBN:fi:au:hklj:181.7
related: URN:NBN:fi:au:hklj:181.9
related: URN:NBN:fi:au:hklj:183
related: URN:NBN:fi:au:hklj:183.5
related: URN:NBN:fi:au:hklj:183.7
related: Erikoiskoulut. Kokeilukoulut
related: URN:NBN:fi:au:hklj:184
related: Muiden maiden yliopistot ja korkeakoulut
related: URN:NBN:fi:au:hklj:185
related: URN:NBN:fi:au:hklj:188.4
related: Radio- ja televisiotoiminta
related: Radiotoiminta
related: URN:NBN:fi:au:hklj:384.42
related: URN:NBN:fi:au:hklj:627.7
related: URN:NBN:fi:au:hklj:627.73
related: URN:NBN:fi:au:hklj:627.751
related: URN:NBN:fi:au:hklj:627.753
related: URN:NBN:fi:au:hklj:627.7531
related: URN:NBN:fi:au:hklj:627.7532
related: Musiikin filosofia, estetiikka, psykologia ja sosiologia Musiikkikasvatus. Musiikkiopetus
related: URN:NBN:fi:au:hklj:781.5
scope note: Luokkiin 780-789+ kuuluvien erikoisalojen tai aineiden opetusoppi Tässä esim. musiikin teorian ja historian sekä sävellyksen, laulun ja soiton opetusoppi
scope note: Didaktik som rör specialområden eller ämnen som hör till klasserna 780-789+ Hit didaktik inom t.ex. musikteori och musikhistoria samt tonsättning, sång och musik @sv

Nuorisotyö
type: Class
type: Concept
subclass of: URN:NBN:fi:au:hklj:185
alternative label: Erityisnuorisotyö (185.8)
alternative label: Etsivä nuorisotyö (185.8)
alternative label: Jengit, nuorisotyö (185.8)
alternative label: Jengityö (185.8)
alternative label: Kenttätyö, nuorisotyö (185.8)
alternative label: Kunnallinen nuorisotyö (185.8)
alternative label: Lastenkulttuuri, varhaisnuorisotyö (185.8)
alternative label: Nettinuorisotyö (185.8)
alternative label: Nuoret, nuorisotyö (185.8)
alternative label: Nuoriso-ohjaajan työ (185.8)
alternative label: Nuorisopolitiikka, nuorisotyö (185.8)
alternative label: Nuorisotalot, nuorisotyö (185.8)
alternative label: Nuorisotoimi, nuorisotyö (185.8)
alternative label: Nuorisotyö (185.8)
alternative label: Nuorisotyö, nuoriso- ja jengityö (185.8)
alternative label: Nuorisotyöntekijät, nuorisotyö (185.8)
alternative label: Nuorten asema, nuorisotyö (185.8)
alternative label: Nuoruus, nuorisotyö (185.8)
alternative label: Varhaisnuoret, nuorisotyö (185.8)
alternative label: Verkkonuorisotyö (185.8)
alternative label: Barnkultur, arbete med barn i skolåldern (185.8) @sv
alternative label: Fältarbete, ungdomsarbete (185.8) @sv
alternative label: Gäng, ungdomsarbete (185.8) @sv
alternative label: Gängarbete (185.8) @sv
alternative label: Kommunalt ungdomsarbete (185.8) @sv
alternative label: Specialungdomsarbete (185.8) @sv
alternative label: Unga vuxna, ungdomsarbete (185.8) @sv
alternative label: Unga, ungdomsarbete (185.8) @sv
alternative label: Ungdom, ungdomsarbete (185.8) @sv
alternative label: Ungdomens ställning, ungdomsarbete (185.8) @sv
alternative label: Ungdomsarbetare, ungdomsarbete (185.8) @sv
alternative label: Ungdomsarbete (185.8) @sv
alternative label: Ungdomsarbete, ungdoms- och gängarbete (185.8) @sv
alternative label: Ungdomsarbetet på nätet (185.8) @sv
alternative label: Ungdomshus, ungdomsarbete (185.8) @sv
alternative label: Ungdomsledarens arbete (185.8) @sv
alternative label: Ungdomspolitik, ungdomsarbete (185.8) @sv
alternative label: Ungdomsväsen, ungdomsarbete (185.8) @sv
alternative label: Uppsökande ungdomsverksamhet (185.8) @sv
broader: URN:NBN:fi:au:hklj:185
in scheme: URN:NBN:fi:au:hklj:
notation: 185.8
preferred label: Youth-work @en
preferred label: Ungdomsarbete @sv
related: URN:NBN:fi:au:hklj:060
related: URN:NBN:fi:au:hklj:061
related: URN:NBN:fi:au:hklj:063
related: URN:NBN:fi:au:hklj:181.7
related: URN:NBN:fi:au:hklj:182
related: URN:NBN:fi:au:hklj:183
related: URN:NBN:fi:au:hklj:183.5
related: Keskiasteen koulutus
related: URN:NBN:fi:au:hklj:183.7
related: Muiden maiden koululaitokset
related: URN:NBN:fi:au:hklj:184
related: Muiden maiden yliopistot ja korkeakoulut
related: Muut yleisen sivistystyön muodot
related: Ammatinvalinta
related: URN:NBN:fi:au:hklj:188.4
related: Seurakunta. Seurakuntatyö
related: Sisäpolitiikka. Puolueet
related: Suomi
related: URN:NBN:fi:au:hklj:345
related: URN:NBN:fi:au:hklj:357.1
related: Perhepolitiikka. Lapsipolitiikka. Nuorisopolitiikka
related: Nuorisoseuratoiminta
related: Partioliike
scope note: Yksityinen ja kunnallinen nuorisotyö. Jengityö Nuorisotyön organisaatio. Nuorisotyöntekijän oppaat Nuorten eri alojen kulttuuri- ja harrastustoiminta alan mukaisessa luokassa
scope note: Privat och kommunalt ungdomsarbete. Gängarbete Ungdomsarbetets organisation. Vägledningar för ungdomsarbetare Kultur- och hobbyverksamhet för ungdomar inom olika områden klassificeras enligt område @sv

Luominen. Kehitys
type: Class
type: Concept
subclass of: YLEINEN USKONTOTIEDE. YLEINEN USKONNONFILOSOFIA
alternative label: Kreationismi, uskontotiede (206)
alternative label: Luominen, uskonnonfilosofia (206)
alternative label: Luominen, uskontotiede (206)
alternative label: Älykäs suunnittelu, uskontotiede (206)
alternative label: Intelligent design, religionsvetenskap (206) @sv
alternative label: Kreationism, religionsvetenskap (206) @sv
alternative label: Skapelsen, religionsfilosofi (206) @sv
alternative label: Skapelsen, religionsvetenskap (206) @sv
broader: YLEINEN USKONTOTIEDE. YLEINEN USKONNONFILOSOFIA
in scheme: URN:NBN:fi:au:hklj:
notation: 206
preferred label: Creation. Evolution @en
preferred label: Skapelsen. Evolutionen @sv
related: URN:NBN:fi:au:hklj:110
related: Uskonnonfilosofia
related: URN:NBN:fi:au:hklj:209
related: Kristinuskon filosofia
related: Jumalan olemus
related: URN:NBN:fi:au:hklj:280
related: Itä-Aasian uskonnot ja mytologiat
related: Intian uskonnot ja mytologiat
related: Buddhalaisuus ja sen mytologia
related: Muinais-Egyptin ja Etu-Aasian uskonnot ja mytologiat
related: Antiikin Kreikan ja Rooman uskonnot ja mytologiat
related: Persian uskonnot ja mytologiat
related: Islam ja sen mytologia
related: Juutalaisten uskonto ja sen mytologia
related: Muut uskonnot ja mytologiat
related: Afrikan alkuperäiskansojen uskonnot
related: Amerikan alkuperäiskansojen uskonnot ja mytologiat
related: Australian ja Oseanian alkuperäiskansojen uskonnot ja mytologiat
related: Muinaissuomalaiset ja suomalais-ugrilaiset uskonnot ja mytologiat
related: Muinaisgermaaniset, -balttilaiset, -slaavilaiset ja -kelttiläiset uskonnot ja mytologiat
related: Muinaispohjoismaiset uskonnot ja mytologiat
related: Biologinen antropologia
related: Kehitysoppi. Evoluutio
scope note: Luominen ja kehitys yleisuskonnollisina kysymyksinä Luominen ja kehitys tietyn uskonnon kannalta ko. uskonnon luokassa
scope note: Skapelsen och evolutionen som allmänreligiös fråga Skapelsen och evolutionen inom området för en bestämd religion klassificeras enligt område @sv

Maa- ja metsätalouslainsäädäntö
type: Class
type: Concept
subclass of: Ympäristöoikeus. Talousoikeus
alternative label: Asuttaminen, asutuslainsäädäntö (334.5)
alternative label: Asutus, asutuslainsäädäntö (334.5)
alternative label: Asutuslainsäädäntö (334.5)
alternative label: Kalastus, lainsäädäntö (334.5)
alternative label: Maakauppa, maanhankintalaki ja -lupa (334.5)
alternative label: Maanhankintalainsäädäntö (334.5)
alternative label: Maanhankintalupa (334.5)
alternative label: Maatalous, lainsäädäntö (334.5)
alternative label: Maatalouslainsäädäntö (334.5)
alternative label: Metsälainsäädäntö (334.5)
alternative label: Metsästysoikeus (334.5)
alternative label: Metsätalous, lainsäädäntö (334.5)
alternative label: Petovahingot, lainsäädäntö (334.5)
alternative label: Yhteismetsät, metsätalouslainsäädäntö (334.5)
alternative label: Yksityismetsälaki (334.5)
alternative label: Yksityismetsätalous, lainsäädäntö (334.5)
alternative label: Bebyggelse, bebyggelselagstiftning (334.5) @sv
alternative label: Bebyggelselagstiftning (334.5) @sv
alternative label: Fiske, lagstiftning (334.5) @sv
alternative label: Jakträtt (334.5) @sv
alternative label: Jordförvärvslagstiftning (334.5) @sv
alternative label: Jordförvärvstillstånd (334.5) @sv
alternative label: Kolonisering, bebyggelselagstiftning (334.5) @sv
alternative label: Lagen om enskilda skogar (334.5) @sv
alternative label: Lantbruk, lagstiftning (334.5) @sv
alternative label: Lantbrukslagstiftning (334.5) @sv
alternative label: Markaffärer, jordanskaffningslag och -tillstånd (334.5) @sv
alternative label: Privatskogsbruk, lagstiftning (334.5) @sv
alternative label: Rovdjursskador, lagstiftning (334.5) @sv
alternative label: Samfällda skogar, skogsbrukslagstiftning (334.5) @sv
alternative label: Skogsbruk, lagstiftning (334.5) @sv
alternative label: Skogslagstiftning (334.5) @sv
broader: Ympäristöoikeus. Talousoikeus
in scheme: URN:NBN:fi:au:hklj:
notation: 334.5
preferred label: Agriculture and forestry legislation @en
preferred label: Jord- och skogsbrukslagstiftning @sv
related: URN:NBN:fi:au:hklj:326.2
related: URN:NBN:fi:au:hklj:332.2
related: Asemakaava- ja rakentamislainsäädäntö
related: Esine- ja velvoiteoikeus. Immateriaalioikeudet. Huoneen- ja maanvuokralainsäädäntö
related: Merioikeus
related: Maaoikeus
related: Vesioikeus
related: Kansainvälinen oikeus
related: Suomen ja Euroopan Unionin laki- ja asetuskokoelmat
related: Muiden maiden lait
related: URN:NBN:fi:au:hklj:342
related: Ympäristönsuojelu. Luonnonsuojelu
related: URN:NBN:fi:au:hklj:613.3
related: URN:NBN:fi:au:hklj:650
related: Maatalouspolitiikka
related: URN:NBN:fi:au:hklj:650.2
related: URN:NBN:fi:au:hklj:651
related: URN:NBN:fi:au:hklj:654
related: URN:NBN:fi:au:hklj:657
related: Metsästys. Kalastus
related: Metsästys
related: Kalastus
scope note: Metsästys- ja kalastuslainsäädäntö Maanhankintalait. Maanhankintalupa
scope note: Lagstiftning om jakt och fiske Lagstiftning om jordförvärv. Jordförvärvstillstånd @sv

Vesiliikenne
type: Class
type: Concept
subclass of: Vesi- ja ilmaliikenne
alternative label: Ahtaajat, ahtaus (386.1)
alternative label: Ahtaus (386.1)
alternative label: Ahtojää, vesiliikenne (386.1)
alternative label: Ajoreitit, vesiliikenne (386.1)
alternative label: Aluemeri, merenkulku (386.1)
alternative label: Ankkurointi, vesiliikenne, satamat (386.1)
alternative label: Autolauttaliikenne (386.1)
alternative label: Charter-liikenne, vesiliikenne (386.1)
alternative label: Haaksirikot, merenkulku (386.1)
alternative label: Haverit (386.1)
alternative label: Haverit, merenkulku (386.1)
alternative label: Henkilöliikenne, laivaliikenne (386.1)
alternative label: Huolinta, vesiliikenne (386.1)
alternative label: Huoltamot, vesiliikenne (386.1)
alternative label: Huoltoasemat, vesiliikenne (386.1)
alternative label: Höyrylaivat, vesiliikenne (386.1)
alternative label: Ilmatyynyalukset, vesiliikenne (386.1)
alternative label: Jaalat, vesiliikenne (386.1)
alternative label: Jakeluasemat, vesiliikenne (386.1)
alternative label: Joenuomat, vesiliikenne (386.1)
alternative label: Joet, vesiliikenne (386.1)
alternative label: Jokilaivat, vesiliikenne (386.1)
alternative label: Jokisuistot, vesiliikenne (386.1)
alternative label: Joukkoliikenne, vesiliikenne (386.1)
alternative label: Julkinen liikenne, vesiliikenne (386.1)
alternative label: Järvet, vesiliikenne (386.1)
alternative label: Järviliikenne (386.1)
alternative label: Jää, merenkulku (386.1)
alternative label: Jääliikenne (386.1)
alternative label: Jäänmurtajat, merenkulku (386.1)
alternative label: Jääpeite, merenkulku (386.1)
alternative label: Kanavaliikenne (386.1)
alternative label: Kansainvälinen liikenne, vesiliikenne (386.1)
alternative label: Kantosiipialukset, vesiliikenne (386.1)
alternative label: Karilleajo , merenkulku (386.1)
alternative label: Kaukoliikenne, vesiliikenne (386.1)
alternative label: Kauppa-alukset, laivanvarustus (386.1)
alternative label: Kauppa-alukset, merenkulku (386.1)
alternative label: Kauppalaivasto, laivanvarustus (386.1)
alternative label: Kauppalaivasto, merenkulku (386.1)
alternative label: Kauppalaivat, laivanvarustus (386.1)
alternative label: Kauppalaivat, merenkulku (386.1)
alternative label: Kauppamerenkulku (386.1)
alternative label: Kauttakulkuliikenne, vesiliikenne (386.1)
alternative label: Kelirikko, vesiliikenne (386.1)
alternative label: Kutsujoukkoliikenne, vesiliikenne (386.1)
alternative label: Kutsuliikenne, vesiliikenne (386.1)
alternative label: Laivaliikenne (386.1)
alternative label: Laivanvarustamot (386.1)
broader: Vesi- ja ilmaliikenne
in scheme: URN:NBN:fi:au:hklj:
notation: 386.1
related: URN:NBN:fi:au:hklj:320
related: URN:NBN:fi:au:hklj:332.2
related: Merioikeus
related: URN:NBN:fi:au:hklj:342
related: Paikallisliikenne
related: Helsinki. Pääkaupunkiseutu
related: URN:NBN:fi:au:hklj:460
related: Yleiset matkaoppaat
related: Satamat. Satamatekniikka
related: Vesiväylät. Vesien säännöstely
related: Vesikulkuneuvot
related: Laivat. Laivanrakennus
related: URN:NBN:fi:au:hklj:625.72
related: Muut vesikulkuneuvot
related: Kemian teollisuus
related: Öljy. Maakaasu
related: Materiaalitoiminnot. Logistiikka
related: Merenkulkuoppi
related: URN:NBN:fi:au:hklj:721
related: Kaupunkisuunnittelu. Kaupunkiarkkitehtuuri
related: Purjehdus. Soutu. Melonta
related: Moottoriurheilu. Lentourheilu
related: Moottoriveneurheilu
scope note: Vesiliikenteen liikennepolitiikka ja -suunnittelu Meriliikenne. Merenkulku. Laivaliikenne. Kauppamerenkulku. Matkustajaliikenne. Sisävesiliikenne Veneliikenne. Veneily yleensä. Yleiset veneilijän oppaat Liikenneväylät ja liikenneverkot sekä satamat vesiliikenteen kannalta. Satamatoiminta. Satama- ja venesatamaoppaat Laivanvarustus. Huoltoasematoiminta ja huolinta vesi- ja meriliikenteen kannalta Vaarallisten aineiden kuljetus vesitse Jos teos koskee sekä vesiliikennettä että vesikulkuneuvoja tai satamien ja väylien rakentamista, on etusija luokalla 386.1
scope note: Trafikpolitik och trafikplanering som rör sjötrafik Sjötrafik. Sjöfart. Fartygstrafik. Handelssjöfart. Passagerartrafik. Insjötrafik Båttrafik. Småbåtstrafik och nöjesbåtar i allmänhet. Allmänna handledningar för förare av nöjesbåtar Trafikleder och trafiknät samt hamnar ur sjötrafikens synvinkel Hamnväsen. Hamnguider Rederiverksamhet. Bensinstationer och spedition ur sjötrafikens synvinkel Transport av farliga ämnen till sjöss Om verket handlar om både sjötrafik och vattenfarkoster eller hamnbygge och farledsbygge, ges företräde åt klass 386.1 @sv

Ilmaliikenne. Ilmailu
type: Class
type: Concept
subclass of: Vesi- ja ilmaliikenne
alternative label: Charter-liikenne, lentoliikenne (386.2)
alternative label: Halpalennot (386.2)
alternative label: Halvat lennot (386.2)
alternative label: Helikopterit, lentoliikenne (386.2)
alternative label: Henkilöliikenne, lentoliikenne (386.2)
alternative label: Huolinta, lentoliikenne (386.2)
alternative label: Ilmailu (386.2)
alternative label: Ilmailu, lentoliikenne (386.2)
alternative label: Ilmailu, siviili-ilmailu (386.2)
alternative label: Ilmailuhallinto (386.2)
alternative label: Ilmakuljetus, lentoliikenne (386.2)
alternative label: Ilmaliikenne (386.2)
alternative label: Joukkoliikenne, lentoliikenne (386.2)
alternative label: Julkinen liikenne, lentoliikenne (386.2)
alternative label: Kansainvälinen liikenne, lentoliikenne (386.2)
alternative label: Kaukoliikenne, lentoliikenne (386.2)
alternative label: Kauttakulkuliikenne, lentoliikenne (386.2)
alternative label: Kutsujoukkoliikenne, lentoliikenne (386.2)
alternative label: Kutsuliikenne, lentoliikenne (386.2)
alternative label: Lentoasemat, lentoliikenne (386.2)
alternative label: Lentokentät, lentoliikenne (386.2)
alternative label: Lentokuljetus, lentoliikenne (386.2)
alternative label: Lentoliikenne (386.2)
alternative label: Lentoliikenne, ilmaliikenne (386.2)
alternative label: Lentopelko, lentoliikenne (386.2)
alternative label: Lentoreitit (386.2)
alternative label: Lentoturvallisuus (386.2)
alternative label: Lentoturvallisuus, turvajärjestelyt (386.2)
alternative label: Lentoyhtiöt (386.2)
alternative label: Liikenne, lentoliikenne (386.2)
alternative label: Liikennealueet, liikenne, asema-alueet, lentoasemat (386.2)
alternative label: Liikennealueet, liikenne, lentokentät (386.2)
alternative label: Liikennehallinto, ilmailuhallinto (386.2)
alternative label: Liikennejärjestelmät, lentoliikenne (386.2)
alternative label: Liikennemaksut, lentoliikenne (386.2)
alternative label: Liikennepalvelut, lentoliikenne (386.2)
alternative label: Liikennepolitiikka, lentoliikenne (386.2)
alternative label: Liikennerajoitukset, lentoliikenne (386.2)
alternative label: Liikennesuunnittelu, lentoliikenne (386.2)
alternative label: Liikennetekniikka, lentoliikenne (386.2)
alternative label: Liikenneverkot, lentoliikenne (386.2)
alternative label: Liikenneväylät, lentoliikenne (386.2)
alternative label: Liikenneyhteydet, lentoliikenne (386.2)
alternative label: Liikennöinti, lentoliikenne (386.2)
alternative label: Läpikulkuliikenne, lentoliikenne (386.2)
alternative label: Matka-aika, lentoliikenne (386.2)
alternative label: Matkakortit, lentoliikenne (386.2)
alternative label: Rahti, lentoliikenne (386.2)
alternative label: Rahtiliikenne, lentoliikenne (386.2)
broader: Vesi- ja ilmaliikenne
in scheme: URN:NBN:fi:au:hklj:
notation: 386.2
related: URN:NBN:fi:au:hklj:320
related: URN:NBN:fi:au:hklj:332.2
related: URN:NBN:fi:au:hklj:342
related: URN:NBN:fi:au:hklj:386.203
related: URN:NBN:fi:au:hklj:386.205
related: URN:NBN:fi:au:hklj:386.209
related: Sotataito. Strategia. Taktiikka
related: Suomen puolustusvoimat
related: Muiden maiden puolustusvoimat
related: URN:NBN:fi:au:hklj:460
related: Avaruustutkimus. Avaruuslennot. Avaruusteknologia
related: Ufot. Ilmakehän tunnistamattomat ilmiöt
related: Ilmakulkuneuvot
related: Lentokoneet
related: Muut ilmakulkuneuvot
related: Kemian teollisuus
related: Öljy. Maakaasu
related: Materiaalitoiminnot. Logistiikka
related: Lento-opetus. Lentotaito
related: URN:NBN:fi:au:hklj:721
related: Kaupunkisuunnittelu. Kaupunkiarkkitehtuuri
related: Moottoriurheilu. Lentourheilu
related: Lentourheilu
scope note: Ilmaliikenteen liikennepolitiikka ja -suunnittelu Lentoliikenne. Siviili-ilmailu. Ilmailu yleensä Lentoreitit, -kentät ja -asemat lentoliikenteen kannalta Lentoliikenteen turvallisuusjärjestelyt. Huolinta ilmaliikenteen kannalta Vaarallisten aineiden kuljetus ilmaliikenteen kannalta Jos teos koskee sekä ilmaliikennettä tai ilmailua että lentokoneita tai muita ilmakulkuneuvoja, on etusija luokalla 386.2
scope note: Trafikpolitik och trafikplanering som rör lufttrafik Flygtrafik. Civilflyg. Luftfart i allmänhet. Flygrutter, flygfält, flygplatser ur flygtrafikens synvinkel Säkerhetsarrangemang som rör flygtrafiken. Spedition ur flygtrafikens synvinkel Transport av farliga ämnen ur flygtrafikens synvinkel Om verket handlar om både lufttrafik eller luftfart och flygplan eller andra luftfarkoster, ges företräde åt klass 386.2 @sv

Paikallisliikenne
type: Class
type: Concept
subclass of: URN:NBN:fi:au:hklj:380
alternative label: Ajettavuus, liikenne (385 ... 387 +)
alternative label: Ajokelpoisuus, liikenne (385 ... 387 +)
alternative label: Ajoreitit, paikallisliikenne (387 +)
alternative label: Alikulut, paikallisliikenne (387 +)
alternative label: Asema-alueet, paikallisliikenteen suunnittelu (387 +)
alternative label: Asemat, paikallisliikenne (387 +)
alternative label: Autoilijat, paikallisliikenne (387 +)
alternative label: Autoilu, paikallisliikenne (387 +)
alternative label: Autoliikenne, paikallisliikenne (387 +)
alternative label: Autopaikat, paikallisliikenne (387 +)
alternative label: Autot, paikallisliikenne (387 +)
alternative label: Bussiliikenne, paikallisliikenne (387 +)
alternative label: Charter-liikenne, maaliikenne (385 ... 387 +)
alternative label: Erikoiskuljetus, paikallisliikenne (387 +)
alternative label: Heiluriliikenne, paikallisliikenne (387 +)
alternative label: Henkilöliikenne, paikallisliikenne (387 +)
alternative label: Hidaskadut, liikennesuunnittelu (387 +)
alternative label: Hidasteet, paikallisliikenne (387 +)
alternative label: Huolinta, paikallisliikenne (387 +)
alternative label: Huoltamot, paikallisliikenne (387 +)
alternative label: Huoltoasemat, paikallisliikenne (387 +)
alternative label: Jakeluasemat, paikallisliikenne (387 +)
alternative label: Jakeluliikenne, paikallisliikenne (387 +)
alternative label: Jalankulkijat, paikallisliikenne (387 +)
alternative label: Jalkakäytävät, paikallisliikenne (387 +)
alternative label: Johdinautoliikenne (387 +)
alternative label: Joukkoliikenne, paikallisliikenne (387 +)
alternative label: Julkinen liikenne, paikallisliikenne (387 +)
alternative label: Junaliikenne, paikallisliikenne (387 +)
alternative label: Kadut, liikennesuunnittelu (387 +)
alternative label: Kadut, paikallisliikenne (387 +)
alternative label: Katuliikenne (387 +)
alternative label: Katumaksut (387 +)
alternative label: Katuverkot (387 +)
alternative label: Kaupunkiliikenne (387 +)
alternative label: Kauttakulkuliikenne, paikallisliikenne (387 +)
alternative label: Kehätiet, paikallisliikenne (387)
alternative label: Kelirikko, paikallisliikenne (387 +)
alternative label: Kevyen liikenteen väylät, paikallisliikenne (387 +)
alternative label: Kevyenliikenteenväylät, paikallisliikenne (387 +)
alternative label: Kevyt liikenne, paikallisliikenne (387 +)
alternative label: Kutsujoukkoliikenne, paikallisliikenne (387 +)
alternative label: Kutsuliikenne, paikallisliikenne (387 +)
alternative label: Kyyditys, paikallisliikenne (387 +)
alternative label: Kävely, liikenne (387 +)
alternative label: Kävelykadut, liikennesuunnittelu (387 +)
alternative label: Kävelyreitit (387 +)
alternative label: Kävelyreitit, paikallisliikenne (387 +)
alternative label: Kävelytiet, liikennesuunnittelu (387 +)
alternative label: Levähdysalueet, paikallisliikenne (387 +)
alternative label: Liikenne, paikallisliikenne (387 +)
alternative label: Liikenneala (385 ... 387 +)
alternative label: Liikennealueet, liikenne, asema-alueet, linja-autoasemat (385 ... 387 +)
broader: URN:NBN:fi:au:hklj:380
in scheme: URN:NBN:fi:au:hklj:
narrower: Helsinki. Pääkaupunkiseutu
notation: 387
related: URN:NBN:fi:au:hklj:320
related: URN:NBN:fi:au:hklj:332.2
related: URN:NBN:fi:au:hklj:342
related: Maaliikenne
related: Vesiliikenne
related: URN:NBN:fi:au:hklj:387.03
related: URN:NBN:fi:au:hklj:387.05
related: URN:NBN:fi:au:hklj:387.09
related: URN:NBN:fi:au:hklj:624
related: Polkupyörät
related: Moottoripyörät. Mopedit
related: Kemian teollisuus
related: Öljy. Maakaasu
related: Materiaalitoiminnot. Logistiikka
related: Liikenneopetus. Liikenneturvallisuus
related: URN:NBN:fi:au:hklj:721
related: Kaupunkisuunnittelu. Kaupunkiarkkitehtuuri
related: Pyöräily
scope note: Maa- ja vesiliikenne paikallisliikenteenä. Paikallisliikennettä koskeva liikennepolitiikka ja liikennesuunnittelu. Ruuhkat paikallisliikenteessä Julkinen ja yksityinen liikenne paikallisliikenteen kannalta Yksityisautoilu ja hyötyliikenne paikallisliikenteen kannalta Tiet, kadut, rautatiet, liikenneväylät ja -verkot, linja-auto-, rautatie- ja metroasemat, paikoitus, tie- ja katutullit ja -maksut paikallisliikenteen kannalta. Autottomat alueet. Jalankulkualueet. Jalankulkuliikenne. Kevyt liikenne. Pyörätiet. Polkupyöräliikenne Raitiotieliikenne. Pikaraitiotieliikenne. Metroliikenne. Paikallisjunaliikenne. Paikallinen linja-autoliikenne Huoltoasematoiminta paikallisliikenteen kannalta Vaarallisten aineiden kuljetus paikallisliikenteen kannalta
scope note: Land- och sjötrafik som lokaltrafik. Trafikpolitik och trafikplanering som rör lokaltrafik. Trafikstockningar i lokaltrafiken Kollektivtrafik och privat trafik ur kollektivtrafikens synvinkel Privatbilism och nyttotrafik ur kollektivtrafikens synvinkel Vägar, gator, järnvägar, trafikleder och trafiknät, busstationer, järnvägsstationer och metrostationer, parkering, väg-och gatutullar samt väg- och gatuavgifter ur kollektivtrafikens synvinkel. Bilfria områden. Områden för gående. Gångtrafik. Lätt trafik. Cykelvägar. Cykeltrafik Spårvagnstrafik.Snabbspårvagnstrafik. Metrotrafik. Trafik med lokaltåg. Lokal busstrafik Bensinstationer ur lokaltrafikens synvinkel Transport av farliga ämnen ur lokaltrafikens synvinkel @sv

Aseteknologia
type: Class
type: Concept
subclass of: URN:NBN:fi:au:hklj:390
alternative label: Abc-aseet (393)
alternative label: Abc-aseet, aseteknologia (393)
alternative label: Ammukset (393)
alternative label: Ampuma-aseet (393)
alternative label: Ampumatarvikkeet (393)
alternative label: Aseenkanto, aseet (393)
alternative label: Aseet (393)
alternative label: Aseet, asetekniikka (393)
alternative label: Aseet, maanpuolustus (393)
alternative label: Aseistus, asetekniikka (393)
alternative label: Aseistus, maanpuolustus (393)
alternative label: Asejärjestelmät, asetekniikka (393)
alternative label: Asejärjestelmät, maanpuolustus (393)
alternative label: Asekokeet, aseteknologia (393)
alternative label: Aselehdet, aseet (393)
alternative label: Aseluvat, aseet (393)
alternative label: Aseoppi (393)
alternative label: Aseteknologia (393)
alternative label: Aseteollisuus (393)
alternative label: Atomienergia, ydinaseet (393)
alternative label: Atomipommit, aseteknologia (393)
alternative label: Atomitekniikka, ydinaseet (393)
alternative label: Atomivoima, ydinaseet (393)
alternative label: Ballistiikka, aseteknologia (393)
alternative label: Bioaseet, aseteknologia (393)
alternative label: Biologinen sodankäynti, biologiset aseet (393)
alternative label: Biologiset aseet (393)
alternative label: Biologiset aseet yl., aseteknologia (393)
alternative label: Fissio, ydinaseet (393)
alternative label: Fuusio, ydinaseet (393)
alternative label: Haulikot, aseteknologia (393)
alternative label: Haulit (393)
alternative label: Hyökkäysvaunut (393)
alternative label: Joukkotuhoaseet (393)
alternative label: Joukkotuhoaseet, aseteknologia (393)
alternative label: Kaasuaseet, aseteknologia (393)
alternative label: Kemialliset aseet (393)
alternative label: Kemialliset aseet, aseteknologia (393)
alternative label: Ketjureaktio, ydinaseet (393)
alternative label: Kilvet, aseet (393)
alternative label: Kiväärit, kiväärit (393)
alternative label: Konekiväärit (393)
alternative label: Konepistoolit (393)
alternative label: Kranaatit (393)
alternative label: Kuljetuskalusto, armeijan (393)
alternative label: Kypärät, puolustusvoimat (393)
alternative label: Käsiaseet (393)
alternative label: Käsiaseet, asetekniikka (393)
alternative label: Lataus, asetekniikka (393)
alternative label: Lavetit, kuljetuskalusto, armejan (393)
broader: URN:NBN:fi:au:hklj:390
in scheme: URN:NBN:fi:au:hklj:
notation: 393
related: URN:NBN:fi:au:hklj:320
related: URN:NBN:fi:au:hklj:325
related: Rauhankysymys. Rauhantutkimus
related: URN:NBN:fi:au:hklj:332.2
related: URN:NBN:fi:au:hklj:340
related: Organisaatioiden ja laitosten sosiologia
related: Asevarustelu. Asekauppa
related: URN:NBN:fi:au:hklj:393.09
related: Sotahistoria
related: Suomi
related: Avaruustutkimus. Avaruuslennot. Avaruusteknologia
related: Ydinfysiikka. Atomifysiikka. Molekyylifysiikka
related: Mekaniikka
related: KEMIA
related: Sovellettu kemia
related: Energia
related: Laivat. Laivanrakennus
related: Muut vesikulkuneuvot
related: Muut ilmakulkuneuvot
related: URN:NBN:fi:au:hklj:631
related: Metsästys
related: Ammunta
scope note: Aseet. Aseteknologia. Aseteollisuus. Tavanomaiset, biologiset, kemialliset ja ydinaseet aseteknologian ja -teollisuuden kannalta. Käsiaseet. Hyökkäysvaunut. Tykit. Ohjukset. Muut taisteluvälineet. Ballistiikka Aseiden keräily Jos teoksessa on sekä asevarustelua tai asekauppaa että aseteknologiaa tai aseteollisuutta, on etusija luokalla 391
scope note: Vapen. Vapenteknik. Vapenindustri. Konventionella, biologiska och kemiska vapen samt kärnvapen ur vapenteknikens och vapenhandelns. synvinkel. Handvapen. Stridsvagnar. Kanoner. Robotar. Övrig krigsmateriel. Ballistik Vapensamlande Om verket handlar om såväl upprustning och vapenhandel som vapenteknik och vapenindustri, ges företräde åt klass 391 @sv

Lappi
type: Class
type: Concept
subclass of: Pohjois-Pohjanmaa. Kainuu. Koillismaa
alternative label: Autiotuvat, Lapin matkailu (412.91)
alternative label: Kaamos, Lappi (412.91)
alternative label: Kämpät, Lapin matkailu (412.91)
alternative label: Lapin lääni (412.91)
alternative label: Lapin lääni, maantiede, matkat (412.91)
alternative label: Lapinkylät, maantiede, matkat, Suomi (412.91)
alternative label: Lappalaiset, Suomen Lappi (412.91)
alternative label: Lappi, Suomen Lappi (412.91)
alternative label: Luovutetut alueet, vuoteen 1944, Petsamo (412.91)
alternative label: Luovutetut alueet, vuoteen 1944, Sallan alue (412.91)
alternative label: Metsäkämpät, Lapin matkailu (412.91)
alternative label: Napapiirit, Suomen Lappi (412.91)
alternative label: Petsamo, vuoteen 1944 (412.91)
alternative label: Ruska, kuvateokset, Lappi (412.91)
alternative label: Ruska, matkailu, Lappi (412.91)
alternative label: Saamelaiset, Suomen Lappi (412.91)
alternative label: Saamelaiskylät, maantiede, matkat, Suomi (412.91)
alternative label: Sallan alue, vuoteen 1944 (412.91)
alternative label: Tunturit, maantiede, Suomi (412.91)
alternative label: Tunturivaellus, matkaoppaat, Suomen Lappi (412.91)
alternative label: Avträdda områden, till år 1944, Petsamo (412.91) @sv
alternative label: Avträdda områden, till år 1944, Sallaområdet (412.91) @sv
alternative label: Baracker, Lapplands turism (412.91) @sv
alternative label: Fjäll, geografi, Finland (412.91) @sv
alternative label: Fjällvandring, resehandböcker, finska Lappland (412.91) @sv
alternative label: Höstfärger, illustrerade verk, Lappland (412.91) @sv
alternative label: Höstfärger, turism, Lappland (412.91) @sv
alternative label: Lappar, Finska Lappland (412.91) @sv
alternative label: Lappland, Finska Lappland (412.91) @sv
alternative label: Lapplands län (412.91) @sv
alternative label: Lapplands län, geografi, resor (412.91) @sv
alternative label: Lappvisten, geografi, resor, Finland (412.91) @sv
alternative label: Petsamo, till år 1944 (412.91) @sv
alternative label: Polcirklar, Finska Lappland (412.91) @sv
alternative label: Sallaområdet, till år 1944 (412.91) @sv
alternative label: Samebyar, geografi, resor, Finland (412.91) @sv
alternative label: Samer, Finska Lappland (412.91) @sv
alternative label: Skogsarbetarbaracker, Lapplands turism (412.91) @sv
alternative label: Vintermörker, Lappland (412.91) @sv
alternative label: Ödemarksstugor, Lapplandsturism (412.91) @sv
broader: Pohjois-Pohjanmaa. Kainuu. Koillismaa
in scheme: URN:NBN:fi:au:hklj:
notation: 412.91
preferred label: Lapland @en
preferred label: Lappland @sv
related: URN:NBN:fi:au:hklj:411
related: Ruotsi
related: Norja
related: Itä-Eurooppa
related: Venäjä
related: Arktis, pohjoiset napamaat
related: URN:NBN:fi:au:hklj:460
related: URN:NBN:fi:au:hklj:920
related: URN:NBN:fi:au:hklj:929
related: Venäjän historia
related: Venäjän historia vuoteen 1917
related: Venäjän vanha ja keskiaika
related: Venäjän historia 1682-1856
related: Venäjän historia 1857-1917
related: Neuvostoliiton historia 1917-1991
related: Neuvostoliiton historia 1917-1938
related: Neuvostoliiton historia 1939-1945
related: Neuvostoliiton historia 1945-1991
related: Venäjän historia 1992-
related: Ukrainan, Valko-Venäjän ja Moldovan historia
related: Ukrainan historia
related: Valko-Venäjän historia
related: Moldovan historia
scope note: Lapin lääni Menetetyt Sallan ja Petsamon alueet vuoteen 1944
scope note: Lapplands län De avträdda Petsamo- och Sallaområdena till 1944 @sv

Armenia. Azerbaidzan. Georgia. Kazakstan. Kirgisia. Tadzikistan. Turkmenistan. Uzbekistan
type: Class
type: Concept
subclass of: AASIA
alternative label: Armenia (423)
alternative label: Armenia, maantiede, matkat (423)
alternative label: Azerbaidzan (423)
alternative label: Azerbaidzan, maantiede, matkat (423)
alternative label: Georgia, IVY-maat (423)
alternative label: Jakutia (423)
alternative label: Jakutia, maantiede, matkat (423)
alternative label: Kamtsatka (423)
alternative label: Kamtsatka, maantiede, matkat (423)
alternative label: Kasakat, Aasia (423)
alternative label: Kaukasia (423)
alternative label: Kaukasia, maantiede, matkat (423)
alternative label: Kazakstan (423)
alternative label: Kazakstan, maantiede, matkat (423)
alternative label: Keski-Aasia, IVY-maat (423)
alternative label: Kirgisia (423)
alternative label: Kirgisia, maantiede, matkat (423)
alternative label: Kuriilit, Venäjä (423)
alternative label: Neuvostoliitto, Aasian puoleiset maat (423)
alternative label: Sahalin (423)
alternative label: Sahalin, maantiede, matkat (423)
alternative label: Siperia (423)
alternative label: Siperia, maantiede, matkat (423)
alternative label: Tadzikistan (423)
alternative label: Tadzikistan, maantiede, matkat (423)
alternative label: Tsetsenia (423)
alternative label: Tsetsenia, maantiede, matkat (423)
alternative label: Turkmenistan (423)
alternative label: Turkmenistan, maantiede, matkat (423)
alternative label: Uzbekistan (423)
alternative label: Uzbekistan, maantiede, matkat (423)
alternative label: Venäjä, Aasian puoleiset alueet (423)
alternative label: Venäläiset, Venäjä, Aasian puoleinen (423)
alternative label: Armenien (423) @sv
alternative label: Armenien, geografi, resor (423) @sv
alternative label: Azerbajdzjan (423) @sv
alternative label: Azerbajdzjan, geografi, resor (423) @sv
alternative label: Centralasien, OSS-länder (423) @sv
alternative label: Georgien, OSS-länder (423) @sv
alternative label: Jakutien (423) @sv
alternative label: Jakutien, geografi, resor (423) @sv
alternative label: Kamtjatka (423) @sv
alternative label: Kamtjatka, geografi, resor (423) @sv
alternative label: Kaukasien (423) @sv
alternative label: Kaukasien, geografi, resor (423) @sv
alternative label: Kazakstan, geografi, resor (423) @sv
alternative label: Kirgisien (423) @sv
alternative label: Kirgisien, geografi, resor (423) @sv
alternative label: Kosacker, Asien (423) @sv
broader: AASIA
in scheme: URN:NBN:fi:au:hklj:
notation: 423
related: Itä-Eurooppa
related: Venäjä
related: Moskova
related: Pietari
related: Ukraina
related: Valko-Venäjä
related: Moldova
related: Keski-Aasia
related: Venäjän historia
related: Venäjän historia vuoteen 1917
related: Venäjän vanha ja keskiaika
related: Venäjän historia 1682-1856
related: Venäjän historia 1857-1917
related: Neuvostoliiton historia 1917-1991
related: Neuvostoliiton historia 1917-1938
related: Neuvostoliiton historia 1939-1945
related: Neuvostoliiton historia 1945-1991
related: Venäjän historia 1992-
related: Ukrainan, Valko-Venäjän ja Moldovan historia
related: Ukrainan historia
related: Valko-Venäjän historia
related: Moldovan historia
related: Armenian, Azerbaidzanin, Georgian, Kazakstanin, Kirgisian, Tadzikistanin, Turkmenistanin ja Uzbekistanin historia
scope note: Venäjän ja Venäjän federaation Aasian puoleiset alueet. Siperia Kaukasuksen alue. Armenia. Azerbaidzan. Georgia. Kazakstan. Kirgisia. Tadzikistan. Turkmenistan. Uzbekistan
scope note: De asiatiska områdena av Ryssland och Ryska federationen. Sibirien Kaukasus. Armenien. Azerbajdjan. Georgien. Kazakstan. Kirgisistan. Tadjikistan. Turkmenistan. Uzbekistan @sv

Ilman suojelu
type: Class
type: Concept
subclass of: Ympäristönsuojelu. Luonnonsuojelu
alternative label: Aerosolit, ilman saasteet (508.64)
alternative label: Alailmakehä, suojelu (508.64)
alternative label: CFC-yhdisteet, ilmansaasteet (508.64)
alternative label: CFC-yhdisteet, kasvihuoneilmiö (508.64)
alternative label: CSS-tekniikka (508.64)
alternative label: F-kaasut, kasvihuonekaasut (508.64)
alternative label: Filtterit, ilmansuojelu (508.64)
alternative label: Fossiiliset polttoaineet, ilman saastuminen (508.64)
alternative label: Fossiiliset polttoaineet, kasvihuoneilmiö (508.64)
alternative label: Freonit, kasvihuoneilmiö (508.64)
alternative label: Haihtuvat orgaaniset yhdisteet, ilmansaasteet (508.64)
alternative label: Hajuhaitat, ilmansuojelu (508.64)
alternative label: Hapan laskeuma, ilman saastuminen (508.64)
alternative label: Happosateet, ilman saastuminen (508.64)
alternative label: Hiilen kierto, kasvihuoneilmiö (508.64)
alternative label: Hiilen talteenotto ja varastointi (508.64)
alternative label: Hiilidioksidi, kasvihuoneilmiö (508.64)
alternative label: Hiilidioksidin talteenotto ja varastointi (508.64)
alternative label: Hiilijalanjälki (508.64)
alternative label: Hiilimonoksidi, ilman saasteet (508.64)
alternative label: Hiilineutraalius (508.64)
alternative label: Hiilipaino (508.64)
alternative label: Hiukkaset, ilmansaasteet (508.64)
alternative label: Hivenkaasut, kasvihuonekaasut (508.64)
alternative label: Häkä, ilmansaasteet (508.64)
alternative label: Ilma, ilman suojelu (508.64)
alternative label: Ilmakehä, suojelu (508.64)
alternative label: Ilman laatu, ilmansaasteet (508.64)
alternative label: Ilman laatu, ilmansuojelu (508.64)
alternative label: Ilman lämpötila, kasvihuoneilmiö (508.64)
alternative label: Ilman saastuminen (508.64)
alternative label: Ilmanlaatu, ilmansaasteet (508.64)
alternative label: Ilmanlaatu, ilmansuojelu (508.64)
alternative label: Ilmanpuhdistimet, ilmansuojelu (508.64)
alternative label: Ilmansaasteet (508.64)
alternative label: Ilmansuojelu (508.64)
alternative label: Ilmansuojelutekniikka (508.64)
alternative label: Ilmasto, kasvihuoneilmiö (508.64)
alternative label: Ilmastomallit, kasvihuoneilmiö (508.64)
alternative label: Ilmastonmuutokset, kasvihuoneilmiö (508.64)
alternative label: Ilmastonsuojelu (508.64)
alternative label: Ilmastopaino (508.64)
alternative label: Ilmastopolitiikka (508.64)
alternative label: Ilmastotutkimus, kasvihuoneilmiö (508.64)
alternative label: Jätekaasut, ilman saastuminen (508.64)
alternative label: Jätekaasut, ilmansuojelu (508.64)
alternative label: Jäätiköt, kasvihuoneilmiö (508.64)
alternative label: Kasvihuoneilmiö (508.64)
alternative label: Kasvihuonekaasut (508.64)
broader: Ympäristönsuojelu. Luonnonsuojelu
in scheme: URN:NBN:fi:au:hklj:
notation: 508.64
related: Etiikka. Moraalifilosofia
related: Ympäristöoikeus. Talousoikeus
related: URN:NBN:fi:au:hklj:342
related: Kehitysmaiden taloudelliset olot
related: Aluepolitiikka. Ympäristöpolitiikka
related: Meteorologia. Klimatologia
related: BIOLOGIA
related: Ekologia. Eliömaantiede
related: URN:NBN:fi:au:hklj:613.3
related: URN:NBN:fi:au:hklj:613.31
related: URN:NBN:fi:au:hklj:620
related: Energia
related: Sähköenergian tuottaminen. Voimalatekniikka
related: Paperi- ja selluloosateollisuus
related: Kaivos- ja kaivannaisteollisuus
related: Orgaanisen kemian teollisuus
related: Kivihiili. Turve
related: Öljy. Maakaasu
related: URN:NBN:fi:au:hklj:650
related: URN:NBN:fi:au:hklj:675
related: Markkinointi. Asiakaspalvelu
related: Kuluttajanvalistus
related: Luonnon- ja kulttuurimaiseman suunnittelu
scope note: Ilmakehän suojelu. Ilman laatu. Ilman saastuminen Ilmansaasteet ja niiden vaikutukset luontoon ja ihmiseen Otsonikato. Kasvihuoneilmiö Ilmansuojelutekniikka yleensä Tiettyyn teollisuudenalaan tai kulkuneuvoon liittyvä ilmansuojelutekniikka alan mukaisessa luokassa
scope note: Luftvård med hänsyn till atmosfären. Luftens kvalitet. Luftföroreningar Luftföroreningarnas inverkan på naturen och människorna Ozonminskningen. Växthuseffekten Luftvårdsteknik i allmänhet Luftvårdsteknik som rör en bestämd industrisektor eller ett enskilt transportmedel klassificeras enligt område @sv

Hoitotiede. Hoitotyö. Hoitohenkilökunta
type: Class
type: Concept
subclass of: LÄÄKETIEDE. TERVEYDENHOITO
alternative label: Avohoito, sairaanhoito (610.7 +)
alternative label: Avokuntoutus, sairaanhoito (610.7 +)
alternative label: Avosairaanhoito (610.7 +)
alternative label: Biopankit, potilasasiakirjat (610.7 +)
alternative label: Empowerment, potilaat (610.7 +)
alternative label: Erikoissairaanhoito, hoitotyö (610.7)
alternative label: Etälääketiede (610.7 +)
alternative label: Hoito, hoitotyö (610.7 +)
alternative label: Hoitoala, lääketieteellinen hoitotyö (610.7 +)
alternative label: Hoitoetiikka (610.7)
alternative label: Hoitohenkilöstö, hoitoala (610.7 +)
alternative label: Hoitoisuus, hoitotiede (610.7 +)
alternative label: Hoitoketjut (610.7 +)
alternative label: Hoitokulttuuri, hoitotiede (610.7)
alternative label: Hoitomyönteisyys, potilaan asema (610.7 +)
alternative label: Hoitomyöntyvyys, potilaan asema (610.7 +)
alternative label: Hoitopolku (610.7 +)
alternative label: Hoitoprosessit (610.7 +)
alternative label: Hoitopäätökset (610.7 +)
alternative label: Hoitosuhde (610.7 +)
alternative label: Hoitotakuu, hoitotiede (610.7 +)
alternative label: Hoitotiede (610.7 +)
alternative label: Hoitotyö (610.7 +)
alternative label: Hoitotyön psykologia (610.7 +)
alternative label: Hoitovaste, hoitotiede (610.7 +)
alternative label: Hoitoyhteisöt (610.7 +)
alternative label: Hoitoympäristö, lääketiede (610.7 +)
alternative label: Hoiva-ala, hoitotyö (610.7 +)
alternative label: Hoivatyö, hoitotyö (610.7 +)
alternative label: Huolenpito, hoitotyö (610.7 +)
alternative label: Ihmissuhdetyö, hoitotyö (610.7 +)
alternative label: Interaktiivisuus, hoitosuhde (610.7 +)
alternative label: Kotisairaalat (610.7 +)
alternative label: Kotisairaanhoito (610.7 +)
alternative label: Kroonikot, hoitotiede (610.7 +)
alternative label: Kroonikot, sairaalapsykologia (610.7 +)
alternative label: Kroonikot, sairaalasosiologia (610.7 +)
alternative label: Kudospankit, potilasasiakirjat (610.7 +)
alternative label: Laitostuminen, hoitoyhteisö (610.7 +)
alternative label: Laitteistot, sairaalatekniikka (610.7)
alternative label: Lähetteet, lääketiede (610.7 +)
alternative label: Näyttöön perustuva hoito, hoitotiede (610.7 +)
alternative label: Näyttöön perustuva hoitotyö, hoitotiede (610.7 +)
alternative label: Näyttöön perustuvat käytännöt, hoitotyö (610.7 +)
alternative label: Omaiset, hoitoyhteisö (610.7 +)
alternative label: Omaishoitajat, hoitotyö (610.7 +)
alternative label: Omaishoito, hoitotyö (610.7 +)
alternative label: Omaisjärjestöt, lääketieteelliset (610.7)
alternative label: Omavoimaistuminen, potilaat (610.7 +)
alternative label: Omavoimaisuus, potilaat (610.7 +)
alternative label: Osallistaminen, hoitotyö (610.7 +)
alternative label: Pakkohoito, potilaan asema (610.7 +)
alternative label: Pakkoruokinta, potilaan asema (610.7 +)
broader: LÄÄKETIEDE. TERVEYDENHOITO
in scheme: URN:NBN:fi:au:hklj:
narrower: Hoitolaitokset. Sairaalatekniikka
narrower: Lääketieteen opinnot
narrower: Lääkärin työ
narrower: Sairaanhoitajan ja terveydenhoitajan työ
notation: 610.7
related: URN:NBN:fi:au:hklj:120
related: URN:NBN:fi:au:hklj:332.22
related: URN:NBN:fi:au:hklj:371.6
related: Lääketieteen filosofia ja etiikka
related: Terveydenhoito
related: URN:NBN:fi:au:hklj:613.1
related: Henkilökohtainen terveydenhoito
related: Jooga
related: URN:NBN:fi:au:hklj:613.3
related: URN:NBN:fi:au:hklj:613.31
related: Lastenhoito
related: URN:NBN:fi:au:hklj:613.5
related: Seksologia
related: URN:NBN:fi:au:hklj:615
related: URN:NBN:fi:au:hklj:617
scope note: Hoitotiede, hoitotyö ja hoitohenkilökunta yleensä Sairaanhoidon yleisteokset, jotka koskevat sekä lääkärin että sairaanhoitajan työtä Hoitotyön psykologia yleensä. Hoitoyhteisö yleensä Sairaalapsykologia ja sairaalasosiologia yleensä Potilaan asema ja oikeudet hoitoyhteisössä yleensä Hoitovirheet ja potilasvahingot yleensä Lääketieteen erikoisaloihin liittyvä hoitotiede, hoitotyö ja hoitohenkilökunta alan mukaisessa luokassa
scope note: Vårdvetenskap, vårdarbete och vårdpersonal i allmänhet Allmänna arbeten i sjukvård som rör både läkarens och sjukskötarens arbete Vårdarbetets psykologi i allmänhet. Vårdgemenskapen i allmänhet Sjukhuspsykologi och sjukhussociologi i allmänhet Patientens ställning och rättigheter i vårdgemenskapen i allmänhet Felbehandlingar och patientskador i allmänhet Frågor om vårdvetenskap, vårdarbete och vårdpersonal som rör medicinska specialområden klassificeras enligt område @sv

Diabetes
type: Class
type: Concept
subclass of: Sisäelimet. Sisätaudit
alternative label: Aikuisdiabetes (617.32)
alternative label: Aikuisiän diabetes (617.32)
alternative label: Aikuistyypin diabetes (617.32)
alternative label: Diabetes (617.32)
alternative label: Dieettikeittokirjat, diabetes (617.32)
alternative label: Gestaatiodiabetes, diabetes (617.32)
alternative label: Glykeeminen indeksi, diabetes (617.32)
alternative label: Glykeeminen kuorma, diabetes (617.32)
alternative label: Glykemia-annos, diabetes (617.32)
alternative label: Glykemiaindeksi, diabetes (617.32)
alternative label: Glykemiakuorma, diabetes (617.32)
alternative label: Haima, diabetes (617.32)
alternative label: Haimasairaudet, diabetes (617.32)
alternative label: Haimataudit, diabetes (617.32)
alternative label: Hypoglykemia, verensokeri, diabetes (617.32)
alternative label: Insuliini, diabetes (617.32)
alternative label: Kakkostyypin diabetes (617.32)
alternative label: Kooma, diabetes (617.32)
alternative label: Metformiini, lääkkeet, diabetes (617.32)
alternative label: Nuoruusdiabetes (617.32)
alternative label: Nuoruusiän diabetes (617.32)
alternative label: Nuoruustyypin diabetes (617.32)
alternative label: Raskausdiabetes, diabetes (617.32)
alternative label: Raskaussokeritauti, diabetes (617.32)
alternative label: Sokeristumisindeksi, diabetes (617.32)
alternative label: Sokeritauti (617.32)
alternative label: Sokeroitumisindeksi, diabetes (617.32)
alternative label: Tyypin 1 diabetes (617.32)
alternative label: Tyypin 2 diabetes (617.32)
alternative label: Verensokeri, diabetes (617.32)
alternative label: Barn- och ungdomsdiabetes (617.32) @sv
alternative label: Blodsocker, diabetes (617.32) @sv
alternative label: Bukspottkörteln, diabetes (617.32) @sv
alternative label: Bukspottkörtelns sjukdomar, diabetes (617.32) @sv
alternative label: Diabetes av vuxentyp (617.32) @sv
alternative label: Diabetes typ 2 (617.32) @sv
alternative label: Dietkokböcker, diabetes (617.32) @sv
alternative label: Gestationsdiabetes, diabetes (617.32) @sv
alternative label: Graviditetsdiabetes, diabetes (617.32) @sv
alternative label: Hypoglykemi, blodsocker, diabetes (617.32) @sv
alternative label: Insulin, diabetes (617.32) @sv
alternative label: Koma, diabetes (617.32) @sv
alternative label: Metformin, mediciner, diabetes (617.32) @sv
alternative label: Pankreassjukdomar, diabetes (617.32) @sv
alternative label: Sockerindex, diabetes (617.32) @sv
alternative label: Sockersjuka (617.32) @sv
alternative label: Typ 1-diabetes (617.32) @sv
alternative label: Typ 2-diabetes (617.32) @sv
alternative label: Ungdomsdiabetes (617.32) @sv
broader: Sisäelimet. Sisätaudit
in scheme: URN:NBN:fi:au:hklj:
notation: 617.32
related: URN:NBN:fi:au:hklj:181.9
related: URN:NBN:fi:au:hklj:332.22
related: URN:NBN:fi:au:hklj:371.6
related: URN:NBN:fi:au:hklj:373
related: URN:NBN:fi:au:hklj:576
related: Anatomia
related: URN:NBN:fi:au:hklj:612
related: URN:NBN:fi:au:hklj:613.1
related: URN:NBN:fi:au:hklj:613.3
related: URN:NBN:fi:au:hklj:613.31
related: URN:NBN:fi:au:hklj:613.5
related: URN:NBN:fi:au:hklj:615
related: URN:NBN:fi:au:hklj:615.1
related: URN:NBN:fi:au:hklj:615.3
related: URN:NBN:fi:au:hklj:615.8
related: URN:NBN:fi:au:hklj:616
related: URN:NBN:fi:au:hklj:616.2
related: URN:NBN:fi:au:hklj:616.3
related: URN:NBN:fi:au:hklj:617.1
related: URN:NBN:fi:au:hklj:617.4
related: URN:NBN:fi:au:hklj:617.7
related: URN:NBN:fi:au:hklj:691.1
related: URN:NBN:fi:au:hklj:691.12
scope note: Diabetes eli sokeritauti, sen ennaltaehkäisy, diagnostiikka, hoito ja patologia. Insuliinihoito Diabeetikkojen ruokavaliot ja keittokirjat
scope note: Diabetes (sockersjuka), förebyggande och behandling av den, dess diagnostik och patologi. Insulinbehandling Dieter och kokböcker för diabetiker @sv

Tiet. Kadut. Tienrakennus. Kadunrakennus
type: Class
type: Concept
subclass of: URN:NBN:fi:au:hklj:624
alternative label: Ajokaistat, tien- ja kadunrakennus (624.2)
alternative label: Alikulkutunnelit, tien- ja kadunrakennus (624.2)
alternative label: Alikulut, tien- ja kadunrakennus (624.2)
alternative label: Asfaltointi, tien- ja kadunrakennus (624.2)
alternative label: Asfaltti, tienpäällystys (624.2)
alternative label: Auraus, talvikunnossapito (624.2)
alternative label: Autopaikat, rakentaminen (624.2)
alternative label: Bitumi, tienpäällystys (624.2)
alternative label: Geotekniikka, tien- ja kadunrakennus (624.2)
alternative label: Hidaskadut, kadunrakennus (624.2)
alternative label: Hidasteet, kadun-ja tienrakennus (624.2)
alternative label: Hiekoitus (624.2)
alternative label: Jalkakäytävät, kadunrakennus (624.2)
alternative label: Jäävauriot, tiet, kadut (624.2)
alternative label: Kadunrakennus (624.2)
alternative label: Kadut, kadunrakennus (624.2)
alternative label: Kaistat, tien- ja kadunrakennus (624.2)
alternative label: Kallionleikkaus, tierakennus (624.2)
alternative label: Kantatiet (624.2)
alternative label: Katupöly, kunnossapito, kadut ja tiet (624.2)
alternative label: Katuvalaistus (624.2)
alternative label: Kaupunkirakentaminen, kadunrakennus (624.2)
alternative label: Kehätiet, tienrakennus (624.2)
alternative label: Kevyen liikenteen väylät, tien- ja kadunrakennus (624.2)
alternative label: Kevyenliikenteenväylät, tien- ja kadunrakennus (624.2)
alternative label: Kulkuväylät, tiet, rakentaminen ja ylläpito (624.2)
alternative label: Kunnonvalvonta, kadut ja tiet (624.2)
alternative label: Kunnossapito, kadut ja tiet (624.2)
alternative label: Kävelykadut, kadunrakennus (624.2)
alternative label: Kävelytiet, tienrakennus (624.2)
alternative label: Levähdysalueet, tien- ja kadunrakennus (624.2)
alternative label: Liikennealueet, rakentaminen, asema-alueet, linja-autoasemat (624.2)
alternative label: Liikennealueet, rakentaminen, kadut ja tiet (624.2)
alternative label: Liikennealueet, rakentaminen, pysäköintialueet (624.2)
alternative label: Liikennevalot, tien- ja kadunrakennus (624.2)
alternative label: Liikenneväylät, tien-ja kadunrakennus (624.2)
alternative label: Liikenneyhteydet, tiet (624.2)
alternative label: Liittymät, tien- ja kadunrakennus (624.2)
alternative label: Liukkaus, teiden ja katujen kunnossapito (624.2)
alternative label: Lumenluonti, katujen ja teiden ylläpito (624.2)
alternative label: Lumenpoisto, katujen ja teiden ylläpito (624.2)
alternative label: Lumi, katujen ja teiden ylläpito (624.2)
alternative label: Lumityöt, katujen ja teiden ylläpito (624.2)
alternative label: Lumivauriot, kadut ja tiet (624.2)
alternative label: Lyhdyt, katulyhdyt (624.2)
alternative label: Maaliikenneväylät, tien-ja kadunrakennus (624.2)
alternative label: Maanrakennus, tien- ja kadunrakennus (624.2)
alternative label: Maantiet, tienrakennus (624.2)
alternative label: Maarakennus, tien- ja kadunrakennus (624.2)
broader: URN:NBN:fi:au:hklj:624
in scheme: URN:NBN:fi:au:hklj:
notation: 624.2
related: URN:NBN:fi:au:hklj:380
related: Maaliikenne
related: URN:NBN:fi:au:hklj:460
related: Yleinen konetekniikka
related: Koneenrakennus. Pneumatiikka. Hydrauliikka
related: Voimakoneet. Moottorit. Nosto- ja kuljetuslaitteet
related: URN:NBN:fi:au:hklj:624.209
related: Sillat. Sillanrakennus
related: Raideliikenneväylät. Junat. Raitiovaunut. Metro
related: Autot
related: Muut vesikulkuneuvot
related: Lentokoneet
related: Sähkövalo
related: URN:NBN:fi:au:hklj:631
related: URN:NBN:fi:au:hklj:660
related: Rakennusstatiikka. Rakennusaineet
related: Tekninen rakennussuunnittelu
related: Geotekniikka. Maatyöt
related: Moottoriurheilu. Lentourheilu
related: Autourheilu
related: Moottoripyöräurheilu
related: Moottoriveneurheilu
related: Lentourheilu
scope note: Rakennusstatiikka, tekninen rakennussuunnittelu sekä geotekniikka ja maatyöt tien- ja kadunrakennuksen kannalta Sora- ja asfalttitiet, moottoritiet, kadut, paikoitusalueet, katuvalaistus, liittymät, maantietunnelit, kävely- ja pyörätiet sekä niiden rakentaminen ja kunnossapito Asfaltointi. Lanaus. Talvikunnossapito. Hiekoitus. Suolaus Routavauriot sekä niiden ehkäisy ja korjaaminen Jos teoksessa on sekä maaliikennettä että liikenneväylien tai kulkuneuvojen tekniikkaa, on etusija luokilla 385 ja 387+
scope note: Byggnadsstatik, teknisk byggnadsplanering samt geoteknik och anläggningsarbeten ur väg- och gatubyggnadssynvinkel Grus- och asfaltvägar, motorvägar, gator, parkeringsområden, gatubelysning, anslutningar, vägtunnlar, gång- och cykelvägar samt byggande och underhåll av dem Asfaltering. Sladdning. Vinterunderhåll. Sandning. Saltning Tjälskador samt förebyggande och reparation av dem Om verket handlar om både landtrafik och trafikledernas eller kommunikationsmedlens teknik, ges företräde åt klasserna 385 och 387+ @sv

Sähkötekniikka
type: Class
type: Concept
subclass of: URN:NBN:fi:au:hklj:620
alternative label: Akut, sähkötekniikka (627)
alternative label: Anodit, sähkötekniikka (627 +)
alternative label: Aurinkokennot, sähkötekniikka (627)
alternative label: Aurinkoparistot, sähkötekniikka (627)
alternative label: EMC (627 +)
alternative label: Elektrodit, sähkötekniikka (627 +)
alternative label: Elektroluminesenssi, sähkötekniikka (627)
alternative label: Elektrolyysitekniikka (627)
alternative label: Elektrolyytit, tekninen sähkökemia (627)
alternative label: Galvanotekniikka (627)
alternative label: Hopeointi, galvanotekniikka (627)
alternative label: Häiriösuojaus, sähkötekniikka (627 +)
alternative label: Kaapeliteollisuus (627 +)
alternative label: Kaapeliverkot, sähkötekniikka (627)
alternative label: Katodit, sähkötekniikka (627 +)
alternative label: Komponentit, sähkötekniikka (627 +)
alternative label: Lataus, akut (627)
alternative label: Latauslaitteet, sähkötekniikka (627 +)
alternative label: Laturit, sähkötekniikka (627 +)
alternative label: Liitännät, sähkötekniikka (627 +)
alternative label: Loissähkö, tekniikka (627 +)
alternative label: Loisteho, tekniikka (627 +)
alternative label: Lämpösähköisyys, sähkötekniikka (627)
alternative label: Maakaapelit, kaapeliteollisuus (627 +)
alternative label: Mikroelektrodit, sähkötekniikka (627 +)
alternative label: Määräykset, sähkötekniikka (627 +)
alternative label: Paristot (627)
alternative label: Pinnoitus, galvanotekniikka (627)
alternative label: Polttokennot (627)
alternative label: Resistanssi, sähkötekniikka (627 +)
alternative label: Resonanssi, sähkötekniikka (627 +)
alternative label: Sinkitys (627)
alternative label: Suprajohtavuus, sähkötekniikka (627 +)
alternative label: Suprajohteet, sähkötekniikka (627 +)
alternative label: Suuntaajat, sähkötekniikka (627 +)
alternative label: Suurnopeustekniikka, sähkötekniikka (627 +)
alternative label: Sähkö, tekniikka (627 +)
alternative label: Sähköala, sähkötekniikka (627 +)
alternative label: Sähköala, sähkötekninen teollisuus (627 +)
alternative label: Sähköiset ominaisuudet, sähkötekniikka (627 +)
alternative label: Sähköisyys, sähkötekniikka (627 +)
alternative label: Sähköjärjestelmät (627 +)
alternative label: Sähkökemia, tekninen (627 +)
alternative label: Sähkökennot (627)
alternative label: Sähkökentät, sähkötekniikka (627 +)
alternative label: Sähkömagneetit, sähkötekniikka (627 +)
alternative label: Sähkömagneettinen yhteensopivuus (627 +)
alternative label: Sähköoppi, tekninen sähköoppi (627 +)
alternative label: Sähköpiirustus (627 +)
alternative label: Sähköpurkaukset, sähkötekniikka (627 +)
alternative label: Sähkösuunnittelu (627 +)
alternative label: Sähkötarkastus (627 +)
alternative label: Sähkötarvikkeet (627 +)
alternative label: Sähkötekniikka (627 +)
alternative label: Sähköteollisuus (627 +)
broader: URN:NBN:fi:au:hklj:620
in scheme: URN:NBN:fi:au:hklj:
narrower: Sähkövalo
narrower: Sähköenergian muuttaminen, muuntaminen, jakelu ja siirto
narrower: Sähkönmittaustekniikka. Sähkönsäätötekniikka
narrower: Sähköenergian tuottaminen. Voimalatekniikka
narrower: URN:NBN:fi:au:hklj:627.7
narrower: Elektroniikka
notation: 627
related: Sähköoppi. Magnetismi
related: FYSIKAALINEN KEMIA
related: Energia
related: URN:NBN:fi:au:hklj:620.88
related: Raideliikenneväylät. Junat. Raitiovaunut. Metro
related: Autot
related: URN:NBN:fi:au:hklj:667.7
related: URN:NBN:fi:au:hklj:667.71
related: Uunit. Takat
related: URN:NBN:fi:au:hklj:681
related: Toimistokoneet
scope note: Sähkötekniikan ja vahvavirtatekniikan yleisteokset Teknisen sähköopin yleisteokset Tekninen sähkökemia. Akut. Paristot. Sähkökennot Galvanotekniikka. Elektrolyysitekniikka. Lämpösähköisyys tekniikan kannalta Sähkötekninen teollisuus yleensä Sähkötekniikan sovellukset eri aloille sekä erikoisalojen sähkökäyttöiset koneet ja laitteet alan mukaisessa luokassa
scope note: Allmänna verk som rör elteknik och starkströmsteknik Allmänna verk som rör teknisk ellära Teknisk elektrokemi. Ackumulatorer. Batterier. Solceller Galvanoteknik. Elektrolysteknik. Termoelektricitet ur teknisk synvinkel Elektroteknisk industri i allmänhet Tillämpningar av elteknik inom olika områden samt eldrivna maskiner och apparater för specialområden klassificeras enligt område @sv

Öljy. Maakaasu
type: Class
type: Concept
subclass of: Orgaanisen kemian teollisuus
alternative label: Asfaltti, kemianteollisuus (649.2)
alternative label: Bensiini (649.2)
alternative label: Biodiesel (649.2)
alternative label: Biokaasu, polttoaineet (649.2)
alternative label: Biokaasulaitokset (649.2)
alternative label: Biokaasulaitokset , biokaasu (649.2)
alternative label: Bitumi, kemianteollisuus (649.2)
alternative label: Dieselöljy (649.2)
alternative label: Energiateknologia, maakaasun teknologia (649.2)
alternative label: Energiateknologia, öljyn teknologia (649.2)
alternative label: Kaasulaitokset (649.2)
alternative label: Kaasumaiset polttoaineet (649.2)
alternative label: Kaasuntuotanto (649.2)
alternative label: Kaasut, polttoaineteknologia (649.2)
alternative label: Kaasut, öljynjalostusteollisuus (649.2)
alternative label: Kaasuöljy (649.2)
alternative label: Kansainvälinen öljykauppa (649.2)
alternative label: Kerosiinit (649.2)
alternative label: Kevyt polttoöljy (649.2)
alternative label: Liuskekaasu, jalostus, tuotanto, kauppa, teknologia (649.2)
alternative label: Liuskeöljy, jalostus, tuotanto, kauppa, teknologia (649.2)
alternative label: Luonnonkaasu, kaasuntuotanto (649.2)
alternative label: Luonnonkaasu, maakaasuteknologia (649.2)
alternative label: Lyijytön bensiini (649.2)
alternative label: Maakaasu, kaasuntuotanto (649.2)
alternative label: Maakaasu, maakaasuteknologia (649.2)
alternative label: Maakaasuteknologia (649.2)
alternative label: Maaöljy (649.2)
alternative label: Maaöljy, jalostus, tuotanto, kauppa (649.2)
alternative label: Maaöljy, polttoaineteknologia (649.2)
alternative label: Moottoripolttoaineet (649.2)
alternative label: Nestekaasu, öljynjalostusteollisuus (649.2)
alternative label: Nestemäiset polttoaineet (649.2)
alternative label: Nesteytetty maakaasu, kaasuntuotanto (649.2)
alternative label: OPEC (649.2)
alternative label: Orgaaniset polttoaineet, maakaasu (649.2)
alternative label: Orgaaniset polttoaineet, öljy (649.2)
alternative label: Palavat nesteet, polttoaineet (649.2)
alternative label: Paloöljy (649.2)
alternative label: Parafiinit, kemianteollisuus (649.2)
alternative label: Petrokemia (649.2)
alternative label: Petrokemian teollisuus (649.2)
alternative label: Petroli (649.2)
alternative label: Piki, kemianteollisuus (649.2)
alternative label: Polttoaineet, maakaasu (649.2)
alternative label: Polttoaineet, öljy (649.2)
alternative label: Polttokaasut (649.2)
alternative label: Polttonesteet (649.2)
alternative label: Polttoöljy (649.2)
broader: Orgaanisen kemian teollisuus
in scheme: URN:NBN:fi:au:hklj:
notation: 649.2
related: URN:NBN:fi:au:hklj:380
related: URN:NBN:fi:au:hklj:384
related: Posti
related: Radio- ja televisiotoiminta
related: Radiotoiminta
related: URN:NBN:fi:au:hklj:384.42
related: Lehdistöoppi
related: Maaliikenne
related: Vesi- ja ilmaliikenne
related: Vesiliikenne
related: Ilmaliikenne. Ilmailu
related: Paikallisliikenne
related: Helsinki. Pääkaupunkiseutu
related: Geomorfologia. Geodynamiikka
related: Vesien suojelu
related: Ilman suojelu
related: Orgaaninen kemia. Muovien kemia
related: Energia
related: Vesijohto-, viemäri- ja vedenpuhdistustekniikka
related: Sähköenergian tuottaminen. Voimalatekniikka
related: Kaivos- ja kaivannaisteollisuus
related: Kemian teollisuus
related: URN:NBN:fi:au:hklj:667.71
scope note: Öljyn ja maakaasun teknologia, jalostus, tuotanto ja kauppa Öljynjalostusteollisuus. Petrokemian teollisuus Raakaöljy. Öljystä ja maakaasusta saatavat polttoaineet Polttoöljyt. Nestekaasut. Bensiinit. Petrolit. Dieselöljyt
scope note: Teknologi, förädling, produktion och handel som rör olja och naturgas Oljeraffineringsindustri. Petrokemisk industri Råolja. Oljebaserade och naturgasbaserade bränslen Brännolja. Flytgaser. Bensiner. Fotogen. Dieseloljor @sv

Kalastus
type: Class
type: Concept
subclass of: Metsästys. Kalastus
alternative label: Ahven, kalastus (658.2)
alternative label: Ajoverkkokalastus (658.2)
alternative label: Akvakulttuuri, kalanviljely (658.2)
alternative label: Ammattikalastus (658.2)
alternative label: Ankerias, kalastus (658.2)
alternative label: Catch and release -kalastus (658.2)
alternative label: Eräelämä, kalastusoppaat (658.2)
alternative label: Erätaidot, kalastustaidot (658.2)
alternative label: Erätalous, kalastus (658.2)
alternative label: Harjus, kalastus (658.2)
alternative label: Hauki, kalastus (658.2)
alternative label: Heittokalastus (658.2)
alternative label: Helmenkalastus (658.2)
alternative label: Helmenpyynti (658.2)
alternative label: Hoitokalastus (658.2)
alternative label: Houkutteet, kalastus (658.2)
alternative label: Houkuttimet, kalastus (658.2)
alternative label: Istukkaat, kalat (658.2)
alternative label: Istutus, kalanistustus (658.2)
alternative label: Jokikalastus (658.2)
alternative label: Jokirapu, ravunpyynti (658.2)
alternative label: Järvikalastus (658.2)
alternative label: Kalakannat, kalastus (658.2)
alternative label: Kalakantojen hoito (658.2)
alternative label: Kalalammikot, kalastus (658.2)
alternative label: Kalanistutus (658.2)
alternative label: Kalanjalostus (658.2)
alternative label: Kalankasvatus (658.2)
alternative label: Kalanpyydykset (658.2)
alternative label: Kalanviljely (658.2)
alternative label: Kalanviljelylaitokset (658.2)
alternative label: Kalastajat, kalastajan työ (658.2)
alternative label: Kalasto, kalastus (658.2)
alternative label: Kalastuksenhoito (658.2)
alternative label: Kalastus (658.2)
alternative label: Kalastus, ammattikalastus (658.2)
alternative label: Kalastus, urheilukalastus (658.2)
alternative label: Kalastus, vapaa-ajan kalastus (658.2)
alternative label: Kalastusalueet (658.2)
alternative label: Kalastuskunnat (658.2)
alternative label: Kalastusluvat (658.2)
alternative label: Kalastusmatkailu, kalastus (658.2)
alternative label: Kalastusoikeus (658.2)
alternative label: Kalastuspaikat (658.2)
alternative label: Kalastuspolitiikka (658.2)
alternative label: Kalastusseurat (658.2)
alternative label: Kalastusvälineet (658.2)
alternative label: Kalastusvälineet, kalastus (658.2)
alternative label: Kalastusyhdistykset (658.2)
broader: Metsästys. Kalastus
in scheme: URN:NBN:fi:au:hklj:
notation: 658.2
related: URN:NBN:fi:au:hklj:1.4
related: Maa- ja metsätalouslainsäädäntö
related: Hydrologia
related: Uhanalaiset lajit. Luonnonsuojelualueet
related: Vesien suojelu
related: Ekologia. Eliömaantiede
related: URN:NBN:fi:au:hklj:590
related: Eläinsuojelu
related: Kalat
related: Nisäkkäät
related: Vesirakennus. Vesikulkuneuvot
related: Vesikulkuneuvot
related: Laivat. Laivanrakennus
related: URN:NBN:fi:au:hklj:625.72
related: Muut vesikulkuneuvot
related: URN:NBN:fi:au:hklj:649.91
related: Maatalouspolitiikka
related: URN:NBN:fi:au:hklj:650.2
related: Akvaariot
related: URN:NBN:fi:au:hklj:657
related: Metsästys
related: Kalaruoat
related: Uinti. Sukellus
scope note: Kalatalous. Kalastuspolitiikka. Kalastuksen taloudellinen merkitys Kalastuksen liiketalous ja organisaatio. Kalakauppa Kalakannan ja kalavesien hoito. Kalojen istutus. Kalaportaat ja kalatiet sekä niiden rakentaminen. Kalastusluvat ja -rajoitukset Kalastustavat ja -välineet. Kalanpyydykset. Verkon pauloitus. Perhon sidonta Ammattikalastus. Urheilukalastus. Vapaa-ajan kalastus. Merikalastus. Sisävesikalastus Valaanpyynti Kalanviljely. Kalanviljelylaitokset
scope note: Fiskeri. Fiskeripolitik. Fiskets ekonomiska betydelse Företagsekonomi och organisation inom fiskeri. Fiskhandel Skötsel av fiskstammar och fiskevatten. Utplantering av fisk. Fisktrappor och fiskvägar och byggande av dem. Fiskelicenser och fiskebegränsningar Fiskemetoder. Fiskeredskap. Fiskebragder. Telning av nät. Flugbindning Yrkesfiske. Sportfiske. Fritidsfiske. Havsfiske. Insjöfiske Valfångst Fiskodling. Fiskodlingar @sv

Rakennustyöt. Rakennusaineet. Rakennustarvikkeet
type: Class
type: Concept
subclass of: Talonrakennus
alternative label: Betoni, talonrakennus (667.1)
alternative label: Betonirakennukset, betonirakenteet, talonrakennus (667.1)
alternative label: Betonirakenteet, talonrakennus (667.1)
alternative label: Betoniraudoitus, talonrakennus (667.1)
alternative label: Betonointi, talonrakennus (667.1)
alternative label: Esirakentaminen, talonrakennus (667.1)
alternative label: Geotekniikka, talonrakennus (667.1 +)
alternative label: Harkot, talonrakennus (667.1)
alternative label: Helat, talonrakennus (667.1)
alternative label: Hirret, talonrakennus (667.1)
alternative label: Hirsirakennukset, talonrakennus (667.1)
alternative label: Hirsirakentaminen, talonrakennus (667.1)
alternative label: Hirsirakenteet, talonrakennus (667.1)
alternative label: Kaakelilaatat, talonrakennus (667.1)
alternative label: Kaakelit, talonrakennus (667.1)
alternative label: Kaivu, talonrakennus (667.1)
alternative label: Kaivutekniikka, talonrakennus (667.1)
alternative label: Kelopuut, talonrakennus (667.1)
alternative label: Keraamiset laatat, talonrakennus (667.1)
alternative label: Keraamiset materiaalit, talonrakennus (667.1)
alternative label: Kertopuu, talonrakennus (667.1)
alternative label: Kevytbetoni, talonrakennus (667.1)
alternative label: Kiinnitys, tekniikka, talonrakennus (667.1)
alternative label: Kiinnitystarvikkeet, talonrakennus (667.1)
alternative label: Kiinnitystekniikka, talonrakennus (667.1)
alternative label: Kipsilevyt, talonrakennus (667.1)
alternative label: Kirvesmiehet, kirvesmiehen työ (667.1)
alternative label: Kivi, talonrakennus (667.1)
alternative label: Kiviaines, talonrakennus (667.1)
alternative label: Kivirakennukset, kivirakenteet, talonrakennus (667.1)
alternative label: Kivirakenteet, talonrakennus (667.1)
alternative label: Klinkkerilaatat, talonrakennus (667.1)
alternative label: Klinkkerit, talonrakennus (667.1)
alternative label: Kovalevyt, talonrakennus (667.1)
alternative label: Kuitulevyt, talonrakennus (667.1)
alternative label: Käsityökalut, talonrakennus (667.1)
alternative label: Laatat, rakennuksen laatoitustyöt (667.1)
alternative label: Laatoitus (667.1)
alternative label: Lasirakenteet, talonrakennus (667.1)
alternative label: Lastulevyt, talonrakennus (667.1)
alternative label: Laudat, talonrakennus (667.1)
alternative label: Levyt, rakentaminen, talonrakennus (667.1 +)
alternative label: Liimapuurakenteet, talonrakennus (667.1)
alternative label: Liittäminen, talonrakennus (667.1)
alternative label: Louhinta, talonrakennus (667.1)
alternative label: Luonnonkivi, talonrakennus (667.1)
alternative label: Luonnonmateriaalit, talonrakennus (667.1)
alternative label: Maankaivu, talonrakennus (667.1)
alternative label: Maanrakennus, talonrakennus (667.1 +)
alternative label: Maarakennus, talonrakennus (667.1 +)
alternative label: Maatyöt, talonrakennus (667.1 +)
broader: Talonrakennus
in scheme: URN:NBN:fi:au:hklj:
narrower: Muuraus. Rappaus
narrower: Maalaustyöt
notation: 667.1
related: Energia
related: Raideliikenneväylät. Junat. Raitiovaunut. Metro
related: Puuteollisuus
related: Lasiteollisuus. Keraaminen teollisuus. Sementtiteollisuus
related: Kemian teollisuus
related: Rakennusstatiikka. Rakennusaineet
related: Tekninen rakennussuunnittelu
related: Geotekniikka. Maatyöt
related: Rakenneosat
related: URN:NBN:fi:au:hklj:667.7
related: URN:NBN:fi:au:hklj:667.71
related: Uunit. Takat
related: Rakennuksen kunnossapito
related: Metallityö
related: Puutyö. Huonekalut. Verhoilu
related: Sisustusoppaat
related: URN:NBN:fi:au:hklj:720
related: URN:NBN:fi:au:hklj:721
related: URN:NBN:fi:au:hklj:726
scope note: Rakennustyöt, rakennusaineet, rakennustarvikkeet, rakennustyökalut ja rakennuskoneet talonrakennuksessa Puu, betoni, sementti, kivi, mineraalit, kalkki, tiili, savi, maa, metallit, teräs, muovit ja lasi rakennusaineina talonrakennuksen kannalta Betoni-, teräsbetoni-, metalli-, teräs-, puu-, laatoitus- ja kiveystyöt sekä lasitus, tapetointi ja muut viimeistelytyöt talonrakennuksen kannalta Tässä myös tiettyä rakennustyötä, -ainetta tai -tarviketta talon kunnossapidon ja korjauksen kannalta koskevat teokset
scope note: Byggnadsarbeten, byggmaterial, byggvaror, byggverktyg och byggmaskiner inom husbyggnad Trä, betong, cement, sten, mineraler, kalk, tegel, lera, jord, metaller, stål, plast och glas som byggmaterial ur husbyggnadssynvinkel Betongarbete, arbete med armerad betong, metall-, stål-, trä-, kakel- och stenläggningsarbete samt glasinsättning och tapetsering och andra slutförande arbeten ur husbyggnadssynvinkel Hit också verk som handlar om ett bestämt byggnadsarbete, byggmaterial eller en bestämd byggvara som hänför sig till underhåll och reparation av hus @sv

Puutyö. Huonekalut. Verhoilu
type: Class
type: Concept
subclass of: HIENOMEKANIIKKA. KÄSI- JA KOTITEOLLISUUS
alternative label: Arkut, käsityöohjeet (684)
alternative label: Entistäminen, huonekalut (684)
alternative label: Himmelit (684)
alternative label: Huonekalut, entisöinti (684)
alternative label: Huonekalut, rakentaminen käsityönä (684)
alternative label: Huonekalut, verhoilu käsityönä (684)
alternative label: Hyllyt, puutyöt (684)
alternative label: Höyläkoneet, puusepän työ (684)
alternative label: Höylät, puusepän työ (684)
alternative label: Höyläys, puusepän työ (684)
alternative label: Istuimet, huonekalujen rakentaminen (684)
alternative label: Istuimet, verhoilu (684)
alternative label: Juurityöt (684)
alternative label: Kaapit, puutyöt (684)
alternative label: Kaappikellot, rakennusohjeet (684)
alternative label: Kalusteet, rakentaminen käsityönä (684)
alternative label: Kalusteet, verhoilu käsityönä (684)
alternative label: Kangaspuut, rakentaminen (684)
alternative label: Kansanomaiset huonekalut, puutyöohjeet (684)
alternative label: Kataja, puutyöt (684)
alternative label: Kehdot, puutyöohjeet (684)
alternative label: Keittiökalusteet, huonekalujen rakentaminen (684)
alternative label: Kiillotus, puutyöohjeet (684)
alternative label: Koivu, puutyöt (684)
alternative label: Konservointi, huonekalut (684)
alternative label: Kontit, kansatiede, tuohityöt (684)
alternative label: Korinpunonta (684)
alternative label: Korit (684)
alternative label: Korityöt (684)
alternative label: Korkki, korkkityöt (684)
alternative label: Kuviosahaus (684)
alternative label: Kynttilänjalat, puutyöohjeet (684)
alternative label: Käsityökalut, puusepän työ (684)
alternative label: Käsityöt, puutyöt (684)
alternative label: Käsityöt, verhoilu (684)
alternative label: Käyttöesineet, puutyöt (684)
alternative label: Lakat, huonekalujen lakkaus (684)
alternative label: Lakat, puutyöt (684)
alternative label: Lakkatyöt, huonekalujen lakkaus (684)
alternative label: Lakkatyöt, puutyöt (684)
alternative label: Lakkaus, huonekalujen lakkaus (684)
alternative label: Lastutyöt (684)
alternative label: Lehtisahaus (684)
alternative label: Liimaus, puutyöt (684)
alternative label: Linnunpöntöt, rakentaminen (684)
alternative label: Lintulaudat, rakentaminen (684)
alternative label: Lääkekaapit, rakentaminen (684)
alternative label: Naulakot, huonekalut (684)
alternative label: Niinityöt (684)
alternative label: Ohjekirjat, puutyöt (684)
alternative label: Olki, käsityöt (684)
alternative label: Olkityöt (684)
broader: HIENOMEKANIIKKA. KÄSI- JA KOTITEOLLISUUS
in scheme: URN:NBN:fi:au:hklj:
notation: 684
related: URN:NBN:fi:au:hklj:473
related: URN:NBN:fi:au:hklj:473.1
related: URN:NBN:fi:au:hklj:475
related: URN:NBN:fi:au:hklj:475.1
related: URN:NBN:fi:au:hklj:476
related: URN:NBN:fi:au:hklj:476.1
related: URN:NBN:fi:au:hklj:476.11
related: URN:NBN:fi:au:hklj:476.12
related: URN:NBN:fi:au:hklj:476.5
related: URN:NBN:fi:au:hklj:476.6
related: URN:NBN:fi:au:hklj:476.7
related: URN:NBN:fi:au:hklj:476.8
related: Puuteollisuus
related: Rakennustyöt. Rakennusaineet. Rakennustarvikkeet
related: Kodin korjaustöiden oppaat
related: Sisustusoppaat
related: URN:NBN:fi:au:hklj:760
related: Taidepuutyöt
related: Huonekalutaide
related: URN:NBN:fi:au:hklj:798
scope note: Puutyöohjeet ja -mallit Puusepän työ. Puusepänverstaat. Verhoilijan työ. Kotiverhoomot Huonekalujen valmistaminen, verhoilu, koristelu ja entisöinti käsityön ja kotiteollisuuden kannalta Kori-, olki- , korkki-, lastu-, juuri-, tuohi- ja tulitikkutyöohjeet
scope note: Arbetsinstruktioner och modeller för träarbete Snickarens arbete. Snickerier. Tapetserarens arbete. Tapetserarverkstäder ur hantverkssynvinkel Möbeltillverkning, möbeltapetsering, möbeldekoration och möbelrestaurering ur hantverks- och hemslöjdssynvinkel Korg-, halm-, kork-, spån-, rot-, näver- och tändsticksarbeten @sv

Kaupunkisuunnittelu. Kaupunkiarkkitehtuuri
type: Class
type: Concept
subclass of: URN:NBN:fi:au:hklj:720
alternative label: Aluerakentaminen, asemakaavat (727 +)
alternative label: Aluerakentaminen, kaupunkisuunnittelu (727 +)
alternative label: Aluesuunnittelu, asemakaavat (727 +)
alternative label: Aluesuunnittelu, kaupunkisuunnittelu (727 +)
alternative label: Aluevaraukset, asemakaavat (727 +)
alternative label: Aluevaraukset, kaupunkisuunnittelu (727 +)
alternative label: Arkkitehtuuri, asemakaavat (727 +)
alternative label: Arkkitehtuuri, kaupunkisuunnittelu (727 +)
alternative label: Arkkitehtuuripiirustukset, asemakaavat (727 +)
alternative label: Arkkitehtuuripiirustukset, kaupunkisuunnittelu (727 +)
alternative label: Asemakaavat (727 +)
alternative label: Asemakaavoitus (727 +)
alternative label: Asuinalueet, kaavoitus, kaupungit (727 +)
alternative label: Asumalähiöt, kaupunkisuunnittelu (727 +)
alternative label: Asuntoalueet, asemakaavat (727 +)
alternative label: Asuntoalueet, kaupunkisuunnittelu (727 +)
alternative label: Asutuskeskukset, asemakaavat (727 +)
alternative label: Aukiot, kaupunkiarkkitehtuuri (727 +)
alternative label: Campus Allegro, arkkitehtuuri (727)
alternative label: Detaljikaavat, asemakaavat (727 +)
alternative label: Elinympäristö, yhteiskunta, kaupunkisuunnittelu (727 +)
alternative label: Erityisalueet, asemakaavoitus (727 +)
alternative label: Esikaupungit, asemakaavat (727 +)
alternative label: Esikaupungit, kaupunkiarkkitehtuuri (727 +)
alternative label: Fyysinen ympäristö, kaupunkisuunnittelu (727 +)
alternative label: Havainnekuvat, asemakaavoitus (727 +)
alternative label: Huoltoalueet, asemakaavat (727 +)
alternative label: Huoltoalueet, kaupunkisuunnittelu (727 +)
alternative label: Huoltoasemat, kaupunkisuunnittelu (727 +)
alternative label: Joutomaa, kaupunkisuunnittelu (727 +)
alternative label: Kaava-alueet, kaupunkialueet (727 +)
alternative label: Kaavanimet, asemakaavoitus, paikannimet (727 +)
alternative label: Kaavat, asemakaavat (727 +)
alternative label: Kaavoitus, kaupunkialueet (727 +)
alternative label: Kaavoitusalueet, kaupunkialueet (727 +)
alternative label: Kadunkalusteet (727 +)
alternative label: Kampukset, arkkitehtuuri (727 +)
alternative label: Katuympäristö, kaupunkisuunnittelu (727 +)
alternative label: Kaupunginosat, kaupunkisuunnittelu (727 +)
alternative label: Kaupungit, asemakaavat, kaavoitus (727 +)
alternative label: Kaupunkialueet, kaupunkisuunnittelu (727 +)
alternative label: Kaupunkiarkkitehtuuri (727 +)
alternative label: Kaupunkikeskustat, asemakaavat (727 +)
alternative label: Kaupunkikeskustat, kaupunkiarkkitehtuuri (727 +)
alternative label: Kaupunkikeskustat, kaupunkisuunnittelu (727 +)
alternative label: Kaupunkikulttuuri, kaupunkisuunnittelu (727 +)
alternative label: Kaupunkikuva, kaupunkisuunnittelu (727 +)
alternative label: Kaupunkiluonto, kaupunkisuunnittelu (727 +)
alternative label: Kaupunkimallit (727 +)
alternative label: Kaupunkirakenne, kaupunkisuunnittelu (727 +)
alternative label: Kaupunkirakentaminen, kaupunkisuunnittelu (727 +)
broader: URN:NBN:fi:au:hklj:720
in scheme: URN:NBN:fi:au:hklj:
narrower: Helsinki. Pääkaupunkiseutu
notation: 727
related: Aluepolitiikka. Ympäristöpolitiikka
related: Asuntopolitiikka
related: URN:NBN:fi:au:hklj:380
related: URN:NBN:fi:au:hklj:384
related: Posti
related: Radio- ja televisiotoiminta
related: Radiotoiminta
related: URN:NBN:fi:au:hklj:384.42
related: Lehdistöoppi
related: Maaliikenne
related: Vesi- ja ilmaliikenne
related: Vesiliikenne
related: Ilmaliikenne. Ilmailu
related: Paikallisliikenne
related: Helsinki. Pääkaupunkiseutu
related: Arkkitehtuurin teoria, estetiikka ja filosofia
related: Arkkitehtuurikilpailut. Arkkitehtuurinäyttelyt. Arkkitehtuuripalkinnot
related: URN:NBN:fi:au:hklj:720.9
related: URN:NBN:fi:au:hklj:721
related: Luonnon- ja kulttuurimaiseman suunnittelu
scope note: Kaupunkisuunnittelu ja kaupunkiarkkitehtuuri sekä niiden historia, henkilöhistoria, tekniikka, teoria, filosofia ja estetiikka Kaupunkeja koskeva alueellinen suunnittelu sekä ympäristö- ja yhdyskuntasuunnittelu Kaupunkien keskustojen ja liikekeskusten suunnittelu Kaupunginosien, esikaupunkien ja lähiöiden suunnittelu Kaupunkien asunto-, opetus-, yliopisto-, kulttuuri-, liike-, virasto-, sairaala-, teollisuus-, liikenne- ja varastoalueiden suunnittelu Kaupunkien kaavoitus ja sen historia. Kaupunkien yleiskaavat, osayleiskaavat, vaihekaavat, asemakaavat, rakennuskaavat ja rantakaavat Asemakaavaoppi. Asemakaava-arkkitehtuuri
scope note: Stadsplanering och stadsarkitektur samt deras historia, personhistoria, teknik, teori, filosofi och estetik Regionplanering, miljöplanering och samhällsplanering som rör städer Planering av städernas centrum och affärscentrum Planering av stadsdelar, förstäder och förorter Planering av städernas bostads-, skol-, universitets-, kultur-, affärs-, sjukhus-, industri-, trafik-, och lagerområden samt områden för ämbetshus Fysisk planering av städer och dess historia. Städernas generalplaner, delgeneralplaner, etapplaner, stadsplaner, byggnadsplaner och strandplaner Stadsplanelära Stadsplanearkitektur @sv

Piirustuksen materiaalit ja tekniikka
type: Class
type: Concept
subclass of: URN:NBN:fi:au:hklj:749.1
alternative label: Aiheet, piirustusoppaat (749.11)
alternative label: Alastonmalli, piirustustaiteen tekniikka (749.11)
alternative label: Anatomia, piirustustaito (749.11)
alternative label: Anatomia, taiteilijoille (749.11)
alternative label: Asetelmat, piirustustaiteen tekniikka (749.11)
alternative label: Camera obscura, piirustustaiteen tekniikka (749.11)
alternative label: Eläinaiheet, piirustustaiteen tekniikka (749.11)
alternative label: Elävän mallin piirustus, piirustustaiteen tekniikka (749.11)
alternative label: Harrastukset, piirustus (749.11)
alternative label: Hiilipiirustus (749.11)
alternative label: Jäljentäminen, piirustuksen tekniikka (749.11)
alternative label: Kasviaiheet, piirustusoppaat (749.11)
alternative label: Keho, anatomia taiteilijoille (749.11)
alternative label: Kopiointi, piirustuksen tekniikka (749.11)
alternative label: Liitu, piirustuksen tekniikka (749.11)
alternative label: Luonnokset, piirustustaide, tekniikka (749.11)
alternative label: MElävän mallin piirustus, piirustustaiteen tekniikka (749.11)
alternative label: Mallipiirustus, oppaat (749.11)
alternative label: Muotisuunnittelijat, piirustustaide (749.11)
alternative label: Muotitaiteilijat, piirustustaide (749.11)
alternative label: Muotokuvat, piirustustaiteen tekniikka (749.11)
alternative label: Ohjekirjat, piirustus (749.11)
alternative label: Omakuvat, piirustustaide, tekniikka (749.11)
alternative label: Perspektiivi, taide (749.11)
alternative label: Piirtäminen, piirustuksen tekniikka (749.11)
alternative label: Piirustus, piirustuksen tekniikka (749.11)
alternative label: Piirustusvälineet (749.11)
alternative label: Projektio, piirustuksen tekniikka (749.11)
alternative label: Sommittelu, piirustuksen oppaat (749.11)
alternative label: Taideharrastukset, piirustuksen tekniikka (749.11)
alternative label: Tussityöt, piirustuksen tekniikka (749.11)
alternative label: Vartalo, anatomia taiteilijoille (749.11)
alternative label: Anatomi, färdighet i teckning (749.11) @sv
alternative label: Anatomi, för konstnärer (749.11) @sv
alternative label: Anledningar, teckningshandledningar (749.11) @sv
alternative label: Camera obscura, teckningens teknik (749.11) @sv
alternative label: Djurmotiv, teckningskonstens teknik (749.11) @sv
alternative label: Figuren, anatomi för konstnärer (749.11) @sv
alternative label: Hobbyer, ritning (749.11) @sv
alternative label: Instruktionsböcker, ritning (749.11) @sv
alternative label: KModellteckning, teckningskonstens teknik (749.11) @sv
alternative label: Kolteckning (749.11) @sv
alternative label: Komposition, bildkonst, teckningshandböcker (749.11) @sv
alternative label: Konstintressen, teckningens teknik (749.11) @sv
alternative label: Kopiering, reproducering, teckningskonstens teknik (749.11) @sv
alternative label: Krita, teckningskonstens teknik (749.11) @sv
alternative label: Kroppen, keho, anatomi för konstnärer (749.11) @sv
alternative label: Modekonstnärer, teckningskonst (749.11) @sv
alternative label: Modellteckning, handböcker (749.11) @sv
broader: URN:NBN:fi:au:hklj:749.1
in scheme: URN:NBN:fi:au:hklj:
notation: 749.11
related: URN:NBN:fi:au:hklj:1.791
related: Koneenrakennus. Pneumatiikka. Hydrauliikka
related: Tekstiili- ja vaatetusteollisuus
related: Tekninen rakennussuunnittelu
related: Oppikirjat. Harjoituskirjat. Tehtäväkokoelmat. Taiteen materiaalit ja tekniikka. Taidekasvatus
related: URN:NBN:fi:au:hklj:709
related: URN:NBN:fi:au:hklj:720
related: Maalaustaiteen teoria, estetiikka ja filosofia
related: URN:NBN:fi:au:hklj:740.9
related: URN:NBN:fi:au:hklj:741
related: URN:NBN:fi:au:hklj:741.1
related: URN:NBN:fi:au:hklj:741.2
related: URN:NBN:fi:au:hklj:742
related: GRAAFINEN TAIDE. VALOKUVAUS
related: Kuvitustaide
related: Taidegrafiikka
related: Taidegrafiikan materiaalit ja tekniikka
related: Paperitaide
related: Kirjallisuuden aihepiirejä ja kirjallisuustyyppejä koskeva historia ja tutkimus
related: Lasten- ja nuortenkirjallisuuden historia ja tutkimus
related: Suomenkielisen kirjallisuuden aihepiirejä ja kirjallisuustyyppejä koskeva historia ja tutkimus
related: Suomenkielisen lasten- ja nuortenkirjallisuuden historia ja tutkimus
related: Muodin historia
scope note: Käytännön piirustusoppaat. Piirustustaito yleensä Piirustuspaperit ja -kynät. Hiilipiirustus Anatomia taiteilijoille. Mallipiirustuksen oppaat Perspektiivi- ja projektio-oppi Muoti- ja sarjakuvapiirustuksen materiaalit ja tekniikka Jos teoksessa on sekä piirustus- että maalaustaiteen materiaaleja tai tekniikkaa, on etusija luokalla 741+
scope note: Praktiska handböcker i teckning. Konsten att teckna i allmänhet Teckningspapper och ritpennor. Kolteckning Anatomi för konstnärer. Handböcker i modellteckning Perspektiv- och projektionslära Modellteckningens och serieteckningens material och tekniker Om verket rör både teckningskonstens och målarkonstens material och tekniker ges företräde åt klass 741+ @sv

Amerikka
type: Class
type: Concept
subclass of: URN:NBN:fi:au:hklj:777.9
alternative label: Amerikka, elokuva (777.98 +)
alternative label: Etelä-Amerikka, elokuva (777.98)
alternative label: Pohjois-Amerikka, elokuva (777.98 +)
alternative label: Amerika, film (777.98 +) @sv
alternative label: Nordamerika, film (777.98 +) @sv
alternative label: Sydamerika, film (777.98) @sv
broader: URN:NBN:fi:au:hklj:777.9
in scheme: URN:NBN:fi:au:hklj:
narrower: Yhdysvallat
notation: 777.98
preferred label: America @en
preferred label: Amerika @sv
related: URN:NBN:fi:au:hklj:1.4
related: URN:NBN:fi:au:hklj:1.84
related: URN:NBN:fi:au:hklj:1.944
related: URN:NBN:fi:au:hklj:2.84
related: URN:NBN:fi:au:hklj:2.94
related: URN:NBN:fi:au:hklj:3.4
related: URN:NBN:fi:au:hklj:384.42
related: URN:NBN:fi:au:hklj:4.4
related: URN:NBN:fi:au:hklj:5.4
related: URN:NBN:fi:au:hklj:6.4
related: URN:NBN:fi:au:hklj:7.4
related: URN:NBN:fi:au:hklj:709
related: URN:NBN:fi:au:hklj:710
related: URN:NBN:fi:au:hklj:756
related: Teatteri- ja näyttämötaiteen teoria, estetiikka ja filosofia
related: URN:NBN:fi:au:hklj:770.9
related: Elokuvatekniikka. Videokuvauksen tekniikka
related: URN:NBN:fi:au:hklj:783.67
related: URN:NBN:fi:au:hklj:783.68

Musiikin teoria
type: Class
type: Concept
subclass of: MUSIIKKI
alternative label: Aiheet, musiikin teoria (782 +)
alternative label: Algoritminen musiikki, musiikin teoria (782 +)
alternative label: Fraasit, musiikin teoria (782 +)
alternative label: Musiikin teoria (782 +)
alternative label: Musiikinteoria (782 +)
alternative label: Musiikki, musiikin teoria (782 +)
alternative label: Musiikkianalyysi, musiikin teoria (782 +)
alternative label: Ragat, musiikin teoria (782 +)
alternative label: Säveltaide, musiikin teoria (782 +)
alternative label: Temporaalisuus, musiikin teoria (782 +)
alternative label: Algoritmisk musik, musikens teori (782 +) @sv
alternative label: Anledningar, musikens teori (782 +) @sv
alternative label: Fraser, musikens teori (782 +) @sv
alternative label: Musik, musikteori (782 +) @sv
alternative label: Musikanalys, musikens teori (782 +) @sv
alternative label: Musikens teori (782 +) @sv
alternative label: Musikkonst, musikteori (782 +) @sv
alternative label: Musikteori (782 +) @sv
alternative label: Ragor, musikens teori (782 +) @sv
alternative label: Temporalitet, musikteori (782 +) @sv
broader: MUSIIKKI
in scheme: URN:NBN:fi:au:hklj:
narrower: Rytmioppi
narrower: Säveloppi
narrower: Sointuoppi
narrower: URN:NBN:fi:au:hklj:782.4
narrower: Muoto-oppi
narrower: URN:NBN:fi:au:hklj:782.6
narrower: Johtaminen
narrower: Musiikin tulkinta. Tyylioppi
narrower: Notaatio
notation: 782
preferred label: Music theory @en
preferred label: Musikteori @sv
related: Musiikin filosofia, estetiikka, psykologia ja sosiologia Musiikkikasvatus. Musiikkiopetus
related: Musiikin estetiikka ja filosofia
related: Musiikin psykologia. Musiikin akustiikka
related: Musiikin sosiologia. Musiikkipolitiikka
related: URN:NBN:fi:au:hklj:781.5
scope note: Tässä musiikin teorian ja musiikkiopin yleisteokset Tässä ja alaluokissa musiikin teoria ja musiikkioppi musiikin lajista riippumatta Tässä ja alaluokissa myös musiikin teoriaa ja musiikkioppia koskevat oppikirjat ja oppimateriaalit
scope note: Hit allmänna verk om musikteori och musiklära Hit och till underklasserna musikteori och musiklära oavsett musikslag Hit och till underklasserna också läroböcker och läromedel i musikteori och musiklära @sv

Kaakkois-Aasia
type: Class
type: Concept
subclass of: Aasia
alternative label: Gamelanmusiikki (784.24)
alternative label: Gamelanorkesteri (784.24)
alternative label: Gamelanmusik (784.24) @sv
alternative label: Gamelanorkester (784.24) @sv
broader: Aasia
in scheme: URN:NBN:fi:au:hklj:
notation: 784.24
preferred label: South-East Asia @en
preferred label: Sydöstasien @sv
related: URN:NBN:fi:au:hklj:473.1
related: URN:NBN:fi:au:hklj:769
related: URN:NBN:fi:au:hklj:783
related: URN:NBN:fi:au:hklj:783.1
related: Australia. Uusi-Seelanti. Uusi-Guinea
related: URN:NBN:fi:au:hklj:784.9
related: URN:NBN:fi:au:hklj:787
related: URN:NBN:fi:au:hklj:787.2
related: Itämaisten uskontojen musiikki
related: Islamilaisten uskonnollinen musiikki
related: URN:NBN:fi:au:hklj:787.29
related: URN:NBN:fi:au:hklj:788.8
related: URN:NBN:fi:au:hklj:789
related: Varhaiskansojen musiikki
related: URN:NBN:fi:au:hklj:795.1
related: URN:NBN:fi:au:hklj:797.2
related: URN:NBN:fi:au:hklj:807
scope note: Brunei. Burma (Myanmar). Filippiinit. Indonesia. Kamputsea. Laos. Malesia. Singapore. Thaimaa. Vietnam
scope note: Brunei. Burma (Myanmar). Filippinerna. Indonesien. Kambodja (Kampuchea). Laos. Malaysia. Singapore. Thailand. Vietnam @sv

Protestanttinen musiikki
type: Class
type: Concept
subclass of: Kristillisten kirkkojen musiikki
alternative label: Anglikaaninen kirkkomusiikki (787.11 +)
alternative label: Anthemit (787.11)
alternative label: Hengellinen musiikki, protestanttinen musiikki (787.11 +)
alternative label: Protestanttinen musiikki (787.11 +)
alternative label: Andlig musik, protestantisk musik (787.11 +) @sv
alternative label: Anglikansk kyrkomusik (787.11 +) @sv
alternative label: Anthems (787.11) @sv
alternative label: Protestantisk musik (787.11 +) @sv
broader: Kristillisten kirkkojen musiikki
in scheme: URN:NBN:fi:au:hklj:
narrower: Virret. Hengelliset laulut
narrower: URN:NBN:fi:au:hklj:787.112
narrower: Spirituaalit. Gospel-musiikki
notation: 787.11
preferred label: Protestant music @en
preferred label: Protestantisk musik @sv
related: Hartauskirjat
related: Rukouskirjat
related: Virsikirjat ja hengelliset laulukirjat
related: Henkilökohtainen hartaudenharjoitus
related: EVANKELIS-LUTERILAINEN KIRKKO
related: Sakramentit. Kirkolliset toimitukset
related: Protestanttiset kirkot ja yhteisöt
related: URN:NBN:fi:au:hklj:783
related: URN:NBN:fi:au:hklj:783.1
related: URN:NBN:fi:au:hklj:783.5
related: URN:NBN:fi:au:hklj:783.59
related: URN:NBN:fi:au:hklj:783.6
related: URN:NBN:fi:au:hklj:784
related: URN:NBN:fi:au:hklj:784.9
related: URN:NBN:fi:au:hklj:787.2
related: URN:NBN:fi:au:hklj:789

LIIKUNTA. URHEILU. LEIKIT. HUVIT
type: Class
type: Concept
subclass of: URN:NBN:fi:au:hklj:700
broader: URN:NBN:fi:au:hklj:700
in scheme: URN:NBN:fi:au:hklj:
narrower: Liikuntatiede ja -tutkimus. Liikuntapolitiikka
narrower: Liikunnan ja urheilun historia
narrower: Liikunta. Urheilu
narrower: Voimistelu
narrower: Voimailu. Itsepuolustus
narrower: Retkeily. Ulkoilu. Vuorikiipeily. Suunnistus
narrower: URN:NBN:fi:au:hklj:795
narrower: Palloilu
narrower: Leikit
narrower: URN:NBN:fi:au:hklj:798
narrower: Julkiset huvit
notation: 790
preferred label: PHYSICAL EDUCATION. SPORTS. GAMES. PASTIMES @en
preferred label: MOTION. SPORT. LEKAR. NÖJEN @sv
related: Urheilulääketiede
scope note: Yleisteokset, jotka koskevat sekä liikuntaa tai urheilua että leikkejä tai huveja
scope note: Allmänna verk som rör såväl motion eller sport som lekar eller nöjen @sv

Leikkikalut
type: Class
type: Concept
subclass of: Leikit
alternative label: Amigurumit (797.1)
alternative label: Antiikkiesineet, lelut (797.1)
alternative label: Fidget spinnerit, leikkikalut (797.1)
alternative label: Hyrrät, leikkikalut (797.1)
alternative label: Kangaseläimet, leikkikalujen valmistaminen (797.1)
alternative label: Keinuhevoset (797.1)
alternative label: Keppihevoset (797.1)
alternative label: Keräily, lelut (797.1)
alternative label: Kumituotteet, kumilelut (797.1)
alternative label: Käsinuket, valmistus (797.1)
alternative label: Lastentarvikkeet, leikkikalut (797.1)
alternative label: Legot (797.1)
alternative label: Leikit, leikkikalut (797.1)
alternative label: Leikki, leikkikalut (797.1)
alternative label: Leikki-ikäiset, leikkikalut (797.1)
alternative label: Leikkiautot (797.1)
alternative label: Leikkikalut (797.1)
alternative label: Leikkikalut, leikkikalujen valmistus käsityönä (797.1)
alternative label: Leikkikalut, leikkikaluteollisuus (797.1)
alternative label: Leikkikaluteollisuus (797.1)
alternative label: Lelut (797.1)
alternative label: Lelut, lelujen valmistus käsityönä (797.1)
alternative label: Lelut, leluteollisuus (797.1)
alternative label: Liidokit, leikkikalut (797.1)
alternative label: Marionettiteatterit, nukkien valmistus (797.1)
alternative label: Nallet (797.1)
alternative label: Nukenvaatteet (797.1)
alternative label: Nuket (797.1)
alternative label: Nuket, leikkikaluteollisuus (797.1)
alternative label: Nuket, valmistus käsityönä (797.1)
alternative label: Nukkekodit (797.1)
alternative label: Nukketeatterit, käsinuket (797.1)
alternative label: Nukketeollisuus (797.1)
alternative label: Pallot, leikkikalut (797.1)
alternative label: Paperinuket (797.1)
alternative label: Pehmoeläimet (797.1)
alternative label: Pehmolelut (797.1)
alternative label: Polkuautot, leikkikalut (797.1)
alternative label: Polkuveneet, leikkikalut (797.1)
alternative label: Pulkat, leikkikalut (797.1)
alternative label: Puulelut (797.1)
alternative label: Puulelut, leikkikalujen valmistus käsityönä (797.1)
alternative label: Puulelut, leikkikaluteollisuus (797.1)
alternative label: Radio-ohjattavat autot, leikkiautot (797.1)
alternative label: Rakennuspalikat (797.1)
alternative label: Rakennussarjat (797.1)
alternative label: Sormihyrrät, leikkikalut (797.1)
alternative label: Sorminuket, valmistus (797.1)
alternative label: Sormspinnerit, leikkikalut (797.1)
broader: Leikit
in scheme: URN:NBN:fi:au:hklj:
notation: 797.1
related: Lapsuuden ja nuoruuden psykologia
related: Kokeellinen kasvatus
related: Esineellinen kulttuuri
related: URN:NBN:fi:au:hklj:473
related: URN:NBN:fi:au:hklj:473.1
related: URN:NBN:fi:au:hklj:475
related: URN:NBN:fi:au:hklj:475.1
related: URN:NBN:fi:au:hklj:476
related: URN:NBN:fi:au:hklj:476.1
related: URN:NBN:fi:au:hklj:476.11
related: URN:NBN:fi:au:hklj:476.12
related: URN:NBN:fi:au:hklj:476.5
related: URN:NBN:fi:au:hklj:476.6
related: URN:NBN:fi:au:hklj:476.7
related: URN:NBN:fi:au:hklj:476.8
related: URN:NBN:fi:au:hklj:618.86
related: URN:NBN:fi:au:hklj:620.88
related: Ompelu
related: Neulonta
related: Nukketeatteri
related: Lastenmusiikki
related: URN:NBN:fi:au:hklj:797.2
related: URN:NBN:fi:au:hklj:798
scope note: Leikkikaluteollisuus. Lelukauppatoiminta Leikkikalujen valmistusohjeet ja -mallit valmistusmateriaalista riippumatta käsityön, askartelun ja kotiteollisuuden kannalta Leikkikalujen keräily. Nallet. Tinasotilaat Nuket, nukenvaatteet ja nukkekodit sekä niiden valmistus Käsinukkien, myös nukketeatterin käsinukkien valmistus Jos teos koskee leikkikaluja sekä kansatieteen että leikin tai leikkikalujen valmistuksen kannalta, on etusija luokalla 797.1
scope note: Leksaksindustri. Leksakshandel Anvisningar och modeller för leksaksframställning ur hantverks- och hemslöjdssynvinkel och som hobby oavsett material Leksaker som samlingsobjekt. Teddybjörnar. Tennsoldater Dockor, dockkläder och dockhus samt tillverkning av dem Tillverkning av handdockor, också handdockor för dockteatrar Om verket handlar om leksaker såväl ur etnologisk synvinkel som ur lekens eller leksaksframställningens synvinkel, ges företräde åt klass 797.1 @sv

Yleinen arkeologia
type: Class
type: Concept
subclass of: HISTORIAN TUTKIMUSMENETELMÄT. ARKEOLOGIA. KULTTUURIHISTORIA
alternative label: Aarrelöydöt, arkeologia (915)
alternative label: Aarteet, arkeologia (915)
alternative label: Aikakaudet, arkeologia (915)
alternative label: Ajoitus, arkeologia (915)
alternative label: Arkeobotaniikka (915)
alternative label: Arkeologia (915 +)
alternative label: Arkeologiset löydöt (915)
alternative label: Asuinpaikat, arkeologia (915)
alternative label: Asumukset, arkeologia (915)
alternative label: C14-menetelmä, arkeologia (915)
alternative label: Dendrokronologia, arkeologia (915)
alternative label: Ennallistaminen, arkeologia (915)
alternative label: Esineellinen kulttuuri, arkeologia (915)
alternative label: Haudat, arkeologia (915)
alternative label: Hautakammiot, arkeologia (915)
alternative label: Hautakirjoitukset, arkeologia (915)
alternative label: Hautakivet, arkeologia (915)
alternative label: Hautalöydöt (915)
alternative label: Hautamuistomerkit, arkeologia (915)
alternative label: Hautaustavat, arkeologia (915)
alternative label: Historiallinen arkeologia (915)
alternative label: Historiallisen ajan arkeologia (915)
alternative label: Isotooppigeologia, iänmääritys, arkeologia (915)
alternative label: Iänmääritys, arkeologia (915)
alternative label: Jatulintarhat, labyrintit, arkeologia (915)
alternative label: Jäljet, arkeologia (915)
alternative label: Kaivaukset, arkeologia (915)
alternative label: Kasviarkeologia (915)
alternative label: Kaupunkiarkeologia, arkeologia (915)
alternative label: Keltit, arkeologia (915)
alternative label: Kenotafit, arkeologia (915)
alternative label: Kenttätyö, arkeologia (915)
alternative label: Kerrostumat, arkeologia (915)
alternative label: Kiinteät muinaisjäännökset (915)
alternative label: Kirjoittamattomat lähteet, arkeologia (915)
alternative label: Klassillinen arkeologia (915)
alternative label: Klassillinen arkeologia, arkeologia (915)
alternative label: Klassinen arkeologia (915)
alternative label: Klassinen arkeologia, arkeologia (915)
alternative label: Kronologia, arkeologia (915)
alternative label: Kulttuuriesineet, arkeologia (915)
alternative label: Kupariesineet, arkeologia (915)
alternative label: Kuppikivet, arkeologia (915)
alternative label: Käyttöesineet, arkeologia (915)
alternative label: Labyrintit, arkeologia (915)
alternative label: Linnat, arkeologia (915)
alternative label: Linnavuoret, arkeologia (915)
alternative label: Linnoitukset, arkeologia (915)
alternative label: Lustot, dendrokonologia (915)
alternative label: Luuesineet, arkeologia (915)
broader: HISTORIAN TUTKIMUSMENETELMÄT. ARKEOLOGIA. KULTTUURIHISTORIA
in scheme: URN:NBN:fi:au:hklj:
narrower: Kadonneet mantereet. Maapallon ulkopuolisten kulttuurien vaikutus muinaishistoriaan
notation: 915
related: URN:NBN:fi:au:hklj:386.109
related: Kulttuuriantropologia. Sosiaaliantropologia
related: Vesikulkuneuvot
related: Laivat. Laivanrakennus
related: URN:NBN:fi:au:hklj:625.72
related: Euroopan ulkopuolisten vanhojen kulttuurien taide
related: Uinti. Sukellus
related: URN:NBN:fi:au:hklj:909
related: Vanhan ajan historia
related: Keskiajan historia 400-1499
related: Uuden ajan historia 1500-1788
related: Uusimman ajan historia 1789-1913
related: Nykyajan historia 1914-1938
related: I maailmansodan historia 1914-1918
related: Nykyajan historia 1939-
related: II maailmansodan historia 1939-1945
related: Historian tutkimusmenetelmät
related: Historian aputieteet
related: Yleinen kronologia ja kronografia
related: URN:NBN:fi:au:hklj:919
related: Vanhan ajan kulttuurihistoria
scope note: Arkeologian ja arkeologisen tutkimuksen yleisteokset Arkeologiset kaivaukset yleensä. Arkeologinen ajanmääritys ja stratigrafia Rakennukset, asuin- ja hautapaikat sekä esinelöydöt arkeologisen tutkimuksen kannalta yleensä Yleinen meriarkeologia Tietyn maanosan, maan, alueen tai aikakauden arkeologia ko. maanosan, maan, alueen tai aikakauden historian luokassa
scope note: Allmänna verk om arkeologi och arkeologisk forskning Arkeologiska utgrävningar i allmänhet. Arkeologisk datering och stratigrafi Byggnader, boplatser och gravar samt föremålsfynd ur den arkeologiska forskningens synvinkel i allmänhet Allmän marinarkeologi Arkeologi som hänför sig till olika världsdelar, länder, geografiska områden och tidsperioder förs till klassen för världsdelens, landets, det geografiska områdets eller tidsperiodens historia @sv

SAKSAN HISTORIA
type: Class
type: Concept
subclass of: URN:NBN:fi:au:hklj:900
alternative label: Berliini, historia (940 ... 948 +)
alternative label: Itä-Preussi, historia, Saksa (940 ... 946 +)
alternative label: Preussi, Saksan historia (940 ... 948)
alternative label: Saksa, historia (940 ... 948)
alternative label: Berlin, historia (940 ... 948 +) @sv
alternative label: Ostpreussen, historia, Tyskland (940 ... 946 +) @sv
alternative label: Preussen, Tysklands historia (940 ... 948) @sv
alternative label: Tyskland, historia (940 ... 948) @sv
broader: URN:NBN:fi:au:hklj:900
in scheme: URN:NBN:fi:au:hklj:
narrower: Saksan esi- ja varhaishistoria vuoteen 843
narrower: Saksan keskiaika 843-1518
narrower: Saksan historia 1519-1647
narrower: Saksan historia 1648-1814
narrower: Saksan historia 1815-1913
narrower: Saksan historia 1914-1945
narrower: Saksan historia 1946-
notation: 940
preferred label: GERMANY'S HISTORY @en
preferred label: TYSKLANDS HISTORIA @sv
related: Sisäpolitiikka. Puolueet
related: URN:NBN:fi:au:hklj:325
related: Muiden maiden valtiojärjestelmät
related: Saksa
related: Berliini
related: URN:NBN:fi:au:hklj:909
related: I maailmansodan historia 1914-1918
related: II maailmansodan historia 1939-1945
related: URN:NBN:fi:au:hklj:919
scope note: Saksan historian yleisteokset Jos teos koskee vähintään kolmea luokkien 941-948 aikakautta, se kuuluu pääluokkaan 940 Jos teos koskee samassa määrin kahta aikakautta, se kuuluu varhaisemman aikakauden luokkaan, muuten siihen luokkaan, johon se selvästi painottuu
scope note: Allmänna verk om Tysklands historia Om verket handlar om minst tre tidsperioder inom klasserna 941-948 förs det till huvudklass 940 Om verket behandlar två tidsperioder jämbördigt förs det till klassen för den tidigare tidsperioden, i andra fall till klassen för den tidsperiod som klart dominerar i verket @sv

Venäjän historia
type: Class
type: Concept
subclass of: URN:NBN:fi:au:hklj:970
alternative label: Aunus, historia (971 +)
alternative label: Heimosoturit, Inkeri (971 +)
alternative label: Heimosoturit, Itä-Karjala (971 +)
alternative label: Inkeri, historia (971 +)
alternative label: Inkeriläiset, historia (971 +)
alternative label: Itä-Karjala, historia (971 +)
alternative label: Karjala, Venäjä, historia (971 +)
alternative label: Kasakat, historia (971 ... 972)
alternative label: Kaukasia, historia (971 +)
alternative label: Kuolan niemimaa, historia (971 +)
alternative label: Leningrad, historia (971 +)
alternative label: Moskova, historia (971 +)
alternative label: Murmanskin alue, historia (971 +)
alternative label: Novaja Zemlja, historia (971 +)
alternative label: Pajarit, Venäjä, historia (971 +)
alternative label: Pietari, kaupunki, historia (971 +)
alternative label: Sahalin, Venäjän historia (971 +)
alternative label: Siperia, historia (971 +)
alternative label: Venäjä, historia (971 +)
alternative label: Venäläistämispolitiikka, Venäjän historia (971 +)
alternative label: Bojarer, Ryssland, historia (971 +) @sv
alternative label: Förryskningspolitik, Rysslands historia (971 +) @sv
alternative label: Ingermanland, historia (971 +) @sv
alternative label: Ingermanlänningar, historia (971 +) @sv
alternative label: Karelen, Ryssland, historia (971 +) @sv
alternative label: Kaukasien, historia (971 +) @sv
alternative label: Kolahalvön, historia (971 +) @sv
alternative label: Kosacker, historia (971 ... 972) @sv
alternative label: Moskva, historia (971 +) @sv
alternative label: Murmanskområdet, historia (971 +) @sv
alternative label: Olonetskarelen, historia (971 +) @sv
alternative label: Ryssland, historia (971 +) @sv
alternative label: S:t Petersburg, historia (971 +) @sv
alternative label: Sachalin, Rysslands historia (971 +) @sv
alternative label: Sibirien, historia (971 +) @sv
alternative label: Stamsoldater, Ingermanland (971 +) @sv
alternative label: Stamsoldater, Östkarelen (971 +) @sv
alternative label: Östkarelen, historia (971 +) @sv
broader: URN:NBN:fi:au:hklj:970
in scheme: URN:NBN:fi:au:hklj:
narrower: Venäjän historia vuoteen 1917
narrower: Neuvostoliiton historia 1917-1991
narrower: Venäjän historia 1992-
narrower: Ukrainan, Valko-Venäjän ja Moldovan historia
notation: 971
preferred label: History of Russia @en
preferred label: Rysslands historia @sv
related: Menetetty Karjalan alue
related: Lappi
related: Venäjä
related: Moskova
related: Pietari
related: Armenia. Azerbaidzan. Georgia. Kazakstan. Kirgisia. Tadzikistan. Turkmenistan. Uzbekistan
related: URN:NBN:fi:au:hklj:909
related: URN:NBN:fi:au:hklj:919
related: Baltian maiden historia
related: Viron historia
related: Latvian historia
related: Liettuan historia
related: Aasian historia
related: Armenian, Azerbaidzanin, Georgian, Kazakstanin, Kirgisian, Tadzikistanin, Turkmenistanin ja Uzbekistanin historia
related: URN:NBN:fi:au:hklj:989
scope note: Tässä Venäjän historian yleisteokset Tässä myös teokset, jotka koskevat sekä Venäjän että Neuvostoliiton historiaa Tässä ja alaluokissa sekä Venäjän Euroopan että Aasian puoleisten alueiden historia Tässä ja alaluokissa myös Siperian historia Tässä ja luokassa 971.2+ myös Venäjän hallitsijoita koskeva historia ja henkilöhistoria Jos teos koskee vähintään kolmea aikakautta, se kuuluu lähimpään pääluokkaan Jos teos koskee samassa määrin kahta aikakautta, se kuuluu varhaisemman aikakauden luokkaan, muuten siihen luokkaan, johon se selvästi painottuu
scope note: Hit allmänna verk om Rysslands historia Hit också verk som handlar om både Rysslands och Sovjetunionens historia Hit och till underklasserna historiska verk om både de europeiska och asiatiska områdena av Ryssland Hit och till underklasserna också Sibiriens historia Hit och till klass 971.2+ också historia eller personhistoria som rör regenter i Ryssland Om verket handlar om minst tre tidsperioder förs det till närmaste huvudklass Om verket behandlar två tidsperioder jämbördigt förs det till klassen för den tidigare tidsperioden, i andra fall till klassen för den tidsperiod som klart dominerar i verket @sv

MUIDEN MAANOSIEN HISTORIA
type: Class
type: Concept
subclass of: URN:NBN:fi:au:hklj:900
broader: URN:NBN:fi:au:hklj:900
in scheme: URN:NBN:fi:au:hklj:
narrower: Aasian historia
narrower: Afrikan historia
narrower: Amerikan historia
narrower: Etelä-Amerikan historia
narrower: URN:NBN:fi:au:hklj:989
notation: 980
preferred label: HISTORY OF OTHER CONTINENTS @en
preferred label: ANDRA VÄRLDSDELARS HISTORIA @sv
related: Sisäpolitiikka. Puolueet
related: URN:NBN:fi:au:hklj:325
related: Muiden maiden valtiojärjestelmät
related: AASIA
related: AFRIKKA
related: AMERIKKA
related: AUSTRALIA. OSEANIA. NAPAMAAT
related: URN:NBN:fi:au:hklj:460
related: Löytöretket. Tutkimusmatkat
related: URN:NBN:fi:au:hklj:909
related: I maailmansodan historia 1914-1918
related: II maailmansodan historia 1939-1945
related: URN:NBN:fi:au:hklj:919
scope note: Muiden maanosien historian yleisteokset
scope note: Allmänna verk om andra världsdelars historia @sv

YLEISET KAUSIJULKAISUT
type: Class
type: Concept
subclass of: KIRJA-ALA
alternative label: Aikakauslehdet (050 ... 058)
alternative label: Aikuisviihdelehdet (050 ... 058)
alternative label: Almanakat (050 ... 058)
alternative label: Ammattilehdet (050 ... 058)
alternative label: Asiakaslehdet (050 ... 058)
alternative label: Elektroniset lehdet (050 ... 058)
alternative label: Elämäntapalehdet, aikakauslehdet (050 ... 058)
alternative label: Fanzinet, aikakauslehdet (050 ... 058)
alternative label: Harrastelijalehdet, aikakauslehdet (050 ... 058)
alternative label: Henkilökuntalehdet (050 ... 058)
alternative label: Henkilöstölehdet (050 ... 058)
alternative label: Huumorilehdet (050 ... 058)
alternative label: Ilmaisjakelulehdet, aikakauslehdet (050 ... 058)
alternative label: Ilmoituslehdet, aikakauslehdet (050 ... 058)
alternative label: Joukkotiedotusvälineet, aikakauslehdet (050 ... 058)
alternative label: Joukkoviestimet, aikakauslehdet (050 ... 058)
alternative label: Joululehdet (050 ... 058)
alternative label: Julkaisusarjat (050 ... 058)
alternative label: Julkaisut, yleiset kausijulkaisut (050 ... 058)
alternative label: Juorut, sensaatiolehdet (050 ... 058)
alternative label: Järjestölehdet (050 ... 058)
alternative label: Jäsenlehdet (050 ... 058)
alternative label: Kalenterit (050 ... 058)
alternative label: Karkauspäivä, kalenterit (050 ... 058)
alternative label: Kasettilehdet, aikakauslehdet (050 ... 058)
alternative label: Kaupallinen joukkoviestintä, aikakauslehdet (050 ... 058)
alternative label: Kausijulkaisut (050 ... 058)
alternative label: Kolumnistit, aikakauslehdet (050 ... 058)
alternative label: Kolumnit, aikakauslehdet (050 ... 058)
alternative label: Kulttuurilehdet (050 ... 058)
alternative label: Kulttuuriosastot, aikakauslehdet (050 ... 058)
alternative label: Kuukaudet, kalenterit (050 ... 058)
alternative label: Lastenlehdet (050 ... 058)
alternative label: Lehdet, aikakauslehdet (050 ... 058)
alternative label: Lehdistö, lehdet (050 ... 058)
alternative label: Lehti-ilmoitukset, lehdet (050 ... 058)
alternative label: Massamedia, aikakauslehdet (050 ... 058)
alternative label: Mielipidelehdet (050 ... 058)
alternative label: Miestenlehdet (050 ... 058)
alternative label: Naistenlehdet (050 ... 058)
alternative label: Nuortenlehdet (050 ... 058)
alternative label: Nuortenpalstat, lehdet (050 ... 058)
alternative label: Opiskelijalehdet (050 ... 058)
alternative label: Pakinat, aikakauslehdet (050 ... 058)
alternative label: Pakinoitsijat, aikakauslehdet (050 ... 058)
alternative label: Pilalehdet (050 ... 058)
alternative label: Pornolehdet (050 ... 058)
alternative label: Puuhalehdet, aikakauslehdet (050 ... 058)
alternative label: Päivämäärät, kalenterit (050 ... 058)
alternative label: Pääkirjoitukset, aikakauslehdet (050 ... 058)
alternative label: Reportaasit, aikakauslehdet (050 ... 058)
alternative label: Sarjajulkaisuluettelot (050 ... 058)
alternative label: Sarjajulkaisut (050 ... 058)
alternative label: Sarjat, sarjajulkaisut (050 ... 058)
alternative label: Seksilehdet (050 ... 058)
alternative label: Selkolehdet, aikakauslehdet (050 ... 058)
alternative label: Sensaatiolehdet, aikakauslehdet (050 ... 058)
alternative label: Sitoutumattomat lehdet, aikakauslehdet (050 ... 058)
alternative label: Skandaalilehdistö, aikakauslehdet (050 ... 058)
broader: KIRJA-ALA
in scheme: URN:NBN:fi:au:hklj:
narrower: Suomenkieliset
narrower: Ruotsinkieliset
narrower: Saksankieliset
narrower: Englanninkieliset
narrower: Ranskankieliset
narrower: Italiankieliset
narrower: Espanjankieliset
narrower: Venäjänkieliset
notation: 050
related: YLEISET KOKOOMATEOKSET
related: SANOMALEHDET
related: Lehdistöoppi
related: Ajanlasku
related: URN:NBN:fi:au:hklj:522.309
scope note: Tässä ja alaluokissa aineistotyypistä riippumatta yleiset tai sekasisältöiset kausijulkaisut ja niiden erilliset sisällysluettelot Tässä ja alaluokissa myös aineistotyypistä riippumatta yleiset sarjajulkaisut, aikakauslehdet, vuosikirjat, kalenterit ja almanakat Tässä ja alaluokissa myös elektroniset lehdet ja kausijulkaisut, kuten äänilehdet sekä tele- ja videolehdet, paitsi sanomalehdiksi tulkittavat Erikoisalojen kausijulkaisut ja niiden erilliset hakemistot alan mukaisessa luokassa
scope note: Hit och till underklasserna seriella publikationer med allmänt eller blandat innehåll och separata innehållsförteckningar för dessa oavsett mediatyp Hit och till underklasserna också allmänna seriella publikationer, tidskrifter, årsböcker, kalendrar och almanackor oavsett mediatyp Hit och till underklasserna också elektroniska tidskrifter och seriella publikationer, såsom taltidningar samt telematiska tidningar och videotidningar, undantaget publikationer som kan betraktas som tidningar Seriella publikationer som rör specialområden och deras separata innehållsförteckningar klassificeras enligt område @sv

Filosofian historia
type: Class
type: Concept
subclass of: URN:NBN:fi:au:hklj:100
alternative label: Aatehistoria, filosofian historia (108 +)
alternative label: Aatteet, filosofian historia (108 +)
alternative label: Dekonstruktio, filosofia (108 +)
alternative label: Dialogi, filosofian historia (108 +)
alternative label: Erehdys, filosofian historia (108 +)
alternative label: Filosofia, filosofian historia (108 +)
alternative label: Filosofian historia (108 +)
alternative label: Filosofit, kootut teokset (108 +)
alternative label: Filosofit, yleisteokset (108 +)
alternative label: Hermeneutiikka, filosofia (108 +)
alternative label: Holismi, filosofia (108 +)
alternative label: Holistisuus, filosofia (108 +)
alternative label: Ihmiskuva, filosofia (108 +)
alternative label: Intersubjektiivisuus, filosofia (108 +)
alternative label: Irrationalismi, filosofia (108 +)
alternative label: Kategoriat, filosofia (108 +)
alternative label: Kokonaisvaltaisuus, filosofia (108 +)
alternative label: Kvalia, mielenfilosofia (108)
alternative label: Käytännöllinen filosofia (108 +)
alternative label: Maailmankatsomus, filosofia (108 +)
alternative label: Mielenfilosofia (108 +)
alternative label: Määritelmät, filosofia (108 +)
alternative label: Subjekti, filosofia (108 +)
alternative label: Subjektiivisuus, filosofia (108 +)
alternative label: Subjektivismi, filosofia (108 +)
alternative label: Suuntaukset, filosofian historia (108 +)
alternative label: Terve järki, filosofia (108 +)
alternative label: Todellisuus, filosofia (108 +)
alternative label: Totuuden teoria, filosofia (108 +)
alternative label: Totuudenkaltaisuus, filosofia (108 +)
alternative label: Totuus, filosofia (108 +)
alternative label: Totuusteoriat, filosofia (108 +)
alternative label: Transsendentaalifilosofia, filosofian historia (108 +)
alternative label: Universaalit, filosofia (108 +)
alternative label: Universalismi, filosofia (108 +)
alternative label: Utopistit, filosofian historia (108 +)
alternative label: Viisaus, filosofia (108 +)
alternative label: Väittely, filosofian historia (108 +)
alternative label: Yksilö, filosofia (108 +)
alternative label: Yleiskäsitteet, filosofia (108 +)
alternative label: Allmänbegrepp, filosofi (108 +) @sv
alternative label: Definitioner, filosofi (108 +) @sv
alternative label: Dekonstruktion, filosofi (108 +) @sv
alternative label: Dialog, filosofins historia (108 +) @sv
alternative label: Disputation, filosofins historia (108 +) @sv
alternative label: Filosofer, allmänna verk (108 +) @sv
alternative label: Filosofer, samlade verk (108 +) @sv
alternative label: Filosofi, filosofins historia (108 +) @sv
alternative label: Filosofins historia (108 +) @sv
alternative label: Filosofisk psykologi (108 +) @sv
alternative label: Helhetsbetoning, filosofi (108 +) @sv
alternative label: Helhetsorientering, filosofi (108 +) @sv
alternative label: Hermeneutik, filosofi (108 +) @sv
alternative label: Holism, filosofi (108 +) @sv
alternative label: Idéer, filosofins historia (108 +) @sv
broader: URN:NBN:fi:au:hklj:100
in scheme: URN:NBN:fi:au:hklj:
narrower: Itämainen filosofia
narrower: Vanhan ajan filosofia
narrower: Keskiajan filosofia
narrower: Renessanssin ja uuden ajan filosofia
narrower: Uusimman ajan filosofia
narrower: Nykyajan filosofia
narrower: Suomi
notation: 108
related: Oppikirjat. Johdatukset filosofiaan
related: Esseet
related: URN:NBN:fi:au:hklj:110
related: LOGIIKKA
related: TIETOTEORIA. TIETO-OPPI
related: Tietoteorian historia ja suunnat
related: TIEDEOPPI
related: ETIIKKA. ESTETIIKKA
related: ELÄMÄNFILOSOFIA. KULTTUURIFILOSOFIA
related: Itsekasvatus. Itseopiskelu
scope note: Tässä ja alaluokissa filosofian yleinen historia Tässä ja alaluokissa myös filosofien yleisteokset sekä yleis- tai sekasisältöiset filosofien kootut ja valitut teokset Filosofian erikoisalojen historia sekä niitä koskevat filosofien kootut ja valitut teokset alan mukaisessa luokassa
scope note: Hit och till underklasserna filosofins allmänna historia Hit och till underklasserna också allmänna verk av filosofer samt filosofers samlade verk och verk i urval med allmänt eller blandat innehåll Filosofins historia inom specialområden samt samlade verk och verk i urval av filosofer inom specialområden klassificeras enligt område @sv

Perinnöllisyyspsykologia
type: Class
type: Concept
subclass of: URN:NBN:fi:au:hklj:120
alternative label: Identtiset kaksoset, perinnöllisyyspsykologia (124)
alternative label: Kaksoset, perinnöllisyyspsykologia (124)
alternative label: Kaksostutkimus, perinnöllisyyspsykologia (124)
alternative label: Kuutoset, perinnöllisyyspsykologia (124)
alternative label: Perinnöllisyyspsykologia (124)
alternative label: Identiska tvillingar, ärftlighetspsykologi (124) @sv
alternative label: Sexlingar, ärftlighetspsykologi (124) @sv
alternative label: Tvillingar, ärftlighetspsykologi (124) @sv
alternative label: Tvillingforskning, ärftlighetspsykologi (124) @sv
alternative label: Ärftlighetspsykologi (124) @sv
broader: URN:NBN:fi:au:hklj:120
in scheme: URN:NBN:fi:au:hklj:
notation: 124
preferred label: Hereditary psychology @en
preferred label: Ärftlighetspsykologi @sv
related: Psyyken rakenne ja toiminnot
related: Kokeellinen psykologia. Psykometriikka
related: Psykologian suunnat
related: Differentiaalipsykologia. Persoonallisuuden psykologia
related: Muita psykologian aloja
related: Fysiologinen psykologia
related: URN:NBN:fi:au:hklj:576
related: Etologia. Eläinsosiologia
related: Psykiatria
related: Lapsi- ja nuorisopsykiatria
related: URN:NBN:fi:au:hklj:618.2
related: URN:NBN:fi:au:hklj:618.24
related: Itsemurhat ja niiden ehkäisy
related: URN:NBN:fi:au:hklj:618.3
related: Oikeuspsykiatria
related: Psyykkiset sairaudet. Mielenterveyden häiriöt
related: Skitsofrenia. Jakomielitauti
related: Kaksisuuntainen mielialahäiriö
related: Neuroosit
related: URN:NBN:fi:au:hklj:618.8
related: Analyyttinen psykoterapia
related: URN:NBN:fi:au:hklj:618.85
related: URN:NBN:fi:au:hklj:618.86
related: Mielisairaanhoito
scope note: Ihmisen käyttäytymisen perinnöllisyyden tutkimus yleensä Psykologiset kaksostutkimukset yleensä Tiettyyn psykologian erikoisalaan liittyvät kysymykset perinnöllisyydestä alan mukaisessa luokassa
scope note: Människans beteende ur ärftlighetsforskningens synvinkel i allmänhet Psykologisk tvillingforskning i allmänhet Ärftlighetsfrågor inom bestämda psykologiska områden eller specialområden klassificeras enligt område @sv

Logistiikka. Looginen kalkyyli
type: Class
type: Concept
subclass of: LOGIIKKA
alternative label: Formaalinen logiikka (135)
alternative label: Intensionaalinen logiikka (135)
alternative label: Järjestyslogiikka (135)
alternative label: Käsiteanalyysi, logiikka (135)
alternative label: Käsitteenmuodostus, logiikka (135)
alternative label: Käsitteet, logiikka (135)
alternative label: Logistiikka, logiikka (135)
alternative label: Looginen kalkyyli (135)
alternative label: Luokkakalkyyli (135)
alternative label: Matemaattinen logiikka (135)
alternative label: Matemaattiset menetelmät, matemaattinen logiikka (135)
alternative label: Modaalilogiikka (135)
alternative label: Muodollinen logiikka (135)
alternative label: Predikaattilogiikka (135)
alternative label: Reaalilogiikka (135)
alternative label: Symbolinen logiikka (135)
alternative label: Todennäköisyys, logiikka (135)
alternative label: Todennäköisyyslogiikka (135)
alternative label: Tyyppihierarkiat, logiikka (135)
alternative label: Välttämättömyys, modaalilogiikka (135)
alternative label: Begrepp, logik (135) @sv
alternative label: Begreppsanalys, logik (135) @sv
alternative label: Begreppsbildning, logik (135) @sv
alternative label: Formalistisk logik (135) @sv
alternative label: Formell logik (135) @sv
alternative label: Intensional logik (135) @sv
alternative label: Klasskalkyl (135) @sv
alternative label: Logisk kalkyl (135) @sv
alternative label: Logistik, logik (135) @sv
alternative label: Matematisk logik (135) @sv
alternative label: Matematiska metoder, matematisk logik (135) @sv
alternative label: Modallogik (135) @sv
alternative label: Nödvändighet, modallogik (135) @sv
alternative label: Ordningslogik (135) @sv
alternative label: Predikatlogik (135) @sv
alternative label: Reallogik (135) @sv
alternative label: Sannolikhet, logik (135) @sv
alternative label: Sannolikhetslogik (135) @sv
alternative label: Symbolisk logik (135) @sv
alternative label: Typhierarkier, logik (135) @sv
broader: LOGIIKKA
in scheme: URN:NBN:fi:au:hklj:
notation: 135
preferred label: Symbolic logic. Logistic calculus @en
preferred label: Logistik. Logisk kalkyl @sv
related: Lauselogiikka. Lausekalkyyli
related: MATEMATIIKKA
related: Todennäköisyyslaskenta
related: Matematiikan muut alat
related: URN:NBN:fi:au:hklj:627.7
related: Systeemityö
related: Ohjelmointi. Ohjelmointikielet
related: URN:NBN:fi:au:hklj:627.73
related: Käyttöjärjestelmät
related: Tekstinkäsittelyohjelmat
related: Taulukkolaskentaohjelmat
related: Tietokantaohjelmat
related: Kuvankäsittelyohjelmat. Grafiikkaohjelmat. Taitto-ohjelmat
related: Tietoliikenneohjelmat
related: Tietokoneiden lisälaitteet
related: Säätö- ja systeemitekniikka. Teollinen automaatio
related: Tietoliikenne. Viestintätekniikka. Multimedia
related: URN:NBN:fi:au:hklj:627.751
related: Sähköposti. Verkkojuttelu
related: URN:NBN:fi:au:hklj:627.7512
related: Matkaviestinpalvelut. Puhelinliikenne
related: URN:NBN:fi:au:hklj:627.753
related: URN:NBN:fi:au:hklj:627.7531
related: URN:NBN:fi:au:hklj:627.7532
scope note: Matemaattinen, muodollinen ja symbolinen logiikka yleensä Käsitelogiikka. Predikaatti- ja luokkakalkyyli. Reaalilogiikka. Funktiokalkyyli. Järjestyslogiikka. Tyyppihierarkia. Todennäköisyyslogiikka
scope note: Matematisk, formell och symbolisk logik i allmänhet Konceptionslogik. Predikat- och klasslogik. Reallogik. Funktionskalkyl. Ordningslogik. Typhierarki. Sannolikhetslogik @sv

Filosofian ja psykologian opetusoppi
type: Class
type: Concept
subclass of: URN:NBN:fi:au:hklj:182
alternative label: Elämänkatsomustieto, opetusoppi (182.1)
alternative label: Etiikka, opetusoppi (182.1)
alternative label: Filosofian opetusoppi (182.1)
alternative label: Psykologia, opetusoppi (182.1)
alternative label: Etik, didaktik (182.1) @sv
alternative label: Filosofins didaktik (182.1) @sv
alternative label: Livsåskådningskunskap, didaktik (182.1) @sv
alternative label: Psykologi, didaktik (182.1) @sv
broader: URN:NBN:fi:au:hklj:182
in scheme: URN:NBN:fi:au:hklj:
notation: 182.1
preferred label: Didactics in philosophy and psychology @en
preferred label: Didaktik i filosofi och psykologi @sv
related: Oppikirjat. Johdatukset filosofiaan
related: Opinnot
related: Oppimisen psykologia
related: Hypnoosi. Suggestio
related: URN:NBN:fi:au:hklj:181.7
related: URN:NBN:fi:au:hklj:181.9
related: URN:NBN:fi:au:hklj:183
related: URN:NBN:fi:au:hklj:183.5
related: URN:NBN:fi:au:hklj:183.7
related: Erikoiskoulut. Kokeilukoulut
related: URN:NBN:fi:au:hklj:184
related: Muiden maiden yliopistot ja korkeakoulut
related: URN:NBN:fi:au:hklj:185
related: URN:NBN:fi:au:hklj:188.4
related: Radio- ja televisiotoiminta
related: Radiotoiminta
related: URN:NBN:fi:au:hklj:384.42
related: URN:NBN:fi:au:hklj:627.7
related: URN:NBN:fi:au:hklj:627.73
related: URN:NBN:fi:au:hklj:627.751
related: URN:NBN:fi:au:hklj:627.753
related: URN:NBN:fi:au:hklj:627.7531
related: URN:NBN:fi:au:hklj:627.7532
scope note: Pääluokkaan 100 kuuluvien erikoisalojen tai aineiden opetusoppi Tässä esim. filosofian, psykologian, elämänkatsomustiedon ja kasvatustieteen opetusoppi
scope note: Didaktik som rör specialområden eller ämnen som hör till huvudklass 100 Hit didaktik inom t.ex. filosofi, psykologi, livsåskådningskunskap och pedagogik @sv

Maantieteen ja kansatieteen opetusoppi
type: Class
type: Concept
subclass of: URN:NBN:fi:au:hklj:182
alternative label: Maantiede, opetusoppi (182.4)
alternative label: Maantieteen opetusoppi (182.4)
alternative label: Geografi, didaktik (182.4) @sv
alternative label: Geografins didaktik (182.4) @sv
broader: URN:NBN:fi:au:hklj:182
in scheme: URN:NBN:fi:au:hklj:
notation: 182.4
preferred label: Didactics in geography and ethnology @en
preferred label: Geografins och etnologins didaktik @sv
related: Oppimisen psykologia
related: Hypnoosi. Suggestio
related: URN:NBN:fi:au:hklj:181.7
related: URN:NBN:fi:au:hklj:181.9
related: URN:NBN:fi:au:hklj:183
related: URN:NBN:fi:au:hklj:183.5
related: URN:NBN:fi:au:hklj:183.7
related: Erikoiskoulut. Kokeilukoulut
related: URN:NBN:fi:au:hklj:184
related: Muiden maiden yliopistot ja korkeakoulut
related: URN:NBN:fi:au:hklj:185
related: URN:NBN:fi:au:hklj:188.4
related: Radio- ja televisiotoiminta
related: Radiotoiminta
related: URN:NBN:fi:au:hklj:384.42
related: URN:NBN:fi:au:hklj:400
related: Opinnot
related: URN:NBN:fi:au:hklj:627.7
related: URN:NBN:fi:au:hklj:627.73
related: URN:NBN:fi:au:hklj:627.751
related: URN:NBN:fi:au:hklj:627.753
related: URN:NBN:fi:au:hklj:627.7531
related: URN:NBN:fi:au:hklj:627.7532
scope note: Pääluokkaan 400 kuuluvien erikoisalojen tai aineiden opetusoppi Tässä esim. maantieteen ja -tiedon, geologian, paleontologian sekä kansatieteen ja antropologian opetusoppi
scope note: Didaktik som rör specialområden eller ämnen som hör till huvudklass 400 Hit didaktik inom t.ex. geografi, geologi, paleontologi samt etnologi och antropologi @sv

Sovellettujen tieteiden opetusoppi
type: Class
type: Concept
subclass of: URN:NBN:fi:au:hklj:182
alternative label: Ammattiaineet, opetusoppi (182.6)
alternative label: Atk, opetusoppi (182.6)
alternative label: Kaupalliset aineet, opetusoppi (182.6)
alternative label: Kotitalous, opetusoppi (182.6)
alternative label: Maatilatalouden opetusoppi (182.6)
alternative label: Opetuskeittiöt, didaktiikka (182.6)
alternative label: Taitoaineet, opetusoppi (182.6)
alternative label: Tekninen työ, opetusoppi (182.6)
alternative label: Tekstiilityö, opetusoppi (182.6)
alternative label: Terveysoppi, opetusoppi (182.6)
alternative label: Terveystieto, opetusoppi (182.6)
alternative label: ADB, didaktik (182.6) @sv
alternative label: Färdighetsämnen, didaktik (182.6) @sv
alternative label: Gårdsbrukets didaktik (182.6) @sv
alternative label: Huslig ekonomi, didaktik (182.6) @sv
alternative label: Hälsokunskap, didaktik (182.6) @sv
alternative label: Hälsolära, didaktik (182.6) @sv
alternative label: Merkantila ämnen, didaktik (182.6) @sv
alternative label: Tekniskt arbete, didaktik (182.6) @sv
alternative label: Textilslöjd, didaktik (182.6) @sv
alternative label: Undervisningskök, didaktik (182.6) @sv
alternative label: Yrkesämnen, didaktik (182.6) @sv
broader: URN:NBN:fi:au:hklj:182
in scheme: URN:NBN:fi:au:hklj:
notation: 182.6
preferred label: Didactics in applied sciences @en
preferred label: Didaktik i tillämpade vetenskaper @sv
related: Oppimisen psykologia
related: Hypnoosi. Suggestio
related: URN:NBN:fi:au:hklj:181.7
related: URN:NBN:fi:au:hklj:181.9
related: URN:NBN:fi:au:hklj:183
related: URN:NBN:fi:au:hklj:183.5
related: URN:NBN:fi:au:hklj:183.7
related: Erikoiskoulut. Kokeilukoulut
related: URN:NBN:fi:au:hklj:184
related: Muiden maiden yliopistot ja korkeakoulut
related: URN:NBN:fi:au:hklj:185
related: URN:NBN:fi:au:hklj:188.4
related: Radio- ja televisiotoiminta
related: Radiotoiminta
related: URN:NBN:fi:au:hklj:384.42
related: Opinnot
related: Lääketieteen opinnot
related: URN:NBN:fi:au:hklj:627.7
related: URN:NBN:fi:au:hklj:627.73
related: URN:NBN:fi:au:hklj:627.751
related: URN:NBN:fi:au:hklj:627.753
related: URN:NBN:fi:au:hklj:627.7531
related: URN:NBN:fi:au:hklj:627.7532
scope note: Pääluokkaan 600 kuuluvien erikoisalojen tai aineiden opetusoppi Tässä esim. sovellettujen tieteiden, ammattiaineiden, lääketieteen, terveystiedon, teknisten ja teollisten alojen, teknisen työn, tekstiilityön, atk-alan, rakennusalan, liiketalouden, kaupallisen alan, koti- ja laitostalouden, ravinto- ja ravintola-alan, maatilatalouden ja metsätalouden opetusoppi
scope note: Didaktik som rör specialområden eller ämnen som hör till huvudklass 600 Hit didaktiska aspekter på t.ex. tillämpade vetenskaper, yrkesämnen, medicin, hälsolära, teknik och industri, tekniskt arbete, textilarbete, databranschen, byggnadsbranschen, företagsekonomi, handelsbranschen, hushåll, storhushåll, näringsverksamhet, restaurangbranschen, lantbruk och skogsbruk @sv

Pelastusoppi. Kristillinen antropologia
type: Class
type: Concept
subclass of: KRISTILLINEN DOGMATIIKKA
alternative label: Anteeksianto, kristillinen pelastusoppi (234)
alternative label: Armahdus, kristillinen pelastusoppi (234)
alternative label: Armo, kristillinen pelastusoppi (234)
alternative label: Elämä, kristillinen oppi (234)
alternative label: Elämän tarkoitus, kristillinen pelastusoppi (234)
alternative label: Elämäntarkoitus, kristillinen pelastusoppi (234)
alternative label: Ennaltamäärääminen, kristinusko (234)
alternative label: Ennaltamääräämisoppi, kristillinen dogmatiikka (234)
alternative label: Epäily, kristillinen dogmatiikka (234)
alternative label: Erehdys, synti, dogmatiikka (234)
alternative label: Hengellinen herätys, pelastusoppi, kristinusko (234)
alternative label: Herätys, pelastusoppi, kristinusko (234)
alternative label: Hoosean kirja (234)
alternative label: Ihminen, kristillinen dogmatiikka (234)
alternative label: Ihmiset, kristillinen dogmatiikka (234)
alternative label: Ihmiskuva, kristillinen antropologia (234)
alternative label: Katumus, kristillinen pelastusoppi (234)
alternative label: Kiusaukset, dogmatiikka (234)
alternative label: Kohtalo, kristillinen dogmatiikka (234)
alternative label: Kokemukset, uskoon tulo, kääntymys (234)
alternative label: Kristillinen antropologia (234)
alternative label: Kristityn kasvu, pelastusoppi (234)
alternative label: Kärsimys, kristillinen antropologia (234)
alternative label: Kääntymys, kristinuskon dogmatiikka (234)
alternative label: Mielekkyys, kristillinen pelastusoppi (234)
alternative label: Parannus, parannuksen teko, kristinusko (234)
alternative label: Pelastus, kristinusko (234)
alternative label: Pelastusoppi (234)
alternative label: Perisynti (234)
alternative label: Predestinaatio, kristinusko (234)
alternative label: Soteriologia (234)
alternative label: Sovinto, sovitus, dogmatiikka (234)
alternative label: Sovitus, kristinusko (234)
alternative label: Synti, dogmatiikka (234)
alternative label: Syntiinlankeemus (234)
alternative label: Syyllisyys, kristillinen dogmatiikka (234)
alternative label: Syyttömyys, kristillinen dogmatiikka (234)
alternative label: Tahdonvapaus, kristillinen antropologia (234)
alternative label: Tahto, kristillinen antropologia (234)
alternative label: Tarkoitus, pelastusoppi (234)
alternative label: Teleologia, pelastusoppi (234)
alternative label: Toivo, pelastusoppi (234)
alternative label: Usko, kristillinen dogmatiikka (234)
alternative label: Uskonelämä, kristillinen dogmatiikka (234)
alternative label: Uskonnollinen kehitys, kristillinen dogmatiikka (234)
alternative label: Uskoon tuleminen, kristinuskon dogmatiikka (234)
alternative label: Uudestisyntyminen, dogmatiikka (234)
alternative label: Vanhurskaus (234)
broader: KRISTILLINEN DOGMATIIKKA
in scheme: URN:NBN:fi:au:hklj:
notation: 234
related: Uskonnonfilosofia
related: Kristologia
related: Kuolema ja kuolemanjälkeinen elämä
related: Kristillinen etiikka
related: HENKILÖ- JA SUKUHISTORIA
related: Elämäkerralliset hakuteokset
related: Suomi
related: Suomen yleiset elämäkerralliset hakuteokset
related: Filosofit. Psykologit. Kasvatustieteiden edustajat
related: URN:NBN:fi:au:hklj:992
related: Yhteiskuntaelämän, joukkotiedotuksen, liikenteen ja maanpuolustuksen edustajat
related: Maantieteilijät. Tutkimusmatkailijat. Löytöretkeilijät.Kansatieteilijät. Antropologit
related: Luonnontieteilijät. Matemaatikot
related: Lääketieteen, tuotantoelämän, tekniikan, kaupan ja talous-elämän edustajat
related: Humanististen tieteiden edustajat
related: Sukuhistoria. Sukututkimus
related: Sukututkimuksen historia ja menetelmät
scope note: Ihmisen elämä ja olemus kristinuskon kannalta Syntiinlankeemus. Perisynti. Synti. Armo Vanhurskauttaminen. Kääntymys. Usko. Katumus. Parannus Vapaa tahto. Predestinaatio-oppi
scope note: Människans liv och väsen ur kristendomens synvinkel Syndafallet. Arvsynden. Synden. Nåden Rättfärdiggörelse. Omvändelse. Tro. Bot. Bättring Fri vilja. Predestinationsläran @sv

Lähetystyö
type: Class
type: Concept
subclass of: EVANKELIS-LUTERILAINEN KIRKKO
alternative label: Ambomaa, ev.-lut. lähetystyö (259)
alternative label: Juutalaislähetys, ev.-lut. kirkko (259)
alternative label: Kenttätyö, lähetystyö, ev.-lut. (259)
alternative label: Lähetysseurat, ev.-lut. kirkko (259)
alternative label: Lähetysteologia, ev.-lut. kirkko (259)
alternative label: Lähetystyö, ev.-lut. kirkko (259)
alternative label: Lähetystyöntekijät, ev.-lut. lähetystyö (259)
alternative label: Maallikkosaarnaajat, ev.-lut. kirkko, lähetystyö (259)
alternative label: Missiologia, ev.-lut. kirkko (259)
alternative label: Saarnaajat, lähetystyö, ev.-lut. (259)
alternative label: Systemaattinen teologia, missiologia, ev.-lut. (259)
alternative label: Amboland, ev.luth. mission (259) @sv
alternative label: Fältarbete, mission, ev.luth. (259) @sv
alternative label: Judemission, ev.luth. kyrkan (259) @sv
alternative label: Lekmannapredikanter, ev.luth. kyrkan, kristen mission (259) @sv
alternative label: Missiologi, ev.luth. kyrkan (259) @sv
alternative label: Missionsarbete, ev.luth. kyrkan (259) @sv
alternative label: Missionssällskap, ev.luth. kyrkan (259) @sv
alternative label: Missionsteologi, ev.luth. kyrkan (259) @sv
alternative label: Missionärer, ev.luth. mission (259) @sv
alternative label: Predikanter, mission, ev.luth. (259) @sv
alternative label: Systematisk teologi, missiologi, ev.luth. (259) @sv
broader: EVANKELIS-LUTERILAINEN KIRKKO
in scheme: URN:NBN:fi:au:hklj:
notation: 259
preferred label: Mission work @en
preferred label: Missionsarbete @sv
related: RAAMATTU. RAAMATUNTUTKIMUS
related: Laitokset. Järjestöt
related: Sisälähetys. Evankelioiminen
related: URN:NBN:fi:au:hklj:260
related: URN:NBN:fi:au:hklj:280
related: Itä-Aasian uskonnot ja mytologiat
related: Intian uskonnot ja mytologiat
related: Buddhalaisuus ja sen mytologia
related: Muinais-Egyptin ja Etu-Aasian uskonnot ja mytologiat
related: Antiikin Kreikan ja Rooman uskonnot ja mytologiat
related: Persian uskonnot ja mytologiat
related: Islam ja sen mytologia
related: Juutalaisten uskonto ja sen mytologia
related: Muut uskonnot ja mytologiat
related: Afrikan alkuperäiskansojen uskonnot
related: Amerikan alkuperäiskansojen uskonnot ja mytologiat
related: Australian ja Oseanian alkuperäiskansojen uskonnot ja mytologiat
related: Muinaissuomalaiset ja suomalais-ugrilaiset uskonnot ja mytologiat
related: Muinaisgermaaniset, -balttilaiset, -slaavilaiset ja -kelttiläiset uskonnot ja mytologiat
related: Muinaispohjoismaiset uskonnot ja mytologiat
scope note: Kristillinen ev.-lut. kirkon lähetystyö ja Raamatun levitystyö ei-kristillisillä alueilla ja ei-kristillisten väestöryhmien keskuudessa. Juutalaislähetys Lähetystyön teologia, menetelmät ja työntekijät sekä heidän koulutuksensa Jos teoksessa on sekä lähetystyötä että sisälähetystä tai evankelioimista, on etusija luokalla 259
scope note: Den kristna evangelisk-lutherska kyrkans missionsarbete och spridandet av Bibelns ord i icke-kristna områden och bland icke-kristna befolkningsgrupper. Mission bland judarna Missionsarbetets teologi och metoder samt missionsarbetarna och utbildningen av dem Om verket innehåller både missionsarbete och inremission eller evangelisation ges företräde åt klass 259 @sv

Oppikirjat. Oppaat. Harjoituskirjat. Tehtäväkokoelmat
type: Class
type: Concept
subclass of: URN:NBN:fi:au:hklj:300
alternative label: Asuminen ulkomailla (302)
alternative label: Au pairit, työskentely ulkomailla (302)
alternative label: Kansainvälinen liikkuvuus, työskentely ulkomailla (302)
alternative label: Kansalaistaito (302)
alternative label: Kansalaistaito, oppikirjat ja oppaat (302)
alternative label: Kotiseutu, kotiseutuoppi (302)
alternative label: Kotiseutuoppi (302)
alternative label: Lähetetyt työntekijät (302)
alternative label: Lähetetyt työntekijät , oppaat (302)
alternative label: Muutot, ulkomaille muuttaminen (302)
alternative label: Sosiaaliset taidot, yhteiskuntaoppi (302)
alternative label: Synnyinseutu, kotiseutuoppi (302)
alternative label: Työharjoittelu, työskentely ulkomailla (302)
alternative label: Työskentely ulkomailla (302)
alternative label: Työskentely ulkomailla, oppaat (302)
alternative label: Ulkomaantyö (302)
alternative label: Ulkomaantyö, oppaat (302)
alternative label: Ulkomailla asuminen (302)
alternative label: Ulkomailla työskentely (302)
alternative label: Ulkomailla työskentely, oppaat (302)
alternative label: Vuorovaikutustaidot, yhteiskuntaoppi (302)
alternative label: Yhteiskunta, yhteiskuntaoppi (302)
alternative label: Yhteiskuntaoppi (302)
alternative label: Yhteiskuntatieto (302)
alternative label: Ympäristöoppi, kouluaine (302)
alternative label: Arbete utomlands (302) @sv
alternative label: Arbete utomlands, handledningar (302) @sv
alternative label: Arbetspraktik, arbete utomlands (302) @sv
alternative label: Au pairer, arbete utomlands (302) @sv
alternative label: Flyttningar, flyttning utomlands (302) @sv
alternative label: Födelsebygd, hembygdslära (302) @sv
alternative label: Hembygd, hembygdslära (302) @sv
alternative label: Hembygdslära (302) @sv
alternative label: Interaktionskunskaper, samhällslära (302) @sv
alternative label: Internationell mobilitet, arbete utomlands (302) @sv
alternative label: Medborgarfärdighet (302) @sv
alternative label: Medborgarfärdighet, läroböcker och vägledningar (302) @sv
alternative label: Omgivningslära, skolämne (302) @sv
alternative label: Samhälle, samhällslära (302) @sv
alternative label: Samhällskunskap (302) @sv
alternative label: Samhällslära (302) @sv
alternative label: Sociala färdigheter, samhällslära (302) @sv
alternative label: Utlandsarbete (302) @sv
alternative label: Utlandsarbete, handledningar (302) @sv
alternative label: Utlandsboende (302) @sv
alternative label: Utsända arbetare (302) @sv
alternative label: Utsända arbetare, handledningar (302) @sv
broader: URN:NBN:fi:au:hklj:300
in scheme: URN:NBN:fi:au:hklj:
notation: 302
preferred label: Text books. Guides. Exercise books. Collections of examination exercises @en
preferred label: Läroböcker. Vägledningar. Övningsböcker. Samlingar av provuppgifter @sv
related: URN:NBN:fi:au:hklj:183
related: Historialliset koulumuodot
related: Esikoulut
related: Peruskoulut
related: URN:NBN:fi:au:hklj:183.5
related: Keskiasteen koulutus
related: URN:NBN:fi:au:hklj:183.7
related: Erikoiskoulut. Kokeilukoulut
related: Muiden maiden koululaitokset
related: URN:NBN:fi:au:hklj:184
related: Turun akatemia
related: Helsingin yliopisto
related: Turun yliopisto
related: Åbo akademi
related: Jyväskylän yliopisto
related: Oulun yliopisto
related: Tampereen yliopisto
related: Muut yliopistot ja korkeakoulut
related: Teknilliset korkeakoulut
related: Kauppakorkeakoulut
related: Muiden maiden yliopistot ja korkeakoulut
related: Asiakirjakaavat ja -ohjeet. Oikeusoppaat
related: Oppikirjat. Harjoituskirjat. Tehtäväkokoelmat
scope note: Yhteiskuntatieteiden yleiset oppikirjat, harjoituskirjat ja tehtäväkokoelmat Yhteiskunta- ja ympäristöopin sekä kansalaistaidon oppikirjat, harjoituskirjat ja tehtäväkokoelmat Tässä myös ulkomaalaisille, ulkomaille muuttaville ja ulkomailla työskenteleville tarkoitetut yleiset oppaat Tiettyä maata tai erikoisalaa koskevat teokset maan tai erikoisalan mukaisessa luokassa Eri yhteiskuntatieteiden oppikirjat, harjoituskirjat ja tehtäväkokoelmat alan mukaisessa luokassa
scope note: Allmänna läroböcker, övningsböcker och samlingar av provuppgifter i samhällsvetenskaperna Läroböcker, övningsböcker och samlingar av provuppgifter i samhällslära, miljökunskap och medborgarkunskap Hit också allmänna vägledningar för utlänningar, för personer som avser att flytta utomlands och för personer som arbetar utomlands Verk som rör ett bestämt land eller specialområde klassificeras enligt land eller specialområde Olika läroböcker, övningsböcker och samlingar med prov som rör samhällsvetenskaperna klassificeras enligt område @sv

Pääoma. Työ. Luonnonvarat
type: Class
type: Concept
subclass of: URN:NBN:fi:au:hklj:360
alternative label: Aivovienti, taloustiede (361)
alternative label: Aivovienti, työvoiman liikkuvuus (361)
alternative label: Aivovuoto, taloustiede (361)
alternative label: Aivovuoto, työvoiman liikkuvuus (361)
alternative label: Akateeminen työvoima, työvoimapolitiikka (361)
alternative label: Ammatinharjoittajat, työvoimapolitiikka (361)
alternative label: Ammatissa toimimaton väestö, työvoimapolitiikka (361)
alternative label: Ammatissa toimiva väestö, työvoimapolitiikka (361)
alternative label: Ammattirakenne, työvoimapolitiikka (361)
alternative label: Ammattitaidoton työvoima, työvoimapolitiikka (361)
alternative label: Ansiotyö, työn taloustiede (361)
alternative label: Arvonluonti (361)
alternative label: Biotalous, uusiutuvat luonnonvarat, taloustiede (361)
alternative label: Halpatyövoima, työvoimapolitiikka (361)
alternative label: Henkinen pääoma, pääoma (361)
alternative label: Inhimillinen pääoma, pääoma (361)
alternative label: Joustavuus, työmarkkinapolitiikka (361)
alternative label: Kansallistaminen, tuotantovälineet (361)
alternative label: Kartellit, taloustiede (361)
alternative label: Kilpailunrajoitukset, monopolit (361)
alternative label: Kilpailurajoitukset, monopolit (361)
alternative label: Koulutustarve, työvoimapolitiikka (361)
alternative label: Koulutustaso, työvoima (361)
alternative label: Koulutustausta, työvoimapolitiikka (361)
alternative label: Kulutusmenot, kansantalous (361)
alternative label: Laiton työvoima (361)
alternative label: Lisäarvo, kansantaloustiede (361)
alternative label: Luonnonvarat, taloustiede (361)
alternative label: Luova talous , työn tuottavuus (361)
alternative label: Maankorko, taloustiede (361)
alternative label: Maanomistus, taloustiede (361)
alternative label: Monopolit, taloustiede (361)
alternative label: OTC-markkinat (361)
alternative label: Oligopoli (361)
alternative label: Omaisuus, pääoma, kansantaloustiede (361)
alternative label: Omistajat, pääoma (361)
alternative label: Osaamispääoma, pääoma (361)
alternative label: Paikallinen sopiminen, työvoimapolitiikka (361)
alternative label: Pareto-tehokkuus, pääomateoriat (361)
alternative label: Poistuma, pääoma (361)
alternative label: Poistuma, työvoima (361)
alternative label: Prekariaatti, työvoimapolitiikka (361)
alternative label: Pääoma, kansantalous (361)
alternative label: Pääomakanta, kansantalous (361)
alternative label: Pääomaliikeet, kansantalous (361)
alternative label: Pääomamarkkinat (361)
alternative label: Pääomanliikeet, kansantalous (361)
alternative label: Pääomanmuodostus, kansantalous (361)
alternative label: Pääomansiirrot, kansantalous (361)
alternative label: Pääomatulot, kansantalous (361)
broader: URN:NBN:fi:au:hklj:360
in scheme: URN:NBN:fi:au:hklj:
notation: 361
related: Työoikeus
related: Työn sosiologia
related: URN:NBN:fi:au:hklj:363
related: Kiinteistöt. Tontit
related: Talousjärjestelmät
related: Maailmankauppa. Kansainväliset talousjärjestöt
related: Tuotanto. Tuottavuus
related: Hinnat. Hintapolitiikka
related: Elintaso. Kulutus
related: Talousmaantiede. Taloushistoria
related: Työ sosiaalipoliittisena kysymyksenä
related: Työolot
related: Työsuojelu
related: Työllisyys. Työttömyys. Työvoimapalvelu
related: Maapolitiikka
related: Työväenliike
related: Työmarkkinajärjestöt
related: Ympäristönsuojelu. Luonnonsuojelu
related: URN:NBN:fi:au:hklj:620
related: URN:NBN:fi:au:hklj:650
related: Maatalouspolitiikka
related: Henkilöstöpolitiikka
scope note: Pääomanmuodostus. Pääoman muodot. Varallisuus. Reaalipääoma. Tuotantovälineet. Käyttöpääoma. Pääoman tuotto. Voitto. Lisäarvo Taloudelliset yhteenliittymät. Kartellit. Trustit. Monopolit Työ, työmarkkinat ja työvoimapolitiikka taloustieteen kannalta Raaka-aineet ja luonnonvarat taloustieteen kannalta Pääoman ja tuotantovälineiden omistussuhteet, kansallistaminen, yksityistäminen ja pakkolunastus Tiettyä tuotantovälinettä, raaka-ainetta tai luonnonvaraa koskevat teokset alan mukaisessa luokassa
scope note: Kapitalbildning. Kapitalformer. Förmögenhet. Realkapital. Produktionsmedel. Driftskapital. Kapitalavkastning. Vinst. Mervärde Ekonomiska sammanslutningar. Karteller. Truster. Monopol Arbetet, arbetsmarknaderna och arbetsmarknadspolitiken ur ekonomins synvinkel Råmaterial och naturresurser ur ekonomins synvinkel Kapital och produktionsmedel: ägandeförhållanden, nationalisering och privatisering Arbeten som rör enskilda produktionsmedel, råmaterial eller naturresurser klassificeras enligt område @sv

Sotahistoria
type: Class
type: Concept
subclass of: URN:NBN:fi:au:hklj:390
alternative label: Asemasota, sotahistoria (399 +)
alternative label: Asepuvut (399 +)
alternative label: Asevelimerkit, sotahistoria (399 +)
alternative label: Aseveljeys, sotahistoria (399 +)
alternative label: Desantit, sotahistoria (399 +)
alternative label: Divisioonat , sotahistoria, sotatieteellinen (399 +)
alternative label: Ensimmäinen maailmansota, sotatieteellinen sotahistoria (399 +)
alternative label: Haarniskat, asepukujen historia (399 +)
alternative label: Ilmapuolustus, sotahistoria, sotatieteellinen (399 +)
alternative label: Ilmasota, sotahistoria, sotatiede (399 +)
alternative label: Ilmatorjunta, sotahistoria, sotatieteellinen (399 +)
alternative label: Irakin-Iranin sota, sotahistoria (399)
alternative label: Juoksuhaudat, sotahistoria (399 +)
alternative label: Kaukopartiot, sotahistoria, sotatieteellinen (399 +)
alternative label: Kenttähaudat, taistelupaikat, sotahistoria (399 +)
alternative label: Kenttälinnoitukset, sotahistoria, sotatieteellinen (399 +)
alternative label: Komppaniat, sotahistoria, sotatieteellinen (399 +)
alternative label: Kypärät, sotilaspukujen historia (399 +)
alternative label: Laivastotukikohdat, sotahistoria, sotatieteellinen (399 +)
alternative label: Lentotukikohdat, sotahistoria, sotatieteellinen (399 +)
alternative label: Maailmansodat, sotahistoria, sotatieteellinen (399 +)
alternative label: Maihinnousu, sotahistoria, sotatieteellinen (399 +)
alternative label: Merisota, sotahistoria, sotatieteellinen (399 +)
alternative label: Meritaistelut, sotahistoria, sotatieteellinen (399 +)
alternative label: Piiritys, sotahistoria, sotatieteellinen (399 +)
alternative label: Poitiers’n taistelu (1356), sotahistoria (399)
alternative label: Puunilaissodat, Karthago, sotahistoria (399)
alternative label: Puvut, asepuvut (399 +)
alternative label: Päänsuojaimet, sotilaspukujen historia (399 +)
alternative label: Rakuunat, sotahistoria, sotatieteellinen (399 +)
alternative label: Rintama, sotahistoria, sotatieteellinen (399 +)
alternative label: Rykmentit, sotahistoria, sotatieteellinen (399 +)
alternative label: Sodat, sotahistoria, sotatieteellinen (399 +)
alternative label: Sota, sotahistoria, sotatieteellinen (399 +)
alternative label: Sotahistoria, sotatieteellinen (399 +)
alternative label: Sotakirjallisuus, sotahistoria, sotatieteellinen (399 +)
alternative label: Sotamuseot, sotahistoria (399 +)
alternative label: Sotaretket, sotahistoria, sotatieteellinen (399 +)
alternative label: Sotarintama, sotahistoria, sotatieteellinen (399 +)
alternative label: Sotatoimet, sotahistoria, sotatieteellinen (399 +)
alternative label: Sotilaspuvut (399 +)
alternative label: Sotilasvirkapuvut (399 +)
alternative label: Sukellusvenesota, sotahistoria, sotatieteellinen (399 +)
alternative label: Taisteluhaudat, sotahistoria (399 +)
alternative label: Taistelupaikat, sotahistoria (399 +)
alternative label: Taistelut, sotahistoria, sotatieteellinen (399 +)
alternative label: Toinen maailmansota, sotatieteellinen sotahistoria (399 +)
alternative label: Trofeet, sotahistoria (399 +)
alternative label: Univormut, kulttuurihistoria (399 +)
alternative label: Univormut, sotilaspuvut (399 +)
alternative label: Uusi aika, sotahistoria, sotatieteellinen (399 +)
alternative label: Vaatteet, sotilaspuvut (399 +)
broader: URN:NBN:fi:au:hklj:390
in scheme: URN:NBN:fi:au:hklj:
narrower: Suomi
notation: 399
related: URN:NBN:fi:au:hklj:1.4
related: URN:NBN:fi:au:hklj:320
related: URN:NBN:fi:au:hklj:325
related: Rauhankysymys. Rauhantutkimus
related: URN:NBN:fi:au:hklj:332.2
related: URN:NBN:fi:au:hklj:340
related: Organisaatioiden ja laitosten sosiologia
related: Aseteknologia
related: URN:NBN:fi:au:hklj:393.09
related: Muiden maiden puolustusvoimat
related: URN:NBN:fi:au:hklj:909
related: Vanhan ajan historia
related: Keskiajan historia 400-1499
related: Uuden ajan historia 1500-1788
related: Uusimman ajan historia 1789-1913
related: Nykyajan historia 1914-1938
related: I maailmansodan historia 1914-1918
related: Nykyajan historia 1939-
related: II maailmansodan historia 1939-1945
scope note: Puhtaasti sotilaallisia kysymyksiä koskevat historiateokset Sotahistoriallinen tutkimus Asepuvut ja niiden historia
scope note: Historiska verk som rör rent militära frågor Krigshistorisk forskning Uniformerna och deras historia @sv

Suomi
type: Class
type: Concept
subclass of: EUROOPPA
alternative label: Etelä-Suomen lääni (412 +)
alternative label: Etelä-Suomen lääni, maantiede, matkat (412 +)
alternative label: Itä-Suomen lääni (412)
alternative label: Itä-Suomen lääni, maantiede, matkat (412)
alternative label: Kirkonkylät, Suomen maantiede (412 +)
alternative label: Kotimaanmatkailu (412 +)
alternative label: Kotiseutukuvaukset (412 +)
alternative label: Kotiseutukuvaukset, maantiede, matkat (412 +)
alternative label: Kunnat, Suomen maantiede (412 +)
alternative label: Kylät, Suomi (412 +)
alternative label: Länsi-Suomen lääni (412 +)
alternative label: Länsi-Suomen lääni, maantiede, matkat (412 +)
alternative label: Läänit, Suomen maantiede (412 +)
alternative label: Maakunnat, aluemaantiede, Suomi (412 +)
alternative label: Maalaiskunnat, Suomen maantiede (412 +)
alternative label: Maantiede, Suomen maantiede (412 +)
alternative label: Maantieto, oppikirjat, Suomen maantieto (412 +)
alternative label: Maaseutu, maantiede (412 +)
alternative label: Pienkunnat, Suomen maantiede (412 +)
alternative label: Pitäjät (412 +)
alternative label: Pitäjät, maantiede, matkat (412 +)
alternative label: Pohjoismaalaiset, maantiede, Suomi (412 +)
alternative label: Saaristolaiset, maantiede, Suomi (412 +)
alternative label: Suomalaiset, Suomi (412 +)
alternative label: Suomalaisuus, maantiede, matkakuvaukset (412 +)
alternative label: Suomi (412 +)
alternative label: Suomi, maantiede, matkat (412 +)
alternative label: Suomi-kuva (412 +)
alternative label: Suomi-kuva, maantiede, matkat (412 +)
alternative label: Vaarat, Suomen maantiede (412 +)
alternative label: Väli-Suomi (412 +)
alternative label: Väli-Suomi, maantiede, matkat (412 +)
alternative label: Byar, Finland (412 +) @sv
alternative label: Finland (412 +) @sv
alternative label: Finland, geografi, resor (412 +) @sv
alternative label: Finlandsbild (412 +) @sv
alternative label: Finlandsbild, geografi, resor (412 +) @sv
alternative label: Finländare, Finland (412 +) @sv
alternative label: Finskhet, geografi, reseskildringar (412 +) @sv
alternative label: Geografi, Finlands geografi (412 +) @sv
alternative label: Geografi, maantieto, läroböcker, Finlands geografi (412 +) @sv
alternative label: Hembygdsskildringar (412 +) @sv
alternative label: Hembygdsskildringar, geografi, resor (412 +) @sv
alternative label: Inrikesturism (412 +) @sv
alternative label: Kommuner, Finlands geografi (412 +) @sv
alternative label: Kyrkbyar, Finlands geografi (412 +) @sv
alternative label: Landsbygd, geografi (412 +) @sv
alternative label: Landskap, provins, regionalgeografi, Finland (412 +) @sv
alternative label: Landskommuner, Finlands geografi (412 +) @sv
alternative label: Län, Finlands geografi (412 +) @sv
alternative label: Mellan-Finland (412 +) @sv
alternative label: Mellan-Finland, geografi, resor (412 +) @sv
alternative label: Nordbor, geografi, Finland (412 +) @sv
alternative label: Skogbevuxna fjäll, Finlands geografi (412 +) @sv
alternative label: Skärgårdsbor, geografi, Finland (412 +) @sv
alternative label: Småkommuner, Finlands geografi (412 +) @sv
alternative label: Socknar (412 +) @sv
alternative label: Socknar, geografi, resor (412 +) @sv
broader: EUROOPPA
in scheme: URN:NBN:fi:au:hklj:
narrower: Suomenruotsalaisten asuma-alueet
narrower: Uusimaa
narrower: Varsinais-Suomi. Satakunta
narrower: Ahvenanmaa
narrower: Häme. Pirkanmaa
narrower: Kymenlaakso. Etelä-Karjala
narrower: Etelä-Savo
narrower: Pohjois-Savo
narrower: Etelä-Pohjanmaa. Keski-Pohjanmaa
narrower: Pohjois-Pohjanmaa. Kainuu. Koillismaa
notation: 412
related: Oppikirjat. Harjoituskirjat. Tehtäväkokoelmat
related: URN:NBN:fi:au:hklj:411
related: URN:NBN:fi:au:hklj:460
related: URN:NBN:fi:au:hklj:920
scope note: Suomea koskevat yleisteokset Suomen maantieteen yleisteokset ja yleiset oppikirjat Tässä ja alaluokissa matkailu, matkailupolitiikka, matkailuelinkeino, matkailupalvelut sekä matkailun edistäminen Suomessa Tässä ja alaluokissa Suomea koskevat matkakertomukset Tässä ja alaluokissa matkailijoille tarkoitetut Suomea koskevat matkaoppaat, leirintäalue-, hotelli-, motelli-, retkeilymaja-, nähtävyys-, ja museo-oppaat Jos teoksessa on sekä maantiedettä että historiaa, on etusija luokalla 412+
scope note: Allmänna verk som rör Finland Allmänna verk och allmänna läroböcker om Finlands geografi Hit och till underklasserna turism, turistpolitik, turistnäring, service för turister och turistfrämjande i Finland Hit och till underklasserna reseskildringar som rör Finland Hit och till underklasserna resehandböcker och guideböcker om campingområden, hotell, motell, vandrarhem, sevärdheter och museer avsedda för turister i Finland Om verket handlar om både geografi och historia ges företräde åt klass 412+ @sv

FYSIIKKA
type: Class
type: Concept
subclass of: LUONNONTIETEET
alternative label: ALD-menetelmä, ohutkalvot (530)
alternative label: ALD-tekniikka, ohutkalvot (530)
alternative label: Atomikerroskasvatus, ohutkalvot (530)
alternative label: Fysiikka (530)
alternative label: Fysiikka, yleinen fysiikka (530)
alternative label: Fysikaaliset ilmiöt, fysiikka (530 ... 537)
alternative label: Fysikaaliset ominaisuudet, fysiikka (530 ... 537)
alternative label: Luonnonopin oppikirjat, fysiikka, oppikirjat (530 ... 537)
alternative label: Luonnontieteet, fysiikka (530 ... 537)
alternative label: Luonnontieto, fysiikka (530 ... 537)
alternative label: Matemaattiset tieteet, fysiikka (530 ... 537)
alternative label: Metamateriaalit, fysikaaliset ominaisuudet (530 ... 537)
alternative label: Ohutkalvot, fysiikka (530)
alternative label: Perussuureet, fysiikka (530)
alternative label: Rajapintailmiöt, fysikaaliset ilmiöt (530 ... 537)
alternative label: Suureet, fysiikka (530)
alternative label: ALD-metoden, tunnfilmer (530) @sv
alternative label: ALD-teknik, tunnfilmer (530) @sv
alternative label: Atomlagerdeposition, tunnfilmer (530) @sv
alternative label: Fysik (530) @sv
alternative label: Fysik, allmän fysik (530) @sv
alternative label: Fysikaliska egenskaper, fysik (530 ... 537) @sv
alternative label: Fysikaliska fenomen, fysik (530 ... 537) @sv
alternative label: Grundstorheter, fysik (530) @sv
alternative label: Gränsytfenomen, fysikaliska fenomen (530 ... 537) @sv
alternative label: Matematiska vetenskaper, fysik (530 ... 537) @sv
alternative label: Metamaterial, fysikaliska egenskaper (530 ... 537) @sv
alternative label: Naturlära, fysik (530 ... 537) @sv
alternative label: Naturlära, läroböcker, fysik, läroböcker (530 ... 537) @sv
alternative label: Naturvetenskaper, fysik (530 ... 537) @sv
alternative label: Storheter, fysik (530) @sv
alternative label: Tunnfilmer, fysik (530) @sv
broader: LUONNONTIETEET
in scheme: URN:NBN:fi:au:hklj:
narrower: Fysiikka harrasteena ja ajanvietteenä
narrower: Yleinen ja teoreettinen fysiikka
narrower: Kokeellinen fysiikka
narrower: Mekaniikka
narrower: Lämpöoppi
narrower: Äänioppi. Mekaaniset värähtelyt
narrower: Valo-oppi. Värioppi. Säteilyoppi
narrower: Sähköoppi. Magnetismi
notation: 530
preferred label: PHYSICS @en
preferred label: FYSIK @sv
related: Geomorfologia. Geodynamiikka
related: MATEMATIIKKA
related: Maailmankaikkeus. Kosmologia. Kosmogonia
related: KEMIA
related: FYSIKAALINEN KEMIA
related: Yleisbiologia
related: Lääketieteellinen kemia ja fysiikka
related: URN:NBN:fi:au:hklj:620
scope note: Fysiikan yleisteokset. Yleiset fysiikan oppikirjat Teokset, joissa on sekä teoreettista että kokeellista fysiikkaa Jos teos koskee sekä matematiikkaa että fysiikkaa, on etusija luokilla 510-519 Jos teos koskee sekä fysiikkaa että kemiaa, on etusija luokilla 530-537 Fysiikan tekniset ja teolliset sovellukset alan mukaisessa luokassa
scope note: Allmänna verk om fysik. Allmänna läroböcker i fysik Verk som innehåller både teoretisk och experimentell fysik Om verket rör både matematik och fysik ges företräde åt klasserna 510-519 Om verket rör både fysik och kemi ges företräde åt klasserna 530-537 Tekniska och industriella tillämpningar av fysik klassificeras enligt område @sv

Reumataudit
type: Class
type: Concept
subclass of: Sisäelimet. Sisätaudit
alternative label: Dieettikeittokirjat, reuma (617.33)
alternative label: Kihti (617.33)
alternative label: Nivelet, nivelreuma (617.33)
alternative label: Nivelreuma (617.33)
alternative label: Reumaoppi (617.33)
alternative label: Reumataudit (617.33)
alternative label: Yliliikkuvuus, reumatologia (617.33)
alternative label: Dietkokböcker, reumatism (617.33) @sv
alternative label: Gikt (617.33) @sv
alternative label: Hypermobilitet, reumatologi (617.33) @sv
alternative label: Leder, ledgångsreumatism (617.33) @sv
alternative label: Ledgångsreumatism (617.33) @sv
alternative label: Reumatiska sjukdomar (617.33) @sv
alternative label: Reumatologi (617.33) @sv
broader: Sisäelimet. Sisätaudit
in scheme: URN:NBN:fi:au:hklj:
notation: 617.33
preferred label: Rheumatic diseases @en
preferred label: Reumatiska sjukdomar @sv
related: URN:NBN:fi:au:hklj:181.9
related: URN:NBN:fi:au:hklj:332.22
related: URN:NBN:fi:au:hklj:371.6
related: URN:NBN:fi:au:hklj:373
related: URN:NBN:fi:au:hklj:576
related: Anatomia
related: URN:NBN:fi:au:hklj:612
related: URN:NBN:fi:au:hklj:613.1
related: URN:NBN:fi:au:hklj:613.3
related: URN:NBN:fi:au:hklj:613.31
related: URN:NBN:fi:au:hklj:613.5
related: URN:NBN:fi:au:hklj:615
related: URN:NBN:fi:au:hklj:615.1
related: URN:NBN:fi:au:hklj:615.3
related: URN:NBN:fi:au:hklj:615.8
related: URN:NBN:fi:au:hklj:616
related: URN:NBN:fi:au:hklj:616.2
related: URN:NBN:fi:au:hklj:616.3
related: URN:NBN:fi:au:hklj:617.1
related: URN:NBN:fi:au:hklj:617.4
related: URN:NBN:fi:au:hklj:617.7
related: Liikuntaelimet. Liikuntaelinten taudit
related: URN:NBN:fi:au:hklj:691.1
related: URN:NBN:fi:au:hklj:691.12
scope note: Reumataudit, niiden patologia, diagnostiikka, hoito ja ennaltaehkäisy. Nivelreuma Reumasairaiden ruokavaliot ja keittokirjat
scope note: Reumatiska sjukdomar, förebyggande och behandling av dem samt deras diagnostik och patologi. Ledgångsreumatism Dieter och kokböcker för diabetiker @sv

Ohjelmointi. Ohjelmointikielet
type: Class
type: Concept
subclass of: URN:NBN:fi:au:hklj:627.7
alternative label: Algoritmit, tietokoneohjelmat (627.72)
alternative label: Antivirusohjelmat (627.72)
alternative label: Atk-ohjelmointi (627.72)
alternative label: Atk-ohjelmointi, ohjelmointi (627.72)
alternative label: Atk-ohjelmointikielet (627.72)
alternative label: Atk-ohjelmointikielet, ohjelmointi (627.72)
alternative label: Avoin lähdekoodi (627.72)
alternative label: Bugit, ohjelmointi (627.72)
alternative label: Geneettiset algoritmit, tietokoneohjelmat (627.72)
alternative label: Konekielet (627.72)
alternative label: Kyselykielet (627.72)
alternative label: Lausekielet (627.72)
alternative label: Lineaarinen ohjelmointi (627.72)
alternative label: Lähdekoodit (627.72)
alternative label: Metakielet, ohjelmointikielet (627.72)
alternative label: Ohjelmakehittimet (627.72)
alternative label: Ohjelmointi (627.72)
alternative label: Ohjelmointi, ohjelmoinnin perusteet (627.72)
alternative label: Ohjelmointikielet (627.72)
alternative label: Ohjelmointikielet, ohjelmointi (627.72)
alternative label: Ohjelmointivirheet, ohjelmointi (627.72)
alternative label: Ohjelmointiympäristö (627.72)
alternative label: Ohjelmointiympäristö, ohjelmointi (627.72)
alternative label: Ohjelmoitavat logiikat (627.72)
alternative label: Olio-ohjelmointi (627.72)
alternative label: Oliokeskeisyys (627.72)
alternative label: Open source (627.72)
alternative label: Peligrafiikka, ohjelmointi (627.72)
alternative label: Pelisuunnittelu, ohjelmointi (627.72 +)
alternative label: Rinnakkaisohjelmointi (627.72)
alternative label: Small Basic, ohjelmointikielet (627.72)
alternative label: Sovelluskehittimet, ohjelmointi (627.72)
alternative label: Tietokonekielet (627.72)
alternative label: Tietokonekielet, ohjelmointi (627.72)
alternative label: Tietokoneohjelmointi (627.72)
alternative label: Tietokoneohjelmointi, ohjelmointi (627.72)
alternative label: Tietokonevirukset (627.72)
alternative label: Vaatimushallinta, ohjelmointi (627.72)
alternative label: Vaatimustenhallinta, ohjelmointi (627.72)
alternative label: Vapaa koodi (627.72)
alternative label: Vapaa lähdekoodi (627.72)
alternative label: Virustentorjuntaohjelmat (627.72)
alternative label: Virustorjuntaohjelmat (627.72)
alternative label: ADB-programmering (627.72) @sv
alternative label: ADB-programmering, programmering (627.72) @sv
alternative label: Adb-programmeringsspråk (627.72) @sv
alternative label: Adb-programmeringsspråk, programmering (627.72) @sv
alternative label: Algoritmer, dataprogram (627.72) @sv
broader: URN:NBN:fi:au:hklj:627.7
in scheme: URN:NBN:fi:au:hklj:
notation: 627.72
related: LOGIIKKA
related: Logistiikka. Looginen kalkyyli
related: URN:NBN:fi:au:hklj:182
related: URN:NBN:fi:au:hklj:332.1
related: URN:NBN:fi:au:hklj:384
related: Sähköoppi. Magnetismi
related: URN:NBN:fi:au:hklj:620.88
related: Systeemityö
related: URN:NBN:fi:au:hklj:627.73
related: Käyttöjärjestelmät
related: Tekstinkäsittelyohjelmat
related: Taulukkolaskentaohjelmat
related: Tietokantaohjelmat
related: Kuvankäsittelyohjelmat. Grafiikkaohjelmat. Taitto-ohjelmat
related: Tietoliikenneohjelmat
related: Tietokoneiden lisälaitteet
related: Säätö- ja systeemitekniikka. Teollinen automaatio
related: URN:NBN:fi:au:hklj:627.7512
related: Elektroniikka
related: URN:NBN:fi:au:hklj:667.7
related: URN:NBN:fi:au:hklj:667.71
related: Toimistotyö
related: URN:NBN:fi:au:hklj:681
related: Toimistokoneet
scope note: Ohjelmoinnin yleisteokset sekä ohjelmoinnin perusteet ja ohjelmoinnin opiskelu Vuokaaviot yleensä. Ohjelmien testaus ja ylläpito yleensä Oliokeskeisyys ja olio-ohjelmointi yleensä Tässä myös virusohjelmat sekä virusten torjunta Tässä myös ohjelmointikieliä koskevat yleisteokset Kone- ja lausekielet yleensä Jos teoksessa on sekä ohjelmointia että systeemityötä, on etusija luokalle 627.71
scope note: Allmänna verk om programmering och grunderna för programmering samt läromedel för programmering Flödesplaner i allmänhet. Testning och underhåll av program i allmänhet Objektorientering och objektorienterad programmering i allmänhet Hit också virusprogram och bekämpning av virus Hit också allmänna verk om programmeringsspråk Maskinspråk i allmänhet. Högnivåspråk i allmänhet Om verket innehåller både programmering och systemarbete ges företräde åt klass 627.71 @sv

Tekninen rakennussuunnittelu
type: Class
type: Concept
subclass of: URN:NBN:fi:au:hklj:660
alternative label: Havainnekuvat, rakennustekniikka (663)
alternative label: Konseptisuunnittelu, tekninen rakennussuunnittelu (663)
alternative label: Piirrokset, rakennuspiirustukset (663)
alternative label: Piirtäminen, rakennuspiirustus (663)
alternative label: Piirustukset, rakennuspiirustukset (663)
alternative label: Piirustus, rakennuspiirustus (663)
alternative label: Pohjapiirrokset, rakennuspiirustukset (663)
alternative label: Pohjapiirustukset, rakennuspiirustukset (663)
alternative label: Rakennesuunnittelu, rakennustekniikka (663)
alternative label: Rakennusohjeet, rakennustekniikka (663)
alternative label: Rakennuspiirustus, rakennustekniikka (663)
alternative label: Rakennussuunnittelu, rakennustekniikka (663)
alternative label: Rakennustekniikka, rakennussuunnittelu (663)
alternative label: Rakentamisohjeet, rakennustekniikka (663)
alternative label: Suunnittelu, tekninen rakennussuunnittelu (663)
alternative label: Suunnittelumenetelmät, tekninen rakennussuunnittelu (663)
alternative label: Suunnitteluohjeet, tekninen rakennussuunnittelu (663)
alternative label: Tekninen rakennuspiirustus (663)
alternative label: Tilasuunnittelu, rakennustekniikka (663)
alternative label: Vuorovaikutteinen suunnittelu, tekninen rakennussuunnittelu (663)
alternative label: Yhteissuunnittelu, tekninen rakennussuunnittelu (663)
alternative label: Yhteisöllinen suunnittelu, tekninen rakennussuunnittelu (663)
alternative label: 3D-bilder, byggnadsteknik (663) @sv
alternative label: Byggnadsinstruktioner, byggnadsteknik (663) @sv
alternative label: Byggnadsplanering, teknisk, byggnadsteknik (663) @sv
alternative label: Byggnadsritning, byggnadsteknik (663) @sv
alternative label: Byggnadsteknik, byggnadsplanering (663) @sv
alternative label: Gemensam planering, teknisk byggnadsplanering (663) @sv
alternative label: Grundplaner, byggnadsritningar (663) @sv
alternative label: Interaktiv planering, teknisk byggnadsplanering (663) @sv
alternative label: Konceptplanering, teknisk byggnadsplanering (663) @sv
alternative label: Konstruktionsprojektering, byggnadsteknik (663) @sv
alternative label: Planering, teknisk byggnadsplanering (663) @sv
alternative label: Planeringsdirektiv, teknisk byggnadsplanering (663) @sv
alternative label: Planeringsmetoder, teknisk byggnadsplanering (663) @sv
alternative label: Planritningar, byggnadsritningar (663) @sv
alternative label: Ritande, byggnadsritning (663) @sv
alternative label: Ritning, byggnadsritning (663) @sv
alternative label: Ritningar, byggnadsritningar (663) @sv
alternative label: Rumsgestaltning, byggnadsteknik (663) @sv
alternative label: Samplanering, teknisk byggnadsplanering (663) @sv
alternative label: Teckningar, byggnadsritningar (663) @sv
alternative label: Teknisk byggnadsritning (663) @sv
broader: URN:NBN:fi:au:hklj:660
in scheme: URN:NBN:fi:au:hklj:
notation: 663
preferred label: Technical building planning @en
preferred label: Teknisk byggnadsplanering @sv
related: Tiet. Kadut. Tienrakennus. Kadunrakennus
related: Sillat. Sillanrakennus
related: Raideliikenneväylät. Junat. Raitiovaunut. Metro
related: Vesirakennus. Vesikulkuneuvot
related: Satamat. Satamatekniikka
related: Vesiväylät. Vesien säännöstely
related: Vesijohto-, viemäri- ja vedenpuhdistustekniikka
related: Vesikulkuneuvot
related: Laivat. Laivanrakennus
related: URN:NBN:fi:au:hklj:625.72
related: Muut vesikulkuneuvot
related: Rakennusstatiikka. Rakennusaineet
related: Talonrakennus
related: Rakennustyöt. Rakennusaineet. Rakennustarvikkeet
related: Muuraus. Rappaus
related: Maalaustyöt
related: Rakenneosat
related: URN:NBN:fi:au:hklj:667.7
related: URN:NBN:fi:au:hklj:667.71
related: Uunit. Takat
related: Huoneakustiikka
related: Rakennusten erillistilat
related: Rakennuksen kunnossapito
related: Piirustuksen materiaalit ja tekniikka
scope note: Teknisen rakennussuunnittelun ja rakennuspiirustuksen yleisteokset Teokset, jotka koskevat teknistä rakennussuunnittelua tai rakennuspiirustusta sekä talonrakennuksen että muun rakennustekniikan kannalta Tekniset rakennuspiirustukset, rakennusselitykset ja rakennusselostukset yleensä Määrä- ja kustannuslaskelmat yleensä
scope note: Allmänna verk om teknisk byggnadsplanering och byggnadsritning Verk som handlar om teknisk byggnadsplanering eller byggnadsritning med hänsyn till både husbyggnad och annan byggnadsteknik Tekniska byggnadsritningar, byggnadsbeskrivningar och byggnadsredogörelser i allmänhet Mängd- och kostnadskalkyler i allmänhet @sv

Markkinointi. Asiakaspalvelu
type: Class
type: Concept
subclass of: URN:NBN:fi:au:hklj:675
alternative label: Affiliate-markkinointi (675.8)
alternative label: Agentit, myyntiedustajat (675.8)
alternative label: Agentuurit (675.8)
alternative label: Alennusmyynti (675.8)
alternative label: Asiakashallinta (675.8)
alternative label: Asiakasjohtaminen (675.8)
alternative label: Asiakaskeskeisyys (675.8)
alternative label: Asiakaskokemukset (675.8)
alternative label: Asiakaskokemus (675.8)
alternative label: Asiakaslähtöinen tarjontaketjun hallinta (675.8)
alternative label: Asiakaslähtöisyys (675.8)
alternative label: Asiakaspalvelu (675.8)
alternative label: Asiakassegmentointi, markkinointi (675.8)
alternative label: Asiakassuhde (675.8)
alternative label: Asiakassuhteen hallinta (675.8)
alternative label: Asiakastiedot (675.8)
alternative label: Asiakastyytyväisyys (675.8)
alternative label: Asiakastyö (675.8)
alternative label: Asiakasuskollisuus (675.8)
alternative label: Asiakkaat (675.8)
alternative label: Asiakkuuden hallinta (675.8)
alternative label: Asiakkuudenhallinta (675.8)
alternative label: Asiakkuuksien hallinta (675.8)
alternative label: Asiakkuus (675.8)
alternative label: Asiakkuusjohtaminen (675.8)
alternative label: Asiamiehet, myyntiedustajat (675.8)
alternative label: Aukiolo, asiakaspalvelu (675.8)
alternative label: Automaattimyynti (675.8)
alternative label: Avainasiakkuus (675.8)
alternative label: B2b (675.8)
alternative label: Bonuskortit (675.8)
alternative label: Business-to-business-markkinointi (675.8)
alternative label: Business-to-business-myynti (675.8)
alternative label: CRM (675.8)
alternative label: Customer relationship management (675.8)
alternative label: Demonstraatiot, markkinointi (675.8)
alternative label: Digimarkkinointi (675.8)
alternative label: Digitaalinen markkinointi (675.8)
alternative label: Dumping (675.8)
alternative label: ECR (675.8)
alternative label: Edustustilaisuudet, markkinointi (675.8)
alternative label: Efficient Consumer Response (675.8)
alternative label: Esittelijät, kauppa, tuotemarkkinointi (675.8)
alternative label: Esittelyt, markkinointi (675.8)
alternative label: Etukortit (675.8)
alternative label: Etämyynti (675.8)
alternative label: Haamuasiointi, markkinointitutkimus (675.8)
alternative label: Henkilösuhteet, markkinointi, asiakaspalvelu (675.8)
alternative label: Hinnoittelu, markkinointi (675.8)
broader: URN:NBN:fi:au:hklj:675
in scheme: URN:NBN:fi:au:hklj:
notation: 675.8
related: Kauppaoikeus. Yhtiölainsäädäntö. Pankki- ja vakuutuslainsäädäntö
related: URN:NBN:fi:au:hklj:360
related: URN:NBN:fi:au:hklj:363
related: Osuustoiminta
related: Suomen ulkomaankauppa
related: URN:NBN:fi:au:hklj:368
related: Hinnat. Hintapolitiikka
related: Elintaso. Kulutus
related: Ympäristönsuojelu. Luonnonsuojelu
related: Uhanalaiset lajit. Luonnonsuojelualueet
related: Maaperän, metsien ja soiden suojelu
related: Vesien suojelu
related: Ilman suojelu
related: URN:NBN:fi:au:hklj:627.751
related: URN:NBN:fi:au:hklj:649.91
related: URN:NBN:fi:au:hklj:650.2
related: Kaupan historia
related: Liiketalouden hallinto ja organisaatio
related: URN:NBN:fi:au:hklj:675.803
related: Mainonta. Kuluttajanvalistus
related: Mainonta
related: URN:NBN:fi:au:hklj:676.103
related: Kuluttajanvalistus
scope note: Markkinoinnin yleisteokset ja yleiset oppikirjat Menekki yleensä. Markkinoinnin organisaatio yleensä Markkinointipolitiikka, makkinointisuunnitelmat, markkinointikanavat ja markkinointikampanjat yleensä Markkinatutkimukset ja kohderyhmätutkimukset yleensä Alennusmyynti ja hinnoittelu markkinoinnin kannalta yleensä Hintakilpailu yleensä. Kilpailu markkinoinnissa yleensä Vientimarkkinointi yleensä Asiakkuudenhallinta yleensä Asiakaspalvelu ja -neuvonta sekä myyntityö ja -taito yleensä Myyntitavat ja -menetelmät sekä myyntitekniikka yleensä Myymälärutiinit, itsepalvelu, automaattimyynti, posti- ja puhelinmyynti sekä suoramyynti yleensä Verkkomarkkinointi ja sähköinen etämyynti yleensä Erikoisalojen markkinointi ja asiakaspalvelu alan mukaisessa luokassa
scope note: Allmänna verk och läroböcker i marknadsföring Avsättning i allmänhet. Marknadsföringens organisation i allmänhet Marknadsföringspolitk, marknadsföringsplaner, marknadsföringskanaler och marknadsföringskampanjer i allmänhet Marknadsundersökningar och målgruppsundersökningar i allmänhet Realisationer och prissättning ur marknadsföringssynvinkel i allmänhet Priskonkurrens i allmänhet. Konkurrens om marknader i allmänhet Exportmarknadsföring i allmänhet Kundhantering i allmänhet Kundtjänst och kundrådgivning samt försäljningsarbete och försäljningskunskap i allmänhet Försäljningspraxis och försäljningsmetoder samt försäljningsteknik i allmänhet Butiksrutiner, självbetjäning, automatförsäljning, postorder och telefonförsäljning samt direktförsäljning i allmänhet Marknadsföring på nätet och elektrisk distansförsäljning i allmänhet Marknadsföring och kundtjänst inom specialområden klassificeras enligt område @sv

Hotelli- ja ravintolatalous
type: Class
type: Concept
subclass of: LIIKETALOUS. KAUPPA. MARKKINOINTI. LIIKENNEOPETUS
alternative label: Aamiaiset, ravintolatalous (679)
alternative label: Aamiaismajoitus, hotelli- ja ravintolatalous (679)
alternative label: Anniskelu, ravintolatalous (679)
alternative label: Anniskeluoikeudet, ravintolatalous (679)
alternative label: Annostus, ravintolatalous (679)
alternative label: Ateriat, ravintolatalous (679)
alternative label: Baarit, ravintolatalous (679)
alternative label: Bed and breakfast, hotelli- ja ravintolatalous (679)
alternative label: Bistrot, ravintolatalous (679)
alternative label: Brunssit, ravintolatalous (679)
alternative label: Catering, ravintolatalous (679)
alternative label: Etniset ravintolat, ravintolatalous (679)
alternative label: Fast food, ravintolatalous (679)
alternative label: Grillikioskit (679)
alternative label: Grillit, ravintolat (679)
alternative label: Hampurilaisravintolat (679)
alternative label: Hostellit, hotellitalous (679)
alternative label: Hotelli- ja ravintolalaitos (679)
alternative label: Hotelli- ja ravintolaoppilaitokset (679)
alternative label: Hotelliala (679)
alternative label: Hotellit, hotellitalous (679)
alternative label: Hovimestarit, hovimestarin työ (679)
alternative label: Huvit, ravintolat (679)
alternative label: Illalliset, ravintolatalous (679)
alternative label: Kahvilat, ravintolatalous (679)
alternative label: Kahviot, ravintolatalous (679)
alternative label: Kapselihotellit (679)
alternative label: Kasvisravintolat, ravintolatalous (679)
alternative label: Katukeittiöt (679)
alternative label: Keittiöt, ravintolatalous (679)
alternative label: Kestikievarit (679)
alternative label: Kesäkodit, hoito ja talous (679)
alternative label: Kioskiruoat, ravintolatalous (679)
alternative label: Konditoriat, ravintolatalous (679)
alternative label: Krouvit, ravintolatalous (679)
alternative label: Kylpylähotellit, hotellitalous (679)
alternative label: Lepokodit, hoito ja talous (679)
alternative label: Lomakodit, hoito ja talous (679)
alternative label: Lomakylät, hoito ja talous (679)
alternative label: Lounaat, ravintolatalous (679)
alternative label: Majatalot, hoito ja ylläpito (679)
alternative label: Majoitus, majoitusala (679)
alternative label: Majoitusala (679)
alternative label: Majoitusliikkeet (679)
alternative label: Majoitustoiminta (679)
alternative label: Matkustajakodit, majoitustoiminta (679)
alternative label: Menyyt, ravintolatalous (679)
alternative label: Motellit, majoitustominta (679)
broader: LIIKETALOUS. KAUPPA. MARKKINOINTI. LIIKENNEOPETUS
in scheme: URN:NBN:fi:au:hklj:
notation: 679
related: Keskiasteen koulutus
related: URN:NBN:fi:au:hklj:360
related: URN:NBN:fi:au:hklj:363
related: URN:NBN:fi:au:hklj:368
related: EUROOPPA
related: AASIA
related: AFRIKKA
related: AMERIKKA
related: AUSTRALIA. OSEANIA. NAPAMAAT
related: Yleiset matkaoppaat
related: URN:NBN:fi:au:hklj:650.2
related: Kauppakirjeenvaihto
related: URN:NBN:fi:au:hklj:679.09
related: KOTITALOUS. LAITOSTALOUS. KAUNEUDENHOITO
related: Ravintotalous. Gastronomia
related: URN:NBN:fi:au:hklj:691.1
related: Leipominen
related: URN:NBN:fi:au:hklj:691.12
related: URN:NBN:fi:au:hklj:691.13
related: Kalaruoat
related: Eri maiden ja alueiden ruokalajit ja ruokakulttuuri
related: Juomat
related: Kotijuhlien järjestäminen. Kutsujen järjestäminen
related: Suurkeittiöt
scope note: Hotellien, motellien, matkustajakotien, retkeilymajojen, lomakylien, ravintoloiden, baarien ja kahviloiden organisointi, talous ja hoito Hovimestarin ja tarjoilijan työ. Tarjoiluoppi Hotelli- ja ravintola-alan koulut ja opistot
scope note: Organisation och ekonomi med hänsyn till hotell, motell, resandehem, vandrarhem, semesterbyar, restauranger, barer och kaféer samt skötsel av dessa Hovmästarens och servitörens arbete. Serveringskunskap Skolor och institut inom hotell- och restaurangbranschen @sv

Kodin korjaustöiden oppaat
type: Class
type: Concept
subclass of: HIENOMEKANIIKKA. KÄSI- JA KOTITEOLLISUUS
alternative label: Irtaimisto, irtaimiston huolto ja korjaus (680.8)
alternative label: Kesäasunnot, kodin korjaustyöt (680.8)
alternative label: Kesämökit, kodin korjaustyöt (680.8)
alternative label: Kodin korjaustyöt (680.8)
alternative label: Kodin työt, kodin korjaustöiden oppaat (680.8)
alternative label: Korjaus, kodin pienkorjaukset (680.8)
alternative label: Koti, kodin korjaustyöt (680.8)
alternative label: Liimaus, korjaustyöt (680.8)
alternative label: Loma-asunnot, kodin korjaustyöt (680.8)
alternative label: Niksit, kodin korjaustyöt (680.8)
alternative label: Ohjekirjat, kodin korjaustyöt (680.8)
alternative label: Paikkaus, kodin korjaustyöt (680.8)
alternative label: Vapaa-ajanasunnot, kodin korjaustyöt (680.8)
alternative label: Viat, kodin korjaustyöt (680.8)
alternative label: Fel, viat, hemreparationer (680.8) @sv
alternative label: Fritidshus, hemreparationer (680.8) @sv
alternative label: Hem, hemreparationer (680.8) @sv
alternative label: Hemmets arbeten, handböcker för reparationer i hemmet (680.8) @sv
alternative label: Hemreparationer (680.8) @sv
alternative label: Instruktionsböcker, hemreparationer (680.8) @sv
alternative label: Knep, hemreparationer (680.8) @sv
alternative label: Lapping, hemreparationer (680.8) @sv
alternative label: Limning, reparationsarbeten (680.8) @sv
alternative label: Lösöre, lösöre, service och reparation (680.8) @sv
alternative label: Reparation, hemmets småreparationer (680.8) @sv
alternative label: Semesterbostäder, hemreparationer (680.8) @sv
alternative label: Sommarbostäder, hemreparationer (680.8) @sv
alternative label: Sommarstugor, hemreparationer (680.8) @sv
broader: HIENOMEKANIIKKA. KÄSI- JA KOTITEOLLISUUS
in scheme: URN:NBN:fi:au:hklj:
notation: 680.8
preferred label: Home repair manuals @en
preferred label: Handböcker för reparationer i hemmet @sv
related: Talonrakennus
related: Maalaustyöt
related: Rakennuksen kunnossapito
related: URN:NBN:fi:au:hklj:681
related: Kelloteollisuus
related: Optiset ja lääketieteelliset laitteet
related: Toimistokoneet
related: Metallityö
related: Puutyö. Huonekalut. Verhoilu
related: KOTITALOUS. LAITOSTALOUS. KAUNEUDENHOITO
related: Kotitalous. Kodinhoito
related: Siivous. Pesu- ja puhdistustyöt
related: URN:NBN:fi:au:hklj:764
related: Ryijyt
related: Koruompelu. Kirjonta. Nimikointi
related: Ompelu
related: Solmeilu. Makramee. Fransut
related: Matot
related: Neulonta
related: Virkkaus. Pitsinvirkkaus. Koukkuaminen. Nypläys
related: Kankaankudonta. Kankaanpainanta
related: Tilkkutyöt. Tikatut peitteet
related: Kehrääminen. Karstaus. Värjäys
related: URN:NBN:fi:au:hklj:798
scope note: Yleiset ja sekasisältöiset kodin korjaustöiden oppaat Irtaimiston ja esineiden korjaaminen yleensä Sisätilojen pienkorjaukset yleensä Erikoisalojen korjaustyöt alan mukaisessa luokassa
scope note: Handböcker med allmänt och blandat innehåll som handlar om reparationer i hemmet Reparation av lösöre och föremål i allmänhet Smärre reparationer inomhus i allmänhet Reparationer som rör specialområden klassificeras enligt område @sv

Taideteollisuuden teoria, estetiikka ja filosofia
type: Class
type: Concept
subclass of: URN:NBN:fi:au:hklj:760
broader: URN:NBN:fi:au:hklj:760
in scheme: URN:NBN:fi:au:hklj:
notation: 760.1
preferred label: Theory, aesthetics and philosophy of industrial art @en
preferred label: Konstindustrins teori, estetik och filosofi @sv
related: Taiteen estetiikka. Taidefilosofia. Taidepsykologia. Taidesosiologia. Taidepolitiikka
related: Taidetaonta
related: Kulta- ja hopeasepäntaide. Korutaide
related: Taidepuutyöt
related: Huonekalutaide
related: URN:NBN:fi:au:hklj:764
related: Ryijyt
related: Koruompelu. Kirjonta. Nimikointi
related: Ompelu
related: Solmeilu. Makramee. Fransut
related: Matot
related: Neulonta
related: Virkkaus. Pitsinvirkkaus. Koukkuaminen. Nypläys
related: Kankaankudonta. Kankaanpainanta
related: Tilkkutyöt. Tikatut peitteet
related: Kehrääminen. Karstaus. Värjäys
related: Keramiikkataide. Posliinitaide
related: Keramiikkataide
related: Posliinitaide. Posliinimaalaus
related: Lasitaide
related: Paperitaide
related: URN:NBN:fi:au:hklj:767
related: Kukkien asettelu ja sidonta. Ikebana
related: URN:NBN:fi:au:hklj:769
scope note: Taideteollisuuden yleinen teoria, estetiikka ja filosofia Taideteollisuuden erikoisalojen teoria, estetiikka ja filosofia alan mukaisessa luokassa
scope note: Konstindustrins allmänna teori, estetik och filosofi Specialområden inom konstindustrins allmänna teori, estetik och filosofi klassificeras enligt område @sv

Pohjoismaat. Baltian maat
type: Class
type: Concept
subclass of: URN:NBN:fi:au:hklj:777.9
alternative label: Baltia, elokuvataide (777.92)
alternative label: Dogmaelokuvat, elokuvan historia, Tanska (777.92)
alternative label: Islanti, elokuvataide (777.92)
alternative label: Latvia, elokuva (777.92)
alternative label: Liettua, elokuva (777.92)
alternative label: Norja, elokuvataide (777.92)
alternative label: Pohjoismaat, elokuvataide (777.92 +)
alternative label: Pohjola, elokuvataide (777.92 +)
alternative label: Ruotsi, elokuvataide (777.92)
alternative label: Tanska, elokuvataide (777.92)
alternative label: Viro, elokuva (777.92)
alternative label: Baltikum, filmkonst (777.92) @sv
alternative label: Danmark, filmkonst (777.92) @sv
alternative label: Dogmafilmer, filmhistoria, Danmark (777.92) @sv
alternative label: Estland, film (777.92) @sv
alternative label: Island, filmkonst (777.92) @sv
alternative label: Lettland, film (777.92) @sv
alternative label: Litauen, film (777.92) @sv
alternative label: Norden, filmkonst (777.92 +) @sv
alternative label: Nordiska länderna, filmkonst (777.92 +) @sv
alternative label: Norge, filmkonst (777.92) @sv
alternative label: Sverige, filmkonst (777.92) @sv
broader: URN:NBN:fi:au:hklj:777.9
in scheme: URN:NBN:fi:au:hklj:
narrower: Suomi
notation: 777.92
preferred label: Nordic countries. Baltic countries @en
preferred label: Norden. Baltikum @sv
related: URN:NBN:fi:au:hklj:1.4
related: URN:NBN:fi:au:hklj:1.84
related: URN:NBN:fi:au:hklj:1.944
related: URN:NBN:fi:au:hklj:2.84
related: URN:NBN:fi:au:hklj:2.94
related: URN:NBN:fi:au:hklj:3.4
related: URN:NBN:fi:au:hklj:384.42
related: URN:NBN:fi:au:hklj:4.4
related: URN:NBN:fi:au:hklj:5.4
related: URN:NBN:fi:au:hklj:6.4
related: URN:NBN:fi:au:hklj:7.4
related: URN:NBN:fi:au:hklj:709
related: URN:NBN:fi:au:hklj:710
related: URN:NBN:fi:au:hklj:756
related: Teatteri- ja näyttämötaiteen teoria, estetiikka ja filosofia
related: URN:NBN:fi:au:hklj:770.9
related: Elokuvatekniikka. Videokuvauksen tekniikka
related: URN:NBN:fi:au:hklj:783.67
related: URN:NBN:fi:au:hklj:783.68
scope note: Ruotsi. Tanska. Norja. Islanti Viro. Latvia. Liettua
scope note: Sverige. Danmark. Norge. Island Estland. Lettland. Litauen @sv

Itä-Eurooppa
type: Class
type: Concept
subclass of: URN:NBN:fi:au:hklj:777.9
alternative label: Bulgaria, elokuvataide (777.95)
alternative label: Neuvostoliitto, elokuvataide (777.95 +)
alternative label: Puola, elokuvataide (777.95)
alternative label: Bulgarien, filmkonst (777.95) @sv
alternative label: Polen, filmkonst (777.95) @sv
alternative label: Sovjetunionen, filmkonst (777.95 +) @sv
broader: URN:NBN:fi:au:hklj:777.9
in scheme: URN:NBN:fi:au:hklj:
narrower: Venäjä
notation: 777.95
preferred label: Eastern Europe @en
preferred label: Östeuropa @sv
related: URN:NBN:fi:au:hklj:1.4
related: URN:NBN:fi:au:hklj:1.84
related: URN:NBN:fi:au:hklj:1.944
related: URN:NBN:fi:au:hklj:2.84
related: URN:NBN:fi:au:hklj:2.94
related: URN:NBN:fi:au:hklj:3.4
related: URN:NBN:fi:au:hklj:384.42
related: URN:NBN:fi:au:hklj:4.4
related: URN:NBN:fi:au:hklj:5.4
related: URN:NBN:fi:au:hklj:6.4
related: URN:NBN:fi:au:hklj:7.4
related: URN:NBN:fi:au:hklj:709
related: URN:NBN:fi:au:hklj:710
related: URN:NBN:fi:au:hklj:756
related: Teatteri- ja näyttämötaiteen teoria, estetiikka ja filosofia
related: URN:NBN:fi:au:hklj:770.9
related: Elokuvatekniikka. Videokuvauksen tekniikka
related: URN:NBN:fi:au:hklj:783.67
related: URN:NBN:fi:au:hklj:783.68
scope note: Moldova. Ukraina. Valko-Venäjä Itsenäisten valtioiden yhteisö yleensä
scope note: Moldova (f.d. Moldavien). Ukraina. Vitryssland Oberoende staternas samvälde i allmänhet @sv

Musiikin filosofia, estetiikka, psykologia ja sosiologia Musiikkikasvatus. Musiikkiopetus
type: Class
type: Concept
subclass of: MUSIIKKI
alternative label: Musiikkimaku (781 +)
alternative label: Musiksmak (781 +) @sv
broader: MUSIIKKI
in scheme: URN:NBN:fi:au:hklj:
narrower: Musiikin estetiikka ja filosofia
narrower: Musiikin psykologia. Musiikin akustiikka
narrower: Musiikin sosiologia. Musiikkipolitiikka
narrower: URN:NBN:fi:au:hklj:781.5
notation: 781
preferred label: Philosophy, aesthetics, psychology and sociology of music. Musical pedagogy. Musical education @en
preferred label: Musikfilosofi, musikestetik, musikpsykologi och musiksociologi Musikpedagogik. Musikundervisning @sv
related: Musiikin opetusoppi
related: URN:NBN:fi:au:hklj:618.86
related: Taiteen estetiikka. Taidefilosofia. Taidepsykologia. Taidesosiologia. Taidepolitiikka
related: Oppikirjat. Harjoituskirjat. Tehtäväkokoelmat. Taiteen materiaalit ja tekniikka. Taidekasvatus
related: Taideopinnot
related: Musiikin teoria
related: Rytmioppi
related: Säveloppi
related: Sointuoppi
related: URN:NBN:fi:au:hklj:782.4
related: Muoto-oppi
related: URN:NBN:fi:au:hklj:782.6
related: Johtaminen
related: Musiikin tulkinta. Tyylioppi
related: Notaatio
scope note: Yleisteokset, jotka koskevat useita musiikin filosofiaan, estetiikkaan, psykologiaan, sosiologiaan tai musiikkikasvatukseen ja -opetukseen liittyviä aiheita
scope note: Allmänna verk som hänför sig till flera områden inom musikfilosofi, musikestetik, musikpsykologi, musiksociologi eller musikpedagogik och musikundervisning @sv

Muu näyttämö- tai draamamusiikki. Pelimusiikki
type: Class
type: Concept
subclass of: URN:NBN:fi:au:hklj:783.6
alternative label: Balladioppera (783.69)
alternative label: Konsolipelimusiikki (783.69)
alternative label: Minstrelit, teatterimusiikki (783.69)
alternative label: Pelimusiikki (783.69)
alternative label: Tietokonepelimusiikki (783.69)
alternative label: Videopelimusiikki (783.69)
alternative label: Balladopera (783.69) @sv
alternative label: Datorspelmusik (783.69) @sv
alternative label: Konsolspelmusik (783.69) @sv
alternative label: Minstrels, teatermusik (783.69) @sv
alternative label: Spelmusik (783.69) @sv
alternative label: Videospelmusik (783.69) @sv
broader: URN:NBN:fi:au:hklj:783.6
in scheme: URN:NBN:fi:au:hklj:
notation: 783.69
preferred label: Other stage and drama music @en
preferred label: Övrig scen- och dramamusik. Spelmusik @sv
related: URN:NBN:fi:au:hklj:1.3
related: URN:NBN:fi:au:hklj:1.83
related: URN:NBN:fi:au:hklj:1.943
related: URN:NBN:fi:au:hklj:2.3
related: URN:NBN:fi:au:hklj:2.83
related: URN:NBN:fi:au:hklj:2.93
related: URN:NBN:fi:au:hklj:3.3
related: URN:NBN:fi:au:hklj:4.3
related: URN:NBN:fi:au:hklj:5.3
related: URN:NBN:fi:au:hklj:6.3
related: URN:NBN:fi:au:hklj:7.3
related: URN:NBN:fi:au:hklj:770
related: Teatterimuodot
related: URN:NBN:fi:au:hklj:783.5
related: URN:NBN:fi:au:hklj:784
related: URN:NBN:fi:au:hklj:784.111
related: URN:NBN:fi:au:hklj:788
related: URN:NBN:fi:au:hklj:789
related: Pelit
related: Korttipelit. Pasianssit
related: Shakki
related: Roolipelit
related: URN:NBN:fi:au:hklj:8.3
scope note: Muu näyttämö- tai draamamusiikki Pelien yhteyteen sävelletty tai muokattu ja niiden pelaamisen tai seuraamisen aikana soitettavaksi ja kuultavaksi tarkoitettu musiikki Näyttämö- tai draamamusiikin yksittäisistä osista sovitetut kokoelmat soitinnuksen mukaisessa luokassa
scope note: Övrig scen- och dramamusik Musik som komponerats eller anpassats för alla slags spel och som är avsedd att spelas eller lyssnas på då man spelar eller ser på spelandet Samlingar arrangerade som enskilda partier ur scen- eller dramamusik klassificeras enligt instrumentering @sv

Balkanin niemimaa
type: Class
type: Concept
subclass of: Eurooppa
broader: Eurooppa
in scheme: URN:NBN:fi:au:hklj:
narrower: Bulgaria
narrower: Romania
narrower: Entisen Jugoslavian alue
narrower: Albania
narrower: Kreikka
notation: 784.15
preferred label: Balkan Peninsula @en
preferred label: Balkanhalvön @sv
related: URN:NBN:fi:au:hklj:473.1
related: URN:NBN:fi:au:hklj:769
related: URN:NBN:fi:au:hklj:783
related: URN:NBN:fi:au:hklj:783.1
related: URN:NBN:fi:au:hklj:787
related: URN:NBN:fi:au:hklj:787.2
related: URN:NBN:fi:au:hklj:787.29
related: URN:NBN:fi:au:hklj:788.8
related: URN:NBN:fi:au:hklj:789
related: URN:NBN:fi:au:hklj:795.1
related: URN:NBN:fi:au:hklj:797.2
related: URN:NBN:fi:au:hklj:807
scope note: Yleisteokset ja sekasisältöiset kokoelmat
scope note: Allmänna verk och samlingar med blandat innehåll @sv

Entisen Jugoslavian alue
type: Class
type: Concept
subclass of: Balkanin niemimaa
alternative label: Jugoslavian alue, kansanmusiikki (784.153 +)
alternative label: Jugoslaviens område, folkmusik (784.153 +) @sv
broader: Balkanin niemimaa
in scheme: URN:NBN:fi:au:hklj:
narrower: Slovenia
narrower: Kroatia
narrower: Bosnia ja Hertsegovina
narrower: Serbia ja Montenegro
narrower: Makedonia (EJTM)
notation: 784.153
preferred label: The former Yogoslavia @en
preferred label: Före detta Jugoslavien @sv
related: URN:NBN:fi:au:hklj:473.1
related: URN:NBN:fi:au:hklj:769
related: URN:NBN:fi:au:hklj:783
related: URN:NBN:fi:au:hklj:783.1
related: URN:NBN:fi:au:hklj:787
related: URN:NBN:fi:au:hklj:787.2
related: URN:NBN:fi:au:hklj:787.29
related: URN:NBN:fi:au:hklj:788.8
related: URN:NBN:fi:au:hklj:789
related: URN:NBN:fi:au:hklj:795.1
related: URN:NBN:fi:au:hklj:797.2
related: URN:NBN:fi:au:hklj:807
scope note: Yleisteokset ja sekasisältöiset kokoelmat
scope note: Allmänna verk och samlingar med blandat innehåll @sv

Pohjois-Amerikka
type: Class
type: Concept
subclass of: URN:NBN:fi:au:hklj:784
alternative label: Afroamerikkalainen musiikki, kansanmusiikki (784.4 ... 784.6)
alternative label: Afroamerikkalaiset, kansanmusiikki (784.4 ... 784.6)
alternative label: Amerikka, kansanmusiikki, P-Amerikka (784.4 +)
alternative label: Pohjois-Amerikka, kansanmusiikki, Pohjois-Amerikka (784.4 +)
alternative label: Afroamerikaner, folkmusik (784.4 ... 784.6) @sv
alternative label: Afroamerikansk musik, folkmusik (784.4 ... 784.6) @sv
alternative label: Amerika, folkmusik, Nordamerika (784.4 +) @sv
alternative label: Nordamerika, folkmusik, Nordamerika (784.4 +) @sv
broader: URN:NBN:fi:au:hklj:784
in scheme: URN:NBN:fi:au:hklj:
narrower: Kanada
narrower: Yhdysvallat
notation: 784.4
preferred label: North America @en
preferred label: Nordamerika @sv
related: URN:NBN:fi:au:hklj:473.1
related: URN:NBN:fi:au:hklj:769
related: URN:NBN:fi:au:hklj:783
related: URN:NBN:fi:au:hklj:783.1
related: Väli-Amerikka
related: Karibianmeren saaret
related: Etelä-Amerikka
related: Intiaanit
related: Eskimot. Inuiitit
related: URN:NBN:fi:au:hklj:787
related: URN:NBN:fi:au:hklj:787.2
related: URN:NBN:fi:au:hklj:787.29
related: URN:NBN:fi:au:hklj:788.8
related: URN:NBN:fi:au:hklj:789
related: URN:NBN:fi:au:hklj:795.1
related: URN:NBN:fi:au:hklj:797.2
related: URN:NBN:fi:au:hklj:807
scope note: Yleisteokset ja sekasisältöiset kokoelmat Tässä myös yleisteokset ja sekasisältöiset kokoelmat, jotka koskevat sekä Pohjois- että Väli- tai Etelä-Amerikan kansanmusiikkia
scope note: Allmänna verk och samlingar med blandat innehåll Hit också allmänna verk och samlingar med blandat innehåll som rör Nordamerikas, Centralamerikas eller Sydamerikas folkmusik @sv

Etelä-Amerikka
type: Class
type: Concept
subclass of: URN:NBN:fi:au:hklj:784
alternative label: Afroamerikkalainen musiikki, kansanmusiikki (784.4 ... 784.6)
alternative label: Afroamerikkalaiset, kansanmusiikki (784.4 ... 784.6)
alternative label: Amerikka, kansanmusiikki, E-Amerikka (784.6)
alternative label: Etelä-Amerikka, kansanmus., E-Amerikka (784.6)
alternative label: Inkamusiikki (784.6)
alternative label: Latinalaisamerikkalainen musiikki, kansanmusiikki, Etelä-Amerikka (784.6)
alternative label: Afroamerikaner, folkmusik (784.4 ... 784.6) @sv
alternative label: Afroamerikansk musik, folkmusik (784.4 ... 784.6) @sv
alternative label: Amerika, folkmusik, Sydamerika (784.6) @sv
alternative label: Inkamusik (784.6) @sv
alternative label: Latinamerikansk musik, folkmusik, Sydamerika (784.6) @sv
alternative label: Sydamerika, folkmusik, Sydamerika (784.6) @sv
broader: URN:NBN:fi:au:hklj:784
in scheme: URN:NBN:fi:au:hklj:
notation: 784.6
preferred label: South America @en
preferred label: Sydamerika @sv
related: URN:NBN:fi:au:hklj:473.1
related: URN:NBN:fi:au:hklj:769
related: URN:NBN:fi:au:hklj:783
related: URN:NBN:fi:au:hklj:783.1
related: Pohjois-Amerikka
related: Väli-Amerikka
related: Karibianmeren saaret
related: Intiaanit
related: URN:NBN:fi:au:hklj:787
related: URN:NBN:fi:au:hklj:787.2
related: URN:NBN:fi:au:hklj:787.29
related: URN:NBN:fi:au:hklj:788.8
related: URN:NBN:fi:au:hklj:789
related: URN:NBN:fi:au:hklj:795.1
related: URN:NBN:fi:au:hklj:797.2
related: URN:NBN:fi:au:hklj:807
scope note: Tässä myös yleisteokset ja sekasisältöiset kokoelmat, jotka koskevat latinalaisen Amerikan kansanmusiikkia yleensä Argentiina. Bolivia. Brasilia. Chile. Ecuador. Guyana. Kolumbia. Paraguay. Peru. Ranskan Guayana. Surinam. Uruguay. Venezuela
scope note: Hit också allmänna verk och samlingar med blandat innehåll som rör latinamerikansk folkmusik i allmänhet Argentina. Bolivia. Brasilien. Chile. Colombia. Ecuador. Franska Guayana. Guyana. Paraguay. Peru. Surinam. Uruguay. Venezuela @sv

Kosketinsoittimet
type: Class
type: Concept
subclass of: URN:NBN:fi:au:hklj:786
alternative label: Kosketinsoittimet (786.1 +)
alternative label: Toccatat (786.1 +)
alternative label: Tangentinstrument (786.1 +) @sv
alternative label: Toccator (786.1 +) @sv
broader: URN:NBN:fi:au:hklj:786
in scheme: URN:NBN:fi:au:hklj:
narrower: Piano
narrower: Cembalo
narrower: Urut
narrower: Sähköurut ja muut sähköiset kosketinsoittimet
narrower: Harmoni
narrower: Harmonikka
narrower: Muut kosketinsoittimet
notation: 786.1
preferred label: Keyboard instruments @en
preferred label: Klaviaturinstrument @sv
related: URN:NBN:fi:au:hklj:627.7531
related: URN:NBN:fi:au:hklj:681
related: URN:NBN:fi:au:hklj:781.5
related: URN:NBN:fi:au:hklj:782.6
related: URN:NBN:fi:au:hklj:785
related: URN:NBN:fi:au:hklj:785.11
related: URN:NBN:fi:au:hklj:788
related: URN:NBN:fi:au:hklj:789

Puupuhaltimet
type: Class
type: Concept
subclass of: URN:NBN:fi:au:hklj:786
alternative label: Ansatsi, puhallinsoittimet (786.4 ... 786.6 +)
alternative label: Asete, puhallinsoittimet (786.4 ... 786.6 +)
alternative label: Kortholt (786.4 +)
alternative label: Lehdykkäsoittimet (786.4)
alternative label: Puhallinsoittimet, puupuhaltimet (786.4 +)
alternative label: Puhallussoittimet, puupuhaltimet (786.4 +)
alternative label: Puupuhaltimet (786.4 +)
alternative label: Ansats, ansatsi (786.4 ... 786.6 +) @sv
alternative label: Ansats, asete (786.4 ... 786.6 +) @sv
alternative label: Blåsinstrument, träblåsinstrument (786.4 +) @sv
alternative label: Rörbladsinstrument (786.4) @sv
alternative label: Träblåsinstrument (786.4 +) @sv
broader: URN:NBN:fi:au:hklj:786
in scheme: URN:NBN:fi:au:hklj:
narrower: Huilu. Piccolo
narrower: Nokkahuilu
narrower: Klarinetti
narrower: Saksofoni
narrower: Oboe. Englannintorvi
narrower: Fagotti
narrower: Muut puupuhaltimet
notation: 786.4
preferred label: Woodwind @en
preferred label: Träblåsinstrument @sv
related: URN:NBN:fi:au:hklj:627.7531
related: URN:NBN:fi:au:hklj:681
related: URN:NBN:fi:au:hklj:781.5
related: URN:NBN:fi:au:hklj:782.6
related: URN:NBN:fi:au:hklj:785
related: URN:NBN:fi:au:hklj:785.11
related: URN:NBN:fi:au:hklj:788
related: URN:NBN:fi:au:hklj:789

Blues. Soul
type: Class
type: Concept
subclass of: URN:NBN:fi:au:hklj:788
alternative label: Populaarimusiikki, blues, soul (788.1 +)
alternative label: Rytmi- ja viihdemusiikki, blues, soul (788.1 +)
alternative label: Rytmimusiikki, blues, soul (788.1 +)
alternative label: Populärmusik, blues, soul (788.1 +) @sv
alternative label: Rytm- och underhållningsmusik, blues, soul (788.1 +) @sv
alternative label: Rytmmusik, blues, soul (788.1 +) @sv
broader: URN:NBN:fi:au:hklj:788
in scheme: URN:NBN:fi:au:hklj:
narrower: Blues
narrower: Soul. Funk. R&B
narrower: Rap. Hip hop
narrower: Reggae. Ska
narrower: Zydeco
notation: 788.1
related: URN:NBN:fi:au:hklj:782.4
related: URN:NBN:fi:au:hklj:783
related: URN:NBN:fi:au:hklj:783.1
related: URN:NBN:fi:au:hklj:785.7
related: URN:NBN:fi:au:hklj:786.8
related: URN:NBN:fi:au:hklj:787.112
related: URN:NBN:fi:au:hklj:789
related: URN:NBN:fi:au:hklj:795
scope note: Yleisteokset ja sekasisältöiset kokoelmat Tässä ja alaluokissa blues ja soul sekä niitä koskeva kirjallisuus Tässä ja alaluokissa myös bluesin ja soulin suuntaukset sekä niiden historia ja henkilöhistoria
scope note: Allmänna verk och samlingar med blandat innehåll Hit och till underklasserna blues och soul samt litteratur om dem Hit och till underklasserna också olika riktningar inom blues och soul samt deras historia och personhistoria @sv

Lastenmusiikki
type: Class
type: Concept
subclass of: URN:NBN:fi:au:hklj:788
alternative label: Kansanlaulut, lastenmusiikki (788.6)
alternative label: Kehtolaulut, lastenmusiikki (788.6)
alternative label: Lastenkulttuuri, lastenmusiikki (788.6)
alternative label: Lastenlaulut (788.6)
alternative label: Lastenmusiikki (788.6)
alternative label: Laulu, lastenlaulut (788.6)
alternative label: Laulukirjat, lastenlaulut (788.6)
alternative label: Laululeikit, musiikkijulkaisuna (788.6)
alternative label: Laulumusiikki, lastenlaulut (788.6)
alternative label: Laulut, lastenlaulut (788.6)
alternative label: Leikit, musiikkileikit, nuotit ja äänitteet (788.6)
alternative label: Leikki, musiikkileikit, nuotit ja äänitteet (788.6)
alternative label: Musiikkileikit, musiikkiäänitteet (788.6)
alternative label: Musiikkileikit, nuottijulkaisut (788.6)
alternative label: Musiikkiliikunta, musiikkiäänitteet (788.6)
alternative label: Musiikkiliikunta, nuottijulkaisut (788.6)
alternative label: Musiikkisadut (788.6)
alternative label: Piirileikit, lastenmusiikki (788.6)
alternative label: Populaarimusiikki, lastenmusiikki (788.6)
alternative label: Rytmimusiikki, lastenmusiikki (788.6)
alternative label: Vauvat, kehtolaulut (788.6)
alternative label: Viittomalaulut, lastenlaulut (788.6)
alternative label: Yhteislaulu, lastenlaulut (788.6)
alternative label: Allsång, barnvisor (788.6) @sv
alternative label: Babyer, vaggvisor (788.6) @sv
alternative label: Barnkultur, musik för barn (788.6) @sv
alternative label: Barnmusik (788.6) @sv
alternative label: Barnvisor (788.6) @sv
alternative label: Folkvisor, musik för barn (788.6) @sv
alternative label: Lek, barnlek, musiklekar, noter och (788.6) @sv
alternative label: Lekar, musiklekar, noter och ljudupptagningar (788.6) @sv
alternative label: Musikgymnastik, musikupptagningar (788.6) @sv
alternative label: Musikgymnastik, notpublikationer (788.6) @sv
alternative label: Musiklekar, musikupptagningar (788.6) @sv
alternative label: Musiklekar, notpublikationer (788.6) @sv
alternative label: Musiksagor (788.6) @sv
alternative label: Populärmusik, musik för barn (788.6) @sv
alternative label: Ringlekar, musik för barn (788.6) @sv
alternative label: Rytmmusik, musik för barn (788.6) @sv
alternative label: Sång, barnvisor (788.6) @sv
alternative label: Sångböcker, barnvisor (788.6) @sv
alternative label: Sångböcker, teckenspråk, barnvisor (788.6) @sv
alternative label: Sånger, barnvisor (788.6) @sv
alternative label: Sånglekar, som musikpublikation (788.6) @sv
alternative label: Sångmusik, barnvisor (788.6) @sv
alternative label: Vaggvisor, barnmusik (788.6) @sv
broader: URN:NBN:fi:au:hklj:788
in scheme: URN:NBN:fi:au:hklj:
notation: 788.6
preferred label: Children’s music @en
preferred label: Barnmusik @sv
related: URN:NBN:fi:au:hklj:782.4
related: URN:NBN:fi:au:hklj:783
related: URN:NBN:fi:au:hklj:783.1
related: URN:NBN:fi:au:hklj:785.7
related: URN:NBN:fi:au:hklj:786.8
related: URN:NBN:fi:au:hklj:787.112
related: URN:NBN:fi:au:hklj:787.3
related: URN:NBN:fi:au:hklj:787.31
related: URN:NBN:fi:au:hklj:789
related: URN:NBN:fi:au:hklj:795
related: Leikit
related: Leikkikalut
related: URN:NBN:fi:au:hklj:797.2
scope note: Lastenmusiikki, lastenlaulut ja musiikkisadut sekä niitä koskeva kirjallisuus Lastenmusiikin, lastenlaulujen ja musiikkisatujen historia ja henkilöhistoria Nuottijulkaisuiksi määritetyt musiikkileikit, laululeikit ja musiikkiliikuntaleikit
scope note: Barnmusik, barnvisor och musiksagor samt litteratur om dem Barnmusikens, barnvisornas och musiksagornas historia och personhistoria Musiklekar, sånglekar och musikgymnastiklekar som definieras som publikationer med noter @sv

Muut urheilu- ja liikuntamuodot
type: Class
type: Concept
subclass of: Liikunta. Urheilu
alternative label: Alamäkiluistelu, extreme-lajit (791.9)
alternative label: Bumeranginheitto (791.9)
alternative label: Bumerangit, urheilu (791.9)
alternative label: Extreme-lajit (791.9)
alternative label: Jääpurjehdus (791.9)
alternative label: Kelkat (791.9)
alternative label: Kelkkailu (791.9)
alternative label: Kelkkailu, kelkat (791.9)
alternative label: Luolatutkimus, extreme-lajit (791.9)
alternative label: Moniottelut, nykyaikainen 5-ottelu (791.9)
alternative label: Moniottelut, triathlon (791.9)
alternative label: Ohjaskelkkailu (791.9)
alternative label: Parkour (791.9)
alternative label: Potkukelkkailu (791.9)
alternative label: Potkulaudat (791.9)
alternative label: Saappaanheitto (791.9)
alternative label: Sotilasviisiottelu (791.9)
alternative label: Triathlon (791.9)
alternative label: Äärilajit (791.9)
alternative label: Bumeranger, idrott (791.9) @sv
alternative label: Bumerangkastning (791.9) @sv
alternative label: Extrema sporter (791.9) @sv
alternative label: Extremsporter (791.9) @sv
alternative label: Grottforskning, extrema sporter (791.9) @sv
alternative label: Ice cross downhill, extremsporter (791.9) @sv
alternative label: Issegling (791.9) @sv
alternative label: Kälkar (791.9) @sv
alternative label: Kälkåkning (791.9) @sv
alternative label: Kälkåkning, kälkar (791.9) @sv
alternative label: Militär femkamp (791.9) @sv
alternative label: Mångkamp, modern 5-kamp (791.9) @sv
alternative label: Mångkamp, triathlon (791.9) @sv
alternative label: Rodelåkning (791.9) @sv
alternative label: Sparkcyklar (791.9) @sv
alternative label: Sparkåkning (791.9) @sv
alternative label: Stövelkastning (791.9) @sv
broader: Liikunta. Urheilu
in scheme: URN:NBN:fi:au:hklj:
narrower: Miekkailu
narrower: Ammunta
notation: 791.9
preferred label: Other branches of sport and physical education @en
preferred label: Andra sportgrenar och idrottsformer @sv
related: Liikuntatiede ja -tutkimus. Liikuntapolitiikka
related: Yleisurheilu
related: Hiihto. Alppihiihto. Ampumahiihto
related: Voimistelu
related: Voimailu. Itsepuolustus
related: Painonnosto
related: Paini
related: Nyrkkeily
related: Itämaisperäiset lajit. Budo
related: Palloilu
related: Jalkapallo
related: Jääkiekko
related: Muut joukkuepelit
related: Tennis. Squash. Sulkapallo
related: Pöytätennis
related: Golf
related: Keilailu
related: Muut pallopelit
related: Pelit
scope note: Tässä esim. nykyaikainen 5-ottelu, triathlon ja muut moniottelut, jotka eivät sisälly johonkin tiettyyn lajiin Tässä myös kelkkailu
scope note: Hit t.ex. modern femkamp, triathlon och andra former av mångkamp, vilka inte ingår i någon bestämd sportgren Hit också kälkåkning @sv

SUOMALAIS-UGRILAISTEN KIELTEN KIRJALLISUUDEN HISTORIA JA TUTKIMUS
type: Class
type: Concept
subclass of: URN:NBN:fi:au:hklj:800
alternative label: Biografiat, kirjailijat (810 ... 849)
alternative label: Edelläkävijät, kirjailijat (810 ... 849)
alternative label: Elämäkerrat, kirjailijat (810 ... 849)
alternative label: Elämänhistoria, henkilöhistoria, kirjailijat (810 ... 849)
alternative label: Ersän kieli, kirjallisuudenhistoria (810)
alternative label: Esikoiskirjailijat, elämäkerrat ja muistelmat (810 ... 849)
alternative label: Esikoisteokset, elämäkerrat ja muistelmat (810 ... 849)
alternative label: Haamukirjoittajat, kirjailijoiden henkilöhistoria (810 ... 849)
alternative label: Haastattelut, henkilöhistoria, kirjailijat (810 ... 849)
alternative label: Henkilöhistoria, kirjailijat (810 ... 849)
alternative label: Henkilökuvat, kirjailijat (810 ... 849)
alternative label: Henkilöt, kirjailijat (810 ... 849)
alternative label: Historia, henkilöhistoria, kirjailijat (810 ... 849)
alternative label: Julkisuuden henkilöt, kirjailijat (810 ... 849)
alternative label: Kansalliset suurmiehet, kirjailijat (810 ... 849)
alternative label: Karjalan kieli, kirjallisuuden historia (810)
alternative label: Kirjailijaryhmät (810 ... 849)
alternative label: Kirjailijat, elämäkerrat ja muistelmat (810 ... 849)
alternative label: Kirjallisuuspiirit, kirjailijaryhmät (810 ... 849)
alternative label: Kirjeet, kirjailijat (810 ... 849)
alternative label: Kirjoittajapiirit, kirjailijaryhmät, historia (810 ... 849)
alternative label: Kirjoittamaan oppiminen, kirjailijaryhmät, historia (810 ... 849)
alternative label: Kolumnistit, kirjailijat, elämäkerrat ja muistelmat (810 ... 849)
alternative label: Kääntäjät, elämäkerrat ja muistelmat (810 ... 849)
alternative label: Lapsuus, kirjailijat (810 ... 849)
alternative label: Lastenkirjailijat, elämäkerrat ja muistelmat (810 ... 849)
alternative label: Liivin kieli, kirjallisuuden historia (810)
alternative label: Lukupiirit, kirjailijaryhmät (810 ... 849)
alternative label: Lyydin kieli, kirjallisuuden historia (810)
alternative label: Lyyrikot, elämäkerrat ja muistelmat (810 ... 849)
alternative label: Maahanmuuttajat, henkilöhistoria, kirjailijat (810 ... 849)
alternative label: Maanpako, henkilöhistoria, kirjailijat (810 ... 849)
alternative label: Marin kieli, kirjallisuuden historia (810)
alternative label: Merkkihenkilöt, kirjailijat (810 ... 849)
alternative label: Mielipidevangit, kirjailijat, elämäkerrat ja muistelmat (810 ... 849)
alternative label: Mordvan kieli, kirjallisuuden historia (810)
alternative label: Muistelmat, kirjailijat (810 ... 849)
alternative label: Muistokirjoitukset, kirjailijat (810 ... 849)
alternative label: Nekrologit, kirjailijat (810 ... 849)
alternative label: Nuortenkirjailijat, elämäkerrat ja muistelmat (810 ... 849)
alternative label: Näytelmäkirjailijat, elämäkerrat ja muistelmat (810 ... 849)
alternative label: Omaelämäkerrat, kirjailijat (810 ... 849)
alternative label: Ostjakin kieli, kirjallisuuden historia (810)
alternative label: Pakinoitsijat, kirjailijat, elämäkerrat ja muistelmat (810 ... 849)
alternative label: Pakolaiset, henkilöhistoria, kirjailijat (810 ... 849)
alternative label: Permiläiset kielet, kirjallisuuden historia (810)
alternative label: Professorit, kirjailijat (810 ... 849)
alternative label: Päiväkirjat, kirjailijat (810 ... 849)
alternative label: Rakkauskirjeet, kirjailijat (810 ... 849)
alternative label: Siirtolaiset, henkilöhistoria, kirjailijat (810 ... 849)
alternative label: Suomalais-ugrilaiset kielet, kirjallisuuden historia (810 ... 819)
alternative label: Suurmiehet, kirjailijat (810 ... 849)
alternative label: Syrjäänin kieli, kirjallisuuden historia (810)
alternative label: Taiteilijaelämäkerrat, kirjailijat (810 ... 849)
alternative label: Taiteilijat, kirjailijat (810 ... 849)
alternative label: Tseremissin kieli, kirjallisuuden historia (810)
broader: URN:NBN:fi:au:hklj:800
in scheme: URN:NBN:fi:au:hklj:
narrower: Suomenkielisen kirjallisuuden historia ja tutkimus
narrower: Suomenkielisen kansanrunouden historia ja tutkimus
narrower: Suomenkielisen kirjallisuuden aihepiirejä ja kirjallisuustyyppejä koskeva historia ja tutkimus
narrower: Saamenkielisen kirjallisuuden historia ja tutkimus
narrower: Vironkielisen kirjallisuuden historia ja tutkimus
narrower: Unkarinkielisen kirjallisuuden historia ja tutkimus
notation: 810
related: Symbolit. Koodit. Merkkijärjestelmät
related: URN:NBN:fi:au:hklj:1.9
related: URN:NBN:fi:au:hklj:1.91
related: Lasten- ja nuortenkirjallisuuden historia ja tutkimus
related: URN:NBN:fi:au:hklj:807
related: Yleinen kirjallisuudenhistoria
related: Vanha aika
related: Keskiaika
related: Uusi aika
related: Nykyaika
scope note: Suomalais-ugrilaisten kielten kirjallisuuden historian ja tutkimuksen yleisteokset Itämerensuomalaisten kielten kirjallisuuden historia ja tutkimus Inkerin-, karjalan-, liivin-, lyydin-, vatjan- ja vepsänkielisen kirjallisuuden historia ja tutkimus Ugrilaisten ja volgansuomalaisten kielten kirjallisuuden historia ja tutkimus Mordvan-, ostjakin- (hantin-), syrjäänin- (komin-), tseremissin- (marin-), vogulin- (mansin-) ja votjakin- (udmurtin-) -kielisen kirjallisuuden historia ja tutkimus
scope note: Allmänna verk om de finsk-ugriska språkens litteraturhistoria och forskning i de finsk-ugriska språkens litteratur Litteraturhistoria och litteraturforskning som rör de östersjöfinska språken Litteraturhistoria och litteraturforskning som rör ingermanländska, karelska, liviska, lydiska, vepsiska och votiska Litteraturhistoria och litteraturforskning som rör de ugriska och volgafinska språken Litteraturhistoria och litteraturforskning som rör mordvinska, ostjakiska (chanti), syrjänska (komi), tjeremissiska (mari), voguliska (mansi) och votjakiska (udmurtiska) @sv

Vanhan ajan kulttuurihistoria
type: Class
type: Concept
subclass of: URN:NBN:fi:au:hklj:919
alternative label: Antiikki, kulttuurihistoria (919.1)
alternative label: Esihistoria, kulttuurihistoria (919.1)
alternative label: Esiroomalainen rautakausi, kulttuurihistoria (919.1)
alternative label: Karthagolaiset, muinaiskansat, kulttuurihistoria (919.1)
alternative label: Kiltit, kansallispuvut, kulttuurihistoria (919.1)
alternative label: Kivikausi, kulttuurihistoria (919.1)
alternative label: Kivikautiset kulttuurit, kulttuurihistoria (919.1)
alternative label: Kuoppakeraaminen kulttuuri (919.1)
alternative label: Megaliittikulttuuri, kulttuurihistoria (919.1)
alternative label: Mesoliittinen kausi, kulttuurihistoria (919.1)
alternative label: Muinaisajan ihmiset, kulttuurihistoria (919.1)
alternative label: Muinaiskansat, kulttuurihistoria (919.1)
alternative label: Myöhäisantiikki, kulttuurihistoria (919.1)
alternative label: Neoliittinen kausi, kulttuurihistoria (919.1)
alternative label: Paleoliittinen kausi, kulttuurihistoria (919.1)
alternative label: Pronssikausi, kulttuurihistoria (919.1)
alternative label: Roomalainen rautakausi, vanhan ajan kulttuuri (919.1)
alternative label: Tartaanit, kulttuurihistoria (919.1)
alternative label: Vanha aika, kulttuurihistoria (919.1)
alternative label: Varhaishistoria, kulttuurihistoria (919.1)
alternative label: Antiken, kulturhistoria (919.1) @sv
alternative label: Bronsåldern, kulturhistoria (919.1) @sv
alternative label: Forntidens människor, kulturhistoria (919.1) @sv
alternative label: Forntidsfolk, kulturhistoria (919.1) @sv
alternative label: Förhistoria, kulturhistoria (919.1) @sv
alternative label: Förromersk järnålder, kulturhistoria (919.1) @sv
alternative label: Gamla tiden, kulturhistoria (919.1) @sv
alternative label: Gropkeramiska kulturen (919.1) @sv
alternative label: Kartager, forntidsfolk, kulturhistoria (919.1) @sv
alternative label: Kiltar, nationaldräkter, kulturhistoria (919.1) @sv
alternative label: Megalitkulturen, kulturhistoria (919.1) @sv
alternative label: Mesolitisk tid, kulturhistoria (919.1) @sv
alternative label: Neolitisk period, kulturhistoria (919.1) @sv
alternative label: Paleolitisk tid, kulturhistoria (919.1) @sv
alternative label: Romersk järnålder, gamla tidens kultur (919.1) @sv
alternative label: Senantiken, kulturhistoria (919.1) @sv
alternative label: Stenåldern, kulturhistoria (919.1) @sv
alternative label: Stenålderskulturer, kulturhistoria (919.1) @sv
alternative label: Tartan, kulturhistoria (919.1) @sv
alternative label: Tidig historia, kulturhistoria (919.1) @sv
broader: URN:NBN:fi:au:hklj:919
in scheme: URN:NBN:fi:au:hklj:
notation: 919.1
preferred label: Ancient cultural history @en
preferred label: Forntidens kulturhistoria @sv
related: Itämainen filosofia
related: Vanhan ajan filosofia
related: Kulttuurifilosofia
related: Käytös- ja tapatieto
related: Juhlien järjestäminen
related: Esineellinen kulttuuri
related: URN:NBN:fi:au:hklj:473
related: URN:NBN:fi:au:hklj:649.91
related: Esihistoriallinen taide
related: Euroopan ulkopuolisten vanhojen kulttuurien taide
related: Antiikin taidehistoria
related: Vanha aika
related: URN:NBN:fi:au:hklj:909
related: Vanhan ajan historia
related: Historian tutkimusmenetelmät
related: Historian aputieteet
related: Yleinen arkeologia
related: Egyptin ja Etu-Aasian muinaishistoria ja arkeologia
related: Kreikan muinaishistoria ja arkeologia
related: Rooman valtakunnan historia ja arkeologia
related: Etelä-Aasian historia
related: Keski- ja Itä-Aasian historia
related: Japanin historia
scope note: Vanhan ajan kulttuurihistorian yleisteokset Euroopan vanhan ajan kulttuurihistorian yleisteokset Antiikin kulttuurihistorian yleisteokset Tässä myös kivi-, pronssi- ja rautakausi sekä neoliittinen ja paleoliittinen kausi kulttuurihistorian kannalta yleensä Tietyn maan tai alueen vanhan ajan kulttuurihistoria ko. maan tai alueen historian luokassa
scope note: Allmänna verk om forntidens kulturhistoria Allmänna verk om den europeiska forntidens kulturhistoria Allmänna verk om antikens kulturhistoria Hit också stenålder, bronsålder och järnålder samt neolitikum och paleolitikum ur kulturhistorisk synvinkel i allmänhet Verk om forntidens kulturhistoria i ett bestämt land eller geografiskt område förs till klassen för världsdelens, landets eller det geografiska områdets historia @sv

Psykologian suunnat
type: Class
type: Concept
subclass of: URN:NBN:fi:au:hklj:120
alternative label: Konnektionismi, psykologia (123)
alternative label: Kriittinen psykologia, (123 +)
alternative label: Psykologiset koulukunnat (123 +)
alternative label: Konnexionism, psykologi (123) @sv
alternative label: Kritisk psykologi, (123 +) @sv
alternative label: Psykologiska skolor (123 +) @sv
broader: URN:NBN:fi:au:hklj:120
in scheme: URN:NBN:fi:au:hklj:
narrower: Behaviorismi
narrower: Syvyyspsykologia
notation: 123
preferred label: Schools in psychology @en
preferred label: Riktningar inom psykologin @sv
related: Psyyken rakenne ja toiminnot
related: Ajattelu. Älykkyys. Mielikuvitus
related: Tunne- ja tahtotoiminnot
related: Oppimisen psykologia
related: Havaintopsykologia
related: Tiedostamaton sielunelämä
related: Uni
related: Alitajunta
related: Hypnoosi. Suggestio
related: Kokeellinen psykologia. Psykometriikka
related: Perinnöllisyyspsykologia
related: Typologia. Karakterologia
related: Differentiaalipsykologia. Persoonallisuuden psykologia
related: Psychology of expression {@en
related: Lapsuuden ja nuoruuden psykologia
related: Muita psykologian aloja
related: Uskonto- ja maailmankatsomuspsykologia
related: Sosiaalipsykologia. Kulttuuripsykologia
related: Ihmissuhteiden psykologia
related: Kehityspsykologia. Eri ikäkausien psykologia
related: Fysiologinen psykologia
scope note: Tässä useita psykologian suuntia ja koulukuntia esittelevät tai vertailevat yleisteokset Tiettyä psykologian erikoisalaa tai -kysymystä koskevat teokset koulukunnasta riippumatta alan mukaisessa luokassa
scope note: Hit allmänna verk som presenterar eller jämför flera riktningar eller skolor inom psykologin Verk som rör psykologiska specialområden eller specialfrågor klassificeras oavsett skolor enligt område @sv

Kuolemakokemukset
type: Class
type: Concept
subclass of: RAJATIETO
alternative label: Inkarnaatio, kokemukset kuolemasta (193)
alternative label: Jälleensyntyminen, kuolemakokemukset (193)
alternative label: Kokemukset, kuolemakokemukset (193)
alternative label: Kuolema, parapsykologiset kokemukset (193)
alternative label: Kuolemakokemukset (193)
alternative label: Kuolemanjälkeinen elämä, kuolemakokemukset (193)
alternative label: Kuolemattomuus, kuolemakokemukset (193)
alternative label: Kuolleet, kuolemakokemukset (193)
alternative label: Näyt, kuolemakokemukset (193)
alternative label: Paranormaalit ilmiöt, kuolemakokemukset (193)
alternative label: Rajatieto, kuolemakokemukset (193)
alternative label: Reinkarnaatio, kuolemakokemukset (193)
alternative label: Selittämättömät ilmiöt, kuolemakokemukset (193)
alternative label: Sielun kuolemattomuus, kuolemakokemukset (193)
alternative label: Sielunvaellus, kuolemakokemukset (193)
alternative label: Uudelleensyntyminen, kuolemakokemukset (193)
alternative label: Avlidna, dödsupplevelser (193) @sv
alternative label: Döden, parapsykologiska upplevelser (193) @sv
alternative label: Dödsupplevelser (193) @sv
alternative label: Erfarenheter, dödsupplevelser (193) @sv
alternative label: Inkarnation, dödserfarenheter (193) @sv
alternative label: Livet efter döden, dödsupplevelser (193) @sv
alternative label: Odödlighet, dödsupplevelser (193) @sv
alternative label: Oförklarliga fenomen, dödsupplevelser (193) @sv
alternative label: Omstridda fenomen, dödsupplevelser (193) @sv
alternative label: Paranormala fenomen, dödsupplevelser (193) @sv
alternative label: Pånyttfödelse, övriga religioner och ockultism, dödsupplevelser (193) @sv
alternative label: Reinkarnation, dödsupplevelser (193) @sv
alternative label: Själavandring, dödsupplevelser (193) @sv
alternative label: Själens odödlighet, dödsupplevelser (193) @sv
alternative label: Syner, dödsupplevelser (193) @sv
alternative label: Återfödelse, dödsupplevelser (193) @sv
broader: RAJATIETO
in scheme: URN:NBN:fi:au:hklj:
notation: 193
preferred label: Experiences of death @en
preferred label: Dödsupplevelser @sv
related: Tiedostamaton sielunelämä
related: Uni
related: Alitajunta
related: Hypnoosi. Suggestio
related: Parapsykologia
related: URN:NBN:fi:au:hklj:192
related: Elämä. Kuolema
related: Kuolema ja kuolemanjälkeinen elämä
related: URN:NBN:fi:au:hklj:280
related: Itä-Aasian uskonnot ja mytologiat
related: Intian uskonnot ja mytologiat
related: Buddhalaisuus ja sen mytologia
related: Muinais-Egyptin ja Etu-Aasian uskonnot ja mytologiat
related: Antiikin Kreikan ja Rooman uskonnot ja mytologiat
related: Persian uskonnot ja mytologiat
related: Islam ja sen mytologia
related: Juutalaisten uskonto ja sen mytologia
related: Muut uskonnot ja mytologiat
related: Afrikan alkuperäiskansojen uskonnot
related: Amerikan alkuperäiskansojen uskonnot ja mytologiat
related: Australian ja Oseanian alkuperäiskansojen uskonnot ja mytologiat
related: Muinaissuomalaiset ja suomalais-ugrilaiset uskonnot ja mytologiat
related: Muinaisgermaaniset, -balttilaiset, -slaavilaiset ja -kelttiläiset uskonnot ja mytologiat
related: Muinaispohjoismaiset uskonnot ja mytologiat
related: URN:NBN:fi:au:hklj:618.24
scope note: Rajatietoon kuuluvat kokemukset kuolemasta, kuolemanjälkeisestä elämästä, edellisistä elämistä ja jälleensyntymästä
scope note: Paranormala dödsupplevelser, upplevelser av livet efter detta, tidigare liv och reinkarnation @sv

Jumalan olemus
type: Class
type: Concept
subclass of: KRISTILLINEN DOGMATIIKKA
alternative label: Areiolaisuus, kolminaisuusoppi, dogmatiikka (231)
alternative label: Elämän synty, kristinusko (231)
alternative label: Epäjumalat, kristinuskon Jumala (231)
alternative label: Henki, kristillinen dogmatiikka (231)
alternative label: Immanenssi, kristillinen dogmatiikka (231)
alternative label: Jumala, kristillinen oppi (231)
alternative label: Jumalakäsitykset, kristillinen oppi (231)
alternative label: Jumalat, kristinuskon Jumala (231)
alternative label: Jumaluus, kristillinen oppi (231)
alternative label: Kaitselmus, kristillinen oppi (231)
alternative label: Kolminaisuusoppi, dogmatiikka (231)
alternative label: Kreationismi, kristillinen dogmatiikka (231)
alternative label: Luominen, kristillinen dogmatiikka (231)
alternative label: Monoteismi, kristillinen dogmatiikka (231)
alternative label: Pneumatologia, Pyhä Henki (231)
alternative label: Pyhitys, Pyhä Henki (231)
alternative label: Pyhyys, Pyhä Henki (231)
alternative label: Pyhä Henki, dogmatiikka (231)
alternative label: Pyhä, Pyhä Henki (231)
alternative label: Teodikea, jumalakäsitys, kristinusko (231)
alternative label: Todistukset, teologia, jumalatodistukset, kristinusko (231)
alternative label: Ykseys, kristillinen jumalakäsitys (231)
alternative label: Älykäs suunnittelu, kristillinen dogmatiikka (231)
alternative label: Ande, kristen dogmatik (231) @sv
alternative label: Arianism, treenighetsläran, dogmatik (231) @sv
alternative label: Avgudar, kristendomens Gud (231) @sv
alternative label: Bevis, teologi, gudsbevis, kristendom (231) @sv
alternative label: Enhet, kristen gudsuppfattning (231) @sv
alternative label: Försyn, kristen lära (231) @sv
alternative label: Gud, kristen lära (231) @sv
alternative label: Gudar, kristendomens Gud (231) @sv
alternative label: Gudom, kristen lära (231) @sv
alternative label: Gudsuppfattningar, kristen lära (231) @sv
alternative label: Helg, Heliga Anda (231) @sv
alternative label: Helgande, Helige Ande (231) @sv
alternative label: Helige Ande, den, dogmatik (231) @sv
alternative label: Helighet, den Helige Ande (231) @sv
alternative label: Immanens, kristen dogmatik (231) @sv
alternative label: Intelligent design, kristen dogmatik (231) @sv
alternative label: Kreationism, kristen dogmatik (231) @sv
alternative label: Livets uppkomst, kristendom (231) @sv
alternative label: Monoteism, kristen dogmatik (231) @sv
alternative label: Pneumatologi, den Helige Ande (231) @sv
alternative label: Skapelsen, kristen dogmatik (231) @sv
alternative label: Teodicé, gudsuppfattning, kristendom (231) @sv
alternative label: Treenighetsläran, dogmatik (231) @sv
broader: KRISTILLINEN DOGMATIIKKA
in scheme: URN:NBN:fi:au:hklj:
notation: 231
preferred label: God's Being @en
related: URN:NBN:fi:au:hklj:110
related: Uskonnonfilosofia
related: Elämä. Kuolema
related: Luominen. Kehitys
related: URN:NBN:fi:au:hklj:209
related: Kristologia
related: Apologetiikka
related: Kristillinen etiikka
related: URN:NBN:fi:au:hklj:280
related: Itä-Aasian uskonnot ja mytologiat
related: Intian uskonnot ja mytologiat
related: Buddhalaisuus ja sen mytologia
related: Muinais-Egyptin ja Etu-Aasian uskonnot ja mytologiat
related: Antiikin Kreikan ja Rooman uskonnot ja mytologiat
related: Persian uskonnot ja mytologiat
related: Islam ja sen mytologia
related: Juutalaisten uskonto ja sen mytologia
related: Muut uskonnot ja mytologiat
related: Afrikan alkuperäiskansojen uskonnot
related: Amerikan alkuperäiskansojen uskonnot ja mytologiat
related: Australian ja Oseanian alkuperäiskansojen uskonnot ja mytologiat
related: Muinaissuomalaiset ja suomalais-ugrilaiset uskonnot ja mytologiat
related: Muinaisgermaaniset, -balttilaiset, -slaavilaiset ja -kelttiläiset uskonnot ja mytologiat
related: Muinaispohjoismaiset uskonnot ja mytologiat
related: Kehitysoppi. Evoluutio
scope note: Kristinuskon Jumala-käsite. Kolminaisuusoppi. Isä. Poika. Pyhä Henki Jumalan olemassaolo ja toiminta. Luominen. Kaitselmus. Jumalan ilmoitus
scope note: Kristendomens gudsbegrepp. Treenighetsläran. Fadern. Sonen. Den Helige Ande Guds existens och verksamhet. Skapelsen. Försynen. Guds uppenbarelse @sv

Muut uskonnot ja mytologiat
type: Class
type: Concept
subclass of: URN:NBN:fi:au:hklj:280
alternative label: Alkuperäiskansat, mytologiat (289 +)
alternative label: Alkuperäiskansat, uskonnot (289 +)
alternative label: Animismi, eri animistiset uskonnot (289 +)
alternative label: Avioliittoon vihkiminen, uskontotiede, eri uskonnot (282 ... 289 +)
alternative label: Fetisismi, alkuperäiskansojen uskonnot (289 +)
alternative label: Fetisistiset uskonnot (289 +)
alternative label: Jälleensyntyminen, alkuperäiskansojen uskonnot (289 +)
alternative label: Kansanusko, samanismi (289 +)
alternative label: Luonnonkansat, mytologiat (289 +)
alternative label: Luonnonkansat, uskonnot (289 +)
alternative label: Luonnonpalvonta, uskontotiede, eri uskonnot (289 +)
alternative label: Luonto, luonnonpalvonta, eri uskonnot (289 +)
alternative label: Lähteet, uhrilähteet, uskontotiede (289 +)
alternative label: Noidat, samanismi (289 +)
alternative label: Noitarummut, samanismi (289 +)
alternative label: Noituus, samanismi (289 +)
alternative label: Primitiiviset kansat, mytologiat (289 +)
alternative label: Primitiiviset kansat, uskonnot (289 +)
alternative label: Rajatieto, samanismi (289 +)
alternative label: Samaanit (289 +)
alternative label: Samanismi (289 +)
alternative label: Shamaanit (289 +)
alternative label: Shamanismi (289 +)
alternative label: Sielunvaellus, alkuperäiskansojen uskonnot (289 +)
alternative label: Tietäjät, shamanismi (289 +)
alternative label: Totemismi (289 +)
alternative label: Uudelleensyntyminen, alkuperäiskansojen uskonnot (289 +)
alternative label: Velhot, samanismi (289 +)
alternative label: Animism, olika animistiska religioner (289 +) @sv
alternative label: Besvärjare, schamanism (289 +) @sv
alternative label: Fetischism, urbefolkningarnas religioner (289 +) @sv
alternative label: Fetischistiska religioner (289 +) @sv
alternative label: Folktro, schamanism (289 +) @sv
alternative label: Häxeri, schamanism (289 +) @sv
alternative label: Häxor, schamanism (289 +) @sv
alternative label: Källor, offerkällor, religionsvetenskap (289 +) @sv
alternative label: Naturdyrkan, religionsvetenskap, olika religioner (289 +) @sv
alternative label: Naturen, naturdyrkan, olika religioner (289 +) @sv
alternative label: Naturfolk, mytologier (289 +) @sv
alternative label: Naturfolk, religioner (289 +) @sv
alternative label: Omstridda fenomen, schamanism (289 +) @sv
alternative label: Primitiva folk, mytologier (289 +) @sv
alternative label: Primitiva folk, religioner (289 +) @sv
alternative label: Pånyttfödelse, övriga religioner och ockultism, urbefolkningarnas religioner (289 +) @sv
alternative label: Reinkarnation, urbefolkningarnas religioner (289 +) @sv
alternative label: Schamaner (289 +) @sv
alternative label: Schamanism (289 +) @sv
alternative label: Schamantrummor, schamanism (289 +) @sv
alternative label: Shamaner (289 +) @sv
alternative label: Shamanism (289 +) @sv
alternative label: Själavandring, urbefolkningarnas religioner (289 +) @sv
alternative label: Totemism (289 +) @sv
broader: URN:NBN:fi:au:hklj:280
in scheme: URN:NBN:fi:au:hklj:
narrower: Afrikan alkuperäiskansojen uskonnot
narrower: Amerikan alkuperäiskansojen uskonnot ja mytologiat
narrower: Australian ja Oseanian alkuperäiskansojen uskonnot ja mytologiat
narrower: Muinaissuomalaiset ja suomalais-ugrilaiset uskonnot ja mytologiat
narrower: Muinaisgermaaniset, -balttilaiset, -slaavilaiset ja -kelttiläiset uskonnot ja mytologiat
notation: 289
related: URN:NBN:fi:au:hklj:110
related: RAJATIETO
related: URN:NBN:fi:au:hklj:192
related: Kuolemakokemukset
related: Uskonnonfilosofia
related: Elämä. Kuolema
related: Luominen. Kehitys
related: URN:NBN:fi:au:hklj:209
related: URN:NBN:fi:au:hklj:210
related: Jumalan olemus
related: Enkelit. Paholaiset. Demonit
related: Kuolema ja kuolemanjälkeinen elämä
related: Lähetystyö
related: URN:NBN:fi:au:hklj:807
related: URN:NBN:fi:au:hklj:992
scope note: Tässä myös Aasian alkuperäiskansojen uskonnot ja mytologiat Tässä ja alaluokissa shamanismi
scope note: Hit också de asiatiska ursprungsfolkens religioner och mytologier Hit och till underklasserna schamanism @sv

Kansainvälinen oikeus
type: Class
type: Concept
subclass of: URN:NBN:fi:au:hklj:330
alternative label: Ahvenanmaa, kansainvälinen oikeus (336)
alternative label: Avaruusoikeus (336)
alternative label: Diplomaattiset erioikeudet (336)
alternative label: Diplomatiaoikeus (336)
alternative label: Erioikeudet, diplomaatiaoikeus (336)
alternative label: Erivapaus, diplomatiaoikeus (336)
alternative label: Haagin tuomioistuin (336)
alternative label: Humanitaarinen oikeus, kansainvälinen oikeus (336)
alternative label: Hyökkäysrikos, sotarikokset, kansainvälinen rikosoikeus (336)
alternative label: Ilmatila, kansainvälinen oikeus (336)
alternative label: Interventio, kansainvälinen oikeus (336)
alternative label: Kansainvälinen julkisokeus (336)
alternative label: Kansainvälinen järjestelmä, kansainvälinen oikeus (336)
alternative label: Kansainvälinen kauppaoikeus (336)
alternative label: Kansainvälinen markkinaoikeus (336)
alternative label: Kansainvälinen merioikeus (336)
alternative label: Kansainvälinen oikeudenkäyttö (336)
alternative label: Kansainvälinen oikeus (336)
alternative label: Kansainvälinen oikeusapu (336)
alternative label: Kansainvälinen oikeussubjekti (336)
alternative label: Kansainvälinen perheoikeus (336)
alternative label: Kansainvälinen perintöoikeus (336)
alternative label: Kansainvälinen prosessioikeus (336)
alternative label: Kansainvälinen rikosoikeus (336)
alternative label: Kansainvälinen sosiaalioikeus (336)
alternative label: Kansainvälinen talousoikeus (336)
alternative label: Kansainvälinen tapaoikeus (336)
alternative label: Kansainvälinen tekijänoikeus (336)
alternative label: Kansainvälinen teollisoikeus (336)
alternative label: Kansainvälinen työoikeus (336)
alternative label: Kansainvälinen velvoiteoikeus (336)
alternative label: Kansainvälinen vero-oikeus (336)
alternative label: Kansainvälinen yksityisoikeus (336)
alternative label: Kansainvälinen ympäristöoikeus (336)
alternative label: Kansainväliset tuomioistuimet (336)
alternative label: Kommentaarit, lakien kommentaarit (332 ... 338)
alternative label: Konsulioikeus (336)
alternative label: Lakikirjat, kansainväliset lait (336)
alternative label: Lakikokoelmat, kansainväliset lait (336)
alternative label: Luovuttaminen, rikoksentekijän luovutus, kansainvälinen oikeus (336)
alternative label: Luovutus, rikoksentekijän luovutus, kansainvälinen oikeus (336)
alternative label: Merioikeus, kansainvälinen merioikeus (336)
alternative label: Oikeusistuimet, muut kansainväliset (336)
alternative label: Rikoksentekijän luovutus, kansainvälinen oikeus (336)
alternative label: Rikos ihmisyyttä vastaan, kansainvälinen oikeus (336)
alternative label: Rikosoikeus, kansainvälinen rikosoikeus (336)
alternative label: Sanktiot, kansainvälinen oikeus (336)
broader: URN:NBN:fi:au:hklj:330
in scheme: URN:NBN:fi:au:hklj:
notation: 336
related: URN:NBN:fi:au:hklj:326.2
related: Julkisoikeus
related: URN:NBN:fi:au:hklj:332.1
related: URN:NBN:fi:au:hklj:332.2
related: Asemakaava- ja rakentamislainsäädäntö
related: URN:NBN:fi:au:hklj:332.22
related: Vero-oikeus
related: Rikosoikeus
related: Prosessioikeus. Oikeushallinto
related: Vankeinhoito. Vankilat
related: Siviili- ja kauppaoikeus. Sopimusoikeus
related: Esine- ja velvoiteoikeus. Immateriaalioikeudet. Huoneen- ja maanvuokralainsäädäntö
related: Perhe- ja holhousoikeus
related: Perintö- ja testamenttioikeus
related: Kauppaoikeus. Yhtiölainsäädäntö. Pankki- ja vakuutuslainsäädäntö
related: Ympäristöoikeus. Talousoikeus
related: Merioikeus
related: Maaoikeus
related: Vesioikeus
related: Maa- ja metsätalouslainsäädäntö
related: Työoikeus
related: Suomen ja Euroopan Unionin laki- ja asetuskokoelmat
related: Muiden maiden lait
related: Muiden maiden kunnallis-, läänin- ja valtionhallinto
related: Sotien yhteiskunnalliset vaikutukset
scope note: Kansainvälinen yksityisoikeus. Kansainvälinen rikosoikeus Diplomatia- ja konsulioikeus. Kansainvälinen merioikeus Kansainvälisiä järjestöjä koskeva lainsäädäntö Ihmisoikeuksia koskeva kansainvälinen lainsäädäntö Ahvenanmaan oikeudellinen asema Kansainväliset tuomioistuimet
scope note: Internationell privaträtt. Internationell straffrätt Diplomat- och konsulärrätt. Internationell sjörätt Lagstiftning om internationella organisationer Internationell lagstiftning om mänskliga rättigheter Ålands rättsliga ställning Internationella domstolar @sv

Suomen ja Euroopan Unionin laki- ja asetuskokoelmat
type: Class
type: Concept
subclass of: URN:NBN:fi:au:hklj:330
alternative label: Asetukset, Suomi ja EU (337)
alternative label: Direktiivit, direktiivikokoelmat (337)
alternative label: EU-oikeus (337)
alternative label: EU:n oikeus (337)
alternative label: EY-oikeus (337)
alternative label: Euroopan unionin oikeus (337)
alternative label: Eurooppaoikeus (337)
alternative label: Eurooppaosuuskunnat, EU-oikeus (337)
alternative label: Kansainvälinen oikeus, Euroopan unioni (337)
alternative label: Kansallinen oikeus, Suomen lakikokoelmat (337)
alternative label: Kommentaarit, lakien kommentaarit (332 ... 338)
alternative label: Lakikirjat, EU-lait (337)
alternative label: Lakikirjat, Suomen lait (337)
alternative label: Lakikokoelmat, EU-lait (337)
alternative label: Lakikokoelmat, Suomen lait (337)
alternative label: Määräykset, asetukset (337)
alternative label: Määräykset, direktiivit (337)
alternative label: Primaarioikeus, EU-oikeus (337)
alternative label: Selitetyt lakikokoelmat (337)
alternative label: Suomen asetuskokoelma (337)
alternative label: Suomen laki (337)
alternative label: Suomen säädöskokoelma (337)
alternative label: Säädökset, Suomi ja EU (337)
alternative label: Valtionsisäinen oikeus, Suomen lakikokoelmat (337)
alternative label: Välittömät oikeusvaikutukset, EY-oikeus (337)
alternative label: Ylikansallinen osuuskuntamuoto, EU-oikeus (337)
alternative label: Bestämmelser, direktiv (337) @sv
alternative label: Bestämmelser, förordningar (337) @sv
alternative label: Direkta rättsverkningar, EG-rätt (337) @sv
alternative label: Direktiv, direktivsamlingar (337) @sv
alternative label: EG-rätt (337) @sv
alternative label: EU-rätt (337) @sv
alternative label: Europaandelslag, EU-rätt (337) @sv
alternative label: Europarätt (337) @sv
alternative label: Europeiska unionens rätt (337) @sv
alternative label: Finlands författningssamling (337) @sv
alternative label: Finlands lag (337) @sv
alternative label: Folkrätt, Europeiska unionen (337) @sv
alternative label: Författningar, Finland och EU (337) @sv
alternative label: Förordningar, Finland och EU (337) @sv
alternative label: Inomstatlig rätt, lagsamlingar, Finland (337) @sv
alternative label: Kommentarer, lagkommentarer (332 ... 338) @sv
alternative label: Kommenterade lagsamlingar (337) @sv
alternative label: Lagböcker, EU-lagar (337) @sv
alternative label: Lagböcker, Finlands lagar (337) @sv
alternative label: Lagsamlingar, EU-lagar (337) @sv
alternative label: Lagsamlingar, Finlands lagar (337) @sv
broader: URN:NBN:fi:au:hklj:330
in scheme: URN:NBN:fi:au:hklj:
notation: 337
related: URN:NBN:fi:au:hklj:326.2
related: Asiakirjakaavat ja -ohjeet. Oikeusoppaat
related: Julkisoikeus
related: URN:NBN:fi:au:hklj:332.1
related: URN:NBN:fi:au:hklj:332.2
related: Asemakaava- ja rakentamislainsäädäntö
related: URN:NBN:fi:au:hklj:332.22
related: Vero-oikeus
related: Rikosoikeus
related: Prosessioikeus. Oikeushallinto
related: Vankeinhoito. Vankilat
related: Siviili- ja kauppaoikeus. Sopimusoikeus
related: Esine- ja velvoiteoikeus. Immateriaalioikeudet. Huoneen- ja maanvuokralainsäädäntö
related: Perhe- ja holhousoikeus
related: Perintö- ja testamenttioikeus
related: Kauppaoikeus. Yhtiölainsäädäntö. Pankki- ja vakuutuslainsäädäntö
related: Ympäristöoikeus. Talousoikeus
related: Merioikeus
related: Maaoikeus
related: Vesioikeus
related: Maa- ja metsätalouslainsäädäntö
related: Työoikeus
related: Kansainvälinen oikeus
related: URN:NBN:fi:au:hklj:337.05
related: Muiden maiden lait
scope note: Suomen ja Euroopan Unionin yleissisältöiset laki- ja asetuskokoelmat Suomen ja EU:n erikoisalojen laki- ja asetuskokoelmat alan mukaisessa luokassa
scope note: Finlands och Europeiska unionens lag- och författningssamlingar med allmänt innehåll Finlands och Europeiska unionens lag- och författningssamlingar inom specialområden klassificeras enligt område @sv

Suomi
type: Class
type: Concept
subclass of: Sotahistoria
alternative label: Jatkosota, sotahistoriallinen tutkimus (399.1)
alternative label: Kansalaissota, sotahistoria tutkimus (399.1)
alternative label: Korsut, sotahistoria, Suomi (399.1)
alternative label: Suomen historia, sotahistoria, sotatieteellinen (399.1)
alternative label: Suomen sisällissota, sotahistoria (399.1)
alternative label: Suomen sota 1808-1809, sotahistoria, sotatieteellinen (399.1)
alternative label: Suomi, sotahistoria, sotatieteellinen (399.1)
alternative label: Talvisota, sotahistoriallinen tutkimus (399.1)
alternative label: Vapaussota, Suomen sotahistoria (399.1)
alternative label: Finland, krigshistoria, krigsvetenskaplig (399.1) @sv
alternative label: Finlands historia, krigshistoria, krigsvetenskaplig (399.1) @sv
alternative label: Finska inbördeskriget, krigshistoria (399.1) @sv
alternative label: Finska kriget 1808-1809, krigshistoria, krigsvetenskaplig (399.1) @sv
alternative label: Fortsättningskriget, krigshistorisk forskning (399.1) @sv
alternative label: Frihetskriget, Finlands armé (399.1) @sv
alternative label: Inbördeskriget, krigshistoria, forskning (399.1) @sv
alternative label: Korsur, krigshistoria, Finland (399.1) @sv
alternative label: Vinterkriget, krigshistorisk forskning (399.1) @sv
broader: Sotahistoria
in scheme: URN:NBN:fi:au:hklj:
notation: 399.1
preferred label: Finland @en
related: URN:NBN:fi:au:hklj:1.4
related: URN:NBN:fi:au:hklj:320
related: URN:NBN:fi:au:hklj:325
related: Rauhankysymys. Rauhantutkimus
related: URN:NBN:fi:au:hklj:332.2
related: URN:NBN:fi:au:hklj:340
related: Organisaatioiden ja laitosten sosiologia
related: Aseteknologia
related: URN:NBN:fi:au:hklj:393.09
related: Suomen puolustusvoimat
related: URN:NBN:fi:au:hklj:397.09
related: Muiden maiden puolustusvoimat
related: URN:NBN:fi:au:hklj:909
related: I maailmansodan historia 1914-1918
related: II maailmansodan historia 1939-1945
related: Vuoden 1918 sota
related: Sodat 1939-1945
scope note: Puhtaasti sotilaallisia kysymyksiä Suomen osalta koskevat historiateokset Suomea koskeva sotahistoriallinen tutkimus Suomen puolustusvoimien asepuvut ja niiden historia
scope note: Historiska verk som rör rent militära frågor med tonvikt på Finland Krigshistorisk forskning som rör Finland Uniformerna inom Finlands försvarsmakt och deras historia @sv

KASVITIEDE
type: Class
type: Concept
subclass of: LUONNONTIETEET
alternative label: Androgynia, kasvitiede (580)
alternative label: Arboretumit (580)
alternative label: Biologia, kasvitiede (580 ... 588)
alternative label: Biologiset tieteet, kasvitiede (580 ... 588)
alternative label: Biotieteet, kasvitiede (580 ... 588)
alternative label: Elävä luonto, kasvitiede (580 ... 588)
alternative label: Elävät fossiilit, kasvitiede (580 ... 588)
alternative label: Etäsuojelu, kasvitiede (580 ... 588)
alternative label: Fotobiologia, biologia, kasvitiede (580 ... 588)
alternative label: Herbaariot (580 ... 588)
alternative label: Hermafroditismi, kasvitiede (580)
alternative label: Itusilmut, kasvitiede (580 ... 588)
alternative label: Kasvien kerääminen (580)
alternative label: Kasviharrastus, luonnonkasvit (580)
alternative label: Kasvihuoneet, kasvitieteelliset puutarhat (580)
alternative label: Kasvikokoelmat (580)
alternative label: Kasvikuidut, kasvitiede (580 ... 588)
alternative label: Kasvikunta, kasvitiede (580)
alternative label: Kasvimateriaalit, kasvitiede (580 ... 588)
alternative label: Kasvimuseot (580)
alternative label: Kasvitaudit, luonnonkasvit (580 ... 587 +)
alternative label: Kasvitiede (580 ... 588)
alternative label: Kasvitieteelliset museot (580)
alternative label: Kasvitieteelliset puutarhat (580)
alternative label: Keräily, kasvit (580)
alternative label: Lajiensuojelu, kasvitiede (580 ... 588)
alternative label: Luonnonkasvit, kasvitiede (580 ... 588)
alternative label: Luonnontieteelliset museot, kasvimuseot (580)
alternative label: Luonnontieteet, kasvitiede (580 ... 588)
alternative label: Luonnonvaraiset kasvit, kasvitiede (580 ... 588)
alternative label: Luonto, elävä luonto (570 ... 598)
alternative label: Museot, kasvimuseot (580)
alternative label: Niini, kasvikuidut, kasvitiede (580 ... 588)
alternative label: Orangeriat, kasvitieteelliset puutarhat (580)
alternative label: Paljassiemeniset, kasvitiede (580 ... 588)
alternative label: Puistot, kasvitieteelliset puutarhat (580)
alternative label: Rönsyt, kasvitiede (580 ... 588)
alternative label: Seksuaalisuus, kasvitiede (580)
alternative label: Sukupolvenvuorottelu, kasvitiede (580)
alternative label: Sukupuolisuus, kasvitiede (580)
alternative label: Suvullinen lisääntyminen, kasvitiede (580)
alternative label: Suvuton lisääntyminen, kasvitiede (580)
alternative label: Talvipuutarhat, kasvitieteelliset puutarhat (580)
alternative label: Tuholaiskestävyys, kasvitiede (580 ... 588 +)
alternative label: Viherhuoneet, kasvitieteelliset puutarhat (580)
alternative label: Androgyni, botanik (580) @sv
alternative label: Arboretum (580) @sv
alternative label: Artskydd, botanik (580 ... 588) @sv
alternative label: Bast, växtfibrer, botanik (580 ... 588) @sv
alternative label: Biologi, botanik (580 ... 588) @sv
alternative label: Biologiska vetenskaper, botanik (580 ... 588) @sv
alternative label: Biovetenskaper, botanik (580 ... 588) @sv
broader: LUONNONTIETEET
in scheme: URN:NBN:fi:au:hklj:
narrower: Kasvimorfologia. Kasvianatomia
narrower: Kasvifysiologia
narrower: Kasviekologia
narrower: Systemaattinen kasvitiede
narrower: Kasvimaantiede
notation: 580
related: Hydrologia
related: Paleontologia
related: Luonto-oppaat. Oppikirjat
related: Uhanalaiset lajit. Luonnonsuojelualueet
related: BIOLOGIA
related: URN:NBN:fi:au:hklj:580.03
related: Maanviljely
related: Puutarhanhoito. Hyötykasvit. Huone- ja koristekasvit
related: Koristekasvit
related: Hyötykasvit
related: Yrtti- ja maustekasvit
related: Hedelmä-, marja- ja vihanneskasvit
related: Huonekasvit
related: URN:NBN:fi:au:hklj:657
related: Luonnon- ja kulttuurimaiseman suunnittelu
scope note: Kasvitieteen ja kasviopin yleisteokset Luonnonvaraisia kasveja yleensä koskevat teokset Kasviharrastuskirjat. Kasvien keräily Kasvikokoelmat. Herbaariot Kasvitieteelliset museot ja puutarhat Yleiset kasveja koskevat teokset, joiden sisältöä ei ole järjestetty systemaattisesti eikä aakkosellisesti
scope note: Allmänna verk om botanik Verk som rör vilda växter i allmänhet Handböcker för växtintresserade. Växtsamlande Växtsamlingar. Herbarier Botaniska museer och trädgårdar Allmänna verk som rör växter och vars innehåll inte är systematiskt eller alfabetiskt indelat @sv

Seksologia
type: Class
type: Concept
subclass of: Terveydenhoito
alternative label: Addiktio, seksi (613.6)
alternative label: Androgynia, seksologia (613.6)
alternative label: Aseksuaalisuus (613.6)
alternative label: Asennot, seksioppaat (613.6)
alternative label: Avioliitto, sukupuolielämä (613.6)
alternative label: Avoliitto, sukupuolielämä (613.6)
alternative label: Biseksuaalisuus (613.6)
alternative label: Biseksuaalit (613.6)
alternative label: Bordellit, seksologia (613.6)
alternative label: Diskriminointi, seksuaaliset vähemmistöt (613.6)
alternative label: E-pillerit (613.6)
alternative label: Ehkäisy, raskauden ehkäisy (613.6)
alternative label: Ehkäisymenetelmät (613.6)
alternative label: Ehkäisyneuvonta (613.6)
alternative label: Ehkäisypillerit (613.6)
alternative label: Ehkäisytabletit (613.6)
alternative label: Ekshibitionismi (613.6)
alternative label: Eläimeen sekaantuminen, seksologia (613.6)
alternative label: Eläimiin sekaantuminen, seksologia (613.6)
alternative label: Erektiohäiriöt (613.6)
alternative label: Erotiikka, seksologia (613.6)
alternative label: Esimurrosikä, seksuaalinen kehitys (613.6)
alternative label: Esipuberteetti, seksuaalinen kehitys (613.6)
alternative label: Fetisismi, seksologia (613.6)
alternative label: Fetissit, seksologia (613.6)
alternative label: Flirtti, seksologia (613.6)
alternative label: Frigiditeetti (613.6)
alternative label: Gaykulttuuri (613.6)
alternative label: Hermafroditismi, seksologia (613.6)
alternative label: Heteroseksuaalisuus, seksologia (613.6)
alternative label: Homoerotiikka (613.6)
alternative label: Homofilia (613.6)
alternative label: Homokulttuuri (613.6)
alternative label: Homoseksuaalisuus, seksologia (613.6)
alternative label: Homous (613.6)
alternative label: Hormonaaliset tekijät, sukupuolielämä, raskauden ehkäisy (613.6)
alternative label: Hormonaaliset vaikutukset, sukupuolielämä, raskauden ehkäisy (613.6)
alternative label: Hormonikierukat (613.6)
alternative label: Hormonivaikutukset, sukupuolielämä, raskauden ehkäisy (613.6)
alternative label: Ihmiskauppa, prostituutio (613.6)
alternative label: Ilotalot, seksologia (613.6)
alternative label: Ilotytöt, prostituutio (613.6)
alternative label: Impotenssi (613.6)
alternative label: Insesti, seksologia (613.6)
alternative label: Interseksuaalisuus (613.6)
alternative label: Intersukupuolisuus (613.6)
alternative label: Irtolaisuus, prostituutio (613.6)
broader: Terveydenhoito
in scheme: URN:NBN:fi:au:hklj:
notation: 613.6
related: Differentiaalipsykologia. Persoonallisuuden psykologia
related: Lapsuuden ja nuoruuden psykologia
related: Ihmissuhteiden psykologia
related: Naisen ja miehen psykologia
related: Etiikka. Moraalifilosofia
related: Perhe- ja kotikasvatus
related: Kristillinen etiikka
related: URN:NBN:fi:au:hklj:323
related: URN:NBN:fi:au:hklj:332.22
related: URN:NBN:fi:au:hklj:357.1
related: Kriminologia. Kriminaalisosiologia
related: Perhepolitiikka. Lapsipolitiikka. Nuorisopolitiikka
related: URN:NBN:fi:au:hklj:371.6
related: Naisen ja miehen asema yhteiskunnassa
related: Hoitotiede. Hoitotyö. Hoitohenkilökunta
related: Henkilökohtainen terveydenhoito
related: URN:NBN:fi:au:hklj:615
related: URN:NBN:fi:au:hklj:617
related: Tartuntataudit
related: Iho. Ihotaudit. Sukupuolielimet. Sukupuolitaudit
related: Raskaus. Sikiönkehitys. Synnytys. Gynekologia
related: Virtsaelimet. Virtsaelinten taudit
related: Julkiset huvit
related: Sirkus. Huvipuistot. Varietee
related: Erotiikan historia
scope note: Ihmisen sukupuolinen käyttäytyminen Sukupuolielämän sosiologia ja psykologia Seksuaalipsykologia. Erotiikan psykologia Seksuaalikasvatus. Seksuaalivalistus Sukupuolioppaat. Ehkäisyneuvonta. Ehkäisymenetelmät. Turvaseksi Sukupuolielämän häiriöt ja ongelmat Sukupuoliset vähemmistöt, niiden osakulttuurit, elämäntavat ja asema yhteiskunnassa Heteroseksuaalisuus. Homoseksuaalisuus. Biseksuaalisuus Insesti seksologisena kysymyksenä Seksibisnes. Pornografia. Prostituutio. Seksiturismi
scope note: Människans sexuella beteende Sexuallivets sociologi och psykologi Sexualpsykologi. Erotikens psykologi Sexualfostran. Sexualupplysning Sexualhandböcker. Preventivmedelsrådgivning. Preventivmetoder. Trygg sex törningar och problem i sexuallivet Sexuella minoriteter, deras delkulturer, levnadssätt och ställning i samhället Heterosexualitet. Homosexualitet. Bisexualitet Incest som sexologisk fråga Kommersiell sex. Pornografi. Prostitution. Sexturism @sv

Systeemityö
type: Class
type: Concept
subclass of: URN:NBN:fi:au:hklj:627.7
alternative label: Atk-systeemityö (627.71)
alternative label: Data mining, atk (627.71)
alternative label: Data-arkistot, tietokannan suunnittelu (627.71)
alternative label: Datan louhinta, atk (627.71)
alternative label: Datanlouhinta, atk (627.71)
alternative label: Dokumentaatio, atk (627.71)
alternative label: Dokumentointi, atk (627.71)
alternative label: Hallintajärjestelmät, tiedonhallintajärjestelmät (627.71)
alternative label: Hierarkkiset tietojärjestelmät (627.71)
alternative label: Integroidut tietojärjestelmät. (627.71)
alternative label: Järjestelmäarkkitehtuuri (627.71)
alternative label: Järjestelmäkaaviot (627.71)
alternative label: Klusterianalyysi, tiedonlouhinta, atk (627.71)
alternative label: Konvertointi, atk-tietokannat (627.71)
alternative label: Lohkokaaviot, systeemityö (627.71)
alternative label: Modulaariset tietojärjestelmät (627.71)
alternative label: Numeeriset tietokannat, atk (627.71)
alternative label: Ohjelmistoarkkitehtuuri (627.71)
alternative label: Ohjelmistokehitys (627.71)
alternative label: Ohjelmistonsuunnittelu (627.71)
alternative label: Ohjelmistosuunnittelu (627.71)
alternative label: Ohjelmistot, atk-suunnittelu (627.71)
alternative label: Ohjelmistotekniikka (627.71)
alternative label: Operaatioanalyysi, systeeminsuunnittelu (627.71)
alternative label: Rekisterit, systeemityö (627.71)
alternative label: Relaatiotietokannat, systeemityö (627.71)
alternative label: Ryhmittelyanalyysi, tiedonlouhinta, atk (627.71)
alternative label: SQLite, relaatiotietokannat, systeemityö (627.71)
alternative label: Sovelluskehittimet, systeemityö (627.71)
alternative label: Sovellusohjelmat, systeemityö (627.71)
alternative label: Systeeminsuunnittelu, atk (627.71)
alternative label: Systeemityö, atk (627.71)
alternative label: Tekstinlouhinta, atk (627.71)
alternative label: Tekstitietokannat, systeemityö (627.71)
alternative label: Tiedon louhinta, atk (627.71)
alternative label: Tiedonhallinta, systeemityö (627.71)
alternative label: Tiedonhallintajärjestelmät (627.71)
alternative label: Tiedonlouhinta, atk (627.71)
alternative label: Tiedostot, systeemityö (627.71)
alternative label: Tietoarkistot, tietokannan suunnittelu (627.71)
alternative label: Tietojärjestelmät, systeemityö (627.71)
alternative label: Tietojärjestelmätyö, atk (627.71)
alternative label: Tietokannat, systeemityö (627.71)
alternative label: Tietopankit, systeemityö (627.71)
alternative label: Tietorekisterit, systeemityö (627.71)
alternative label: Tietovarastot, systeemityö (627.71)
alternative label: Työryhmäohjelmistot, systeemityö (627.71)
broader: URN:NBN:fi:au:hklj:627.7
in scheme: URN:NBN:fi:au:hklj:
notation: 627.71
related: YLEISET TIETOSANAKIRJAT
related: LOGIIKKA
related: Logistiikka. Looginen kalkyyli
related: URN:NBN:fi:au:hklj:182
related: URN:NBN:fi:au:hklj:332.1
related: URN:NBN:fi:au:hklj:384
related: Sähköoppi. Magnetismi
related: URN:NBN:fi:au:hklj:620.88
related: Ohjelmointi. Ohjelmointikielet
related: URN:NBN:fi:au:hklj:627.73
related: Käyttöjärjestelmät
related: Tekstinkäsittelyohjelmat
related: Taulukkolaskentaohjelmat
related: Tietokantaohjelmat
related: Kuvankäsittelyohjelmat. Grafiikkaohjelmat. Taitto-ohjelmat
related: Tietoliikenneohjelmat
related: Tietokoneiden lisälaitteet
related: Säätö- ja systeemitekniikka. Teollinen automaatio
related: URN:NBN:fi:au:hklj:627.7512
related: Elektroniikka
related: URN:NBN:fi:au:hklj:667.7
related: URN:NBN:fi:au:hklj:667.71
related: Toimistotyö
related: URN:NBN:fi:au:hklj:681
related: Toimistokoneet
scope note: Systeemityön ja systeeminsuunnittelun yleisteokset. Tiedonhallinta yleensä Tietojärjestelmien, ohjelmistojen, tiedostojen, tietokantojen ja tiedonhakujärjestelmien suunnittelu, rakentaminen ja ylläpito yleensä Systeemityön organisointi, vaiheistus ja dokumentointi yleensä Integroidut, hierarkkiset ja modulaariset tietojärjestelmät sekä niiden suunnittelu, toteutus ja ylläpito yleensä Järjestelmäkaaviot ja niiden laadinta yleensä Jos teoksessa on sekä systeemityötä että ohjelmointia, on etusija luokalla 627.71 Erikoisalojen tietojärjestelmät, tiedostot ja tietokannat sekä niiden suunnittelu, rakentaminen ja ylläpito alan mukaisessa luokassa
scope note: Allmänna verk som rör systemarbete och systemplanering. Informationshantering i allmänhet Planering, upprättande och underhåll av datasystem, program, register, databaser och informationssökningssystem i allmänhet Organisation, fasindelning och dokumentation av systemarbete i allmänhet Integrerade, hierarkiska och modulära databehandlingssystem samt planering, upprättande och underhåll av dem i allmänhet Systemscheman och upprättande av dem i allmänhet Om verket handlar om både systemarbete och programmering ges företräde åt klass 627.71 Databehandlingssystem, register och databaser för specialområden samt planering, upprättande och underhåll av dem klassificeras enligt område @sv

Matkaviestinpalvelut. Puhelinliikenne
type: Class
type: Concept
subclass of: Tietoliikenne. Viestintätekniikka. Multimedia
alternative label: 3G-tekniikka (627.752)
alternative label: 4G-tekniikka, mobiililaitteet, matkapuhelimet (627.752)
alternative label: Asennus, puhelinasennus (627.752)
alternative label: Automaattiset puhelinvastaajat (627.752)
alternative label: Autopuhelimet (627.752)
alternative label: Autopuhelinverkot (627.752)
alternative label: GPRS (627.752)
alternative label: GSM (627.752)
alternative label: General Packet Radio Service (627.752)
alternative label: Group Special Mobile (627.752)
alternative label: Haku, henkilöhakujärjestelmät (627.752)
alternative label: Hakujärjestelmät, henkilöhakujärjestelmät (627.752)
alternative label: Hakulaitteet, henkilöhakujärjestelmät (627.752)
alternative label: Hands free -toiminto (627.752)
alternative label: Handsfree-toiminto (627.752)
alternative label: Henkilöhakujärjestelmät (627.752)
alternative label: Hätäpuhelimet, puhelintekniikka (627.752)
alternative label: Kaapeliviestintä, puhelinliikenne (627.752)
alternative label: Kamerapuhelimet (627.752)
alternative label: Kamerapuhelimet, puhelinliikenne (627.752)
alternative label: Kamerapuhelimet, puhelintekniikka (627.752)
alternative label: Kamerapuhelimet, puhelinteollisuus (627.752)
alternative label: Kannettavat matkapuhelimet (627.752)
alternative label: Kaukopuhelut (627.752)
alternative label: Kolmannen sukupolven matkapuhelinteknologiat (627.752)
alternative label: Kortit, puhelukortit, puhelinliikenne (627.752)
alternative label: Kuuluvuusalueet, puhelinliikenne (627.752)
alternative label: Kuuluvuusalueet, puhelintekniikka (627.752)
alternative label: Kuvapuhelimet (627.752)
alternative label: Kädet vapaana -toiminto (627.752)
alternative label: Kännykät (627.752)
alternative label: Käsipuhelimet (627.752)
alternative label: Langattomat laitteet, matkapuhelimet (627.752)
alternative label: Lähipuhelut (627.752)
alternative label: Matkapuhelimet (627.752)
alternative label: Matkapuhelinjärjestelmät (627.752)
alternative label: Matkapuhelinverkot (627.752)
alternative label: Matkaviestimet (627.752)
alternative label: Matkaviestinverkot (627.752)
alternative label: Mobiililaitteet, matkapuhelimet (627.752)
alternative label: Multimediasanomat (627.752)
alternative label: Multimediaviestit (627.752)
alternative label: Operaattorit, puhelinliikenne (627.752)
alternative label: Operaattorit, puhelintekniikka (627.752)
alternative label: Paikallispuhelut (627.752)
alternative label: Puhelimet (627.752)
alternative label: Puhelimet, puhelintekniikka (627.752)
broader: Tietoliikenne. Viestintätekniikka. Multimedia
in scheme: URN:NBN:fi:au:hklj:
notation: 627.752
related: LOGIIKKA
related: Logistiikka. Looginen kalkyyli
related: URN:NBN:fi:au:hklj:182
related: URN:NBN:fi:au:hklj:332.1
related: URN:NBN:fi:au:hklj:380
related: URN:NBN:fi:au:hklj:384
related: Posti
related: Avaruustutkimus. Avaruuslennot. Avaruusteknologia
related: Sähköoppi. Magnetismi
related: URN:NBN:fi:au:hklj:620.88
related: URN:NBN:fi:au:hklj:627.73
related: Tietokoneiden lisälaitteet
related: Säätö- ja systeemitekniikka. Teollinen automaatio
related: URN:NBN:fi:au:hklj:627.751
related: Sähköposti. Verkkojuttelu
related: URN:NBN:fi:au:hklj:627.7512
related: Elektroniikka
related: URN:NBN:fi:au:hklj:667.7
related: URN:NBN:fi:au:hklj:667.71
related: Toimistotyö
related: URN:NBN:fi:au:hklj:681
related: Toimistokoneet
related: Valokuvauksen materiaalit ja tekniikka. Valokuvausoppaat
related: Elokuvatekniikka. Videokuvauksen tekniikka
related: Elämäkerralliset hakuteokset
scope note: Matkaviestinpalveluja ja puhelinliikennettä koskevat yleisteokset Matkapuhelinliikenne sekä teksti- ja multimediaviestit ja niiden tekniikka Puhelintekniikka. Matkaviestinpalvelujen tekniikka yleensä Puhelinoperaattorit. Puhelinlaitokset. Puhelinkeskukset Puhelinnumerojärjestelmät yleensä. Puhelinverkot. Puhelinvaihteet Linkkiasemat. Kuuluvuusalueet Matkaviestin- ja puhelinlaitteet sekä niiden tekniikka ja teollinen valmistus Matkaviestimet. Puhelimet. Matkapuhelimet. Puhelinvastaajat Hakulaitteet. Sisäpuhelinjärjestelmät Erikoisaloihin liittyvät matkaviestin- ja puhelinpalvelut alan mukaisessa luokassa
scope note: Allmänna verk om mobilkommunikationstjänster och telefontrafik Mobiltelefontrafik samt text- och multimediameddelanden och teknik i dem Telefonteknik. Teknik i mobilkommunikationstjänster i allmänhet Telefonoperatörer. Telefonverk. Telefoncentraler. Telefonnumersystem i allmänhet. Telefonnät. Telefonväxlar Länkstationer. Hörbarhetsområden Telekommunikations- och telefonapparater samt teknik i dem och industriell framställning av dem Mobilteleapparater. Telefoner. Mobiltelefoner. Telefonsvarare Personsökare. Interna telefonsystem Mobilkommunikations- och telefontjänster inom specialområden klassificeras enligt område @sv

Hedelmä-, marja- ja vihanneskasvit
type: Class
type: Concept
subclass of: Hyötykasvit
alternative label: Ahomansikka, viljely (653.22)
alternative label: Ananas, viljely (653.22)
alternative label: Appelsiini, viljely (653.22)
alternative label: Aprikoosi, viljely (653.22)
alternative label: Avokado, viljely (653.22)
alternative label: Banaani, viljely (653.22)
alternative label: Greippi, viljely (653.22)
alternative label: Hedelmäkasvit, puutarhanhoito (653.22)
alternative label: Hedelmänviljely (653.22)
alternative label: Hedelmäpuut, puutarhanhoito (653.22)
alternative label: Hedelmät, puutarhanhoito (653.22)
alternative label: Herne, puutarhanhoito (653.22)
alternative label: Hernekasvit, puutarhanhoito (653.22)
alternative label: Herukat, puutarhanhoito (653.22)
alternative label: Hilla, marjastus (653.22)
alternative label: Hyötykasvit, marjakasvit (653.22)
alternative label: Hyötykasvit, vihanneskasvit (653.22)
alternative label: Idut, viljely (653.22)
alternative label: Kaalit, puutarhanhoito (653.22)
alternative label: Kahvipensas, viljely (653.22)
alternative label: Karambola, viljely (653.22 +)
alternative label: Karpalo, marjastus (653.22)
alternative label: Karviainen, viljely (653.22)
alternative label: Kepit, puutarhanhoito (653.22)
alternative label: Keruu, marjastus (653.22)
alternative label: Keräilytalous, marjastus (653.22)
alternative label: Keräilytuotteet, marjat (653.22)
alternative label: Keräkaali, puutarhanhoito (653.22)
alternative label: Kiinankaali, puutarhanhoito (653.22)
alternative label: Kiivi, viljely (653.22)
alternative label: Kirsikka, viljely (653.22)
alternative label: Kotitarve, marjastus (653.22)
alternative label: Kukkakaali, viljely (653.22)
alternative label: Kurkku, viljely (653.22)
alternative label: Köynnöskasvit, viiniköynnös (653.22)
alternative label: Lakka, marjastus (653.22)
alternative label: Lanttu, viljely, kotipuutarha (653.22)
alternative label: Lehtimangoldi, puutarhanhoito (653.22)
alternative label: Lehtimangoldi, ruoanvalmistus (653.22 +)
alternative label: Luonnon virkistyskäyttö, marjastus (653.22)
alternative label: Luonnonmarjat, marjastus (653.22)
alternative label: Luonnontuoteala, marjastus (653.22)
alternative label: Luonnontuotteet, marjastus (653.22)
alternative label: Luontaiselinkeinot, marjastus (653.22)
alternative label: Luonto-oppaat, marjastus (653.22)
alternative label: Luumu, viljely (653.22)
alternative label: Maatiaislajikkeet, hedelmäkasvit (653.22)
alternative label: Maatiaislajikkeet, marjakasvit (653.22)
alternative label: Maatiaislajikkeet, vihanneskasvit (653.22)
broader: Hyötykasvit
in scheme: URN:NBN:fi:au:hklj:
notation: 653.22
related: Antroposofia
related: URN:NBN:fi:au:hklj:342
related: URN:NBN:fi:au:hklj:576
related: KASVITIEDE
related: Systemaattinen kasvitiede
related: Putkilokasvit
related: Hyönteiset
related: Kivihiili. Turve
related: URN:NBN:fi:au:hklj:649.91
related: Maatalouspolitiikka
related: URN:NBN:fi:au:hklj:650.2
related: URN:NBN:fi:au:hklj:651
related: Maanviljely
related: URN:NBN:fi:au:hklj:657
related: Rakennusten erillistilat
related: URN:NBN:fi:au:hklj:691.1
related: Leipominen
related: URN:NBN:fi:au:hklj:691.12
related: URN:NBN:fi:au:hklj:691.13
related: Kalaruoat
related: Eri maiden ja alueiden ruokalajit ja ruokakulttuuri
related: Säilöntä
related: Luonnon- ja kulttuurimaiseman suunnittelu
scope note: Viljellyt ja luonnonvaraiset hedelmä-, marja- ja vihanneskasvit Hedelmien ja marjojen viljely ja keräily. Marjastus Vihannesten viljely. Vihannesten kasvihuoneviljely Tässä myös juureskasvien viljely koti- tai keittiöpuutarhassa
scope note: Odlade och vilda frukter, bär och grönsaker Odling och samlande av frukter, bär och grönsaker. Bärplockning Odling av grönsaker. Växthusodling av grönsaker Hit också odling av rotfrukter i trädgårdar hemma eller i köksträdgårdar @sv

Ravintotalous. Gastronomia
type: Class
type: Concept
subclass of: KOTITALOUS. LAITOSTALOUS. KAUNEUDENHOITO
alternative label: A-vitamiini, ruoanvalmistus (691 +)
alternative label: Ahomansikka, ruoanvalmistus (691 +)
alternative label: Ananas, ruoanvalmistus (691 +)
alternative label: Appelsiini, ruoanvalmistus (691 +)
alternative label: Aprikoosi, ruoanvalmistus (691 +)
alternative label: Avokado, ruoanvalmistus (691 +)
alternative label: B-vitamiinit, ruoanvalmistus (691 +)
alternative label: Banaani, ruoanvalmistus (691 +)
alternative label: C-vitamiini, ruoanvalmistus (691 +)
alternative label: D-vitamiini, ruoanvalmistus (691 +)
alternative label: E-vitamiini, ruoanvalmistus (691 +)
alternative label: Einekset, ruokakulttuuri (691 +)
alternative label: Elintarvikerasvat, ruoanvalmistus (691 +)
alternative label: Elintarvikkeet, kotitalous (691 +)
alternative label: Eläinrasvat, ruoanvalmistus (691 +)
alternative label: Fruktoosi, ruoanvalmistus (691 +)
alternative label: Gastronomia (691 +)
alternative label: Greippi, ruoanvalmistus (691 +)
alternative label: Halal, ruoka (691 +)
alternative label: Hapanmaitovalmisteet, ruoanvalmistus (691 +)
alternative label: Haudutus, ruoanvalmistus (691 +)
alternative label: Hedelmäsokeri, ruoanvalmistus (691 +)
alternative label: Hedelmät, ruoanvalmistus (691 +)
alternative label: Hera, ruoanvalmistus (691 +)
alternative label: Herne, ruoanvalmistus (691 +)
alternative label: Hernekasvit, ruoanvalmistus (691 +)
alternative label: Herukat, ruoanvalmistus (691 +)
alternative label: Hilla, ruoanvalmistus (691 +)
alternative label: Hirssi, ruoanvalmistus (691 +)
alternative label: Hunaja, ruoanvalmistus (691 +)
alternative label: Hyvä maku, gastronomia (691 +)
alternative label: Hyytelöt, ruoanvalmistus (691 +)
alternative label: Hyytyminen, ruoanvalmistus (691 +)
alternative label: Jogurtti, ruoanvalmistus (691 +)
alternative label: Jugurtti, ruoanvalmistus (691 +)
alternative label: Jukurtti, ruoanvalmistus (691 +)
alternative label: Juoksettuminen, ruoanvalmistus (691 +)
alternative label: Juurekset, ruoanvalmistus (691 +)
alternative label: Juusto, ruoanvalmistus (691 +)
alternative label: K-vitamiini, ruoanvalmistus (691 +)
alternative label: Kaalirapi, ruoanvalmistus (691 +)
alternative label: Kaalit, ruoanvalmistus (691 +)
alternative label: Kaasuliedet, kotitalous (691 +)
alternative label: Karambola, ruoanvalmistus (691 +)
alternative label: Karpalo, ruoanvalmistus (691 +)
alternative label: Karviainen, ruoanvalmistus (691 +)
alternative label: Kasvikset, ruoanvalmistus (691 +)
alternative label: Kasvirasvat, ruoanvalmistus (691 +)
alternative label: Kasviöljyt, ruoanvalmistus (691 +)
alternative label: Kattilat, ruoanvalmistus (691)
broader: KOTITALOUS. LAITOSTALOUS. KAUNEUDENHOITO
in scheme: URN:NBN:fi:au:hklj:
narrower: URN:NBN:fi:au:hklj:691.1
narrower: Säilöntä
narrower: Juomat
notation: 691
related: URN:NBN:fi:au:hklj:332.2
related: URN:NBN:fi:au:hklj:473
related: URN:NBN:fi:au:hklj:473.1
related: URN:NBN:fi:au:hklj:475
related: URN:NBN:fi:au:hklj:475.1
related: URN:NBN:fi:au:hklj:476
related: URN:NBN:fi:au:hklj:476.1
related: URN:NBN:fi:au:hklj:476.11
related: URN:NBN:fi:au:hklj:476.12
related: URN:NBN:fi:au:hklj:476.5
related: URN:NBN:fi:au:hklj:476.6
related: URN:NBN:fi:au:hklj:476.7
related: URN:NBN:fi:au:hklj:476.8
related: URN:NBN:fi:au:hklj:613.1
related: URN:NBN:fi:au:hklj:613.3
related: URN:NBN:fi:au:hklj:649.91
related: Hotelli- ja ravintolatalous
related: Kotitalous. Kodinhoito
related: Suurkeittiöt
scope note: Ravintotaloutta, gastronomiaa, ruokakulttuuria tai ruokailutapoja koskevat yleisteokset Ruokatavarat ja ruoka-aineet yleensä Liha, kala, maitotuotteet, juustot, hedelmät ja kasvikset ruoka-aineina tai ruokatavaroina yleensä Keittiökoneiden käyttö yleensä Jos ravintotaloutta, gastronomiaa, ruokakulttuuria, ruoka-aineita tai keittiökoneita koskevassa teoksessa on myös reseptejä tai ruoanvalmistusohjeita, on etusija luokalla 691.1+
scope note: Allmänna verk som rör mathushållning, gastronomi, matkultur och matvanor Matvaror och födoämnen i allmänhet Kött, fisk, mjölkprodukter, ost, frukt och grönsaker som födoämnen eller matvaror i allmänhet Användning av köksmaskiner i allmänhet Om ett verk som rör mathushållning, gastronomi, matkultur, födoämnen eller köksmaskiner också innehåller matrecept, ges företräde åt klass 691.1+ @sv

Kulta- ja hopeasepäntaide. Korutaide
type: Class
type: Concept
subclass of: URN:NBN:fi:au:hklj:760
alternative label: Alabasteri, korut (762)
alternative label: Antiikkiesineet, korut (762)
alternative label: Arvoesineet, korut (762)
alternative label: Arvoesineet, kulta- ja hopeaesineet (762)
alternative label: Astiat, hopea-astiat (762)
alternative label: Aterimet, hopeaesineet (762)
alternative label: Esineet, korut (762)
alternative label: Filigraanityöt (762)
alternative label: Helmet, korutaide (762)
alternative label: Hionta, jalokivet (762)
alternative label: Hiuskoristeet (762)
alternative label: Hopea, taideteollisuus (762)
alternative label: Hopeaesineet (762)
alternative label: Hopeasepät, elämäkerrat ja muistelmat (762)
alternative label: Hopeasepät, hopeasepän työ (762)
alternative label: Hopeatyöt (762)
alternative label: Hopeointi, taideteollisuus (762)
alternative label: Intarsia, korutaide (762)
alternative label: Jade, taidekäsityö, korut (762)
alternative label: Jalokivet, kultasepäntaide, korut (762)
alternative label: Jalokivityöt (762)
alternative label: Jalometallit, kultasepäntaide, korut (762)
alternative label: Kaiverrukset, koru-ja kultasepäntaide (762)
alternative label: Kakkulapiot, ruokailuvälineet, hopeaesineet (762)
alternative label: Kameet (762)
alternative label: Kaulakorut (762)
alternative label: Kello- ja kultasepänliikkeet, kultasepänliikkeet (762)
alternative label: Kivi, korut, hionta (762)
alternative label: Kivituotteet, jalokivet, korut (762)
alternative label: Kivityöt, korut, jalokivet (762)
alternative label: Koralliesineet, korut (762)
alternative label: Korukivet, korut, korujen valmistus (762)
alternative label: Korut (762)
alternative label: Korutaide (762)
alternative label: Korutaiteilijat, elämäkerrat ja muistelmat (762)
alternative label: Korvakorut (762)
alternative label: Kruunut, korutaide (762)
alternative label: Kulta, korutaide (762)
alternative label: Kulta- ja kelloliikkeet, kultasepäanliikkeet (762)
alternative label: Kultaesineet (762)
alternative label: Kultasepänliikkeet (762)
alternative label: Kultasepäntyöt (762)
alternative label: Kultasepät (762)
alternative label: Kultaus, korutaide (762)
alternative label: Kvartsi, korut (762)
alternative label: Käsityöt, korujen valmistus (762)
alternative label: Käsityöt, kulta- ja hopeasepäntyöt (762)
alternative label: Maljakot, hopea-astiat (762)
broader: URN:NBN:fi:au:hklj:760
in scheme: URN:NBN:fi:au:hklj:
notation: 762
related: Esineellinen kulttuuri
related: URN:NBN:fi:au:hklj:473
related: URN:NBN:fi:au:hklj:473.1
related: URN:NBN:fi:au:hklj:475
related: URN:NBN:fi:au:hklj:475.1
related: URN:NBN:fi:au:hklj:476
related: URN:NBN:fi:au:hklj:476.1
related: URN:NBN:fi:au:hklj:476.11
related: URN:NBN:fi:au:hklj:476.12
related: URN:NBN:fi:au:hklj:476.5
related: URN:NBN:fi:au:hklj:476.6
related: URN:NBN:fi:au:hklj:476.7
related: URN:NBN:fi:au:hklj:476.8
related: Mineralogia. Kristallografia. Petrologia
related: Kelloteollisuus
related: Metallityö
related: Taideteollisuuden teoria, estetiikka ja filosofia
related: Antiikkiesineiden keräily
related: Taideteollisuuden historia
related: Taidetaonta
related: Taidepuutyöt
related: Muut taideteollisuuden alat
related: Paperitaide
related: URN:NBN:fi:au:hklj:767
scope note: Kulta- ja hopeasepäntaide sekä korutaide, niiden historia, henkilöhistoria ja tuotteet sekä materiaalit, tekniikka ja estetiikka. Kulta- ja hopeasepän työ Korut ja korunteko-ohjeet koruun käytetystä materiaalista riippumatta Tässä esim. metalli-, jalokivi-, helmi-, puu-, lasi-, keramiikka-, muovi- ja paperikorut. Kulta- ja hopeaesineet. Jalokiviesineet. Jade-esineet Jos teos koskee sekä kulta- että kellosepäntaidetta tai -työtä, on etusija luokalla 681.1
scope note: Guldsmideskonst och silversmideskonst samt smyckekonst, deras historia, personhistoria och produktion samt material, tekniker och estetik. Guld- och silversmedens arbete Smycken och arbetsbeskrivningar för tillverkning av smycken oavsett material Hit smycken gjorda av t.ex. metall, ädelsten, pärlor, bärnsten, trä, glas, keramik, plast och papper. Guld- och silverföremål. Föremål av ädelsten. Föremål av jade. Föremål av bärnsten Om verket handlar om såväl guldsmideskonst som urmakeri eller urmakarens och guldsmedens arbete, ges företräde åt klass 681.1 @sv

Huonekalutaide
type: Class
type: Concept
subclass of: Taidepuutyöt
alternative label: Antiikkiesineet, huonekalut (763.1)
alternative label: Arkut, hauta-arkut (763.1)
alternative label: Arkut, huonekalutaide (763.1)
alternative label: Art deco, huonekalutaide (763.1)
alternative label: Art noveau, huonekalutaide (763.1)
alternative label: Arvoesineet, huonekalut (763.1)
alternative label: Barokki, huonekalutaide (763.1)
alternative label: Biedermeier, huonekalut (763.1)
alternative label: Chippendale, huonekalut (763.1)
alternative label: Empire, huonekalutaide (763.1)
alternative label: Funktionalismi, huonekalut (763.1)
alternative label: Huonekalut, huonekalutaide (763.1)
alternative label: Huonekalut, huonekalutyylit (763.1)
alternative label: Huonekalutaide (763.1)
alternative label: Huonekalutyylit (763.1)
alternative label: Hyllyt, huonekalutaide (763.1)
alternative label: Istuimet, huonekalutaide (763.1)
alternative label: Jugend, huonekalutaide (763.1)
alternative label: Kaapit, huonekalutaide (763.1)
alternative label: Kalusteet, huonekalutaide (763.1)
alternative label: Kansanomaiset huonekalut, huonekalutaide (763.1)
alternative label: Kehdot, huonekalutaide (763.1)
alternative label: Keittiökalusteet, huonekalutaide (763.1)
alternative label: Konttorikalusteet, huonekaludesign (763.1)
alternative label: Koristemaalaus, huonekalutaide (763.1)
alternative label: Kustavilainen tyyli, huonekalutaide (763.1)
alternative label: L'art nouveau, huonekalutaide (763.1)
alternative label: Lyhdyt, taideteollisuus (763.1)
alternative label: Lyijylasi, valaisimet (763.1)
alternative label: Myymäläkalusteet, huonekalut (763.1)
alternative label: Ootraus, koristemaalaus, huonekalutaide (763.1)
alternative label: Peilit, huonekalut (763.1)
alternative label: Puunmukailu, koristemaalaus, huonekalutaide (763.1)
alternative label: Puutarhakalusteet, huonekalutaide (763.1)
alternative label: Pöydät, huonekalutaide ja -design (763.1)
alternative label: Rokokoo, huonekalutaide (763.1)
alternative label: Sängyt, huonekalutaide (763.1)
alternative label: Tuolit, huonekalutaide ja -design (763.1)
alternative label: Tyylihuonekalut (763.1)
alternative label: Uusrokokoo, huonekalutaide (763.1)
alternative label: Valaisimet, taideteollisuus (763.1)
alternative label: Verhoilijat, huonekalutaide (763.1)
alternative label: Verhoilu, huonekalutaide (763.1)
alternative label: Öljylamput (763.1)
alternative label: Allmogemöbler, möbelkonst (763.1) @sv
alternative label: Antikviteter, möbler (763.1) @sv
alternative label: Art deco, möbelkonst (763.1) @sv
broader: Taidepuutyöt
in scheme: URN:NBN:fi:au:hklj:
notation: 763.1
related: Esineellinen kulttuuri
related: URN:NBN:fi:au:hklj:473
related: URN:NBN:fi:au:hklj:473.1
related: URN:NBN:fi:au:hklj:475
related: URN:NBN:fi:au:hklj:475.1
related: URN:NBN:fi:au:hklj:476
related: URN:NBN:fi:au:hklj:476.1
related: URN:NBN:fi:au:hklj:476.11
related: URN:NBN:fi:au:hklj:476.12
related: URN:NBN:fi:au:hklj:476.5
related: URN:NBN:fi:au:hklj:476.6
related: URN:NBN:fi:au:hklj:476.7
related: URN:NBN:fi:au:hklj:476.8
related: Puuteollisuus
related: URN:NBN:fi:au:hklj:634.03
related: Puutyö. Huonekalut. Verhoilu
related: Sisustusoppaat
related: Sisustusarkkitehtuuri
related: KUVANVEISTOTAIDE
related: URN:NBN:fi:au:hklj:730.9
related: Kuvanveistotaiteen materiaalit ja tekniikka
related: Taideteollisuuden teoria, estetiikka ja filosofia
related: Antiikkiesineiden keräily
related: Taideteollisuuden historia
related: URN:NBN:fi:au:hklj:767
scope note: Huonekalutaide. Huonekalujen muotoilu Huonekalutaiteen historia, henkilöhistoria ja tuotteet sekä materiaalit, tekniikka ja estetiikka Puuleikkaus huonekalutaiteessa Huonekalujen koristelutyylit Huonekalut taideteollisuuden ja taidekäsityön kannalta
scope note: Möbelkonst. Möbelformgivning Möbelkonstens historia, personhistoria och produktion samt material, tekniker och estetik Träsnideri i möbelkonsten Stilar inom ornamentiken som hänför sig till möbler Möbler ur konstindustrins och konsthantverkets synvinkel @sv

Etelä-Eurooppa
type: Class
type: Concept
subclass of: URN:NBN:fi:au:hklj:777.9
alternative label: Jugoslavian alue, elokuvataide (777.94)
alternative label: Portugali, elokuvataide (777.94)
alternative label: Serbia, elokuvataide (777.94)
alternative label: Jugoslaviens område, filmkonst (777.94) @sv
alternative label: Portugal, filmkonst (777.94) @sv
alternative label: Serbien, filmkonst (777.94) @sv
broader: URN:NBN:fi:au:hklj:777.9
in scheme: URN:NBN:fi:au:hklj:
narrower: Italia
narrower: Espanja
notation: 777.94
preferred label: Southern Europe @en
preferred label: Sydeuropa @sv
related: URN:NBN:fi:au:hklj:1.4
related: URN:NBN:fi:au:hklj:1.84
related: URN:NBN:fi:au:hklj:1.944
related: URN:NBN:fi:au:hklj:2.84
related: URN:NBN:fi:au:hklj:2.94
related: URN:NBN:fi:au:hklj:3.4
related: URN:NBN:fi:au:hklj:384.42
related: URN:NBN:fi:au:hklj:4.4
related: URN:NBN:fi:au:hklj:5.4
related: URN:NBN:fi:au:hklj:6.4
related: URN:NBN:fi:au:hklj:7.4
related: URN:NBN:fi:au:hklj:709
related: URN:NBN:fi:au:hklj:710
related: URN:NBN:fi:au:hklj:756
related: Teatteri- ja näyttämötaiteen teoria, estetiikka ja filosofia
related: URN:NBN:fi:au:hklj:770.9
related: Elokuvatekniikka. Videokuvauksen tekniikka
related: URN:NBN:fi:au:hklj:783.67
related: URN:NBN:fi:au:hklj:783.68
scope note: Portugali. Malta. Balkanin niemimaa Albania. Bosnia ja Hertsegovina. Bulgaria. Kosovo. Kreikka. Kroatia. Makedonia. Montenegro. Serbia. Slovenia
scope note: Portugal. Malta. Balkanhalvön Albanien. Bosnien-Hercegovina. Bulgarien. Grekland. Kosovo. Kroatien. Makedonien. Montenegro. Serbien. Slovenien @sv

Länsi- ja Lounais-Eurooppa
type: Class
type: Concept
subclass of: Eurooppa
broader: Eurooppa
in scheme: URN:NBN:fi:au:hklj:
narrower: Ranska
narrower: Italia
narrower: Espanja
narrower: Portugali
narrower: Malta
notation: 784.14
preferred label: Western and South-Western Europe @en
preferred label: Västeuropa och sydvästra Europa @sv
related: URN:NBN:fi:au:hklj:473.1
related: URN:NBN:fi:au:hklj:769
related: URN:NBN:fi:au:hklj:783
related: URN:NBN:fi:au:hklj:783.1
related: URN:NBN:fi:au:hklj:787
related: URN:NBN:fi:au:hklj:787.2
related: URN:NBN:fi:au:hklj:787.29
related: URN:NBN:fi:au:hklj:788.8
related: URN:NBN:fi:au:hklj:789
related: URN:NBN:fi:au:hklj:795.1
related: URN:NBN:fi:au:hklj:797.2
related: URN:NBN:fi:au:hklj:807
scope note: Yleisteokset ja sekasisältöiset kokoelmat
scope note: Allmänna verk och samlingar med blandat innehåll @sv

Itsenäisten valtioiden yhteisö
type: Class
type: Concept
subclass of: Eurooppa
broader: Eurooppa
in scheme: URN:NBN:fi:au:hklj:
narrower: Venäjä
narrower: Ukraina
narrower: Valko-Venäjä
narrower: Moldova
notation: 784.17
preferred label: Commonwealth of Indepentent States @en
preferred label: Oberoende staternas samvälde @sv
related: URN:NBN:fi:au:hklj:473.1
related: URN:NBN:fi:au:hklj:769
related: URN:NBN:fi:au:hklj:783
related: URN:NBN:fi:au:hklj:783.1
related: Itä-Eurooppa
related: Itsenäisten valtioiden yhteisön Aasian puoleiset alueet
related: Kaukasuksen maat
related: URN:NBN:fi:au:hklj:787
related: URN:NBN:fi:au:hklj:787.2
related: URN:NBN:fi:au:hklj:787.29
related: URN:NBN:fi:au:hklj:788.8
related: URN:NBN:fi:au:hklj:789
related: URN:NBN:fi:au:hklj:795.1
related: URN:NBN:fi:au:hklj:797.2
related: URN:NBN:fi:au:hklj:807
scope note: Yleisteokset ja sekasisältöiset kokoelmat, jotka koskevat sekä IVY:n Euroopan että Aasian puoleisia alueita IVY:n Euroopan puoleiset alueet yleensä Tässä ja alaluokissa myös IVY:n Euroopan puoleisella alueella asuvien suomensukuisten kansojen kansanmusiikki
scope note: Allmänna verk och samlingar med blandat innehåll som rör både de asiatiska och europeiska områdena av OSS De europeiska områdena av OSS i allmänhet Hit och till underklasserna också de i de europeiska områdena av OSS bosatta finsk-ugriska folkens folkmusik @sv

Moderni jazz
type: Class
type: Concept
subclass of: Jazz
alternative label: Afrokuubalainen jazz (788.21)
alternative label: Avantgarde jazz (788.21)
alternative label: Bebop (788.21)
alternative label: Cool jazz (788.21)
alternative label: Etninen jazz (788.21)
alternative label: Free jazz (788.21)
alternative label: Fuusiojazz (788.21)
alternative label: Fuusiomusiikki (788.21)
alternative label: Hard bop (788.21)
alternative label: Kamarijazz (788.21)
alternative label: Mainstream (788.21)
alternative label: Popjazz (788.21)
alternative label: Rockjazz (788.21)
alternative label: Third stream -jazz (788.21)
alternative label: West coast jazz (788.21)
alternative label: Afrokubansk jazz (788.21) @sv
alternative label: Etnisk jazz (788.21) @sv
alternative label: Fusionsjazz (788.21) @sv
alternative label: Fusionsmusik (788.21) @sv
alternative label: Kammarjazz (788.21) @sv
alternative label: Third stream jazz (788.21) @sv
broader: Jazz
in scheme: URN:NBN:fi:au:hklj:
narrower: Bebop. Mainstream. Latin jazz
narrower: Third stream jazz
narrower: Free jazz. Avantgarde jazz
narrower: Fuusiomusiikki. Rockjazz. Popjazz. Jazzrock
narrower: Etninen jazz
notation: 788.21
preferred label: Modern jazz @en
related: URN:NBN:fi:au:hklj:782.4
related: URN:NBN:fi:au:hklj:783
related: URN:NBN:fi:au:hklj:783.1
related: URN:NBN:fi:au:hklj:785.7
related: URN:NBN:fi:au:hklj:786.8
related: URN:NBN:fi:au:hklj:787.112
related: URN:NBN:fi:au:hklj:789
related: URN:NBN:fi:au:hklj:795
scope note: Tässä ja alaluokissa esim. bebop, third stream jazz, free jazz, fuusiomusiikki ja etninen jazz
scope note: Här och i underklasserna t.ex. bebop, third stream jazz, free jazz, fusionsmusik och etnisk jazz @sv

Rock. Pop
type: Class
type: Concept
subclass of: Folk. Country. Rock. Pop
alternative label: AOR (788.33)
alternative label: Acid rock (788.33)
alternative label: Alternative rock (788.33)
alternative label: Art rock (788.33)
alternative label: Beatmusiikki (788.33)
alternative label: Bubble gum -musiikki (788.33)
alternative label: Diskomusiikki (788.33)
alternative label: Festivaalit, rockfestivaalit (788.33 +)
alternative label: Garage rock (788.33)
alternative label: Glam rock (788.33)
alternative label: Grunge (788.33)
alternative label: Hard core (788.33)
alternative label: Highlife, maailmanmusiikki (788.33)
alternative label: Huvit, rock-konsertit (788.33 +)
alternative label: Indie rock (788.33)
alternative label: Jazz-rock (788.33)
alternative label: Latin rock (788.33)
alternative label: New Wave -musiikki (788.33)
alternative label: Popmusiikki (788.33)
alternative label: Popyhtyeet (788.33 +)
alternative label: Post-rock (788.33)
alternative label: Punk rock (788.33)
alternative label: Punk, musiikki (788.33)
alternative label: Rautalankamusiikki (788.33)
alternative label: Rock (788.33 +)
alternative label: Rock-klubit (788.33 +)
alternative label: Rockfestivaalit (788.33 +)
alternative label: Rockklubit (788.33 +)
alternative label: Rocklyriikka, rockmusiikki (788.33 +)
alternative label: Rockmusiikki (788.33 +)
alternative label: Rockvideot (788.33 +)
alternative label: Rockyhtyeet (788.33 +)
alternative label: Suomi-rock (788.33 +)
alternative label: Surfmusiikki (788.33)
alternative label: Taiderock (788.33)
alternative label: Teinipop (788.33)
alternative label: Teknorock (788.33)
alternative label: Underground rock (788.33)
alternative label: Uusi aalto, rockmusiikki (788.33)
alternative label: Vaihtoehtorock (788.33)
alternative label: Beatmusik (788.33) @sv
alternative label: Bubble gum-musik (788.33) @sv
alternative label: Diskomusik (788.33) @sv
alternative label: Festivaler, rockfestivaler (788.33 +) @sv
alternative label: Glamrock (788.33) @sv
alternative label: Highlife, världsmusik (788.33) @sv
alternative label: Konstrock (788.33) @sv
alternative label: New Wave-musik (788.33) @sv
alternative label: Nya vågen, rockmusik (788.33) @sv
alternative label: Nöjen, rock-konserter (788.33 +) @sv
alternative label: Popgrupper (788.33 +) @sv
alternative label: Popmusik (788.33) @sv
alternative label: Postrock (788.33) @sv
alternative label: Punk, musik (788.33) @sv
alternative label: Rock-klubbar (788.33 +) @sv
alternative label: Rockfestivaler (788.33 +) @sv
broader: Folk. Country. Rock. Pop
in scheme: URN:NBN:fi:au:hklj:
narrower: Rock and roll. Rockabilly
narrower: Heavy rock. Hard rock
narrower: Elektroninen popmusiikki. Electronica
narrower: Progressiivinen rock. Psykedeelinen rock
narrower: Punk rock. Uusi aalto. Post-punk
notation: 788.33
related: URN:NBN:fi:au:hklj:782.4
related: URN:NBN:fi:au:hklj:783
related: URN:NBN:fi:au:hklj:783.1
related: URN:NBN:fi:au:hklj:785.7
related: URN:NBN:fi:au:hklj:786.8
related: URN:NBN:fi:au:hklj:787.112
related: Folk. Country
related: Aasialainen maailmanmusiikki. Aasialainen etninen pop ja viihdemusiikki
related: New Age -musiikki. Rentoutusmusiikki
related: URN:NBN:fi:au:hklj:789
related: URN:NBN:fi:au:hklj:795
scope note: Yleisteokset ja sekasisältöiset kokoelmat Tässä ja alaluokissa rock ja pop sekä niitä koskeva kirjallisuus Tässä ja alaluokissa myös rockin ja popin suuntaukset sekä niiden historia ja henkilöhistoria Tässä myös esim. teinipop ja bubble gum, "perinteinen" diskomusiikki ja dancepop
scope note: Allmänna verk och samlingar med blandat innehåll Här och i underklasserna rock och pop samt litteratur om dem Här och i underklasserna också olika riktningar inom rock och pop samt deras historia och personhistoria Här också ungdomspop och bubble gum, "traditionell" diskomusik och dancepop @sv

Eurooppalainen maailmanmusiikki. Europpalainen etninen pop ja viihdemusikki
type: Class
type: Concept
subclass of: URN:NBN:fi:au:hklj:788.8
alternative label: Etnopop, eurooppalainen maailmanmusiikki (788.81)
alternative label: Maailmanmusiikki, eurooppalainen maailmanmusiikki (788.81)
alternative label: Etnopop, europeisk världsmusik (788.81) @sv
alternative label: Världsmusik, europeisk världsmusik (788.81) @sv
broader: URN:NBN:fi:au:hklj:788.8
in scheme: URN:NBN:fi:au:hklj:
notation: 788.81
preferred label: European world music. European ethnic pop and light music. @en
preferred label: Europeisk världsmusik. Europeisk etnisk pop och underhållningsmusik @sv
related: URN:NBN:fi:au:hklj:782.4
related: URN:NBN:fi:au:hklj:783
related: URN:NBN:fi:au:hklj:783.1
related: URN:NBN:fi:au:hklj:785.7
related: URN:NBN:fi:au:hklj:786.8
related: URN:NBN:fi:au:hklj:787.112
related: Folk. Hootenanny
related: Viihdemusiikki
related: Suomenkielinen viihdemusiikki
related: Ruotsin-, tanskan- ja norjankielinen viihdemusiikki
related: Saksankielinen viihdemusiikki
related: Englanninkielinen viihdemusiikki
related: Ranskankielinen viihdemusiikki
related: Italiankielinen viihdemusiikki
related: Venäjän-, valkovenäjän- ja ukrainankielinen viihdemusiikki
related: Espanjankielinen viihdemusiikki
related: Muunkielinen viihdemusiikki
related: Kreikankielinen viihdemusiikki
related: Portugalinkielinen viihdemusiikki
related: Vironkielinen viihdemusiikki
related: URN:NBN:fi:au:hklj:789
related: URN:NBN:fi:au:hklj:795
scope note: Tässä esim. pohjoismainen ja saamelainen nykykansanmusiikki sekä muut eurooppalaiset ei-angloamerikkalaiset etniset tyylit, jotka eivät ole viihdemusiikkia tai puhdasta kansanmusiikkia
scope note: Här till exempel nordisk och samisk modern folkmusik samt andra europeiska, icke-angloamerikanska etniska stilar, som inte anses vara underhållningsmusik eller ren folkmusik @sv

URALILAISET KIELET. ALTAILAISET KIELET
type: Class
type: Concept
subclass of: URN:NBN:fi:au:hklj:800
alternative label: Enetsin kieli, samojedikielet (880)
alternative label: Filologia (850 ... 899 +)
alternative label: Samojedikielet (880)
alternative label: Sukukielet, suomen sukukielet (880 ... 887 +)
alternative label: Uralaltailaiset kielet (880)
alternative label: Uralilaiset kielet (880)
alternative label: Besläktade språk, med finska besläktade språk (880 ... 887 +) @sv
alternative label: Entsiska, samojedspråk (880) @sv
alternative label: Filologi (850 ... 899 +) @sv
alternative label: Samojedspråk (880) @sv
alternative label: Ural-altaiska språk (880) @sv
alternative label: Uraliska språk (880) @sv
broader: URN:NBN:fi:au:hklj:800
in scheme: URN:NBN:fi:au:hklj:
narrower: Suomalais-ugrilaiset kielet
narrower: Volgansuomalaiset kielet. Permiläiset kielet
narrower: Itämerensuomalaiset kielet
narrower: Suomen kieli
narrower: Viron kieli
narrower: Saamen kieli
narrower: Ugrilaiset kielet
narrower: Mongolikielet. Tunguusikielet. Korean kieli
narrower: Turkkilaiset kielet. Turkin kieli
notation: 880
preferred label: URAL-ALTAIC LANGUAGES @en
preferred label: URALISKA SPRÅK. ALTAISKA SPRÅK @sv
related: KIELITIEDE
related: Kielifilosofia
related: Kielipsykologia. Kielisosiologia. Kielipolitiikka
related: Monikieliset sanakirjat. Sivistyssanakirjat
related: Kielioppi. Muoto-oppi. Sanaoppi. Semantiikka
related: Äänneoppi
related: Etymologia. Onomastiikka
scope note: Yleisteokset ural-altailaisista kielistä Yleisteokset uralilaisista kielistä. Yleisteokset altailaisista kielistä Samojedikielet
scope note: Allmänna verk om ural-altaiska språk Allmänna verk om uraliska språk. Allmänna verk om altaiska språk Samojedspråk @sv

Yleisönpalvelu
type: Class
type: Concept
subclass of: KIRJASTOT. KIRJASTOTOIMI
broader: KIRJASTOT. KIRJASTOTOIMI
in scheme: URN:NBN:fi:au:hklj:
narrower: Lainaus
narrower: Tietopalvelu. Informaatiopalvelu
narrower: Lastenkirjastot
narrower: Erityisten väestöryhmien kirjastopalvelut
narrower: Erikoiskokoelmat
narrower: Kirjastoautot. Kirjastoveneet
narrower: Muu kirjastotoiminta
notation: 024
preferred label: Customer service @en
preferred label: Kundtjänst @sv
related: URN:NBN:fi:au:hklj:018
related: Muu kuin kirja-aineisto kirjastossa
related: Kirjaston käyttö. Kirjastososiologia
related: Kirjastonkäytön opastus
related: Yleiset kirjastot
related: Erikoiskirjastot. Yhdistysten, laitosten ja yritysten kirjastot
related: URN:NBN:fi:au:hklj:028
related: Dokumentaatio ja informaatiopalvelu yleensä
related: Museonhoito
related: Arkistonhoito
related: URN:NBN:fi:au:hklj:061
related: URN:NBN:fi:au:hklj:063
scope note: Tässä ja alaluokissa yleisten, tieteellisten, yksityisten ja erikoiskirjastojen yleisönpalvelu Tässä ja alaluokissa myös muuta kuin kirja-aineistoa ja kirjaston erikoiskokoelmia koskeva yleisönpalvelu
scope note: Hit och till underklasserna kundtjänst i allmänna, vetenskapliga och privata bibliotek samt specialbibliotek Hit och till underklasserna kundtjänst som rör också andra biblioteksmedier än böcker och specialsamlingar i bibliotek @sv

Elämä. Kuolema
type: Class
type: Concept
subclass of: YLEINEN USKONTOTIEDE. YLEINEN USKONNONFILOSOFIA
alternative label: Elämä, uskonnonfilosofia (205)
alternative label: Elämän synty, uskonnonfilosofia (205)
alternative label: Elämän tarkoitus, uskonnonfilosofia (205)
alternative label: Elämäntarkoitus, uskonnonfilosofia (205)
alternative label: Helvetti, uskonnonfilosofia (205)
alternative label: Helvetti, uskontotiede (205)
alternative label: Ikuinen elämä, uskonnonfilosofia (205)
alternative label: Ikuinen elämä, uskontotiede (205)
alternative label: Inkarnaatio (205)
alternative label: Inkarnaatio, uskonnonfilosofia (205)
alternative label: Jälleensyntyminen, uskontotiede (205)
alternative label: Karma (205)
alternative label: Karma, jälleensyntyminen (205)
alternative label: Kuolema, uskonnonfilosofia (205)
alternative label: Kuolema, uskontotiede (205)
alternative label: Kuolemanjälkeinen elämä, uskonnonfilosofia (205)
alternative label: Kuolemanjälkeinen elämä, uskontotiede (205)
alternative label: Kuolemanpelko, uskonnonfilosofia (205)
alternative label: Kuolemattomuus, uskontotiede (205)
alternative label: Kuolleet, uskonnonfilosofia (205)
alternative label: Kuolleet, uskontotiede (205)
alternative label: Reinkarnaatio, uskontotiede (205)
alternative label: Sielu, uskontotiede (205)
alternative label: Sielun kuolemattomuus, uskontotiede (205)
alternative label: Sielunvaellus, uskontotiede (205)
alternative label: Uudelleensyntyminen, uskontotiede (205)
alternative label: Vainajainpalvonta, uskontotiede, kuolema (205)
alternative label: Avlidna, religionsfilosofi (205) @sv
alternative label: Avlidna, religionsvetenskap (205) @sv
alternative label: Döden, religionsfilosofi (205) @sv
alternative label: Döden, religionsvetenskap (205) @sv
alternative label: Dödsfruktan, religionsfilosofi (205) @sv
alternative label: Dödskult, religionsvetenskap, död (205) @sv
alternative label: Evigt liv, religionsfilosofi (205) @sv
alternative label: Evigt liv, religionsvetenskap (205) @sv
alternative label: Helvetet, religionsfilosofi (205) @sv
alternative label: Helvetet, religionsvetenskap (205) @sv
alternative label: Inkarnation (205) @sv
alternative label: Inkarnation, religionsfilosofi (205) @sv
alternative label: Karma, reinkarnation (205) @sv
alternative label: Livet efter döden, religionsfilosofi (205) @sv
alternative label: Livet efter döden, religionsvetenskap (205) @sv
alternative label: Livet, religionsfilosofi (205) @sv
alternative label: Livets mening, religionsfilosofi (205) @sv
alternative label: Livets uppkomst, religionsfilosofi (205) @sv
alternative label: Livsfrågor, religionsfilosofi (205) @sv
broader: YLEINEN USKONTOTIEDE. YLEINEN USKONNONFILOSOFIA
in scheme: URN:NBN:fi:au:hklj:
notation: 205
related: URN:NBN:fi:au:hklj:110
related: URN:NBN:fi:au:hklj:192
related: Kuolemakokemukset
related: Uskonnonfilosofia
related: URN:NBN:fi:au:hklj:209
related: Kristinuskon filosofia
related: Jumalan olemus
related: Kuolema ja kuolemanjälkeinen elämä
related: URN:NBN:fi:au:hklj:280
related: Itä-Aasian uskonnot ja mytologiat
related: Intian uskonnot ja mytologiat
related: Buddhalaisuus ja sen mytologia
related: Muinais-Egyptin ja Etu-Aasian uskonnot ja mytologiat
related: Antiikin Kreikan ja Rooman uskonnot ja mytologiat
related: Persian uskonnot ja mytologiat
related: Islam ja sen mytologia
related: Juutalaisten uskonto ja sen mytologia
related: Muut uskonnot ja mytologiat
related: Afrikan alkuperäiskansojen uskonnot
related: Amerikan alkuperäiskansojen uskonnot ja mytologiat
related: Australian ja Oseanian alkuperäiskansojen uskonnot ja mytologiat
related: Muinaissuomalaiset ja suomalais-ugrilaiset uskonnot ja mytologiat
related: Muinaisgermaaniset, -balttilaiset, -slaavilaiset ja -kelttiläiset uskonnot ja mytologiat
related: Muinaispohjoismaiset uskonnot ja mytologiat
related: URN:NBN:fi:au:hklj:618.24
related: Itsemurhat ja niiden ehkäisy
scope note: Elämä, kuolema, jälleensyntyminen ja kuolemanjälkeinen elämä yleisuskonnollisina kysymyksinä Elämä ja kuolema tietyn uskonnon kannalta ko. uskonnon luokassa
scope note: Livet, döden, reinkarnationen och livet efter detta som allmänreligiös fråga Livet och döden inom området för en bestämd religion klassificeras enligt område @sv

Perhepolitiikka. Lapsipolitiikka. Nuorisopolitiikka
type: Class
type: Concept
subclass of: URN:NBN:fi:au:hklj:371
alternative label: Adoptio, perhepolitiikka (371.5)
alternative label: Adoptiolapset, perhepolitiikka (371.5)
alternative label: Adoptiovanhemmat, perhepolitiikka (371.5)
alternative label: Alaikäiset, asema yhteiskunnassa (371.5 +)
alternative label: Alaikäiset, lasten ja nuorten suojelu (371.5)
alternative label: Au-lapset (371.5 +)
alternative label: Au-lapset, perhepolitiikka (371.5 +)
alternative label: Au-äidit, perhepolitiikka (371.5 +)
alternative label: Au-äidit, vanhempien asema yhteiskunnassa (371.5 +)
alternative label: Avioero, lastensuojelu (371.5)
alternative label: Avioerolapset, lastensuojelu (371.5)
alternative label: Avioerolapset, perhepolitiikka (371.5 +)
alternative label: Avioliitto, lastensuojelu (371.5)
alternative label: Avioliitto, neuvonta (371.5)
alternative label: Avioliitto, perhepolitiikka (371.5)
alternative label: Avioliittoneuvonta (371.5)
alternative label: Aviottomat lapset (371.5 +)
alternative label: Aviottomat lapset, perhepolitiikka (371.5 +)
alternative label: Aviottomat äidit, perhepolitiikka (371.5 +)
alternative label: Aviottomat äidit, vanhempien asema yhteiskunnassa (371.5 +)
alternative label: Avoero, lastensuojelu (371.5)
alternative label: Avoin adoptio, perhepolitiikka (371.5)
alternative label: Avoliitto, lastensuojelu (371.5)
alternative label: Avoliitto, neuvonta (371.5)
alternative label: Avoliitto, perhepolitiikka (371.5)
alternative label: Avotyö, lastensuojelu (371.5)
alternative label: Avotyö, perhetuki (371.5)
alternative label: Biologiset lapset, perhepolitiikka (371.5 +)
alternative label: Biologiset vanhemmat, perhepolitiikka (371.5 +)
alternative label: Elatus, perhepolitiikka (371.5)
alternative label: Elatusapu, perhepolitiikka (371.5)
alternative label: Elatustuki, perhetuet (371.5)
alternative label: Elatusturva, perhepolitiikka (371.5)
alternative label: Elinympäristö, yhteiskunta, lasten ja nuorten suojelu (371.5)
alternative label: Ensikodit (371.5)
alternative label: Erityinen huolenpito (371.5)
alternative label: Fyysinen väkivalta, lastensuojelu (371.5)
alternative label: Grooming (371.5)
alternative label: Heitteillejättö, lastensuojelu (371.5)
alternative label: Hoitovapaa (371.5)
alternative label: Holhous, lastensuojelu (371.5)
alternative label: Huoltajuus (371.5 +)
alternative label: Huoltolaitokset, lastensuojelulaitokset (371.5)
alternative label: Huoltolaitokset, nuorisoasemat (371.5)
alternative label: Huostaanotto, lastensuojelu (371.5)
alternative label: Hyväksikäyttö, lastensuojelu (371.5)
alternative label: Hyväksikäyttö, perheväkivalta, insesti (371.5)
alternative label: Ihmiskauppa, lastensuojelu (371.5)
alternative label: Insesti, lastensuojelu (371.5)
alternative label: Isyys, perhepolitiikka (371.5)
broader: URN:NBN:fi:au:hklj:371
in scheme: URN:NBN:fi:au:hklj:
narrower: Lastenneuvolat. Äitiysneuvolat
narrower: Päivähoito
notation: 371.5
related: Ihmissuhteiden psykologia
related: Kasvatusneuvonta. Kasvatusneuvolat
related: Perhe- ja kotikasvatus
related: URN:NBN:fi:au:hklj:181.9
related: Nuorisotyö
related: Kristillinen etiikka
related: Sielunhoito
related: Väestötiede. Väestöpolitiikka
related: Perhe- ja holhousoikeus
related: Työoikeus
related: URN:NBN:fi:au:hklj:345
related: URN:NBN:fi:au:hklj:357.1
related: Perhesosiologia
related: Kriminologia. Kriminaalisosiologia
related: Työolot
related: URN:NBN:fi:au:hklj:373
related: Naisen ja miehen asema yhteiskunnassa
related: Työmarkkinajärjestöt
related: Seksologia
related: URN:NBN:fi:au:hklj:618.85
scope note: Perhe-, lapsi- ja nuorisopolitiikan yleisteokset Lapsiperheiden asema yhteiskunnassa Lasten, nuorten ja vanhempien asema yhteiskunnassa Perheitä koskevat sosiaalipoliittiset tukitoimet. Perhekustannusten tasaus Lapsilisät. Elatustuki. Äitiyshuolto. Äitiysavustus Äitiysvapaa. Isyysvapaa. Vanhempainvapaa. Perhevapaat Perhe- ja avioliittoneuvonta. Perhe- ja avioliittoneuvolat Perhesuunnittelu. Adoptio Lasten ja nuorten huolto ja suojelu Huostaanotto. Lastenkodit. Turvakodit. Ensikodit. Sijaiskasvatus. Sijaiskodit Perheväkivalta ja insesti lastensuojelun kannalta
scope note: Allmänna verk som rör familje-, barn- eller ungdomspolitik Barnfamiljernas ställning i samhället Barnens, ungdomarnas och föräldrarnas ställning i samhället Socialpolitiska stödinsatser för familjer. Utjämning av familjeutgifter Barnbidrag. Underhållsbidrag. Mödravård. Moderskapsunderstöd Moderskapsledighet. Faderskapsledighet. Föräldraledighet. Familjeledighet Familje- och äktenskapsrådgivning. Familje- och äktenskapsrådgivningsbyråer Familjeplanering. Adoption Vård och skydd av barn och unga Omhändertagande. Barnhem. Skyddshem. Ensikoti-rörelsen. Fostran i familjehem. Familjehem Familjevåld och incest som en barnskyddsfråga @sv

Etelä-Eurooppa
type: Class
type: Concept
subclass of: EUROOPPA
alternative label: Etelä-Eurooppa (419 +)
alternative label: Etelä-Eurooppa, maantiede, matkat (419 +)
alternative label: Sydeuropa (419 +) @sv
alternative label: Sydeuropa, geografi, resor (419 +) @sv
broader: EUROOPPA
in scheme: URN:NBN:fi:au:hklj:
narrower: Pyreneiden niemimaa
narrower: Italia
narrower: Balkanin niemimaa
narrower: Malta
notation: 419
preferred label: Southern Europe @en
preferred label: Sydeuropa @sv
related: Ranska
related: URN:NBN:fi:au:hklj:460
related: URN:NBN:fi:au:hklj:979
related: Espanjan historia
related: Portugalin historia
related: Italian historia
related: Kreikan nykyhistoria
related: Entisen Jugoslavian alueen historia
related: Slovenian historia
related: Kroatian historia
related: Bosnian ja Hertsegovinan historia
related: Serbian historia
related: Makedonian historia
related: Montenegron historia
related: Kosovon historia
related: Bulgarian historia
related: Albanian historia
related: Maltan historia
scope note: Etelä-Eurooppaa ja Etelä-Euroopan maantiedettä koskevat yleisteokset sekä teokset, jotka koskevat useampia Etelä-Euroopan maita
scope note: Allmänna verk om Sydeuropa och Sydeuropas geografi samt verk som rör flera sydeuropeiska länder @sv

Ekologia. Eliömaantiede
type: Class
type: Concept
subclass of: BIOLOGIA
alternative label: Aapasuot, ekologia (574)
alternative label: Aapasuot, elinympäristöt (574)
alternative label: Aapasuot, eliömaantiede (574)
alternative label: Aarnimetsät, metsäekologia (574)
alternative label: Aarniometsät, metsäekologia (574)
alternative label: Aavikot, ekologia (574)
alternative label: Aavikot, elinympäristöt (574)
alternative label: Aavikot, eliömaantiede (574)
alternative label: Agroekologia (574)
alternative label: Aineiden kierto, ekologia (574)
alternative label: Alikasvos, metsäekologia (574)
alternative label: Alkuperäiset lajit, eliömaantiede (574)
alternative label: Allikot, vesiekologia (574)
alternative label: Alue-ekologia, ekologia (574)
alternative label: Alvarit, ekologia (574)
alternative label: Arkeofyytit, ekologia ja eliömaantiede (574)
alternative label: Arot, ekologia (574)
alternative label: Arot, elinympäristöt (574)
alternative label: Arot, eliömaantiede (574)
alternative label: Asutuksen seuralaislajit, eliömaantiede (574)
alternative label: Autiomaat, ekologia (574)
alternative label: Autiomaat, elinympäristöt (574)
alternative label: Autiomaat, eliömaantiede (574)
alternative label: Avosuot, suot, ekologia (574)
alternative label: Benthos, ekologia (574)
alternative label: Biodiversiteetti, ekologia (574)
alternative label: Bioenergetiikka, energiaekologia (574)
alternative label: Bioenergia, energiaekologia (574)
alternative label: Biogeografia (574)
alternative label: Biogeokemiallinen kierto (574)
alternative label: Biogeokemialliset kierrot (574)
alternative label: Biokenoosit, ekologia (574)
alternative label: Bioklimatologia, ekologia (574)
alternative label: Bioklimatologia, eliömaantiede (574)
alternative label: Biologinen monimuotoisuus, ekologia (574)
alternative label: Biomanipulaatio, ekologia (574)
alternative label: Biomassa, energiaekologia (574)
alternative label: Biometeorologia, ekologia (574)
alternative label: Biomit (574)
alternative label: Biosfääri, ekologia (574)
alternative label: Biotooppi, ekologia (574)
alternative label: Carnivorit, ekologia (574)
alternative label: Deltat, ekologia (574)
alternative label: Deltat, elinympäristöt (574)
alternative label: Deltat, eliömaantiede (574)
alternative label: Diversiteetti, ekologia (574)
broader: BIOLOGIA
in scheme: URN:NBN:fi:au:hklj:
notation: 574
related: URN:NBN:fi:au:hklj:400
related: Yleinen aluemaantiede. Yleinen kulttuurimaantiede. Yleinen poliittinen maantiede
related: EUROOPPA
related: AASIA
related: AFRIKKA
related: AMERIKKA
related: AUSTRALIA. OSEANIA. NAPAMAAT
related: FYYSINEN MAANTIEDE
related: Hydrologia
related: Meteorologia. Klimatologia
related: Paleontologia
related: Luonto-oppaat. Oppikirjat
related: Ympäristönsuojelu. Luonnonsuojelu
related: Uhanalaiset lajit. Luonnonsuojelualueet
related: Maaperän, metsien ja soiden suojelu
related: Vesien suojelu
related: Ilman suojelu
related: Yleisbiologia
related: URN:NBN:fi:au:hklj:574.084
related: Kasviekologia
related: Kasvimaantiede
related: Etologia. Eläinsosiologia
related: Eläinekologia
related: Eläinmaantiede
related: URN:NBN:fi:au:hklj:657
related: Kalastus
scope note: Ekologian ja eliömaantieteen yleisteokset, jotka koskevat sekä eläimiä että kasveja. Eliömaantieteelliset alueet Eliöiden suhde ympäristöönsä. Ekosysteemit Populaatioekologia. Energiaekologia Ravintoketjut. Biogeokemialliset kierrot Symbioosi. Parasitismi. Parasitologia yleensä Maaekosysteemit. Maaperä- ja metsäekosysteemit Vesiekosysteemit. Vesiekologia. Planktonekologia Teokset, jotka kuvailevat eri elinympäristöjen tai eliömaantieteellisten alueiden luontoa ja joita ei ole tarkoitettu luonto-oppaiksi tai lajinmääritysoppaiksi. Aavikoiden, arojen, merien, metsien, napa- ja tundra-alueiden, savannien, soiden, vesistöjen, vuoristojen ja kulttuuriympäristöjen ekologia ja luonto yleensä Säätilan ja vuodenaikojen vaikutus luontoon yleensä
scope note: Hit allmänna verk om ekologi och biogeografi som rör både djur och växter Biogeografiska områden Organismernas förhållande till omgivningen. Ekosystem Populationsekologi. Energiekologi Näringskedjor. Biogeokemiska kretslopp Symbios. Parasitism. Parasitologi i allmänhet Jordekosystem. Jordmånsekosystem och skogsekosystem Vattenekosystem. Hydroekologi. Planktonekologi Verk som beskriver naturen i olika livsmiljöer eller på olika biogeografiska områden och som inte är avsedda som naturhandböcker eller handböcker i artbestämning Öknarnas, stäppernas, havens, skogarnas, polar- och tundraområdenas, savannernas, myrarnas, sjöarnas, vattendragens, bergstrakternas och kulturmiljöernas ekologi och natur i allmänhet Vädrets och årstidernas inverkan på naturen i allmänhet @sv

LÄÄKETIEDE. TERVEYDENHOITO
type: Class
type: Concept
subclass of: SOVELLETUT TIETEET
alternative label: Biologiset tieteet, lääketiede (610 ... 618 +)
alternative label: Biotieteet, lääketiede (610 ... 618 +)
alternative label: Ensitieto, lääketiede (610)
alternative label: Katastrofiapu, lääketieteellinen apu (610)
alternative label: Kohorttitutkimus, lääketiede (610 ... 618 +)
alternative label: Lääketiede (610 ... 618 +)
alternative label: Nanolääketiede (610 ... 618 +)
alternative label: Näyttöön perustuva kliininen lääketiede, lääketiede (610)
alternative label: Näyttöön perustuva lääketiede, lääketiede (610)
alternative label: Rasituskokeet, lääketiede (610 ... 618 +)
alternative label: Telelääketiede (610)
alternative label: Terveystieteet (610)
alternative label: Toimintahäiriöt, lääketiede (610 ... 618 +)
alternative label: Yleislääketiede (610 +)
alternative label: Yliliikkuvuus, lääketiede (610 ... 618 +)
alternative label: Allmänmedicin (610 +) @sv
alternative label: Belastningsprov, medicin (610 ... 618 +) @sv
alternative label: Biologiska vetenskaper, medicin (610 ... 618 +) @sv
alternative label: Biovetenskaper, medicin (610 ... 618 +) @sv
alternative label: Funktionsstörningar, medicin (610 ... 618 +) @sv
alternative label: Första vetskap, medicin (610) @sv
alternative label: Hypermobilitet, medicin (610 ... 618 +) @sv
alternative label: Hälsovetenskaper (610) @sv
alternative label: Katastrofhjälp, medicinsk hjälp (610) @sv
alternative label: Kohortundersökning, medicin (610 ... 618 +) @sv
alternative label: Kunskapsbaserad klinisk medicin, medicin (610) @sv
alternative label: Kunskapsbaserad medicin, medicin (610) @sv
alternative label: Medicin (610 ... 618 +) @sv
alternative label: Nanomedicin (610 ... 618 +) @sv
alternative label: Telemedicin (610) @sv
broader: SOVELLETUT TIETEET
in scheme: URN:NBN:fi:au:hklj:
narrower: Lääketieteen filosofia ja etiikka
narrower: Lääkärikirjat. Ensiapuoppaat
narrower: Hoitotiede. Hoitotyö. Hoitohenkilökunta
narrower: Anatomia
narrower: URN:NBN:fi:au:hklj:612
narrower: Terveydenhoito
narrower: Lääketieteen erikoisaloja
narrower: URN:NBN:fi:au:hklj:615
narrower: URN:NBN:fi:au:hklj:616
narrower: URN:NBN:fi:au:hklj:617
narrower: Psykiatria
notation: 610
preferred label: MEDICINE. HEALTH CARE @en
preferred label: MEDICIN. HÄLSOVÅRD @sv
related: URN:NBN:fi:au:hklj:332.22
related: URN:NBN:fi:au:hklj:371.6
related: Eläinlääketiede
scope note: Lääketieteen yleisteokset Lääketieteen yleiset oppikirjat Lääketieteen yleinen historia 610.09
scope note: Allmänna verk om medicin Allmänna läroböcker i medicin Medicins allmänna historia 610.09 @sv

Sydän- ja verenkiertoelimet. Sydän- ja verenkiertoelinten taudit. Veri. Veritaudit
type: Class
type: Concept
subclass of: Sisäelimet. Sisätaudit
alternative label: Ahtaumat, sydän- ja verisuonitaudit (617.34)
alternative label: Ahtautumat, sydän- ja verisuonitaudit (617.34)
alternative label: Aivovaltimot, ihmisen anatomia ja fysiologia (617.34)
alternative label: Alentunut verenpaine (617.34)
alternative label: Anemia (617.34)
alternative label: Angiofibrooma, verisuonitaudit (617.34)
alternative label: Angiogeneesi (617.34)
alternative label: Angioplastia (617.34)
alternative label: Arterioskleroosi (617.34)
alternative label: DIC-oireyhtymä, veritaudit (617.34)
alternative label: Defibrillaatio, rytmihäiriöt, sydän (617.34)
alternative label: Defibrillaattorit, tahdistimet, sydän (617.34)
alternative label: Dieettikeittokirjat, sydän- ja verisuonitaudit (617.34)
alternative label: Dissekoiva aneurysma, verisuonitaudit (617.34)
alternative label: ECG (617.34)
alternative label: EKG (617.34)
alternative label: Elektrodiagnostiikka, EKG (617.34)
alternative label: Elektrokardiografia (617.34)
alternative label: HDL-kolesteroli, sydäntaudit (617.34)
alternative label: Hematologia, veri ja verenkierto (617.34)
alternative label: Hematologia, veritaudit, verenkiertoelinten taudit (617.34)
alternative label: Hemofilia (617.34)
alternative label: Hypertensio (617.34)
alternative label: Hypotensio, alentunut verenpaine (617.34)
alternative label: Hypotonia, alentunut verenpaine (617.34)
alternative label: Hyytymishäiriöt (617.34)
alternative label: Imukudosoppi (617.34)
alternative label: Imusolut, veritaudit (617.34)
alternative label: Imusuonisto, ihmisen fysiologia (617.34)
alternative label: Kardiologia (617.34)
alternative label: Kardiomyopatiat (617.34)
alternative label: Katetrit, sydämen katetrointi (617.34)
alternative label: Katetrointi, sydämen katetrointi (617.34)
alternative label: Kaulavaltimot, verenkiertoelimet (617.34)
alternative label: Keinosydämet (617.34)
alternative label: Kohonnut verenpaine (617.34)
alternative label: Kolesteroli, sydäntaudit (617.34)
alternative label: LDL-kolesteroli, sydäntaudit (617.34)
alternative label: Leposyke (617.34)
alternative label: Luuydin (617.34)
alternative label: Luuydinsiirto (617.34)
alternative label: Luuytimensiirto (617.34)
alternative label: Lymfedeema, lymfologia (617.34)
alternative label: Lymfologia (617.34)
alternative label: Lymfosyytit, veritaudit (617.34)
alternative label: Ohitusleikkaukset (617.34)
broader: Sisäelimet. Sisätaudit
in scheme: URN:NBN:fi:au:hklj:
notation: 617.34
related: URN:NBN:fi:au:hklj:181.9
related: URN:NBN:fi:au:hklj:332.22
related: URN:NBN:fi:au:hklj:371.6
related: URN:NBN:fi:au:hklj:373
related: URN:NBN:fi:au:hklj:576
related: Anatomia
related: URN:NBN:fi:au:hklj:612
related: URN:NBN:fi:au:hklj:613.1
related: URN:NBN:fi:au:hklj:613.3
related: URN:NBN:fi:au:hklj:613.31
related: URN:NBN:fi:au:hklj:613.5
related: URN:NBN:fi:au:hklj:615
related: URN:NBN:fi:au:hklj:615.1
related: URN:NBN:fi:au:hklj:615.3
related: Seerumihoito. Rokotukset. Verensiirto
related: URN:NBN:fi:au:hklj:615.8
related: URN:NBN:fi:au:hklj:616
related: URN:NBN:fi:au:hklj:616.2
related: URN:NBN:fi:au:hklj:616.3
related: Immunologia. Serologia. Verioppi
related: URN:NBN:fi:au:hklj:617.1
related: Syöpätaudit
related: URN:NBN:fi:au:hklj:617.4
related: URN:NBN:fi:au:hklj:617.7
related: URN:NBN:fi:au:hklj:691.1
related: URN:NBN:fi:au:hklj:691.12
scope note: Sydän- ja verenkiertoelimet, veri ja vertamuodostava kudos, niiden anatomia ja fysiologia sekä taudit Sydän- ja verenkiertoelintautien sekä veritautien ennaltaehkäisy, diagnostiikka, hoito ja patologia Verenkierto, sydän, verisuonet, imusuonet, imurauhaset, perna ja luuydin sekä niiden taudit Sepelvaltimotauti. Sydäninfarkti. Veritulppa. Verenpaine. Verenpainetauti. Veren kolesteroli Ohitusleikkaukset. Sydämensiirrot Veritaudit. Anemiat. Verenvuototauti Sydän- ja verisuonitauteja tai anemiaa sairastavien ruokavaliot ja keittokirjat
scope note: Hjärtat och cirkulationsorganen, blod och blodbildande vävnad, deras anatomi och fysiologi samt sjukdomar Sjukdomar i hjärtat och cirkulationsorganen samt blodsjukdomar, förebyggande och behandling av dem samt deras diagnostik och patologi Cirkulationsorganens, hjärtat, blodkärlen, lymfkärlen, lymfkörtlarna, mjälten och benmärgen och deras sjukdomar Kranskärlssjukdomar. Hjärtinfarkt. Blodpropp. Blodtryck. Blodtryckssjukdomar. Blodets kolesterol Bypassoperationer. Hjärttransplantationer Blodsjukdomar. Anemi. Blödarsjuka Dieter och kokböcker för personer med sjukdomar i hjärtat och cirkulationsorganen @sv

Hampaat. Hammaslääketiede
type: Class
type: Concept
subclass of: URN:NBN:fi:au:hklj:617.9
alternative label: Aftainen suutulehdus, suun ja hampaiston taudit (617.93)
alternative label: Amalgaami, hammaslääketiede (617.93)
alternative label: Bruksismi (617.93)
alternative label: Ehkäisevä hammaslääketiede (617.93)
alternative label: Erikoishammaslääkärit, hammaslääkärin työ (617.93)
alternative label: Fluoraus, hampaiden hoito (617.93)
alternative label: Hammasharjat (617.93)
alternative label: Hammashoitajat, hammashoitajan työ (617.93)
alternative label: Hammashoito (617.93)
alternative label: Hammashoitolat (617.93)
alternative label: Hammashuoltajat, hammashoitajan työ (617.93)
alternative label: Hammashuolto (617.93)
alternative label: Hammasimplantit, hammastekniikka (617.93)
alternative label: Hammaskaries (617.93)
alternative label: Hammaskirurgia (617.93)
alternative label: Hammaskivi (617.93)
alternative label: Hammaslääketiede (617.93)
alternative label: Hammaslääkärit, hammaslääkärin työ (617.93)
alternative label: Hammasproteesit (617.93)
alternative label: Hammassärky (617.93)
alternative label: Hammastahnat, hampaiden hoito (617.93)
alternative label: Hammastaudit (617.93)
alternative label: Hammastekniikka (617.93)
alternative label: Hammasteknikot, hammasteknikon työ (617.93)
alternative label: Hampaan paikkaus (617.93)
alternative label: Hampaanoionta (617.93)
alternative label: Hampaat, hammaslääketiede (617.93)
alternative label: Hampaat, ihmisen anatomia (617.93)
alternative label: Hampaiden narskuttelu (617.93)
alternative label: Hampaidenhoito (617.93)
alternative label: Iensairaudet, suun ja hampaiston taudit (617.93)
alternative label: Ikenet (617.93)
alternative label: Karies (617.93)
alternative label: Kieli, ihmisen anatomia ja fysiologia (617.93)
alternative label: Kieli, lääketiede (617.93)
alternative label: Kitalakihalkiot (617.93)
alternative label: Koivusokeri, hammaslääketiede (617.93)
alternative label: Kouluterveydenhuolto, hammashuolto (617.93)
alternative label: Ksylitoli, hammaslääketiede (617.93)
alternative label: Leukakirurgia (617.93)
alternative label: Odontoliitti (617.93)
alternative label: Odontologia (617.93)
alternative label: Oikeushammaslääketiede (617.93)
alternative label: Opiskelijaterveydenhuolto, hammashuolto (617.93)
alternative label: Opiskeluterveydenhuolto, hammashuolto (617.93)
alternative label: Ortodontia (617.93)
broader: URN:NBN:fi:au:hklj:617.9
in scheme: URN:NBN:fi:au:hklj:
notation: 617.93
related: URN:NBN:fi:au:hklj:181.9
related: URN:NBN:fi:au:hklj:332.22
related: URN:NBN:fi:au:hklj:371.6
related: URN:NBN:fi:au:hklj:373
related: URN:NBN:fi:au:hklj:576
related: Anatomia
related: URN:NBN:fi:au:hklj:612
related: URN:NBN:fi:au:hklj:613.1
related: Henkilökohtainen terveydenhoito
related: URN:NBN:fi:au:hklj:613.3
related: URN:NBN:fi:au:hklj:613.31
related: URN:NBN:fi:au:hklj:613.5
related: URN:NBN:fi:au:hklj:615
related: URN:NBN:fi:au:hklj:615.1
related: URN:NBN:fi:au:hklj:615.3
related: URN:NBN:fi:au:hklj:615.8
related: URN:NBN:fi:au:hklj:616
related: URN:NBN:fi:au:hklj:616.2
related: URN:NBN:fi:au:hklj:616.3
related: URN:NBN:fi:au:hklj:617.1
related: Syöpätaudit
related: URN:NBN:fi:au:hklj:617.4
related: URN:NBN:fi:au:hklj:617.7
related: Korva. Nenäontelo. Kurkku. Korva-, nenä- ja kurkkutaudit
related: URN:NBN:fi:au:hklj:691.1
related: URN:NBN:fi:au:hklj:691.12
scope note: Hampaat, ikenet ja suuontelo, niiden anatomia ja fysiologia Hampaiden, ienten ja suuontelon taudit, niiden ennaltaehkäisy, diagnostiikka, hoito ja patologia Yleinen hammashuolto. Hammaslääkäripalvelut. Koululaisten ja opiskelijoiden hammashuolto Hammaslääkärin ja hammashoitajan työ. Hammasteknikon työ Hammasproteesit. Hammas- ja leukakirurgia Suuhygienia. Hampaiden ja ikenien hoito henkilökohtaisen terveydenhoidon kannalta Hammasharjat. Hampaiden hoitovälineet
scope note: Tänder, tandkött och munhålan, deras anatomi och fysiologi Tändernas, tandköttets och munhålans sjukdomar, förebyggande och behandling av dem samt deras diagnostik och patologi Allmän tandvård. Odontologiska tjänster. Skol- och studenttandvård Tandläkarens och tandskötarens arbete. Tandteknikerns arbete Tandproteser. Tand- och käkkirurgi Munhygien. Vård av tänder ur den personliga hälsovårdens och friskvårdens synvinkel Tandborstar. Hjälpmedel för tandvård @sv

Oikeuspsykiatria
type: Class
type: Concept
subclass of: Psykiatria
alternative label: Kriminaalipsykiatria (618.4)
alternative label: Mielentilatutkimus (618.4)
alternative label: Murhaajat, oikeuspsykiatria (618.4)
alternative label: Nuoret rikoksentekijät, oikeuspsykiatria (618.4)
alternative label: Oikeuspsykiatria (618.4)
alternative label: Rikoksentekijät, oikeuspsykiatria (618.4)
alternative label: Sarjamurhaajat, oikeuspsykiatria (618.4)
alternative label: Syyntakeisuus (618.4)
alternative label: Varkaat, oikeuspsykiatria (618.4)
alternative label: Väkivalta, mielentilatutkimukset (618.4)
alternative label: Gärningsmän, rättspsykiatri (618.4) @sv
alternative label: Kriminalpsykiatri (618.4) @sv
alternative label: Mördare, rättspsykiatri (618.4) @sv
alternative label: Rättspsykiatri (618.4) @sv
alternative label: Seriemördare, rättspsykiatri (618.4) @sv
alternative label: Sinnesundersökning (618.4) @sv
alternative label: Tillräknelighet (618.4) @sv
alternative label: Tjuvar, rättspsykiatri (618.4) @sv
alternative label: Unga förbrytare, rättspsykiatri (618.4) @sv
alternative label: Våld, sinnesundersökningar (618.4) @sv
broader: Psykiatria
in scheme: URN:NBN:fi:au:hklj:
notation: 618.4
preferred label: Forensic psychiatry @en
preferred label: Rättspsykiatri @sv
related: URN:NBN:fi:au:hklj:120
related: Perinnöllisyyspsykologia
related: Kehityspsykologia. Eri ikäkausien psykologia
related: URN:NBN:fi:au:hklj:181.9
related: URN:NBN:fi:au:hklj:330
related: Oikeussosiologia. Oikeuspolitiikka. Oikeuspsykologia
related: URN:NBN:fi:au:hklj:332.22
related: URN:NBN:fi:au:hklj:371.6
related: URN:NBN:fi:au:hklj:373
related: URN:NBN:fi:au:hklj:576
related: URN:NBN:fi:au:hklj:613.3
related: URN:NBN:fi:au:hklj:613.31
related: URN:NBN:fi:au:hklj:613.5
related: Oikeuslääketiede
related: URN:NBN:fi:au:hklj:615
related: URN:NBN:fi:au:hklj:615.1
related: URN:NBN:fi:au:hklj:615.3
related: URN:NBN:fi:au:hklj:615.8
related: URN:NBN:fi:au:hklj:616
related: URN:NBN:fi:au:hklj:616.2
related: URN:NBN:fi:au:hklj:616.3
related: URN:NBN:fi:au:hklj:617
related: URN:NBN:fi:au:hklj:617.1
related: URN:NBN:fi:au:hklj:617.2
related: URN:NBN:fi:au:hklj:617.4
related: URN:NBN:fi:au:hklj:617.99
scope note: Mielentilatutkimukset. Syyntakeettomuus
scope note: Sinnesundersökningar. Otillräknelighet @sv

Yrtti- ja maustekasvit
type: Class
type: Concept
subclass of: Hyötykasvit
alternative label: Hyötykasvit, yrtit (653.21)
alternative label: Kasviharrastus, yrtit (653.21)
alternative label: Kauneudenhoitokasvit, viljely ja keräily (653.21)
alternative label: Luonto-oppaat, yrtit (653.21)
alternative label: Maatiaislajikkeet, yrtti- ja maustekasvit (653.21)
alternative label: Maustekasvit (653.21)
alternative label: Perinnekasvit, yrtti- ja maustekasvit (653.21)
alternative label: Valkosipuli, viljely (653.21)
alternative label: Villiyrtit (653.21)
alternative label: Yrtit (653.21)
alternative label: Yrtit, puutarhanhoito (653.21)
alternative label: Yrttikasvit (653.21)
alternative label: Endemiska arter, lantbruk, ört- och kryddväxter (653.21) @sv
alternative label: Kosmetikväxter, odling och samlande (653.21) @sv
alternative label: Kryddväxter (653.21) @sv
alternative label: Naturguider, örter (653.21) @sv
alternative label: Nyttoväxter, örter (653.21) @sv
alternative label: Officinella växter (653.21) @sv
alternative label: Vilda örter (653.21) @sv
alternative label: Vitlök, odling (653.21) @sv
alternative label: Växter som hobby, örter (653.21) @sv
alternative label: Örter (653.21) @sv
alternative label: Örter, trädgårdsskötsel (653.21) @sv
broader: Hyötykasvit
in scheme: URN:NBN:fi:au:hklj:
notation: 653.21
preferred label: Herbs and spice plants @en
preferred label: Örter och kryddväxter @sv
related: Antroposofia
related: URN:NBN:fi:au:hklj:342
related: URN:NBN:fi:au:hklj:576
related: KASVITIEDE
related: Systemaattinen kasvitiede
related: Putkilokasvit
related: Hyönteiset
related: URN:NBN:fi:au:hklj:615.1
related: Vaihtoehtolääkintä. Luonnonparannus
related: Kivihiili. Turve
related: URN:NBN:fi:au:hklj:649.91
related: Maatalouspolitiikka
related: URN:NBN:fi:au:hklj:650.2
related: URN:NBN:fi:au:hklj:651
related: Maanviljely
related: URN:NBN:fi:au:hklj:657
related: Rakennusten erillistilat
related: URN:NBN:fi:au:hklj:691.1
related: Leipominen
related: URN:NBN:fi:au:hklj:691.12
related: URN:NBN:fi:au:hklj:691.13
related: Kalaruoat
related: Eri maiden ja alueiden ruokalajit ja ruokakulttuuri
related: Kauneudenhoito
related: Luonnon- ja kulttuurimaiseman suunnittelu
related: Kehrääminen. Karstaus. Värjäys
scope note: Viljellyt ja luonnonvaraiset yrtti- ja maustekasvit Yrtti- ja maustekasvien viljely ja keräily
scope note: Odlade och vilda örter och kryddväxter Odling och samlande av örter och kryddväxter @sv

Rakennusstatiikka. Rakennusaineet
type: Class
type: Concept
subclass of: URN:NBN:fi:au:hklj:660
alternative label: Alapohjat, rakennustekniikka (662)
alternative label: Bambu, rakennusaineet (662)
alternative label: Betoni, rakennustekniikka (662)
alternative label: Betonirakennukset, rakennustekniikka (662)
alternative label: Betonirakenteet, rakennustekniikka (662)
alternative label: Betoniraudoitus, rakennustekniikka (662)
alternative label: Betonointi (662)
alternative label: Elementtirakentaminen, rakennustekniikka (662)
alternative label: Graafinen betoni, rakennustekniikka (662)
alternative label: Harkot, rakennustekniikka (662)
alternative label: Helat, rakennustarvikkeet (662)
alternative label: Hirret, rakennusaineet (662)
alternative label: Hirsirakentaminen (662)
alternative label: Hirsirakenteet (662)
alternative label: Hirsirakenteet, rakennustekniikka (662)
alternative label: Jännityslaskelmat, rakennustekniikka (662)
alternative label: Kaakelilaatat, rakennustekniikka (662)
alternative label: Kaakelit, rakennustekniikka (662)
alternative label: Kantavat rakenteet, rakennustekniikka (662)
alternative label: Kantavuus, rakennusstatiikka (662)
alternative label: Keraamiset laatat, rakennustekniikka (662)
alternative label: Keraamiset materiaalit, rakennustekniikka (662)
alternative label: Kertopuu, puurakenteet (662)
alternative label: Kevytbetoni, rakennusaineet (662)
alternative label: Kiinnitys, tekniikka, rakennustekniikka (662)
alternative label: Kiinnitystarvikkeet, rakennustekniikka (662)
alternative label: Kiinnitystekniikka, rakennustekniikka (662)
alternative label: Kipsilevyt, rakennustekniikka (662)
alternative label: Kivi, rakennusaineena (662)
alternative label: Kiviaines, rakennusaineena (662)
alternative label: Kivirakennukset, rakennustekniikka (662)
alternative label: Kivirakenteet (662)
alternative label: Kivirakenteet, rakennustekniikka (662)
alternative label: Klinkkerilaatat, rakennustekniikka (662)
alternative label: Klinkkerit, rakennustekniikka (662)
alternative label: Kuormalaskelmat, rakennusstatiikka (662)
alternative label: Kuormitus, rakennusstatiikka (662)
alternative label: Lasirakenteet, rakennustekniikka (662)
alternative label: Laudat, rakennusaineet (662)
alternative label: Levyt, rakentaminen, rakennustekniikka (662)
alternative label: Liimapuurakenteet, rakennustekniikka (662)
alternative label: Liittäminen, rakennustekniikka (662)
alternative label: Lujuus, rakennustekniikka (662)
alternative label: Lujuuskokeet, rakennustekniikka (662)
alternative label: Luonnonkivi, rakennustekniikka (662)
alternative label: Luonnonmateriaalit, rakennustekniikka (662)
broader: URN:NBN:fi:au:hklj:660
in scheme: URN:NBN:fi:au:hklj:
notation: 662
related: Tekninen mekaniikka
related: Tiet. Kadut. Tienrakennus. Kadunrakennus
related: Sillat. Sillanrakennus
related: Raideliikenneväylät. Junat. Raitiovaunut. Metro
related: Vesirakennus. Vesikulkuneuvot
related: Satamat. Satamatekniikka
related: Vesiväylät. Vesien säännöstely
related: Vesijohto-, viemäri- ja vedenpuhdistustekniikka
related: Vesikulkuneuvot
related: Laivat. Laivanrakennus
related: URN:NBN:fi:au:hklj:625.72
related: Muut vesikulkuneuvot
related: Puuteollisuus
related: Lasiteollisuus. Keraaminen teollisuus. Sementtiteollisuus
related: Tekninen rakennussuunnittelu
related: Talonrakennus
related: Rakennustyöt. Rakennusaineet. Rakennustarvikkeet
related: Muuraus. Rappaus
related: Maalaustyöt
related: Rakenneosat
related: URN:NBN:fi:au:hklj:667.7
related: URN:NBN:fi:au:hklj:667.71
related: Uunit. Takat
related: Huoneakustiikka
related: Rakennusten erillistilat
related: Rakennuksen kunnossapito
scope note: Rakennusstatiikan yleisteokset Rakennusaineita ja rakennustarvikkeita koskevat yleisteokset Teokset, jotka koskevat rakennusstatiikkaa, rakennusaineita tai rakennustarvikkeita sekä talonrakennuksen että muun rakennustekniikan kannalta Rakenneosat, -rungot ja -elementit yleensä Yleiset rakennustekniset lujuus-, kuorma- ja jännityslaskelmat Rakenteet, niiden mitoitus ja kantokyky yleensä Puu, betoni, sementti, kivi, mineraalit, kalkki, tiili, savi, maa, metallit, teräs, muovit ja lasi sekä levyt, laatat, palkit, pilarit, pylväät ja holvit rakennustekniikassa yleensä Riippu-, ylipaine- ja elementtirakenteet yleensä Rakennustekniikan erikoisalojen rakennusstatiikka, lujuuslaskelmat sekä rakennusaineet ja -välineet alan mukaisessa luokassa
scope note: Allmänna verk om byggnadsstatik Allmänna verk om byggmaterial och byggvaror Verk som handlar om byggnadsstatik, byggmaterial och byggvaror med hänsyn till både husbyggnad och annan byggnadsteknik Konstruktionsdelar, byggstommar och byggelement i allmänhet Allmänna byggnadstekniska hållfasthets-, belastnings- och spänningsberäkningar Konstruktioner, mätning av dem och deras bärkraft Trä, betong, cement, sten, mineraler, kalk, tegel, lera, jord, metaller, stål, plast och glas samt skivor, plattor, balkar, pelare, kolonner och valv inom byggnadstekniken i allmänhet Häng-, valv- och elementkonstruktioner i allmänhet Byggnadsstatik, hållfasthetsberäkningar samt byggmaterial och byggvaror inom byggnadstekniska specialområden klassificeras enligt område @sv

Leipominen
type: Class
type: Concept
subclass of: URN:NBN:fi:au:hklj:691.1
alternative label: Browniet, leivonnaiset, kotivalmistus (691.11)
alternative label: Donitsit, leivonnaiset, kotivalmistus (691.11)
alternative label: Hapanleipä, leivonta (691.11)
alternative label: Hiiva, leivonta (691.11)
alternative label: Jauhot, leivontaohjeet (691.11)
alternative label: Juustokakut, kotivalmistus (691.11)
alternative label: Kaura, leivonta (691.11)
alternative label: Keksit, leivonta (691.11)
alternative label: Kondiittorit, kondiittorin työ (691.11)
alternative label: Kotileivonta (691.11)
alternative label: Kotivalmistus, leivonta (691.11)
alternative label: Leipominen, leipomisohjeet (691.11)
alternative label: Leipominen, leipurin työ (691.11)
alternative label: Leipomot, leipurin työ (691.11)
alternative label: Leipurit, leipurin työ (691.11)
alternative label: Leipä, leivonta (691.11)
alternative label: Leipäkoneet, leivonta (691.11)
alternative label: Leipävilja, leivonta (691.11)
alternative label: Leivonnaiset, kotivalmistus (691.11)
alternative label: Leivonta, leipomisohjeet (691.11)
alternative label: Leivonta, leipurin työ (691.11)
alternative label: Leseet, leivonta (691.11)
alternative label: Marenki, leivonnaiset, kotivalmistus (691.11)
alternative label: Mukikakut, kotivalmistus (691.11)
alternative label: Munkit, leivonnaiset, kotivalmistus (691.11)
alternative label: Nisu, kotivalmistus (691.11)
alternative label: Ohra, leivonta (691.11)
alternative label: Pettu, ruokaohjeet (691.11)
alternative label: Piiraat, leivonta (691.11)
alternative label: Piirakat, leivonta (691.11)
alternative label: Piparkakkutalot, kotivalmistus (691.11)
alternative label: Pulla, kotivalmistus (691.11)
alternative label: Raskitus, leipä, leivonta, (691.11)
alternative label: Ruis, leivonta (691.11)
alternative label: Ruisleipä, leivonta (691.11)
alternative label: Saaristolaisleipä (691.11)
alternative label: Sokerileipurit, sokerileipurin työ (691.11)
alternative label: Taikina (691.11)
alternative label: Taikinajuuri, leipä, leivonta (691.11)
alternative label: Tarteletit, leivonnaiset, kotivalmistus (691.11)
alternative label: Vehnä, leivonta (691.11)
alternative label: Vehnänen, kotivalmistus (691.11)
alternative label: Bagare, bagarens arbete (691.11) @sv
alternative label: Bagerier, bagarens arbete (691.11) @sv
alternative label: Bak, bagares arbete (691.11) @sv
alternative label: Bak, bakningsråd (691.11) @sv
broader: URN:NBN:fi:au:hklj:691.1
in scheme: URN:NBN:fi:au:hklj:
notation: 691.11
related: URN:NBN:fi:au:hklj:473
related: URN:NBN:fi:au:hklj:473.1
related: URN:NBN:fi:au:hklj:475
related: URN:NBN:fi:au:hklj:475.1
related: URN:NBN:fi:au:hklj:476
related: URN:NBN:fi:au:hklj:476.1
related: URN:NBN:fi:au:hklj:476.11
related: URN:NBN:fi:au:hklj:476.12
related: URN:NBN:fi:au:hklj:476.5
related: URN:NBN:fi:au:hklj:476.6
related: URN:NBN:fi:au:hklj:476.7
related: URN:NBN:fi:au:hklj:476.8
related: URN:NBN:fi:au:hklj:613.1
related: URN:NBN:fi:au:hklj:649.91
related: Maanviljely
related: Puutarhanhoito. Hyötykasvit. Huone- ja koristekasvit
related: Hyötykasvit
related: Yrtti- ja maustekasvit
related: Hedelmä-, marja- ja vihanneskasvit
related: Hotelli- ja ravintolatalous
related: HIENOMEKANIIKKA. KÄSI- JA KOTITEOLLISUUS
related: Kotitalous. Kodinhoito
related: Eri maiden ja alueiden ruokalajit ja ruokakulttuuri
related: Säilöntä
related: Kotijuhlien järjestäminen. Kutsujen järjestäminen
related: Suurkeittiöt
scope note: Leivän ja leivonnaisten leipomisohjeet Leipiä ja leivonnaisia koskeva ruokakulttuuri ja gastronomia Leipurin ja kondiittorin työ Tässä myös perinteisten ja kansallisten leipien ja leivonnaisten leivontaohjeet Jos teoksessa on sekä käytännön leipomisohjeita tai ruokakulttuuria että kansatiedettä, on etusija luokalla 691.11
scope note: Bröd- och bakverksrecept Matkultur och gastronomi som rör bröd och bakverk Bagarens och konditorns arbete Hit också recept för traditionella och nationella bröd och bakverk Om verket handlar om såväl bakrecept eller matkultur som etnologi, ges företräde åt klass 691.11 @sv

GRAAFINEN TAIDE. VALOKUVAUS
type: Class
type: Concept
subclass of: URN:NBN:fi:au:hklj:700
alternative label: Biografiat, taiteilijat (710 ... 789 +)
alternative label: Edelläkävijät, taiteilijat (710 ... 789 +)
alternative label: Elämäkerrat, taiteilijat ja musiikki (710 ... 789 +)
alternative label: Elämänhistoria, henkilöhistoria, taiteilijat (710 ... 789 +)
alternative label: Graafinen viestintä, graafinen taide (750 ... 756 +)
alternative label: Haastattelut, henkolöhistoria, taiteilijat (710 ... 789 +)
alternative label: Henkilöhistoria, taiteilijat (710 ... 789 +)
alternative label: Henkilökuvat, taiteilijat (710 ... 789 +)
alternative label: Henkilöt, taiteilijat (710 ... 789 +)
alternative label: Historia, henkilöhistoria, taiteilijat (710 ... 789 +)
alternative label: Julkisuuden henkilöt, taiteilijat (710 ... 789 +)
alternative label: Kansalliset suurmiehet, taiteilijat ja musiikki (710 ... 789 +)
alternative label: Kirjeet, taiteilijat (710 ... 789 +)
alternative label: Kuvaamataiteet, graafinen taide (750 ... 753 +)
alternative label: Kuvataide, graafinen taide (750 ... 753 +)
alternative label: Lapsitähdet, julkisuuden henkilöt, taiteilijat (710 ... 789 +)
alternative label: Lapsuus, taiteilijat (710 ... 789 +)
alternative label: Maahanmuuttajat, henkilöhistoria, taiteilijat (710 ... 789 +)
alternative label: Maanpako, henkilöhistoria, taiteilijat (710 ... 789 +)
alternative label: Merkkihenkilöt, taiteilijat ja musiikki (710 ... 789 +)
alternative label: Mielipidevangit, taiteilijat, elämäkerrat ja muistelmat (710 ... 789 +)
alternative label: Muistelmat, taiteilijat (710 ... 789 +)
alternative label: Muistokirjoitukset, taiteilijat (710 ... 789 +)
alternative label: Nekrologit, taiteilijat (710 ... 789 +)
alternative label: Omaelämäkerrat, taiteilijat (710 ... 789 +)
alternative label: Pakolaiset, henkilöhistoria, taiteilijat (710 ... 789 +)
alternative label: Professorit, taiteilijat (710 ... 789 +)
alternative label: Päiväkirjat, taiteilijat (710 ... 789 +)
alternative label: Rakkauskirjeet, taiteilijat (710 ... 789 +)
alternative label: Siirtolaiset, henkilöhistoria, taiteilijat (710 ... 789 +)
alternative label: Suurmiehet, taiteilijat ja musiikki (710 ... 789 +)
alternative label: Taiteet, graafinen taide (750 ... 753 +)
alternative label: Teokset, taiteilijoiden teosluettelot (703 ... 776.03)
alternative label: Uranuurtajat, taiteilijat (710 ... 789 +)
alternative label: Vaihtoehtohistoria, henkilöhistoria, taiteilijat (710 ... 789 +)
alternative label: Vaihtoehtoinen historia, henkilöhistoria, taiteilijat (710 ... 789 +)
alternative label: Alternativ historia, personhistoria, konstnärer (710 ... 789 +) @sv
alternative label: Barndom, konstnärer (710 ... 789 +) @sv
alternative label: Barnstjärnor, offentliga personer, konstnärer (710 ... 789 +) @sv
alternative label: Bemärkta personer, konstnärer och musik (710 ... 789 +) @sv
alternative label: Bildkonst, grafisk konst (750 ... 753 +) @sv
alternative label: Bildkonster, grafisk konst (750 ... 753 +) @sv
alternative label: Biografier, konstnärer (710 ... 789 +) @sv
alternative label: Brev, konstnärer (710 ... 789 +) @sv
alternative label: Dagböcker, konstnärer (710 ... 789 +) @sv
alternative label: Flyktingar, personhistoria, konstnärer (710 ... 789 +) @sv
alternative label: Föregångare, konstnärer (710 ... 789 +) @sv
alternative label: Grafisk kommunikation, grafisk konst (750 ... 756 +) @sv
alternative label: Historia, personhistoria, konstnärer (710 ... 789 +) @sv
alternative label: Immigranter, personhistoria, konstnärer (710 ... 789 +) @sv
alternative label: Intervjuer, personhistoria, konstnärer (710 ... 789 +) @sv
alternative label: Invandrare, personhistoria, konstnärer (710 ... 789 +) @sv
alternative label: Konstarter, grafisk konst (750 ... 753 +) @sv
broader: URN:NBN:fi:au:hklj:700
in scheme: URN:NBN:fi:au:hklj:
narrower: Graafisen taiteen teoria, estetiikka ja filosofia
narrower: Graafisen taiteen historia
narrower: Kuvitustaide
narrower: Käyttögrafiikka
narrower: Taidegrafiikka
narrower: URN:NBN:fi:au:hklj:756
notation: 750
related: Symbolit. Koodit. Merkkijärjestelmät
related: Kirjapainotaito. Graafinen teollisuus
related: URN:NBN:fi:au:hklj:010
related: Yleisbibliografiat. Kansallisbibliografiat
related: Kustantajien ja kirjakauppojen luettelot
related: Erikoisalojen bibliografiat
related: Taiteet. Liikunta
related: Paikallisbibliografiat. Henkilöbibliografiat
related: MAALAUSTAIDE. PIIRUSTUSTAIDE
related: URN:NBN:fi:au:hklj:740.9
related: URN:NBN:fi:au:hklj:749.1
related: Piirustuksen materiaalit ja tekniikka
related: Pilapiirrokset. Karikatyyrit
scope note: Yleisteokset, jotka koskevat sekä graafisen taiteen historiaa että tekniikkaa Yleisteokset, jotka koskevat sekä käyttögrafiikkaa että taidegrafiikkaa Yleisteokset, jotka koskevat sekä graafista taidetta että valokuvausta Jos teos kuitenkin painottuu johonkin tiettyyn alaan, on etusija alan mukaisella luokalla Jos teos koskee sekä piirustustaidetta että grafiikkaa, on etusija luokalla 749.1+
scope note: Allmänna verk om den grafiska konstens historia och teknik Allmänna verk om både bruksgrafik och konstgrafik Allmänna verk om både grafisk konst och fotografi Om något bestämt område dominerar i verket ges företräde åt klassen för området Om verket rör både teckningskonst och grafik ges företräde åt klass 749.1+ @sv

Taidepuutyöt
type: Class
type: Concept
subclass of: URN:NBN:fi:au:hklj:760
alternative label: Esineet, taidepuutyöt (763 +)
alternative label: Intarsia, taidepuutyöt (763 +)
alternative label: Kaiverrukset, puuleikkaustaide (763 +)
alternative label: Koivu, taidepuutyöt (763 +)
alternative label: Kynttilänjalat, taideteollisuus, puu (763)
alternative label: Käsityöt, taidepuutyöt (763 +)
alternative label: Lampunvarjostimet, taideteollisuus (763)
alternative label: Lamput, taideteollisuus (763)
alternative label: Leikkaus, puuleikkaustaide (763)
alternative label: Lovileikkaus (763 +)
alternative label: Muotoilijat, eri alat (761 ... 768)
alternative label: Muotoilu, eri alat (761 ... 768)
alternative label: Puu, puuleikkaustaide (763)
alternative label: Puuesineet, puuleikkaustaide (763)
alternative label: Puulaadut, puuleikkaustaide (763)
alternative label: Puuleikkaukset (763)
alternative label: Puunleikkaus (763)
alternative label: Puunveisto, puuleikkaus (763)
alternative label: Puutyöt, taidekäsityö (763 +)
alternative label: Sisävalaistus, valaisimet, taideteollisuus (763)
alternative label: Taidepuutyöt (763 +)
alternative label: Upotuskoristelu, taidepuutyöt (763 +)
alternative label: Varjostimet, taideteollisuus (763)
alternative label: Veisto, puuleikkaus (763 +)
alternative label: Veistotaide, puuleikkaustaide (763 +)
alternative label: Bildhuggeri, träsnideri (763 +) @sv
alternative label: Björk, träarbeten, konst (763 +) @sv
alternative label: Formgivare, olika branscher (761 ... 768) @sv
alternative label: Formgivning, olika branscher (761 ... 768) @sv
alternative label: Föremål, träarbeten, konst (763 +) @sv
alternative label: Graveringar, träsnideri (763 +) @sv
alternative label: Handarbeten, träarbeten, konst (763 +) @sv
alternative label: Infattning, konstsnickeri (763 +) @sv
alternative label: Inomhusbelysning, belysningsanordningar, konstindustri (763) @sv
alternative label: Intarsia, konstsnickeri (763 +) @sv
alternative label: Kantskärning (763 +) @sv
alternative label: Lampor, konstindustri (763) @sv
alternative label: Lampskärmar, konstindustri (763) @sv
alternative label: Ljusstakar, konstindustri, trä (763) @sv
alternative label: Skärmar, konstindustri (763) @sv
alternative label: Slöjd, träsnideri (763 +) @sv
alternative label: Snideri, träsniderkonst (763) @sv
alternative label: Trä, träsnideri (763) @sv
alternative label: Träarbeten, konsthantverk (763 +) @sv
alternative label: Träföremål, träsnideri (763) @sv
alternative label: Träkonstvärk (763 +) @sv
alternative label: Träslag, träsnideri (763) @sv
broader: URN:NBN:fi:au:hklj:760
in scheme: URN:NBN:fi:au:hklj:
narrower: Huonekalutaide
notation: 763
related: Esineellinen kulttuuri
related: URN:NBN:fi:au:hklj:473
related: URN:NBN:fi:au:hklj:473.1
related: URN:NBN:fi:au:hklj:475
related: URN:NBN:fi:au:hklj:475.1
related: URN:NBN:fi:au:hklj:476
related: URN:NBN:fi:au:hklj:476.1
related: URN:NBN:fi:au:hklj:476.11
related: URN:NBN:fi:au:hklj:476.12
related: URN:NBN:fi:au:hklj:476.5
related: URN:NBN:fi:au:hklj:476.6
related: URN:NBN:fi:au:hklj:476.7
related: URN:NBN:fi:au:hklj:476.8
related: Puuteollisuus
related: Puutyö. Huonekalut. Verhoilu
related: Sisustusarkkitehtuuri
related: KUVANVEISTOTAIDE
related: URN:NBN:fi:au:hklj:730.9
related: Kuvanveistotaiteen materiaalit ja tekniikka
related: Taideteollisuuden teoria, estetiikka ja filosofia
related: Antiikkiesineiden keräily
related: Taideteollisuuden historia
related: Kulta- ja hopeasepäntaide. Korutaide
related: URN:NBN:fi:au:hklj:767
scope note: Taidepuutyöt, niiden historia, henkilöhistoria ja tuotteet sekä materiaalit, tekniikka ja estetiikka Puuleikkaustaide yleensä Puuesineet taideteollisuuden ja taidekäsityön kannalta
scope note: Konstsnickeri, dess historia, personhistoria och produktion samt material, tekniker och estetik Träsniderikonst i allmänhet Träföremål ur konstindustrins och konsthantverkets synvinkel @sv

Aasia
type: Class
type: Concept
subclass of: URN:NBN:fi:au:hklj:784
alternative label: Aasia, kansanmusiikki (784.2 +)
alternative label: Itämaat, kansanmusiikki (784.2 +)
alternative label: Asien, folkmusik (784.2 +) @sv
alternative label: Orienten, folkmusik (784.2 +) @sv
broader: URN:NBN:fi:au:hklj:784
in scheme: URN:NBN:fi:au:hklj:
narrower: Etu-Aasia
narrower: Etelä-Aasia
narrower: Kaakkois-Aasia
narrower: Keski- ja Itä-Aasia
notation: 784.2
preferred label: Asia @en
preferred label: Asien @sv
related: URN:NBN:fi:au:hklj:473.1
related: URN:NBN:fi:au:hklj:769
related: URN:NBN:fi:au:hklj:783
related: URN:NBN:fi:au:hklj:783.1
related: URN:NBN:fi:au:hklj:784.9
related: URN:NBN:fi:au:hklj:787
related: URN:NBN:fi:au:hklj:787.2
related: Itämaisten uskontojen musiikki
related: Islamilaisten uskonnollinen musiikki
related: URN:NBN:fi:au:hklj:787.29
related: URN:NBN:fi:au:hklj:788.8
related: URN:NBN:fi:au:hklj:789
related: Varhaiskansojen musiikki
related: URN:NBN:fi:au:hklj:795.1
related: URN:NBN:fi:au:hklj:797.2
related: URN:NBN:fi:au:hklj:807
scope note: Yleisteokset ja sekasisältöiset kokoelmat Tässä ja alaluokissa myös Aasian alkuperäiskansojen musiikki
scope note: Allmänna verk och samlingar med blandat innehåll Hit och till underklasserna också de asiatiska ursprungsfolkens musik @sv

Etu-Aasia
type: Class
type: Concept
subclass of: Aasia
alternative label: Arabialainen musiikki, kansanmusiikki, Aasia (784.21)
alternative label: Ghazal (784.21)
alternative label: Janitsaarimusiikki, perinnemusiikki, Turkki (784.21)
alternative label: Juutalaiset, etnomusiikki, Israel (784.21)
alternative label: Arabisk musik, folkmusik, Asien (784.21) @sv
alternative label: Janitsjarmusik, traditionell musik, Turkiet (784.21) @sv
alternative label: Judar, etnomusik, Israel (784.21) @sv
broader: Aasia
in scheme: URN:NBN:fi:au:hklj:
notation: 784.21
preferred label: South-West Asia @en
preferred label: Främre Asien @sv
related: URN:NBN:fi:au:hklj:473.1
related: URN:NBN:fi:au:hklj:769
related: URN:NBN:fi:au:hklj:783
related: URN:NBN:fi:au:hklj:783.1
related: URN:NBN:fi:au:hklj:784.9
related: Juutalaiset
related: URN:NBN:fi:au:hklj:787
related: URN:NBN:fi:au:hklj:787.2
related: Itämaisten uskontojen musiikki
related: Juutalaisten uskonnollinen musiikki
related: Islamilaisten uskonnollinen musiikki
related: URN:NBN:fi:au:hklj:787.29
related: URN:NBN:fi:au:hklj:788.8
related: URN:NBN:fi:au:hklj:789
related: Varhaiskansojen musiikki
related: URN:NBN:fi:au:hklj:795.1
related: URN:NBN:fi:au:hklj:797.2
related: URN:NBN:fi:au:hklj:807
scope note: Afganistan. Arabiemiirikunnat. Bahrain. Irak. Iran. Israel. Jemen. Jordania. Kuwait. Kypros. Libanon. Oman. Quatar. Saudi-Arabia. Syyria. Turkki Tässä myös Palestiina ja Kurdistan
scope note: Afghanistan. Bahrain. Cypern. Förenade Arabemiraten. Irak. Iran. Israel. Jordanien. Kuwait. Libanon. Oman. Qatar. Saudiarabien. Syrien. Turkiet. Yemen Hit också Palestina och Kurdistan @sv

GERMAANISTEN KIELTEN KIRJALLISUUDEN HISTORIA JA TUTKIMUS
type: Class
type: Concept
subclass of: URN:NBN:fi:au:hklj:800
alternative label: Biografiat, kirjailijat (810 ... 849)
alternative label: Edelläkävijät, kirjailijat (810 ... 849)
alternative label: Elämäkerrat, kirjailijat (810 ... 849)
alternative label: Elämänhistoria, henkilöhistoria, kirjailijat (810 ... 849)
alternative label: Esikoiskirjailijat, elämäkerrat ja muistelmat (810 ... 849)
alternative label: Esikoisteokset, elämäkerrat ja muistelmat (810 ... 849)
alternative label: Friisin kieli, kirjallisuudenhistoria (820)
alternative label: Haamukirjoittajat, kirjailijoiden henkilöhistoria (810 ... 849)
alternative label: Haastattelut, henkilöhistoria, kirjailijat (810 ... 849)
alternative label: Henkilöhistoria, kirjailijat (810 ... 849)
alternative label: Henkilökuvat, kirjailijat (810 ... 849)
alternative label: Henkilöt, kirjailijat (810 ... 849)
alternative label: Historia, henkilöhistoria, kirjailijat (810 ... 849)
alternative label: Julkisuuden henkilöt, kirjailijat (810 ... 849)
alternative label: Kansalliset suurmiehet, kirjailijat (810 ... 849)
alternative label: Kirjailijaryhmät (810 ... 849)
alternative label: Kirjailijat, elämäkerrat ja muistelmat (810 ... 849)
alternative label: Kirjallisuuspiirit, kirjailijaryhmät (810 ... 849)
alternative label: Kirjeet, kirjailijat (810 ... 849)
alternative label: Kirjoittajapiirit, kirjailijaryhmät, historia (810 ... 849)
alternative label: Kirjoittamaan oppiminen, kirjailijaryhmät, historia (810 ... 849)
alternative label: Kolumnistit, kirjailijat, elämäkerrat ja muistelmat (810 ... 849)
alternative label: Kääntäjät, elämäkerrat ja muistelmat (810 ... 849)
alternative label: Lapsuus, kirjailijat (810 ... 849)
alternative label: Lastenkirjailijat, elämäkerrat ja muistelmat (810 ... 849)
alternative label: Lukupiirit, kirjailijaryhmät (810 ... 849)
alternative label: Lyyrikot, elämäkerrat ja muistelmat (810 ... 849)
alternative label: Maahanmuuttajat, henkilöhistoria, kirjailijat (810 ... 849)
alternative label: Maanpako, henkilöhistoria, kirjailijat (810 ... 849)
alternative label: Merkkihenkilöt, kirjailijat (810 ... 849)
alternative label: Mielipidevangit, kirjailijat, elämäkerrat ja muistelmat (810 ... 849)
alternative label: Muistelmat, kirjailijat (810 ... 849)
alternative label: Muistokirjoitukset, kirjailijat (810 ... 849)
alternative label: Nekrologit, kirjailijat (810 ... 849)
alternative label: Nuortenkirjailijat, elämäkerrat ja muistelmat (810 ... 849)
alternative label: Näytelmäkirjailijat, elämäkerrat ja muistelmat (810 ... 849)
alternative label: Omaelämäkerrat, kirjailijat (810 ... 849)
alternative label: Pakinoitsijat, kirjailijat, elämäkerrat ja muistelmat (810 ... 849)
alternative label: Pakolaiset, henkilöhistoria, kirjailijat (810 ... 849)
alternative label: Professorit, kirjailijat (810 ... 849)
alternative label: Päiväkirjat, kirjailijat (810 ... 849)
alternative label: Rakkauskirjeet, kirjailijat (810 ... 849)
alternative label: Siirtolaiset, henkilöhistoria, kirjailijat (810 ... 849)
alternative label: Suurmiehet, kirjailijat (810 ... 849)
alternative label: Taiteilijaelämäkerrat, kirjailijat (810 ... 849)
alternative label: Taiteilijat, kirjailijat (810 ... 849)
alternative label: Uranuurtajat, kirjailijat (810 ... 849)
alternative label: Vaihtoehtohistoria, henkilöhistoria, kirjailijat (810 ... 849)
alternative label: Vaihtoehtoinen historia, henkilöhistoria, kirjailijat (810 ... 849)
alternative label: Alternativ historia, personhistoria, författare (810 ... 849) @sv
alternative label: Barnboksförfattare, biografier och memoarer (810 ... 849) @sv
alternative label: Barndom, författare (810 ... 849) @sv
alternative label: Bemärkta personer, författare (810 ... 849) @sv
alternative label: Biografier, författare (810 ... 849) @sv
alternative label: Bokcirklar, författargrupper (810 ... 849) @sv
alternative label: Brev, författare (810 ... 849) @sv
alternative label: Dagböcker, författare (810 ... 849) @sv
broader: URN:NBN:fi:au:hklj:800
in scheme: URN:NBN:fi:au:hklj:
narrower: Pohjoismaisten kielten kirjallisuuden historia ja tutkimus
narrower: Ruotsinkielisen kirjallisuuden historia ja tutkimus
narrower: Tanskankielisen kirjallisuuden historia ja tutkimus
narrower: Norjankielisen kirjallisuuden historia ja tutkimus
narrower: Islanninkielisen kirjallisuuden historia ja tutkimus
narrower: Saksankielisen kirjallisuuden historia ja tutkimus
narrower: Hollanninkielisen kirjallisuuden historia ja tutkimus
narrower: Englanninkielisen kirjallisuuden historia ja tutkimus
narrower: Amerikan englanninkielisen kirjallisuuden historia ja tutkimus
notation: 820
related: Symbolit. Koodit. Merkkijärjestelmät
related: Lasten- ja nuortenkirjallisuuden historia ja tutkimus
related: URN:NBN:fi:au:hklj:807
related: Yleinen kirjallisuudenhistoria
related: Vanha aika
related: Keskiaika
related: Uusi aika
related: Nykyaika

GERMAANISET, KELTTILÄISET, BALTTILAISET JA SLAAVILAISET KIELET
type: Class
type: Concept
subclass of: URN:NBN:fi:au:hklj:800
alternative label: Filologia (850 ... 899 +)
alternative label: Friisin kieli (870)
alternative label: Friisin kieli, kielitiede (870)
alternative label: Germaaniset kielet (870 ... 876)
alternative label: Gootin kieli (870)
alternative label: Indogermaaniset kielet, eri indogermaaniset kielet (870 ... 876)
alternative label: Itägermaaniset kielet (870)
alternative label: Filologi (850 ... 899 +) @sv
alternative label: Frisiska (870) @sv
alternative label: Frisiska, lingvistik (870) @sv
alternative label: Germanska språk (870 ... 876) @sv
alternative label: Gotiska (870) @sv
alternative label: Indogermanska språk, olika indogermanska språk (870 ... 876) @sv
alternative label: Östgermanska språk (870) @sv
broader: URN:NBN:fi:au:hklj:800
in scheme: URN:NBN:fi:au:hklj:
narrower: Pohjoismaiset kielet
narrower: Ruotsin kieli
narrower: Saksan kieli
narrower: Englannin kieli
narrower: Hollannin kieli
narrower: Kelttiläiset kielet
narrower: Balttilaiset kielet
narrower: Slaavilaiset kielet
notation: 870
preferred label: GERMANIC, CELTIC, BALTIC AND SLAVIC LANGUAGES @en
preferred label: GERMANSKA, KELTISKA, BALTISKA OCH SLAVISKA SPRÅK @sv
related: KIELITIEDE
related: Kielifilosofia
related: Kielipsykologia. Kielisosiologia. Kielipolitiikka
related: Monikieliset sanakirjat. Sivistyssanakirjat
related: Kielioppi. Muoto-oppi. Sanaoppi. Semantiikka
related: Äänneoppi
related: Etymologia. Onomastiikka
related: URN:NBN:fi:au:hklj:860
scope note: Teokset, jotka koskevat sekä germaanisia että kelttiläisiä, balttilaisia tai slaavilaisia kieliä Germaaniset kielet yleensä Friisin kieli
scope note: Verk som handlar om såväl germanska som keltiska, baltiska eller slaviska språk Germanska språk i allmänhet Frisiska @sv

Entisen Jugoslavian alueen historia
type: Class
type: Concept
subclass of: URN:NBN:fi:au:hklj:979
alternative label: Jugoslavian alue, historia (979.5 +)
alternative label: Kroatia, historia (979.5)
alternative label: Jugoslaviens område, historia (979.5 +) @sv
alternative label: Kroatien, historia (979.5) @sv
broader: URN:NBN:fi:au:hklj:979
in scheme: URN:NBN:fi:au:hklj:
narrower: Slovenian historia
narrower: Kroatian historia
narrower: Bosnian ja Hertsegovinan historia
narrower: Serbian historia
narrower: Makedonian historia
narrower: Montenegron historia
narrower: Kosovon historia
notation: 979.5
preferred label: History of the former Yugoslavian region @en
preferred label: Det före detta jugoslaviska områdets historia @sv
related: Etelä-Eurooppa
related: Pyreneiden niemimaa
related: Entisen Jugoslavian alue
related: Slovenia
related: Kroatia
related: Bosnia ja Hertsegovina
related: Serbia
related: Makedonia, EJTM
related: Montenegro
related: Kosovo
related: URN:NBN:fi:au:hklj:909
related: URN:NBN:fi:au:hklj:919
scope note: Jugoslavian alueen historian yleisteokset
scope note: Allmänna verk om det jugoslaviska områdets historia @sv

Lapsuuden ja nuoruuden psykologia
type: Class
type: Concept
subclass of: URN:NBN:fi:au:hklj:120
alternative label: Adoptiolapset, lapsi-ja nuorisopsykologia (127)
alternative label: Ainoa lapsi, psykologia (127)
alternative label: Avioerolapset, lapsuuden psykologia (127)
alternative label: Eettinen kehitys, lapsuuden ja nuoruuden psykologia (127)
alternative label: Elämänodotukset, lapsuuden ja nuoruuden (127)
alternative label: Emotionaalinen kehitys, lapsuuden psykologia (127)
alternative label: Emotionaalinen kehitys, nuoruuden psykologia (127)
alternative label: Esikouluikäiset, psyykkinen kehitys (127)
alternative label: Esikuvat, lapsi- ja nuorisopsykologia (127)
alternative label: Esimurrosikä (127)
alternative label: Esimurrosikä, nuorisopsykologia (127)
alternative label: Esipuberteetti (127)
alternative label: Esipuberteetti, nuorisopsykologia (127)
alternative label: Henkinen kehitys, lapsuuden psykologia (127)
alternative label: Henkinen kehitys, nuoruuden psykologia (127)
alternative label: Hyperaktiivisuus, lapsuuden ja nuoruuden psykologia (127)
alternative label: Ikäkaudet, lapsuuden psykologia (127)
alternative label: Ikäkaudet, nuoruuden psykologia (127)
alternative label: Ikäkausien psykologia, lapsuuden psykologia (127)
alternative label: Ikäkausien psykologia, nuoruuden psykologia (127)
alternative label: Ikäluokat, lapsuuden psykologia (127)
alternative label: Ikäluokat, nuoruuden psykologia (127)
alternative label: Ikäryhmät, lapsuuden psykologia (127)
alternative label: Ikäryhmät, nuoruuden psykologia (127)
alternative label: Isättömyys, lapsi- ja nuorisopsykologia (127)
alternative label: Itku, lapsipsykologia (127)
alternative label: Kasvuympäristö, lapsuuden psykologia (127)
alternative label: Kehityshäiriöt, lapsi- ja nuorisopsykologia (127)
alternative label: Kehityspsykologia, lapsi- ja nuorisopsykologia (127)
alternative label: Kouluikäiset, psykologia (127)
alternative label: Koululaiset, psykologia (127)
alternative label: Lapsen kehitys, kehityspsykologia (127)
alternative label: Lapset, kehityspsykologia (127)
alternative label: Lapset, psykologia (127)
alternative label: Lapsipsykologia (127)
alternative label: Lapsipsykologiset testit (127)
alternative label: Lapsuuden psykologia (127)
alternative label: Lasten kehitys, kehityspsykologia (127)
alternative label: Leikit, lapsuuden psykologia (127)
alternative label: Leikki, lapsuuden psykologia (127)
alternative label: Leikki-ikäiset, lapsuuden psykologia (127)
alternative label: Leikkiteoriat, lapsuuden psykologia (127)
alternative label: Mielikuvitusleikit, lapsipsykologia (127)
alternative label: Moraalikehitys, lapsi- ja nuorisopsykologia (127)
alternative label: Murrosikä (127)
broader: URN:NBN:fi:au:hklj:120
in scheme: URN:NBN:fi:au:hklj:
notation: 127
related: Psyyken rakenne ja toiminnot
related: Ajattelu. Älykkyys. Mielikuvitus
related: Tunne- ja tahtotoiminnot
related: Oppimisen psykologia
related: Havaintopsykologia
related: Tiedostamaton sielunelämä
related: Uni
related: Alitajunta
related: Hypnoosi. Suggestio
related: Psykologian suunnat
related: Differentiaalipsykologia. Persoonallisuuden psykologia
related: Psychology of expression {@en
related: Muita psykologian aloja
related: Kehityspsykologia. Eri ikäkausien psykologia
related: Naisen ja miehen psykologia
related: Kasvatuspsykologia
related: Käytännön kasvatus
related: Kokeellinen kasvatus
related: Perhe- ja kotikasvatus
related: URN:NBN:fi:au:hklj:181.7
related: Lastenhoito
related: Seksologia
related: Lapsi- ja nuorisopsykiatria
related: URN:NBN:fi:au:hklj:618.86
related: Leikit
related: Leikkikalut
related: URN:NBN:fi:au:hklj:797.2
scope note: Lapsen ja nuoren psyykkiset kehitysvaiheet Lapsen ja nuoren minäkuvan ja persoonallisuuden muodostuminen Varhaislapsuuden, murrosiän, aikuistumisen ja itsenäistymisen psykologia Leikki lapsipsykologian kannalta Tässä myös lapsi- ja nuorisopsykologiset testit Jos lapsi- tai nuorisopsykologinen teos koskee jotakin psykologian erikoisalaa, on etusija alan mukaisella luokalla Jos teoksessa on sekä lapsipsykologiaa että kasvatuspsykologiaa tai käytännön kasvatusohjeita, on etusija luokilla 180.2 ja 181+
scope note: De psykiska utvecklingsfaserna hos barn och unga Utformningen av jagföreställningen och personligheten hos barn och unga Den tidiga barndomens och pubertetens psykologi. Psykologiska aspekter på att bli vuxen och självständig Lekar ur barnpsykologisk synvinkel Hit också barn- och ungdomspsykologiska test Om ett barn- eller ungdomspsykologiskt verk rör ett specialområde inom psykologin ges företräde åt klassen för specialområdet Om verket rör både barn- och ungdomspsykologi och praktiska uppfostringsråd ges företräde åt klasserna 180.2 och 181+ @sv

Keskiasteen koulutus
type: Class
type: Concept
subclass of: URN:NBN:fi:au:hklj:183
alternative label: Ammatillinen koulutus (183.6)
alternative label: Ammatillinen koulutus, keskiasteen koulutus (183.6)
alternative label: Ammatillinen lisäkoulutus (183.6)
alternative label: Ammatillinen lisäkoulutus, keskiasteen koulutus (183.6)
alternative label: Ammatillinen peruskoulutus (183.6)
alternative label: Ammatillinen peruskoulutus, keskiasteen koulutus (183.6)
alternative label: Ammatilliset erityisoppilaitokset (183.6)
alternative label: Ammatilliset erityisoppilaitokset, keskiasteen koulutus (183.6)
alternative label: Ammatilliset oppilaitokset (183.6)
alternative label: Ammatilliset oppilaitokset, keskiasteen koulutus (183.6)
alternative label: Ammatilliset perustutkinnot (183.6)
alternative label: Ammatilliset perustutkinnot, keskiasteen koulutus (183.6)
alternative label: Ammatilliset tutkinnot (183.6)
alternative label: Ammatilliset tutkinnot, keskiasteen koulutus (183.6)
alternative label: Ammattikasvatus (183.6)
alternative label: Ammattikoulujen opettajaopistot (183.6)
alternative label: Ammattikoululaiset (183.6)
alternative label: Ammattikoulut (183.6)
alternative label: Ammattikoulut, keskiasteen koulutus (183.6)
alternative label: Ammattikoulutus (183.6)
alternative label: Ammattikoulutus, keskiaisteen koulutus (183.6)
alternative label: Ammattiopettajat, ammattikoulutus (183.6)
alternative label: Ammattiopetus (183.6)
alternative label: Ammattiopetus, keskiasteen koulutus (183.6)
alternative label: Ammattiopinnot (183.6)
alternative label: Ammattiopistot (183.6)
alternative label: Ammattiopistot, keskiasteen koulutus (183.6)
alternative label: Ammattioppilaitokset (183.6)
alternative label: Ammattioppilaitokset, keskiasteen koulutus (183.6)
alternative label: Ammattitaitokilpailut, ammatillinen koulutus (183.6)
alternative label: Ammattitutkinnot (183.6)
alternative label: Diplomityöt, ammatillinen koulutus (183.6 +)
alternative label: Erikoisammattitutkinnot, ammatilliset tutkinnot (183.6)
alternative label: HOSP, ammatillinen koulutus (183.6)
alternative label: HOSP, keskiasteen koulutus (183.6)
alternative label: Harjoittelu, ammattiopinnot (183.6)
alternative label: Harjoittelupaikat, ammattiopinnot (183.6)
alternative label: Henkilökohtainen opetussuunnitelma, ammatillinen koulutus (183.6)
alternative label: Henkilökohtainen opetussuunnitelma, keskiasteen koulutus (183.6)
alternative label: Henkilökohtainen opinto-ohjelma, ammatillinen koulutus (183.6)
alternative label: Henkilökohtainen opinto-ohjelma, keskiasteen koulutus (183.6)
alternative label: Henkilökohtainen opintosuunnitelma, ammatillinen koulutus (183.6)
alternative label: Henkilökohtainen opintosuunnitelma, keskiasteen koulutus (183.6)
alternative label: Henkilökohtainen opiskeluohjelma, ammatillinen koulutus (183.6)
alternative label: Henkilökohtainen opiskeluohjelma, keskiasteen koulutus (183.6)
alternative label: Henkilökohtainen opiskelusuunnitelma, ammatillinen koulutus (183.6)
broader: URN:NBN:fi:au:hklj:183
in scheme: URN:NBN:fi:au:hklj:
notation: 183.6
related: URN:NBN:fi:au:hklj:181.7
related: URN:NBN:fi:au:hklj:182
related: URN:NBN:fi:au:hklj:183.5
related: URN:NBN:fi:au:hklj:183.7
related: URN:NBN:fi:au:hklj:184
related: URN:NBN:fi:au:hklj:185
related: Kansalais-, kansan- ja työväenopistot. Kansankorkeakoulut
related: Opintokerhotoiminta
related: Muut yleisen sivistystyön muodot
related: Nuorisotyö
related: URN:NBN:fi:au:hklj:186.303
related: URN:NBN:fi:au:hklj:186.309
related: Ammatinvalinta
related: Oppikirjat. Oppaat. Harjoituskirjat. Tehtäväkokoelmat
related: URN:NBN:fi:au:hklj:330
related: Asiakirjakaavat ja -ohjeet. Oikeusoppaat
related: URN:NBN:fi:au:hklj:340
related: URN:NBN:fi:au:hklj:345
related: URN:NBN:fi:au:hklj:617.74
related: URN:NBN:fi:au:hklj:620
related: URN:NBN:fi:au:hklj:651
related: LIIKETALOUS. KAUPPA. MARKKINOINTI. LIIKENNEOPETUS
related: Hotelli- ja ravintolatalous
related: Taideopinnot
related: MUSIIKKI
related: Liikunta. Urheilu
scope note: Keskiasteen koulutus yleensä. Ammatillinen koulutus yleensä Ammattikoulut, opistotasoiset oppilaitokset sekä oppisopimuskoulutus yleensä Erikoisalojen ammatillinen opetus ja oppilaitokset alan mukaisessa luokassa
scope note: Mellanstadieutbildning i allmänhet. Yrkesutbildning i allmänhet Yrkesskolor, läroinrättningar på institutnivå samt utbildning genom läroavtal Yrkesutbildning som rör specialområden klassificeras enligt område @sv

Erikoiskoulut. Kokeilukoulut
type: Class
type: Concept
subclass of: URN:NBN:fi:au:hklj:183
alternative label: Erityiskoulut, montessori-, steiner-, waldorf- ja freinet-koulut (183.8)
alternative label: Freinet-koulut (183.8)
alternative label: Freinet-pedagogiikka (183.8)
alternative label: Kokeellinen kasvatusoppi, kokeilukoulut (183.8)
alternative label: Kokeellinen pedagogiikka, kokeilukoulut (183.8)
alternative label: Kokeilukoulut (183.8)
alternative label: Koulukokeilu, kokeilukoulut (183.8)
alternative label: Kristilliset koulut (183.8)
alternative label: Montessori-menetelmä (183.8)
alternative label: Montessori-pedagogiikka (183.8)
alternative label: Montessorikoulut (183.8)
alternative label: Reggio Emilia -pedagogiikka (183.8)
alternative label: Steiner-koulut (183.8)
alternative label: Steiner-pedagogiikka (183.8)
alternative label: Steinerpedagogiikka (183.8)
alternative label: Summerhill, koulu (183.8)
alternative label: Waldorf-koulut (183.8)
alternative label: Waldorf-pedagogiikka (183.8)
alternative label: Waldorfkoulut (183.8)
alternative label: Waldorfpedagogiikka (183.8)
alternative label: Experimentell pedagogik, försöksskolor (183.8) @sv
alternative label: Experimentell uppfostringslära, försöksskolor (183.8) @sv
alternative label: Freinetpedagogik (183.8) @sv
alternative label: Freinetskolor (183.8) @sv
alternative label: Försöksskolor (183.8) @sv
alternative label: Kristliga skolor (183.8) @sv
alternative label: Kristna skolor (183.8) @sv
alternative label: Montessorimetoden (183.8) @sv
alternative label: Montessoripedagogik (183.8) @sv
alternative label: Montessoriskolor (183.8) @sv
alternative label: Reggio Emilia-pedagogik (183.8) @sv
alternative label: Skolförsök, försöksskolor (183.8) @sv
alternative label: Specialskolor, Montessori-, Steiner-, Waldorf- och Freinetskolor (183.8) @sv
alternative label: Steinerpedagogik (183.8) @sv
alternative label: Steinerskolor (183.8) @sv
alternative label: Summerhill, skola (183.8) @sv
alternative label: Waldorfpedagogik (183.8) @sv
alternative label: Waldorfskolor (183.8) @sv
broader: URN:NBN:fi:au:hklj:183
in scheme: URN:NBN:fi:au:hklj:
notation: 183.8
preferred label: Special schools. Experimental schools @en
preferred label: Specialskolor. Experimentskolor @sv
related: Kokeellinen kasvatus
related: URN:NBN:fi:au:hklj:181.7
related: URN:NBN:fi:au:hklj:181.9
related: URN:NBN:fi:au:hklj:182
related: Filosofian ja psykologian opetusoppi
related: Uskonnon opetusoppi
related: Yhteiskuntatieteiden opetusoppi
related: Maantieteen ja kansatieteen opetusoppi
related: Matematiikan ja luonnontieteiden opetusoppi
related: Sovellettujen tieteiden opetusoppi
related: Taideaineiden opetusoppi
related: Musiikin opetusoppi
related: Liikunnan ja urheilun opetusoppi
related: Kirjallisuuden ja kielten opetusoppi
related: Historian opetusoppi
related: URN:NBN:fi:au:hklj:183.5
related: URN:NBN:fi:au:hklj:183.7
related: URN:NBN:fi:au:hklj:183.803
related: URN:NBN:fi:au:hklj:183.809
related: Muiden maiden koululaitokset
related: URN:NBN:fi:au:hklj:184
related: Antroposofia
related: Oppikirjat. Oppaat. Harjoituskirjat. Tehtäväkokoelmat
related: URN:NBN:fi:au:hklj:330
related: Asiakirjakaavat ja -ohjeet. Oikeusoppaat
related: URN:NBN:fi:au:hklj:340
related: URN:NBN:fi:au:hklj:345
scope note: Suomen ja muiden maiden erikoiskoulut ja niihin liittyvä pedagogiikka Tässä esim. montessori-, steiner-, waldorf- ja freinet-koulut sekä montessori-, steiner-, waldorf- ja freinet-pedagogiikka
scope note: Specialskolor och deras pedagogik i Finland och övriga länder Hit t.ex. Montessori-, Steiner-, Waldorf- och Freinetskolor samt Montessori-, Steiner-, Waldorf och Freinetpedagogik @sv

Suomen ulkopolitiikka
type: Class
type: Concept
subclass of: URN:NBN:fi:au:hklj:325
alternative label: Diplomaattisuhteet, Suomi (325.1)
alternative label: Idänsuhteet, Suomen ulkopolitiikka (325.1)
alternative label: Kansainvälinen politiikka, ulko- ja turvallisuuspolitiikka, Suomi (325.1)
alternative label: Maailmanpolitiikka, ulko- ja turvallisuuspolitiikka, Suomi (325.1)
alternative label: Sotapolitiikka, ulko- ja turvallisuuspolitiikka, Suomi (325.1)
alternative label: Suomettuminen, Suomen ulkopolitiikka (325.1)
alternative label: Suomi, ulkopolitiikka (325.1)
alternative label: Turvallisuuspolitiikka, turvallisuuspolitiikka, Suomi (325.1)
alternative label: Ulkopolitiikka, ulkopolitiikka, Suomi (325.1)
alternative label: Diplomatiska förbindelser, Finland (325.1) @sv
alternative label: Finland, utrikespolitik (325.1) @sv
alternative label: Finlandisering, Finlands utrikespolitik (325.1) @sv
alternative label: Internationell politik, utrikes- och säkerhetspolitik, Finland (325.1) @sv
alternative label: Krigspolitik, utrikes- och säkerhetspolitik, Finland (325.1) @sv
alternative label: Säkerhetspolitik, säkerhetspolitik, Finland (325.1) @sv
alternative label: Utrikespolitik, utrikespolitik, Finland (325.1) @sv
alternative label: Världspolitik, utrikes- och säkerhetspolitik, Finland (325.1) @sv
alternative label: Östrelationer, Finlands utrikespolitik (325.1) @sv
broader: URN:NBN:fi:au:hklj:325
in scheme: URN:NBN:fi:au:hklj:
notation: 325.1
preferred label: Finland's foreign policy @en
preferred label: Finlands utrikespolitik @sv
related: Sisäpolitiikka. Puolueet
related: Suomi
related: Kansainvälinen yhteistyö
related: URN:NBN:fi:au:hklj:326.2
related: Muiden maanosien valtioiden keskinäinen yhteistyö
related: Yhdistyneet Kansakunnat
related: Rauhankysymys. Rauhantutkimus
related: Suomen ulkomaankauppa
related: Maailmankauppa. Kansainväliset talousjärjestöt
related: URN:NBN:fi:au:hklj:390
related: Asevarustelu. Asekauppa
related: Suomen puolustusvoimat
related: Muiden maiden puolustusvoimat
related: Diplomatiikka
related: URN:NBN:fi:au:hklj:920
related: Esi- ja varhaishistoria vuoteen 1154
related: Keskiaika 1155-1522
related: Reformaation aika 1523-1617
related: Ruotsin suurvalta-aika 1618-1721
related: Vapauden aika ja kustavilainen aika 1722-1809
related: Autonomian aika 1810-1917
related: Itsenäisyyden aika 1917-1938
related: Vuoden 1918 sota
related: Itsenäisyyden aika 1939-
related: Sodat 1939-1945
related: URN:NBN:fi:au:hklj:929
related: Helsinki. Pääkaupunkiseutu
scope note: Suomen ulko- ja turvallisuuspolitiikka Suomen asema kansainvälisessä politiikassa Suomen puolueettomuus- ja liittoutumattomuuspolitiikka Suomen suhteet sotilas- ja valtioliittoihin Suomen harjoittama diplomatia. Suomen suurlähetystöt ja konsulaatit Jos teos koskee sekä Suomen sisä- että ulkopolitiikkaa, on etusija luokalla 324.1 Jos teos koskee sekä Suomen ulko- tai turvallisuuspolitiikkaa, että Suomen harjoittamaa muuta kansainvälistä yhteistyötä, on etusija luokalla 326+
scope note: Finlands utrikes- och säkerhetspolitik Finlands ställning i den internationella politiken Finlands neutralitetspolitik och alliansfrihetspolitik Finlands förhållande till militärallianser och statsförbund Finlands diplomatiska verksamhet. Finlands ambassader och konsulat Om verket handlar om både inrikes- och utrikespolitik ges företräde åt klassen 324.1 Om verket handlar om Finlands utrikes- och säkerhetspolitik samt om annat internationellt samarbete som Finland bedriver, ges företräde åt klasserna 326+ @sv

Kauppaoikeus. Yhtiölainsäädäntö. Pankki- ja vakuutuslainsäädäntö
type: Class
type: Concept
subclass of: Siviili- ja kauppaoikeus. Sopimusoikeus
alternative label: Asunto-osakeyhtiöt, yhtiölainsäädäntö (333.4)
alternative label: Avoimet yhtiöt, lainsäädäntö (333.4)
alternative label: CE-merkintä, lainsäädäntö (333.4)
alternative label: Erikoistuomioistuimet, markkinatuomioistuin (333.4)
alternative label: Eurooppa-yhtiöt, yhtiölainsäädäntö (333.4)
alternative label: Eurooppalaiset osakeyhtiöt, yhtiölainsäädäntö (333.4)
alternative label: Eurooppayhtiöt, yhtiölainsäädäntö (333.4)
alternative label: Fuusiot, yhtiölainsäädäntö (333.4)
alternative label: Henkilöyhtiöt (333.4)
alternative label: Holdingyhtiöt, lainsäädäntö (333.4)
alternative label: Huutokauppa, kauppaoikeus (333.4)
alternative label: Ilmoitusvelvollisuus, kauppaoikeus (333.4)
alternative label: Irtaimen kauppa, lainsäädäntö (333.4)
alternative label: Irtaimisto, irtaimen kauppa (333.4)
alternative label: Joint venture, yhtiölainsäädäntö (333.4)
alternative label: Julkiset kaupanvahvistajat, kauppaoikeus (333.4)
alternative label: Julkiset osakeyhtiöt, yhtiölainsäädäntö (333.4)
alternative label: Jälleenvakuutus, lainsäädäntö (333.4)
alternative label: Kansainvälinen kauppaoikeus, Euroopan unioni (333.4)
alternative label: Kansainvälinen markkinaoikeus, Euroopan unioni (333.4)
alternative label: Kaupanvahvistajat, kauppaoikeus (333.4)
alternative label: Kauppaoikeus (333.4)
alternative label: Kaupparekisterit (333.4)
alternative label: Keinohedelmöitys, lainsäädäntö (333.4)
alternative label: Keskeytysvakuutus, lainsäädäntö (333.4)
alternative label: Kiinteistöosakeyhtiöt, yhtiöoikeus (333.4)
alternative label: Kilpailu, kilpailuoikeus (333.4)
alternative label: Kilpailunrajoitukset, kilpailuoikeus (333.4)
alternative label: Kilpailuoikeus (333.4)
alternative label: Kilpailurajoitukset, kilpailuoikeus (333.4)
alternative label: Kirjanpito, lainsäädäntö (333.4)
alternative label: Kirjanpitolainsäädäntö (333.4)
alternative label: Kommandiittiyhtiöt (333.4)
alternative label: Konsernit, yhtiölainsäädäntö (333.4)
alternative label: Konvertointi, pankkilainsäädäntö (333.4)
alternative label: Korvausvastuu, vakuutusoikeus (333.4)
alternative label: Kotivakuutus, vakuutuslainsäädäntö (333.4)
alternative label: Kuljetusluvat (333.4)
alternative label: Kuljetusoikeus (333.4)
alternative label: Kuluttaja-asiamiehet, lainsäädäntö (333.4)
alternative label: Kuluttajansuoja, lainsäädäntö (333.4)
alternative label: Kuluttajaoikeus (333.4)
alternative label: Kuluttajariidat, lainsäädäntö (333.4)
alternative label: Kuluttajasuoja, lainsäädäntö (333.4)
alternative label: Kunnalliset osakeyhtiöt, yhtiölainsäädäntö (333.4)
alternative label: Lainhuudatus (333.4)
alternative label: Lainhuutorekisterit (333.4)
alternative label: Liikennevakuutus, lainsäädäntö (333.4)
alternative label: Liiketoimintasiirto, yhtiölainsäädäntö (333.4)
broader: Siviili- ja kauppaoikeus. Sopimusoikeus
in scheme: URN:NBN:fi:au:hklj:
notation: 333.4
related: URN:NBN:fi:au:hklj:326.2
related: URN:NBN:fi:au:hklj:332.1
related: URN:NBN:fi:au:hklj:332.22
related: Esine- ja velvoiteoikeus. Immateriaalioikeudet. Huoneen- ja maanvuokralainsäädäntö
related: Kansainvälinen oikeus
related: Suomen ja Euroopan Unionin laki- ja asetuskokoelmat
related: Muiden maiden lait
related: Raha. Valuutta. Pankit. Pörssit
related: Osuustoiminta
related: Elintaso. Kulutus
related: Vakuutustoimi
related: Sosiaalivakuutus
related: LIIKETALOUS. KAUPPA. MARKKINOINTI. LIIKENNEOPETUS
related: Tavaraoppi
related: Liiketalouden hallinto ja organisaatio
related: URN:NBN:fi:au:hklj:675
related: Liiketaloudellinen kirjanpito ja tilintarkastus
related: Kauppakirjeenvaihto
related: Kauppamatematiikka
related: Materiaalitoiminnot. Logistiikka
related: Markkinointi. Asiakaspalvelu
related: Mainonta
related: Kuluttajanvalistus
scope note: Kauppaoikeuden yleisteokset. Markkinaoikeus. Markkinatuomioistuin. Kilpailuoikeus. Kaupparekisteri. Tavaramerkki- ja toiminimilainsäädäntö. Prokura Elinkeinonharjoittajan ja kuluttajan välistä kauppaa koskeva lainsäädäntö Irtaimen kauppaa ja osamaksukauppaa koskeva lainsäädäntö Kuluttajansuojalainsäädäntö. Tuotevastuu- ja tuoteturvallisuuslainsäädäntö Yhtiölainsäädäntö. Yhtiöoikeus. Yhtiökokous. Osake-, asunto-, henkilö-, kommandiitti- ja avoimia yhtiöitä sekä osuuskuntia koskeva lainsäädäntö Kirjanpitolainsäädäntö. Tilintarkastuslainsäädäntö Pankki- ja vakuutuslainsäädäntö. Vekseli- ja sekkioikeus Liikennevakuutuslainsäädäntö. Kuljetusoikeus Jos teoksessa on sekä siviili- että kauppaoikeutta, on etusija luokalla 333
scope note: Allmänna verk som rör handelsrätt. Marknadsrätt. Marknadsdomstolen. Konkurrenslagstiftning. Handelsregistret. Lagstiftning om varumärken och firmalagstiftning. Prokura Lagstiftning om köp mellan näringsidkare och konsument Lagstiftning om köp av lös egendom och om avbetalningsköp Konsumentskyddslagstiftning. Lagstiftning om produktansvar och produktsäkerhet Bolagslagstiftning. Bolagsrätt. Bolagsstämma. Lagstiftning om aktiebolag, bostadsaktiebolag, personbolag, kommanditbolag, öppna bolag och andelslag Bokförings- och revisionslagstiftning Bank- och försäkringslagstiftning. Växel- och checkrätt Trafikförsäkringslagstiftning. Transporträtt Om verket handlar om både civil- och handelsrätt ges företräde åt klass 333 @sv

Muiden maiden lait
type: Class
type: Concept
subclass of: URN:NBN:fi:au:hklj:330
alternative label: Asetukset, muut maat, myös yksittäiset (338)
alternative label: Islamilainen laki, lainsäädäntö (338)
alternative label: Islamilainen oikeus, lainsäädäntö (338)
alternative label: Islamilainen oikeusjärjestys, lainsäädäntö (338)
alternative label: Islamin laki, lainsäädäntö (338)
alternative label: Islamismi, islamilainen oikeusjärjestys, lainsäädäntö (338)
alternative label: Kansallinen oikeus, muiden maiden lakikokoelmat (338)
alternative label: Kommentaarit, lakien kommentaarit (332 ... 338)
alternative label: Kuolemanrangaistus, muiden maiden lait (338)
alternative label: Kuolemantuomio, muiden maiden lait (338)
alternative label: Lakikirjat, muiden maiden lait (338)
alternative label: Lakikokoelmat, muiden maiden lait (338)
alternative label: Oikeusistuimet, muiden maiden (338)
alternative label: Perustuslainmukaisuus, muut maat (338)
alternative label: Perustuslait, muut maat (338)
alternative label: Poliittinen islam, islamilainen oikeusjärjestys, lainsäädäntö (338)
alternative label: Saria, lainsäädäntö (338)
alternative label: Sharia, lainsäädäntö (338)
alternative label: Tuomioistuimet, muiden maiden (338)
alternative label: Valamiehet, muiden maiden oikeuslaitos (338)
alternative label: Valtionsisäinen oikeus, muiden maiden lakikokoelmat (338)
alternative label: Domstolar, övriga länders (338) @sv
alternative label: Dödsdom, övriga länders lagar (338) @sv
alternative label: Dödsstraff, övriga länders lagar (338) @sv
alternative label: Förordningar, övriga länder, även enskilda (338) @sv
alternative label: Grundlagar, övriga länder (338) @sv
alternative label: Grundlagsenlighet, övriga länder (338) @sv
alternative label: Inomstatlig rätt, lagsamlingar, övriga länder (338) @sv
alternative label: Islamisk lag, lagstiftning (338) @sv
alternative label: Islamisk rättsordning, lagstiftning (338) @sv
alternative label: Islamism, islamisk rättsordning, lagstiftning (338) @sv
alternative label: Islamsk rättspraxis, lagstiftning (338) @sv
alternative label: Jurymedlemmar, övriga länders rättsväsen (338) @sv
alternative label: Kommentarer, lagkommentarer (332 ... 338) @sv
alternative label: Lagböcker, övriga länders lagar (338) @sv
alternative label: Lagsamlingar, övriga länders lagar (338) @sv
alternative label: Nationell rätt, övriga länders lagsamlingar (338) @sv
alternative label: Politisk islam, islamisk rättsordning, lagstiftning (338) @sv
alternative label: Saria, lagstiftning (338) @sv
alternative label: Sharia, lagstiftning (338) @sv
broader: URN:NBN:fi:au:hklj:330
in scheme: URN:NBN:fi:au:hklj:
notation: 338
preferred label: Other countries' laws @en
preferred label: Andra länders lagar @sv
related: URN:NBN:fi:au:hklj:326.2
related: Muiden maiden valtiojärjestelmät
related: Julkisoikeus
related: URN:NBN:fi:au:hklj:332.1
related: URN:NBN:fi:au:hklj:332.2
related: Asemakaava- ja rakentamislainsäädäntö
related: URN:NBN:fi:au:hklj:332.22
related: Vero-oikeus
related: Rikosoikeus
related: Prosessioikeus. Oikeushallinto
related: Vankeinhoito. Vankilat
related: Siviili- ja kauppaoikeus. Sopimusoikeus
related: Esine- ja velvoiteoikeus. Immateriaalioikeudet. Huoneen- ja maanvuokralainsäädäntö
related: Perhe- ja holhousoikeus
related: Perintö- ja testamenttioikeus
related: Kauppaoikeus. Yhtiölainsäädäntö. Pankki- ja vakuutuslainsäädäntö
related: Ympäristöoikeus. Talousoikeus
related: Merioikeus
related: Maaoikeus
related: Vesioikeus
related: Maa- ja metsätalouslainsäädäntö
related: Työoikeus
related: Kansainvälinen oikeus
related: Suomen ja Euroopan Unionin laki- ja asetuskokoelmat
related: URN:NBN:fi:au:hklj:338.05
related: Muiden maiden puolustusvoimat
scope note: Muiden maiden lait ja asetukset, myös erikoisaloja koskeva lainsäädäntö sekä laki- ja asetuskokoelmat Muiden maiden oikeuslaitokset ja -järjestelmät
scope note: Andra länders lagar och författningar, också lagstiftning samt lag- och författningssamlingar som rör specialområden Andra länders rättsväsen och rättssystem @sv

Suomen valtionhallinto
type: Class
type: Concept
subclass of: URN:NBN:fi:au:hklj:340
alternative label: Ajoneuvorekisterit (347)
alternative label: Aloitteet, hallinto, valtion (347)
alternative label: Alueelliset palveluyksiköt, valtionhallinto (347)
alternative label: Aluehallinto, valtion, Suomi (347)
alternative label: Aluehallintovirastot, valtionhallinto (347)
alternative label: ELY-keskukset, valtionhallinto (347)
alternative label: ELYt, valtionhallinto (347)
alternative label: Elinkeino-, liikenne- ja ympäristökeskukset, valtionhallinto (347)
alternative label: Elinkeinohallinto, valtionhallinto (347)
alternative label: Esittely, valtionhallinto (347)
alternative label: Esteellisyys, valtionhallinto (347)
alternative label: Esteettömyys, valtionhallinto (347)
alternative label: Esteettömyystodistukset, valtionhallinto (347)
alternative label: Hallinnolliset palvelut, valtionhallinto, Suomi (347)
alternative label: Hallinto, valtionhallinto, Suomi (347)
alternative label: Hallintopalvelut, valtionhallinto, Suomi (347)
alternative label: Hallintopäätökset, valtionhallinto (347)
alternative label: Henkikirjat, Väestörekisterikeskus (347)
alternative label: Henkilörekisterit, väestörekisterikeskus (347)
alternative label: Henkilötiedot, henkilötekisterit (347)
alternative label: Jonot, valtiolliset palvelut (347)
alternative label: Julkinen hallinto, valtionhallinto (347)
alternative label: Julkiset palvelut, valtion (347 ... 348)
alternative label: Julkishallinto, valtionhallinto (347)
alternative label: Julkishyödykkeet, valtion (347 ... 348)
alternative label: Julkisyhteisöt, valtio (347)
alternative label: Jääviys, valtionhallinto (347)
alternative label: Kasvontunnistus, henkilöllisyys (347)
alternative label: Keskipitkän aikavälin suunnittelu, valtio (347)
alternative label: Keskushallinto, Suomi (347)
alternative label: Keskusvirastot, Suomi (347)
alternative label: Kiertokirjeet, valtionhallinto (347)
alternative label: Kihlakunnanvirastot (347)
alternative label: Kihlakunnat (347)
alternative label: Konttorit, valtionhallinto (347)
alternative label: Kotipaikka (347)
alternative label: Kotipaikkarekisterit (347)
alternative label: Kuntapalvelut, valtion (347 ... 348)
alternative label: Lainvalmistelu, komiteat, Suomi (347)
alternative label: Luottamustehtävät, valtionhallinto (347)
alternative label: Luottamustoimet, valtionhallinto (347)
alternative label: Lyhyen aikavälin suunnittelu, valtionhallinto (347)
alternative label: Lääninhallinto (347)
alternative label: Maa- ja metsätaloushallinto, ministeriöt, Suomi (347)
alternative label: Maistraatit (347)
alternative label: Maksullisuus, valtion tuottamat palvelut (347)
alternative label: Maksut, valtion tuottamat palvelut (347)
alternative label: Maksuttomuus, valtion tuottamat palvelut (347)
alternative label: Ministeriöt, Suomi (347)
alternative label: Määräaikaisuus, valtionhallinto (347)
alternative label: Neuvostot, valtionhallinto (347)
alternative label: Neuvottelukunnat, valtionhallinto (347)
broader: URN:NBN:fi:au:hklj:340
in scheme: URN:NBN:fi:au:hklj:
narrower: Komiteat. Komiteanmietinnöt
notation: 347
related: Suomen valtiojärjestelmä
related: Suomen valtiopäiväasiakirjat
related: Julkisoikeus
related: URN:NBN:fi:au:hklj:332.1
related: URN:NBN:fi:au:hklj:332.2
related: Asemakaava- ja rakentamislainsäädäntö
related: URN:NBN:fi:au:hklj:332.22
related: Vero-oikeus
related: Rikosoikeus
related: Prosessioikeus. Oikeushallinto
related: Vankeinhoito. Vankilat
related: Suomen maakuntahallinto
related: URN:NBN:fi:au:hklj:347.05
related: Muiden maiden kunnallis-, läänin- ja valtionhallinto
related: URN:NBN:fi:au:hklj:363
related: Valtionverotus. Veropolitiikka
related: Tullilaitos
related: Aluepolitiikka. Ympäristöpolitiikka
related: Henkilöstöpolitiikka
scope note: Suomen valtionhallintoa koskevat yleisteokset Valtionhallinnon organisaatio, hallintoelimet ja palvelut yleensä Keskushallinto. Ministeriöt. Keskusvirastot Valtion alue-, piiri- ja paikallishallinto yleensä Aluehallintovirastot. Kihlakunnanvirastot. Maistraatit Valtion viranhaltijat ja virkasäännöt Valtion virallisjulkaisut yleensä Erikoisaloja koskeva valtionhallinto ja valtion erikoisalojen virallisjulkaisut alan mukaisessa luokassa Jos teoksessa on sekä Suomen valtion keskus- että lääninhallintoa, on etusija luokalla 347
scope note: Allmänna verk som rör Finlands statsförvaltning Statsförvaltningens organisation, förvaltningsorgan och tjänster i allmänhet Centralförvaltningen. Ministerierna. Centrala ämbetsverk Statens regional-, distrikts- och lokalförvaltning i allmänhet Regionförvalningsverk. Häradsbyråer. Magistrater Statliga tjänsteinnehavare och tjänstereglementen Statens offentliga publikationer i allmänhet Specialområden inom statsförvaltningen och statens offentliga publikationer inom specialområden klassificeras enligt område Om verket handlar om både statlig centralförvaltning och länsförvaltning i Finland ges företräde åt klass 347 @sv

Organisaatioiden ja laitosten sosiologia
type: Class
type: Concept
subclass of: SOSIOLOGIA
alternative label: Byrokratia, sosiologia (353 +)
alternative label: Institutionaalistuminen (353 +)
alternative label: Instituutiot, sosiologia (353 +)
alternative label: Joukkoäly, ryhmäsosiologia (353 +)
alternative label: Kibbutsit, sosiologia (353 +)
alternative label: Kollektiivinen toiminta, sosiologia (353 +)
alternative label: Kollektiivinen äly, ryhmäsosiologia (353 +)
alternative label: Kollektiivinen älykkyys, ryhmäsosiologia (353 +)
alternative label: Kollektiivit, sosiologia (353 +)
alternative label: Kollektiiviäly, ryhmäsosiologia (353 +)
alternative label: Kommuunit, sosiologia (353)
alternative label: Laitostuminen, organisaatiososiologia (353 +)
alternative label: Luovat menetelmät, ryhmäsosiologia (353 +)
alternative label: Organisaatiososiologia (353 +)
alternative label: Organisaatiot, organisaatiososiologia (353 +)
alternative label: Parviäly, ryhmäsosiologia (353 +)
alternative label: Parviälykkyys, ryhmäsosiologia (353 +)
alternative label: Pienryhmät, ryhmäsosiologia (353 +)
alternative label: Ryhmädynamiikka, ryhmäsosiologia (353 +)
alternative label: Ryhmäpaine, ryhmäsosiologia (353 +)
alternative label: Ryhmäsosiologia (353 +)
alternative label: Ryhmät, sosiologia (353 +)
alternative label: Ryhmätutkimukset, sosiologia (353 +)
alternative label: Ryhmätyö, sosiologia (353)
alternative label: Ryhmäviestintä, ryhmäsosiologia (353 +)
alternative label: Sitoutuminen, organisaatiososiologia (353 +)
alternative label: Sosiaalinen integraatio, ryhmäsosiologia (353 +)
alternative label: Sosiaaliset instituutiot (353 +)
alternative label: Sosiaaliset yhteisöt, organisaatiososiologia (353 +)
alternative label: Swarm intelligence, ryhmäsosiologia (353 +)
alternative label: Toiminnalliset menetelmät, ryhmäsosiologia (353 +)
alternative label: Verkostot, organisaatiososiologia (353 +)
alternative label: Virkavaltaisuus, sosiologia (353 +)
alternative label: Yhteistyökyky, organisaatiososiologia (353 +)
alternative label: Yhteisöt, yhteisösosiologia (353 +)
alternative label: Bindning, social, organisationssociologi (353 +) @sv
alternative label: Byråkrati, byrokratia, sociologi (353 +) @sv
alternative label: Byråkrati, virkavaltaisuus, sociologi (353 +) @sv
alternative label: Funktionella metoder, gruppsociologi (353 +) @sv
alternative label: Grupparbete, sociologi (353) @sv
alternative label: Gruppdynamik, gruppsociologi (353 +) @sv
alternative label: Grupper, sociologi (353 +) @sv
alternative label: Gruppkommunikation, gruppsociologi (353 +) @sv
alternative label: Gruppsociologi (353 +) @sv
alternative label: Grupptryck, gruppsociologi (353 +) @sv
alternative label: Gruppundersökningar, sociologi (353 +) @sv
broader: SOSIOLOGIA
in scheme: URN:NBN:fi:au:hklj:
narrower: Työn sosiologia
notation: 353
related: Kirjaston käyttö. Kirjastososiologia
related: Sosiaalipsykologia. Kulttuuripsykologia
related: Vankeinhoito. Vankilat
related: URN:NBN:fi:au:hklj:340
related: URN:NBN:fi:au:hklj:357.1
related: Perhesosiologia
related: Kriminologia. Kriminaalisosiologia
related: URN:NBN:fi:au:hklj:390
related: Asevarustelu. Asekauppa
related: Sotataito. Strategia. Taktiikka
related: Aseteknologia
related: Sotien yhteiskunnalliset vaikutukset
related: Väestönsuojelu
related: Suomen puolustusvoimat
related: Muiden maiden puolustusvoimat
related: Sotahistoria
related: Suomi
related: Hoitolaitokset. Sairaalatekniikka
related: URN:NBN:fi:au:hklj:618.85
related: Liiketalouden hallinto ja organisaatio
related: Johtamisen tekniikka ja menetelmät
related: Laskentatoimi. Rahoitus. Talousarviot
related: Työntutkimukset. Työanalyysi
related: Toimistotyö
related: Henkilöstöpolitiikka
scope note: Organisaatioiden, laitosten ja sosiaalisten instituutioiden sosiologia yleensä Ryhmäsosiologia yleensä Byrokratia sosiologisena ilmiönä
scope note: Organisationers, inrättningars och sociala institutioners sociologi i allmänhet Gruppsociologi i allmänhet Byråkrati som sociologiskt fenomen @sv

Aluepolitiikka. Ympäristöpolitiikka
type: Class
type: Concept
subclass of: URN:NBN:fi:au:hklj:370
alternative label: Alikehitys, aluepolitiikka (370.1)
alternative label: Alue-erot, aluepolitiikka (370.1)
alternative label: Alue-erot, aluesuunnittelu (370.1)
alternative label: Alueellinen yhteistyö, aluepolitiikka (370.1)
alternative label: Alueelliset erot, aluepolitiikka (370.1)
alternative label: Alueelliset erot, aluesuunnittelu (370.1)
alternative label: Alueelliset vaikutukset, aluepolitiikka (370.1)
alternative label: Alueellistaminen (370.1)
alternative label: Alueellistuminen (370.1)
alternative label: Alueellisuus (370.1)
alternative label: Alueet, aluepolitiikka (370.1)
alternative label: Alueet, aluesuunnittelu (370.1)
alternative label: Aluejako, aluepolitiikka (370.1)
alternative label: Aluejako, aluesuunnittelu (370.1)
alternative label: Aluekehitys (370.1)
alternative label: Aluekeskukset (370.1)
alternative label: Alueluokitukset, aluepolitiikka (370.1)
alternative label: Alueluokitukset, aluesuunnittelu (370.1)
alternative label: Aluepolitiikka (370.1)
alternative label: Aluerajat, aluepolitiikka (370.1)
alternative label: Aluerajat, aluesuunnittelu (370.1)
alternative label: Aluerakenne, aluepolitiikka (370.1)
alternative label: Aluerakenne, aluesuunnittelu (370.1)
alternative label: Aluesuunnittelu (370.1)
alternative label: Aluetaloudelliset vaikutukset , alueelliset vaikutukset (370.1)
alternative label: Aluetiede (370.1)
alternative label: Aluetuki (370.1)
alternative label: Aluetutkimus (370.1)
alternative label: Aluevaikutukset, aluepolitiikka (370.1)
alternative label: Aluevaraukset (370.1)
alternative label: Alueyhteistyö, aluepolitiikka (370.1)
alternative label: Asuinalueet, aluesuunnittelu (370.1)
alternative label: Asuinyhteisöt, suunnittelu (370.1)
alternative label: Asuinympäristö, suunnittelu (370.1)
alternative label: Asumistiheys, asuinalueiden suunnittelu (370.1)
alternative label: Asuntoalueet, aluesuunnittelu (370.1)
alternative label: Asuttaminen, aluesuunnittelu (370.1)
alternative label: Asutus, aluesuunnittelu (370.1)
alternative label: Asutuskeskukset, aluesuunnittelu (370.1)
alternative label: Asutusrakenne, aluepolitiikka (370.1)
alternative label: Desentralisaatio, aluepolitiikka (370.1)
alternative label: Desentralisaatio, aluesuunnittelu (370.1)
alternative label: Elinvoimaisuus, aluepolitiikka (370.1)
alternative label: Elinympäristö, biologia, ympäristöpolitiikka (370.1)
alternative label: Elämänpolitiikka, ympäristöpolitiikka (370.1)
alternative label: Erityisalueet, aluesuunnittelu (370.1)
alternative label: Fyysinen ympäristö, aluesuunnittelu (370.1)
broader: URN:NBN:fi:au:hklj:370
in scheme: URN:NBN:fi:au:hklj:
notation: 370.1
related: URN:NBN:fi:au:hklj:320
related: URN:NBN:fi:au:hklj:332.2
related: Ympäristöoikeus. Talousoikeus
related: URN:NBN:fi:au:hklj:342
related: URN:NBN:fi:au:hklj:345
related: Suomen maakuntahallinto
related: Suomen valtionhallinto
related: Alueellinen sosiologia. Maassamuutto
related: Tuotanto. Tuottavuus
related: Elintaso. Kulutus
related: URN:NBN:fi:au:hklj:371
related: Maapolitiikka
related: Asuntopolitiikka
related: URN:NBN:fi:au:hklj:400
related: Yleinen aluemaantiede. Yleinen kulttuurimaantiede. Yleinen poliittinen maantiede
related: Ympäristönsuojelu. Luonnonsuojelu
related: Uhanalaiset lajit. Luonnonsuojelualueet
related: Maaperän, metsien ja soiden suojelu
related: Vesien suojelu
related: Ilman suojelu
related: Maatalouspolitiikka
related: URN:NBN:fi:au:hklj:721
related: Kaupunkisuunnittelu. Kaupunkiarkkitehtuuri
related: Helsinki. Pääkaupunkiseutu
related: Luonnon- ja kulttuurimaiseman suunnittelu
scope note: Kansallisen ja kansainvälisen alue- ja ympäristöpolitiikan yleisteokset Alueellinen suunnittelu yleensä Euroopan Unionin alue- ja ympäristöpolitiikka yleensä Valtakunnallinen, seudullinen ja paikallinen alue- ja ympäristöpolitiikka yleensä Ympäristökysymykset sekä yhteiskunnalliset palvelut ja palvelutarpeet yhteiskunta- ja aluepolitiikan osana Valtakunnansuunnittelu. Maakuntasuunnittelu Yhteiskunnan toimintojen sijoittaminen valtakunnan eri osiin Kehitysaluepolitiikka yleensä Toimintojen keskittäminen. Toimintojen hajauttaminen Maaseudun ja kaupunkien välisten toimintasuhteiden suunnittelu ja kehittäminen Maakunnallinen ja seudullinen aluesuunnittelu yleensä Yhdyskunta- ja ympäristönsuunnittelu yleensä Suunnittelumaantiede. Aluetiede. Keskus- ja vaikutusaluejärjestelmät Alueellisen suunnittelun ja aluepolitiikan erikoisaloja koskevat teokset alan mukaisessa luokassa
scope note: Allmänna verk som rör nationell och internationell regional- och miljöpolitik Regionplanering i allmänhet Europeiska unionens regional- och miljöpolitik i allmänhet Riksomfattande och lokal regional- och miljöpolitik i allmänhet Miljöfrågor samt socialtjänster och behov av socialtjänster ur samhälls- och regionalpolitisk synvinkel Riksplanering. Landskapsplanering Förläggning av samhällets funktioner i olika delar av riket Utvecklingsområdespolitik i allmänhet Koncentration av funktionerna. Utlokalisering av funktionerna Planering och utveckling av samverkan mellan städer och landsbygd Regionplanering för landsbygd och lokala områden i allmänhet Samhälls- och miljöplanering i allmänhet Planeringsgeografi. Regionalvetenskap. Systemet med central- och influensområden Verk som rör specialområden inom regionplanering och regionalpolitik klassificeras enligt område @sv

Juhlien järjestäminen
type: Class
type: Concept
subclass of: Käytös- ja tapatieto
alternative label: Ajanviete, juhlat (379.1)
alternative label: Avioliittoon vihkiminen, hääjuhlien järjestäminen (379.1)
alternative label: Bestmanit, häät (379.1)
alternative label: Catering, juhlien järjestäminen (379.1)
alternative label: Edustustilaisuudet, juhlien järjestäminen (379.1)
alternative label: Festivaalit, järjestäminen (379.1)
alternative label: Hautajaiset, järjestäminen (379.1)
alternative label: Hautauspalvelut, hautaustoimistot (379.1)
alternative label: Hautaustoimistot (379.1)
alternative label: Huvit, juhlien järjestäminen (379.1)
alternative label: Hääpuvut, häät (379.1)
alternative label: Häät (379.1)
alternative label: Häät, juhlien järjestäminen (379.1)
alternative label: Iltamat, juhlien järjestäminen (379.1)
alternative label: Isänpäivä, juhlat (379.1)
alternative label: Itsenäisyyspäivät, juhlat (379.1)
alternative label: Joulu, juhlien järjestäminen (379.1)
alternative label: Juhannus, juhlien järjestäminen (379.1)
alternative label: Juhlaliputus (379.1)
alternative label: Juhlamenot, juhlien järjestäminen (379.1)
alternative label: Juhlapaikat, juhlien järjestäminen (379.1)
alternative label: Juhlapuvut, käytös-ja tapatieto (379.1)
alternative label: Juhlapäivät (379.1)
alternative label: Juhlapäivät, juhlien järjestäminen (379.1)
alternative label: Juhlasuunnittelu (379.1)
alternative label: Juhlat (379.1)
alternative label: Juhlat, juhlien järjestäminen (379.1)
alternative label: Juhlavaatteet, käytös-ja tapatieto (379.1)
alternative label: Juhlien järjestäminen (379.1)
alternative label: Järjestäminen, juhlat (379.1)
alternative label: Järjestötoiminta, juhlien järjestäminen (379.1)
alternative label: Kaasot, häät (379.1)
alternative label: Kansallispäivät (379.1)
alternative label: Kihlaus, kihlajaisten järjestäminen (379.1)
alternative label: Kirkolliset juhlat, juhlien järjestäminen (379.1)
alternative label: Kirkolliset vuotuisjuhlat, juhlien järjestäminen (379.1)
alternative label: Kotiseutujuhlat, juhlien järjestämisoppaat (379.1)
alternative label: Koulujuhlat (379.1)
alternative label: Kulkueet, juhlien järjestäminen (379.1)
alternative label: Kutsukortit (379.1)
alternative label: Kutsut, juhlien järjestäminen (379.1)
alternative label: Lahjat, juhlat (379.1)
alternative label: Lakkiaiset, juhlien järjestäminen (379.1)
alternative label: Laskiainen, juhlien järjestäminen (379.1)
alternative label: Lucian päivä, juhlien järjestäminen (379.1)
broader: Käytös- ja tapatieto
in scheme: URN:NBN:fi:au:hklj:
notation: 379.1
related: Sakramentit. Kirkolliset toimitukset
related: Kirkolliset juhlat ja juhlapäivät
related: URN:NBN:fi:au:hklj:371
related: Järjestötoiminta. Kokoustekniikka
related: URN:NBN:fi:au:hklj:473.1
related: Kulttuuriantropologia. Sosiaaliantropologia
related: URN:NBN:fi:au:hklj:691.1
related: Juomat
related: Kotijuhlien järjestäminen. Kutsujen järjestäminen
related: Pukeutuminen. Kauneudenhoito
related: Kauneudenhoito
related: URN:NBN:fi:au:hklj:787.3
related: URN:NBN:fi:au:hklj:787.31
related: URN:NBN:fi:au:hklj:787.311
related: URN:NBN:fi:au:hklj:787.32
related: URN:NBN:fi:au:hklj:787.34
related: Julkiset huvit
related: Kunniamerkit. Arvonimet. Mitalitiede
related: URN:NBN:fi:au:hklj:919
related: Vanhan ajan kulttuurihistoria
related: Keskiajan kulttuurihistoria 400-1499
related: Uuden ajan kulttuurihistoria 1500-1788
related: Uusimman ajan kulttuurihistoria 1789-1913
related: Nykyajan kulttuurihistoria 1914-1938
related: Nykyajan kulttuurihistoria 1939-
related: Erotiikan historia
related: Muodin historia
scope note: Juhlien järjestämistä koskevat yleiset oppaat Juhliin ja niiden järjestämiseen liittyvä käytös- ja tapatieto Kansallisiin ja muihin juhlapäiviin liittyvien juhlien järjestäminen järjestöjen ja julkisten organisaatioiden kannalta Koulujen, oppilaitosten, päiväkotien, työpaikkojen, kerhojen, yhdistysten, järjestöjen sekä kunnallisten tai valtiollisten organisaatioiden järjestämät juhlat ja juhlatilaisuudet Tässä myös esim. hääjuhlien järjestäminen
scope note: Allmänna handledningar i anordnande av fester Umgängesformer och etikett i anslutning till fester och festarrangemang Anordnande av fester för nationella och andra högtider ur de privata och offentliga organisationernas synvinkel Fester och tillställningar ordnade av skolor, läronrättningar, daghem, klubbar, föreningar, privata, kommunala eller statliga organisationer samt på arbetsplatser Hit också t.ex. anordnande av bröllop @sv

Radiotoiminta
type: Class
type: Concept
subclass of: Radio- ja televisiotoiminta
alternative label: Ajankohtaisohjelmat, radiotoiminta (384.41)
alternative label: Alueohjelmat, radiotoiminta (384.41)
alternative label: Asiaohjelmat, radiotoiminta (384.41)
alternative label: Digitaaliradio, radiotoiminta (384.41)
alternative label: Disc jockeyt, radiotoiminta (384.41)
alternative label: Dj:t, radiotoiminta (384.41)
alternative label: Dokumenttiohjelmat, radiotoiminta (384.41)
alternative label: Haastattelumenetelmät , radiotoiminta (384.41)
alternative label: Haastattelut, radiotoiminta (384.41)
alternative label: Jatkokertomukset, radiotoiminta (384.41)
alternative label: Joukkotiedotusvälineet, radio (384.41)
alternative label: Joukkoviestimet, radio (384.41)
alternative label: Journalismi, radiojournalismi (384.41)
alternative label: Journalismikritiikki, radiojournalismi (384.41)
alternative label: Juontajat, radiotoiminta (384.41)
alternative label: Kaapeliradio (384.41)
alternative label: Kaapeliradio, radiotoiminta (384.41)
alternative label: Kaupallinen joukkoviestintä, radiotoiminta (384.41)
alternative label: Kaupallinen radio (384.41)
alternative label: Keskusradiojärjestelmät, radiotoiminta (384.41)
alternative label: Keskusteluohjelmat, radio (384.41)
alternative label: Kulttuurijournalismi, radio (384.41)
alternative label: Kulttuuriohjelmat, radion ohelmatoiminta (384.41)
alternative label: Kuuluvuusalueet, radiotoiminta (384.41)
alternative label: Kuuntelijatutkimukset, radio (384.41)
alternative label: Kuuntelutottumukset, radio (384.41)
alternative label: Käsikirjoittaminen, radio (384.41)
alternative label: Lastenohjelmat, radiotoiminta (384.41)
alternative label: Makasiiniohjelmat, radio (384.41)
alternative label: Massamedia, radio (384.41)
alternative label: Merirosvoradio (384.41)
alternative label: Musiikkiohjelmat, radiotoiminta (384.41)
alternative label: Nuortenohjelmat, radiotoiminta (384.41)
alternative label: Ohjelmapalvelut, radio (384.41)
alternative label: Ohjelmapolitiikka, radio (384.41)
alternative label: Ohjelmat, radiotoiminta (384.41)
alternative label: Ohjelmatarjonta, radio (384.41)
alternative label: Ohjelmatoimistot, radio (384.41)
alternative label: Ohjelmatuotanto, radio (384.41)
alternative label: Ohjelmavälitys, radio (384.41)
alternative label: Ohjelmistot, radiotoiminta (384.41)
alternative label: Paikallisradio, radiotoiminta (384.41)
alternative label: Paikallisradiotoiminta, radiotoiminta (384.41)
alternative label: Perheohjelmat, radiotoiminta (384.41)
alternative label: Poliittinen journalismi, radio (384.41)
broader: Radio- ja televisiotoiminta
in scheme: URN:NBN:fi:au:hklj:
notation: 384.41
related: Kasvatusfilosofia. Kasvatustavoitteet
related: URN:NBN:fi:au:hklj:182
related: Filosofian ja psykologian opetusoppi
related: Uskonnon opetusoppi
related: Yhteiskuntatieteiden opetusoppi
related: Maantieteen ja kansatieteen opetusoppi
related: Matematiikan ja luonnontieteiden opetusoppi
related: Sovellettujen tieteiden opetusoppi
related: Taideaineiden opetusoppi
related: Musiikin opetusoppi
related: Liikunnan ja urheilun opetusoppi
related: Kirjallisuuden ja kielten opetusoppi
related: Historian opetusoppi
related: URN:NBN:fi:au:hklj:320
related: URN:NBN:fi:au:hklj:332.1
related: Elämäntapojen sosiologia. Kulttuurisosiologia
related: URN:NBN:fi:au:hklj:627.7
related: Tietoliikenne. Viestintätekniikka. Multimedia
related: URN:NBN:fi:au:hklj:627.753
related: URN:NBN:fi:au:hklj:627.7531
related: Öljy. Maakaasu
related: Materiaalitoiminnot. Logistiikka
related: Mainonta
related: URN:NBN:fi:au:hklj:721
related: Kaupunkisuunnittelu. Kaupunkiarkkitehtuuri
related: Ilmaisutaito. Puhetaito. Lausuntataide
related: URN:NBN:fi:au:hklj:783.68
scope note: Yleis- ja paikallisradioasemien radiotoiminta Radion ohjelmatoiminta. Radion ohjelmapolitiikka. Radion uutistoiminta. Radiotoimittajan työ. Äänilehden toimittaminen. Kuuntelijatutkimukset Radio-ohjelmia sisältävät äänitteet sisällön mukaisessa luokassa Jos teos koskee sekä radiotoimintaa että radiotekniikkaa, on etusija luokalla 384.41
scope note: Riks- och lokalradiostationer Radions programverksamhet. Radions programpolitik. Radions nyhetsförmedling. Radiojournalistens arbete. Att redigera taltidningar. Lyssnarundersökningar Inspelningar med radioprogram klassificeras enligt innehåll Om verket handlar om både radions programverksamhet och radioteknik, ges företräde åt klass 384.41 @sv

Maaperän, metsien ja soiden suojelu
type: Class
type: Concept
subclass of: Ympäristönsuojelu. Luonnonsuojelu
alternative label: Aapasuot, luonnonsuojelu (508.62)
alternative label: Aarnimetsät, metsien suojelu (508.62)
alternative label: Aarniometsät, metsien suojelu (508.62)
alternative label: Aavikoituminen (508.62)
alternative label: Avohakkuut, metsien suojelu (508.62)
alternative label: Deltat, kosteikkojen suojelu (508.62)
alternative label: Eloperäinen aines, maaperänsuojelu (508.62)
alternative label: Eloperäiset maalajit, maaperänsuojelu (508.62)
alternative label: Eloperäiset maat, maaperänsuojelu (508.62)
alternative label: Elottomat maalajit, maaperänsuojelu (508.62)
alternative label: Eroosio, ympäristönsuojelu (508.62)
alternative label: Erämaat, metsien suojelu (508.62)
alternative label: Geodiversiteetti, geologisten muodostumien suojelu (508.62)
alternative label: Geologinen monimuotoisuus, geologisten muodostumien suojelu (508.62)
alternative label: Geologiset kerrostumat, suojelu (508.62)
alternative label: Geologiset muodostumat, suojelu (508.62)
alternative label: Hakkuukiellot, metsänsuojelu (508.62)
alternative label: Hakkuut, luonnonsuojelu (508.62)
alternative label: Hapan laskeuma, maaperän happamoituminen (508.62)
alternative label: Happamoituminen, maaperän happamoituminen (508.62)
alternative label: Happosateet, maaperän happamoituminen (508.62)
alternative label: Harjujensuojelu (508.62)
alternative label: Harjut, harjujensuojelu (508.62)
alternative label: Harsuuntuminen, metsien suojelu (508.62)
alternative label: Havumetsät, metsien suojelu (508.62)
alternative label: Hiekkakuopat, harjujen suojelu (508.62)
alternative label: Humus, eroosio (508.62)
alternative label: Humus, maaperän suojelu (508.62)
alternative label: Huuhtoutuminen, eroosio (508.62)
alternative label: Ikimetsät, metsien suojelu (508.62)
alternative label: Joenperkaus, kosteikkojen suojelu (508.62)
alternative label: Joenuomat, kosteikkojen suojelu (508.62)
alternative label: Joet, kosteikkojen suojelu (508.62)
alternative label: Jokisuistot, kosteikkojen suojelu (508.62)
alternative label: Juomavesi, pohjavedet (508.62)
alternative label: Järvenlasku, kosteikkojen suojelu (508.62)
alternative label: Järvet, kosteikkojen suojelu (508.62)
alternative label: Jäteöljy, öljyvahingot, maaperä (508.62)
alternative label: Jäteöljy, öljyvahingot, pohjavesi (508.62)
alternative label: Kaivot, pohjavesien saastuminen (508.62)
alternative label: Kaivot, pohjavesien suojelu (508.62)
alternative label: Kalliot, suojelu (508.62)
alternative label: Kangasmetsät, suojelu (508.62)
alternative label: Kanjonit, suojelu (508.62)
alternative label: Kaskeaminen, ympäristöongelmat (508.62)
alternative label: Kaskiviljely, ympäristöongelmat (508.62)
broader: Ympäristönsuojelu. Luonnonsuojelu
in scheme: URN:NBN:fi:au:hklj:
notation: 508.62
related: Etiikka. Moraalifilosofia
related: Ympäristöoikeus. Talousoikeus
related: Vesioikeus
related: URN:NBN:fi:au:hklj:342
related: Kehitysmaiden taloudelliset olot
related: Aluepolitiikka. Ympäristöpolitiikka
related: Uhanalaiset lajit. Luonnonsuojelualueet
related: Vesien suojelu
related: BIOLOGIA
related: Ekologia. Eliömaantiede
related: Kasviekologia
related: Eläinekologia
related: URN:NBN:fi:au:hklj:613.3
related: URN:NBN:fi:au:hklj:620
related: Energia
related: Sähköenergian tuottaminen. Voimalatekniikka
related: Paperi- ja selluloosateollisuus
related: Kaivos- ja kaivannaisteollisuus
related: Kivihiili. Turve
related: URN:NBN:fi:au:hklj:650
related: URN:NBN:fi:au:hklj:657
related: Geotekniikka. Maatyöt
related: URN:NBN:fi:au:hklj:675
related: Markkinointi. Asiakaspalvelu
related: Kuluttajanvalistus
related: Luonnon- ja kulttuurimaiseman suunnittelu
scope note: Maankuoren aineksen ja pohjavesien suojelu ja saastuminen Elottomien ja elollisten maalajien sekä geologisten muodostumien ja kerrostumien suojelu. Harjujen suojelu Maankäytön aiheuttama eroosio ja maaperän köyhtyminen. Aavikoituminen. Maaperän happamoituminen. Ympäristömyrkyt ja öljyvahingot maaperän ja pohjavesien kannalta Metsien, sademetsien, erämaiden, rantojen, soiden ja kosteikkojen suojelu Metsänhakkuut, avohakkuut, soiden ojitukset ja kosteikkojen kuivatukset luonnonsuojelun kannalta
scope note: Skydd och nedsmutsning av jordskorpan och grundvatten Skydd av biotiska och abiotiska jordarter samt geologiska formationer och avlagringar. Skydd av åsar Erosion och utarmning av jordmånen som följd av markanvändning. Ökenbildning. Försurning av marken. Miljögifter och oljeolyckor med hänsyn till jordmån och grundvatten Skydd av skogar, regnskogar, ödemarker, stränder, myrar och våtmarker Skogsavverkning, kalhyggen, utdikning av myrar och torrläggning av våtmarker ur naturskyddssynvinkel @sv

Systemaattinen kasvitiede
type: Class
type: Concept
subclass of: KASVITIEDE
alternative label: Aitotumaiset eliöt, kasvit (587 +)
alternative label: Aitotumaiset, kasvit (587 +)
alternative label: Aitotumalliset, kasvit (587 +)
alternative label: Alkuperäiset kasvilajit, kasvilajit (587 +)
alternative label: Aluskasvillisuus, kasvilajit (587 +)
alternative label: Arkeofyytit, kasvilajit (587 +)
alternative label: Asutuksen seuralaislajit, kasvilajit (587 +)
alternative label: Benthos, kasviekologia (587)
alternative label: Benthos, kasvilajit (587 +)
alternative label: Carnivorit, kasvilajit (587 +)
alternative label: Eliökunta, kasvisystematiikka (587 +)
alternative label: Eliöt, kasvit (587 +)
alternative label: Endeemiset kasvilajit, kasvilajit (587 +)
alternative label: Endofyytit, kasvilajit (587 +)
alternative label: Epifyytit, kasvilajit (587 +)
alternative label: Eukaryootit, kasvit (587 +)
alternative label: Floora, kasvilajit (587 +)
alternative label: Harjukasvillisuus, kasvilajit (587 +)
alternative label: Hydrofyytit, kasvilajit (587 +)
alternative label: Ihmisen seuralaislajit, kasvilajit (587 +)
alternative label: Isäntäkasvit, systemaattinen kasvitiede (587 +)
alternative label: Itiökasvit (587)
alternative label: Itiöt (587)
alternative label: Jättipalsami, kasvilajit (587)
alternative label: Kaksivuotiset kasvit, kasvilajit (587 +)
alternative label: Kalliokasvillisuus, kasvilajit (587 +)
alternative label: Karnivorit, kasvilajit (587 +)
alternative label: Kasvikunta, kasvisystematiikka (587 +)
alternative label: Kasvilajit (587 +)
alternative label: Kasvilajit, luonnonkasvit (587 +)
alternative label: Kasvillisuus, kasvilajit (587 +)
alternative label: Kasviot, maantieteellisestä alueesta riippumatta (587 +)
alternative label: Kasvisto, kasvilajit (587 +)
alternative label: Kasvisystematiikka (587 +)
alternative label: Kasvit, luonnonkasvit (587 +)
alternative label: Ketokasvit, kasvilajit (587 +)
alternative label: Kotoperäiset kasvilajit, kasvilajit (587 +)
alternative label: Kulttuurikasvit, kasvilajit (587 +)
alternative label: Kulttuurin seuralaislajit, kasvilajit (587 +)
alternative label: Köynnöskasvit, systemaattinen kasvitiede (587 +)
alternative label: Lajimääritys, luonnonkasvit (587 +)
alternative label: Lajinmääritys, luonnonkasvit (587 +)
alternative label: Lajit, luonnonkasvilajit (587 +)
alternative label: Lajiutuminen, systemaattinen kasvitiede (587 +)
alternative label: Lihansyöjäkasvit, kasvilajit (587 +)
alternative label: Lihansyöjät, kasvilajit (587 +)
alternative label: Loiset, kasvilajit (587 +)
broader: KASVITIEDE
in scheme: URN:NBN:fi:au:hklj:
narrower: Sekovartiset kasvit
narrower: Putkilokasvit
notation: 587
related: Paleontologia
related: Luonto-oppaat. Oppikirjat
related: Uhanalaiset lajit. Luonnonsuojelualueet
related: BIOLOGIA
related: URN:NBN:fi:au:hklj:580.03
related: Kasvimorfologia. Kasvianatomia
related: Kasvifysiologia
related: Kasviekologia
related: Kasvimaantiede
related: Systemaattinen eläintiede
related: Selkärangattomat
related: Hyönteiset
related: Selkärankaiset
related: Kalat
related: Linnut
related: Nisäkkäät
related: Maanviljely
related: Puutarhanhoito. Hyötykasvit. Huone- ja koristekasvit
related: Koristekasvit
related: Hyötykasvit
related: Yrtti- ja maustekasvit
related: Hedelmä-, marja- ja vihanneskasvit
related: Huonekasvit
scope note: Kasvisystematiikka. Kasvitaksonomia Sisällöltään systemaattisesti järjestetyt kasvikirjat Kasviot. Kasveja koskevat lajinmääritysoppaat Itiökasveja koskevat yleisteokset, joissa on sekä sanikkaisia että sekovartisia kasveja Itiökasveja yleensä koskeva systematiikka ja lajinmääritysoppaat Itiökasveja yleensä koskeva anatomia, morfologia, fysiologia, ekologia ja kasvimaantiede Itiökasvien lisääntyminen
scope note: Växtsystematik. Växttaxonomi Botaniska böcker med systematisk indelning Floror. Handböcker i artbestämning av växter Allmänna verk som rör sporväxter och som handlar om både kärlkryptogamer och bålväxter Systematik och handböcker i artbestämning som rör sporväxter i allmänhet Anatomi, morfologi, fysiologi, ekologi och växtgeografi som rör sporväxter i allmänhet Sporväxternas fortplantning @sv

Virtsaelimet. Virtsaelinten taudit
type: Class
type: Concept
subclass of: URN:NBN:fi:au:hklj:617.9
alternative label: Ahtaumat, virtsateiden taudit (617.95)
alternative label: Ahtautumat, virtsateiden taudit (617.95)
alternative label: Androgeenit (617.95)
alternative label: Andrologia (617.95)
alternative label: Andropaussi (617.95)
alternative label: Dialyysihoito (617.95)
alternative label: Dieettikeittokirjat, munuaistaudit (617.95)
alternative label: Eritteet, virtsaneritys (617.95)
alternative label: Eritys, virtsaneritys (617.95)
alternative label: Eturauhanen (617.95)
alternative label: Eturauhanen, andrologia (617.95)
alternative label: Hedelmättömyys, miehen (617.95)
alternative label: Hormonaaliset tekijät, sukupuolihormonit, miehen (617.95)
alternative label: Hormonaaliset vaikutukset, sukupuolihormonit, miehen (617.95)
alternative label: Hormonit, sukupuolihormonit, miehen (617.95)
alternative label: Hormonivaikutukset, sukupuolihormonit, miehen (617.95)
alternative label: Katetrit, virtsateiden katetrointi (617.95)
alternative label: Katetrointi, virtsateiden katetrointi (617.95)
alternative label: Keinomunuaiset (617.95)
alternative label: Kiveksen kiertymä, andrologia (617.95)
alternative label: Kivekset, anatomia ja fysiologia (617.95)
alternative label: Kivekset, taudit (617.95)
alternative label: Lapsettomuus, miehestä johtuva (617.95)
alternative label: Lisääntymisterveys, urologia (617.95)
alternative label: Miehet, andrologia (617.95)
alternative label: Miestentautioppi (617.95)
alternative label: Munuaiset, ihmisen fysiologia ja anatomia (617.95)
alternative label: Munuaisoppi (617.95)
alternative label: Munuaissiirot (617.95)
alternative label: Munuaistaudit (617.95)
alternative label: Munuaisten vajaatoiminta (617.95)
alternative label: Nefrologia (617.95)
alternative label: Seksuaaliterveys, urologia (617.95)
alternative label: Siittiösolut (617.95)
alternative label: Siittiöt (617.95)
alternative label: Sperma (617.95)
alternative label: Sterilointi, andrologia (617.95)
alternative label: Sukuelimet, miehen sukuelimet (617.95)
alternative label: Sukukypsyys, miehen sukuelimet (617.95)
alternative label: Sukupuolielimet, miehen sukuelimet (617.95)
alternative label: Sukupuolihormonit, miehen (617.95)
alternative label: Sukupuolikypsyys, miehen sukuelimet (617.95)
alternative label: Sukusolut, miehen (617.95)
alternative label: Urologia (617.95)
alternative label: Vesikoureteraalinen refluksi, virtsateiden taudit (617.95)
broader: URN:NBN:fi:au:hklj:617.9
in scheme: URN:NBN:fi:au:hklj:
notation: 617.95
related: URN:NBN:fi:au:hklj:181.9
related: URN:NBN:fi:au:hklj:332.22
related: URN:NBN:fi:au:hklj:371.6
related: URN:NBN:fi:au:hklj:373
related: URN:NBN:fi:au:hklj:576
related: Anatomia
related: URN:NBN:fi:au:hklj:612
related: URN:NBN:fi:au:hklj:613.1
related: URN:NBN:fi:au:hklj:613.3
related: URN:NBN:fi:au:hklj:613.31
related: URN:NBN:fi:au:hklj:613.5
related: Seksologia
related: URN:NBN:fi:au:hklj:615
related: URN:NBN:fi:au:hklj:615.1
related: URN:NBN:fi:au:hklj:615.3
related: URN:NBN:fi:au:hklj:615.8
related: URN:NBN:fi:au:hklj:616
related: URN:NBN:fi:au:hklj:616.2
related: URN:NBN:fi:au:hklj:616.3
related: URN:NBN:fi:au:hklj:617.1
related: Sisäelimet. Sisätaudit
related: URN:NBN:fi:au:hklj:617.4
related: Iho. Ihotaudit. Sukupuolielimet. Sukupuolitaudit
related: URN:NBN:fi:au:hklj:617.7
related: Raskaus. Sikiönkehitys. Synnytys. Gynekologia
related: URN:NBN:fi:au:hklj:691.1
related: URN:NBN:fi:au:hklj:691.12
scope note: Urologia Virtsaelimet, munuaiset, virtsanjohtimet, virtsaputki ja virtsarakko sekä niiden fysiologia ja anatomia Miehen sukupuolielimet ja sukupuolirauhaset, niiden anatomia ja fysiologia Virtsaelinsairauksien ja miehen sukupuolielinten sairauksien ennaltaehkäisy, diagnostiikka, hoito ja patologia Munuaistaudit. Munuaissiirrot. Dialyysihoito Kivesten ja eturauhasen sairaudet. Miehen hedelmättömyys Andropaussi yleensä Virtsaelin- ja munuaissairaiden ruokavaliot ja keittokirjat
scope note: Urologi Urinvägsorganen, njurar, urinledare, urinrör och urinblåsa samt deras fysiologi och anatomi Mannens könsorgan och könskörtlar, deras fysiologi och anatomi Urinvägsorganens och de manliga könsorganens sjukdomar, förebyggande och behandling av dem samt deras diagnostik och patologi Njursjukdomar. Njurtransplantationer. Dialys Sjukdomar i testiklarna och prostatan. Manlig sterilitet Andropaus i allmänhet Dieter och kokböcker för personer med sjukdomar i urinvägsorganen eller njurarna @sv

Silmä. Silmätaudit
type: Class
type: Concept
subclass of: URN:NBN:fi:au:hklj:617.9
alternative label: Ahtaumat, kyynelneste, silmät, ihmisen anatomia ja fysiologia (617.96)
alternative label: Ahtautumat, kyynelneste, silmät, ihmisen anatomia ja fysiologia (617.96)
alternative label: Aistivammat, lääketiede, näkövammat (617.96)
alternative label: Aurinkolasit, silmätaudit (617.96)
alternative label: Glaukooma (617.96)
alternative label: Harmaakaihi (617.96)
alternative label: Ikänäkö (617.96)
alternative label: Kaihi (617.96)
alternative label: Karsastus (617.96)
alternative label: Kuivasilmäisyys (617.96)
alternative label: Kyynelneste, silmät, ihmisen anatomia ja fysiologia (617.96)
alternative label: Likinäköisyys (617.96)
alternative label: Luomet, silmä, silmätaudit (617.96)
alternative label: Monivammaiset, kuurosokeus (617.96)
alternative label: Mykiö, ihmisen anatomia ja fysiologia (617.96)
alternative label: Näkö, ihmisen fysiologia (617.96)
alternative label: Näkö, näkövammat (617.96)
alternative label: Näkövammaiset, lääketiede (617.96)
alternative label: Näkövammat, silmätaudit (617.96)
alternative label: Näönsuojaimet (617.96)
alternative label: Näöntutkimus (617.96)
alternative label: Oftalmologia (617.96)
alternative label: Piilolasit, silmätaudit (617.96)
alternative label: Putkinäkö, näkövammat, silmätaudit (617.96)
alternative label: Sarveiskalvo , ihmisen anatomia ja fysiologia (617.96)
alternative label: Silmiensuojaimet (617.96)
alternative label: Silmä, ihmisen anatomia ja fysiologia (617.96)
alternative label: Silmäkirurgia (617.96)
alternative label: Silmälasit, silmätautioppi (617.96)
alternative label: Silmäluomet, ihmisen anatomia ja fysiologia (617.96)
alternative label: Silmänliikkeet, ihmisen anatomia ja fysiologia (617.96)
alternative label: Silmänpainetauti (617.96)
alternative label: Silmät, ihmisen anatomia ja fysiologia (617.96)
alternative label: Silmätaudit (617.96)
alternative label: Silmätautioppi (617.96)
alternative label: Sokeat, silmätaudit (617.96)
alternative label: Sokeus (617.96)
alternative label: Stereonäkö, ihmisen fysiologia (617.96)
alternative label: Stereonäkö, näkövammat (617.96)
alternative label: Stereoskopia, ihmisen fysiologia (617.96)
alternative label: Stereoskopia, näkövammat (617.96)
alternative label: Suojalasit (617.96)
alternative label: Syvyysnäkö, ihmisen fysiologia (617.96)
alternative label: Syvyysnäkö, näkövammat (617.96)
alternative label: Taittovirheet (617.96)
broader: URN:NBN:fi:au:hklj:617.9
in scheme: URN:NBN:fi:au:hklj:
notation: 617.96
related: Havaintopsykologia
related: URN:NBN:fi:au:hklj:181.9
related: Näkövammaiset
related: URN:NBN:fi:au:hklj:332.22
related: URN:NBN:fi:au:hklj:371.6
related: URN:NBN:fi:au:hklj:373
related: Valo-oppi. Värioppi. Säteilyoppi
related: URN:NBN:fi:au:hklj:576
related: Anatomia
related: URN:NBN:fi:au:hklj:612
related: URN:NBN:fi:au:hklj:613.1
related: URN:NBN:fi:au:hklj:613.3
related: URN:NBN:fi:au:hklj:613.31
related: URN:NBN:fi:au:hklj:613.5
related: URN:NBN:fi:au:hklj:615
related: URN:NBN:fi:au:hklj:615.1
related: URN:NBN:fi:au:hklj:615.3
related: URN:NBN:fi:au:hklj:615.8
related: URN:NBN:fi:au:hklj:616
related: URN:NBN:fi:au:hklj:616.2
related: URN:NBN:fi:au:hklj:616.3
related: URN:NBN:fi:au:hklj:617.1
related: URN:NBN:fi:au:hklj:617.4
related: URN:NBN:fi:au:hklj:617.7
related: Optiset ja lääketieteelliset laitteet
related: URN:NBN:fi:au:hklj:691.1
related: URN:NBN:fi:au:hklj:691.12
scope note: Silmä ja näköhermo, niiden anatomia ja fysiologia Silmätaudit, niiden ennaltaehkäisy, diagnostiikka, hoito ja patologia Näkövammaisuus. Sokeus. Värisokeus. Taittoviat Näkövammaisten apuvälineet, paitsi silmälasit
scope note: Ögat och synnerven, deras anatomi och fysiologi Ögonsjukdomar, förebyggande och behandling av dem samt deras diagnostik och patologi Synskador. Blindhet. Färgblindhet. Brytningsfel Hjälpmedel för synskadade, undantaget glasögon @sv

Allergiat
type: Class
type: Concept
subclass of: URN:NBN:fi:au:hklj:617.9
alternative label: Allergeenit (617.97)
alternative label: Allergia (617.97)
alternative label: Allergiat (617.97)
alternative label: Allergiat, allergia (617.97)
alternative label: Altisteet, allergeenit (617.97)
alternative label: Altistuminen, allergeenit (617.97)
alternative label: Astma (617.97)
alternative label: Atopia (617.97)
alternative label: Atopia, allergiat (617.97)
alternative label: Dieettikeittokirjat, allergiat (617.97)
alternative label: Eläinallergia (617.97)
alternative label: Heinänuha (617.97)
alternative label: Hengenahdistus, astma (617.97)
alternative label: Hengityselimet, allergiset taudit (617.97)
alternative label: Hengityselinten taudit, astma ja heinänuha (617.97)
alternative label: Hengitystiet, allergiset taudit (617.97)
alternative label: Herkistävät aineet, allergiat (617.97)
alternative label: Immunotoksikologia, allergia (617.97)
alternative label: Itiöt, allergeenit (617.97)
alternative label: Katupöly, allergiat, astma (617.97)
alternative label: Kutina, allergiat (617.97)
alternative label: Lääkeaineallergiat (617.97)
alternative label: Maidoton ruokavalio, maitoallergia (617.97)
alternative label: Maitoallergia (617.97)
alternative label: Nuha, allerginen nuha (617.97)
alternative label: Pesuaineet, allergiat (617.97)
alternative label: Puhdistusaineet, allergiat (617.97)
alternative label: Pöly, allergiat, astma (617.97)
alternative label: Ruoka-aineallergia (617.97)
alternative label: Ruoka-allergia (617.97)
alternative label: Saippua, allergiat (617.97)
alternative label: Siitepölyallergia (617.97)
alternative label: Yliherkkyys (617.97)
alternative label: Yliherkkyys, allergiat (617.97)
alternative label: Yskä, allerginen nuha (617.97)
alternative label: Allergener, allergener (617.97) @sv
alternative label: Allergi (617.97) @sv
alternative label: Allergi framkallande ämnen (617.97) @sv
alternative label: Allergier (617.97) @sv
alternative label: Allergier, allergi (617.97) @sv
alternative label: Andningsorgan, allergiska sjukdomar (617.97) @sv
alternative label: Andningsorganens sjukdomar, astma och hösnuva (617.97) @sv
alternative label: Andningsvägarna, allergiska sjukdomar (617.97) @sv
alternative label: Andnöd, astma (617.97) @sv
alternative label: Atopi (617.97) @sv
broader: URN:NBN:fi:au:hklj:617.9
in scheme: URN:NBN:fi:au:hklj:
notation: 617.97
related: URN:NBN:fi:au:hklj:181.9
related: URN:NBN:fi:au:hklj:332.22
related: URN:NBN:fi:au:hklj:371.6
related: URN:NBN:fi:au:hklj:373
related: URN:NBN:fi:au:hklj:576
related: Anatomia
related: URN:NBN:fi:au:hklj:612
related: URN:NBN:fi:au:hklj:613.1
related: URN:NBN:fi:au:hklj:613.3
related: URN:NBN:fi:au:hklj:613.31
related: URN:NBN:fi:au:hklj:613.5
related: URN:NBN:fi:au:hklj:615
related: URN:NBN:fi:au:hklj:615.1
related: URN:NBN:fi:au:hklj:615.3
related: URN:NBN:fi:au:hklj:615.8
related: URN:NBN:fi:au:hklj:616
related: URN:NBN:fi:au:hklj:616.2
related: URN:NBN:fi:au:hklj:616.3
related: URN:NBN:fi:au:hklj:617.1
related: Sisäelimet. Sisätaudit
related: URN:NBN:fi:au:hklj:617.4
related: Iho. Ihotaudit. Sukupuolielimet. Sukupuolitaudit
related: URN:NBN:fi:au:hklj:617.7
related: Korva. Nenäontelo. Kurkku. Korva-, nenä- ja kurkkutaudit
related: Hengityselimet. Hengityselinten taudit
related: URN:NBN:fi:au:hklj:691.1
related: URN:NBN:fi:au:hklj:691.12
scope note: Allergiset taudit ja reaktiot, niiden ennaltaehkäisy, diagnostiikka, hoito ja patologia yleensä Allergian syyt. Allergeenit Siitepöly-, pöly-, eläin-, lääkeaine- ja ruoka-aineallergiat. Astma. Heinänuha Allergiatestaus Allergikkojen ruokavaliot ja keittokirjat
scope note: Allergiska sjukdomar och reaktioner, förebyggande och behandling av dem samt deras diagnostik och patologi i allmänhet Orsaker till allergi. Allergener Pollenallergi, dammallergi, djurallergi, läkemedelsallergi och födoämnesallergi. Astma. Hösnuva Allergitest Dieter och kokböcker för allergiker @sv

Metsästys. Kalastus
type: Class
type: Concept
subclass of: URN:NBN:fi:au:hklj:650
alternative label: Alkutuotanto, metsästys ja kalastus (658 +)
alternative label: Eräkirjallisuus, muistelmat (658)
alternative label: Erätalous (658 +)
alternative label: Istutetut eläimet, metsästys ja kalastus (658 +)
alternative label: Luonnonvara-ala, erätalous (658 +)
alternative label: Puukot, metsästys, kalastus (658 +)
alternative label: Talvipyynti (658 +)
alternative label: Trofeet, metsästys ja kalastus (658 +)
alternative label: Erämarksbruk (658 +) @sv
alternative label: Inplanterade djur, jakt och fiske (658 +) @sv
alternative label: Naturresursområdet, erämarksbruk (658 +) @sv
alternative label: Primärproduktion, ekonomi, jakt och fiske (658 +) @sv
alternative label: Slidknivar, jakt, fiske (658 +) @sv
alternative label: Troféer, jakt och fisk (658 +) @sv
alternative label: Vildmarkslitteratur, memoarer (658) @sv
alternative label: Vinterfångst (658 +) @sv
broader: URN:NBN:fi:au:hklj:650
in scheme: URN:NBN:fi:au:hklj:
narrower: Metsästys
narrower: Kalastus
notation: 658
preferred label: Hunting. Fishing @en
preferred label: Jakt. Fiske @sv
related: URN:NBN:fi:au:hklj:1.4
related: Ympäristöoikeus. Talousoikeus
related: Maa- ja metsätalouslainsäädäntö
related: URN:NBN:fi:au:hklj:473
related: URN:NBN:fi:au:hklj:473.1
related: URN:NBN:fi:au:hklj:475
related: URN:NBN:fi:au:hklj:475.1
related: URN:NBN:fi:au:hklj:476
related: URN:NBN:fi:au:hklj:476.1
related: URN:NBN:fi:au:hklj:476.11
related: URN:NBN:fi:au:hklj:476.12
related: URN:NBN:fi:au:hklj:476.5
related: URN:NBN:fi:au:hklj:476.6
related: URN:NBN:fi:au:hklj:476.7
related: URN:NBN:fi:au:hklj:476.8
related: Uhanalaiset lajit. Luonnonsuojelualueet
related: URN:NBN:fi:au:hklj:590
related: Eläinsuojelu
related: URN:NBN:fi:au:hklj:649.91
related: URN:NBN:fi:au:hklj:657
related: URN:NBN:fi:au:hklj:691.13
related: Kalaruoat
related: Retkeily. Ulkoilu. Vuorikiipeily. Suunnistus
scope note: Teokset, jotka koskevat sekä metsästystä että kalastusta
scope note: Verk som handlar om både jakt och fiske @sv

Materiaalitoiminnot. Logistiikka
type: Class
type: Concept
subclass of: URN:NBN:fi:au:hklj:675
alternative label: Ainevirrat, logistiikka (675.7)
alternative label: Etätunnistaminen, logistiikka (675.7)
alternative label: Etätunnistus, logistiikka (675.7)
alternative label: Haitalliset aineet, logistiikka (675.7)
alternative label: Haitta-aineet, logistiikka (675.7)
alternative label: Hankinta, liiketalous (675.7)
alternative label: Hankintaorganisaatiot (675.7)
alternative label: Huolinta, kaupan materiaalitoiminnot (675.7)
alternative label: Ilmakuljetus, materiaalitoiminnot (675.7)
alternative label: Inventointi (675.7)
alternative label: Jakelutiet (675.7)
alternative label: Kannet, pakkaus, pakkaus (675.7)
alternative label: Kaupankäynti, materiaalitoiminnot (675.7)
alternative label: Kauppa, materiaalitoiminnot (675.7)
alternative label: Kertakäyttöpakkaukset, materiaalitoiminnot (675.7)
alternative label: Komerot, säilytystilat, varastointi (675.7)
alternative label: Kontit, logistiikka, tavarankuljetus (675.7)
alternative label: Konttikuljetus (675.7)
alternative label: Kotelointi, logistiikka (675.7)
alternative label: Kotelot, logistiikka (675.7)
alternative label: Kuljetinjärjestelmät, kuljetusala (675.7)
alternative label: Kuljetus (675.7)
alternative label: Kuljetusala (675.7)
alternative label: Kuljetusalan oppilaitokset (675.7)
alternative label: Kuljetusliikkeet (675.7)
alternative label: Kuljetusmaksut (675.7)
alternative label: Kuljetuspalvelut (675.7)
alternative label: Kuljetustalous (675.7)
alternative label: Kulkuväylät, logistiikka (675.7)
alternative label: Kuormaus (675.7)
alternative label: Kylmäketjut, kaupan materiaalitoiminnot (675.7)
alternative label: Kylmäkuljetus, tavarankuljetus (675.7)
alternative label: Kylmäpakkaukset, pakkaus (675.7)
alternative label: Kylmävarastointi, varastointi (675.7)
alternative label: Laatikot, pakkaus (675.7)
alternative label: Lastaus (675.7)
alternative label: Lentokuljetus, kuljetus (675.7)
alternative label: Logistiikka, materiaalitoiminnot (675.7)
alternative label: Logistiikka-ala (675.7)
alternative label: Logistiikkakeskukset (675.7)
alternative label: Logistiikkapalvelut, materiaalitoiminnot (675.7)
alternative label: Maakuljetus, logistiikka (675.7)
alternative label: Maantiekuljetus, logistiikka (675.7)
alternative label: Materiaalihallinto (675.7)
alternative label: Materiaalinohjaus (675.7)
broader: URN:NBN:fi:au:hklj:675
in scheme: URN:NBN:fi:au:hklj:
notation: 675.7
related: Kauppaoikeus. Yhtiölainsäädäntö. Pankki- ja vakuutuslainsäädäntö
related: URN:NBN:fi:au:hklj:360
related: URN:NBN:fi:au:hklj:363
related: Osuustoiminta
related: URN:NBN:fi:au:hklj:368
related: URN:NBN:fi:au:hklj:380
related: URN:NBN:fi:au:hklj:384
related: Posti
related: Radio- ja televisiotoiminta
related: Radiotoiminta
related: URN:NBN:fi:au:hklj:384.42
related: Lehdistöoppi
related: Maaliikenne
related: Vesi- ja ilmaliikenne
related: Vesiliikenne
related: Ilmaliikenne. Ilmailu
related: Paikallisliikenne
related: Helsinki. Pääkaupunkiseutu
related: Voimakoneet. Moottorit. Nosto- ja kuljetuslaitteet
related: URN:NBN:fi:au:hklj:627.751
related: Paperi- ja selluloosateollisuus
related: URN:NBN:fi:au:hklj:649.91
related: URN:NBN:fi:au:hklj:650.2
related: Kaupan historia
related: Tavaraoppi
related: Liiketalouden hallinto ja organisaatio
related: Mainonta. Kuluttajanvalistus
scope note: Kaupan materiaalitoiminnot yleensä. Logistiikka yleensä Materiaalin hankinta, osto, pakkaus, kuljetus, siirto, vastaanotto, varastointi ja inventointi yleensä Erikoisalojen materiaalitoiminnot alan mukaisessa luokassa
scope note: Handelns materialadministration i allmänhet. Logistik i allmänhet Anskaffning, uppköp, förpackning, transport, flyttning, mottagning, lagring och inventering av material i allmänhet Materialadministration inom specialområden klassificeras enligt område @sv

Uuden ajan taidehistoria
type: Class
type: Concept
subclass of: URN:NBN:fi:au:hklj:709
alternative label: Amerikka, taide, moderni, uusi aika (709.5)
alternative label: Barokki, taidehistoria (709.5)
alternative label: Eklektismi, taidehistoria, kertaustyylit (709.5)
alternative label: Empire, taidehistoria (709.5)
alternative label: Etelä-Amerikka, taide, moderni, uusi aika (709.5)
alternative label: Kansallisromantiikka, taidehistoria (709.5)
alternative label: Kertaustyylit, taidehistoria (709.5)
alternative label: Klassismi, taidehistoria (709.5)
alternative label: Naturalismi, taidehistoria (709.5)
alternative label: Neoklassismi, taidehistoria (709.5)
alternative label: Pohjois-Amerikka, taide, moderni, uusi aika (709.5)
alternative label: Realismi, taidehistoria (709.5 ... 709.6)
alternative label: Rokokoo, taidehistoria (709.5)
alternative label: Romantiikka, taidehistoria (709.5)
alternative label: Symbolismi, taidehistoria (709.5)
alternative label: Taidehistoria, uusi aika (709.5)
alternative label: Täysromantiikka, taidehistoria (709.5)
alternative label: Uusbarokki, taidehistoria (709.5)
alternative label: Uusi aika, taidehistoria (709.5)
alternative label: Uusklassismi, taidehistoria (709.5)
alternative label: Varhaisromantiikka, taidehistoria (709.5)
alternative label: Viktoriaaninen aika, Iso-Britannia, taide (709.5)
alternative label: Vuosisadan vaihde, taidehistoria (709.5 ... 709.6)
alternative label: Amerika, konst, modern, nya tiden (709.5) @sv
alternative label: Barock, konsthistoria (709.5) @sv
alternative label: Eklekticism, konsthistoria, imitationsstilar (709.5) @sv
alternative label: Empire, konsthistoria (709.5) @sv
alternative label: Förromantik, konsthistoria (709.5) @sv
alternative label: Högromantik, konsthistoria (709.5) @sv
alternative label: Imitationsstilar, konsthistoria (709.5) @sv
alternative label: Klassicism, konsthistoria (709.5) @sv
alternative label: Konsthistoria, nya tiden (709.5) @sv
alternative label: Nationalromantik, konsthistoria (709.5) @sv
alternative label: Naturalism, konsthistoria (709.5) @sv
alternative label: Neoklassicism, konsthistoria (709.5) @sv
alternative label: Nordamerika, konst, modern, nya tiden (709.5) @sv
alternative label: Nya tiden, konsthistoria (709.5) @sv
alternative label: Nybarock, konsthistoria (709.5) @sv
alternative label: Nyklassicism, konsthistoria (709.5) @sv
alternative label: Realism, konsthistoria (709.5 ... 709.6) @sv
alternative label: Rokoko, konsthistoria (709.5) @sv
alternative label: Romantiken, konsthistoria (709.5) @sv
alternative label: Sekelskiftet, konsthistoria (709.5 ... 709.6) @sv
alternative label: Sydamerika, konst, modern, nya tiden (709.5) @sv
alternative label: Symbolism, konsthistoria (709.5) @sv
alternative label: Viktorianska tiden, Storbritannien, konst (709.5) @sv
broader: URN:NBN:fi:au:hklj:709
in scheme: URN:NBN:fi:au:hklj:
notation: 709.5
preferred label: Modern age art @en
preferred label: Nya tidens konsthistoria @sv
related: Suomen yleinen taidehistoria
related: Uuden ajan arkkitehtuuri
related: URN:NBN:fi:au:hklj:730.9
related: Uuden ajan kuvanveistotaide
related: URN:NBN:fi:au:hklj:740.9
related: Uuden ajan maalaustaide
related: URN:NBN:fi:au:hklj:770.9
related: URN:NBN:fi:au:hklj:789
related: URN:NBN:fi:au:hklj:789.1
related: Barokkimusiikki
related: Klassismin musiikki
related: Romantiikan musiikki
related: URN:NBN:fi:au:hklj:919
related: Uuden ajan kulttuurihistoria 1500-1788
related: Uusimman ajan kulttuurihistoria 1789-1913
scope note: Euroopan uuden ajan taide yleensä Tässä myös Euroopan ulkopuolisen länsimaisen taiteen uuden ajan yleinen taidehistoria Barokin, rokokoon, romantiikan, symbolismin ja kansallisromantiikan taide yleensä Kertaustyylien, kuten uusklassismin taide yleensä Uuden ajan taiteen eri aloja koskevat teokset alan mukaisessa luokassa Yksittäisiä taiteilijoita tai heidän tuotantoaan koskevat teokset ovat aina ko. taiteenalan tai sen historian luokassa
scope note: Nya tidens europeiska konst i allmänhet Hit också allmän konsthistoria som rör nya tidens utomeuropeiska västerländska konst Barockens, rokokons, romantikens, symbolismens och nationalromantikens konst i allmänhet Eklekticism såsom nyklassicistisk konst i allmänhet Verk som handlar om nya tidens enskilda konstarter klassificeras enligt konstart Verk som handlar om enskilda konstnärer och deras produktion klassificeras alltid enligt konstarten eller dess historia @sv

Antiikkiesineiden keräily
type: Class
type: Concept
subclass of: URN:NBN:fi:au:hklj:760
alternative label: Antiikkiesineet (760.85)
alternative label: Antiikkiesineet, keräily (760.85)
alternative label: Antiikkihuutokaupat (760.85)
alternative label: Antiikkiliikkeet (760.85)
alternative label: Arvoesineet, antiikkiesineiden keräily (760.85)
alternative label: Astiastot, antiikkiesineiden keräily (760.85)
alternative label: Astiat, antiikkiesineiden keräily (760.85)
alternative label: Esineet, antiikkiesineet (760.85)
alternative label: Huutokauppa, antiikkihuutokauppa (760.85)
alternative label: Irtaimisto, antiikkiesineet (760.85)
alternative label: Keräily, antiikkiesineet (760.85)
alternative label: Kirnut, antiikkiesineiden keräily ja kauppa (760.85)
alternative label: Kitsch, antiikkiesineet (760.85)
alternative label: Koriste-esineet, antiikki (760.85)
alternative label: Lippaat, antiikkiesineet (760.85)
alternative label: Maljakot, antiikkiesineiden keräily (760.85)
alternative label: Matkamuistot, antiikkiesineet (760.85)
alternative label: Muistoesineet, antiikkiesineet, (760.85)
alternative label: Osto- ja myyntiliikkeet, antiikkiliikkeet (760.85)
alternative label: Peilit, antiikkiesineet (760.85)
alternative label: Rasiat, antiikkiesineet (760.85)
alternative label: Samovaarit (760.85)
alternative label: Soittorasiat, antiikkiesineet (760.85)
alternative label: Andrahandsaffärer, antikaffärer (760.85) @sv
alternative label: Antikauktioner (760.85) @sv
alternative label: Antikviteter (760.85) @sv
alternative label: Antikviteter, samlande (760.85) @sv
alternative label: Antikvitetsaffärer (760.85) @sv
alternative label: Askar, antikföremål (760.85) @sv
alternative label: Auktion, antikauktion (760.85) @sv
alternative label: Föremål, antikföremål (760.85) @sv
alternative label: Kitsch, antikföremål (760.85) @sv
alternative label: Kärl, samlande av antikföremål (760.85) @sv
alternative label: Kärnor, mjölkhantering, samling och handel av antikviteter (760.85) @sv
alternative label: Lösöre, antikföremål (760.85) @sv
alternative label: Minnesföremål, antikföremål, (760.85) @sv
alternative label: Prydnadsföremål, antikviteter (760.85) @sv
alternative label: Samlarverksamhet, antikföremål (760.85) @sv
alternative label: Samovarer (760.85) @sv
alternative label: Serviser, samlande av antikföremål (760.85) @sv
alternative label: Skrin, antikföremål (760.85) @sv
alternative label: Souvenirer, antikföremål (760.85) @sv
alternative label: Speglar, antikföremål (760.85) @sv
alternative label: Speldosor, antikföremål (760.85) @sv
alternative label: Vaser, samlande av antikföremål (760.85) @sv
broader: URN:NBN:fi:au:hklj:760
in scheme: URN:NBN:fi:au:hklj:
notation: 760.85
related: Kustannustoimi. Kirjakauppa
related: URN:NBN:fi:au:hklj:018
related: URN:NBN:fi:au:hklj:675
related: Kelloteollisuus
related: Sisustusoppaat
related: Taidekauppa
related: Taidetaonta
related: Kulta- ja hopeasepäntaide. Korutaide
related: Taidepuutyöt
related: Huonekalutaide
related: URN:NBN:fi:au:hklj:764
related: Ryijyt
related: Koruompelu. Kirjonta. Nimikointi
related: Ompelu
related: Solmeilu. Makramee. Fransut
related: Matot
related: Neulonta
related: Virkkaus. Pitsinvirkkaus. Koukkuaminen. Nypläys
related: Kankaankudonta. Kankaanpainanta
related: Tilkkutyöt. Tikatut peitteet
related: Kehrääminen. Karstaus. Värjäys
related: Keramiikkataide. Posliinitaide
related: Keramiikkataide
related: Posliinitaide. Posliinimaalaus
related: Lasitaide
related: URN:NBN:fi:au:hklj:769
related: URN:NBN:fi:au:hklj:798
scope note: Antiikkiesineet, niiden keräily ja kauppa yleensä Antiikkiesineiden säilytys, kunnostus ja entisöinti yleensä Antiikkiliikkeet, antiikkihuutokaupat ja antiikkimessut yleensä Erikoisalojen antiikkiesineet, niiden keräily ja kauppa alan mukaisessa luokassa
scope note: Antikviteter, antikvitetssamlande och antikvitetshandel i allmänhet Förvaring, iståndsättande och restaurering av antikviteter i allmänhet Antikvitetsaffärer, antikvitetsauktioner och antikvitetsmässor i allmänhet Antikviteter, antikvitetssamlande och antikvitetshandel inom specialområden klassificeras enligt område @sv

Teatterimuodot
type: Class
type: Concept
subclass of: URN:NBN:fi:au:hklj:770
alternative label: Burleski, teatteri (773)
alternative label: Commedia dell'arte (773)
alternative label: Devising, improvisaatioteatteri (773)
alternative label: Ekologinen teatteri (773)
alternative label: Forum-teatteri, osallistava teatteri (773)
alternative label: Improvisaatioteatteri (773)
alternative label: Kabuki (773)
alternative label: Katuteatteri (773)
alternative label: Kesäteatterit (773)
alternative label: Kokeellinen teatteri (773)
alternative label: Kouluteatterityö (773)
alternative label: Kuunnelmat, radioteatterin historia ja tekniikka (773)
alternative label: Kuvaelmat, teatteri (773)
alternative label: Kärsimysnäytelmät, teatteri (773)
alternative label: Lastenkulttuuri, teatteri (773)
alternative label: Lastennäytelmät, lastenteatteri (773)
alternative label: Lastenteatterit (773)
alternative label: Laulunäytelmät, musiikkiteatteri (773)
alternative label: Melodraamat, teatteri (773)
alternative label: Miimi (773)
alternative label: Minstrelit, teatterimuodot (773)
alternative label: Musiikkinäytelmät, teatteri (773)
alternative label: Musiikkiteatteri, teatteri (773)
alternative label: Narrit, commedia dell'arte (773)
alternative label: No-näytelmät, teatterimuodot (773)
alternative label: No-teatteri (773)
alternative label: Nuorisoteatterit (773)
alternative label: Näkymätön teatteri (773)
alternative label: Näyttämötaide, teatterimuodot (773 +)
alternative label: Osallistava teatteri (773)
alternative label: Osallistuva teatteri (773)
alternative label: Poliittinen teatteri (773)
alternative label: Prosessidraama (773)
alternative label: Radioteatterit (773)
alternative label: Revyyt, musiikkiteatteri (773)
alternative label: Sketsit, teatteritaide (773)
alternative label: Speksit (773)
alternative label: Stand up -komiikka, tutkimus (773)
alternative label: Tarinateatteri (773)
alternative label: Teatteri, musiikkiteatteri (773)
alternative label: Teatteri, teatterimuodot (773)
alternative label: Teatterimuodot (773)
alternative label: Teatterimuodot, commedia dell'arte (773)
alternative label: Teatterimuodot, kabuki-teatteri (773)
alternative label: Teatterimuodot, katuteatteri (773)
alternative label: Teatterimuodot, kokeellinen teatteri (773)
alternative label: Teatterimuodot, kouluteatteri (773)
alternative label: Teatterimuodot, lastenteatteri (773)
broader: URN:NBN:fi:au:hklj:770
in scheme: URN:NBN:fi:au:hklj:
notation: 773
related: URN:NBN:fi:au:hklj:1.3
related: URN:NBN:fi:au:hklj:710
related: Teatteri- ja näyttämötaiteen teoria, estetiikka ja filosofia
related: Harrastajateatteri
related: URN:NBN:fi:au:hklj:770.9
related: Teatterityö
related: Teatteritekniikka
related: Nukketeatteri
related: Tanssitaide
related: Pantomiimi
related: Elokuva. Elokuvataide
related: URN:NBN:fi:au:hklj:783.6
related: Oopperat
related: Oopperoiden soitinosat
related: Oopperoiden solistiset lauluosat
related: Oopperoiden kuoro-osat
related: Operetit
related: Musikaalit
related: Balettimusiikki
related: Näytelmämusiikki
related: Melodraamat
related: URN:NBN:fi:au:hklj:783.67
related: URN:NBN:fi:au:hklj:783.68
related: Muu näyttämö- tai draamamusiikki. Pelimusiikki
scope note: Tiettyä teatterimuotoa, sen historiaa, henkilöhistoriaa, tekniikkaa tai estetiikkaa koskevat teokset Tiettyä teatterimuotoa koskevat käytännön oppaat Commedia dell'arte. Kabuki-teatteri. Katuteatteri. Kokeellisen teatterin eri muodot. Kouluteatteri. Lastenteatteri. No-teatteri. Radio- ja tv-teatteri. Stand-up -esitykset. Varjoteatteri. Kuunnelmataide. Musiikkiteatteri teatteritaiteen kannalta
scope note: Verk som handlar om en bestämd teaterform, dess historia, personhistoria, tekniker eller estetik Praktiska handböcker som rör en bestämd teaterform Barnteater. Commedia dell'arte. Gatuteater. Kabukiteater. No-teater. Olika former av experimentell teater. Radio- och TV-teater. Skolteater. Skuggteater. Stand-up -shower Hörspel. Musikteater ur teaterkonstens synvinkel @sv

MUSIIKKI
type: Class
type: Concept
subclass of: URN:NBN:fi:au:hklj:700
alternative label: Biografiat, taiteilijat (710 ... 789 +)
alternative label: Edelläkävijät, taiteilijat (710 ... 789 +)
alternative label: Elämäkerrat, taiteilijat ja musiikki (710 ... 789 +)
alternative label: Elämänhistoria, henkilöhistoria, taiteilijat (710 ... 789 +)
alternative label: Elävä musiikki, musiikki (780)
alternative label: Esittävät taiteet, musiikki (780 ... 789 +)
alternative label: Esitykset, musiikkitallenteet (780 ... 789 +)
alternative label: Haastattelut, henkolöhistoria, taiteilijat (710 ... 789 +)
alternative label: Henkilöhistoria, taiteilijat (710 ... 789 +)
alternative label: Henkilökuvat, taiteilijat (710 ... 789 +)
alternative label: Henkilöt, taiteilijat (710 ... 789 +)
alternative label: Historia, henkilöhistoria, taiteilijat (710 ... 789 +)
alternative label: Julkisuuden henkilöt, taiteilijat (710 ... 789 +)
alternative label: Kansalliset suurmiehet, taiteilijat ja musiikki (710 ... 789 +)
alternative label: Kasetit, musiikkikasetit (780 ... 789 +)
alternative label: Kirjeet, taiteilijat (710 ... 789 +)
alternative label: Klassikot, musiikki ja musiikinhistoria (780 ... 789 +)
alternative label: Kognitiivinen musiikintutkimus (780)
alternative label: Kognitiivinen musiikkitiede (780)
alternative label: Konservatoriot (780)
alternative label: Käsiohjelmat, musiikki (780 +)
alternative label: Lapsitähdet, julkisuuden henkilöt, taiteilijat (710 ... 789 +)
alternative label: Lapsuus, taiteilijat (710 ... 789 +)
alternative label: Maahanmuuttajat, henkilöhistoria, taiteilijat (710 ... 789 +)
alternative label: Maanpako, henkilöhistoria, taiteilijat (710 ... 789 +)
alternative label: Merkkihenkilöt, taiteilijat ja musiikki (710 ... 789 +)
alternative label: Mielipidevangit, taiteilijat, elämäkerrat ja muistelmat (710 ... 789 +)
alternative label: Muistelmat, taiteilijat (710 ... 789 +)
alternative label: Muistokirjoitukset, taiteilijat (710 ... 789 +)
alternative label: Musiikin oppimateriaalit (780)
alternative label: Musiikin tutkimus (780)
alternative label: Musiikintutkimus (780)
alternative label: Musiikki (780)
alternative label: Musiikkiala (780)
alternative label: Musiikkianalyysi (780)
alternative label: Musiikkielämä (780)
alternative label: Musiikkiesseet (780)
alternative label: Musiikkikirjat (780 ... 789 +)
alternative label: Musiikkikorkeakoulut (780)
alternative label: Musiikkikoulut (780)
alternative label: Musiikkikulttuuri (780)
alternative label: Musiikkimarkkinat (780 +)
alternative label: Musiikkiohjelmat, musiikkiohjelmatallenteet (780 ... 789 +)
alternative label: Musiikkioppilaitokset (780)
alternative label: Musiikkiteollisuus (780)
alternative label: Musiikkitiede (780)
alternative label: Musiikkiyhdistykset (780)
alternative label: Musikologia (780)
alternative label: Nekrologit, taiteilijat (710 ... 789 +)
alternative label: Omaelämäkerrat, taiteilijat (710 ... 789 +)
alternative label: Oppilaitokset, musiikkioppilaitokset (780)
alternative label: Pakolaiset, henkilöhistoria, taiteilijat (710 ... 789 +)
alternative label: Pastissit, musiikki ja musiikinhistoria (780 ... 789 +)
alternative label: Professorit, taiteilijat (710 ... 789 +)
alternative label: Päiväkirjat, taiteilijat (710 ... 789 +)
alternative label: Rakkauskirjeet, taiteilijat (710 ... 789 +)
alternative label: Sibelius-Akatemia (780)
broader: URN:NBN:fi:au:hklj:700
in scheme: URN:NBN:fi:au:hklj:
narrower: Musiikkibibliografiat. Diskografiat
narrower: Konsertit. Musiikkijuhlat. Musiikkikilpailut. Nuottien ja äänitteiden kustantaminen
narrower: Musiikin filosofia, estetiikka, psykologia ja sosiologia Musiikkikasvatus. Musiikkiopetus
narrower: Musiikin teoria
narrower: URN:NBN:fi:au:hklj:783
narrower: URN:NBN:fi:au:hklj:784
narrower: URN:NBN:fi:au:hklj:785
narrower: URN:NBN:fi:au:hklj:786
narrower: URN:NBN:fi:au:hklj:787
narrower: URN:NBN:fi:au:hklj:788
narrower: URN:NBN:fi:au:hklj:789
notation: 780
related: Symbolit. Koodit. Merkkijärjestelmät
related: Keskiasteen koulutus
related: Muut yliopistot ja korkeakoulut
related: Taideopinnot
scope note: Musiikin ja musiikkitieteen yleisteokset Musiikkia koskevat yleiset essee- ja kokoomateokset Yleiset musiikin ja musiikkitieteen oppikirjat ja oppimateriaalit Musiikkioppilaitokset yleensä. Musiikkikoulut ja -opistot yleensä Musiikkikorkeakoulut yleensä. Sibelius Akatemia yleensä Musiikkiharrastus yleensä. Musiikkiyhdistykset yleensä
scope note: Allmänna verk om musik och musikvetenskap Allmänna essäsamlingar och samlingsverk som rör musik Allmänna läroböcker och läromedel som rör musik och musikvetenskap Musikläroinrättningar i allmänhet. Musikskolor och musikinstitut i allmänhet Musikhögskolor i allmänhet. Sibelius-Akademin i allmänhet Musik som hobby i allmänhet. Musikföreningar i allmänhet @sv

Balettimusiikki
type: Class
type: Concept
subclass of: URN:NBN:fi:au:hklj:783.6
alternative label: Airit, balettimusiikki (783.64)
alternative label: Baletit, musiikki (783.64)
alternative label: Baletti, musiikki (783.64)
alternative label: Balettimusiikki (783.64)
alternative label: Pantomiimit, musiikki (783.64)
alternative label: Tanssimusiikki, balettimusiikki (783.64)
alternative label: Airer, balettmusik (783.64) @sv
alternative label: Balett, musik (783.64) @sv
alternative label: Baletter, musik (783.64) @sv
alternative label: Balettmusik (783.64) @sv
alternative label: Dansmusik, balettmusik (783.64) @sv
alternative label: Pantomimer, musik (783.64) @sv
broader: URN:NBN:fi:au:hklj:783.6
in scheme: URN:NBN:fi:au:hklj:
notation: 783.64
preferred label: Ballet music @en
preferred label: Balettmusik @sv
related: URN:NBN:fi:au:hklj:1.3
related: URN:NBN:fi:au:hklj:1.83
related: URN:NBN:fi:au:hklj:1.943
related: URN:NBN:fi:au:hklj:2.3
related: URN:NBN:fi:au:hklj:2.83
related: URN:NBN:fi:au:hklj:2.93
related: URN:NBN:fi:au:hklj:3.3
related: URN:NBN:fi:au:hklj:4.3
related: URN:NBN:fi:au:hklj:5.3
related: URN:NBN:fi:au:hklj:6.3
related: URN:NBN:fi:au:hklj:7.3
related: URN:NBN:fi:au:hklj:770
related: Teatterimuodot
related: Tanssitaide
related: Baletti
related: Jazzbaletti. Moderni tanssi
related: Pantomiimi
related: URN:NBN:fi:au:hklj:783.5
related: Oopperat
related: URN:NBN:fi:au:hklj:784
related: URN:NBN:fi:au:hklj:784.111
related: URN:NBN:fi:au:hklj:785.4
related: URN:NBN:fi:au:hklj:788
related: URN:NBN:fi:au:hklj:789
related: URN:NBN:fi:au:hklj:795
related: URN:NBN:fi:au:hklj:8.3
scope note: Pantomiimimusiikki. Oopperoiden balettimusiikki Balettimusiikin yksittäisistä osista sovitetut kokoelmat soitinnuksen mukaisessa luokassa
scope note: Pantomimmusik. Balettmusik i operor Samlingar arrangerade som enskilda partier ur balettmusik klassificeras enligt instrumentering @sv

Pohjoismaat. Baltian maat
type: Class
type: Concept
subclass of: Eurooppa
alternative label: Pohjoismaat, kansanmusiikki (784.11 +)
alternative label: Pohjola, kansanmusikki (784.11 +)
alternative label: Norden, folkmusik (784.11 +) @sv
alternative label: Nordiska länderna, folkmusik (784.11 +) @sv
broader: Eurooppa
in scheme: URN:NBN:fi:au:hklj:
narrower: URN:NBN:fi:au:hklj:784.111
narrower: Ruotsi
narrower: Norja
narrower: Tanska
narrower: Islanti
narrower: Baltian maat
notation: 784.11
preferred label: Nordic countries. Baltic countries @en
preferred label: Norden. Baltikum @sv
related: URN:NBN:fi:au:hklj:473.1
related: URN:NBN:fi:au:hklj:769
related: URN:NBN:fi:au:hklj:783
related: URN:NBN:fi:au:hklj:783.1
related: URN:NBN:fi:au:hklj:787
related: URN:NBN:fi:au:hklj:787.2
related: URN:NBN:fi:au:hklj:787.29
related: URN:NBN:fi:au:hklj:788.8
related: URN:NBN:fi:au:hklj:789
related: URN:NBN:fi:au:hklj:795.1
related: URN:NBN:fi:au:hklj:797.2
related: URN:NBN:fi:au:hklj:807
scope note: Yleisteokset ja sekasisältöiset kokoelmat, jotka koskevat Pohjoismaiden kansanmusiikkia tai sekä Pohjoismaiden että Baltian maiden kansanmusiikkia
scope note: Allmänna verk och samlingar med blandat innehåll som rör nordisk folkmusik eller både nordisk och baltisk folkmusik @sv

Itä-Eurooppa
type: Class
type: Concept
subclass of: Eurooppa
broader: Eurooppa
in scheme: URN:NBN:fi:au:hklj:
narrower: Puola
narrower: Tsekkoslovakian alue
narrower: Unkari
notation: 784.16
preferred label: Eastern Europe @en
preferred label: Östeuropa @sv
related: URN:NBN:fi:au:hklj:473.1
related: URN:NBN:fi:au:hklj:769
related: URN:NBN:fi:au:hklj:783
related: URN:NBN:fi:au:hklj:783.1
related: Itsenäisten valtioiden yhteisö
related: Venäjä
related: Karjalan tasavalta
related: Ukraina
related: Valko-Venäjä
related: Moldova
related: Itsenäisten valtioiden yhteisön Aasian puoleiset alueet
related: URN:NBN:fi:au:hklj:787
related: URN:NBN:fi:au:hklj:787.2
related: URN:NBN:fi:au:hklj:787.29
related: URN:NBN:fi:au:hklj:788.8
related: URN:NBN:fi:au:hklj:789
related: URN:NBN:fi:au:hklj:795.1
related: URN:NBN:fi:au:hklj:797.2
related: URN:NBN:fi:au:hklj:807
scope note: Yleisteokset ja sekasisältöiset kokoelmat
scope note: Allmänna verk och samlingar med blandat innehåll @sv

Kristillisten kirkkojen musiikki
type: Class
type: Concept
subclass of: URN:NBN:fi:au:hklj:787
alternative label: Hengellinen musiikki, kristillinen (787.1 +)
alternative label: Hymnit (787.1 +)
alternative label: Häämusiikki, liturginen, kristillinen (787.1 +)
alternative label: Kirkkokuorot, hengellinen musiikki (787.1 +)
alternative label: Kirkkomusiikki (787.1 +)
alternative label: Kirkkomuusikot, kirkkomusiikki (787.1 +)
alternative label: Koraalit (787.1 +)
alternative label: Kristillisten kirkkojen musiikki (787.1 +)
alternative label: Laulukirjat, hengelliset laulut (787.1 +)
alternative label: Laulumusiikki, hengelliset laulut (787.1 +)
alternative label: Laulut, hengelliset laulut (787.1 +)
alternative label: Liturginen musiikki (787.1 +)
alternative label: Ohjelmamusiikki, liturginen musiikki, kristillinen (787.1 +)
alternative label: Uskonnollinen musiikki, kristillinen (787.1 +)
alternative label: Vakava musiikki, liturginen musiikki, kristillinen (787.1 +)
alternative label: Vesperit, liturginen musiikki (787.1 +)
alternative label: Vigiliat, liturginen musiikki (787.1 +)
alternative label: Andlig musik, kristlig (787.1 +) @sv
alternative label: Bröllopsmusik, liturgisk, kristlig (787.1 +) @sv
alternative label: Hymner (787.1 +) @sv
alternative label: Koraler (787.1 +) @sv
alternative label: Kristna kyrkors musik (787.1 +) @sv
alternative label: Kyrkokörer, andlig musik (787.1 +) @sv
alternative label: Kyrkomusik (787.1 +) @sv
alternative label: Kyrkomusiker, kyrkomusik (787.1 +) @sv
alternative label: Liturgisk musik (787.1 +) @sv
alternative label: Programmusik, liturgisk musik, kristen (787.1 +) @sv
alternative label: Religiös musik, kristlig (787.1 +) @sv
alternative label: Seriös musik, liturgisk musik, kristlig (787.1 +) @sv
alternative label: Sångböcker, andliga sånger (787.1 +) @sv
alternative label: Sånger, andliga sånger (787.1 +) @sv
alternative label: Sångmusik, andliga sånger (787.1 +) @sv
alternative label: Vesper, liturgisk musik (787.1 +) @sv
alternative label: Vigilia, liturgisk musik (787.1 +) @sv
broader: URN:NBN:fi:au:hklj:787
in scheme: URN:NBN:fi:au:hklj:
narrower: Protestanttinen musiikki
narrower: Roomalaiskatolinen musiikki
narrower: Ortodoksinen musiikki
narrower: Muiden kristillisten kirkkojen musiikki
notation: 787.1
preferred label: Christian church music @en
preferred label: Kristen kyrkomusik @sv
related: Hartauskirjat
related: Rukouskirjat
related: Virsikirjat ja hengelliset laulukirjat
related: Henkilökohtainen hartaudenharjoitus
related: EVANKELIS-LUTERILAINEN KIRKKO
related: Sakramentit. Kirkolliset toimitukset
related: URN:NBN:fi:au:hklj:260
related: URN:NBN:fi:au:hklj:783
related: URN:NBN:fi:au:hklj:783.1
related: URN:NBN:fi:au:hklj:783.5
related: URN:NBN:fi:au:hklj:783.59
related: URN:NBN:fi:au:hklj:783.6
related: URN:NBN:fi:au:hklj:784
related: URN:NBN:fi:au:hklj:784.9
related: URN:NBN:fi:au:hklj:787.2
related: URN:NBN:fi:au:hklj:789
scope note: Tässä ja alaluokissa eri kristillisten kirkkojen ja yhteisöjen liturginen ja hengellinen musiikki sekä niitä koskeva kirjallisuus Tässä ja alaluokissa kristillisten kirkkojen musiikin historia ja henkilöhistoria
scope note: Hit och till underklasserna liturgisk eller andlig musik inom olika kristna kyrkor och samfund samt litteratur om den liturgiska eller andliga musiken Hit och till underklasserna den kristna kyrkomusikens historia och personhistoria @sv

Vanhan ajan historia
type: Class
type: Concept
subclass of: URN:NBN:fi:au:hklj:909
alternative label: Antiikki, arkeologia (909.1)
alternative label: Arkeologia, antiikki (909.1)
alternative label: Esihistoria, historia (909.1)
alternative label: Esihistoriallinen arkeologia (909.1)
alternative label: Esiroomalainen rautakausi, historia (909.1)
alternative label: Illyrialaiset, historia (909.1)
alternative label: Karthagolaiset, muinaiskansat, historia (909.1)
alternative label: Kivikausi, historia (909.1)
alternative label: Maailmanhistoria, vanha aika (909.1)
alternative label: Megaliittikulttuuri, historia (909.1)
alternative label: Mesoliittinen kausi, historia (909.1)
alternative label: Muinaisajan ihmiset, historia (909.1)
alternative label: Muinaiskansat, historia (909.1)
alternative label: Myöhäisantiikki, historia (909.1)
alternative label: Neoliittinen kausi, historia (909.1)
alternative label: Paleoliittinen kausi, historia (909.1)
alternative label: Pronssikausi, historia (909.1)
alternative label: Roomalainen rautakausi, vanhan ajan historia (909.1)
alternative label: Vanha aika, historia (909.1)
alternative label: Varhaishistoria, historia (909.1)
alternative label: Antiken, arkeologi (909.1) @sv
alternative label: Arkeologi, antiken (909.1) @sv
alternative label: Bronsåldern, historia (909.1) @sv
alternative label: Forntidens människor, historia (909.1) @sv
alternative label: Forntidsfolk, historia (909.1) @sv
alternative label: Förhistoria, historia (909.1) @sv
alternative label: Förhistorisk arkeologi (909.1) @sv
alternative label: Förromersk järnålder, historia (909.1) @sv
alternative label: Gamla tiden, historia (909.1) @sv
alternative label: Illyrer, historia (909.1) @sv
alternative label: Kartager, forntidsfolk, historia (909.1) @sv
alternative label: Megalitkulturen, historia (909.1) @sv
alternative label: Mesolitisk tid, historia (909.1) @sv
alternative label: Neolitisk period, historia (909.1) @sv
alternative label: Paleolitisk tid, historia (909.1) @sv
alternative label: Romersk järnålder, gamla tidens historia (909.1) @sv
alternative label: Senantiken, historia (909.1) @sv
alternative label: Stenåldern, historia (909.1) @sv
alternative label: Tidig historia, historia (909.1) @sv
alternative label: Världshistoria, gamla tiden (909.1) @sv
broader: URN:NBN:fi:au:hklj:909
in scheme: URN:NBN:fi:au:hklj:
notation: 909.1
preferred label: Ancient history @en
preferred label: Forntidens historia @sv
related: URN:NBN:fi:au:hklj:300
related: Yhteiskuntatieteiden historia
related: URN:NBN:fi:au:hklj:320
related: URN:NBN:fi:au:hklj:325
related: URN:NBN:fi:au:hklj:370
related: URN:NBN:fi:au:hklj:371
related: URN:NBN:fi:au:hklj:390
related: Sotien yhteiskunnalliset vaikutukset
related: Muiden maiden puolustusvoimat
related: Sotahistoria
related: EUROOPPA
related: Keski-Eurooppa
related: Historialliset kartat. Historiallinen maantiede
related: Yleinen arkeologia
related: Egyptin ja Etu-Aasian muinaishistoria ja arkeologia
related: Kreikan muinaishistoria ja arkeologia
related: Rooman valtakunnan historia ja arkeologia
related: URN:NBN:fi:au:hklj:919
related: Vanhan ajan kulttuurihistoria
related: Esi- ja varhaishistoria vuoteen 1154
related: URN:NBN:fi:au:hklj:970
related: Muiden Keski-Euroopan maiden historia
related: URN:NBN:fi:au:hklj:979
related: Etelä-Aasian historia
related: Keski- ja Itä-Aasian historia
related: Japanin historia
scope note: Vanhan ajan maailmanhistorian yleisteokset Euroopan vanhan ajan historian ja arkeologian yleisteokset Antiikin historian ja arkeologian yleisteokset Tässä myös kivi-, pronssi- ja rautakausi sekä neoliittinen ja paleoliittinen kausi sekä niitä koskeva arkeologia yleensä Tietyn maan tai alueen vanhan ajan historia ja arkeologia ko. maanosan, maan tai alueen historian luokassa
scope note: Allmänna verk om forntidens världshistoria Allmänna verk om den europeiska forntidens historia och arkeologi Allmänna verk om antikens historia och arkeologi Hit också stenålder, bronsålder och järnålder samt neolitikum och paleolitikum samt arkeologi som rör dessa tidsperioder i allmänhet Verk om forntidens historia eller arkeologi i ett bestämt land eller geografiskt område förs till klassen för världsdelens, landets eller det geografiska områdets historia @sv

Historian aputieteet
type: Class
type: Concept
subclass of: HISTORIAN TUTKIMUSMENETELMÄT. ARKEOLOGIA. KULTTUURIHISTORIA
alternative label: Historia, historian aputieteet (911 +)
alternative label: Vaihtoehtohistoria, historian aputieteet (911 +)
alternative label: Vaihtoehtoinen historia, historian aputieteet (911 +)
alternative label: Alternativ historia, historia, hjälpvetenskaper (911 +) @sv
alternative label: Historia, historia, hjälpvetenskaper (911 +) @sv
broader: HISTORIAN TUTKIMUSMENETELMÄT. ARKEOLOGIA. KULTTUURIHISTORIA
in scheme: URN:NBN:fi:au:hklj:
narrower: Yleinen kronologia ja kronografia
narrower: Diplomatiikka
narrower: Rahatiede
narrower: Vaakunatiede. Liput
narrower: Sinettitiede
narrower: Kunniamerkit. Arvonimet. Mitalitiede
notation: 911
preferred label: Auxiliary disciplines of historical research @en
preferred label: Historiska hjälpvetenskaper @sv
related: Kirjoituksen historia. Paleografia. Epigrafia
related: Historian tutkimusmenetelmät
related: Historialliset kartat. Historiallinen maantiede
related: Yleinen arkeologia
related: URN:NBN:fi:au:hklj:919
related: Vanhan ajan kulttuurihistoria
related: Keskiajan kulttuurihistoria 400-1499
related: Uuden ajan kulttuurihistoria 1500-1788
related: Uusimman ajan kulttuurihistoria 1789-1913
related: Nykyajan kulttuurihistoria 1914-1938
related: Nykyajan kulttuurihistoria 1939-
related: Erotiikan historia
related: Muodin historia
related: Sukuhistoria. Sukututkimus
related: Sukututkimuksen historia ja menetelmät
scope note: Yleisteokset historian aputieteistä
scope note: Allmänna verk om historiska hjälpvetenskaper @sv

Aasian historia
type: Class
type: Concept
subclass of: MUIDEN MAANOSIEN HISTORIA
alternative label: Aasia, historia (981 +)
alternative label: Himalaja, historia (981)
alternative label: Maanosat, Aasia, historia (981)
alternative label: Silkkitie, historia (981 +)
alternative label: Yhdistyneet Arabiemiirikunnat, historia (981)
alternative label: Asien, historia (981 +) @sv
alternative label: Förenade Arabemiraten, historia (981) @sv
alternative label: Himalaya, historia (981) @sv
alternative label: Sidenvägen, historia (981 +) @sv
alternative label: Världsdelar, Asien, historia (981) @sv
broader: MUIDEN MAANOSIEN HISTORIA
in scheme: URN:NBN:fi:au:hklj:
narrower: Etu-Aasian historia
narrower: Etelä-Aasian historia
narrower: Kaakkois-Aasian historia
narrower: Keski- ja Itä-Aasian historia
narrower: Japanin historia
narrower: Armenian, Azerbaidzanin, Georgian, Kazakstanin, Kirgisian, Tadzikistanin, Turkmenistanin ja Uzbekistanin historia
notation: 981
preferred label: Asia's history @en
preferred label: Asiens historia @sv
related: AASIA
related: Venäjän historia
related: Venäjän historia vuoteen 1917
related: Venäjän vanha ja keskiaika
related: Venäjän historia 1682-1856
related: Venäjän historia 1857-1917
related: Neuvostoliiton historia 1917-1991
related: Neuvostoliiton historia 1917-1938
related: Neuvostoliiton historia 1939-1945
related: Neuvostoliiton historia 1945-1991
related: Venäjän historia 1992-
related: Ukrainan, Valko-Venäjän ja Moldovan historia
related: Ukrainan historia
related: Valko-Venäjän historia
related: Moldovan historia
scope note: Aasian historian yleisteokset
scope note: Allmänna verk om Asiens historia @sv

Muu kuin kirja-aineisto kirjastossa
type: Class
type: Concept
subclass of: Kirjastoaineisto. Kokoelmatyö
alternative label: AV-aineisto, kirjastonhoito (022.8)
alternative label: Artoteekit (022.8)
alternative label: Atk-tallenteet, kirjastoaineistona (022.8)
alternative label: Audiovisuaalinen aineisto, kirjastonhoito (022.8)
alternative label: BD-levyt, kirjastoaineistona (022.8)
alternative label: Blu-ray-levyt, kirjastoaineistona (022.8)
alternative label: CD-R-levyt, kirjastoaineistona (022.8)
alternative label: CD-ROM-levyt, kirjastoaineistona (022.8)
alternative label: CD-kuvalevyt, kirjastoaineistona (022.8)
alternative label: CD-levyt, kirjastoaineistona (022.8)
alternative label: CD-tietolevyt, kirjastoaineistona (022.8)
alternative label: CD-äänilevyt, kirjastoaineistona (022.8)
alternative label: DVD-levyt, kirjastoaineistona (022.8)
alternative label: Diakuvat, kirjastonhoito (022.8)
alternative label: Diapositiivit, kirjastonhoito (022.8)
alternative label: Digitaaliset tallenteet, kirjastoaineistona (022.8)
alternative label: Digitaaliset videolevyt, kirjastoaineistona (022.8)
alternative label: Elektroniset julkaisut, kirjastoaineistona (022.8)
alternative label: Elokuvatallenteet, kirjastoaineistona (022.8)
alternative label: Kartoteekit (022.8)
alternative label: Kompaktilevyt, kirjastoaineistona (022.8)
alternative label: Kuultokuvat, kirjastonhoito (022.8)
alternative label: Kuvakokoelmat, kirjastonhoito (022.8)
alternative label: Kuvat, kuvakokoelmat, kirjastot (022.8)
alternative label: Kuvatallenteet, kirjastoaineistona (022.8)
alternative label: Laajennettu kirjastotoiminta, artoteekit ja kartoteekit (022.8)
alternative label: Laserlevyt, kirjastoaineistona (022.8)
alternative label: Lehdet, kirjastotoiminta (022.8)
alternative label: Magneettiset tallenteet, kirjastoaineistona (022.8)
alternative label: Moniviestimet, kirjastonhoito (022.8)
alternative label: Romput, kirjastoaineistona (022.8)
alternative label: SACD-levyt, kirjastoaineistona (022.8)
alternative label: Super audio compact discs, kirjastoaineistona (022.8)
alternative label: Sähköinen aineisto, kirjastoaineistona (022.8)
alternative label: Sähköiset julkaisut, kirjastoaineistona (022.8)
alternative label: Taidekirjastot, artoteekit, taidelainaamot (022.8)
alternative label: Taidelainaamot (022.8)
alternative label: Tallenteet, kirjastoaineistot, ei kirjat (022.8)
alternative label: Videotallenteet, kirjastoaineistona (022.8)
alternative label: Videoteekit, kirjastot (022.8)
alternative label: blu ray -levyt, kirjastoaineistona (022.8)
alternative label: e-julkaisut, kirjastoaineistona (022.8)
alternative label: AV-material, biblioteksarbete (022.8) @sv
alternative label: Adb-upptagningar, som biblioteksmedier (022.8) @sv
broader: Kirjastoaineisto. Kokoelmatyö
in scheme: URN:NBN:fi:au:hklj:
notation: 022.8
related: URN:NBN:fi:au:hklj:010
related: URN:NBN:fi:au:hklj:018
related: Valinta ja hankinta
related: Luettelointi
related: Sisällönkuvailu
related: Kirjaston käyttö. Kirjastososiologia
related: Yleisönpalvelu
related: Lastenkirjastot
related: Koulukirjastot
related: Erityisten väestöryhmien kirjastopalvelut
related: Sairaalakirjastot
related: Erikoiskokoelmat
related: Paikalliskokoelmat
related: Musiikkikirjastot
related: Kirjastoautot. Kirjastoveneet
related: Muu kirjastotoiminta
related: Kirjastonkäytön opastus
related: Yleiset kirjastot
related: Erikoiskirjastot. Yhdistysten, laitosten ja yritysten kirjastot
related: URN:NBN:fi:au:hklj:028
related: Dokumentaatio ja informaatiopalvelu yleensä
related: Museonhoito
related: Arkistonhoito
related: URN:NBN:fi:au:hklj:061
related: URN:NBN:fi:au:hklj:063
related: URN:NBN:fi:au:hklj:627.753
related: URN:NBN:fi:au:hklj:627.7531
related: URN:NBN:fi:au:hklj:627.7532
scope note: Muu kuin kirja-aineisto kirjastossa yleensä Kausijulkaisut. Lehdet Av-aineisto (paitsi musiikki). Äänitteet (paitsi musiikki) Äänikasetit ja -nauhat. LP- ja CD-levyt Kuvatallenteet. Videokasetit. Kuvanauhat. Diat. Julisteet Taideteokset. Artoteekit. Artoteekkitoiminta Kartat. Kartoteekit. Kartoteekkitoiminta Mikromuotoinen aineisto. Mikrokortit. Mikrofilmit Elektroniset julkaisut. Verkkojulkaisut Sähkökirjat. CD-ROM -levyt. Optiset levyt. DVD-levyt. Blu ray -levyt Multimedia. Moniviestimet
scope note: Andra biblioteksmedier än böcker i bibliotek i allmänhet Seriella publikationer. Tidningar AV-material (undantaget musik). Ljudupptagningar (undantaget musik) Ljudkassetter och ljudband. Lp- och cd-skivor Bildupptagningar. Videokassetter. Bildband. Diabilder. Affischer Konstverk. Artotek. Artoteksverksamhet Kartor. Kartotek. Kartoteksverksamhet Material i mikroformat. Mikrokort. Mikrofilmer Elektroniska publikationer. Webbpublikationer E-böcker. Cd-rom skivor. Optiska skivor. Dvd-skivor. Blu ray-skivor Multimedia @sv

Taideaineiden opetusoppi
type: Class
type: Concept
subclass of: URN:NBN:fi:au:hklj:182
alternative label: Elokuva, opetusoppi (182.7)
alternative label: Elokuvataide, opetusoppi (182.7)
alternative label: Elokuvatutkimus, opetusoppi (182.7 +)
alternative label: Ilmaisutaito, opetusoppi (182.7 +)
alternative label: Kuvaamataiteet, opetusoppi (182.7)
alternative label: Kuvaamataito, opetusoppi (182.7)
alternative label: Kuvallinen ilmaisu, taiteiden opetusoppi (182.7)
alternative label: Kuvataide, opetusoppi (182.7)
alternative label: Kuvataidekasvatus, opetusoppi (182.7)
alternative label: Piirtäminen, opetusoppi (182.7)
alternative label: Piirustus, opetusoppi (182.7)
alternative label: Taideaineet, opetusoppi (182.7 +)
alternative label: Taidekasvatus, taiteen opetusoppi (182.7 +)
alternative label: Tanssi, opetusoppi (182.7)
alternative label: Teatteritaide, opetusoppi (182.7)
alternative label: Bildkonst, didaktik (182.7) @sv
alternative label: Bildkonster, didaktik (182.7) @sv
alternative label: Bildkonstfostran, didaktik (182.7) @sv
alternative label: Bildspråk, konstens didaktik (182.7) @sv
alternative label: Dans, didaktik (182.7) @sv
alternative label: Estetiska ämnen, didaktik (182.7 +) @sv
alternative label: Film, didaktik (182.7) @sv
alternative label: Filmforskning, didaktik (182.7 +) @sv
alternative label: Filmkonst, didaktik (182.7) @sv
alternative label: Framställningskonst, didaktik (182.7 +) @sv
alternative label: Konstfostran, konstdidaktik (182.7 +) @sv
alternative label: Ritande, didaktik (182.7) @sv
alternative label: Ritning, didaktik (182.7) @sv
alternative label: Teaterkonst, didaktik (182.7) @sv
alternative label: Teckning, didaktik (182.7) @sv
broader: URN:NBN:fi:au:hklj:182
in scheme: URN:NBN:fi:au:hklj:
narrower: Musiikin opetusoppi
narrower: Liikunnan ja urheilun opetusoppi
notation: 182.7
preferred label: Didactics in art @en
preferred label: Didaktik i konst @sv
related: Oppimisen psykologia
related: Hypnoosi. Suggestio
related: URN:NBN:fi:au:hklj:181.7
related: URN:NBN:fi:au:hklj:181.9
related: URN:NBN:fi:au:hklj:183
related: URN:NBN:fi:au:hklj:183.5
related: URN:NBN:fi:au:hklj:183.7
related: Erikoiskoulut. Kokeilukoulut
related: URN:NBN:fi:au:hklj:184
related: Muiden maiden yliopistot ja korkeakoulut
related: URN:NBN:fi:au:hklj:185
related: URN:NBN:fi:au:hklj:188.4
related: Radio- ja televisiotoiminta
related: Radiotoiminta
related: URN:NBN:fi:au:hklj:384.42
related: URN:NBN:fi:au:hklj:627.7
related: URN:NBN:fi:au:hklj:627.73
related: URN:NBN:fi:au:hklj:627.751
related: URN:NBN:fi:au:hklj:627.753
related: URN:NBN:fi:au:hklj:627.7531
related: URN:NBN:fi:au:hklj:627.7532
related: URN:NBN:fi:au:hklj:700
related: Oppikirjat. Harjoituskirjat. Tehtäväkokoelmat. Taiteen materiaalit ja tekniikka. Taidekasvatus
related: Taideopinnot
scope note: Tässä ja alaluokissa pääluokkaan 700 kuuluvien erikoisalojen tai aineiden opetusoppi Tässä esim. kuvaamataidon, maalaus-, kuvanveisto-, valokuva- ja elokuvataiteen, arkkitehtuurin, taideteollisuuden sekä teatteri- ja tanssitaiteen opetusoppi
scope note: Hit och till underklasserna didaktik som rör specialområden eller ämnen som hör till huvudklass 700 Hit didaktik inom t.ex. bildkonst, målarkonst, skulptur, fotografi, filmkonst, arkitektur, konsthantverk samt teater- och danskonst @sv

Kirjallisuuden ja kielten opetusoppi
type: Class
type: Concept
subclass of: URN:NBN:fi:au:hklj:182
alternative label: Informaatiolukutaito, didaktiikka (182.8)
alternative label: Kielikokeet , kielten didaktiikka (182.8)
alternative label: Kielikylpy (182.8)
alternative label: Kielilaboratoriot (182.8)
alternative label: Kielipsykologia, kielten didaktiikka (182.8)
alternative label: Kielistudiot (182.8)
alternative label: Kielitutkinnot, kielten didaktiikka (182.8)
alternative label: Kielten opetusoppi (182.8)
alternative label: Kirjallisuuden opetusoppi (182.8)
alternative label: Kirjoittaminen, äidinkielen opetusoppi (182.8)
alternative label: Kirjoitushäiriöt, äidinkielen opetusoppi (182.8)
alternative label: Kirjoitusvaikeudet, äidinkielen opetusoppi (182.8)
alternative label: Kuullun ymmärtäminen, kielten opetusoppi (182.8)
alternative label: Kuullunymmärtäminen, kielten opetusoppi (182.8)
alternative label: Luetun ymmärtäminen, kielten opetusoppi (182.8)
alternative label: Lukemaan oppiminen, äidinkielen opetusoppi (182.8)
alternative label: Lukeminen, äidinkielen opetusoppi (182.8)
alternative label: Ortografia, opetusoppi (182.8)
alternative label: Prosessikirjoittaminen, äidinkielen opetusoppi (182.8)
alternative label: Sanataidekasvatus, yl. (182.8)
alternative label: Suomen kieli, opetusoppi (182.8)
alternative label: Toinen kieli, opetusoppi (182.8)
alternative label: Vieraat kielet, opetusoppi (182.8)
alternative label: Viittomakieli, didaktiikka (182.8)
alternative label: Äidinkieli, opetusoppi (182.8)
alternative label: Andra språket, didaktik (182.8) @sv
alternative label: Finska, didaktik (182.8) @sv
alternative label: Främmande språk, didaktik (182.8) @sv
alternative label: Hörförståelse, språkens didaktik (182.8) @sv
alternative label: Informationskompetens, didaktik (182.8) @sv
alternative label: Litteraturens didaktik (182.8) @sv
alternative label: Läsförståelse, språkens didaktik (182.8) @sv
alternative label: Läsinlärning, modersmålets didaktik (182.8) @sv
alternative label: Läsning, modersmålets didaktik (182.8) @sv
alternative label: Modersmål, didaktik (182.8) @sv
alternative label: Ordkonstfostran, allm. (182.8) @sv
alternative label: Ortografi, didaktik (182.8) @sv
alternative label: Processkrivning, modersmålets didaktik (182.8) @sv
alternative label: Skrivande, modersmålets didaktik (182.8) @sv
alternative label: Skrivstörningar, modersmålets didaktik (182.8) @sv
alternative label: Skrivsvårigheter, modersmålets didaktik (182.8) @sv
alternative label: Språkbad (182.8) @sv
alternative label: Språkens didaktik (182.8) @sv
alternative label: Språkexamina, språkens didaktik (182.8) @sv
broader: URN:NBN:fi:au:hklj:182
in scheme: URN:NBN:fi:au:hklj:
notation: 182.8
related: Kirjoitus. Kirjoitustaito
related: Oppimisen psykologia
related: Hypnoosi. Suggestio
related: URN:NBN:fi:au:hklj:181.7
related: URN:NBN:fi:au:hklj:181.9
related: URN:NBN:fi:au:hklj:183
related: URN:NBN:fi:au:hklj:183.5
related: URN:NBN:fi:au:hklj:183.7
related: Erikoiskoulut. Kokeilukoulut
related: URN:NBN:fi:au:hklj:184
related: Muiden maiden yliopistot ja korkeakoulut
related: URN:NBN:fi:au:hklj:185
related: URN:NBN:fi:au:hklj:188.4
related: Radio- ja televisiotoiminta
related: Radiotoiminta
related: URN:NBN:fi:au:hklj:384.42
related: URN:NBN:fi:au:hklj:627.7
related: URN:NBN:fi:au:hklj:627.73
related: URN:NBN:fi:au:hklj:627.751
related: URN:NBN:fi:au:hklj:627.753
related: URN:NBN:fi:au:hklj:627.7531
related: URN:NBN:fi:au:hklj:627.7532
related: KIELITIEDE
related: Kielipsykologia. Kielisosiologia. Kielipolitiikka
related: Ruotsin kieli
related: Saksan kieli
related: Englannin kieli
related: Suomen kieli
scope note: Pääluokkaan 800 kuuluvien erikoisalojen tai aineiden opetusoppi Tässä esim. kirjallisuustieteen, lukemisen ja kirjoittamisen sekä äidinkielen ja vieraiden kielten opetusoppi Kielistudiot. Kielikylpy kielen opetusmenetelmänä
scope note: Hit och till underklasserna didaktik som rör specialområden eller ämnen som hör till huvudklass 800 Hit didaktik inom t.ex. litteraturvetenskap, läsande och skrivande samt modersmålet och främmande språk Språklaboratorier. Språkbad som språkundervisningsmetod @sv

Asiakirjakaavat ja -ohjeet. Oikeusoppaat
type: Class
type: Concept
subclass of: URN:NBN:fi:au:hklj:330
alternative label: Anomukset, asiakirjaoppaat (330.2)
alternative label: Ansioluettelot, työpaikan haku (330.2)
alternative label: Asiakirjamallit (330.2)
alternative label: Asiakirjaoppaat (330.2)
alternative label: C. v., työpaikan haku (330.2)
alternative label: CV, työpaikan haku (330.2)
alternative label: Curriculum vitae, työpaikan haku (330.2)
alternative label: Hakemukset, asiakirjaoppaat (330.2)
alternative label: Haku, hakemukset (330.2)
alternative label: Henkilötiedot, ansioluettelot (330.2)
alternative label: Kaavakkeet, asiakirjaoppaat (330.2)
alternative label: Kaavat, asiakirjakaavat (330.2)
alternative label: Kuittaus, asiakirjaoppaat (330.2)
alternative label: Kuittaus, oikeusoppaat (330.2)
alternative label: Laintulkinta, oikeussosiologia (330.2)
alternative label: Lomakkeet, asiakirjaoppaat (330.2)
alternative label: Lähetetyt työntekijät , työnhakuoppaat (330.2)
alternative label: Oikeusoppaat (330.2)
alternative label: Omaiset, oikeusoppaat (330.2)
alternative label: Paikanhakuoppaat (330.2)
alternative label: Selitetyt oikeusoppaat (330.2)
alternative label: Suositukset, työnhaku (330.2)
alternative label: Työkokemus, paikanhakuoppaat (330.2)
alternative label: Työnhakijat, paikanhakuoppaat (330.2)
alternative label: Työnhaku, oppaat (330.2)
alternative label: Työpaikat, työpaikan hakuoppaat (330.2)
alternative label: Työskentely ulkomailla, työnhakuoppaat (330.2)
alternative label: Työtodistukset, asiakirjaoppaat (330.2)
alternative label: Ulkomaantyö, työpaikan hakuoppaat (330.2)
alternative label: Ulkomailla työskentely, työnhakuoppaat (330.2)
alternative label: Anhöriga, rättshandböcker (330.2) @sv
alternative label: Ansökningar, formulärhandböcker (330.2) @sv
alternative label: Arbete utomlands, jobbsökarguider (330.2) @sv
alternative label: Arbetserfarenhet, jobbsökarguider (330.2) @sv
alternative label: Arbetsintyg, formulärhandböcker (330.2) @sv
alternative label: Arbetsplatser, jobbsökarguider (330.2) @sv
alternative label: Arbetssökande, handböcker (330.2) @sv
alternative label: Arbetssökande, jobbsökarguider (330.2) @sv
alternative label: Blanketter, formulärhandböcker (330.2) @sv
alternative label: C. v., arbetssökande (330.2) @sv
alternative label: CV, arbetssökande (330.2) @sv
alternative label: Curriculum vitae, arbetssökande (330.2) @sv
alternative label: Dokumentmallar (330.2) @sv
alternative label: Formler, dokumentformulär (330.2) @sv
alternative label: Formulär, formulärhandböcker (330.2) @sv
broader: URN:NBN:fi:au:hklj:330
in scheme: URN:NBN:fi:au:hklj:
notation: 330.2
related: URN:NBN:fi:au:hklj:183
related: Historialliset koulumuodot
related: Esikoulut
related: Peruskoulut
related: URN:NBN:fi:au:hklj:183.5
related: Keskiasteen koulutus
related: URN:NBN:fi:au:hklj:183.7
related: Erikoiskoulut. Kokeilukoulut
related: Muiden maiden koululaitokset
related: URN:NBN:fi:au:hklj:184
related: Turun akatemia
related: Helsingin yliopisto
related: Turun yliopisto
related: Åbo akademi
related: Jyväskylän yliopisto
related: Oulun yliopisto
related: Tampereen yliopisto
related: Muut yliopistot ja korkeakoulut
related: Teknilliset korkeakoulut
related: Kauppakorkeakoulut
related: Muiden maiden yliopistot ja korkeakoulut
related: Ammatinvalinta
related: Oppikirjat. Oppaat. Harjoituskirjat. Tehtäväkokoelmat
related: URN:NBN:fi:au:hklj:326.2
related: Suomen ja Euroopan Unionin laki- ja asetuskokoelmat
related: Työllisyys. Työttömyys. Työvoimapalvelu
related: Toimistotyö
scope note: Yleiset asiakirjakaavat ja -ohjeet sekä oikeusoppaat maasta riippumatta Työpaikan hakuoppaat. Paikanhakuoppaat Suomen ja EU:n lainsäädännön erikoisaloja koskevat asiakirjakaavat ja -ohjeet sekä oikeusoppaat alan mukaisessa luokassa 332-334+
scope note: Allmänna formulär och formulärhandböcker samt juridiska handböcker oavsett land Handledningar i arbetsansökan. Handböcker i platsansökan Formulär och formulärhandböcker samt juridiska handböcker som rör specialområden inom Finlands och EU:s lagstiftning klassificeras enligt område i klasserna 332-334+ @sv

Elintaso. Kulutus
type: Class
type: Concept
subclass of: URN:NBN:fi:au:hklj:368
alternative label: Aikapalkka (368.3)
alternative label: Aliravitsemus, köyhyys (368.3)
alternative label: Ansiotaso (368.3)
alternative label: Ansiotulot (368.3)
alternative label: Arvoesineet, varallisuus (368.3)
alternative label: BKT (368.3)
alternative label: Boikotti, kuluttajaboikotit (368.3)
alternative label: Bonukset, palkkapolitiikka (368.3)
alternative label: Bruttokansantuote (368.3)
alternative label: Distributiivinen oikeudenmukaisuus, sosiaalinen oikeudenmukaisuus (368.3)
alternative label: Edut, palkkaus (368.3)
alternative label: Elinkustannukset (368.3)
alternative label: Elinkustannusindeksi (368.3)
alternative label: Elinolot, elintaso (368.3)
alternative label: Elinolot, hyvinvointi (368.3)
alternative label: Elinolot, köyhyys (368.3)
alternative label: Elintarvikeapu, köyhyys (368.3)
alternative label: Elintarvikepula, köyhyys (368.3)
alternative label: Elintaso (368.3)
alternative label: Elämänlaatu, elintaso (368.3)
alternative label: Elämänpolitiikka, hyvinvointi (368.3)
alternative label: Eriarvoisuus, elintaso (368.3)
alternative label: Erikoistuminen, elinkeinorakenne (368.3)
alternative label: Eroraha (368.3)
alternative label: Eturyhmät, kuluttajat (368.3)
alternative label: Henkilökohtaiset konkurssit (368.3)
alternative label: Henkilökuntaedut, palkkapolitiikka (368.3)
alternative label: Huono-osaisuus, köyhyys (368.3)
alternative label: Hyvinvointi (368.3)
alternative label: Hyvinvointitalous (368.3)
alternative label: Hyvinvointivaltio (368.3)
alternative label: Hyväosaisuus, elintaso (368.3)
alternative label: Hyödykkeet, kulutus (368.3)
alternative label: Insolvenssi, henkilökohtainen (368.3)
alternative label: Intressiryhmät, kuluttajat (368.3)
alternative label: Irtolaisuus, köyhyys (368.3)
alternative label: Jakaantuminen, tulonjako (368.3)
alternative label: Jakamistalous, kulutus (368.3)
alternative label: Jakautuminen, tulonjako (368.3)
alternative label: Kannustimet, palkkapolitiikka (368.3)
alternative label: Kannustinloukut (368.3)
alternative label: Kannustinloukut, palkat (368.3)
alternative label: Kannustus, palkkapolitiikka (368.3)
alternative label: Kansalaispalkka (368.3)
alternative label: Kansantulo (368.3)
alternative label: Kansantuote (368.3)
broader: URN:NBN:fi:au:hklj:368
in scheme: URN:NBN:fi:au:hklj:
notation: 368.3
related: Kauppaoikeus. Yhtiölainsäädäntö. Pankki- ja vakuutuslainsäädäntö
related: Työoikeus
related: Yhteiskunnan rakenne
related: Pääoma. Työ. Luonnonvarat
related: URN:NBN:fi:au:hklj:363
related: Valtionverotus. Veropolitiikka
related: Talousjärjestelmät
related: Kehitysmaiden taloudelliset olot
related: Hinnat. Hintapolitiikka
related: Talouselämän kehitysilmiöt
related: URN:NBN:fi:au:hklj:370
related: Aluepolitiikka. Ympäristöpolitiikka
related: URN:NBN:fi:au:hklj:371
related: Työ sosiaalipoliittisena kysymyksenä
related: Työolot
related: Työsuojelu
related: Työllisyys. Työttömyys. Työvoimapalvelu
related: Työmarkkinajärjestöt
related: Liiketalouden hallinto ja organisaatio
related: Laskentatoimi. Rahoitus. Talousarviot
related: Henkilöstöpolitiikka
related: URN:NBN:fi:au:hklj:675
related: Markkinointi. Asiakaspalvelu
related: Mainonta. Kuluttajanvalistus
related: Mainonta
related: Kuluttajanvalistus
scope note: Kansantulo. Kansantuote. Elintaso. Taloudellinen hyvinvointi. Hyvinvointivaltio Tulonjakautuminen. Tulopolitiikka. Julkisen ja yksityisen sektorin palkkapolitiikka. Palkkaus. Palkkausjärjestelmät. Palkkahallinto Kulutus yleensä. Kuluttajapolitiikka yleensä. Kuluttajan asema yleensä Alikehitys ja köyhyys kehittyneissä maissa. Henkilökohtaiset konkurssit. Velkajärjestelyt. Velkasaneeraus. Ylivelkaantuneet Tiettyä tuotetta tai tuoteryhmää koskeva kulutus ko. tuotteen luokassa
scope note: Nationalinkomst. Nationalproduktion. Levnadsstandard. Ekonomiskt välstånd. Välfärdsstaten Inkomstfördelning. Inkomstpolitik. Den offentliga och privata sektorns lönepolitik. Avlöning. Lönesystem. Löneadministration Konsumtion i allmänhet. Konsumentpolitik i allmänhet. Konsumentens ställning i allmänhet Underutveckling och fattigdom i de utvecklade länderna. Personliga konkurser. Skuldsanering. Överskuldsatta Konsumtion av enskilda produkter eller produktgrupper klassificeras enligt produkten @sv

Maaliikenne
type: Class
type: Concept
subclass of: URN:NBN:fi:au:hklj:380
alternative label: Ajettavuus, liikenne (385 ... 387 +)
alternative label: Ajokelpoisuus, liikenne (385 ... 387 +)
alternative label: Ajopiirturit, maaliikenne (385)
alternative label: Ajoreitit, maaliikenne (385)
alternative label: Alikulut, liikenne (385)
alternative label: Asema-alueet, liikennesuunnittelu (385)
alternative label: Asemat, liikenne (385)
alternative label: Autoilijat, liikenne (385)
alternative label: Autoilu, liikenne (385)
alternative label: Autoliikenne (385)
alternative label: Autonvuokraus (385)
alternative label: Autot, liikenne (385)
alternative label: Autovuokraamot (385)
alternative label: Bussiliikenne (385)
alternative label: Bussiliikenne, maaliikenne (385)
alternative label: Charter-liikenne, maaliikenne (385 ... 387 +)
alternative label: Erikoiskuljetus, tieliikenne (385)
alternative label: Haitalliset aineet, kuljetus, liikenne (385 ... 386 +)
alternative label: Haitta-aineet, kuljetus, liikenne (385 ... 386 +)
alternative label: Heiluriliikenne, liikenne (385)
alternative label: Henkilöliikenne, rautatieliikenne (385)
alternative label: Henkilöliikenne, tieliikenne (385)
alternative label: Henkilövaunut, rautatieliikenne (385)
alternative label: Hidasteet, liikenne (385)
alternative label: Huolinta, maaliikenne (385)
alternative label: Huoltamot, maaliikenne (385)
alternative label: Huoltoasemat, maaliikenne (385)
alternative label: Infrastruktuurit, liikenne (385 ... 386 +)
alternative label: Jakeluasemat, maaliikenne (385)
alternative label: Jakeluliikenne, maaliikenne (385)
alternative label: Jalankulkijat, liikenne (385)
alternative label: Joukkoliikenne, maaliikenne (385)
alternative label: Joukkoliikenne, rautatieliikenne (385)
alternative label: Joukkoliikenne, tieliikenne (385)
alternative label: Julkinen liikenne, maaliikenne (385)
alternative label: Julkinen liikenne, rautatieliikenne (385)
alternative label: Julkinen liikenne, tieliikenne (385)
alternative label: Junaliikenne (385)
alternative label: Kansainvälinen kuljetus, liikenne (385 ... 386 +)
alternative label: Kansainvälinen liikenne, maaliikenne (385)
alternative label: Kaukoliikenne, maaliikenne (385)
alternative label: Kauttakulkuliikenne, maaliikenne (385)
alternative label: Kehätiet, liikenne (385)
alternative label: Kelirikko (385)
alternative label: Kelirikko, maaliikenne (385)
broader: URN:NBN:fi:au:hklj:380
in scheme: URN:NBN:fi:au:hklj:
notation: 385
related: URN:NBN:fi:au:hklj:320
related: URN:NBN:fi:au:hklj:332.2
related: URN:NBN:fi:au:hklj:342
related: URN:NBN:fi:au:hklj:385.03
related: URN:NBN:fi:au:hklj:385.05
related: URN:NBN:fi:au:hklj:385.09
related: Paikallisliikenne
related: Helsinki. Pääkaupunkiseutu
related: URN:NBN:fi:au:hklj:460
related: URN:NBN:fi:au:hklj:624
related: Tiet. Kadut. Tienrakennus. Kadunrakennus
related: Sillat. Sillanrakennus
related: Raideliikenneväylät. Junat. Raitiovaunut. Metro
related: Eläinten vetämät kulkuneuvot
related: Polkupyörät
related: Moottoripyörät. Mopedit
related: Autot
related: Muut maakulkuneuvot
related: Kemian teollisuus
related: Öljy. Maakaasu
related: Materiaalitoiminnot. Logistiikka
related: Liikenneopetus. Liikenneturvallisuus
related: URN:NBN:fi:au:hklj:721
related: Kaupunkisuunnittelu. Kaupunkiarkkitehtuuri
related: Moottoriurheilu. Lentourheilu
related: Autourheilu
related: Moottoripyöräurheilu
scope note: Maaliikenteen liikennepolitiikka ja -suunnittelu Tieliikenne. Moottoriajoneuvoliikenne. Autoilu yleensä. Julkinen liikenne. Yksityisautoilu. Henkilöauto-, Linja-auto- ja moottoripyöräliikenne. Maanteiden tavaraliikenne. Hyötyliikenne Liikenneväylät ja -verkot sekä linja-auto- ja rautatieasemat liikenteen, liikennepolitiikan ja liikennesuunnittelun kannalta Liikenneruuhkat. Pysäköinti. Tietullit. Tiemaksut Huoltoasematoiminta ja huolinta maaliikenteen kannalta Maastoliikenne. Moottorikelkkailu Raideliikenne yleensä. Rautatieliikenne Vaarallisten aineiden kuljetus maitse Jos teos koskee sekä maaliikennettä että maakulkuneuvoja tai tien- ja rautatienrakennusta, on etusija luokalla 385
scope note: Trafikpolitik och trafikplanering som rör landtrafik Vägtrafik. Motorfordonstrafik. Bilism i allmänhet. Kollektivtrafik. Privatbilism. Personbils-, buss- och motorcykeltrafik. Godstrafik på landsvägarna. Nyttotrafik Trafikleder och trafiknät samt bussstationer och järnvägsstationer ur trafikens, trafikpolitikens och trafikplaneringens synvinkel Trafikstockningar. Parkering. Vägtullar. Vägavgifter Bensinstationer och spedition ur landtrafikens synvinkel Terrängkörning. Snöskoteråkning Spårtrafik i allmänhet. Järnvägstrafik Transport av farliga ämnen till lands Om verket handlar om både landtrafik och landfordon eller väg- och järnvägsbygge, ges företräde åt klass 385 @sv

Keski-Eurooppa
type: Class
type: Concept
subclass of: EUROOPPA
alternative label: Keski-Eurooppa (413 +)
alternative label: Keski-Eurooppa, maantiede, matkat (413 +)
alternative label: Mellaneuropa (413 +) @sv
alternative label: Mellaneuropa, geografi, resor (413 +) @sv
broader: EUROOPPA
in scheme: URN:NBN:fi:au:hklj:
narrower: Benelux-maat
narrower: Unkari
narrower: Puola
narrower: Entisen Tsekkoslovakian alue
narrower: Romania
narrower: Sveitsi
narrower: Itävalta
notation: 413
preferred label: Central Europe @en
preferred label: Centraleuropa @sv
related: Saksa
related: Berliini
related: Ranska
related: Pariisi
related: URN:NBN:fi:au:hklj:460
related: URN:NBN:fi:au:hklj:909
related: Vanhan ajan historia
related: Keskiajan historia 400-1499
related: Uuden ajan historia 1500-1788
related: Uusimman ajan historia 1789-1913
related: Nykyajan historia 1914-1938
related: I maailmansodan historia 1914-1918
related: Nykyajan historia 1939-
related: II maailmansodan historia 1939-1945
scope note: Keski-Eurooppaa ja Keski-Euroopan maantiedettä koskevat yleisteokset Teokset, jotka koskevat useampia Keski-Euroopan maita, myös Saksaa ja Ranskaa
scope note: Allmänna verk om Centraleuropa och Centraleuropas geografi Verk som rör flera centraleuropeiska länder, också Tyskland och Frankrike @sv

MATEMATIIKKA
type: Class
type: Concept
subclass of: LUONNONTIETEET
alternative label: Asymmetria, matematiikka (510 ... 519)
alternative label: Bifurkaatio, matematiikka (510)
alternative label: Epäsymmetria, matematiikka (510 ... 519)
alternative label: Fermat'n probleema (510)
alternative label: Hilbertin ongelmat, matematiikka (510)
alternative label: Itseisarvo, matematiikka (510 ... 519)
alternative label: Kultainen leikkaus, matematiikka (510)
alternative label: Luonnontieteet, matematiikka (510 ... 519)
alternative label: Luvut (510)
alternative label: Matemaattiset menetelmät (510)
alternative label: Matemaattiset menetelmät, matematiikka (510 ... 519)
alternative label: Matemaattiset ongelmat (510)
alternative label: Matemaattiset teoriat (510 ... 519)
alternative label: Matemaattiset tieteet (510)
alternative label: Matemaattiset tieteet, matematiikka (510 ... 519)
alternative label: Matematiikka (510)
alternative label: Matematiikka, yleinen matematiikka (510)
alternative label: Muuttujat, matematiikka (510 ... 519)
alternative label: P=NP-ongelma, matematiikka (510)
alternative label: Parametrit, matematiikka (510)
alternative label: Perussuureet, matematiikka (510)
alternative label: Sectio aurea, matematiikka (510)
alternative label: Suureet, matematiikka (510)
alternative label: Symmetria, matematiikka (510 ... 519)
alternative label: Vakiot, matematiikka (510 ... 519)
alternative label: Variaabelit, matematiikka (510 ... 519)
alternative label: Ylioppilastehtävät, matematiikka (510)
alternative label: Äärettömyys, matematiikka (510)
alternative label: Ääriarvot, matematiikka (510)
alternative label: Absolutbelopp, matematik (510 ... 519) @sv
alternative label: Absolutvärde, matematik (510 ... 519) @sv
alternative label: Asymmetri, matematik (510 ... 519) @sv
alternative label: Bifurkation, matematik (510) @sv
alternative label: Extremvärden, matematik (510) @sv
alternative label: Fermats problem (510) @sv
alternative label: Grundstorheter, matematik (510) @sv
alternative label: Gyllene snittet, matematik (510) @sv
alternative label: Hilberts problem, matematik (510) @sv
alternative label: Konstanter, muuttujat, matematik (510 ... 519) @sv
alternative label: Matematik (510) @sv
alternative label: Matematik, allmän matematik (510) @sv
alternative label: Matematiska metoder (510) @sv
alternative label: Matematiska metoder, matematik (510 ... 519) @sv
alternative label: Matematiska problem (510) @sv
alternative label: Matematiska teorier (510 ... 519) @sv
alternative label: Matematiska vetenskaper (510) @sv
alternative label: Matematiska vetenskaper, matematik (510 ... 519) @sv
alternative label: Naturvetenskaper, matematik (510 ... 519) @sv
alternative label: Osymmetri, matematik (510 ... 519) @sv
alternative label: Oändlighet, matematik (510) @sv
alternative label: P=NP?, matematik (510) @sv
alternative label: Parametrar, matematik (510) @sv
alternative label: Sectio aurea, matematik (510) @sv
alternative label: Storheter, matematik (510) @sv
broader: LUONNONTIETEET
in scheme: URN:NBN:fi:au:hklj:
narrower: Matematiikan taulukot ja kaavakokoelmat. Laskumenetelmät
narrower: Matematiikka harrasteena ja ajanvietteenä
narrower: Joukko-oppi
narrower: Lukuteoria. Aritmetiikka
narrower: Algebra
narrower: Geometria
narrower: Trigonometria
narrower: Analyysi
narrower: Todennäköisyyslaskenta
narrower: Matematiikan muut alat
notation: 510
related: LOGIIKKA
related: Logistiikka. Looginen kalkyyli
related: Teoria. Tutkimusmenetelmät. Tilastomatematiikka
related: Vakuutustoimi
related: FYSIIKKA
related: KEMIA
related: Laskentatoimi. Rahoitus. Talousarviot
related: Kauppamatematiikka
scope note: Matematiikan yleisteokset. Matematiikan perusteet Matematiikan yleiset oppi- ja harjoituskirjat sekä tehtäväkokoelmat Jos teos koskee sekä matematiikkaa että fysiikkaa, on etusija luokilla 510-519
scope note: Allmänna matematiska verk. Matematikens grunder Allmänna läroböcker, övningsböcker och samlingar av provuppgifter i matematik Om verket rör både matematik och fysik ges företräde åt klasserna 510-519 @sv

KEMIA
type: Class
type: Concept
subclass of: LUONNONTIETEET
alternative label: Betuliini, kemia (540)
alternative label: Kemia (540)
alternative label: Kemia, yleinen kemia (540)
alternative label: Ligandit (540)
alternative label: Luonnonopin oppikirjat, kemia, oppikirjat (540 ... 547)
alternative label: Luonnontieteet, kemia (540 ... 550)
alternative label: Luonnontieto, kemia (540 ... 547)
alternative label: Matemaattiset tieteet, kemia (540 ... 550)
alternative label: Perussuureet, kemia (540)
alternative label: Suureet, kemia (540)
alternative label: Vihreä kemia (540 ... 547)
alternative label: Betulin, kemi (540) @sv
alternative label: Grundstorheter, kemi (540) @sv
alternative label: Grön kemi (540 ... 547) @sv
alternative label: Kemi (540) @sv
alternative label: Kemi, allmän kemi (540) @sv
alternative label: Ligander (540) @sv
alternative label: Matematiska vetenskaper, kemi (540 ... 550) @sv
alternative label: Naturlära, kemi (540 ... 547) @sv
alternative label: Naturlära, läroböcker, kemi, läroböcker (540 ... 547) @sv
alternative label: Naturvetenskaper, kemi (540 ... 550) @sv
alternative label: Storheter, kemi (540) @sv
broader: LUONNONTIETEET
in scheme: URN:NBN:fi:au:hklj:
narrower: Kemia harrasteena ja ajanvietteenä
narrower: Teoreettinen kemia
narrower: Kokeellinen kemia
narrower: Analyyttinen kemia
narrower: Epäorgaaninen kemia
narrower: Orgaaninen kemia. Muovien kemia
narrower: Sovellettu kemia
notation: 540
preferred label: CHEMISTRY @en
preferred label: KEMI @sv
related: URN:NBN:fi:au:hklj:192
related: Aseteknologia
related: Hydrologia
related: Geomorfologia. Geodynamiikka
related: MATEMATIIKKA
related: Maailmankaikkeus. Kosmologia. Kosmogonia
related: FYSIIKKA
related: FYSIKAALINEN KEMIA
related: BIOKEMIA
related: URN:NBN:fi:au:hklj:615.1
related: Lääketieteellinen kemia ja fysiikka
related: Paperi- ja selluloosateollisuus
related: Kemian teollisuus
related: Maanviljely
scope note: Kemian yleisteokset. Yleiset kemian oppikirjat Jos teos koskee sekä matematiikkaa että kemiaa, on etusija luokilla 510-519 Jos teos koskee sekä fysiikkaa että kemiaa, on etusija luokilla 530-537
scope note: Allmänna verk om kemi. Allmänna läroböcker i kemi Om verket rör både matematik och kemi ges företräde åt klasserna 510-519 Om verket rör både fysik och kemi ges företräde åt klasserna 530-537 Tekniska och industriella tillämpningar av kemi klassificeras enligt område @sv

Hengityselimet. Hengityselinten taudit
type: Class
type: Concept
subclass of: URN:NBN:fi:au:hklj:617.9
alternative label: Asbesti, asbestoosi (617.92)
alternative label: Asbestoosi (617.92)
alternative label: Asfyksia, hengityselintaudit (617.92)
alternative label: Calmette-rokotus (617.92)
alternative label: Hapenotto, ihmisen fysiologia (617.92)
alternative label: Hapenpuute, lääketiede, hengityselintaudit (617.92)
alternative label: Hengenahdistus (617.92)
alternative label: Hengityksensuojaimet (617.92)
alternative label: Hengitys, ihmisen fysiologia (617.92)
alternative label: Hengityselimet, ihmisen anatomia (617.92)
alternative label: Hengityselimet, ihmisen fysiologia (617.92)
alternative label: Hengityselimet, taudit (617.92)
alternative label: Hengityselinten taudit (617.92)
alternative label: Hengityslaitteet (617.92)
alternative label: Hengitystiet, ihmisen anatomia (617.92)
alternative label: Hengitystiet, ihmisen fysiologia (617.92)
alternative label: Hengitystiet, taudit (617.92)
alternative label: Hengitysvajaus, hengityselinten taudit (617.92)
alternative label: Henkitorvi (617.92)
alternative label: Hikka (617.92)
alternative label: Hiukkaset, hengityselinten taudit (617.92)
alternative label: Homepölykeuhko (617.92)
alternative label: Hypoksia, hengityselinten taudit (617.92)
alternative label: Inhalaatio, hengitys (617.92)
alternative label: Inhalaatio, hengityselimet (617.92)
alternative label: Katupöly, hengityselinsairaudet (617.92)
alternative label: Keuhkosairaudet (617.92)
alternative label: Keuhkot, ihmisen anatomia ja fysiologia (617.92)
alternative label: Keuhkotuberkuloosi (617.92)
alternative label: Keuhkovammaiset, lääketieteellinen hoito (617.92)
alternative label: Maksimaalinen hapenotto, ihmisen fysiologia (617.92)
alternative label: Nikotus (617.92)
alternative label: Pienhiukkaset, hengityselinten taudit (617.92)
alternative label: Pöly, hengityselinsairaudet (617.92)
alternative label: Pölykeuhko (617.92)
alternative label: Rinta, keuhkot (617.92)
alternative label: Rintaelinkirurgia, keuhkojen kirurgia (617.92)
alternative label: Thoraxkirurgia, keuhkojen kirurgia (617.92)
alternative label: Tuberkuloosi (617.92)
alternative label: Andning, människans fysiologi (617.92) @sv
alternative label: Andningsorgan, människans anatomi (617.92) @sv
alternative label: Andningsorgan, människans fysiologi (617.92) @sv
alternative label: Andningsorgan, sjukdomar (617.92) @sv
alternative label: Andningsorganens sjukdomar (617.92) @sv
broader: URN:NBN:fi:au:hklj:617.9
in scheme: URN:NBN:fi:au:hklj:
notation: 617.92
related: URN:NBN:fi:au:hklj:181.9
related: URN:NBN:fi:au:hklj:332.22
related: URN:NBN:fi:au:hklj:371.6
related: URN:NBN:fi:au:hklj:373
related: URN:NBN:fi:au:hklj:576
related: Anatomia
related: URN:NBN:fi:au:hklj:612
related: URN:NBN:fi:au:hklj:613.1
related: Henkilökohtainen terveydenhoito
related: URN:NBN:fi:au:hklj:613.3
related: URN:NBN:fi:au:hklj:613.31
related: URN:NBN:fi:au:hklj:613.5
related: URN:NBN:fi:au:hklj:615
related: URN:NBN:fi:au:hklj:615.1
related: URN:NBN:fi:au:hklj:615.3
related: URN:NBN:fi:au:hklj:615.8
related: URN:NBN:fi:au:hklj:616
related: URN:NBN:fi:au:hklj:616.2
related: URN:NBN:fi:au:hklj:616.3
related: URN:NBN:fi:au:hklj:617.1
related: Sisäelimet. Sisätaudit
related: Syöpätaudit
related: URN:NBN:fi:au:hklj:617.4
related: Tartuntataudit
related: URN:NBN:fi:au:hklj:617.7
related: Allergiat
related: URN:NBN:fi:au:hklj:691.1
related: URN:NBN:fi:au:hklj:691.12
scope note: Hengityselimet, niiden anatomia ja fysiologia Hengityselinten taudit, niiden ennaltaehkäisy, diagnostiikka, hoito ja patologia Henkitorvi, keuhkoputki, keuhkot ja keuhkopussi sekä niiden taudit Hengityselinten tulehdukset. Keuhkokuume. Keuhkotuberkuloosi Pölykeuhko. Asbestikeuhko
scope note: Andningsorganen, deras anatomi och fysiologi Andningsorganens sjukdomar, förebyggande och behandling av dem samt deras diagnostik och patologi Luftstrupen, bronkerna, lungorna och lungsäcken samt sjukdomar i dem Infektioner i andningsorganen. Lunginflammation. Lungtuberkulos Dammlunga. Asbestlunga @sv

Yleinen konetekniikka
type: Class
type: Concept
subclass of: URN:NBN:fi:au:hklj:620
alternative label: Hajotus, koneet (622 +)
alternative label: Koneala (622 +)
alternative label: Koneet (622 +)
alternative label: Koneistot (622 +)
alternative label: Koneoppi (622 +)
alternative label: Konetekniikka (622 +)
alternative label: Käyttöönotto, koneet, moottorit (622 ... 623)
alternative label: Monitoimilaitteet (622 +)
alternative label: Suuttimet, koneet (622 +)
alternative label: Varaosat (622 +)
alternative label: Viat, koneiden korjaus (622 +)
alternative label: Apparatur, maskinteknik (622 +) @sv
alternative label: Fel, viat, maskinreparationer (622 +) @sv
alternative label: Ibruktagande, maskiner, motorer (622 ... 623) @sv
alternative label: Kombiapparater (622 +) @sv
alternative label: Maskinbranschen (622 +) @sv
alternative label: Maskiner (622 +) @sv
alternative label: Maskinerier (622 +) @sv
alternative label: Maskinlära (622 +) @sv
alternative label: Maskinteknik (622 +) @sv
alternative label: Munstycken, maskiner (622 +) @sv
alternative label: Reservdelar (622 +) @sv
alternative label: Sönderdelning, maskiner (622 +) @sv
broader: URN:NBN:fi:au:hklj:620
in scheme: URN:NBN:fi:au:hklj:
narrower: Koneenrakennus. Pneumatiikka. Hydrauliikka
notation: 622
preferred label: General mechanical engineering @en
preferred label: Allmän maskinteknik @sv
related: Mekaniikka
related: Tekninen mekaniikka
related: Voimakoneet. Moottorit. Nosto- ja kuljetuslaitteet
related: URN:NBN:fi:au:hklj:624
related: Tiet. Kadut. Tienrakennus. Kadunrakennus
related: Sillat. Sillanrakennus
related: Raideliikenneväylät. Junat. Raitiovaunut. Metro
related: Eläinten vetämät kulkuneuvot
related: Polkupyörät
related: Moottoripyörät. Mopedit
related: Autot
related: Muut maakulkuneuvot
related: Vesirakennus. Vesikulkuneuvot
related: Satamat. Satamatekniikka
related: Vesiväylät. Vesien säännöstely
related: Vesijohto-, viemäri- ja vedenpuhdistustekniikka
related: Vesikulkuneuvot
related: Laivat. Laivanrakennus
related: URN:NBN:fi:au:hklj:625.72
related: Muut vesikulkuneuvot
related: Ilmakulkuneuvot
related: Lentokoneet
related: Muut ilmakulkuneuvot
related: Sähköenergian muuttaminen, muuntaminen, jakelu ja siirto
related: Säätö- ja systeemitekniikka. Teollinen automaatio
related: URN:NBN:fi:au:hklj:631
scope note: Konetekniikan yleisteokset Teokset, joissa on sekä koneiden suunnittelua, piirtämistä tai rakentamista että koneiden ylläpitoa, huoltoa tai voitelutekniikkaa Teokset, joissa on sekä yleistä konetekniikkaa että säätö- ja systeemitekniikkaa tai koneteknistä automaatiota
scope note: Allmänna verk om maskinteknik Verk som handlar om såväl maskinritning samt konstruktion och tillverkning av maskiner som underhåll och service av maskiner samt smörjteknik Verk som handlar om såväl allmän maskinteknik som reglerteknik och systemteknik eller maskinteknisk automation @sv

Vesiväylät. Vesien säännöstely
type: Class
type: Concept
subclass of: Vesirakennus. Vesikulkuneuvot
alternative label: Ajoratamerkinnät, tien- ja kadunrakennus (625.2)
alternative label: Allasalueet (625.2)
alternative label: Altaat, vesirakennus (625.2)
alternative label: Hulevesi, viemäri-ja vedenpuhdistustekniikka (625.2)
alternative label: Joenperkaus, vesirakennus (625.2)
alternative label: Joenuomat, vesirakennus (625.2)
alternative label: Joet, vesirakennus (625.2)
alternative label: Jokisuistot, vesirakennus (625.2)
alternative label: Järvenlasku, vesirakennus (625.2)
alternative label: Järvet, tekojärvet, rakentaminen (625.2)
alternative label: Järvet, vesirakennus (625.2)
alternative label: Kanavasulut, kanavat (625.2)
alternative label: Kanavat, rakentaminen (625.2)
alternative label: Koskenperkaus, vesirakennus (625.2)
alternative label: Kosket, perkaaminen (625.2)
alternative label: Kuivatus, vesistöt (625.2)
alternative label: Kunnonvalvonta, vesiväylät (625.2)
alternative label: Kunnossapito, vesiväylät (625.2)
alternative label: Laivaväylät, rakennus ja kunnossapito (625.2)
alternative label: Liikenneväylät, vesiväylien rakennus (625.2)
alternative label: Meritiet, kunnossapito ja rakennus (625.2)
alternative label: Meriväylät, kunnossapito ja rakennus (625.2)
alternative label: Padot (625.2)
alternative label: Patoaltaat, vesien säännöstely (625.2)
alternative label: Pengerrykset, tulvasuojelu (625.2)
alternative label: Purot, vesirakennus (625.2)
alternative label: Ruoppaus (625.2)
alternative label: Sisävesiväylät, väylien rakennus ja kunnossapito (625.2)
alternative label: Sulut, kanavat (625.2)
alternative label: Säännöstelyaltaat, vesirakennus (625.2)
alternative label: Tekoaltaat, vesien säännöstely (625.2)
alternative label: Tekojärvet (625.2)
alternative label: Tekojärvet, vesien säännöstely (625.2)
alternative label: Tulvantorjunta (625.2)
alternative label: Tulvasuojelu (625.2)
alternative label: Tulvatorjunta (625.2)
alternative label: Uomat, vesirakennus (625.2)
alternative label: Vahingontorjunta, tulvasuojelu (625.2)
alternative label: Vedenkorkeus, vesien säännöstely (625.2)
alternative label: Vesirakennus, kanavat (625.2)
alternative label: Vesirakennus, kuivatus (625.2)
alternative label: Vesirakennus, padot, tekojärvet (625.2)
alternative label: Vesirakennus, vesien säännöstely (625.2)
alternative label: Vesirakennus, väylien rakennus (625.2)
broader: Vesirakennus. Vesikulkuneuvot
in scheme: URN:NBN:fi:au:hklj:
notation: 625.2
related: Vesioikeus
related: URN:NBN:fi:au:hklj:342
related: URN:NBN:fi:au:hklj:380
related: Vesiliikenne
related: URN:NBN:fi:au:hklj:460
related: Hydrologia
related: Vesien suojelu
related: Energia
related: Yleinen konetekniikka
related: Koneenrakennus. Pneumatiikka. Hydrauliikka
related: Voimakoneet. Moottorit. Nosto- ja kuljetuslaitteet
related: URN:NBN:fi:au:hklj:624
related: Sillat. Sillanrakennus
related: Satamat. Satamatekniikka
related: Vesikulkuneuvot
related: Laivat. Laivanrakennus
related: URN:NBN:fi:au:hklj:625.72
related: Muut vesikulkuneuvot
related: Sähköenergian tuottaminen. Voimalatekniikka
related: URN:NBN:fi:au:hklj:631
related: Maanviljely
related: URN:NBN:fi:au:hklj:657
related: URN:NBN:fi:au:hklj:660
related: Rakennusstatiikka. Rakennusaineet
related: Tekninen rakennussuunnittelu
related: Geotekniikka. Maatyöt
related: Merenkulkuoppi
related: Moottoriurheilu. Lentourheilu
scope note: Väylät, kanavat ja sulut, niiden rakentaminen ja kunnossapito Väylien ruoppaus. Ruoppaajat Vesien säännöstely, padot, penkereet ja tekojärvet, niiden rakentaminen ja kunnossapito Tulvasuojelu. Vesien kuivatus Koskien ja vesistöjen perkaaminen ja ruoppaus Jos teos koskee väyliä tai kanavia sekä rakentamisen että vesiliikenteen kannalta, on etusija luokalla 386.1
scope note: Farleder, kanaler och slussar, byggande och underhåll av dem Muddring av farleder. Mudderverk Vattenreglering, dammar, bankar och konstgjorda sjöar, byggande och underhåll av dem Skydd mot översvämning. Torrläggning av sjöar Rensning och muddring av forsar och vattendrag Om verket handlar om farleder eller kanaler med hänsyn till både byggande och sjötrafik, ges företräde åt klass 386.1 @sv

Tietoliikenne. Viestintätekniikka. Multimedia
type: Class
type: Concept
subclass of: URN:NBN:fi:au:hklj:627.7
alternative label: ADSL (627.75 +)
alternative label: ATM-tekniikka (627.75 +)
alternative label: Ad hoc -verkot, atk (627.75 +)
alternative label: Alueverkot (627.75 +)
alternative label: Anonyymit verkot, tietoverkot (627.75 +)
alternative label: Anonyymiverkot, tietoverkot (627.75 +)
alternative label: Antennijärjestelmät (627.75 +)
alternative label: Antennijärjestelmät, tietoliikennetekniikka (627.75)
alternative label: Antennit (627.75 +)
alternative label: Antennit, tietoliikennetekniikka (627.75 +)
alternative label: Asiointi, sähköinen asiointi (627.75 +)
alternative label: Asymmetric digital subscriber line (627.75 +)
alternative label: Audiokokoukset, teletekniikka (627.75 +)
alternative label: Audiokonferenssit, teletekniikka (627.75 +)
alternative label: Audioneuvottelut, teletekniikka (627.75 +)
alternative label: Darknet, tietoverkot (627.75 +)
alternative label: Dataliikenne (627.75 +)
alternative label: Datasiirto (627.75 +)
alternative label: Datasiirtolaitteet (627.75 +)
alternative label: Datasähkö (627.75)
alternative label: EDI, tiedonsiirron tekniikka (627.75 +)
alternative label: Elektroninen tiedonsiirto (627.75 +)
alternative label: Elektroniset julkaisut, tietoverkot (627.75 +)
alternative label: Elektroniset kokoukset, teletekniikka (627.75 +)
alternative label: Etäluenta, teletekniikka (627.75 +)
alternative label: Faksi (627.75)
alternative label: Faksimile (627.75)
alternative label: Heikkovirtatekniikka (627.75 +)
alternative label: ICT-ala, viestintätekniikka (627.75 +)
alternative label: Informaatioala, tietoverkot (627.75 +)
alternative label: Informaatiografiikka, viestintäteknologia (627.75 +)
alternative label: Informaatioteknologia, tietoliikennetekniikka (627.75 +)
alternative label: Itseorganisoituvat verkot, atk (627.75 +)
alternative label: Kaapelit, tietoliikennetekniikka (627.75 +)
alternative label: Kaapeliverkot, tietoliikennetekniikka (627.75 +)
alternative label: Kaapeliviestintä, tietokoneverkot (627.75 +)
alternative label: Kaapeliviestintä, tietoliikennetekniikka (627.75 +)
alternative label: Kaapelointi, tietoliikennetekniikka (627.75 +)
alternative label: Kansalaisen tietoverkot (627.75 +)
alternative label: Kaukokirjoittimet (627.75)
alternative label: Koodausteoria, tietoliikenne (627.75 +)
alternative label: Kuvansiirto (627.75 +)
alternative label: Käyttötutkimus, tietoliikennepalvelut (627.75 +)
alternative label: Laajakaistaverkot (627.75 +)
alternative label: Laajaverkot (627.75 +)
alternative label: Langaton tiedonsiirto (627.75 +)
alternative label: Langaton viestintä (627.75 +)
broader: URN:NBN:fi:au:hklj:627.7
in scheme: URN:NBN:fi:au:hklj:
narrower: URN:NBN:fi:au:hklj:627.751
narrower: Matkaviestinpalvelut. Puhelinliikenne
narrower: URN:NBN:fi:au:hklj:627.753
notation: 627.75
related: LOGIIKKA
related: Logistiikka. Looginen kalkyyli
related: URN:NBN:fi:au:hklj:182
related: URN:NBN:fi:au:hklj:332.1
related: URN:NBN:fi:au:hklj:380
related: URN:NBN:fi:au:hklj:384
related: Posti
related: Radio- ja televisiotoiminta
related: Radiotoiminta
related: URN:NBN:fi:au:hklj:384.42
related: Lehdistöoppi
related: Avaruustutkimus. Avaruuslennot. Avaruusteknologia
related: Sähköoppi. Magnetismi
related: URN:NBN:fi:au:hklj:620.88
related: URN:NBN:fi:au:hklj:627.73
related: Säätö- ja systeemitekniikka. Teollinen automaatio
related: Elektroniikka
related: URN:NBN:fi:au:hklj:667.7
related: URN:NBN:fi:au:hklj:667.71
related: Toimistotyö
related: URN:NBN:fi:au:hklj:681
related: Toimistokoneet
scope note: Tietoliikenne yleensä. Tietoliikenne-, viestintä- ja teletekniikka yleensä Tässä ja alaluokissa multimedia, hypermedia ja hyperteksti yleensä Tässä ja alaluokkiin tietoverkot, tietoliikenneverkot, verkkopalvelut ja verkkoviestintä sekä niiden tekniikka yleensä Tässä ja alaluokissa analogisen ja digitaalisen tiedon-, tekstin-, kuvan- ja äänensiirron tekniikka yleensä Tässä ja alaluokissa tietoliikenneohjelmat ja tietoliikenneprotokollat yleensä Tässä ja alaluokissa tietoliikenteen lähetys-, siirto- ja vastaanottolaitteet sekä niiden tekniikka ja teollinen valmistus yleensä Tässä ja alaluokissa modeemi-, laajakaista- ja langaton tekniikka sekä kaapeleiden, modeemien, antennien ja tietoliikennesatelliittien tekniikka yleensä Erikoisaloihin liittyvä tietoliikenne sekä viestintä- ja tietoliikennetekniikka alan mukaisessa luokassa Jos teos koskee sekä tietoliikennettä että joukkoviestintää, on etusija luokalle 384+
scope note: Datakommunikation i allmänhet. Kommunikations- och telekommunikationsteknik i allmänhet Hit och till underklasserna allmänna verk om multimedia, hypermedia och hypertext Hit och till underklasserna allmänna verk om datanät, telekommunikationsnät, nättjänster och nätkommunikation samt teknik i dem Hit och till underklasserna allmänna verk om analog och digital data-, text-, bild- och ljudöverföringsteknik Hit och till underklasserna allmänna verk om kommunikationsprogram och länkprotokoll Hit och till underklasserna allmänna verk om sändar-, överförings- och mottagaranordningar samt industri som tillverkar dem Hit och till underklasserna allmänna verk om modem-, bredbands- och trådlös teknik samt allmänna verk om kablar, modem, antenner och telekommunikationssatelliter Datakommunikation samt kommunikations- och telekommunikationsteknik inom specialområden klassificeras enligt område Om verket behandlar både data- och masskommunikation ges företräde åt klassen 384+ @sv

Lemmikkieläimet
type: Class
type: Concept
subclass of: URN:NBN:fi:au:hklj:654
alternative label: Eläimet, lemmikkieläimet (654.9 +)
alternative label: Eläinkaupat, lemmikkieläimet (654.9 +)
alternative label: Eläinkauppa, lemmikkieläimet (654.9 +)
alternative label: Eläinlajit, lemmikkieläimet (654.9 +)
alternative label: Eläinten ruoat (654.9 +)
alternative label: Harrastukset, lemmikkieläimet (654.9 +)
alternative label: Ihminen-eläinsuhde, lemmikkieläimet (654.9)
alternative label: Jalostaminen, lemmikkieläimet (654.9 +)
alternative label: Jalostus, lemmikkieläimet (654.9 +)
alternative label: Jälkeläiset, lemmikkieläimet (654.9 +)
alternative label: Kasvatus (eläinten kasvatus), lemmikkieläimet (654.9 +)
alternative label: Kilpikonnat, lemmikkieläimet (654.9)
alternative label: Kirput, lemmikkieläinten (654.9 +)
alternative label: Kotieläimet, lemmikkieläimet (654.9 +)
alternative label: Kotiterraariot (654.9)
alternative label: Käyttäytyminen, lemmikkieläimet (654.9 +)
alternative label: Käärmeet, lemmikkieläimet (654.9)
alternative label: Lajit, lemmikkieläimet (654.9 +)
alternative label: Lemmikkieläimet (654.9 +)
alternative label: Lemmikkieläinkaupt (654.9 +)
alternative label: Lemmikkieläinmyymälät (654.9 +)
alternative label: Liskot, lemmikkieläimet (654.9)
alternative label: Löytöeläimet, lemmikkieläinten hoito (654.9 +)
alternative label: Matelijat, lemmikkieläimet (654.9)
alternative label: Ontuminen, lemmikkieläimet (654.9 +)
alternative label: Penikointi, lemmikkieläimet (654.9 +)
alternative label: Poikaset, lemmikkieläimet (654.9 +)
alternative label: Poikiminen, lemmikkieläimet (654.9 +)
alternative label: Rodut, jalostus, lemmikkieläimet (654.9 +)
alternative label: Ruokinta, lemmikkieläimet (654.9 +)
alternative label: Ruokintalaitteet, lemmikkieläinten hoito (654.9 +)
alternative label: Sairaudet, eläinlääketiede, lemmikkieläimet (654.9 +)
alternative label: Sisäsiitos, lemmikkieläinjalostus (654.9 +)
alternative label: Sukusiitos, lemmikkieläinjalostus (654.9 +)
alternative label: Taudinkestävyys, eri lemmikkieläimet (654.9 +)
alternative label: Taudit, eri lemmikkieläimet (654.9 +)
alternative label: Terraariot, lemmikkieläinten hoito (654.9 +)
alternative label: Tiineys, lemmikkieläimet (654.9 +)
alternative label: Turkki, eläimet, lemmikkieläimet (654.9 +)
alternative label: Arter, sällskapsdjur (654.9 +) @sv
alternative label: Avkomma, sällskapsdjur (654.9 +) @sv
alternative label: Beteende, sällskapsdjur (654.9 +) @sv
alternative label: Djur, sällskapsdjur (654.9 +) @sv
alternative label: Djuraffärer, sällskapsdjur (654.9 +) @sv
alternative label: Djurarter, sällskapsdjur (654.9 +) @sv
alternative label: Djurhandel, sällskapsdjur (654.9 +) @sv
alternative label: Djurmat (654.9 +) @sv
alternative label: Dräktighet, sällskapsdjur (654.9 +) @sv
alternative label: Förädling, sällskapsdjur (654.9 +) @sv
alternative label: Haltande, sällskapsdjur (654.9 +) @sv
broader: URN:NBN:fi:au:hklj:654
in scheme: URN:NBN:fi:au:hklj:
narrower: Koirat
narrower: Kissat
narrower: Pikkunisäkkäät
narrower: Häkkilinnut
narrower: Akvaariot
notation: 654.9
related: Ympäristöoikeus. Talousoikeus
related: URN:NBN:fi:au:hklj:576
related: URN:NBN:fi:au:hklj:590
related: Eläintarhat
related: Eläinsuojelu
related: Systemaattinen eläintiede
related: Selkärankaiset
related: Nisäkkäät
related: Eläinten vetämät kulkuneuvot
related: URN:NBN:fi:au:hklj:649.91
related: Maatalouspolitiikka
related: URN:NBN:fi:au:hklj:650.2
related: URN:NBN:fi:au:hklj:651
related: URN:NBN:fi:au:hklj:657
related: Eläinlääketiede
related: Rakennusten erillistilat
related: URN:NBN:fi:au:hklj:691.13
scope note: Lemmikkieläimet ja niiden hoito yleensä Tässä ja alaluokissa lemmikkieläinlajit ja -rodut, lemmikkieläinten alkuperä, kesytys ja jalostus Lemmikkieläinten ruokinta ja muu hoito Tässä ja alaluokissa lemmikkieläinten kasvatus ja kauppa Kotiterraariot ja niiden hoito yleensä Kilpikonnat, käärmeet ja liskot lemmikkieläiminä
scope note: Sällskapsdjur och skötsel av dem i allmänhet Hit och till underklasserna sällskapsdjurens arter och raser, sällskapsdjurens ursprung, domesticering, förädling och utfodring av sällskapsdjur Vård av sällskapsdjur Hit och till underklasserna uppfödning av och handel med sällskapsdjur Hemterrarier och skötsel av dem i allmänhet Sköldpaddor, ormar och ödlor som sällskapsdjur @sv

Kalaruoat
type: Class
type: Concept
subclass of: URN:NBN:fi:au:hklj:691.13
alternative label: Ahven, kalaruoat (691.131)
alternative label: Ankerias, kalaruoat (691.131)
alternative label: Hauki, ruokaohjeet (691.131)
alternative label: Jokirapu, ruokaohjeet (691.131)
alternative label: Kala, kalaruoat (691.131)
alternative label: Kalaliemet, kalaruoat (691.131)
alternative label: Kalannahka, kalaruoat (691.131)
alternative label: Kalapyörykät (691.131)
alternative label: Kalaruoat (691.131)
alternative label: Kalaruuat (691.131)
alternative label: Kalat, ruokaohjeet (691.131)
alternative label: Kampela, kalaruoat (691.131)
alternative label: Keittokirjat, kalaruoat (691.131)
alternative label: Kilohaili, ruokaohjeet (691.131)
alternative label: Kirjolohi, kalaruoat (691.131)
alternative label: Kokkikirjat, kalaruoat (691.131)
alternative label: Kuha, kalaruoat (691.131)
alternative label: Kuore, kalaruoat (691.131)
alternative label: Lahna, kalaruoat (691.131)
alternative label: Lohi, ruoanvalmistus (691.131)
alternative label: Made, kalaruoat (691.131)
alternative label: Muikku, ruoanvalmistus (691.131)
alternative label: Mustekalat, ruoanvalmistus (691.131)
alternative label: Mäti, ruoanvalmistus (691.131)
alternative label: Nahkiainen, ruoanvalmistus (691.131)
alternative label: Nieriä, ruokaohjeet (691.131)
alternative label: Osterit, ruokaohjeet (691.131)
alternative label: Perkaus, kalaruoat, ruoanvalmistus (691.131)
alternative label: Rapu, ruokaohjeet (691.131)
alternative label: Ravut, ruoanvalmistus (691.131)
alternative label: Ruoat, keittokirjat, kalaruoat (691.131)
alternative label: Sampikalat, kalaruoat (691.131)
alternative label: Siika, kalaruoat (691.131)
alternative label: Silakka, kalaruoat (691.131)
alternative label: Sillikalat, kalaruoat (691.131)
alternative label: Simpukat, ruokaohjeet (691.131)
alternative label: Suutari, kalaruoat (691.131)
alternative label: Särki, ruoanvalmistus (691.131)
alternative label: Taimen, ruoanvalmistus (691.131)
alternative label: Turska, ruokaohjeet (691.131)
alternative label: Äyriäiset, ruokaohjeet (691.131)
alternative label: Abborre, fiskrätter (691.131) @sv
alternative label: Bläckfiskar, matlagning (691.131) @sv
alternative label: Braxen, fiskrätter (691.131) @sv
broader: URN:NBN:fi:au:hklj:691.13
in scheme: URN:NBN:fi:au:hklj:
notation: 691.131
related: URN:NBN:fi:au:hklj:473
related: URN:NBN:fi:au:hklj:473.1
related: URN:NBN:fi:au:hklj:475
related: URN:NBN:fi:au:hklj:475.1
related: URN:NBN:fi:au:hklj:476
related: URN:NBN:fi:au:hklj:476.1
related: URN:NBN:fi:au:hklj:476.11
related: URN:NBN:fi:au:hklj:476.12
related: URN:NBN:fi:au:hklj:476.5
related: URN:NBN:fi:au:hklj:476.6
related: URN:NBN:fi:au:hklj:476.7
related: URN:NBN:fi:au:hklj:476.8
related: Kalat
related: URN:NBN:fi:au:hklj:613.1
related: URN:NBN:fi:au:hklj:649.91
related: Puutarhanhoito. Hyötykasvit. Huone- ja koristekasvit
related: Hyötykasvit
related: Yrtti- ja maustekasvit
related: Hedelmä-, marja- ja vihanneskasvit
related: Metsästys. Kalastus
related: Metsästys
related: Kalastus
related: Hotelli- ja ravintolatalous
related: Kotitalous. Kodinhoito
related: Eri maiden ja alueiden ruokalajit ja ruokakulttuuri
related: Säilöntä
related: Kotijuhlien järjestäminen. Kutsujen järjestäminen
related: Suurkeittiöt
scope note: Kala-, rapu-, äyriäis-, simpukka- ja mustekalaruokien valmistusohjeet Kala-, rapu-, äyriäis-, simpukka- ja mustekalaruokia koskeva ruokakulttuuri ja gastronomia Tässä myös perinteisten ja kansallisten kala-, rapu-, äyriäis-, simpukka- ja mustekalaruokien valmistusohjeet Jos teoksessa on sekä käytännön ruoanvalmistusohjeita tai ruokakulttuuria että kansatiedettä, on etusija luokalla 691.131
scope note: Matrecept för fiskrätter samt recept för maträtter med kräftor, skaldjur, musslor och bläckfisk Matkultur och gastronomi som rör fiskrätter och maträtter med kräftor, skaldjur, musslor och bläckfisk Hit också matrecept för traditionella och nationella fiskrätter samt recept för maträtter med kräftor, skaldjur, musslor och bläckfisk Om verket handlar om såväl matrecept eller matkultur som etnologi, ges företräde åt klass 691.131 @sv

Eri maiden ja alueiden ruokalajit ja ruokakulttuuri
type: Class
type: Concept
subclass of: URN:NBN:fi:au:hklj:691.1
alternative label: Cajun, ruokaohjeet (691.14)
alternative label: Jouluruoat, ruokaohjeet, perinneruoat (691.14)
alternative label: Kansallisruoat, ruokaohjeet (691.14)
alternative label: Kansanperinne, ruokaohjeet (691.14)
alternative label: Kebab, itämaiset ruokaohjeet (691.14)
alternative label: Keittokirjat, eri maiden (691.14)
alternative label: Keittokirjat, perinneruoat (691.14)
alternative label: Kokkikirjat, eri maiden (691.14)
alternative label: Kokkikirjat, perinneruoat (691.14)
alternative label: Maakuntaruoat, ruokaohjeet (691.14)
alternative label: Makaronit, ruokaohjeet, Italia (691.14)
alternative label: Nuudeli, itämaiset ruokaohjeet (691.14)
alternative label: Pasta, italialaiset ruokaohjeet (691.14)
alternative label: Perinneruoat, ruokaohjeet (691.14)
alternative label: Pitsat, ruokaohjeet (691.14)
alternative label: Pitäjäruoat, ruokaohjeet (691.14)
alternative label: Pizzat, ruokaohjeet (691.14)
alternative label: Ruoat, keittokirjat, kansalliset (691.14)
alternative label: Ruokakulttuuri, kansalliset keittokirjat (691.14)
alternative label: Ruokaperinne, kansalliset keittokirjat (691.14)
alternative label: Salsa, ruokaohjeet (691.14)
alternative label: Spagetti, italialaiset ruokaohjeet (691.14)
alternative label: Cajun, matrecept (691.14) @sv
alternative label: Folktradition, matrecept (691.14) @sv
alternative label: Julmat, matrecept, traditionsrätter (691.14) @sv
alternative label: Kebab, orientaliska matrecept (691.14) @sv
alternative label: Kokböcker, olika länders (691.14) @sv
alternative label: Kokböcker, traditionsrätter (691.14) @sv
alternative label: Landskapsrätter, matrecept (691.14) @sv
alternative label: Makaroner, matrecept, Italien (691.14) @sv
alternative label: Matkultur, nationella kokböcker (691.14) @sv
alternative label: Maträtter, kokböcker, nationella (691.14) @sv
alternative label: Mattradition, nationella kokböcker (691.14) @sv
alternative label: Nationalrätter, matrecept (691.14) @sv
alternative label: Nuudel, orientaliska matrecept (691.14) @sv
alternative label: Pasta, italienska matrecept (691.14) @sv
alternative label: Pitsor, matrecept (691.14) @sv
alternative label: Pizzor, matrecept (691.14) @sv
alternative label: Salsa, matrecept (691.14) @sv
alternative label: Sockenrätter, matrecept (691.14) @sv
alternative label: Spagetti, italienska matrecept (691.14) @sv
alternative label: Traditionsrätter, matrecept (691.14) @sv
broader: URN:NBN:fi:au:hklj:691.1
in scheme: URN:NBN:fi:au:hklj:
notation: 691.14
preferred label: Foods and culinary art in different countries and regions @en
preferred label: Maträtter och matkultur i olika länder och regioner @sv
related: URN:NBN:fi:au:hklj:473
related: URN:NBN:fi:au:hklj:473.1
related: URN:NBN:fi:au:hklj:475
related: URN:NBN:fi:au:hklj:475.1
related: URN:NBN:fi:au:hklj:476
related: URN:NBN:fi:au:hklj:476.1
related: URN:NBN:fi:au:hklj:476.11
related: URN:NBN:fi:au:hklj:476.12
related: URN:NBN:fi:au:hklj:476.5
related: URN:NBN:fi:au:hklj:476.6
related: URN:NBN:fi:au:hklj:476.7
related: URN:NBN:fi:au:hklj:476.8
related: URN:NBN:fi:au:hklj:613.1
related: URN:NBN:fi:au:hklj:649.91
related: Puutarhanhoito. Hyötykasvit. Huone- ja koristekasvit
related: Hyötykasvit
related: Yrtti- ja maustekasvit
related: Hedelmä-, marja- ja vihanneskasvit
related: Hotelli- ja ravintolatalous
related: Kotitalous. Kodinhoito
related: Leipominen
related: URN:NBN:fi:au:hklj:691.12
related: URN:NBN:fi:au:hklj:691.13
related: Kalaruoat
related: Säilöntä
related: Kotijuhlien järjestäminen. Kutsujen järjestäminen
related: Suurkeittiöt
scope note: Tietyn maan, maakunnan tai alueen ruokalajeja koskevat keittokirjat sekä teokset, jotka esittelevät jonkin tietyn maan tai alueen ruokakulttuuria, gastronomiaa tai keittiötä yleensä Perinnekeittokirjat yleensä Jos teoksessa on sekä käytännön ruoanvalmistusohjeita tai ruokakulttuuria että kansatiedettä, on etusija luokalla 691.14+
scope note: Hit kokböcker som behandlar enskilda länders, landskaps eller regioners maträtter samt verk som presenterar något bestämt lands eller någon bestämd regions matkultur, gastronomi eller kök i allmänhet Kokböcker över traditionella maträtter i allmänhet Om verket handlar om såväl matrecept eller matkultur som etnologi, ges företräde åt klass 691.14+ @sv

Elokuva. Elokuvataide
type: Class
type: Concept
subclass of: URN:NBN:fi:au:hklj:770
alternative label: Amatöörielokuvat, elokuva (777)
alternative label: Arvostelut, elokuva (777)
alternative label: Dokumentaarisuus, elokuvan estetiikka (777 +)
alternative label: Elokuva (777 +)
alternative label: Elokuva-ala (777 +)
alternative label: Elokuva-arvostelut (777 +)
alternative label: Elokuvafestivaalit (777 +)
alternative label: Elokuvailmaisu (777 +)
alternative label: Elokuvakasvatus (777 +)
alternative label: Elokuvakerhot (777 +)
alternative label: Elokuvakoulut (777 +)
alternative label: Elokuvakritiikki (777 +)
alternative label: Elokuvakulttuuri (777 +)
alternative label: Elokuvapolitiikka (777 +)
alternative label: Elokuvasensuuri (777 +)
alternative label: Elokuvataide (777 +)
alternative label: Elokuvateollisuus (777 +)
alternative label: Elokuvatrailerit (777 +)
alternative label: Elokuvatuotanto (777 +)
alternative label: Elokuvatuottajat, elokuvatuottajan työ (777)
alternative label: Elokuvatutkijat (777 +)
alternative label: Elokuvatutkimus, elokuva (777 +)
alternative label: Elokuvissakäynti (777 +)
alternative label: Elämysteollisuus, elokuvateollisuus (777 +)
alternative label: Ennakkosensuuri, elokuvat (777 +)
alternative label: Esittävät taiteet, elokuvataide (777 +)
alternative label: Genretutkimus, elokuva (777 +)
alternative label: Huvit, elokuva (777 +)
alternative label: Jatkokertomukset, elokuvataide (777 +)
alternative label: Juoni, elokuvan estetiikka (777)
alternative label: Katselijatutkimukset, elokuvat (777 +)
alternative label: Katsojat, elokuvat (777 +)
alternative label: Kerronnallisuus, elokuvan estetiikka (777 +)
alternative label: Kerronta, elokuvan estetiikka (777)
alternative label: Kertominen, elokuvan estetiikka (777)
alternative label: Kokeelliset elokuvat, elokuva (777 +)
alternative label: Komiikka, elokuvan estetiikka (777)
alternative label: Kuvallinen viestintä, elokuva (777 +)
alternative label: Kävijät, elokuva (777)
alternative label: Kävijätutkimukset, elokuva (777)
alternative label: Lyhytelokuvat, elokuvan estetiikka (777)
alternative label: Narratiivisuus, elokuvan estetiikka (777 +)
alternative label: Näytelmäelokuvat, elokuvan estetiikka (777 +)
alternative label: Näytökset, elokuvaohjelmisto (777)
alternative label: Ohjelmistot, elokuvatoiminta (777)
alternative label: Pseudodokumentit, elokuva (777 +)
alternative label: Pääsyliput, elokuva (777 +)
alternative label: Taideharrastukset, elokuva (777 +)
broader: URN:NBN:fi:au:hklj:770
in scheme: URN:NBN:fi:au:hklj:
narrower: Elokuvatekniikka. Videokuvauksen tekniikka
narrower: URN:NBN:fi:au:hklj:777.9
notation: 777
related: URN:NBN:fi:au:hklj:1.4
related: URN:NBN:fi:au:hklj:1.791
related: URN:NBN:fi:au:hklj:384.42
related: URN:NBN:fi:au:hklj:710
related: URN:NBN:fi:au:hklj:756
related: Valokuvataide
related: Valokuvauksen materiaalit ja tekniikka. Valokuvausoppaat
related: Teatteri- ja näyttämötaiteen teoria, estetiikka ja filosofia
related: Harrastajateatteri
related: URN:NBN:fi:au:hklj:770.9
related: Suomi
related: Teatterityö
related: Teatteritekniikka
related: Teatterimuodot
related: Nukketeatteri
related: Tanssitaide
related: Baletti
related: Jazzbaletti. Moderni tanssi
related: Pantomiimi
related: Ilmaisutaito. Puhetaito. Lausuntataide
related: URN:NBN:fi:au:hklj:783.67
related: URN:NBN:fi:au:hklj:783.68
scope note: Elokuvaa tai elokuvataidetta koskevat yleisteokset, jotka koskevat sekä elokuvatekniikkaa että elokuvan tai elokuvataiteen historiaa Elokuvan tuottaminen ja markkinointi Elokuvateollisuus. Elokuvateatteritoiminta Elokuva-arvostelu ja elokuva-arvostelut yleensä Elokuvan ja elokuvataiteen teoria, filosofia ja estetiikka yleensä Elokuvatallenteet sisällön mukaisessa luokassa Yksittäistä tuottajaa ym. koskevat teokset elokuvataiteen historian luokassa 777.9+
scope note: Allmänna verk om film eller filmkonst och som rör såväl filmteknik som filmens eller filmkonstens historia Filmproduktion och marknadsföring av filmer Filmindustri. Biografverksamhet Filmkritik och filmrecensioner i allmänhet Filmens och filmkonstens teori, filosofi och estetik i allmänhet Filminspelningar klassificeras enligt innehåll Verk som handlar om enskilda producenter o.dyl. förs till klassen för filmkonstens historia 777.9+ @sv

Länsi- ja Keski-Eurooppa
type: Class
type: Concept
subclass of: URN:NBN:fi:au:hklj:777.9
alternative label: Alankomaat, elokuvataide (777.93)
alternative label: Belgia, elokuvataide (777.93)
alternative label: Hollanti, elokuvataide (777.93)
alternative label: Itävalta, elokuvataide (777.93)
alternative label: Romania, elokuvataide (777.93)
alternative label: Sveitsi, elokuvataide (777.93)
alternative label: Tsekki, elokuvataide (777.93)
alternative label: Unkari, elokuvataide (777.93)
alternative label: Belgien, filmkonst (777.93) @sv
alternative label: Holland, filmkonst (777.93) @sv
alternative label: Nederländerna, filmkonst (777.93) @sv
alternative label: Rumänien, filmkonst (777.93) @sv
alternative label: Schweiz, filmkonst (777.93) @sv
alternative label: Tjeckien, filmkonst (777.93) @sv
alternative label: Ungern, filmkonst (777.93) @sv
alternative label: Österrike, filmkonst (777.93) @sv
broader: URN:NBN:fi:au:hklj:777.9
in scheme: URN:NBN:fi:au:hklj:
narrower: Saksa
narrower: Ranska
narrower: Brittein saaret
notation: 777.93
preferred label: Western and Central Europe @en
preferred label: Västeuropa och Centraleuropa @sv
related: URN:NBN:fi:au:hklj:1.4
related: URN:NBN:fi:au:hklj:1.84
related: URN:NBN:fi:au:hklj:1.944
related: URN:NBN:fi:au:hklj:2.84
related: URN:NBN:fi:au:hklj:2.94
related: URN:NBN:fi:au:hklj:3.4
related: URN:NBN:fi:au:hklj:384.42
related: URN:NBN:fi:au:hklj:4.4
related: URN:NBN:fi:au:hklj:5.4
related: URN:NBN:fi:au:hklj:6.4
related: URN:NBN:fi:au:hklj:7.4
related: URN:NBN:fi:au:hklj:709
related: URN:NBN:fi:au:hklj:710
related: URN:NBN:fi:au:hklj:756
related: Teatteri- ja näyttämötaiteen teoria, estetiikka ja filosofia
related: URN:NBN:fi:au:hklj:770.9
related: Elokuvatekniikka. Videokuvauksen tekniikka
related: URN:NBN:fi:au:hklj:783.67
related: URN:NBN:fi:au:hklj:783.68
scope note: Benelux-maat. Alankomaat. Belgia. Luxemburg. Unkari. Puola. Tsekki. Slovakia. Romania. Sveitsi. Liechtenstein. Itävalta
scope note: Beneluxländerna. Nederländerna. Belgien. Luxemburg. Ungern. Polen. Tjeckien. Slovakien. Rumänien. Schweiz. Liechtenstein. Österrike @sv

Oopperat
type: Class
type: Concept
subclass of: URN:NBN:fi:au:hklj:783.6
alternative label: Ariosot, oopperat (783.61 +)
alternative label: Festivaalit, oopperajuhlat (783.61 +)
alternative label: Harjoitukset, ooppera (783.61 +)
alternative label: Juoni, ooppera (783.61 +)
alternative label: Kamarioopperat (783.61 +)
alternative label: Katsojat, ooppera (783.61)
alternative label: Laulumusiikki, ooppera (783.61 +)
alternative label: Libretistit, ooppera (783.61 +)
alternative label: Libretot, ooppera (783.61 +)
alternative label: Näytökset, oopperaohjelmisto (783.61 +)
alternative label: Ohjaus, ooppera (783.61)
alternative label: Ooppera (783.61)
alternative label: Ooppera, libretot (783.61)
alternative label: Oopperajuhlat (783.61)
alternative label: Oopperalaulajat (783.61 +)
alternative label: Oopperaohjaus (783.61)
alternative label: Oopperat (783.61)
alternative label: Oopperat, libretot (783.61)
alternative label: Peking-ooppera (783.61)
alternative label: Pääsyliput, ooppera (783.61)
alternative label: Resitatiivit, ooppera (783.61 +)
alternative label: Roolit, ooppera (783.61)
alternative label: Tarpeistonhoitajat, ooppera (783.61)
alternative label: Televisio-oopperat (783.61 +)
alternative label: Verismi, ooppera (783.61 +)
alternative label: Arioson, operor (783.61 +) @sv
alternative label: Festivaler, operafester (783.61 +) @sv
alternative label: Förevisningar, operarepertoar (783.61 +) @sv
alternative label: Intrig, opera (783.61 +) @sv
alternative label: Inträdesbiljetter, opera (783.61) @sv
alternative label: Kammaroperor (783.61 +) @sv
alternative label: Librettister, opera (783.61 +) @sv
alternative label: Libretton, opera (783.61 +) @sv
alternative label: Opera (783.61) @sv
alternative label: Opera, libretton (783.61) @sv
alternative label: Operafestspel (783.61) @sv
alternative label: Operaregi (783.61) @sv
alternative label: Operasångare (783.61 +) @sv
alternative label: Operor (783.61) @sv
alternative label: Operor, libretton (783.61) @sv
alternative label: Pekingopera (783.61) @sv
alternative label: Recitativ, opera (783.61 +) @sv
alternative label: Regi, opera (783.61) @sv
alternative label: Rekvisitörer, opera (783.61) @sv
alternative label: Roller, opera (783.61) @sv
alternative label: Sångmusik, opera (783.61 +) @sv
alternative label: TV-operor (783.61 +) @sv
alternative label: Verism, opera (783.61 +) @sv
broader: URN:NBN:fi:au:hklj:783.6
in scheme: URN:NBN:fi:au:hklj:
narrower: Oopperoiden soitinosat
narrower: Oopperoiden solistiset lauluosat
narrower: Oopperoiden kuoro-osat
notation: 783.61
related: URN:NBN:fi:au:hklj:1.3
related: URN:NBN:fi:au:hklj:1.83
related: URN:NBN:fi:au:hklj:1.943
related: URN:NBN:fi:au:hklj:2.3
related: URN:NBN:fi:au:hklj:2.83
related: URN:NBN:fi:au:hklj:2.93
related: URN:NBN:fi:au:hklj:3.3
related: URN:NBN:fi:au:hklj:4.3
related: URN:NBN:fi:au:hklj:5.3
related: URN:NBN:fi:au:hklj:6.3
related: URN:NBN:fi:au:hklj:7.3
related: Kulttuurirakennukset
related: URN:NBN:fi:au:hklj:770
related: Teatterimuodot
related: URN:NBN:fi:au:hklj:783.5
related: Balettimusiikki
related: URN:NBN:fi:au:hklj:784
related: URN:NBN:fi:au:hklj:784.111
related: URN:NBN:fi:au:hklj:788
related: URN:NBN:fi:au:hklj:789
related: URN:NBN:fi:au:hklj:8.3
scope note: Tässä ja alaluokissa oopperamusiikki sekä oopperaesitysten videotallenteet Tässä ja alaluokissa myös oopperaa sekä sen historiaa tai henkilöhistoriaa koskeva kirjallisuus Oopperalaulajien henkilöhistoria Oopperatalot ja niiden historia oopperan kannalta Oopperajuhlat ja niiden historia Tässä ja alaluokissa myös oopperalibretot
scope note: Hit och till underklasserna operamusik och videoinspelningar av operaföreställningar Hit och till underklasserna också litteratur om opera samt operans historia eller personhistoria Operasångares personhistoria Operahus och deras historia ur operans synvinkel Operafestspel och deras historia Hit och till underklasserna också operalibretton @sv

Näppäinsoittimet
type: Class
type: Concept
subclass of: URN:NBN:fi:au:hklj:786
alternative label: Kielisoittimet, näppäilysoittimet (786.2 +)
alternative label: Näppäilysoittimet (786.2 +)
alternative label: Knäppinstrument (786.2 +) @sv
alternative label: Stränginstrument, knäppinstrument (786.2 +) @sv
broader: URN:NBN:fi:au:hklj:786
in scheme: URN:NBN:fi:au:hklj:
narrower: Harppu
narrower: Kantele
narrower: Kitara
narrower: Sähkökitara
narrower: Luuttu
narrower: Mandoliini
narrower: Balalaikka
narrower: Sähköbasso
narrower: Muut näppäinsoittimet
notation: 786.2
preferred label: Plucked-string instruments @en
preferred label: Knäppinstrument @sv
related: URN:NBN:fi:au:hklj:627.7531
related: URN:NBN:fi:au:hklj:681
related: URN:NBN:fi:au:hklj:781.5
related: URN:NBN:fi:au:hklj:782.6
related: URN:NBN:fi:au:hklj:785
related: URN:NBN:fi:au:hklj:785.11
related: URN:NBN:fi:au:hklj:788
related: URN:NBN:fi:au:hklj:789

Leikit
type: Class
type: Concept
subclass of: LIIKUNTA. URHEILU. LEIKIT. HUVIT
alternative label: Biografiat, leikki, sirkus, ajanviete (797 ... 799 +)
alternative label: Edelläkävijät, leikki, sirkus, ajanviete (797 ... 799 +)
alternative label: Elämäkerrat, leikki, sirkus, ajanviete (797 ... 799 +)
alternative label: Elämänhistoria, henkilöhistoria, leikki, sirkus, ajanviete (797 ... 799 +)
alternative label: Henkilöhistoria, leikki, sirkus, ajanviete (797 ... 799 +)
alternative label: Henkilökuvat, leikki, sirkus, ajanviete (797 ... 799 +)
alternative label: Henkilöt, leikki, sirkus, ajanviete (797 ... 799 +)
alternative label: Julkisuuden henkilöt, leikki, sirkus, ajanviete (797 ... 799 +)
alternative label: Kansanperinne, leikkiohjeet (797)
alternative label: Kirjeet, leikki, sirkus, ajanviete (797 ... 799 +)
alternative label: Lapsitähdet, julkisuuden henkilöt, leikki, sirkus, ajanviete (797 ... 799 +)
alternative label: Lapsuus, leikki, sirkus, ajanviete (797 ... 799 +)
alternative label: Lastenkulttuuri, leikit (797 +)
alternative label: Lastenleikit (797 +)
alternative label: Leikit (797 +)
alternative label: Leikit, leikkiohjeet (797 +)
alternative label: Leikki (797 +)
alternative label: Leikki, leikkiohjeet (797 +)
alternative label: Leikki-ikäiset, leikkiohjeet (797 +)
alternative label: Leikkikentät, leikit (797 +)
alternative label: Leikkiohjeet (797 +)
alternative label: Leikkipaikat, leikit (797 +)
alternative label: Leikkipuistot, leikit (797 +)
alternative label: Lumilinnat (797)
alternative label: Lumiveistokset, lumilinnat, leikki (797)
alternative label: Merkkihenkilöt, leikki, sirkus, ajanviete (797 ... 799 +)
alternative label: Mielikuvitusleikit, leikit (797)
alternative label: Muistelmat, leikki, sirkus, ajanviete (797 ... 799 +)
alternative label: Muistokirjoitukset, leikki, sirkus, ajanviete (797 ... 799 +)
alternative label: Nekrologit, leikki, sirkus, ajanviete (797 ... 799 +)
alternative label: Omaelämäkerrat, leikki, sirkus, ajanviete (797 ... 799 +)
alternative label: Palloleikit (797 +)
alternative label: Pelit, leikit (797 +)
alternative label: Pihaleikit, leikkiohjeet (797 +)
alternative label: Piirileikit, leikkiohjeet (797 +)
alternative label: Rakkauskirjeet, leikki, sirkus, ajanviete (797 ... 799 +)
alternative label: Roolileikit, leikit (797)
alternative label: Seuraleikit (797 +)
alternative label: Ulkoleikit (797 +)
alternative label: Uranuurtajat, leikki, sirkus, ajanviete (797 ... 799 +)
alternative label: Barn i lekåldern, lekinstruktioner (797 +) @sv
alternative label: Barndom, lek, cirkus, tidsfördriv (797 ... 799 +) @sv
alternative label: Barnkultur, lekar (797 +) @sv
alternative label: Barnlekar (797 +) @sv
alternative label: Barnstjärnor, offentliga personer, lek, cirkus, tidsfördriv (797 ... 799 +) @sv
alternative label: Bemärkta personer, lek, cirkus, tidsfördriv (797 ... 799 +) @sv
broader: LIIKUNTA. URHEILU. LEIKIT. HUVIT
in scheme: URN:NBN:fi:au:hklj:
narrower: Leikkikalut
narrower: URN:NBN:fi:au:hklj:797.2
notation: 797
related: Lapsuuden ja nuoruuden psykologia
related: Kokeellinen kasvatus
related: URN:NBN:fi:au:hklj:473
related: URN:NBN:fi:au:hklj:473.1
related: URN:NBN:fi:au:hklj:475
related: URN:NBN:fi:au:hklj:475.1
related: URN:NBN:fi:au:hklj:476
related: URN:NBN:fi:au:hklj:476.1
related: URN:NBN:fi:au:hklj:476.11
related: URN:NBN:fi:au:hklj:476.12
related: URN:NBN:fi:au:hklj:476.5
related: URN:NBN:fi:au:hklj:476.6
related: URN:NBN:fi:au:hklj:476.7
related: URN:NBN:fi:au:hklj:476.8
related: URN:NBN:fi:au:hklj:618.86
related: Lastenmusiikki
related: URN:NBN:fi:au:hklj:798
related: Postimerkkeily
related: Pelit
related: Korttipelit. Pasianssit
related: Shakki
related: Roolipelit
related: Taikatemput
related: Tietokilpailut
scope note: Leikkiohjeet yleensä. Seuraleikit yleensä Teokset, jotka koskevat sekä leikkejä että leikkikaluja Jos teoksessa on sekä leikkiohjeita että kansatiedettä, on etusija luokalla 797+
scope note: Lekhandledning i allmänhet. Sällskapslekar i allmänhet Verk som rör både lekar och leksaker Om verket handlar om både lekhandledning och etnologi ges företräde åt klass 797+ @sv

Suomen kieli
type: Class
type: Concept
subclass of: URALILAISET KIELET. ALTAILAISET KIELET
alternative label: Aluelingvistiikka, suomen kieli (884 +)
alternative label: Ammattikieli, suomen kieli (884 +)
alternative label: Anglismit, suomen kieli (884 +)
alternative label: Areaalilingvistiikka, suomen kieli (884 +)
alternative label: Arkaismit, suomen kieli (884 +)
alternative label: Englismit, suomen kieli (884 +)
alternative label: Haukkumasanat, kielitiede, suomi (884 +)
alternative label: Herjaukset, kielitiede, suomi (884 +)
alternative label: Idiolektit, suomen kieli (884 +)
alternative label: Idiomit, suomen kieli (884)
alternative label: Itämerensuomalaiset kielet, suomen kieli (884 +)
alternative label: Kielenhuolto, suomen kieli (884 +)
alternative label: Kielenkäyttö, suomen kieli (884 +)
alternative label: Kielennäytteet, suomen kieli (884 +)
alternative label: Kielenoppaat, suomen kieli (884 +)
alternative label: Kielentarkastus, suomen kieli (884 +)
alternative label: Kielentarkistus, suomen kieli (884 +)
alternative label: Kielentutkimus, suomen kieli (884 +)
alternative label: Kielet, suomen kieli (884 +)
alternative label: Kielikokeet , suomen kieli (884)
alternative label: Kielikurssit, suomen kieli (884)
alternative label: Kielimaantiede, suomen kieli (884 +)
alternative label: Kielioppaat, suomen kieli (884 +)
alternative label: Kielitiede, suomen kieli (884 +)
alternative label: Kielitutkinnot, suomen kieli (884)
alternative label: Kielivirheet, suomen kieli (884 +)
alternative label: Kiertoilmaisut, suomen kieli (884 +)
alternative label: Kirjakieli, suomen kieli (884 +)
alternative label: Kirjallinen ilmaisu, suomen kieli (884 +)
alternative label: Kirjoittaminen, suomen kielen oppaat (884 +)
alternative label: Kliseet, suomen kieli (884 +)
alternative label: Kontrastiivinen tutkimus, vertaileva kielitiede, suomen kieli (884 +)
alternative label: Korpukset , suomen kieli (884 +)
alternative label: Korpuslingvistiikka, suomen kieli (884 +)
alternative label: Kuullun ymmärtäminen, suomen kieli (884)
alternative label: Kuullunymmärtäminen, suomen kieli (884)
alternative label: Lakikieli, suomen kieli (884)
alternative label: Lingvistiikka, suomen kieli (884 +)
alternative label: Luetun ymmärtäminen, suomen kieli (884)
alternative label: Muoti-ilmaukset, suomen kieli (884 +)
alternative label: Oikeakielisyys, suomen kieli (884 +)
alternative label: Oikeinkirjoitus, suomen kieli (884 +)
alternative label: Puhekieli, suomen kieli (884 +)
alternative label: Solvaukset, kielitiede, suomi (884 +)
alternative label: Stilistiikka, suomen kieli (884 +)
alternative label: Suomalais-ugrilaiset kielet (881 ... 887 +)
alternative label: Suomalais-ugrilaiset kielet, kielitiede (881 ... 887 +)
alternative label: Suomen kieli (884 +)
alternative label: Suomen kieli, kielitiede (884 +)
alternative label: Suomen kieli, oppikirjat (884)
alternative label: Suomenkieliset, kielipolitiikka, suomen kieli (884)
alternative label: Svetisismit, suomen kieli (884 +)
broader: URALILAISET KIELET. ALTAILAISET KIELET
in scheme: URN:NBN:fi:au:hklj:
narrower: Suomen kielen äänneoppi
narrower: Suomen kielen etymologia ja onomastiikka
narrower: Suomen kielen yksikieliset sanakirjat
narrower: Suomen kielen kielioppi ja semantiikka
narrower: Suomen kielen murteet
narrower: Suomen kielen ainekirjoitusoppaat
narrower: Suomen kielen historia
notation: 884
related: URN:NBN:fi:au:hklj:1
related: Oppimisen psykologia
related: Kirjallisuuden ja kielten opetusoppi
related: URN:NBN:fi:au:hklj:188.4
related: Sähköposti. Verkkojuttelu
related: URN:NBN:fi:au:hklj:627.7512
related: Suomenkielisen kirjallisuuden historia ja tutkimus
related: Suomenkielisen kansanrunouden historia ja tutkimus
related: Suomenkielisen kirjallisuuden aihepiirejä ja kirjallisuustyyppejä koskeva historia ja tutkimus
related: Suomenkielisen lasten- ja nuortenkirjallisuuden historia ja tutkimus
related: Kielipsykologia. Kielisosiologia. Kielipolitiikka
related: Itämerensuomalaiset kielet
related: URN:NBN:fi:au:hklj:884.09
scope note: Suomen kieltä tai sen tutkimusta koskevat yleisteokset Suomen kielen yleiset oppi- ja harjoituskirjat sekä kielikurssit Suomen kielen opiskeluun liittyvät selityksillä tai sanastolla varustetut lukemistot ja lukukirjat Eri ammatteihin ja aloihin liittyvät suomen kielen oppi- ja harjoituskirjat, kielikurssit ja lukemistot Kirjakieli. Puhekieli. Oikeakielisyys. Oikeakielisyysoppaat. Kielenhuolto Tyylioppi ja tyylintutkimus kielitieteen kannalta. Leksikologia Kielisosiologia. Kielipsykologia. Sosiolingvistiikka. Psykolingvistiikka. Kielipolitiikka
scope note: Allmänna verk om finska eller om forskning i finska Allmänna läroböcker och övningsböcker samt språkkurser i finska Textböcker och läseböcker för studier i finska med förklaringar och ordlistor Läroböcker, övningsböcker, språkkurser och textböcker i finska som rör olika yrken och branscher Skriftspråk. Talspråk. Språkriktighet. Handböcker i språkriktighet. Språkvård Stilistik och stilforskning ur språkvetenskaplig synvinkel. Ordlära (lexikologi) Språksociologi. Språkpsykologi. Sociolingvistik. Psykolingvistik. Språkpolitik @sv

I maailmansodan historia 1914-1918
type: Class
type: Concept
subclass of: Nykyajan historia 1914-1938
alternative label: Asemasota, ensimm. maailmansota (909.51)
alternative label: Ensimmäinen maailmansota (909.51)
alternative label: Ensimmäinen maailmansota, historia (909.51)
alternative label: Ilmapuolustus, 1. maailmansodan historia (909.51)
alternative label: Ilmasota, 1. maailmansodan historia (909.51)
alternative label: Ilmatorjunta, 1. maailmansodan historia (909.51)
alternative label: Maailmanhistoria, maailmansodat, I, 1914-18 (909.51)
alternative label: Maailmansodat, ensimmäinen (909.51)
alternative label: Merisota, 1. maailmansota (909.51)
alternative label: Meritaistelut, 1. maailmansota (909.51)
alternative label: Sodat, 1. maailmansota (909.51)
alternative label: Sotahistoria, I maailmansodan historia (909.51)
alternative label: Sukellusvenesota, I maailmansota (909.51)
alternative label: Taistelut, I maailmansota (909.51)
alternative label: Första världskriget (909.51) @sv
alternative label: Första världskriget, historia (909.51) @sv
alternative label: Krig, sodat, 1:a världskriget (909.51) @sv
alternative label: Krigshistoria, I världskrigets historia (909.51) @sv
alternative label: Luftförsvar, 1:a världskrigets historia (909.51) @sv
alternative label: Luftkrig, 1:a världskrigets historia (909.51) @sv
alternative label: Luftvärn, Första världskrigets historia (909.51) @sv
alternative label: Sjökrig, 1:a världskriget (909.51) @sv
alternative label: Sjöstrider, 1:a världskriget (909.51) @sv
alternative label: Strider, första världskriget (909.51) @sv
alternative label: Ställningskrig, första världskriget (909.51) @sv
alternative label: Ubåtskrig, I världskriget (909.51) @sv
alternative label: Världshistoria, världskrigen, I, 1914-18 (909.51) @sv
alternative label: Världskrigen, första världskriget (909.51) @sv
broader: Nykyajan historia 1914-1938
in scheme: URN:NBN:fi:au:hklj:
notation: 909.51
preferred label: History of the First World War 1914-1918 @en
preferred label: Första världskrigets historia 1914-1918 @sv
related: URN:NBN:fi:au:hklj:1.4
related: URN:NBN:fi:au:hklj:300
related: Yhteiskuntatieteiden historia
related: URN:NBN:fi:au:hklj:320
related: URN:NBN:fi:au:hklj:325
related: URN:NBN:fi:au:hklj:370
related: URN:NBN:fi:au:hklj:371
related: URN:NBN:fi:au:hklj:390
related: Sotien yhteiskunnalliset vaikutukset
related: Muiden maiden puolustusvoimat
related: Sotahistoria
related: Suomi
related: EUROOPPA
related: Keski-Eurooppa
related: Historialliset kartat. Historiallinen maantiede
related: Yleinen arkeologia
related: URN:NBN:fi:au:hklj:919
related: URN:NBN:fi:au:hklj:920
related: Vuoden 1918 sota
related: URN:NBN:fi:au:hklj:930
related: SAKSAN HISTORIA
related: BRITTEIN SAARTEN HISTORIA
related: RANSKAN HISTORIA
related: URN:NBN:fi:au:hklj:970
related: Muiden Keski-Euroopan maiden historia
related: URN:NBN:fi:au:hklj:979
related: MUIDEN MAANOSIEN HISTORIA
scope note: I maailmansodan historian yleisteokset I maailmansodan historia tietyn maan kannalta ko. maan historian luokassa
scope note: Allmänna verk om första världskrigets historia Första världskrigets historia ur ett bestämt lands synvinkel förs till klassen för landets historia @sv

II maailmansodan historia 1939-1945
type: Class
type: Concept
subclass of: Nykyajan historia 1939-
alternative label: Akselivallat, toinen maailmansota (909.61)
alternative label: Ardennien taistelu, toinen maailmansota (909.61)
alternative label: Asemasota, toinen maailmansota (909.61)
alternative label: Ilmapuolustus, 2. maailmansodan historia (909.61)
alternative label: Ilmasota, 2. maailmansodan historia (909.61)
alternative label: Ilmatorjunta, 2. maailmansodan historia (909.61)
alternative label: Liittoutuneet, toinen maailmansota (909.61)
alternative label: Maailmanhistoria, maailmansodat, II, 1939-45 (909.61)
alternative label: Maailmansodat, toinen (909.61)
alternative label: Merisota, 2. maailmansota (909.61)
alternative label: Meritaistelut, 2. maailmansota (909.61)
alternative label: Sodat, 2. maailmansota (909.61)
alternative label: Sotahistoria, II maailmansodan historia (909.61)
alternative label: Sukellusvenesota, II maailmansota (909.61)
alternative label: Taistelut, II maailmansota (909.61)
alternative label: Teheranin konferenssi, toinen maailmansota (909.61)
alternative label: Toinen maailmansota (909.61)
alternative label: Allierade, 2:a världskriget (909.61) @sv
alternative label: Andra världskriget, allm.. (909.61) @sv
alternative label: Ardenneroffensiven, andra världskriget (909.61) @sv
alternative label: Axelmakterna, 2:a världskriget (909.61) @sv
alternative label: Bundsförvanter, 2:a världskriget (909.61) @sv
alternative label: Krig, sodat, 2:a världskriget (909.61) @sv
alternative label: Krigshistoria, II världskrigets historia (909.61) @sv
alternative label: Luftförsvar, 2:a världskrigets historia (909.61) @sv
alternative label: Luftkrig, 2:a världskrigets historia (909.61) @sv
alternative label: Luftvärn, Andra världskrigets historia (909.61) @sv
alternative label: Sjökrig, 2:a världskriget (909.61) @sv
alternative label: Sjöstrider, 2:a världskriget (909.61) @sv
alternative label: Strider, andra världskriget (909.61) @sv
alternative label: Ställningskrig, andra världskriget (909.61) @sv
alternative label: Teherankonferensen, andra världskriget (909.61) @sv
alternative label: Ubåtskrig, II världskriget (909.61) @sv
alternative label: Världshistoria, världskrigen, II, 1939-45 (909.61) @sv
alternative label: Världskrigen, andra världskriget (909.61) @sv
broader: Nykyajan historia 1939-
in scheme: URN:NBN:fi:au:hklj:
notation: 909.61
preferred label: History of the Second World War 1939-1945 @en
preferred label: Andra världskrigets historia 1939-1945 @sv
related: URN:NBN:fi:au:hklj:1.4
related: URN:NBN:fi:au:hklj:300
related: Yhteiskuntatieteiden historia
related: URN:NBN:fi:au:hklj:320
related: URN:NBN:fi:au:hklj:325
related: URN:NBN:fi:au:hklj:370
related: URN:NBN:fi:au:hklj:371
related: URN:NBN:fi:au:hklj:390
related: Sotien yhteiskunnalliset vaikutukset
related: Muiden maiden puolustusvoimat
related: Sotahistoria
related: Suomi
related: EUROOPPA
related: Keski-Eurooppa
related: Historialliset kartat. Historiallinen maantiede
related: Yleinen arkeologia
related: URN:NBN:fi:au:hklj:919
related: URN:NBN:fi:au:hklj:920
related: Sodat 1939-1945
related: URN:NBN:fi:au:hklj:930
related: SAKSAN HISTORIA
related: BRITTEIN SAARTEN HISTORIA
related: RANSKAN HISTORIA
related: URN:NBN:fi:au:hklj:970
related: Muiden Keski-Euroopan maiden historia
related: URN:NBN:fi:au:hklj:979
related: MUIDEN MAANOSIEN HISTORIA
scope note: II maailmansodan historian yleisteokset II maailmansodan historia tietyn maan kannalta ko. maan historian luokassa
scope note: Allmänna verk om andra världskrigets historia Andra världskrigets historia ur ett bestämt lands synvinkel förs till klassen för landets historia @sv

Muodin historia
type: Class
type: Concept
subclass of: URN:NBN:fi:au:hklj:919
alternative label: Alusvaatteet, muoti ja muodin historia (919.9)
alternative label: Asusteet, muoti, muodin historia (919.9)
alternative label: Ehostus, kulttuurihistoria (919.9)
alternative label: Farkut, muoti ja muodin historia (919.9)
alternative label: Farmarihousut, muoti ja muodin historia (919.9)
alternative label: Flanelli, muoti ja muodin historia (919.9)
alternative label: Fleece, muoti ja muodin historia (919.9)
alternative label: Fliis, muoti ja muodin historia (919.9)
alternative label: Fliisi, muoti ja muodin historia (919.9)
alternative label: Fyysiset ominaisuudet, kauneudenhoito, kulttuurihistoria (919.9)
alternative label: Haju, muodin ja kauneudenhoidon historia (919.9)
alternative label: Hajuaineet, muodin ja kauneudenhoidon historia (919.9)
alternative label: Hajuvedet, kulttuurihistoria (919.9)
alternative label: Hatut, muoti ja muodin historia (919.9)
alternative label: Haute couture (919.9)
alternative label: Hiukset, kulttuurihistoria (919.9)
alternative label: Hiuskoristeet, muoti ja muodin historia (919.9)
alternative label: Huivit, muoti ja muodin historia (919.9)
alternative label: Hyvä maku, muoti ja muodin historia (919.9)
alternative label: Hääpuvut, pukeutumisen kulttuurihistoria (919.9)
alternative label: Jalkineet, muoti ja muodin historia (919.9)
alternative label: Juhlapuvut, muoti ja muodin historia (919.9)
alternative label: Juhlavaatteet, muoti ja muodin historia (919.9)
alternative label: Kalannahka, muoti (919.9)
alternative label: Kampaukset, muoti ja muodin historia (919.9)
alternative label: Kangaslaadut, muoti ja muodin historia (919.9)
alternative label: Kankaat, muoti ja muodin historia (919.9)
alternative label: Kansanomaiset vaatteet, pukeutumisen kulttuurihistoria (919.9)
alternative label: Kastemekot, muoti ja muodin historia (919.9)
alternative label: Kastevaatteet, muoti ja muodin historia (919.9)
alternative label: Kasvot, kulttuurihistoria (919.9)
alternative label: Katumuoti (919.9)
alternative label: Kauneudenhoito, kulttuurihistoria (919.9)
alternative label: Kauneudenhoitoaineet, kulttuurihistoria (919.9)
alternative label: Kauneus, kauneudenhoito, historia (919.9)
alternative label: Kauneus, muodin historia (919.9)
alternative label: Kauneusihanteet, kauneudenhoito, historia (919.9)
alternative label: Kauneusihanteet, muodin historia (919.9)
alternative label: Kauneuskilpailut (919.9)
alternative label: Keho, muoti ja muodin historia (919.9)
alternative label: Kengät, muoti ja muodin historia (919.9)
alternative label: Koristeet, muoti ja muodin historia (919.9)
alternative label: Kosmetiikka, kulttuurihistoria (919.9)
alternative label: Kosmetologia, kulttuurihistoria (919.9)
broader: URN:NBN:fi:au:hklj:919
in scheme: URN:NBN:fi:au:hklj:
notation: 919.9
related: Itämainen filosofia
related: Kulttuurifilosofia
related: Käytös- ja tapatieto
related: Juhlien järjestäminen
related: Esineellinen kulttuuri
related: URN:NBN:fi:au:hklj:473
related: Tekstiili- ja vaatetusteollisuus
related: Nahka- ja jalkineteollisuus
related: URN:NBN:fi:au:hklj:649.91
related: Pukeutuminen. Kauneudenhoito
related: Kauneudenhoito
related: URN:NBN:fi:au:hklj:749.1
related: Piirustuksen materiaalit ja tekniikka
related: URN:NBN:fi:au:hklj:764
related: Ryijyt
related: Koruompelu. Kirjonta. Nimikointi
related: Ompelu
related: Solmeilu. Makramee. Fransut
related: Matot
related: Neulonta
related: Virkkaus. Pitsinvirkkaus. Koukkuaminen. Nypläys
related: Kankaankudonta. Kankaanpainanta
related: Tilkkutyöt. Tikatut peitteet
related: Kehrääminen. Karstaus. Värjäys
related: Nahkatyöt. Turkistyöt
related: URN:NBN:fi:au:hklj:909
related: Historian tutkimusmenetelmät
related: Historian aputieteet
scope note: Pukeutumisen ja pukeutumistyylien sekä kauneudenhoidon, meikkauksen ja kampausten historia ja kulttuurihistoria eri maanosissa ja maissa sekä eri aikakausina Tässä myös teokset, jotka koskevat muotia yleensä tai muotia useista eri näkökulmista
scope note: Klädselns och klädstilarnas samt skönhetsvårdens, sminkningens och frisyrernas historia och kulturhistoria i olika världsdelar och länder samt under olika tidsperioder Hit också verk som handlar om mode i allmänhet eller mode ur flera olika synvinklar @sv

Kirjastoaineisto. Kokoelmatyö
type: Class
type: Concept
subclass of: KIRJASTOT. KIRJASTOTOIMI
alternative label: Aakkostussäännöt, kirjasto (022 +)
alternative label: Aineistot, kirjastonhoito (022 +)
alternative label: Hyllyjärjestys, kirjastot (022)
alternative label: Hyllyt, kirjastonhoito (022)
alternative label: Kirjastoaineistot, kirjastonhoito (022 +)
alternative label: Kokoelmapolitiikka (022 +)
alternative label: Kokoelmatyö, kirjastonhoito (022 +)
alternative label: Kortistot, kirjastojen (022 +)
alternative label: Lajittelusäännöt, kirjastot (022 +)
alternative label: Nimekkeet, kirjastonhoito (022 +)
alternative label: Poistot, kirjastot (022 +)
alternative label: Siirrot, kirjastoaineisto (022)
alternative label: Siirtokokoelmat, kirjasto (022)
alternative label: Tallenteet, kirjastoaineistot (022 +)
alternative label: Tiedontallennus, kirjastonhoito (022 +)
alternative label: Vaihdot, kirjanhankinta (022 +)
alternative label: Vaihtaminen, kirjastoaineiston hankinta (022 +)
alternative label: Vaihto, kirjastoaineiston hankinta (022 +)
alternative label: Alfabetiseringsregler, bibliotek (022 +) @sv
alternative label: Avdrag, bibliotek (022 +) @sv
alternative label: Beståndsutveckling, biblioteksarbete (022 +) @sv
alternative label: Biblioteksmaterial, biblioteksskötsel (022 +) @sv
alternative label: Byten, växling, bokanskaffning (022 +) @sv
alternative label: Cirkulerande samlingar, bibliotek (022) @sv
alternative label: Datalagring, biblioteksarbete (022 +) @sv
alternative label: Förflyttningar, biblioteksmedier (022) @sv
alternative label: Hyllor, biblioteksarbete (022) @sv
alternative label: Hyllordning, biblioteksarbete (022) @sv
alternative label: Kortregister, bibliotekens (022 +) @sv
alternative label: Material, aineistot, biblioteksarbete (022 +) @sv
alternative label: Ombyte, biblioteksmedier, anskaffning (022 +) @sv
alternative label: Publikationstitlar, biblioteksskötsel (022 +) @sv
alternative label: Samlingspolitik (022 +) @sv
alternative label: Sorteringsregler, bibliotek (022 +) @sv
alternative label: Upptagningar, biblioteksmedier (022 +) @sv
alternative label: Växling, biblioteksmedier, anskaffning (022 +) @sv
broader: KIRJASTOT. KIRJASTOTOIMI
in scheme: URN:NBN:fi:au:hklj:
narrower: Valinta ja hankinta
narrower: Luettelointi
narrower: Sisällönkuvailu
narrower: Muu kuin kirja-aineisto kirjastossa
notation: 022
preferred label: Library media. Care of collections @en
preferred label: Biblioteksmedier. Skötsel av samlingarna @sv
related: Kirjansidonta. Kirjansidontataide
related: URN:NBN:fi:au:hklj:010
related: Kirjastojen luettelot
related: Suomi
related: URN:NBN:fi:au:hklj:018
related: Lastenkirjastot
related: Koulukirjastot
related: Erityisten väestöryhmien kirjastopalvelut
related: Sairaalakirjastot
related: Erikoiskokoelmat
related: Paikalliskokoelmat
related: Musiikkikirjastot
related: Kirjastoautot. Kirjastoveneet
related: Yleiset kirjastot
related: Erikoiskirjastot. Yhdistysten, laitosten ja yritysten kirjastot
related: URN:NBN:fi:au:hklj:028
related: Dokumentaatio ja informaatiopalvelu yleensä
related: Museonhoito
related: Arkistonhoito
related: URN:NBN:fi:au:hklj:061
related: URN:NBN:fi:au:hklj:063
scope note: Tässä ja alaluokissa yleisten, tieteellisten, yksityisten ja erikoiskirjastojen kirjastoaineiston ylläpito sekä kokoelmien hoito ja hallinta myös muun kuin kirja-aineiston osalta Tässä ja alaluokissa kirjastoaineiston inventoinnit, poistot, siirrot ja varastointi sekä käyttökuntoon käsittely, korjaus ja kunnossapito Tässä ja alaluokissa siirto- ja varastokokoelmat sekä kelluvat kokoelmat Tässä ja alaluokissa kokoelmia koskeva tiedontallennus sekä kirjaston bibliografisten tiedostojen, tietokantojen, luetteloiden ja kortistojen rakentaminen ja ylläpito Tässä ja alaluokissa kirjastoaineistoa ja kirjaston luetteloita koskevat lajittelu- ja aakkostussäännöt sekä kirjaston hyllyjärjestys
scope note: Hit och till underklasserna upprätthållande av biblioteksmedier på allmänna, vetenskapliga och privata bibliotek och specialbibliotek samt skötsel och administration av samlingar, också andra medier än böcker Hit och till underklasserna inventering, gallring, omplacering och magasinering samt iståndsättning, reparation och underhåll av biblioteksmedier Hit och till underklasserna cirkulerande, magasinerade samt deponerade samlingar Hit och till underklasserna lagring av information som rör samlingar samt utarbetande och underhåll av bibliografiska register, databaser, kataloger och kartotek Hit och till underklasserna sorterings- och alfabetiseringsregler för biblioteksmedier och bibliotekskataloger samt bibliotekets hylluppställning @sv

Muita psykologian aloja
type: Class
type: Concept
subclass of: URN:NBN:fi:au:hklj:120
broader: URN:NBN:fi:au:hklj:120
in scheme: URN:NBN:fi:au:hklj:
narrower: Uskonto- ja maailmankatsomuspsykologia
narrower: Sosiaalipsykologia. Kulttuuripsykologia
narrower: Kehityspsykologia. Eri ikäkausien psykologia
narrower: Naisen ja miehen psykologia
narrower: Fysiologinen psykologia
notation: 128
preferred label: Other areas of psychology @en
preferred label: Övriga områden inom psykologin @sv
related: Psyyken rakenne ja toiminnot
related: Ajattelu. Älykkyys. Mielikuvitus
related: Tunne- ja tahtotoiminnot
related: Oppimisen psykologia
related: Havaintopsykologia
related: Tiedostamaton sielunelämä
related: Uni
related: Alitajunta
related: Hypnoosi. Suggestio
related: Kokeellinen psykologia. Psykometriikka
related: Psykologian suunnat
related: Behaviorismi
related: Syvyyspsykologia
related: Perinnöllisyyspsykologia
related: Typologia. Karakterologia
related: Differentiaalipsykologia. Persoonallisuuden psykologia
related: Psychology of expression {@en
related: Lapsuuden ja nuoruuden psykologia
related: Sovellettu psykologia
scope note: Tässä useampaa kuin yhtä luokissa 128+ mainittua psykologian erikoisalaa koskevat teokset Jos teos kuitenkin painottuu johonkin erikoisalaan, on etusija alan mukaisella luokalla
scope note: Hit verk som rör fler än ett av de psykologiska specialområden som finns i klasserna 128+ Om något specialområde dominerar ges företräde åt klassen i fråga @sv

LOGIIKKA
type: Class
type: Concept
subclass of: URN:NBN:fi:au:hklj:100
alternative label: Abduktio, logiikka (130)
alternative label: Ajattelun lait (130 ... 135 +)
alternative label: Ajatuslait (130 ... 135 +)
alternative label: Aksiomaattinen menetelmä, logiikka (130)
alternative label: Alkeislogiikka (130)
alternative label: Antinomiat, logiikka (130)
alternative label: Arvostelmat, logiikka (130)
alternative label: Deduktio, logiikka (130)
alternative label: Deonttinen logiikka (130)
alternative label: Dialektiikka (130)
alternative label: Dikotomiat, filosofia, logiikka (130 ... 135)
alternative label: Filosofia, logiikka (130 ... 135)
alternative label: Induktio, logiikka (130)
alternative label: Kausaalisuus, logiikka (130)
alternative label: Kausaliteetti, logiikka (130)
alternative label: Logiikka (130 ... 135)
alternative label: Muuttujat, logiikka (130 ... 135)
alternative label: Määritelmät, logiikka (130 ... 135)
alternative label: Paradoksit, logiikka (130)
alternative label: Päätelmät, logiikka (130)
alternative label: Päättely, logiikka (130)
alternative label: Sumea logiikka (130)
alternative label: Syllogismit, logiikka (130)
alternative label: Syysuhde, logiikka (130)
alternative label: Tautologia, logiikka (130 ... 135)
alternative label: Teoreettinen filosofia, logiikka (130 ... 135)
alternative label: Terve järki, logiikka (130 ... 135)
alternative label: Todistusteoria, logiikka (130)
alternative label: Vakiot, logiikka (130 ... 135)
alternative label: Variaabelit, logiikka (130 ... 135)
alternative label: Virhepäätelmät, logiikka (130)
alternative label: Väittely, logiikka (130 ... 135)
alternative label: Yleistäminen, logiikka (130)
alternative label: kriittinen ajattelu, logiikka (130 ... 135 +)
alternative label: Abduktion, logik (130) @sv
alternative label: Antinomier, logik (130) @sv
alternative label: Axiomatisk metod, logik (130) @sv
alternative label: Bevisteori, logik (130) @sv
alternative label: Deduktion, logik (130) @sv
alternative label: Definitioner, logik (130 ... 135) @sv
alternative label: Deontisk logik (130) @sv
alternative label: Dialektik (130) @sv
alternative label: Dikotomier, filosofi, logik (130 ... 135) @sv
alternative label: Disputation, logik (130 ... 135) @sv
alternative label: Elementär logik (130) @sv
broader: URN:NBN:fi:au:hklj:100
in scheme: URN:NBN:fi:au:hklj:
narrower: Lauselogiikka. Lausekalkyyli
narrower: Logistiikka. Looginen kalkyyli
notation: 130
related: Teoria. Tutkimusmenetelmät
related: Filosofian historia
related: TIETOTEORIA. TIETO-OPPI
related: TIEDEOPPI
related: MATEMATIIKKA
related: URN:NBN:fi:au:hklj:627.7
related: Systeemityö
related: Ohjelmointi. Ohjelmointikielet
related: URN:NBN:fi:au:hklj:627.73
related: Käyttöjärjestelmät
related: Tekstinkäsittelyohjelmat
related: Taulukkolaskentaohjelmat
related: Tietokantaohjelmat
related: Kuvankäsittelyohjelmat. Grafiikkaohjelmat. Taitto-ohjelmat
related: Tietoliikenneohjelmat
related: Tietokoneiden lisälaitteet
related: Säätö- ja systeemitekniikka. Teollinen automaatio
related: Tietoliikenne. Viestintätekniikka. Multimedia
related: URN:NBN:fi:au:hklj:627.751
related: Sähköposti. Verkkojuttelu
related: URN:NBN:fi:au:hklj:627.7512
related: Matkaviestinpalvelut. Puhelinliikenne
related: URN:NBN:fi:au:hklj:627.753
related: URN:NBN:fi:au:hklj:627.7531
related: URN:NBN:fi:au:hklj:627.7532
scope note: Logiikan yleisteokset. Alkeislogiikka Päättely, päätelmä ja virhepäätelmä logiikan kannalta Deduktion, induktion ja dialektiikan logiikka Logiikan sovellukset eri aloille alan mukaisessa luokassa
scope note: Allmänna verk som rör logik. Logikens grunder Slutledning, slutsatser och felslutsatser ur logikens synvinkel Deduktion, induktion och dialektik Tillämpningar av logik på olika områden klassificeras enligt område @sv

Työmarkkinajärjestöt
type: Class
type: Concept
subclass of: Järjestötoiminta. Kokoustekniikka
alternative label: Aatteelliset järjestöt, työmarkkinajärjestöt (377.2)
alternative label: Aatteelliset yhdistykset, työmarkkinajärjestöt (377.2)
alternative label: Alaiset, työntekijäjärjestöt (377.2)
alternative label: Ammatillinen järjestäytyminen (377.2)
alternative label: Ammatilliset keskusjärjestöt (377.2)
alternative label: Ammattialajärjestöt (377.2)
alternative label: Ammattijärjestöt (377.2)
alternative label: Ammattiliitot (377.2)
alternative label: Ammattiosastot (377.2)
alternative label: Ammattiyhdistykset (377.2)
alternative label: Ammattiyhdistysliike (377.2)
alternative label: Ammattiyhdistyspolitiikka (377.2)
alternative label: Ammattiyhdistystoiminta (377.2)
alternative label: Edunvalvonta, työmarkkinajärjestöt (377.2)
alternative label: Ennakkoäänestys, ay-vaalit (377.2)
alternative label: Ennakkoäänestäminen, ay-vaalit (377.2)
alternative label: Etujärjestöt, työmarkkinajärjestöt (377.2)
alternative label: Eturyhmät, työmarkkinajärjestöt (377.2)
alternative label: Henkilökuntayhdistykset, ammattiyhdistykset (377.2)
alternative label: Intressiryhmät, työmarkkinajärjestöt (377.2)
alternative label: Järjestöt, työmarkkinajärjestöt (377.2)
alternative label: Kansainvälinen ammattiyhdistysliike (377.2)
alternative label: Kansalaisosallistuminen, työmarkkinajärjestöt (377.2)
alternative label: Kansalaisten osallistuminen, työmarkkinajärjestöt (377.2)
alternative label: Kansalaistoiminta, työmarkkinajärjestöt (377.2)
alternative label: Kaupan työntekijät, ammattiyhdistystoiminta (377.2)
alternative label: Keskusjärjestöt, työmarkkinajärjestöt (377.2)
alternative label: Konfliktinhallinta, työtaistelut (377.2)
alternative label: Konfliktinratkaisu, työtaistelut (377.2)
alternative label: Konfliktit, työtaistelut (377.2)
alternative label: Kunnalliset keskusjärjestöt (377.2)
alternative label: Kuntien keskusjärjestöt (377.2)
alternative label: Lakot (377.2)
alternative label: Liiketyöntekijät, ammattiyhdistystoiminta (377.2)
alternative label: Luottamusmiehet, ammattiyhdistystoiminta (377.2)
alternative label: Luottamusmiesjärjestelmä (377.2)
alternative label: Metallityöntekijät, ammattiyhdistystoiminta (377.2)
alternative label: Nälkälakko, työtaistelut (377.2)
alternative label: Paikallinen sopiminen, työmarkkinajärjestöt (377.2)
alternative label: Painostusryhmät, työmarkkinajärjestöt (377.2)
alternative label: Palkkatyöläiset, ammattiyhdistysliike (377.2)
alternative label: Postiäänestys, ay-vaalit (377.2)
alternative label: Postiäänestäminen, ay-vaalit (377.2)
alternative label: Riidat, työriidat (377.2)
broader: Järjestötoiminta. Kokoustekniikka
in scheme: URN:NBN:fi:au:hklj:
notation: 377.2
related: URN:NBN:fi:au:hklj:060
related: URN:NBN:fi:au:hklj:061
related: URN:NBN:fi:au:hklj:063
related: Sisäpolitiikka. Puolueet
related: Suomi
related: Työoikeus
related: Työn sosiologia
related: Pääoma. Työ. Luonnonvarat
related: Elintaso. Kulutus
related: URN:NBN:fi:au:hklj:371
related: Työ sosiaalipoliittisena kysymyksenä
related: Työolot
related: Työsuojelu
related: Työllisyys. Työttömyys. Työvoimapalvelu
related: Maapolitiikka
related: Asuntopolitiikka
related: Perhepolitiikka. Lapsipolitiikka. Nuorisopolitiikka
related: Lastenneuvolat. Äitiysneuvolat
related: Päivähoito
related: URN:NBN:fi:au:hklj:371.6
related: Päihdepolitiikka. Päihdehuolto
related: Alkoholipolitiikka
related: Huumausainepolitiikka
related: Kriminaalipolitiikka
related: Siirtolaisuus
related: Työväenliike
related: URN:NBN:fi:au:hklj:377.209
related: Henkilöstöpolitiikka
scope note: Työnantaja- ja työntekijäjärjestöt. Ammattiyhdistysliike Tässä sekä työmarkkinajärjestöjä kokevat yleisteokset että eri aloja ja ammatteja edustavat työmarkkinajärjestöt Ammattijärjestöt. Ammattiyhdistykset. Keskusjärjestöt. Luottamusmiesjärjestelmä. Työtaistelut. Lakot. Työsulut. Työsaarrot
scope note: Arbetsgivar- och arbetstagarorganisationer. Fackföreningsrörelsen Hit både allmänna verk som rör arbetsmarknadsorganisationer och verk som rör arbetsmarknadsorganisationer inom olika yrkesområden och yrken Fackliga organisationer. Fackföreningar. Centralorganisationer. Förtroendemannaorganisationer. Arbetskonflikter. Strejker. Lockouter. Blockader @sv

AFRIKKA
type: Class
type: Concept
subclass of: URN:NBN:fi:au:hklj:400
alternative label: Afrikka (430 ... 439)
alternative label: Afrikka, maantiede, matkat (430 ... 439)
alternative label: Afrikkalaiset (430)
alternative label: Afrikkalaiset, maantiede, matkat (430)
alternative label: Kansanelämä, eri kansat, maantiede (410 ... 459)
alternative label: Kansanluonne, maakuvaukset (410 ... 459)
alternative label: Kotimaa, maakuvaukset (410 ... 459)
alternative label: Maanosat, Afrikka (430)
alternative label: Safarit, Afrikka (430 ... 439)
alternative label: Afrika (430 ... 439) @sv
alternative label: Afrika, geografi, resor (430 ... 439) @sv
alternative label: Afrikaner (430) @sv
alternative label: Afrikaner, geografi, resor (430) @sv
alternative label: Folkliv, olika folk, geografi (410 ... 459) @sv
alternative label: Hemland, landsskildringar (410 ... 459) @sv
alternative label: Nationalkaraktär, landsskildringar (410 ... 459) @sv
alternative label: Safarier, Afrika (430 ... 439) @sv
alternative label: Världsdelar, Afrika (430) @sv
broader: URN:NBN:fi:au:hklj:400
in scheme: URN:NBN:fi:au:hklj:
narrower: Pohjois-Afrikka
narrower: Egypti. Sudan. Etelä-Sudan
narrower: Länsi-Afrikka
narrower: Keski-Afrikka
narrower: Itä-Afrikka
narrower: Djibouti. Eritrea. Etiopia. Somalia
narrower: Etelä-Afrikka
narrower: Afrikan saaret
notation: 430
preferred label: AFRICA @en
preferred label: AFRIKA @sv
related: URN:NBN:fi:au:hklj:061
related: URN:NBN:fi:au:hklj:063
related: Yleinen aluemaantiede. Yleinen kulttuurimaantiede. Yleinen poliittinen maantiede
related: URN:NBN:fi:au:hklj:460
related: Ekologia. Eliömaantiede
related: Merenkulkuoppi
related: Hotelli- ja ravintolatalous
related: URN:NBN:fi:au:hklj:900
related: MUIDEN MAANOSIEN HISTORIA
related: Afrikan historia
related: Pohjois-Afrikan historia
related: Länsi-, Itä- ja Keski-Afrikan historia
related: Etelä-Afrikan historia
scope note: Afrikkaa ja Afrikan maantiedettä koskevat yleisteokset Teokset, jotka koskevat useita Afrikan alueita Tässä ja luokissa 431-439 Afrikkaa koskeva matkailu, matkailupolitiikka, matkailuelinkeino ja matkakertomukset Tässä ja luokissa 431-439 matkailijoille tarkoitetut Afrikkaa koskevat matkaoppaat, leirintäalue-, hotelli-, motelli-, retkeilymaja-, nähtävyys- ja museo-oppaat Jos teoksessa on sekä maantiedettä että historiaa, on etusija luokilla 430-439
scope note: Allmänna verk om Afrika eller Afrikas geografi Verk som rör flera områden i Afrika Hit och till klasserna 431-439 turism, turistpolitik, turistnäring och reseskildringar som rör Afrika Hit och till klasserna 431-439 resehandböcker och guideböcker om campingområden, hotell, motell, vandrarhem, sevärdheter och museer avsedda för turister i Afrika Om verket handlar om både geografi och historia ges företräde åt klasserna 430-439 @sv

AMERIKKA
type: Class
type: Concept
subclass of: URN:NBN:fi:au:hklj:400
alternative label: Afroamerikkalaiset, Amerikka (440 ... 449)
alternative label: Amerikka (440 ... 449)
alternative label: Amerikka, maantiede, matkat (440 ... 449)
alternative label: Amerikkalaiset (440)
alternative label: Amerikkalaiset, maantiede, matkat (440)
alternative label: Kansanelämä, eri kansat, maantiede (410 ... 459)
alternative label: Kansanluonne, maakuvaukset (410 ... 459)
alternative label: Kotimaa, maakuvaukset (410 ... 459)
alternative label: Maanosat, Amerikka (440)
alternative label: Afroamerikaner, Amerika (440 ... 449) @sv
alternative label: Amerika (440 ... 449) @sv
alternative label: Amerika, geografi, resor (440 ... 449) @sv
alternative label: Amerikaner (440) @sv
alternative label: Amerikaner, geografi, resor (440) @sv
alternative label: Folkliv, olika folk, geografi (410 ... 459) @sv
alternative label: Hemland, landsskildringar (410 ... 459) @sv
alternative label: Nationalkaraktär, landsskildringar (410 ... 459) @sv
alternative label: Världsdelar, Amerika (440) @sv
broader: URN:NBN:fi:au:hklj:400
in scheme: URN:NBN:fi:au:hklj:
narrower: Pohjois-Amerikka
narrower: Kanada
narrower: Yhdysvallat, USA
narrower: Meksiko
narrower: Keski-Amerikka
narrower: Karibianmeren saaret
narrower: Etelä-Amerikka
narrower: Brasilia
narrower: Argentiina
notation: 440
preferred label: AMERICAS @en
preferred label: AMERIKA @sv
related: URN:NBN:fi:au:hklj:061
related: URN:NBN:fi:au:hklj:063
related: Yleinen aluemaantiede. Yleinen kulttuurimaantiede. Yleinen poliittinen maantiede
related: URN:NBN:fi:au:hklj:460
related: Ekologia. Eliömaantiede
related: Merenkulkuoppi
related: Hotelli- ja ravintolatalous
related: URN:NBN:fi:au:hklj:900
related: MUIDEN MAANOSIEN HISTORIA
related: Amerikan historia
related: Etelä-Amerikan historia
scope note: Amerikkaa ja Amerikan maantiedettä koskevat yleisteokset Teokset, jotka koskevat useita Amerikan alueita Tässä ja luokissa 441-449 Pohjois-, Väli- tai Etelä-Amerikkaa koskeva matkailu, matkailupolitiikka, matkailuelinkeino ja matkakertomukset Tässä ja luokissa 441-449 matkailijoille tarkoitetut Pohjois-, Väli- tai Etelä-Amerikkaa koskevat matkaoppaat, leirintäalue-, hotelli-, motelli-, retkeilymaja-, nähtävyys- ja museo-oppaat Jos teoksessa on sekä maantiedettä että historiaa, on etusija luokilla 440-449
scope note: Allmänna verk om Amerika eller Amerikas geografi Verk som rör flera områden i Amerika Hit och till klasserna 441-449 turism, turistpolitik, turistnäring och reseskildringar som rör Nordamerika, Mellanamerika eller Sydamerika Hit och till klasserna 441-449 resehandböcker och guideböcker om campingområden, hotell, motell, vandrarhem, sevärdheter och museer avsedda för turister i Nordamerika, Mellanamerika eller Sydamerika Om verket handlar om både geografi och historia ges företräde åt klasserna 440-449 @sv

Sähköoppi. Magnetismi
type: Class
type: Concept
subclass of: FYSIIKKA
alternative label: Aallonpituus, sähköoppi (537)
alternative label: Aaltoliike, sähköoppi (537)
alternative label: Anodit, sähköoppi (537)
alternative label: Elektrodit, sähköoppi (537)
alternative label: Elektroluminesenssi, sähköoppi (537)
alternative label: Energiamittarit, sähkömittarit (537)
alternative label: Frekvenssit, sähköoppi (537)
alternative label: Fysiikka, sähköoppi (537)
alternative label: Galvanismi (537)
alternative label: Induktio, sähköoppi (537)
alternative label: Jaksolliset ilmiöt, sähköoppi (537)
alternative label: Johteet, sähköoppi (537)
alternative label: Johtimet, sähköoppi (537)
alternative label: Jännite, sähköoppi (537)
alternative label: Katodit, sähköoppi (537)
alternative label: Lataus, sähköoppi (537)
alternative label: Loissähkö, fysiikka (537)
alternative label: Loisteho, fysiikka (537)
alternative label: Lämpösähköisyys, sähköoppi (537)
alternative label: Magneettikentät (537)
alternative label: Magneettiset kentät (537)
alternative label: Magneettiset ominaisuudet (537)
alternative label: Magnetismi (537)
alternative label: Maxwellin yhtälöt, sähkömagneettiset kentät (537)
alternative label: Mikroaallot, fysiikka (537)
alternative label: Mikroelektrodit, sähköoppi (537)
alternative label: Mikromekaniikka, sähköoppi (537)
alternative label: Oskillografia, sähköoppi (537)
alternative label: Oskilloskoopit, sähköoppi (537)
alternative label: Polarisaatio, sähköoppi (537)
alternative label: Potentiaalienergia, sähköoppi (537)
alternative label: Puolijohteet, fysiikka (537)
alternative label: Radioaallot, fysiikka (537)
alternative label: Resistanssi, sähköoppi (537)
alternative label: Resonanssi, sähköoppi (537)
alternative label: Sironta, sähköoppi (537)
alternative label: Spektrografit, sähkömagneettinen säteily (537)
alternative label: Suprajohtavuus, sähköoppi (537)
alternative label: Suprajohteet, sähköoppi (537)
alternative label: Sähkö, fysiikka (537)
alternative label: Sähködynamiikka (537)
alternative label: Sähköeristeet, sähköoppi (537)
alternative label: Sähköiset ominaisuudet, sähköoppi (537)
broader: FYSIIKKA
in scheme: URN:NBN:fi:au:hklj:
notation: 537
related: Geomorfologia. Geodynamiikka
related: Äänioppi. Mekaaniset värähtelyt
related: FYSIKAALINEN KEMIA
related: Sähkötekniikka
related: Sähkövalo
related: Sähköenergian muuttaminen, muuntaminen, jakelu ja siirto
related: Sähkönmittaustekniikka. Sähkönsäätötekniikka
related: Sähköenergian tuottaminen. Voimalatekniikka
related: URN:NBN:fi:au:hklj:627.7
related: Systeemityö
related: Ohjelmointi. Ohjelmointikielet
related: URN:NBN:fi:au:hklj:627.73
related: Käyttöjärjestelmät
related: Tekstinkäsittelyohjelmat
related: Taulukkolaskentaohjelmat
related: Tietokantaohjelmat
related: Kuvankäsittelyohjelmat. Grafiikkaohjelmat. Taitto-ohjelmat
related: Tietoliikenneohjelmat
related: Tietokoneiden lisälaitteet
related: Säätö- ja systeemitekniikka. Teollinen automaatio
related: Tietoliikenne. Viestintätekniikka. Multimedia
related: URN:NBN:fi:au:hklj:627.751
related: Sähköposti. Verkkojuttelu
related: URN:NBN:fi:au:hklj:627.7512
related: Matkaviestinpalvelut. Puhelinliikenne
related: URN:NBN:fi:au:hklj:627.753
related: URN:NBN:fi:au:hklj:627.7531
related: URN:NBN:fi:au:hklj:627.7532
related: Elektroniikka
scope note: Sähköstatiikka. Sähködynamiikka. Sähkökinetiikka Staattinen sähkö. Sähkökentät. Sähkövirta Sähkön johtuminen. Vastus. Jännite. Sähkönpurkaukset Magneettiset kentät. Magnetisoituminen. Sähkömagnetismi Sähkömagneettiset värähtelyt ja aallot. Vaihtovirta
scope note: Elektrostatik. Elektrodynamik. Elektrokinetik Statisk elektricitet. Elektriska fält. Elektrisk ström Hur elektricitet leds. Motstånd. Spänning. Elektriska urladdningar Magnetiska fält. Magnetisering. Elektromagnetism Elektromagnetiska svängningar och vågor. Växelström @sv

BIOLOGIA
type: Class
type: Concept
subclass of: LUONNONTIETEET
alternative label: Aerobiologia (570)
alternative label: Aitotumaiset eliöt, eliöt (570)
alternative label: Aitotumaiset, eliöt (570)
alternative label: Aitotumalliset, eliöt (570)
alternative label: Bioinformatiikka, biologia (570)
alternative label: Biologia (570 ... 579)
alternative label: Biologiset tieteet (570)
alternative label: Biologiset tieteet, biologia (570 ... 579)
alternative label: Biomatematiikka (570)
alternative label: Biomateriaalit, biologia (570)
alternative label: Biometria (570)
alternative label: Biostatistiikka (570)
alternative label: Biotestit, biotiteet (570)
alternative label: Biotieteet (570)
alternative label: Biotieteet, biologia (570 ... 579)
alternative label: Eliökunnan järjestelmä (570)
alternative label: Eliökunta (570)
alternative label: Eliöt (570)
alternative label: Elämä, biologia (570)
alternative label: Elävä luonto, biologia (570 ... 579)
alternative label: Etnobiologia, biologia (570)
alternative label: Eukaryootit, eliöt (570)
alternative label: Fotobiologia, biologia (570 ... 579)
alternative label: Hydrobiologia (570)
alternative label: Itämeri, meribiologia (570)
alternative label: Joenuomat, vesibiologia (570)
alternative label: Joet, vesibiologia (570)
alternative label: Jokisuistot, vesibiologia (570)
alternative label: Järvet, vesibiologia (570)
alternative label: Kokeet, biologia (570)
alternative label: Lahkot, eliökunnan järjestelmä (570)
alternative label: Lajit, eliökunnan järjestelmä (570)
alternative label: Lajiutuminen, eliökunnan järjestelmä (570)
alternative label: Luonnonhistoria (570)
alternative label: Luonnontieteet, biologia (570 ... 576)
alternative label: Luonto, elävä luonto (570 ... 598)
alternative label: Maabiologia (570)
alternative label: Maaperäbiologia (570)
alternative label: Mekanismit, biologiset mekanismit (570 ... 579)
alternative label: Meret, meribiologia (570)
alternative label: Meribiologia (570)
alternative label: Murtovesi, murtovesibiologia (570)
alternative label: Plankton (570)
alternative label: Populaatiobiologia, biologia (570 ... 579)
alternative label: Purot, vesibiologia (570)
alternative label: Rodut, eliökunnan järjestelmä (570)
alternative label: Synteettinen biologia (570 ... 579)
alternative label: Systematiikka, eliökunnan järjestelmä (570)
alternative label: Taksonomia, eliökunnan järjestelmä (570)
broader: LUONNONTIETEET
in scheme: URN:NBN:fi:au:hklj:
narrower: Biologian filosofia
narrower: Yleisbiologia
narrower: Ekologia. Eliömaantiede
narrower: Kehitysoppi. Evoluutio
narrower: URN:NBN:fi:au:hklj:576
narrower: Yleinen mikrobiologia
notation: 570
related: Hydrologia
related: Meteorologia. Klimatologia
related: Luonto-oppaat. Oppikirjat
related: Ympäristönsuojelu. Luonnonsuojelu
related: Uhanalaiset lajit. Luonnonsuojelualueet
related: Maaperän, metsien ja soiden suojelu
related: Vesien suojelu
related: Ilman suojelu
related: Elämä maailmankaikkeudessa. Astrobiologia
related: BIOKEMIA
related: KASVITIEDE
related: Systemaattinen kasvitiede
related: URN:NBN:fi:au:hklj:590
related: Systemaattinen eläintiede
related: Anatomia
related: URN:NBN:fi:au:hklj:612
related: Orgaanisen kemian teollisuus
scope note: Biologian ja luonnonhistorian yleisteokset Biologian ja luonnonhistorian yleiset oppikirjat Elävän luonnon biologinen tutkimus yleensä Taksonomia yleensä. Eliökunnan järjestelmä Biologian alaan kuuluvat yleisteokset, jotka koskevat sekä eläimiä että kasveja Useita biotieteitä koskevat teokset Aerobiologia, vesibiologia ja maaperäbiologia yleensä Plankton yleensä
scope note: Allmänna verk om biologi och naturhistoria Allmänna läroböcker i biologi och naturhistoria Biologiska undersökningar i den levande naturen i allmänhet Taxonomi i allmänhet. Organismernas system i allmänhet Allmänna verk som rör biologi och handlar om både djur och växter Verk som rör flera biovetenskapliga områden Aerobiologi, hydrobiologi och jordmånsbiologi i allmänhet Plankton i allmänhet @sv

Nisäkkäät
type: Class
type: Concept
subclass of: Selkärankaiset
alternative label: Aasit, eläintiede (597.93)
alternative label: Aavikkorotat, eläintiede (597.93)
alternative label: Ahma (597.93)
alternative label: Antiloopit (597.93)
alternative label: Apinat (597.93)
alternative label: Biisoni (597.93)
alternative label: Chinchillat, eläintiede (597.93)
alternative label: Delfiinit (597.93)
alternative label: Elefantit (597.93)
alternative label: Galagot (597.93)
alternative label: Gasellit (597.93)
alternative label: Gepardi (597.93)
alternative label: Gerbiilit, eläintiede (597.93)
alternative label: Gibbonit (597.93)
alternative label: Gorilla (597.93)
alternative label: Haisunäätä (597.93)
alternative label: Halli (597.93)
alternative label: Hallit, eläintiede (597.93)
alternative label: Hammasvalaat (597.93)
alternative label: Hamsterit, eläintiede (597.93)
alternative label: Harmaahylje (597.93)
alternative label: Hetulavalaat (597.93)
alternative label: Hevonen, eläintiede (597.93)
alternative label: Hevoset, eläintiede (597.93)
alternative label: Hiiret, eläintiede (597.93)
alternative label: Hilleri (597.93)
alternative label: Hirvi, eläintiede (597.93)
alternative label: Hirvieläimet (597.93)
alternative label: Hominidit (597.93)
alternative label: Hyeenakoira (597.93)
alternative label: Hyeenat (597.93)
alternative label: Hylje-eläimet (597.93)
alternative label: Hylkeet (597.93)
alternative label: Hyönteissyöjät, nisäkkäät (597.93)
alternative label: Häntäapinat (597.93)
alternative label: Ihmisapinat (597.93)
alternative label: Ilves (597.93)
alternative label: Imettäväiset (597.93)
alternative label: Indrit (597.93)
alternative label: Jaguaari (597.93)
alternative label: Jyrsijät, eläintiede (597.93)
alternative label: Jänikset, eläintiede (597.93)
alternative label: Jäniseläimet, eläintiede (597.93)
broader: Selkärankaiset
in scheme: URN:NBN:fi:au:hklj:
notation: 597.93
related: Biologinen antropologia
related: Luonto-oppaat. Oppikirjat
related: Uhanalaiset lajit. Luonnonsuojelualueet
related: Systemaattinen kasvitiede
related: Eläinsuojelu
related: Etologia. Eläinsosiologia
related: Eläinmorfologia. Eläinanatomia
related: Eläinfysiologia
related: Eläinekologia
related: Kalat
related: Eläinmaantiede
related: URN:NBN:fi:au:hklj:654
related: Hevoset
related: Nautaeläimet
related: Vuohet ja lampaat
related: Siat
related: Siipikarja
related: Turkiseläimet
related: Porot
related: Hyönteiset
related: Lemmikkieläimet
related: Koirat
related: Kissat
related: Pikkunisäkkäät
related: Häkkilinnut
related: Akvaariot
related: Metsästys
related: Kalastus
related: Hevosurheilu. Ratsastus
scope note: Norsueläimet. Hyönteissyöjät. Lepakot. Pussieläimet. Jyrsijät. Jäniseläimet. Petoeläimet. Hylje-eläimet. Kavioeläimet. Sorkkaeläimet. Valaat. Kädelliset. Muut nisäkäsryhmät Nisäkkäiden systematiikka ja lajinmääritysoppaat Nisäkkäiden morfologia, anatomia, fysiologia, ekologia, etologia ja eläinmaantiede Nisäkkäiden käyttäytyminen. Nisäkkäiden lisääntyminen
scope note: Elefantdjur. Insektätare. Fladdermöss. Pungdjur. Gnagare. Hardjur. Rovdjur. Säldjur. Hovdjur. Klövdjur. Valar. Primater. Andra däggdjursgrupper Däggdjurens systematik och handböcker i artbestämning av däggdjur Däggdjurens morfologi, anatomi, fysiologi, etologi, ekologi och djurgeografi Däggdjurens beteende. Däggdjurens fortplantning @sv

Skitsofrenia. Jakomielitauti
type: Class
type: Concept
subclass of: Psyykkiset sairaudet. Mielenterveyden häiriöt
alternative label: Jakomielitauti (618.61)
alternative label: Paranoia (618.61)
alternative label: Skitsofrenia (618.61)
alternative label: Vainoharhaisuus (618.61)
alternative label: Förföljelsemani (618.61) @sv
alternative label: Schizofreni (618.61) @sv
alternative label: Schizophreni (618.61) @sv
broader: Psyykkiset sairaudet. Mielenterveyden häiriöt
in scheme: URN:NBN:fi:au:hklj:
notation: 618.61
preferred label: Schizophrenia @en
preferred label: Schizofreni @sv
related: URN:NBN:fi:au:hklj:120
related: Havaintopsykologia
related: Perinnöllisyyspsykologia
related: Kehityspsykologia. Eri ikäkausien psykologia
related: URN:NBN:fi:au:hklj:181.9
related: URN:NBN:fi:au:hklj:332.22
related: URN:NBN:fi:au:hklj:371.6
related: URN:NBN:fi:au:hklj:373
related: URN:NBN:fi:au:hklj:576
related: URN:NBN:fi:au:hklj:613.3
related: URN:NBN:fi:au:hklj:613.31
related: URN:NBN:fi:au:hklj:613.5
related: URN:NBN:fi:au:hklj:615
related: URN:NBN:fi:au:hklj:615.1
related: URN:NBN:fi:au:hklj:615.3
related: URN:NBN:fi:au:hklj:615.8
related: URN:NBN:fi:au:hklj:616
related: URN:NBN:fi:au:hklj:616.2
related: URN:NBN:fi:au:hklj:616.3
related: URN:NBN:fi:au:hklj:617
related: URN:NBN:fi:au:hklj:617.1
related: URN:NBN:fi:au:hklj:617.2
related: URN:NBN:fi:au:hklj:617.4
related: URN:NBN:fi:au:hklj:617.99
related: URN:NBN:fi:au:hklj:618.8
related: Analyyttinen psykoterapia
related: URN:NBN:fi:au:hklj:618.85
related: URN:NBN:fi:au:hklj:618.86
related: Mielisairaanhoito
scope note: Skitsofrenian ennaltaehkäisy, diagnostiikka ja hoito. Skitsofrenian syyt. Skitsofrenian psykopatologia Skitsofrenian lääke- ja terapiahoito Vainoharhaisuus. Paranoia
scope note: Förebyggande och behandling av schizofreni samt dess diagnostik Orsaker till schizofreni. Schizofrenins psykopatologi Läkemedelsbehandling och terapeutisk behandling av schizofreni Förföljelsemani. Paranoia @sv

Mielisairaanhoito
type: Class
type: Concept
subclass of: Psykiatria
alternative label: Mielenterveyshoitajat, mielenterveyshoitajan työ (618.9)
alternative label: Mielisairaanhoito (618.9)
alternative label: Psykiatrinen sairaanhoito (618.9)
alternative label: Mentalsjukvård (618.9) @sv
alternative label: Mentalvårdare, mentalvårdarens arbete (618.9) @sv
alternative label: Psykiatrisk sjukvård (618.9) @sv
broader: Psykiatria
in scheme: URN:NBN:fi:au:hklj:
notation: 618.9
preferred label: Mental health care @en
preferred label: Mentalvård @sv
related: URN:NBN:fi:au:hklj:120
related: Perinnöllisyyspsykologia
related: Kehityspsykologia. Eri ikäkausien psykologia
related: URN:NBN:fi:au:hklj:181.9
related: URN:NBN:fi:au:hklj:332.22
related: URN:NBN:fi:au:hklj:371.6
related: URN:NBN:fi:au:hklj:373
related: URN:NBN:fi:au:hklj:576
related: Sairaanhoitajan ja terveydenhoitajan työ
related: URN:NBN:fi:au:hklj:613.3
related: URN:NBN:fi:au:hklj:613.31
related: URN:NBN:fi:au:hklj:613.5
related: URN:NBN:fi:au:hklj:615
related: URN:NBN:fi:au:hklj:615.1
related: URN:NBN:fi:au:hklj:615.3
related: URN:NBN:fi:au:hklj:615.8
related: URN:NBN:fi:au:hklj:616
related: URN:NBN:fi:au:hklj:616.2
related: URN:NBN:fi:au:hklj:616.3
related: URN:NBN:fi:au:hklj:617
related: URN:NBN:fi:au:hklj:617.1
related: URN:NBN:fi:au:hklj:617.2
related: URN:NBN:fi:au:hklj:617.4
related: URN:NBN:fi:au:hklj:617.99
related: Psyykkiset sairaudet. Mielenterveyden häiriöt
related: Skitsofrenia. Jakomielitauti
related: Kaksisuuntainen mielialahäiriö
related: Neuroosit
related: URN:NBN:fi:au:hklj:618.8
scope note: Mielenterveyshoitajan työ yleensä Tietyn psyykkisen sairauden hoito ko. sairauden luokassa 618.6+
scope note: Sinnessjukvårdarens arbete i allmänhet Behandling av enskilda psykiska sjukdomar förs till sjukdomens klass 618.6+ @sv

Laivat. Laivanrakennus
type: Class
type: Concept
subclass of: Vesikulkuneuvot
alternative label: Asuntolaivat (625.71)
alternative label: Autolautat (625.71)
alternative label: Hinaajat, laivanrakennus (625.71)
alternative label: Huolto, laivat (625.71)
alternative label: Hävittäjät, laivat (625.71)
alternative label: Höyrylaivat (625.71)
alternative label: Jaalat, laivat (625.71)
alternative label: Jokilaiva, laivat (625.71)
alternative label: Jokilaivat, laivat (625.71)
alternative label: Jäänmurtajat (625.71)
alternative label: Kantosiipialukset, laivat (625.71)
alternative label: Katamaraanit, laivat (625.71)
alternative label: Kauppa-alukset (625.71)
alternative label: Kauppa-alukset, laivat (625.71)
alternative label: Kauppalaivasto, laivat (625.71)
alternative label: Kauppalaivat (625.71)
alternative label: Kauppalaivat, laivat (625.71)
alternative label: Komentosillat (625.71)
alternative label: Konehuoneet, laivat (625.71)
alternative label: Koululaivat, laivat (625.71)
alternative label: Kölit, laivat (625.71)
alternative label: Köysistö, laivat (625.71)
alternative label: Laivanrakennus (625.71)
alternative label: Laivasto, laivat (625.71)
alternative label: Laivat (625.71)
alternative label: Lautat, autolautat (625.71)
alternative label: Lentotukialukset (625.71)
alternative label: Lotjat (625.71)
alternative label: Lämmittäjät, höyrylaivat (625.71)
alternative label: Mastot, laivat (625.71)
alternative label: Matkustajalaivat (625.71)
alternative label: Merentutkimusalukset (625.71)
alternative label: Meriteollisuus (625.71)
alternative label: Miinalaivat (625.71)
alternative label: Mukavuuslippulaivat, laivat (625.71)
alternative label: Painolasti, laivat (625.71)
alternative label: Painolastivesi, laivat (625.71)
alternative label: Pintaliitäjät, laivat (625.71)
alternative label: Potkurit, laivat (625.71)
alternative label: Proomut (625.71)
alternative label: Purjeet, purjelaivat (625.71)
alternative label: Purjelaivat (625.71)
alternative label: Puulaivat (625.71)
alternative label: Rahtilaivat (625.71)
broader: Vesikulkuneuvot
in scheme: URN:NBN:fi:au:hklj:
notation: 625.71
related: Merioikeus
related: URN:NBN:fi:au:hklj:342
related: URN:NBN:fi:au:hklj:380
related: Vesi- ja ilmaliikenne
related: Vesiliikenne
related: Sotataito. Strategia. Taktiikka
related: Aseteknologia
related: URN:NBN:fi:au:hklj:460
related: Hydrologia
related: Vesien suojelu
related: URN:NBN:fi:au:hklj:620.88
related: Yleinen konetekniikka
related: Koneenrakennus. Pneumatiikka. Hydrauliikka
related: Voimakoneet. Moottorit. Nosto- ja kuljetuslaitteet
related: URN:NBN:fi:au:hklj:624
related: Satamat. Satamatekniikka
related: Vesiväylät. Vesien säännöstely
related: URN:NBN:fi:au:hklj:625.7109
related: Muut vesikulkuneuvot
related: URN:NBN:fi:au:hklj:631
related: Kalastus
related: URN:NBN:fi:au:hklj:660
related: Rakennusstatiikka. Rakennusaineet
related: Tekninen rakennussuunnittelu
related: Geotekniikka. Maatyöt
related: Merenkulkuoppi
related: Moottoriurheilu. Lentourheilu
related: Yleinen arkeologia
scope note: Laivan suunnittelu, tekniikka ja rakentaminen Laivan rakenne ja osat. Laivan huolto, viat ja korjaus Laivanrakennusteollisuus. Telakkateollisuus. Kauppalaivastot. Sotalaivastot. Laivatyypit. Purjelaivat. Höyrylaivat. Ydin- ja moottorikäyttöiset laivat. Siipirataslaivat. Kantosiipialukset. Matkustajalaivat. Asuntolaivat. Autolautat. Rahtilaivat. Säiliölaivat. Proomut. Hinaajat. Kalastuslaivat. Troolarit. Jäänmurtajat. Sotalaivat. Lentotukialukset Laivojen keulakuvat. Laivojen sisätilat Jos teos koskee sekä laivoja että vesiliikennettä tai merenkulkua, on etusija luokalla 386.1
scope note: Konstruktion av fartyg, skeppsbyggnad och fartygsteknik Fartygets konstruktion och delar. Underhåll och reparation av fartyg, deras fel Skeppsbyggnadsindustri. Varvsindustri. Handelsflottor. Krigsflottor Fartygstyper. Segelfartyg. Ångfartyg. Kärn- och motordrivna fartyg. Hjulångare. Bärplansbåtar. Passagerarfartyg. Husbåtar. Bilfärjor. Lastfartyg. Tankfartyg. Pråmar. Bogserbåtar. Fiskefartyg. Trålare. Isbrytare. Krigsfartyg. Hangarfartyg Galjonsfigurer. Fartygsinredning Om verket handlar om både fartyg och sjötrafik eller sjöfart ges företräde åt klass 386.1 @sv

Muut vesikulkuneuvot
type: Class
type: Concept
subclass of: Vesikulkuneuvot
alternative label: Ilmatyynyalukset, vesikulkuneuvot (625.73)
alternative label: Junalautat (625.73)
alternative label: Lautat (625.73)
alternative label: Lossit (625.73)
alternative label: Sukellusveneet (625.73)
alternative label: Vedenalaiset alukset (625.73)
alternative label: Vesikulkuneuvot, sukellusveneet (625.73)
alternative label: Ydinsukellusveneet (625.73)
alternative label: Atomubåtar (625.73) @sv
alternative label: Farkoster, ubåtar (625.73) @sv
alternative label: Flottar (625.73) @sv
alternative label: Färjor (625.73) @sv
alternative label: Svävfarkoster, farkoster (625.73) @sv
alternative label: Tågfärjor (625.73) @sv
alternative label: Ubåtar (625.73) @sv
alternative label: Undervattensfartyg (625.73) @sv
broader: Vesikulkuneuvot
in scheme: URN:NBN:fi:au:hklj:
notation: 625.73
preferred label: Other watercraft @en
preferred label: Andra vattenfarkoster @sv
related: URN:NBN:fi:au:hklj:342
related: URN:NBN:fi:au:hklj:380
related: Vesi- ja ilmaliikenne
related: Vesiliikenne
related: Sotataito. Strategia. Taktiikka
related: Aseteknologia
related: URN:NBN:fi:au:hklj:460
related: Hydrologia
related: Vesien suojelu
related: URN:NBN:fi:au:hklj:620.88
related: Yleinen konetekniikka
related: Koneenrakennus. Pneumatiikka. Hydrauliikka
related: Voimakoneet. Moottorit. Nosto- ja kuljetuslaitteet
related: URN:NBN:fi:au:hklj:624
related: Tiet. Kadut. Tienrakennus. Kadunrakennus
related: Sillat. Sillanrakennus
related: Vesiväylät. Vesien säännöstely
related: Laivat. Laivanrakennus
related: URN:NBN:fi:au:hklj:625.72
related: URN:NBN:fi:au:hklj:631
related: Kalastus
related: URN:NBN:fi:au:hklj:660
related: Rakennusstatiikka. Rakennusaineet
related: Tekninen rakennussuunnittelu
related: Geotekniikka. Maatyöt
related: Merenkulkuoppi
related: Uinti. Sukellus
related: Moottoriurheilu. Lentourheilu
scope note: Siviili- ja sotilaskäyttöön tarkoitetut sukellusveneet Ydinsukellusveneet. Ilmatyynyalukset. Lossit Jos teos koskee sekä vesikulkuneuvoja että vesiliikennettä tai merenkulkua, on etusija luokalla 386.1
scope note: Ubåtar för civilt och militärt bruk Atomubåtar. Svävare. Färjor Om verket handlar om både vattenfarkoster och sjötrafik eller sjöfart ges företräde åt klass 386.1 @sv

Elektroniikka
type: Class
type: Concept
subclass of: Sähkötekniikka
alternative label: Aktiiviset komponentit, elektroniikka (627.8)
alternative label: Analogiatekniikka, elektroniikka (627.8)
alternative label: Anodit, elektroniikka (627.8)
alternative label: Arduino, mikro-ohjaimet (627.8)
alternative label: Digitaalinen tallennus, elektroniikka (627.8)
alternative label: Digitaaliset signaalit, elektroniikka (627.8)
alternative label: Digitaalitekniikka (627.8)
alternative label: Digitalisointi, elektroniikka (627.8)
alternative label: Digitalisoituminen, elektroniikka (627.8)
alternative label: Digitointi, elektroniikka (627.8)
alternative label: Digitoituminen, elektroniikka (627.8)
alternative label: Diodit (627.8)
alternative label: Elektrodit, elektroniikka (627.8)
alternative label: Elektroniikka (627.8)
alternative label: Elektroniikka-ala (627.8)
alternative label: Elektroniikkakomponentit (627.8)
alternative label: Elektroniikkalaitteet (627.8)
alternative label: Elektroniikkalaitteet, elektroniikka (627.8)
alternative label: Elektroniikkapiirit (627.8)
alternative label: Elektronioptiikka (627.8)
alternative label: Elektroniputket (627.8)
alternative label: Elektroniset järjestelmät (627.8)
alternative label: Elektroniset komponentit (627.8)
alternative label: Elektroniset laitteet (627.8)
alternative label: Elektroniset laitteet, elektroniikka (627.8)
alternative label: Elektroniset lohkokaaviot (627.8)
alternative label: Elektroniset piirit (627.8)
alternative label: Elektroniset signaalit (627.8)
alternative label: Fullereenit, elektroniikka (627.8)
alternative label: Grafeeni, elektroniikka (627.8)
alternative label: Grafiini, elektroniikka (627.8)
alternative label: Hohtodiodit (627.8)
alternative label: IC-piirit (627.8)
alternative label: Integroidut piirit (627.8)
alternative label: Katodit, elektroniikka (627.8)
alternative label: Komponentit, elektroniikka (627.8)
alternative label: Komponenttitekniikka (627.8)
alternative label: Kondensaattorit, elektroniikka (627.8)
alternative label: Kytkentä, elektroniikka (627.8)
alternative label: Kytkentäkaaviot, elektroniikka (627.8)
alternative label: Kytkimet, elektroniikka (627.8)
alternative label: Kytkinlaitteet, elektroniikka (627.8)
alternative label: Laserit, tekniikka (627.8)
broader: Sähkötekniikka
in scheme: URN:NBN:fi:au:hklj:
notation: 627.8
related: Valo-oppi. Värioppi. Säteilyoppi
related: Sähköoppi. Magnetismi
related: URN:NBN:fi:au:hklj:617.7
related: URN:NBN:fi:au:hklj:620.88
related: URN:NBN:fi:au:hklj:627.7
related: Systeemityö
related: Ohjelmointi. Ohjelmointikielet
related: URN:NBN:fi:au:hklj:627.73
related: Käyttöjärjestelmät
related: Tekstinkäsittelyohjelmat
related: Taulukkolaskentaohjelmat
related: Tietokantaohjelmat
related: Kuvankäsittelyohjelmat. Grafiikkaohjelmat. Taitto-ohjelmat
related: Tietoliikenneohjelmat
related: Tietokoneiden lisälaitteet
related: Säätö- ja systeemitekniikka. Teollinen automaatio
related: Tietoliikenne. Viestintätekniikka. Multimedia
related: URN:NBN:fi:au:hklj:627.751
related: Sähköposti. Verkkojuttelu
related: URN:NBN:fi:au:hklj:627.7512
related: Matkaviestinpalvelut. Puhelinliikenne
related: URN:NBN:fi:au:hklj:627.753
related: URN:NBN:fi:au:hklj:627.7531
related: URN:NBN:fi:au:hklj:627.7532
related: URN:NBN:fi:au:hklj:667.7
related: URN:NBN:fi:au:hklj:667.71
related: URN:NBN:fi:au:hklj:681
related: Toimistokoneet
related: Pelit
scope note: Elektroniikan yleisteokset ja yleiset oppikirjat Elektroniset signaalit ja niiden vahvistaminen. Elektroniset piirit ja komponentit Elektroniset järjestelmät. Elektroniikan lohko- ja kytkentäkaaviot Analogiset ja digitaaliset signaalit. Digitaalitekniikka Sähkömagneettisten aaltojen, värähtelyjen ja pulssien tekniikka Mikroaaltotekniikka. Modulointi. Laser- ja maser-tekniikka Analogiapiirit. Pulssipiirit. Integroidut piirit. Mikropiirit Aktiiviset ja passiiviset komponentit. Puolijohdekomponentit Elektroniputket. Röntgenputket. Purkausputket. Transistorit. Tyristorit. Valokennot. Elektronioptiikka eli optoelektroniikka Elektroniikkateollisuus yleensä Elektroniikan sovellukset eri aloille alan mukaisessa luokassa
scope note: Allmänna verk om elektronik. Allmänna läroböcker i elektronik Elektroniska signaler och förstärkning av dem. Elektroniska kretsar och komponenter Elektroniska system. Elekrtoniska block- och kopplingsscheman Analoga och digitala signaler. Digitalteknik Elektromagnetiska vågors, svängningars och pulsers teknik Mikrovågsteknik. Modulering. Laser- och maserteknik Analoga kretsar. Pulskretsar. Integrerade kretsar. Mikrokretsar Aktiva och passiva komponenter. Halvledarkomponenter Elektronrör. Röntgenrör. Urladdningsrör. Transistorer. Tyristorer. Solceller. Elektronoptik (optoelektronik) Elektronikindustri i allmänhet Hit också allmänna arbeten om elektronik som hobby Tillämpningar av elektronik inom olika områden klassificeras enligt område @sv

Nykyajan taidehistoria
type: Class
type: Concept
subclass of: URN:NBN:fi:au:hklj:709
alternative label: Aasia, taide, moderni (709.6)
alternative label: Abstrakti taide, taidehistoria (709.6)
alternative label: Abstraktinen taide, taidehistoria (709.6)
alternative label: Afrikka, taide, moderni (709.6)
alternative label: Amerikka, taide, moderni, nykyaika (709.6)
alternative label: Art deco, taidehistoria (709.6)
alternative label: Art noveau, taidehistoria (709.6)
alternative label: Arte povera, taidehistoria (709.6)
alternative label: Australia, taide, moderni (709.6)
alternative label: Avant-garde, taidehistoria (709.6)
alternative label: Avantgarde, taidehistoria (709.6)
alternative label: Avantgardismi, taidehistoria (709.6)
alternative label: Dada, taidehistoria (709.6)
alternative label: Dadaismi, taidehistoria (709.6)
alternative label: Egypti, taidehistoria, nykyajan (709.6)
alternative label: Ekspressionismi, taidehistoria (709.6 +)
alternative label: Etelä-Amerikka, taide, moderni, nykyaika (709.6)
alternative label: Figuratiivinen taide, taidehistoria (709.6)
alternative label: Funktionalismi, taidehistoria (709.6)
alternative label: Futurismi, taidehistoria (709.6)
alternative label: Impressionismi, taidehistoria (709.6)
alternative label: Informalismi, taidehistoria (709.6)
alternative label: Intia, taide, moderni (709.6)
alternative label: Jugend, taidehistoria (709.6)
alternative label: Junk art, taidehistoria (709.6)
alternative label: Jälkimoderni, taidehistoria (709.6)
alternative label: Jälkimodernismi, taidehistoria (709.6)
alternative label: Konkreettinen taide, taidehistoria (709.6)
alternative label: Konstruktionismi, taidehistoria (709.6)
alternative label: Konstruktivismi, taidehistoria (709.6)
alternative label: Kreikka, taidehistoria, nykyaika (709.6)
alternative label: Kubismi, taidehistoria (709.6)
alternative label: L'art nouveau, taidehistoria (709.6)
alternative label: Lappalaiset, taide, moderni (709.6)
alternative label: Minimalismi, taidehistoria (709.6)
alternative label: Moderni taide, taidehistoria (709.6)
alternative label: Moderni, taidehistoria (709.6)
alternative label: Modernismi, taidehistoria (709.6)
alternative label: Naivismi, taidehistoria (709.6)
alternative label: Neuvostoliitto, taidehistoria (709.6)
alternative label: Nonfiguratiivinen taide, taidehistoria (709.6)
alternative label: Nykyaika, taidehistoria (709.6)
alternative label: Nykytaide, taidehistoria (709.6)
alternative label: Oseania, taide, moderni (709.6)
alternative label: Pohjois-Amerikka, taide, moderni, nykyaika (709.6)
alternative label: Poptaide, taidehistoria (709.6)
alternative label: Postmoderni, taidehistoria (709.6)
alternative label: Postmodernismi, taidehistoria (709.6)
alternative label: Primitivismi, taidehistoria (709.6)
alternative label: Psykedeelinen taide, taidehistoria (709.6)
alternative label: Realismi, taidehistoria (709.5 ... 709.6)
alternative label: Romutaide, taidehistoria (709.6)
alternative label: Saamelaiset, taide, moderni (709.6)
alternative label: Sosialistinen realismi, taidehistoria (709.6)
alternative label: Surrealismi, taidehistoria (709.6)
alternative label: Taidehistoria, nykyaika (709.6)
alternative label: Undergroundtaide, taidehistoria (709.6)
broader: URN:NBN:fi:au:hklj:709
in scheme: URN:NBN:fi:au:hklj:
notation: 709.6
related: Alkuperäiskansojen taide
related: Euroopan ulkopuolisten vanhojen kulttuurien taide
related: Suomen yleinen taidehistoria
related: URN:NBN:fi:au:hklj:710
related: Nykyajan arkkitehtuuri
related: URN:NBN:fi:au:hklj:730.9
related: Nykyajan kuvanveistotaide
related: URN:NBN:fi:au:hklj:740.9
related: Nykyajan maalaustaide
related: URN:NBN:fi:au:hklj:770.9
related: URN:NBN:fi:au:hklj:789
related: URN:NBN:fi:au:hklj:789.1
related: URN:NBN:fi:au:hklj:919
related: Nykyajan kulttuurihistoria 1914-1938
related: Nykyajan kulttuurihistoria 1939-
scope note: Euroopan nykyajan taide yleensä - impressionismista alkaen Tässä myös Euroopan ulkopuolisen länsimaisen taiteen nykyajan yleinen taidehistoria Tässä esim. impressionismin, ekspressionismin, jugendin, art decon, kubismin, surrealismin, dadaismin, modernismin ja postmodernismin taide yleensä Abstrakti taide yleensä Nykyajan taiteen eri aloja koskevat teokset alan mukaisessa luokassa Yksittäisiä taiteilijoita tai heidän tuotantoaan koskevat teokset ovat aina ko. taiteenalan tai sen historian luokassa
scope note: Europeisk nutidskonst i allmänhet - med början i impressionismen Hit också allmän konsthistoria som rör utomeuropeisk västerländsk nutidskonst Hit t.ex. impressionistisk, expressionistisk, kubistisk, surrealistisk, dadaistisk, modernistisk och postmodernistisk konst samt jugendkonst och art deco-konst i allmänhet Abstrakt konst i allmänhet Verk som handlar om nutidens enskilda konstarter klassificeras enligt konstart Verk som handlar om enskilda konstnärer och deras produktion klassificeras alltid enligt konstarten eller dess historia @sv

Valokuvataide
type: Class
type: Concept
subclass of: URN:NBN:fi:au:hklj:756
alternative label: Aiheet, valokuvataide (756.1)
alternative label: Alastonmalli, valokuvataiteen historia (756.1)
alternative label: Asetelmat, valokuvataiteen historia (756.1)
alternative label: Diakuvat, valokuvataide (756.1)
alternative label: Diapositiivit, valokuvataide (756.1)
alternative label: Dokumentaarisuus, valokuvataide (756.1)
alternative label: Dokumenttivalokuvaus, valokuvataide (756.1)
alternative label: Eläinaiheet, valokuvataiteen historia (756.1)
alternative label: Henkilövalokuvaus, valokuvataide (756.1)
alternative label: Kasviaiheet, valokuvataide (756.1)
alternative label: Kuultokuvat, valokuvataide (756.1)
alternative label: Kuvaajat, valokuvaajat (756.1)
alternative label: Kuvajournalismi, lehtikuvat (756.1)
alternative label: Kuvataiteilijat, valokuvaajat (756.1)
alternative label: Kuvateokset, valokuvataide (756.1)
alternative label: Lehtikuvaajat (756.1)
alternative label: Lehtikuvat (756.1)
alternative label: Lehtivalokuvaus, lehtikuvat (756.1)
alternative label: Luonnonkuvaus, valokuvataide (756.1)
alternative label: Luonnonvalokuvaus, valokuvataide (756.1)
alternative label: Mainoskuvaus, valokuvataide (756.1)
alternative label: Maisema, valokuvataide (756.1)
alternative label: Maisemavalokuvaus, valokuvataide (756.1)
alternative label: Muotivalokuvaus, valokuvataide (756.1)
alternative label: Muotokuvat, valokuvataide (756.1)
alternative label: Mustavalkoinen valokuvaus, valokuvataide (756.1)
alternative label: Omakuvat, valokuvataide (756.1)
alternative label: Porno, valokuvataide (756.1)
alternative label: Pornografia, valokuvataide (756.1)
alternative label: Sisäkuvat, aiheet valokuvataiteessa (756.1)
alternative label: Taiteilijaelämäkerrat, valokuvaajat (756.1)
alternative label: Taiteilijat, valokuvaajat (756.1)
alternative label: Uutiskuvat (756.1)
alternative label: Valokuvaajat (756.1)
alternative label: Valokuvailmaisu, valokuvataide (756.1)
alternative label: Valokuvanäyttelyt (756.1)
alternative label: Valokuvat, valokuvataide (756.1)
alternative label: Valokuvataide (756.1)
alternative label: Valokuvaus, valokuvataide (756.1)
alternative label: Anledningar, fotokonst (756.1) @sv
alternative label: Bildjournalistik, pressbilder (756.1) @sv
alternative label: Bildkonstnärer, fotografer (756.1) @sv
alternative label: Bildverk, fotokonst (756.1) @sv
alternative label: Diabilder, fotokonst (756.1) @sv
alternative label: Diapositiver, fotograferingens teknik (756.1) @sv
alternative label: Diapositiver, fotokonst (756.1) @sv
alternative label: Diapositiver, förvaring av fotografier (756.1) @sv
alternative label: Djurmotiv, fotokonstens historia (756.1) @sv
alternative label: Dokumentarism, fotokonst (756.1) @sv
alternative label: Dokumentärfotografi, fotokonst (756.1) @sv
alternative label: Fotografer, kuvaajat (756.1) @sv
alternative label: Fotografer, valokuvaajat (756.1) @sv
alternative label: Fotografering, fotokonst (756.1) @sv
alternative label: Fotografier, fotokonst (756.1) @sv
alternative label: Fotografiskt uttryck, fotokonst (756.1) @sv
alternative label: Fotokonst (756.1) @sv
alternative label: Fotoutställningar (756.1) @sv
alternative label: Genomsiktsbilder, fotokonst (756.1) @sv
alternative label: Interiörer, bildkonst, motiv i fotokonst (756.1) @sv
alternative label: Konstnärer, fotografer (756.1) @sv
broader: URN:NBN:fi:au:hklj:756
in scheme: URN:NBN:fi:au:hklj:
notation: 756.1
related: Lehdistöoppi
related: Suomen yleinen taidehistoria
related: MAALAUSTAIDE. PIIRUSTUSTAIDE
related: URN:NBN:fi:au:hklj:740.9
related: URN:NBN:fi:au:hklj:742
related: URN:NBN:fi:au:hklj:749.1
related: Graafisen taiteen teoria, estetiikka ja filosofia
related: Graafisen taiteen historia
related: Suomi
related: Valokuvauksen materiaalit ja tekniikka. Valokuvausoppaat
related: URN:NBN:fi:au:hklj:760
related: Elokuva. Elokuvataide
scope note: Valokuvataide, sen historia ja henkilöhistoria Valokuvataiteen filosofia, teoria ja estetiikka Valokuvauskilpailut. Valokuvanäyttelyt Aiheesta tai kohteesta riippumatta valokuvakirjat, joiden pääpaino on valokuvataiteessa, ei aiheen tai kohteen dokumentaarisessa esittelyssä Tässä esim. henkilö-, muoto- ja alastonkuvakokoelmat sekä luonnon- ja maisemakuvakokoelmat, joissa pääpaino on valokuvataiteessa Tiettyä kohdetta tai aihetta dokumentaarisesti tai tieteellisesti kuvaavat valokuvateokset alan mukaisessa luokassa Epävarmoissa tapauksissa on etusija luokalla 756.1
scope note: Fotokonst, dess historia och personhistoria Fotokonstens filosofi, teori och estetik Fototävlingar. Fotoutställningar Fotografiska verk där fotokonsten dominerar oavsett ämne eller motiv, och där huvudvikten inte ligger vid dokumentär presentation Hit t.ex. fotosamlingar med porträtt och nakenstudier samt natur- och landskapsstudier, där fotokonsten dominerar Fotografiska verk som presenterar enskilda motiv eller ämnen dokumentärt eller vetenskapligt klassificeras enligt område I osäkra fall ges företräde åt klass 756.1 @sv

Taideteollisuuden historia
type: Class
type: Concept
subclass of: URN:NBN:fi:au:hklj:760
alternative label: Art deco, taideteollisuus (760.9 ... 767)
alternative label: Art noveau, taideteollisuus (760.9 ... 767)
alternative label: Design, historia (760.9 +)
alternative label: Empire, taideteollisuus (760.9 +)
alternative label: Jugend, taideteollisuus (760.9 ... 767)
alternative label: L'art nouveau, taideteollisuus (760.9 ... 767)
alternative label: Muotoilijat, elämäkerrat ja muistelmat (760.9 +)
alternative label: Muotoilu, historia (760.9 +)
alternative label: Suunnittelijat, muotoilijat (760.9 +)
alternative label: Taiteilijaelämäkerrat, muotoilijat (760.9 ... 768)
alternative label: Taiteilijat, muotoilijat (760.9 ... 768)
alternative label: Teollinen muotoilu, henkilöhistoria (760.9 ... 769)
alternative label: Teollinen muotoilu, historia (760.9 ... 769)
alternative label: Uusasiallisuus, taideteollisuus (760.9 +)
alternative label: Uusbarokki, taideteollisuus (760.9 +)
alternative label: Uusrokokoo, taideteollisuus (760.9 +)
alternative label: Art deco, konstindustri (760.9 ... 767) @sv
alternative label: Art nouveau, konstindustri (760.9 ... 767) @sv
alternative label: Empire, konstindustri (760.9 +) @sv
alternative label: Formgivare, biografier och memoarer (760.9 +) @sv
alternative label: Formgivning, historia (760.9 +) @sv
alternative label: Industriell formgivning, historia (760.9 ... 769) @sv
alternative label: Industriell formgivning, personhistoria (760.9 ... 769) @sv
alternative label: Jugend, konstindustri (760.9 ... 767) @sv
alternative label: Konstnärer, formgivare (760.9 ... 768) @sv
alternative label: Konstnärsbiografier, formgivare (760.9 ... 768) @sv
alternative label: L'art nouveau, konstindustri (760.9 ... 767) @sv
alternative label: Nybarock, konstindustri (760.9 +) @sv
alternative label: Nyrokoko, konstindustri (760.9 +) @sv
alternative label: Nysaklighet, konstindustri (760.9 +) @sv
alternative label: Planerare, formgivare (760.9 +) @sv
broader: URN:NBN:fi:au:hklj:760
in scheme: URN:NBN:fi:au:hklj:
narrower: Suomi
notation: 760.9
preferred label: History of industrial art @en
preferred label: Konstindustrins historia @sv
related: Kelloteollisuus
related: URN:NBN:fi:au:hklj:709
related: Sisustusarkkitehtuuri
related: Käyttögrafiikka
related: Taidetaonta
related: Kulta- ja hopeasepäntaide. Korutaide
related: Taidepuutyöt
related: Huonekalutaide
related: URN:NBN:fi:au:hklj:764
related: Ryijyt
related: Koruompelu. Kirjonta. Nimikointi
related: Ompelu
related: Solmeilu. Makramee. Fransut
related: Matot
related: Neulonta
related: Virkkaus. Pitsinvirkkaus. Koukkuaminen. Nypläys
related: Kankaankudonta. Kankaanpainanta
related: Tilkkutyöt. Tikatut peitteet
related: Kehrääminen. Karstaus. Värjäys
related: Keramiikkataide. Posliinitaide
related: Keramiikkataide
related: Posliinitaide. Posliinimaalaus
related: Lasitaide
related: Paperitaide
related: URN:NBN:fi:au:hklj:767
related: Kukkien asettelu ja sidonta. Ikebana
related: URN:NBN:fi:au:hklj:769
scope note: Eri maanosien, maiden ja aikakausien taideteollisuuden, muotoilun ja taidekäsityön sekä taideteollisuuden tyylien yleinen historia Usealla taideteollisuuden alalla toimineet muotoilijat ja taidekäsityön harjoittajat, heidän henkilöhistoriansa ja tuotantonsa Taideteollisuusmuseot, -näyttelyt ja kokoelmat yleensä Taideteollisuuden erikoisalojen historia ja henkilöhistoria sekä museot, kokoelmat ja näyttelyt alan mukaisessa luokassa
scope note: Konstindustrins och dess stilarters samt formgivningens och konsthantverkets allmänna historia i olika världsdelar och länder eller under olika tidsperioder Formgivare och konsthantverkare verksamma inom flera konstindustriella områden, deras personhistoria och produktion Konstindustriella museer, utställningar och samlingar i allmänhet Specialområden inom konstindustrins historia och personhistoria samt konstindustriella museer, utställningar och samlingar klassificeras enligt område @sv

Teatteri- ja näyttämötaiteen teoria, estetiikka ja filosofia
type: Class
type: Concept
subclass of: URN:NBN:fi:au:hklj:770
alternative label: Absurdi teatteri, teatterin filosofia (770.1)
alternative label: Absurdi, teatterin filosofia (770.1)
alternative label: Absurdismi, teatterin filosofia (770.1)
alternative label: Komiikka, teatterin estetiikka (770.1)
alternative label: Näyttämötaide, estetiikka (770.1)
alternative label: Absurd teater, teaterns filosofi (770.1) @sv
alternative label: Absurdism, teaterns filosofi (770.1) @sv
alternative label: Absurditet, teaterns filosofi (770.1) @sv
alternative label: Komik, teaterns estetik (770.1) @sv
alternative label: Scenkonst, estetik (770.1) @sv
broader: URN:NBN:fi:au:hklj:770
in scheme: URN:NBN:fi:au:hklj:
notation: 770.1
preferred label: Theory, aesthetics and philosophy of theatrical and dramatic art @en
preferred label: Teater- och scenkonstens teori, estetik och filosofi @sv
related: Taiteen estetiikka. Taidefilosofia. Taidepsykologia. Taidesosiologia. Taidepolitiikka
related: Teatterimuodot
related: Nukketeatteri
related: Tanssitaide
related: Baletti
related: Jazzbaletti. Moderni tanssi
related: Pantomiimi
related: Elokuva. Elokuvataide
related: Elokuvatekniikka. Videokuvauksen tekniikka
related: URN:NBN:fi:au:hklj:777.9
related: Eurooppa
related: Pohjoismaat. Baltian maat
related: Suomi
related: Länsi- ja Keski-Eurooppa
related: Saksa
related: Ranska
related: Brittein saaret
related: Etelä-Eurooppa
related: Italia
related: Espanja
related: Itä-Eurooppa
related: Venäjä
related: Aasia
related: Afrikka
related: Amerikka
related: Yhdysvallat
related: Australia. Oseania
related: Kirjallisuuden filosofia, teoria ja estetiikka. Runousoppi
scope note: Näyttämö- ja teatteritaiteen yleinen teoria, estetiikka ja filosofia Yleisteokset, jotka koskevat sekä teatteri- tai näyttämötaiteen että elokuvataiteen teoriaa, estetiikkaa tai filosofiaa Yleisteokset, jotka koskevat sekä teatteri- että tanssitaiteen teoriaa, estetiikkaa ja filosofiaa Näyttämö- ja teatteritaiteen erikoisalojen teoria, estetiikka ja filosofia alan mukaisessa luokassa
scope note: Scenkonstens och teaterkonstens allmänna teori, estetik och filosofi Allmänna verk om såväl scenkonstens eller teaterkonstens som filmkonstens teori, estetik eller filosofi Allmänna verk om såväl teaterkonstens som danskonstens teori, estetik och filosofi Teori, estetik och filosofi inom scenkonstens och teaterkonstens specialområden klassificeras enligt område @sv

Eurooppa
type: Class
type: Concept
subclass of: URN:NBN:fi:au:hklj:784
alternative label: Jenkat, kansanmusiikki (784.1 +)
alternative label: Jenka, folkmusik (784.1 +) @sv
broader: URN:NBN:fi:au:hklj:784
in scheme: URN:NBN:fi:au:hklj:
narrower: Pohjoismaat. Baltian maat
narrower: Keski-Eurooppa
narrower: Brittein saaret
narrower: Länsi- ja Lounais-Eurooppa
narrower: Balkanin niemimaa
narrower: Itä-Eurooppa
narrower: Itsenäisten valtioiden yhteisö
notation: 784.1
preferred label: Europe @en
preferred label: Europa @sv
related: URN:NBN:fi:au:hklj:473.1
related: URN:NBN:fi:au:hklj:769
related: URN:NBN:fi:au:hklj:783
related: URN:NBN:fi:au:hklj:783.1
related: URN:NBN:fi:au:hklj:787
related: URN:NBN:fi:au:hklj:787.2
related: URN:NBN:fi:au:hklj:787.29
related: URN:NBN:fi:au:hklj:788.8
related: URN:NBN:fi:au:hklj:789
related: URN:NBN:fi:au:hklj:795.1
related: URN:NBN:fi:au:hklj:797.2
related: URN:NBN:fi:au:hklj:807
scope note: Yleisteokset ja sekasisältöiset kokoelmat
scope note: Allmänna verk och samlingar med blandat innehåll @sv

Afrikka
type: Class
type: Concept
subclass of: URN:NBN:fi:au:hklj:784
alternative label: Afrikka, kansanmusiikki (784.3 +)
alternative label: Taarab, kansanmusiikki (784.3 +)
alternative label: Afrika, folkmusik (784.3 +) @sv
alternative label: Taarab, folkmusik (784.3 +) @sv
broader: URN:NBN:fi:au:hklj:784
in scheme: URN:NBN:fi:au:hklj:
narrower: Pohjois-Afrikka
narrower: Länsi-Afrikka
narrower: Keski-Afrikka
narrower: Itä-Afrikka
narrower: Etelä-Afrikka
narrower: Afrikan saaret
notation: 784.3
preferred label: Africa @en
preferred label: Afrika @sv
related: Kirkolliset juhlat ja juhlapäivät
related: URN:NBN:fi:au:hklj:473.1
related: URN:NBN:fi:au:hklj:769
related: URN:NBN:fi:au:hklj:783
related: URN:NBN:fi:au:hklj:783.1
related: URN:NBN:fi:au:hklj:784.9
related: URN:NBN:fi:au:hklj:787
related: URN:NBN:fi:au:hklj:787.2
related: Islamilaisten uskonnollinen musiikki
related: URN:NBN:fi:au:hklj:787.29
related: URN:NBN:fi:au:hklj:788.8
related: URN:NBN:fi:au:hklj:789
related: URN:NBN:fi:au:hklj:795.1
related: URN:NBN:fi:au:hklj:797.2
related: URN:NBN:fi:au:hklj:807
scope note: Yleisteokset ja sekasisältöiset kokoelmat Tässä ja alaluokissa myös Afrikan alkuperäiskansojen musiikki
scope note: Allmänna verk och samlingar med blandat innehåll Hit och till underklasserna också de afrikanska ursprungsfolkens musik @sv

Islamilaisten uskonnollinen musiikki
type: Class
type: Concept
subclass of: URN:NBN:fi:au:hklj:787.2
alternative label: Islam, uskonnollinen musiikki (787.23)
alternative label: Islamilainen liturginen musiikki (787.23)
alternative label: Islamilainen taide, uskonnollinen musiikki (787.23)
alternative label: Islam, religiös musik (787.23) @sv
alternative label: Islamisk konst, religiös musik (787.23) @sv
alternative label: Islamisk liturgisk musik (787.23) @sv
broader: URN:NBN:fi:au:hklj:787.2
in scheme: URN:NBN:fi:au:hklj:
notation: 787.23
preferred label: Islamic religious music @en
preferred label: Islamisk religiös musik @sv
related: URN:NBN:fi:au:hklj:280
related: URN:NBN:fi:au:hklj:783
related: URN:NBN:fi:au:hklj:783.1
related: URN:NBN:fi:au:hklj:783.5
related: URN:NBN:fi:au:hklj:783.59
related: URN:NBN:fi:au:hklj:783.6
related: URN:NBN:fi:au:hklj:784
related: Aasia
related: Etu-Aasia
related: Etelä-Aasia
related: Kaakkois-Aasia
related: Keski- ja Itä-Aasia
related: Itsenäisten valtioiden yhteisön Aasian puoleiset alueet
related: Kaukasuksen maat
related: Korea
related: Kiina
related: Japani
related: Afrikka
related: Pohjois-Afrikka
related: Länsi-Afrikka
related: Keski-Afrikka
related: Itä-Afrikka
related: Etelä-Afrikka
related: Afrikan saaret
related: URN:NBN:fi:au:hklj:784.9
related: URN:NBN:fi:au:hklj:789
related: Varhaiskansojen musiikki

Eurooppa
type: Class
type: Concept
subclass of: URN:NBN:fi:au:hklj:789
broader: URN:NBN:fi:au:hklj:789
in scheme: URN:NBN:fi:au:hklj:
narrower: Pohjoismaat. Baltian maat
narrower: Keski-Eurooppa
narrower: Brittein saaret
narrower: Länsi- ja Lounais-Eurooppa
narrower: Balkanin niemimaa
narrower: Itä-Eurooppa
narrower: Itsenäisten valtioiden yhteisö
notation: 789.2
preferred label: Europe @en
preferred label: Europa @sv
related: URN:NBN:fi:au:hklj:709
related: URN:NBN:fi:au:hklj:782.4
related: URN:NBN:fi:au:hklj:783
related: URN:NBN:fi:au:hklj:789.1
related: Varhaiskansojen musiikki
related: Keskiajan musiikki
related: Renessanssimusiikki
related: Barokkimusiikki
related: Klassismin musiikki
related: Romantiikan musiikki
related: 1900-luvun musiikki. 2000-luvun musiikki
scope note: Euroopan musiikin historian yleiset ja sekasisältöiset teokset Jos teos koskee Euroopan musiikin historiaa tyylikausittain tai jotakin tiettyä tyylikautta, on etusija luokalla 789.1+
scope note: Verk med allmänt och blandat innehåll som handlar om den europeiska musikens historia Om verket handlar om den europeiska musikens historia ur stilperiodens synvinkel eller en bestämd stilperiod, ges företräde åt klass 789.1+ @sv

MUIDEN KIELTEN KIRJALLISUUDEN HISTORIA JA TUTKIMUS
type: Class
type: Concept
subclass of: URN:NBN:fi:au:hklj:800
alternative label: Biografiat, kirjailijat (810 ... 849)
alternative label: Edelläkävijät, kirjailijat (810 ... 849)
alternative label: Elämäkerrat, kirjailijat (810 ... 849)
alternative label: Elämänhistoria, henkilöhistoria, kirjailijat (810 ... 849)
alternative label: Esikoiskirjailijat, elämäkerrat ja muistelmat (810 ... 849)
alternative label: Esikoisteokset, elämäkerrat ja muistelmat (810 ... 849)
alternative label: Haamukirjoittajat, kirjailijoiden henkilöhistoria (810 ... 849)
alternative label: Haastattelut, henkilöhistoria, kirjailijat (810 ... 849)
alternative label: Henkilöhistoria, kirjailijat (810 ... 849)
alternative label: Henkilökuvat, kirjailijat (810 ... 849)
alternative label: Henkilöt, kirjailijat (810 ... 849)
alternative label: Historia, henkilöhistoria, kirjailijat (810 ... 849)
alternative label: Julkisuuden henkilöt, kirjailijat (810 ... 849)
alternative label: Kansalliset suurmiehet, kirjailijat (810 ... 849)
alternative label: Kirjailijaryhmät (810 ... 849)
alternative label: Kirjailijat, elämäkerrat ja muistelmat (810 ... 849)
alternative label: Kirjallisuuspiirit, kirjailijaryhmät (810 ... 849)
alternative label: Kirjeet, kirjailijat (810 ... 849)
alternative label: Kirjoittajapiirit, kirjailijaryhmät, historia (810 ... 849)
alternative label: Kirjoittamaan oppiminen, kirjailijaryhmät, historia (810 ... 849)
alternative label: Kolumnistit, kirjailijat, elämäkerrat ja muistelmat (810 ... 849)
alternative label: Kääntäjät, elämäkerrat ja muistelmat (810 ... 849)
alternative label: Lapsuus, kirjailijat (810 ... 849)
alternative label: Lastenkirjailijat, elämäkerrat ja muistelmat (810 ... 849)
alternative label: Lukupiirit, kirjailijaryhmät (810 ... 849)
alternative label: Lyyrikot, elämäkerrat ja muistelmat (810 ... 849)
alternative label: Maahanmuuttajat, henkilöhistoria, kirjailijat (810 ... 849)
alternative label: Maanpako, henkilöhistoria, kirjailijat (810 ... 849)
alternative label: Merkkihenkilöt, kirjailijat (810 ... 849)
alternative label: Mielipidevangit, kirjailijat, elämäkerrat ja muistelmat (810 ... 849)
alternative label: Muistelmat, kirjailijat (810 ... 849)
alternative label: Muistokirjoitukset, kirjailijat (810 ... 849)
alternative label: Nekrologit, kirjailijat (810 ... 849)
alternative label: Nuortenkirjailijat, elämäkerrat ja muistelmat (810 ... 849)
alternative label: Näytelmäkirjailijat, elämäkerrat ja muistelmat (810 ... 849)
alternative label: Omaelämäkerrat, kirjailijat (810 ... 849)
alternative label: Pakinoitsijat, kirjailijat, elämäkerrat ja muistelmat (810 ... 849)
alternative label: Pakolaiset, henkilöhistoria, kirjailijat (810 ... 849)
alternative label: Professorit, kirjailijat (810 ... 849)
alternative label: Päiväkirjat, kirjailijat (810 ... 849)
alternative label: Rakkauskirjeet, kirjailijat (810 ... 849)
alternative label: Siirtolaiset, henkilöhistoria, kirjailijat (810 ... 849)
alternative label: Suurmiehet, kirjailijat (810 ... 849)
alternative label: Taiteilijaelämäkerrat, kirjailijat (810 ... 849)
alternative label: Taiteilijat, kirjailijat (810 ... 849)
alternative label: Uranuurtajat, kirjailijat (810 ... 849)
alternative label: Vaihtoehtohistoria, henkilöhistoria, kirjailijat (810 ... 849)
alternative label: Vaihtoehtoinen historia, henkilöhistoria, kirjailijat (810 ... 849)
alternative label: Alternativ historia, personhistoria, författare (810 ... 849) @sv
alternative label: Barnboksförfattare, biografier och memoarer (810 ... 849) @sv
alternative label: Barndom, författare (810 ... 849) @sv
alternative label: Bemärkta personer, författare (810 ... 849) @sv
alternative label: Biografier, författare (810 ... 849) @sv
alternative label: Bokcirklar, författargrupper (810 ... 849) @sv
alternative label: Brev, författare (810 ... 849) @sv
alternative label: Dagböcker, författare (810 ... 849) @sv
broader: URN:NBN:fi:au:hklj:800
in scheme: URN:NBN:fi:au:hklj:
narrower: Kelttiläisten kielten kirjallisuuden historia ja tutkimus
narrower: Kreikankielisen kirjallisuuden historia ja tutkimus
narrower: Latinankielisen kirjallisuuden historia ja tutkimus
narrower: Turkkilaisten kielten kirjallisuuden historia ja tutkimus
narrower: Seemiläisten kielten kirjallisuuden historia ja tutkimus
narrower: Indoiraanisten kielten kirjallisuuden historia ja tutkimus
narrower: Kiinankielisen kirjallisuuden historia ja tutkimus
narrower: Japaninkielisen kirjallisuuden historia ja tutkimus
narrower: Muiden kielten kirjallisuuden historia ja tutkimus
notation: 840
related: Symbolit. Koodit. Merkkijärjestelmät
related: Kirjallisuuden aihepiirejä ja kirjallisuustyyppejä koskeva historia ja tutkimus
related: Lasten- ja nuortenkirjallisuuden historia ja tutkimus
related: URN:NBN:fi:au:hklj:807
related: Yleinen kirjallisuudenhistoria
related: Vanha aika
related: Keskiaika
related: Uusi aika
related: Nykyaika

Sukuhistoria. Sukututkimus
type: Class
type: Concept
subclass of: HENKILÖ- JA SUKUHISTORIA
alternative label: Aateli, historia, sukututkimus (999 +)
alternative label: Aatelisarvot, aateli, historia, sukututkimus (999 +)
alternative label: Aateliset, historia, sukututkimus (999 +)
alternative label: Aatelisto, historia, sukututkimus (999 +)
alternative label: Esivanhemmat, sukututkimus (999 +)
alternative label: Genealogia (999 +)
alternative label: Historia, sukuhistoria (999 +)
alternative label: Jälkeläiset, sukututkimus (999 +)
alternative label: Ritaristo, sukututkimus, sukuhistoria (999 +)
alternative label: Ritarit, sukututkimus, sukuhistoria (999 +)
alternative label: Sukuhistoriat (999)
alternative label: Sukukirjat (999)
alternative label: Sukunimet, sukuhistoriat (999)
alternative label: Sukuseurat (999)
alternative label: Sukutaulut (999)
alternative label: Sukututkimus, sukukirjat (999)
alternative label: Suvut, sukuhistoria (999)
alternative label: Syntyperä, sukututkimus (999 +)
alternative label: Vaihtoehtohistoria, sukuhistoria (999 +)
alternative label: Vaihtoehtoinen historia, sukuhistoria (999 +)
alternative label: Adel, historia, släktforskning (999 +) @sv
alternative label: Adelstitlar, adel, historia, släktforskning (999 +) @sv
alternative label: Alternativ historia, släkthistoria (999 +) @sv
alternative label: Avkomlingar, släktforskning (999 +) @sv
alternative label: Förfäder, släktforskning (999 +) @sv
alternative label: Genealogi (999 +) @sv
alternative label: Historia, släkthistoria (999 +) @sv
alternative label: Härkomst, släktforskning (999 +) @sv
alternative label: Riddare, släktforskning, släkthistoria (999 +) @sv
alternative label: Riddersdkap, släktforskning, släkthistoria (999 +) @sv
alternative label: Släktböcker (999) @sv
alternative label: Släkter, släkthistoria (999) @sv
alternative label: Släktforskning, släktböcker (999) @sv
alternative label: Släktföreningar (999) @sv
alternative label: Släkthistoria (999) @sv
alternative label: Släktnamn, släkthistoria (999) @sv
alternative label: Släkttavlor (999) @sv
broader: HENKILÖ- JA SUKUHISTORIA
in scheme: URN:NBN:fi:au:hklj:
narrower: Sukututkimuksen historia ja menetelmät
notation: 999
preferred label: Family history. Family research @en
preferred label: Släkthistoria. Släktforskning @sv
related: Pelastusoppi. Kristillinen antropologia
related: URN:NBN:fi:au:hklj:323
related: Poliittiset ja aatteelliset vähemmistöt
related: URN:NBN:fi:au:hklj:617
related: URN:NBN:fi:au:hklj:618.24
related: URN:NBN:fi:au:hklj:618.3
related: URN:NBN:fi:au:hklj:909
related: Historian aputieteet
related: URN:NBN:fi:au:hklj:919
related: Elämäkerralliset hakuteokset
related: Suomi
related: Suomen yleiset elämäkerralliset hakuteokset
related: Filosofit. Psykologit. Kasvatustieteiden edustajat
related: URN:NBN:fi:au:hklj:992
related: Yhteiskuntaelämän, joukkotiedotuksen, liikenteen ja maanpuolustuksen edustajat
related: Maantieteilijät. Tutkimusmatkailijat. Löytöretkeilijät.Kansatieteilijät. Antropologit
related: Luonnontieteilijät. Matemaatikot
related: Lääketieteen, tuotantoelämän, tekniikan, kaupan ja talous-elämän edustajat
related: Humanististen tieteiden edustajat
scope note: Genealogia yleensä Teokset, jotka koskevat sekä sukuhistoriaa että sukutukimusta Maasta tai aikakaudesta riippumatta yksittäisten sukujen historiat ja sukutaulut Hallitsijoita, kuninkaallisia tai kuningashuoneita koskevat sukuhistorialliset teokset ko. maan historian luokassa
scope note: Genealogi i allmänhet Verk som handlar om både släkthistoria och släktforskning Enskilda släkters historia och antavlor oavsett land eller tidsperiod Verk som rör regenters, kungligheters eller kungahusens släkthistoria förs till klassen för landets historia @sv

Kustantajien ja kirjakauppojen luettelot
type: Class
type: Concept
subclass of: URN:NBN:fi:au:hklj:010
alternative label: Antikvariaatit, kirjaluettelot (013 +)
alternative label: Bibliografiat, kirjakauppojen luettelot (013 +)
alternative label: Bibliografiat, kustantajien luettelot (013 +)
alternative label: Bibliografiset tietokannat, kirjakauppojen luettelot (013 +)
alternative label: Bibliografiset tietokannat, kustantajien luettelot (013 +)
alternative label: Julkaisuluettelot, kustantajat ja kirjakaupat (013 +)
alternative label: Julkaisuvarastoluettelot (013 +)
alternative label: Kaunokirjallisuusluettelot, kirjakauppojen luettelot (013 +)
alternative label: Kaunokirjallisuusluettelot, kustantajien luettelot (013 +)
alternative label: Kirjahuutokaupat, kirjaluettelot (013 +)
alternative label: Kirjakaupat, kirjaluettelot (013 +)
alternative label: Kirjakerhot, kirjaluettelot (013 +)
alternative label: Kirjaluettelot, kirjakauppojen luettelot (013 +)
alternative label: Kirjaluettelot, kustantajien luettelot (013 +)
alternative label: Kustantajien luettelot, kirjat (013 +)
alternative label: Tuoteluettelot, kirjakaupat, kustantajat (013 +)
alternative label: Valikoimaluettelot, kirjakauppojen luettelot (013 +)
alternative label: Valikoimaluettelot, kustantajien luettelot (013 +)
alternative label: Varastoluettelot, kirjakaupat (013 +)
alternative label: Varastoluettelot, kustantajat (013 +)
alternative label: Yhteisluettelot, kirjakauppojen (013 +)
alternative label: Yhteisluettelot, kustantajien (013 +)
alternative label: Antikvariat, bokförteckningar (013 +) @sv
alternative label: Bibliografier, bokaffärers kataloger (013 +) @sv
alternative label: Bibliografier, förlagskataloger (013 +) @sv
alternative label: Bibliografiska databaser, bokaffärers kataloger (013 +) @sv
alternative label: Bibliografiska databaser, förlagskataloger (013 +) @sv
alternative label: Bokauktioner, bokförteckningar (013 +) @sv
alternative label: Bokhandlar, bokförteckningar (013 +) @sv
alternative label: Bokkataloger, bokaffärers kataloger (013 +) @sv
alternative label: Bokkataloger, förlagskataloger (013 +) @sv
alternative label: Bokklubbar, bokförteckningar (013 +) @sv
alternative label: Förlagskataloger, böcker (013 +) @sv
alternative label: Lagerkataloger, bokhandlar (013 +) @sv
alternative label: Lagerkataloger, förläggare (013 +) @sv
alternative label: Produktkataloger, bokhandlare, förläggare (013 +) @sv
alternative label: Publikationskataloger, förläggare och bokhandlar (013 +) @sv
alternative label: Publikationslagerkataloger (013 +) @sv
alternative label: Samkataloger, bokaffärers (013 +) @sv
alternative label: Samkataloger, förlagens (013 +) @sv
alternative label: Skönlitteraturkataloger, bokaffärers kataloger (013 +) @sv
alternative label: Skönlitteraturkataloger, förlagskataloger (013 +) @sv
alternative label: Urvalskataloger, bokaffärers kataloger (013 +) @sv
broader: URN:NBN:fi:au:hklj:010
in scheme: URN:NBN:fi:au:hklj:
narrower: Suomi
notation: 013
related: Kustannustoimi. Kirjakauppa
related: Yleisbibliografiat. Kansallisbibliografiat
related: Erikoisalojen bibliografiat
related: Filosofia. Psykologia. Kasvatustiede
related: Uskonto
related: Yhteiskunta
related: Maantiede. Matkat. Kansatiede
related: Luonnontieteet. Matematiikka
related: Lääketiede. Tekniikka. Teollisuus. Maa- ja metsätalous. Liiketalous. Kotitalous. Käsityö
related: Taiteet. Liikunta
related: Kirjallisuustiede. Kielitiede
related: Historia
related: Sanakirjat. Hakuteokset
related: Esseet. Taidearvostelut
related: Kausijulkaisut
related: Yhdistykset. Laitokset. Kokoukset
related: Taideopinnot
related: Kokoomateokset
related: URN:NBN:fi:au:hklj:708.603
related: URN:NBN:fi:au:hklj:709
related: URN:NBN:fi:au:hklj:710
related: URN:NBN:fi:au:hklj:720
related: KUVANVEISTOTAIDE
related: MAALAUSTAIDE. PIIRUSTUSTAIDE
related: GRAAFINEN TAIDE. VALOKUVAUS
related: URN:NBN:fi:au:hklj:760
related: URN:NBN:fi:au:hklj:770
related: Musiikkibibliografiat. Diskografiat
scope note: Kustantajien ja kirjakauppojen yleisluettelot luettelon ja sen kohteiden aineistotyypistä riippumatta Kustantajien ja kirjakauppojen yleiset julkaisu-, varasto- ja valikoimaluettelot Kirjakauppojen, kirjahuutokauppojen, antikvariaattien, kirjanäyttelyiden ja kirjamessujen yleiset luettelot Laitosten ja seurojen yleiset julkaisu- ja julkaisuvarastoluettelot Kustantajien ja kirjakauppojen aikakausjulkaisujen, sanomalehtien, mikrofilmien ja -korttien luettelot samassa luokassa kuin vastaavat kirjaluettelot
scope note: Allmänna förlags- och bokhandelskataloger oavsett vilken mediatyp katalogen och dess objekt utgör Förlagens- och bokhandlarnas allmänna publikations-, lager- och urvalskataloger Allmänna bokhandelskataloger, kataloger över bokauktioner, antikvariat, bokutställningar och bokmässor Allmänna kataloger över institutioners och sällskaps publikationer och publikationslager Förlags och bokhandelskataloger över seriella publikationer, tidningar, mikrofilmer och mikrokort förs till samma klass som motsvarande litteraturförteckningar @sv

KASVATUS. OPETUS. KASVATUSTIEDE
type: Class
type: Concept
subclass of: URN:NBN:fi:au:hklj:100
alternative label: Aineenopettajat, opettajanvalmistus (180)
alternative label: Ammatillinen opettajankoulutus (180)
alternative label: Auskultointi, opettajat (180)
alternative label: Elämänhallinta, opiskelu, koulutus (180 ... 185 +)
alternative label: Erikoistumisopinnot (180)
alternative label: Erikoistumisopinnot, opiskelu (180)
alternative label: Henkilöarviointi, opiskelu (180 ... 185 +)
alternative label: Henkinen pääoma, kasvatuspolitiikka (180)
alternative label: Henkinen pääoma, opetuspolitiikka (180)
alternative label: Heterogeenisuus, opiskelijat, koulutus (180 ... 185 +)
alternative label: Homogeenisuus, opiskelijat, koulutus (180 ... 185 +)
alternative label: Hyväksi lukeminen, opinnot (180)
alternative label: Hyväksilukeminen, opinnot (180)
alternative label: Inhimillinen pääoma, kasvatuspolitiikka (180)
alternative label: Inhimillinen pääoma, opetuspolitiikka (180)
alternative label: Inkluusio, koulutus, koulutuspolitiikka (180)
alternative label: Itsesäätely, opiskelu (180 ... 185 +)
alternative label: Kansainvälinen liikkuvuus, opiskelu ulkomailla (180)
alternative label: Kansainväliset tutkinnot (180)
alternative label: Kansalaiskasvatus, kasvatuspolitiikka (180)
alternative label: Kasvatus, kasvatustiede (180)
alternative label: Kasvatusala (180 +)
alternative label: Kasvatusala, kasvatustiede (180)
alternative label: Kasvatusjärjestelmät (180)
alternative label: Kasvatusoppi (180)
alternative label: Kasvatuspolitiikka (180)
alternative label: Kasvatustiede (180)
alternative label: Kehittäminen, koulutus (180 ... 185 +)
alternative label: Kielikasvatus, kasvatus, opetus, kasvatustiede (180)
alternative label: Kieltenopettajat, opettajanvalmistus (180)
alternative label: Know-how, koulutuspolitiikka (180)
alternative label: Korkotuki, opintolainat (180)
alternative label: Kouluttautuminen, koulutus (180)
alternative label: Kouluttautuminen, koulutuspolitiikka (180)
alternative label: Koulutus (180)
alternative label: Koulutus, koulutuspolitiikka (180)
alternative label: Koulutusalat (180)
alternative label: Koulutusalat, koulutuspolitiikka (180)
alternative label: Koulutusasteet (180)
alternative label: Koulutusjärjestelmät (180)
alternative label: Koulutusjärjestelmät, koulutuspolitiikka (180)
alternative label: Koulutusmahdollisuudet (180)
alternative label: Koulutusmahdollisuudet, koulutuspolitiikka (180)
alternative label: Koulutuspolitiikka (180)
alternative label: Koulutussuunnittelu (180)
alternative label: Koulutussuunnittelu, koulutuspolitiikka (180)
alternative label: Koulutustarjonta (180)
alternative label: Koulutustarjonta, koulutuspolitiikka (180)
alternative label: Koulutustarve (180)
alternative label: Koulutustarve, koulutuspolitiikka (180)
alternative label: Koulutustaso (180)
alternative label: Koulutustaso, koulutuspolitiikka (180)
broader: URN:NBN:fi:au:hklj:100
in scheme: URN:NBN:fi:au:hklj:
narrower: Kasvatusfilosofia. Kasvatustavoitteet
narrower: Kasvatuspsykologia
narrower: Käytännön kasvatus
narrower: URN:NBN:fi:au:hklj:182
narrower: URN:NBN:fi:au:hklj:183
narrower: URN:NBN:fi:au:hklj:184
narrower: URN:NBN:fi:au:hklj:185
narrower: Ammatinvalinta
narrower: Itsekasvatus. Itseopiskelu
narrower: Kasvatuksen ja kasvatustieteen historia
notation: 180
related: URN:NBN:fi:au:hklj:061
related: URN:NBN:fi:au:hklj:063
related: Seurakunta. Seurakuntatyö
related: URN:NBN:fi:au:hklj:320
related: URN:NBN:fi:au:hklj:371
related: Terveydenhoito
related: URN:NBN:fi:au:hklj:613.1
related: Liikenneopetus. Liikenneturvallisuus
related: Oppikirjat. Harjoituskirjat. Tehtäväkokoelmat. Taiteen materiaalit ja tekniikka. Taidekasvatus
related: Liikuntatiede ja -tutkimus. Liikuntapolitiikka
scope note: Kasvatus, kasvatustiede, kasvatusoppi ja pedagogiikka yleensä Kasvatus- ja koulutuspolitiikka sekä kasvatus- ja koulutusjärjestelmät yleensä Opintojen rahoitus ja opintotuki yleensä Tässä myös opettajanvalmistusta koskevat yleisteokset Teokset, jotka koskevat sekä koulu-, yliopisto- ja korkeakoululaitosta että aikuiskasvatusta. Jos teos kuitenkin painottuu johonkin näistä aloista, on etusija alan mukaisella luokalla Erikoisaloihin liittyvä kasvatus luokissa 180.1, 181+ tai alan mukaisessa luokassa
scope note: Fostran och pedagogik i allmänhet Pedagogisk politik och utbildningspolitik samt pedagogiska system och utbildningssystem i allmänhet Finansiering av studier och studiestöd i allmänhet Hit också allmänna verk som rör lärarutbildning Verk som rör såväl skolor, universitet och högskolor som vuxenpedagogik. Om något av de här områdena dominerar i verket ges företräde åt klassen för området Fostran som rör specialområden förs till klasserna 180.1 och 180+ eller klassificeras enligt område @sv

EVANKELIS-LUTERILAINEN KIRKKO
type: Class
type: Concept
subclass of: YLEINEN USKONTOTIEDE. YLEINEN USKONNONFILOSOFIA
alternative label: Arkkipiispat, ev.-lut. kirkko (250)
alternative label: Avustusjärjestöt, ev.-lut. kirkko (250)
alternative label: Avustustoiminta, kirkollinen, ev-lut. (250)
alternative label: Ennakkoäänestys, kirkolliset, ev.-lut. (250)
alternative label: Ennakkoäänestäminen, kirkolliset, ev.-lut. (250)
alternative label: Evankelis-luterilainen kirkko (250 ... 259)
alternative label: Evankelisluterilainen kirkko (250 ... 259)
alternative label: Hengellisyys, ev.-lut. kirkko (250 ... 259)
alternative label: Henkikirjat, kirkonkirjat, ev.-lut. (250)
alternative label: Henkilöapu, kirkollinen, ev.-lut. (250)
alternative label: Henkilörekisterit, kirkonkirjat, ev.-lut. (250)
alternative label: Henkilöverotus, kirkollinen (250)
alternative label: Hiippakunnat, ev.-lut. (250)
alternative label: Hiippakuntahallinto, ev.-lut. (250)
alternative label: Hiippakuntakokoukset, ev.-lut. (250)
alternative label: Humanitaarinen apu, kirkollinen apu, ev.-lut. (250)
alternative label: Hyväntekeväisyys, kirkollinen, ev.-lut. (250)
alternative label: Itsehallinto, kirkollinen, ev.-lut. (250)
alternative label: Julkisyhteisöt, kirkot, ev.-lut. (250 ... 259)
alternative label: Kansankirkko, ev.-lut. kirkko (250 ... 259)
alternative label: Kanttorit, kanttorin työ (250)
alternative label: Kastekirjat, kirkkohallinto, ev.-lut. (250)
alternative label: Katastrofiapu, kirkollinen, ev.-lut. (250)
alternative label: Keruu, kirkon avustustoiminta, ev.-lut. (250)
alternative label: Keräys, kirkon avustustoiminta, ev.-lut. (250)
alternative label: Kirkko, ev.-lut. kirkko (250 ... 259)
alternative label: Kirkkohallinto, ev.-lut. kirkko (250)
alternative label: Kirkkokuri, ev.-lut. kirkko (250)
alternative label: Kirkkomuusikot, ev.-lut. kirkko (250)
alternative label: Kirkkoneuvostot, ev.-lut. kirkko (250)
alternative label: Kirkkopäivät, ev.-lut. kirkko (250)
alternative label: Kirkkorakennukset, käyttö, ev.-lut. (250 ... 259)
alternative label: Kirkkososiologia, ev.-lut. kirkko (250)
alternative label: Kirkkovaltuustot, ev.-lut. kirkko (250)
alternative label: Kirkolliset lehdet (250 ... 269 +)
alternative label: Kirkolliset vaalit, ev.-lut. kirkko (250)
alternative label: Kirkolliskokoukset, ev.-lut. (250)
alternative label: Kirkollisvero, ev.-lut. kirkko (250)
alternative label: Kirkon avustustoiminta, ev.-lut. kirkko (250)
alternative label: Kirkon eläkkeet, ev.-lut. kirkko (250)
alternative label: Kirkon hallinto, ev.-lut. kirkko (250)
alternative label: Kirkon ja valtion suhde, ev.-lut. kirkko (250)
alternative label: Kirkon keskukset, ev.-lut. kirkko (250)
alternative label: Kirkon pakolaisapu, ev.-lut. kirkko (250)
alternative label: Kirkon toimikunnat, ev.-lut. kirkko (250)
alternative label: Kirkon työntekijät, ev.-lut. kirkko (250)
alternative label: Kirkon ulkomaanapu, ev.-lut. kirkko (250)
alternative label: Kirkon virat, ev.-lut. kirkko (250)
alternative label: Kirkonarkistot, ev.-lut. kirkko (250)
alternative label: Kirkonkirjat, ev.-lut. kirkko (250)
alternative label: Kirkossa käynti , ev.-lut. kirkko (250)
broader: YLEINEN USKONTOTIEDE. YLEINEN USKONNONFILOSOFIA
in scheme: URN:NBN:fi:au:hklj:
narrower: Sakramentit. Kirkolliset toimitukset
narrower: Kirkolliset juhlat ja juhlapäivät
narrower: Kirkko-oikeus
narrower: Seurakunta. Seurakuntatyö
narrower: Laitokset. Järjestöt
narrower: Saarnaoppi
narrower: Saarnat. Postillat. Kristilliset puhe- ja päivänavauskokoelmat
narrower: Sisälähetys. Evankelioiminen
narrower: Lähetystyö
notation: 250
related: URN:NBN:fi:au:hklj:210
related: Yhdistykset. Laitokset. Kokoukset. Ekumenia
related: RAAMATTU. RAAMATUNTUTKIMUS
related: KRISTILLINEN DOGMATIIKKA
related: KÄYTÄNNÖLLINEN TEOLOGIA
related: URN:NBN:fi:au:hklj:260
related: Protestanttiset kirkot ja yhteisöt
related: Suomi
related: Valtionverotus. Veropolitiikka
related: Yksityinen avustus- ja huoltotyö
related: Kristillisten kirkkojen musiikki
related: Protestanttinen musiikki
scope note: Tässä ev.-lut. kirkkoa ja sen toimintaa koskevat yleisteokset Tässä ja alaluokissa kirkon organisaatio, hallinto ja talous sekä kirkon suhde valtioon, kulttuuriin ja yhteiskuntaan. Kirkollisverotus Kirkollinen avustustoiminta. Kirkon ulkomaan- ja pakolaisapu Hiippakunnat. Kirkollis-, piispain-, synodaali-, hiippakunta- ja pappeinkokoukset Tässä ja alaluokissa kirkon henkilökunta ja heidän koulutuksensa Kirkolliset virat. Virkateologia. Arkkipiispa. Piispat. Papisto. Naispappeus. Lehtorit. Kirkkomuusikot Jos ev.-lut. kirkkoa koskeva teos painottuu johonkin erikoisalaan, on etusija luokilla 220-248 ja 279.1
scope note: Hit allmänna verk som rör den evangelisk-lutherska kyrkan och dess verksamhet Hit och till underklasserna kyrkans organisation, administration och ekonomi samt kyrkans förhållande till staten, kulturen och samhället. Kyrkoskatt Kyrklig biståndsverksamhet. Kyrkans utlandshjälp och flyktinghjälp Stift. Kyrko-, biskops-, synodal-, stifts- och prästmöten Hit och till underklasserna kyrkans anställda och utbildningen av dem Kyrkliga ämbeten. Ämbetsteologi. Ärkebiskopen. Biskopar. Prästerskap. Kvinnopräster. Lektorer. Kyrkomusiker Om tyngdpunkten i ett verk som rör den evangelisk-lutherska kyrkan ligger på något specialområde, ges företräde åt klasserna 220-248 och 279.1 @sv

Muiden maiden puolustusvoimat
type: Class
type: Concept
subclass of: URN:NBN:fi:au:hklj:390
alternative label: Aliupseerikoulut, muut maat (398)
alternative label: Aliupseerikoulutus, muut maat (398)
alternative label: Aliupseerit, muut armeijat (398)
alternative label: Alokkaat, muiden maiden armeijat (398)
alternative label: Ammattiarmeijat (398 +)
alternative label: Ampumaradat, muiden maiden armeijat (398)
alternative label: Armeija, armeijat, muut maat (398)
alternative label: Armeijat, muut maat (398)
alternative label: Arvomerkit, sotilasarvot (397 ... 398)
alternative label: Aseeton palvelus, muiden maiden armeijat (398)
alternative label: Aseistakieltäytyminen, muiden maiden armeijat (398)
alternative label: Aselajit, muiden maiden armeijat (398)
alternative label: Asepalvelus, muiden maiden armeijat (398)
alternative label: Asevelvolliset, muiden maiden armeijat (398)
alternative label: Asevelvollisuus, muut maat (398)
alternative label: Asevoimat, muut armeijat (398)
alternative label: Divisioonat , muiden maiden armeijat (398)
alternative label: Erikoisjoukot, muiden maiden armeijat (398)
alternative label: Erityisalueet, sotilasalueet, muut maat (398)
alternative label: Henkivartiokaartit, joukko-osastot, muut maat (398)
alternative label: Huoltojoukot, muiden maiden armeijat (398)
alternative label: Huumetestit, puolustusvoimat, muut maat (398)
alternative label: Hälytystila, liikekannallepano, muut maat (398)
alternative label: Hävittäjälentäjät, muiden maiden armeijat (398)
alternative label: Ilmailu, ilmavoimat, muut maat (398)
alternative label: Ilmailu, sotilasilmailu, muut maat (398)
alternative label: Ilmapuolustus, muiden maiden armeijat (398)
alternative label: Ilmatorjunta, muiden maiden armeijat (398)
alternative label: Ilmatorjuntajoukot, muiden maiden armeijat (398)
alternative label: Ilmatorjuntatykistö, muiden maiden armeijat (398)
alternative label: Ilmavalvonta, muiden maiden ilmavoimat (398)
alternative label: Ilmavoimat, muiden maiden armeijat (398)
alternative label: Insinöörijoukot, muiden maiden armeijat (398)
alternative label: Iskujoukot, muiden maiden armeijat (398)
alternative label: Jalkaväki, muiden maiden armeijat (398)
alternative label: Joukko-osastot, muut maat (398)
alternative label: Joukkueet, muut maat (398)
alternative label: Kadettikoulut, muut maat (398)
alternative label: Kasarmit, muut maat (398)
alternative label: Kenttätykistö, muut maat (398)
alternative label: Kertausharjoitukset, muut maat (398)
alternative label: Kevyet joukot, muiden maiden armeijat (398)
alternative label: Kieltäytyminen, aseistakieltäytyminen, muiden maiden armeijat (398)
alternative label: Kodinturvajoukot, muut maat (398)
alternative label: Komentajat , muiden maiden armeijat (398)
alternative label: Kommandojoukot, muiden maiden armeijat (398)
alternative label: Komppaniat, muiden maiden armeijat (398)
alternative label: Kotiutus, sotilaat, muiden maiden armeijat (398)
broader: URN:NBN:fi:au:hklj:390
in scheme: URN:NBN:fi:au:hklj:
notation: 398
related: URN:NBN:fi:au:hklj:320
related: URN:NBN:fi:au:hklj:325
related: Suomen ulkopolitiikka
related: Rauhankysymys. Rauhantutkimus
related: URN:NBN:fi:au:hklj:332.2
related: Muiden maiden lait
related: URN:NBN:fi:au:hklj:340
related: Organisaatioiden ja laitosten sosiologia
related: Ilmaliikenne. Ilmailu
related: Asevarustelu. Asekauppa
related: Sotataito. Strategia. Taktiikka
related: Suomen puolustusvoimat
related: URN:NBN:fi:au:hklj:398.09
related: Sotahistoria
related: Suomi
related: URN:NBN:fi:au:hklj:909
related: Vanhan ajan historia
related: Keskiajan historia 400-1499
related: Uuden ajan historia 1500-1788
related: Uusimman ajan historia 1789-1913
related: Nykyajan historia 1914-1938
related: I maailmansodan historia 1914-1918
related: Nykyajan historia 1939-
related: II maailmansodan historia 1939-1945
scope note: Muiden maiden armeijat, niiden maa-, meri- ja ilmavoimat Muiden maiden armeijoiden yksiköt ja joukko-osastot. Ohjesäännöt Kantahenkilökunta. Asevelvolliset. Reservi. Sotaveteraanit. Jalkaväki. Tykistö. Rannikkotykistö. Panssarijoukot. Ilmatorjuntajoukot. Ilmavoimat. Laskuvarjojoukot. Laivasto. Merijalkaväki. Maihinnousujoukot Asevelvollisuus. Palkka-armeijat, esim. Muukalaislegioona. Naisten asepalvelu. Siviilipalvelu. Aseistakieltäytyminen. Kutsunnat. Liikekannallepano. Kertaus- ja sotaharjoitukset. Vapaaehtoinen maanpuolustustyö Sotilaskoulutus. Varusmieskoulutus. Upseeri-, aliupseeri-, ja reservinupseerikoulut. Kadettikoulut. Sotakorkeakoulut. Asevelvollisten asema. Sotilaskoti- ja viihdytystoiminta Tässä myös itsenäisyys- ja vapautusrintamien sotilaalliset yksiköt
scope note: Andra länders arméer, deras land-, sjö- och luftstridskrafter Enheter och truppförband inom andra länders arméer Fältreglementen. Stampersonal. Värnpliktiga. Reserven. Krigsveteraner Infanteri. Artilleri. Kustartilleri. Pansartrupper. Luftvärnstrupper. Luftstridskrafterna. Fallskärmstrupper. Flottan. Marininfanteri. Landstigningstrupper Värnplikt. Yrkesarméer, t.ex. Främlingslegionen. Kvinnlig militärtjänst. Civiltjänst. Vapenvägran. Mönstringar. Mobilisering. Repetitionsövningar och manövrar. Frivilligt försvarsarbete Militärutbildning. Utbildning av värnpliktiga. Officers-, underofficers- och reservofficersskolor. Kadettskolor. Försvarshögskolor. De värnpliktigas ställning. Mobbning och pennalism. Soldathem och underhållning Hit också militära enheter inom självständighets- och befrielsefronter @sv

Tartuntataudit
type: Class
type: Concept
subclass of: URN:NBN:fi:au:hklj:617
alternative label: A(H1N1)-virus (617.5)
alternative label: A(H5N1)-virus (617.5)
alternative label: AIDS (617.5)
alternative label: Acquired Immune Deficiency Syndrome (617.5)
alternative label: Bakteerisolut, sairaalabakteerit (617.5)
alternative label: Bakteerisolut, tartuntataudit (617.5)
alternative label: Bakteerit, sairaalabakteerit (617.5)
alternative label: Bakteerit, tartuntataudit (617.5)
alternative label: Bakteeritaudit (617.5)
alternative label: Basillit, tartuntataudit (617.5)
alternative label: Borrelioosi (617.5)
alternative label: Endofyytit, tartuntataudit (617.5)
alternative label: Epidemiat (617.5)
alternative label: Epidemiologia, tartuntataudit (617.5)
alternative label: Flavivirusinfektiot, tartuntataudit (617.5)
alternative label: Flunssa (617.5)
alternative label: H1N1-virus (617.5)
alternative label: H5N1-virus (617.5)
alternative label: HIV-tartunta (617.5)
alternative label: Haima, haimatulehdus (617.5)
alternative label: Haimasairaudet, haimatulehdus (617.5)
alternative label: Haimataudit, haimatulehdus (617.5)
alternative label: Haimatulehdus (617.5)
alternative label: Hasardit, tartuntataudit (617.5)
alternative label: Hengityselinten taudit, influenssa (617.5)
alternative label: Hepatiitti B -virus, virustaudit, ihmisen (617.5)
alternative label: Herpesvirukset, virustaudit, ihmisen (617.5)
alternative label: Hinkuyskä (617.5)
alternative label: Ihmisen bokavirus, tartuntataudit (617.5)
alternative label: Ihmisen parechovirus, tartuntataudit (617.5)
alternative label: Immuunikato, AIDS (617.5)
alternative label: Infektiot (617.5)
alternative label: Infektiotaudit (617.5)
alternative label: Inflammaatio (617.5)
alternative label: Influenssa (617.5)
alternative label: Influenssa A -virus (617.5)
alternative label: Influenssa A(H1N1)-virus (617.5)
alternative label: Isorokko (617.5)
alternative label: Japanin aivotulehdus, tartuntataudit (617.5)
alternative label: Jäljitys, tartuntataudit (617.5)
alternative label: Karanteeni, lääketiede (617.5)
alternative label: Kliininen mykologia (617.5)
broader: URN:NBN:fi:au:hklj:617
in scheme: URN:NBN:fi:au:hklj:
notation: 617.5
related: URN:NBN:fi:au:hklj:181.9
related: URN:NBN:fi:au:hklj:332.22
related: URN:NBN:fi:au:hklj:371.6
related: URN:NBN:fi:au:hklj:373
related: URN:NBN:fi:au:hklj:576
related: Lääkärikirjat. Ensiapuoppaat
related: Anatomia
related: URN:NBN:fi:au:hklj:612
related: URN:NBN:fi:au:hklj:613.1
related: URN:NBN:fi:au:hklj:613.3
related: URN:NBN:fi:au:hklj:613.31
related: URN:NBN:fi:au:hklj:613.5
related: Seksologia
related: URN:NBN:fi:au:hklj:615
related: URN:NBN:fi:au:hklj:615.1
related: URN:NBN:fi:au:hklj:615.3
related: Seerumihoito. Rokotukset. Verensiirto
related: URN:NBN:fi:au:hklj:615.8
related: URN:NBN:fi:au:hklj:616
related: URN:NBN:fi:au:hklj:616.2
related: URN:NBN:fi:au:hklj:616.3
related: Immunologia. Serologia. Verioppi
related: URN:NBN:fi:au:hklj:617.1
related: URN:NBN:fi:au:hklj:617.4
related: Iho. Ihotaudit. Sukupuolielimet. Sukupuolitaudit
related: URN:NBN:fi:au:hklj:617.7
related: Hengityselimet. Hengityselinten taudit
related: Eläinlääketiede
related: URN:NBN:fi:au:hklj:691.1
related: URN:NBN:fi:au:hklj:691.12
scope note: Tartunta- ja tulehdustaudit, niiden ennaltaehkäisy, diagnostiikka, hoito ja patologia yleensä Tartunta- ja kulkutaudit yleensä. Epidemiat. Epidemiologia Virus- ja bakteeritaudit yleensä Tulehdussairaudet yleensä. Trooppiset tartuntataudit yleensä AIDS. Hinkuyskä. HIV-tartunta. Influenssat. Kolera. Kurkkumätä. Lavantaudit. Malaria. Polio. Punatauti. Rokot. Rutot. Sikotauti. Unitauti. Verenmyrkytys Sairaalabakteerit ja niiden aiheuttamat sairaudet ja tulehdukset Tiettyyn elimeen liittyvä tulehdus ko. elimen luokassa 617+
scope note: Smittsamma sjukdomar och infektionssjukdomar, förebyggande och behandling av dem samt deras diagnostik och patologi i allmänhet Smittsamma sjukdomar och farsoter. Epidemier. Epidemiologi Virus- och bakteriesjukdomar i allmänhet Infektionssjukdomar i allmänhet. Smittsamma tropiska sjukdomar Aids. Blodförgiftning. Difteri. HIV-smitta. Influensa. Kikhosta. Kolera. Koppor. Malaria. Pest. Polio. Påssjuka. Rödsot. Sömnsjuka. Tyfus Sjukhusbakterier och sjukdomar och inflammationer som de förorsakar Inflammationer i ett enskilt organ förs till organets klass 617+ @sv

Kaksisuuntainen mielialahäiriö
type: Class
type: Concept
subclass of: Psyykkiset sairaudet. Mielenterveyden häiriöt
alternative label: Bipolaarinen häiriö (618.62)
alternative label: Bipolaariset psykoosit (618.62)
alternative label: Depressio, kaksisuuntainen mielialahäiriö (618.62)
alternative label: Kaksisuuntainen mielialahäiriö (618.62)
alternative label: Maanisdepressiivinen mielisairaus (618.62)
alternative label: Maanisdepressiiviset psykoosit (618.62)
alternative label: Maanisdepressiivisyys (618.62)
alternative label: Masennus, kaksisuuntainen mielilahäiriö (618.62)
alternative label: Bipolär sjukdom (618.62) @sv
alternative label: Bipolär störning (618.62) @sv
alternative label: Bipolära psykoser (618.62) @sv
alternative label: Depression, bipolär sjukdom (618.62) @sv
alternative label: Manisk-depressiv sjukdom (618.62) @sv
alternative label: Manodepressiva psykoser (618.62) @sv
alternative label: Manodepressivitet (618.62) @sv
alternative label: Nedslagenhet, bipolär sjukdom (618.62) @sv
broader: Psyykkiset sairaudet. Mielenterveyden häiriöt
in scheme: URN:NBN:fi:au:hklj:
notation: 618.62
preferred label: Bipolar disorder @en
preferred label: Bipolär sjukdom @sv
related: URN:NBN:fi:au:hklj:120
related: Havaintopsykologia
related: Perinnöllisyyspsykologia
related: Kehityspsykologia. Eri ikäkausien psykologia
related: URN:NBN:fi:au:hklj:181.9
related: URN:NBN:fi:au:hklj:332.22
related: URN:NBN:fi:au:hklj:371.6
related: URN:NBN:fi:au:hklj:373
related: URN:NBN:fi:au:hklj:576
related: URN:NBN:fi:au:hklj:613.3
related: URN:NBN:fi:au:hklj:613.31
related: URN:NBN:fi:au:hklj:613.5
related: URN:NBN:fi:au:hklj:615
related: URN:NBN:fi:au:hklj:615.1
related: URN:NBN:fi:au:hklj:615.3
related: URN:NBN:fi:au:hklj:615.8
related: URN:NBN:fi:au:hklj:616
related: URN:NBN:fi:au:hklj:616.2
related: URN:NBN:fi:au:hklj:616.3
related: URN:NBN:fi:au:hklj:617
related: URN:NBN:fi:au:hklj:617.1
related: URN:NBN:fi:au:hklj:617.2
related: URN:NBN:fi:au:hklj:617.4
related: URN:NBN:fi:au:hklj:617.99
related: URN:NBN:fi:au:hklj:618.2
related: URN:NBN:fi:au:hklj:618.8
related: Analyyttinen psykoterapia
related: URN:NBN:fi:au:hklj:618.85
related: URN:NBN:fi:au:hklj:618.86
related: Mielisairaanhoito
scope note: Kaksisuuntaisen mielialahäiriön ennaltaehkäisy, diagnostiikka, hoito ja psykopatologia Kaksisuuntaisen mielialahäiriön syyt Kaksisuuntaisen mielialahäiriön lääke- ja terapiahoito
scope note: Bipolär sjukdom, förebyggande och behandling av den samt dess diagnostik och psykopatologi Orsaker till bipolär sjukdom Läkemedelsbehandling och terapeutisk behandling av bipolär sjukdom @sv

Raideliikenneväylät. Junat. Raitiovaunut. Metro
type: Class
type: Concept
subclass of: URN:NBN:fi:au:hklj:624
alternative label: Dieselveturit (624.4)
alternative label: Funikulaarit, rautatiet (624.4)
alternative label: Geotekniikka, rautatienrakennus (624.4)
alternative label: Hammasradat, rautatiet (624.4)
alternative label: Henkilöjunat (624.4)
alternative label: Henkilövaunut, junat (624.4)
alternative label: Huolto, junat (624.4)
alternative label: Höyryveturit (624.4)
alternative label: Junakalusto (624.4)
alternative label: Junanvaunut (624.4)
alternative label: Junat, kulkuvälineet (624.4)
alternative label: Junavaunut (624.4)
alternative label: Liikennealueet, rakentaminen, asema-alueet, rautatieasemat (624.4)
alternative label: Liikennealueet, rakentaminen, rautatiet (624.4)
alternative label: Lämmittäjät, höyryveturit (624.4)
alternative label: Maanrakennus, rautatienrakennus (624.4)
alternative label: Maarakennus, rautatienrakennus (624.4)
alternative label: Maatyöt, rautatienrakennus (624.4)
alternative label: Makuuvaunut (624.4)
alternative label: Matkustajajunat (624.4)
alternative label: Metro, tekniikka (624.4)
alternative label: Metroasemat, tekniikka (624.4)
alternative label: Metrojunat (624.4)
alternative label: Metrotunnelit (624.4)
alternative label: Museojunat, kulkuvälineet (624.4)
alternative label: Museorautatiet, rautatiet, rakentaminen (624.4)
alternative label: Museoveturit, kulkuvälineet (624.4)
alternative label: Pikaraitiotiet (624.4)
alternative label: Radanrakennus (624.4)
alternative label: Raiteet, rakentaminen (624.4)
alternative label: Raitiotiet (624.4)
alternative label: Raitiovaunut (624.4)
alternative label: Rakennustekniikka, rautatienrakennus (624.4)
alternative label: Ratapihat (624.4)
alternative label: Rataverkko, rakentaminen (624.4)
alternative label: Rautatiealueet, rautatienrakennus (624.4)
alternative label: Rautatieasemat, rautatienrakennus (624.4)
alternative label: Rautatiekalusto (624.4)
alternative label: Rautatienrakennus (624.4)
alternative label: Rautatiet, rakentaminen (624.4)
alternative label: Rautatievaunut (624.4)
alternative label: Resiinat (624.4)
alternative label: Risteykset, tien- ja kadunrakennus (624.4)
broader: URN:NBN:fi:au:hklj:624
in scheme: URN:NBN:fi:au:hklj:
notation: 624.4
related: URN:NBN:fi:au:hklj:380
related: Maaliikenne
related: URN:NBN:fi:au:hklj:460
related: URN:NBN:fi:au:hklj:620.88
related: Yleinen konetekniikka
related: Koneenrakennus. Pneumatiikka. Hydrauliikka
related: Voimakoneet. Moottorit. Nosto- ja kuljetuslaitteet
related: Tiet. Kadut. Tienrakennus. Kadunrakennus
related: Sillat. Sillanrakennus
related: URN:NBN:fi:au:hklj:624.409
related: Sähkötekniikka
related: Sähköenergian muuttaminen, muuntaminen, jakelu ja siirto
related: URN:NBN:fi:au:hklj:631
related: URN:NBN:fi:au:hklj:660
related: Rakennusstatiikka. Rakennusaineet
related: Tekninen rakennussuunnittelu
related: Geotekniikka. Maatyöt
related: Talonrakennus
related: Rakennustyöt. Rakennusaineet. Rakennustarvikkeet
related: Muuraus. Rappaus
related: Maalaustyöt
related: Rakenneosat
related: URN:NBN:fi:au:hklj:667.7
related: URN:NBN:fi:au:hklj:667.71
related: Uunit. Takat
related: Huoneakustiikka
related: Rakennusten erillistilat
related: URN:NBN:fi:au:hklj:726
related: Moottoriurheilu. Lentourheilu
scope note: Rakennusstatiikka, tekninen rakennussuunnittelu sekä geotekniikka ja maatyöt raideliikenteen rakentamisen kannalta Rautatiet, ratapihat, raitiotiet, pikaraitiotiet, metro ja metrotunnelit sekä niiden rakentaminen Junat, raitiovaunut ja metrovaunut sekä niiden suunnittelu, tekniikka, rakenne, osat, asennus, huolto, viat, korjaus, varaosat, varustelu, sisustus ja mallit Höyry-, diesel- ja sähköveturit. Henkilö- ja tavaravaunut Jos teos koskee sekä raideliikenteen väyliä tai raideliikennevälineitä että raideliikennettä, on etusija luokilla 385 ja 387+
scope note: Byggnadsstatik, teknisk byggnadsplanering samt geoteknik och anläggningsarbeten med hänsyn till leder för spårbunden trafik Järnvägar, bangårdar, spårvägar, snabbspårvagnar och tunnelbanor samt byggande av dem Tåg, spårvagnar och tunnelbanevagnar samt konstruktion, montering, service, reparation, utrustning och inredning av dem, deras teknik, konstruktion, delar, fel, reservdelar och typer Ånglok, diesellok och ellok. Person- och godståg Om verket handlar om både leder för spårbunden trafik eller fordon för spårbunden trafik och spårbunden trafik, ges företräde åt klasserna 385 och 387+ @sv

Puutarhanhoito. Hyötykasvit. Huone- ja koristekasvit
type: Class
type: Concept
subclass of: URN:NBN:fi:au:hklj:650
alternative label: Aidat, pensasaidat (653)
alternative label: Allelopatia, puutarhanhoito (653 +)
alternative label: Aluskasvit, puutarhanhoito (653 +)
alternative label: Atratsiini, herbisidit, puutarhanhoito (653)
alternative label: Avomaaviljely, puutarhanhoito (653 +)
alternative label: Biodynaaminen viljely, puutarhanhoito (653 +)
alternative label: Biojätteet, kompostointi, puutarhanhoito (653 +)
alternative label: Biologinen torjunta, puutarhanhoito (653 +)
alternative label: Biologinen typensidonta, puutarhanhoito (653 +)
alternative label: Biologinen viljely, puutarhanhoito (653 +)
alternative label: Biologiset menetelmät, puutarhanhoito (653 +)
alternative label: Biosidit, puutarhanhoito (653 +)
alternative label: Denitrifikaatio, puutarhanhoito (653 +)
alternative label: Eloperäiset lannoitteet, puutarhanhoito (653 +)
alternative label: Eloperäiset maat, puutarhanhoito (653 +)
alternative label: Eläintuhot, puutarhanhoito (653 +)
alternative label: Ensiharvennus, puutarhanhoito (653 +)
alternative label: Erikoiskasvit , puutarhanhoito (653 +)
alternative label: Esikasvit, puutarhanhoito, maanviljely (653)
alternative label: Fosfaatit, lannoitus, puutarhanhoito (653 +)
alternative label: Fosforilannoitteet, puutarhanhoito (653 +)
alternative label: Fungisidit, puutarhanhoito (653 +)
alternative label: Fysikaalinen torjunta, puutarhanhoito (653 +)
alternative label: Geenipankit, hyötykasvien jalostus (652 ... 653 +)
alternative label: Geenivarat, hyötykasvien jalostus (652 ... 653 +)
alternative label: Halla, puutarhanhoito (653 +)
alternative label: Haravat, puutarhanhoito (653)
alternative label: Harrastukset, puutarhanhoito (653 +)
alternative label: Harvennus, puutarhanhoito (653 +)
alternative label: Herbisidit, puutarhanhoito (653 +)
alternative label: Hiekkaviljely, viljelymenetelmät, puutarhanhoito (653 +)
alternative label: Hirvituhot, puutarhanhoito (653 +)
alternative label: Hortonomia (653 +)
alternative label: Humus, puutarhanhoito (653 +)
alternative label: Huokoisuus, maaperä, puutarhanhoito (653 +)
alternative label: Hybridit, puutarhakasvit (653 +)
alternative label: Hyönteismyrkyt, puutarhanhoito (653 +)
alternative label: Hyönteistuhot, puutarhanhoito (653 +)
alternative label: Hyötyhyönteiset, puutarhanhoito, biologinen torjunta (653 +)
alternative label: Idätys, puutarhanhoito (653 +)
alternative label: Insektisidit, puutarhanhoito (653 +)
alternative label: Istukkaat, kasvit, puutarhanhoito (653 +)
alternative label: Istutukset, puutarhanhoito (653 +)
alternative label: Istutus, puutarhanhoito (653 +)
alternative label: Isäntäkasvit, kasvitaudit, puutarhanhoito (653 +)
alternative label: Itäminen, puutarhanhoito (653 +)
alternative label: Itävyys, puutarhanhoito (653 +)
broader: URN:NBN:fi:au:hklj:650
in scheme: URN:NBN:fi:au:hklj:
narrower: Koristekasvit
narrower: Hyötykasvit
narrower: Huonekasvit
notation: 653
related: Antroposofia
related: URN:NBN:fi:au:hklj:342
related: URN:NBN:fi:au:hklj:576
related: KASVITIEDE
related: Systemaattinen kasvitiede
related: Putkilokasvit
related: Hyönteiset
related: Kivihiili. Turve
related: URN:NBN:fi:au:hklj:649.91
related: Maatalouspolitiikka
related: URN:NBN:fi:au:hklj:650.2
related: URN:NBN:fi:au:hklj:651
related: Maanviljely
related: URN:NBN:fi:au:hklj:657
related: Rakennusten erillistilat
related: URN:NBN:fi:au:hklj:691.1
related: Leipominen
related: URN:NBN:fi:au:hklj:691.12
related: URN:NBN:fi:au:hklj:691.13
related: Kalaruoat
related: Eri maiden ja alueiden ruokalajit ja ruokakulttuuri
related: Luonnon- ja kulttuurimaiseman suunnittelu
scope note: Puutarhanhoito yleensä. Puutarhan- ja pihanhoidon oppaat Nurmikon tai luonnonniityn perustaminen ja hoito Puutarhanhoitoa koskeva maatalouspolitiikka, maataloustuki, taloustiede, liiketalous ja kirjanpito. Puutarhatuotteet ja niiden kauppa Satovahingot ja korvaukset puutarhanhoidon kannalta Puutarhakasvien jalostus. Puutarhaviljely Biologinen, biodynaaminen ja luomuviljely puutarhanhoidossa Kateviljely ja vuoroviljely puutarhaviljelyksen kannalta Kasvihuoneviljely. Lasinalaisviljely. Viljely keinoalustalla. Keittiö-, kauppa- ja siirtolapuutarhat. Taimitarhat Puutarhanhoidon koneet ja työkalut Puutarharakennukset ja kasvihuoneet puutarhanhoidon kannalta Maan laatu ja viljavuus puutarhanhoidon kannalta Maanraivaus, maanmuokkaus, maanparannus, lannoitus, kompostointi, kylvö, harvennus, karsinta, kastelu, ojitus, sadonkorjuu sekä sadon käsittely ja varastointi puutarhanhoidon kannalta Kasvitaudit, kasvituholaiset, rikkakasvit ja kasvinsuojelu puutarhanhoidon kannalta Biologiset ja kemialliset torjuntamenetelmät puutarhanhoidossa Jos teos koskee sekä maanviljelystä että puutarhanhoitoa, on etusija luokalla 652
scope note: Trädgårdsodling i allmänhet. Handböcker i trädgårdsodling och skötsel av gårdsplaner Anläggning och skötsel av gräsmattor och naturängar Lantbrukspolitik, lantbruksstöd, ekonomi, företagsekonomi och bokföring inom trädgårdsodlingen. Trädgårdsprodukter och handel med dem Skördeskador och ersättningar ur trädgårdsodlingens synvinkel Förädling av trädgårdsväxter. Trädgårdsodling Biologisk, biodynamisk och ekologisk trädgårdsodling Täckodling och växelbruk ur trädgårdsodlingens synvinkel Växthusodling. Odling under glas. Odling på konstgjort underlag Köks-, handels- och koloniträdgårdar. Plantskolor Maskiner och redskap inom trädgårdsodling Byggnader och växthus inom trädgårdsodlingen Jordens kvalitet och bördighet inom trädgårdsodlingen Markröjning, jordbearbetning, jordförbättring, gödsling, kompostering, sådd, gallring, kvistning, bevattning, dikning, skörd samt hantering och lagring av skörden inom trädgårdsodlingen Växtsjukdomar, växtskadegörare, ogräs och växtskydd inom trädgårdsodlingen Biologiska och kemiska bekämpningsmetoder i trädgårdsodlingen Om verket handlar om både jordbruk och trädgårdsodling ges företräde åt klass 652 @sv

Metsästys
type: Class
type: Concept
subclass of: Metsästys. Kalastus
alternative label: Aitokanat, metsästys (658.1)
alternative label: Ammattimetsästys (658.1)
alternative label: Ammukset, metsästysaseet (658.1)
alternative label: Ampuma-aseet, metsästys (658.1)
alternative label: Ampumatarvikkeet, metsästys (658.1)
alternative label: Ansapyynti, metsästys (658.1)
alternative label: Ansat (658.1)
alternative label: Aseenkanto, metsästys (658.1)
alternative label: Aseet, metsästys (658.1)
alternative label: Aselehdet, metsästys (658.1)
alternative label: Aseluvat, metsästys (658.1)
alternative label: Eläinkannat, metsästys (658.1)
alternative label: Eräelämä, metsästysoppaat (658.1)
alternative label: Erätaidot, metsästystaidot (658.1)
alternative label: Erätalous, metsästys (658.1)
alternative label: Haukat, haukkametsästys (658.1)
alternative label: Haukkametsästys, metsästys (658.1)
alternative label: Haulikot, metsästys (658.1)
alternative label: Hirvi, metsästys (658.1)
alternative label: Houkutteet, metsästys (658.1)
alternative label: Houkuttimet, metsästys (658.1)
alternative label: Houkutuslinnut, metsästys (658.1)
alternative label: Hylkeenpyynti (658.1)
alternative label: Istukkaat, riistaeläimet (658.1)
alternative label: Istutus, riistaeläinten istututus (658.1)
alternative label: Jäljitys, metsästys (658.1)
alternative label: Jänikset, metsästys (658.1)
alternative label: Kanalinnut, metsästys (658.1)
alternative label: Kevätmetsästys (658.1)
alternative label: Kiväärit, metsästyskiväärit (658.1)
alternative label: Kotitarve, metsästys (658.1)
alternative label: Kyyhkyt, metsästys (658.1)
alternative label: Linnustus (658.1)
alternative label: Linnut, metsästys (658.1)
alternative label: Lintukannat , metsästys (658.1)
alternative label: Lintuvedet, metsästys (658.1)
alternative label: Lintuvesialueet, metsästys (658.1)
alternative label: Luolametsästys (658.1)
alternative label: Luonnon virkistyskäyttö, metsästys (658.1)
alternative label: Luonnontuoteala, metsästys (658.1)
alternative label: Luonnontuotteet, metsästys (658.1)
alternative label: Luontaiselinkeinot, metsästys (658.1)
broader: Metsästys. Kalastus
in scheme: URN:NBN:fi:au:hklj:
notation: 658.1
related: URN:NBN:fi:au:hklj:1.4
related: Ympäristöoikeus. Talousoikeus
related: Maa- ja metsätalouslainsäädäntö
related: Aseteknologia
related: URN:NBN:fi:au:hklj:473
related: URN:NBN:fi:au:hklj:473.1
related: URN:NBN:fi:au:hklj:475
related: URN:NBN:fi:au:hklj:475.1
related: URN:NBN:fi:au:hklj:476
related: URN:NBN:fi:au:hklj:476.1
related: URN:NBN:fi:au:hklj:476.11
related: URN:NBN:fi:au:hklj:476.12
related: URN:NBN:fi:au:hklj:476.5
related: URN:NBN:fi:au:hklj:476.6
related: URN:NBN:fi:au:hklj:476.7
related: URN:NBN:fi:au:hklj:476.8
related: Uhanalaiset lajit. Luonnonsuojelualueet
related: URN:NBN:fi:au:hklj:590
related: Eläintarhat
related: Eläinsuojelu
related: Nisäkkäät
related: URN:NBN:fi:au:hklj:649.91
related: Siipikarja
related: Turkiseläimet
related: Koirat
related: URN:NBN:fi:au:hklj:657
related: Kalastus
related: URN:NBN:fi:au:hklj:691.13
related: Kalaruoat
related: Ammunta
scope note: Riistatalous. Riistanhoito. Riistalajit. Riistakannat Metsästys- ja rauhoitusajat. Metsästysluvat. Metsästäjän tutkinto Metsästys- ja pyyntitavat. Metsästysvälineet. Metsästysaseet. Ansapyynti Metsästyksen taloudellinen merkitys Turkismetsästys. Urheilumetsästys. Haukkametsästys. Metsästyshaukat Nisäkkäiden, lintujen ja matelijoiden metsästys. Hylkeenpyynti
scope note: Vilthushållning. Viltvård. Viltarter. Viltstammar Jakt- och fredningstider. Jaktlicenser. Jaktprov Jakt- och fångstmetoder. Jaktredskap. Jaktvapen. Fångst med snaror Jaktens ekonomiska betydelse Pälsdjursjakt. Jakt som sport. Jakt med falkar. Jaktfalkar Jakt på däggdjur, fågel och kräldjur. Säljakt @sv

Eläinlääketiede
type: Class
type: Concept
subclass of: URN:NBN:fi:au:hklj:650
alternative label: Afrikkalainen sikarutto, eläinlääketiede (659)
alternative label: Aihiolääkkeet , eläinlääketiede (659)
alternative label: Eläinhoitajan työ (659)
alternative label: Eläinhoitajan työ, eläinlääketiede (659)
alternative label: Eläinkokeet, eläinlääketiede (659)
alternative label: Eläinlääketiede (659)
alternative label: Eläinlääketieteelliset korkeakoulut (659)
alternative label: Eläinlääkintä (659)
alternative label: Eläinlääkintähuolto (659)
alternative label: Eläinlääkkeet (659)
alternative label: Eläinlääkärit, eläinlääkärin työ (659)
alternative label: Eläinsairaalat (659)
alternative label: Eläintaudit, eläinlääketiede (659)
alternative label: Eläinten lääkkeet (659)
alternative label: Eläinten taudit, eläinlääketiede (659)
alternative label: Endofyytit, eläinlääketiede (659)
alternative label: Geneettinen alttius, eläinlääketiede (659)
alternative label: Hampaat, eläinlääketiede (659)
alternative label: Hemangiosarkooma, eläinlääketiede (659)
alternative label: Herpesvirukset, eläinlääketiede (659)
alternative label: Hilse, eläinlääketiede (659)
alternative label: Jättisolukasvaimet, eläinlääketiede (659)
alternative label: Karanteeni, eläinlääketiede (659)
alternative label: Kasvaimet, eläinlääketiede (659)
alternative label: Kirput, eläinlääketiede (659)
alternative label: Koe-eläimet, hoito (659)
alternative label: Koe-eläinmallit, eläinlääketiede (659)
alternative label: Kotieläintaudit, eläinlääketiede (659)
alternative label: Loiseläimet, eläinlääketiede (659)
alternative label: Loiset, eläinlääketiede (659)
alternative label: Loisinta, eläinlääketiede (659)
alternative label: Loisoppi, eläinlääketiede (659)
alternative label: Loistaudit, eläinlääketiede (659)
alternative label: Lääkeaineet, eläinlääketiede (659)
alternative label: Löytöeläimet, eläinlääketiede (659)
alternative label: Ontuminen, eläinlääketiede (659)
alternative label: Parapoxvirukset, eläinlääketiede (659)
alternative label: Parasiitit, eläinlääketiede (659)
alternative label: Parasitismi, eläinlääketiede (659)
alternative label: Parasitologia, eläinlääketiede (659)
alternative label: Penikointi, eläinlääketiede (659)
alternative label: Perinnöllinen alttius, eläinlääketiede (659)
broader: URN:NBN:fi:au:hklj:650
in scheme: URN:NBN:fi:au:hklj:
notation: 659
related: Muut yliopistot ja korkeakoulut
related: Ympäristöoikeus. Talousoikeus
related: URN:NBN:fi:au:hklj:590
related: Eläintarhat
related: Eläinsuojelu
related: Etologia. Eläinsosiologia
related: LÄÄKETIEDE. TERVEYDENHOITO
related: URN:NBN:fi:au:hklj:616
related: Lääketieteellinen kemia ja fysiikka
related: URN:NBN:fi:au:hklj:616.2
related: URN:NBN:fi:au:hklj:616.3
related: Immunologia. Serologia. Verioppi
related: Tartuntataudit
related: URN:NBN:fi:au:hklj:649.91
related: URN:NBN:fi:au:hklj:654
related: Hevoset
related: Nautaeläimet
related: Vuohet ja lampaat
related: Siat
related: Siipikarja
related: Turkiseläimet
related: Porot
related: Hyönteiset
related: Lemmikkieläimet
related: Koirat
related: Kissat
related: Pikkunisäkkäät
related: Häkkilinnut
related: Akvaariot
related: URN:NBN:fi:au:hklj:657
scope note: Eläinlääketieteen yleisteokset. Eläinlääkärin ja eläinhoitajan työ yleensä Kotieläinten sairaudet ja niiden hoito yleensä Villieläinten sairauksien hoito yleensä Koe-eläinten hoito yleensä Eläimistä ihmiseen tarttuvien tautien torjunta Tietyn kotieläimen tai kotieläinryhmän sairaudet ja niiden hoito ko. eläimen tai eläinryhmän luokassa 654+
scope note: Allmänna verk om veterinärmedicin. Veterinärens och djurskötarens arbete i allmänhet Husdjurens sjukdomar och behandling av dem i allmänhet Behandling av vilda djurs sjukdomar i allmänhet Skötsel av försöksdjur i allmänhet Bekämpning av sjukdomar som smittar från djur till människa Sjukdomar hos ett bestämt husdjur eller en viss grupp av husdjur förs till klassen för respek tive djur eller djurgrupp 654+ @sv

LIIKETALOUS. KAUPPA. MARKKINOINTI. LIIKENNEOPETUS
type: Class
type: Concept
subclass of: SOVELLETUT TIETEET
alternative label: Arvo, liiketaloustiede (670)
alternative label: Global Reporting Initiative, kaupalliset aineet (670 ... 676 +)
alternative label: Kaupalliset aineet (670 ... 676 +)
alternative label: Liiketaloustiede (670)
alternative label: Taloudelliset mallit, liiketaloustiede (670)
alternative label: Talousteoriat, liiketaloustieteet (670)
alternative label: Taloustieteet, liiketaloustieteet (670)
alternative label: Viennin edistäminen, messut (670)
alternative label: Ekonomiska modeller, företagsekonomi (670) @sv
alternative label: Ekonomiska teorier, företagsekonomi (670) @sv
alternative label: Ekonomiska vetenskaper, företagsekonomi (670) @sv
alternative label: Exportfrämjande, mässor (670) @sv
alternative label: Företagsekonomi, ekonomisk vetenskap (670) @sv
alternative label: Global Reporting Initiative, merkantila ämnen (670 ... 676 +) @sv
alternative label: Merkantila ämnen (670 ... 676 +) @sv
alternative label: Värde, företagsekonomi (670) @sv
broader: SOVELLETUT TIETEET
in scheme: URN:NBN:fi:au:hklj:
narrower: Kaupan historia
narrower: Tavaraoppi
narrower: Liiketalouden hallinto ja organisaatio
narrower: URN:NBN:fi:au:hklj:675
narrower: Mainonta. Kuluttajanvalistus
narrower: Liikenneopetus. Liikenneturvallisuus
narrower: Merenkulkuoppi
narrower: Hotelli- ja ravintolatalous
notation: 670
preferred label: COMMERCE. TRADE. MARKETING. TRAFFIC ISTRUCTIO @en
preferred label: FÖRETAGSEKONOMI. HANDEL. MARKNADSFÖRING. TRAFIKUNDERVISNING @sv
related: URN:NBN:fi:au:hklj:061
related: URN:NBN:fi:au:hklj:063
related: Keskiasteen koulutus
related: Siviili- ja kauppaoikeus. Sopimusoikeus
related: Esine- ja velvoiteoikeus. Immateriaalioikeudet. Huoneen- ja maanvuokralainsäädäntö
related: Perhe- ja holhousoikeus
related: Perintö- ja testamenttioikeus
related: Kauppaoikeus. Yhtiölainsäädäntö. Pankki- ja vakuutuslainsäädäntö
related: URN:NBN:fi:au:hklj:360
related: URN:NBN:fi:au:hklj:363
related: URN:NBN:fi:au:hklj:368
related: URN:NBN:fi:au:hklj:650.2
related: URN:NBN:fi:au:hklj:670.03
related: URN:NBN:fi:au:hklj:670.09
scope note: Liiketaloustieteen yleisteokset ja yleiset oppikirjat Teokset, jotka koskevat sekä liiketaloutta että kauppaa tai markkinointia yleensä. Messut yleensä Erikoisalojen liiketaloudelliset ja kaupalliset kysymykset alan mukaisessa luokassa Jos teoksessa on sekä liiketaloutta että kansantaloutta tai talouspolitiikkaa, on etusija luokilla 360-369
scope note: Allmänna verk om företagsekonomi Allmänna läroböcker i företagsekonomi Verk som handlar om både företagsekonomi och handel eller marknadsföring i allmänhet. Mässor i allmänhet Företagsekonomiska och handelsrelaterade frågor som rör specialområden klassificeras enligt område Om verket handlar om såväl företagsekonomi som nationalekonomi och ekonomisk politik, ges företräde åt klasserna 360-369 @sv

Henkilöstöpolitiikka
type: Class
type: Concept
subclass of: Liiketalouden hallinto ja organisaatio
alternative label: Alaiset, henkilöstö (674.5)
alternative label: Alaistaidot, henkilöstö (674.5)
alternative label: Ammatillinen kasvu, henkilöstökoulutus (674.5)
alternative label: Ammatillinen kehitys, henkilöstökoulutus (674.5)
alternative label: Ammatillinen tausta, henkilöstöpolitiikka (674.5)
alternative label: Ammattitausta, henkilöstöpolitiikka (674.5)
alternative label: Ammattiura, henkilöstöpolitiikka (674.5)
alternative label: Arvostus, henkilöstöpolitiikka (674.5)
alternative label: Asiantuntijavaihto (674.5)
alternative label: Bonukset, henkilöstöpolitiikka (674.5)
alternative label: Eroaminen, työelämä (674.5)
alternative label: Erottaminen, työpaikalta (674.5)
alternative label: Fokusryhmähaastattelut, työhönotto (674.5)
alternative label: Haastattelijat, työhönotto (674.5)
alternative label: Haastattelumenetelmät , työhönotto (674.5)
alternative label: Haastattelut, työhönotto (674.5)
alternative label: Hallintoedustus, työpaikkademokratia (674.5)
alternative label: Henkilöarviointi, henkilöstöpolitiikka (674.5)
alternative label: Henkilöarviointi, työhöotto (674.5)
alternative label: Henkilökierto (674.5)
alternative label: Henkilökunta (674.5)
alternative label: Henkilökuntakerhot (674.5)
alternative label: Henkilökuntayhdistykset, henkilöstöpolitiikka (674.5)
alternative label: Henkilöstö (674.5)
alternative label: Henkilöstöhallinto (674.5)
alternative label: Henkilöstöhankinta (674.5)
alternative label: Henkilöstöjohtaminen, henkilöstöhallinto (674.5)
alternative label: Henkilöstökoulutus (674.5)
alternative label: Henkilöstöpolitiikka (674.5)
alternative label: Henkilöstörahastot (674.5)
alternative label: Henkilöstöstrategiat (674.5)
alternative label: Henkilöstösuunnittelu (674.5)
alternative label: Henkilöstötilinpäätös (674.5)
alternative label: Henkilövaihto, henkilöstöpolitiikka (674.5)
alternative label: Hiljainen tieto, työpaikkakoulutus (674.5)
alternative label: Ilmapiiri, henkilöstöpolitiikka (674.5)
alternative label: Irtisanominen, työstä erottaminen (674.5)
alternative label: Itsearviointi, työntekijät (674.5)
alternative label: Itseohjautuvuus, henkilöstöpolitiikka (674.5)
alternative label: Kannustematkailu, henkilöstöpolitiikka (674.5)
alternative label: Kannustimet, henkilöstöpolitiikka (674.5)
alternative label: Kannustus, henkilöstöpolitiikka (674.5)
broader: Liiketalouden hallinto ja organisaatio
in scheme: URN:NBN:fi:au:hklj:
notation: 674.5
related: Sosiaalipsykologia. Kulttuuripsykologia
related: Ihmissuhteiden psykologia
related: Sovellettu psykologia
related: Työoikeus
related: URN:NBN:fi:au:hklj:340
related: URN:NBN:fi:au:hklj:345
related: Suomen valtionhallinto
related: Organisaatioiden ja laitosten sosiologia
related: Työn sosiologia
related: URN:NBN:fi:au:hklj:360
related: Pääoma. Työ. Luonnonvarat
related: URN:NBN:fi:au:hklj:363
related: URN:NBN:fi:au:hklj:368
related: Tuotanto. Tuottavuus
related: Elintaso. Kulutus
related: Työ sosiaalipoliittisena kysymyksenä
related: Työolot
related: Työsuojelu
related: Työllisyys. Työttömyys. Työvoimapalvelu
related: Työmarkkinajärjestöt
related: URN:NBN:fi:au:hklj:618.2
related: URN:NBN:fi:au:hklj:620
related: URN:NBN:fi:au:hklj:627.751
related: METALLITEOLLISUUS. PUUNJALOSTUSTEOLLISUUSSÄHKÖTEKNINEN TEOLLISUUS TEKSTIILI- JA NAHKATEOLLISUUS
related: KEMIAN TEOLLISUUS. KAIVOSTEOLLISUUS
related: URN:NBN:fi:au:hklj:650.2
related: Johtamisen tekniikka ja menetelmät
related: Työntutkimukset. Työanalyysi
related: URN:NBN:fi:au:hklj:675
related: Mainonta. Kuluttajanvalistus
scope note: Yksityisen tai julkisen yrityksen tai organisaation henkilöstöpolitiikka ja -hallinto sekä henkilöstökysymykset yleensä Työpaikka-, yritys- ja virastodemokratia yleensä Henkilöstötutkimukset ja henkilöstösuunnittelu yleensä Henkilöstökoulutus yleensä Henkilöstön rakenne, virat ja toimet yleensä Työhönotto, työhön sijoittaminen ja perehdyttäminen sekä työpaikkakoulutus ja työnohjaus yleensä Työkuri, työstä erottaminen yleensä Työpaikan sisäinen tiedotus- ja suhdetoiminta yleensä Yrityksen tai organisaation sosiaalitoiminta yleensä Erikoisalojen yritysten ja organisaatioiden henkilöstöpolitiikka ja henkilöstökysymykset alan mukaisessa luokassa
scope note: Personalpolitik, personaladministration och personalfrågor inom privata eller offentliga företag eller organisationer i allmänhet Personalens medbestämmande och medinflytande i allmänhet Personalundersökningar och personalplanering i allmänhet Personalutbildning i allmänhet Personalens struktur, tjänster och befattningar i allmänhet Anställning, placering i arbetslivet och arbetsintroduktion samt arbetsplatsutbildning och handledning på arbetsplatsen i allmänhet Arbetsdisciplin, uppsägningar i allmänhet Intern information och interna relationer på arbetsplatsen i allmänhet Social verksamhet inom företag och organisationer i allmänhet Personalfrågor som rör specialområden i företag och organisationer klassificeras enligt område @sv

Kotitalous. Kodinhoito
type: Class
type: Concept
subclass of: KOTITALOUS. LAITOSTALOUS. KAUNEUDENHOITO
alternative label: Au pairit, kotiapulaisen työ (690.2)
alternative label: Budjetit, kotitalous (690.2)
alternative label: Ekonomisuus, kotitalous (690.2)
alternative label: Henkilökohtainen talous, taloudenhoito (690.2)
alternative label: Kirjanpito, kotitalouden (690.2)
alternative label: Kodin kirjanpito (690.2)
alternative label: Kodin taloustiede (690.2)
alternative label: Kodinelektroniikka, kotitalous (690.2)
alternative label: Kodinhoito (690.2)
alternative label: Kodinkoneet, käyttö kotitaloudessa (690.2)
alternative label: Kodintekniikka, kotitalous (690.2)
alternative label: Koti, kotitalous (690.2)
alternative label: Kotiansiotyö (690.2)
alternative label: Kotiapulaiset, kotiapulaisen työ (690.2)
alternative label: Kotitaloudet, kotitalous (690.2)
alternative label: Kotitalous (690.2)
alternative label: Kotitalousala (690.2)
alternative label: Kotitalouskoneet, käyttö kotitaloudessa (690.2)
alternative label: Kotitalousneuvonta (690.2)
alternative label: Kotitalousoppilaitokset (690.2)
alternative label: Kotitaloustiede (690.2)
alternative label: Kotitaloustyö (690.2)
alternative label: Kotitarve (690.2)
alternative label: Kotitarve, kotitalous (690.2)
alternative label: Kotityö (690.2)
alternative label: Kustannukset, kodin talous (690.2)
alternative label: Käyttöohjeet, kodinkoneet (690.2)
alternative label: Käyttöönotto, kodinkoneet (690.2)
alternative label: Menot, kirjanpito, kotitalous (690.2)
alternative label: Niksit, kodinhoito (690.2)
alternative label: Palvelijat, kotitalous (690.2)
alternative label: Palvelusväki, kotitalous (690.2)
alternative label: Piiat, kotitalous (690.2)
alternative label: Rahankäyttö, kotitalous (690.2)
alternative label: Taloudellinen arviointi , kodin talous (690.2)
alternative label: Taloudellisuus, kotitalous (690.2)
alternative label: Taloudenhoito, kotitalous (690.2)
alternative label: Talousarviot, kotitalous (690.2)
alternative label: Talouskasvatus, ekonomisuus, kotitalous (690.2)
alternative label: Talouskoulut (690.2)
alternative label: Taloustarvikkeet (690.2)
alternative label: Tulo- ja menoarviot, kotitalous (690.2)
broader: KOTITALOUS. LAITOSTALOUS. KAUNEUDENHOITO
in scheme: URN:NBN:fi:au:hklj:
notation: 690.2
related: URN:NBN:fi:au:hklj:373
related: URN:NBN:fi:au:hklj:473
related: URN:NBN:fi:au:hklj:473.1
related: URN:NBN:fi:au:hklj:475
related: URN:NBN:fi:au:hklj:475.1
related: URN:NBN:fi:au:hklj:476
related: URN:NBN:fi:au:hklj:476.1
related: URN:NBN:fi:au:hklj:476.11
related: URN:NBN:fi:au:hklj:476.12
related: URN:NBN:fi:au:hklj:476.5
related: URN:NBN:fi:au:hklj:476.6
related: URN:NBN:fi:au:hklj:476.7
related: URN:NBN:fi:au:hklj:476.8
related: Liiketaloudellinen kirjanpito ja tilintarkastus
related: HIENOMEKANIIKKA. KÄSI- JA KOTITEOLLISUUS
related: Kodin korjaustöiden oppaat
related: URN:NBN:fi:au:hklj:681
related: URN:NBN:fi:au:hklj:690.209
related: Ravintotalous. Gastronomia
related: URN:NBN:fi:au:hklj:691.1
related: Leipominen
related: URN:NBN:fi:au:hklj:691.12
related: URN:NBN:fi:au:hklj:691.13
related: Kalaruoat
related: Eri maiden ja alueiden ruokalajit ja ruokakulttuuri
related: Säilöntä
related: Juomat
related: Kotijuhlien järjestäminen. Kutsujen järjestäminen
related: Sisustusoppaat
related: Siivous. Pesu- ja puhdistustyöt
scope note: Kotitalouden ja kodinhoidon yleisteokset Kotitalouden ja kodinhoidon neuvonta yleensä Kotitalouden ja kodinhoidon yleiset tai sekasisältöiset oppaat Kodin työt, niiden suunnittelu, organisointi ja rationalisointi yleensä Kotitalouden ja kodinhoidon yleiset niksikirjat Kodinkoneiden tai kotitalouskoneiden käyttö yleensä Kodin talous, taloussuunnittelu ja kirjanpito yleensä Kotiapulaisen työ yleensä Tiettyyn kotitalouden tai kodinhoidon alaan liittyvät teokset alan mukaisessa luokassa 680.8 ja 691-698
scope note: Allmänna verk som rör hushåll och skötsel av hemmet Hushållsrådgivning i allmänhet Handböcker med allmänt och blandat innehåll som handlar om hushåll och skötsel av hemmet Hushållsarbete, planering, organisering och rationalisering av arbetet i hemmet i allmänhet Allmänna tips och knep för hushåll och skötsel av hemmet Användning av hushållsapparater och hushållsmaskiner i allmänhet Hemmets ekonomi, ekonomisk planering och bokföring i hemmet i allmänhet Hembiträdets arbete i allmänhet Verk som rör ett bestämt område inom hushåll eller skötsel av hemmet förs enligt område till klass 680.8 och 691-698 @sv

Kotijuhlien järjestäminen. Kutsujen järjestäminen
type: Class
type: Concept
subclass of: KOTITALOUS. LAITOSTALOUS. KAUNEUDENHOITO
alternative label: Aamiaiset, suunnittelu ja kattaus (692)
alternative label: Ajanviete, juhlat, kotijuhlat (692)
alternative label: Annostus, tarjoilu (692)
alternative label: Astiastot, kattaus (692)
alternative label: Astiat, kattaus (692)
alternative label: Ateriat, suunnittelu ja kattaus (692)
alternative label: Aterimet, kattaus (692)
alternative label: Brunssit, suunnittelu ja kattaus (692)
alternative label: Illalliset, suunnittelu ja kattaus (692)
alternative label: Isänpäivä, perhejuhlat (692)
alternative label: Isät, isänpäivä, kotijuhlat (692)
alternative label: Itsenäisyyspäivät, perhejuhlat (692)
alternative label: Joulu, kotijuhlien järjestäminen (692)
alternative label: Juhannus, kotijuhlien järjestäminen (692)
alternative label: Juhlapäivät, kotijuhlien järjestäminen (692)
alternative label: Juhlat, kotijuhlien järjestäminen (692)
alternative label: Juhlien järjestäminen, kotijuhlat (692)
alternative label: Juomat, tarjoilu (692)
alternative label: Juusto, tarjoilu (692)
alternative label: Kakkulapiot, ruokailuvälineet, kattaus (692)
alternative label: Kattaus (692)
alternative label: Kauhat, ruokailuvälineet, kattaus (692)
alternative label: Kiulut, astiat, kattaus (692)
alternative label: Korkkiruuvit, juomat, tarjoilu (692)
alternative label: Kotijuhlat, järjestäminen (692)
alternative label: Kutsut, kotijuhlien järjestäminen (692)
alternative label: Kyläily, kotijuhlien järjestäminen (692)
alternative label: Lahjat, kotijuhlat (692)
alternative label: Lakkiaiset, kotijuhlien järjestäminen (692)
alternative label: Laskiainen, kotijuhlien järjestäminen (692)
alternative label: Lastenjuhlat, järjestäminen (692)
alternative label: Lastenkutsut, järjestäminen (692)
alternative label: Lautasliinat (692)
alternative label: Lautasliinat, kattaus (692)
alternative label: Lounaat, suunnittelu ja kattaus (692)
alternative label: Lucian päivä (692)
alternative label: Lucian päivä, kotijuhlien järjestäminen (692)
alternative label: Maljakot, kattaus (692)
alternative label: Mate, juomat, tarjoilu (692)
alternative label: Menyyt, kattaus (692)
alternative label: Merkkipäivät, kotijuhlien järjestäminen (692)
alternative label: Nimipäiväjuhlat (692)
alternative label: Nimipäiväjuhlat, kotijuhlat (692)
broader: KOTITALOUS. LAITOSTALOUS. KAUNEUDENHOITO
in scheme: URN:NBN:fi:au:hklj:
notation: 692
related: Kirkolliset juhlat ja juhlapäivät
related: Käytös- ja tapatieto
related: Juhlien järjestäminen
related: URN:NBN:fi:au:hklj:473
related: URN:NBN:fi:au:hklj:473.1
related: URN:NBN:fi:au:hklj:475
related: URN:NBN:fi:au:hklj:475.1
related: URN:NBN:fi:au:hklj:476
related: URN:NBN:fi:au:hklj:476.1
related: URN:NBN:fi:au:hklj:476.11
related: URN:NBN:fi:au:hklj:476.12
related: URN:NBN:fi:au:hklj:476.5
related: URN:NBN:fi:au:hklj:476.6
related: URN:NBN:fi:au:hklj:476.7
related: URN:NBN:fi:au:hklj:476.8
related: Hotelli- ja ravintolatalous
related: Kotitalous. Kodinhoito
related: URN:NBN:fi:au:hklj:691.1
related: Leipominen
related: URN:NBN:fi:au:hklj:691.12
related: URN:NBN:fi:au:hklj:691.13
related: Kalaruoat
related: Eri maiden ja alueiden ruokalajit ja ruokakulttuuri
related: Juomat
related: URN:NBN:fi:au:hklj:787.3
related: URN:NBN:fi:au:hklj:787.31
related: URN:NBN:fi:au:hklj:787.311
related: URN:NBN:fi:au:hklj:787.32
related: URN:NBN:fi:au:hklj:787.34
scope note: Koti-, perhe- ja lastenjuhlien järjestäminen Juhla- ja merkkipäiviin liittyvien kotijuhlien järjestäminen Aterioiden ja ruokalistan suunnittelu. Ruoan tarjoilu ja annostelu Pöydän kattaus ja koristelu. Ruokailuvälineet, astiat ja pöytäliinat pöydän kattauksen kannalta Jos teoksessa on sekä käytännön ohjeita että kansatiedettä, on etusija luokalla 692
scope note: Anordnande av hembjudningar, familjefester och barnkalas Anordnande av hembjudningar som hänför sig till högtider och bemärkelsedagar Planering av måltider och menyer. Servering och utportionering av mat Dukning och bordsdekorationer. Bestick, kärl och servetter ur dukningssynvinkel Om verket innehåller både praktiska råd och etnologi ges företräde åt klass 692 @sv

Tanssitaide
type: Class
type: Concept
subclass of: URN:NBN:fi:au:hklj:770
alternative label: Buto, tanssitaide (775)
alternative label: Elekieli, tanssitaide (775 +)
alternative label: Esiintyjät, tanssijat, tanssitaide (775 +)
alternative label: Esiintymistaito, tanssi, tanssitaide (775 +)
alternative label: Esittäjät, tanssijat, tanssitaide (775 +)
alternative label: Esittäminen, tanssi, tanssitaide (775 +)
alternative label: Esittävät taiteet, tanssitaide (775 +)
alternative label: Esitykset, tanssiesitysten tallenteet, tanssitaide (775 +)
alternative label: Estraditaiteilijat, tanssijat (775 +)
alternative label: Eurytmia (775)
alternative label: Festivaalit, tanssifestivaalit, tanssitaide (775 +)
alternative label: Gestiikka, tanssitaide (775 +)
alternative label: Harjoitukset, tanssi, tanssitaide (775 +)
alternative label: Harrastukset, tanssi, tanssitaide (775 +)
alternative label: Hip hop, tanssitaide (775)
alternative label: Ilmaisutaito, tanssi, tanssitaide (775 +)
alternative label: Kantaesitykset, tanssi (775 +)
alternative label: Katsojat, baletti, tanssitaide (775 +)
alternative label: Katutanssi (775)
alternative label: Kehonkieli, tanssitaide (775 +)
alternative label: Kiertueet, tanssi (775 +)
alternative label: Koreografia (775)
alternative label: Koreografit, elämäkerrat ja muistelmat (775 +)
alternative label: Käsiohjelmat, tanssi (775)
alternative label: Liikemerkintä (775)
alternative label: Liikemerkintä, tanssitaide (775 +)
alternative label: Musiikkiliikunta, tanssitaide (775 +)
alternative label: Näyttämöliikunta, koreografia (775 +)
alternative label: Näyttämömestari, tanssi (775 +)
alternative label: Näyttämötaide, tanssitaide (775 +)
alternative label: Näyttämötaiteilijat, tanssijat (775 +)
alternative label: Pyörätuolitanssi, tanssitaide (775 +)
alternative label: Ruumiinkieli, tanssitaide (775 +)
alternative label: Ruumiinkulttuuri, tanssitaide (775 +)
alternative label: Soolot, tanssitaide (775 +)
alternative label: Street dance (775)
alternative label: Streetdance (775)
alternative label: Taideharrastukset, tanssi, tanssitaide (775 +)
alternative label: Taiteet, tanssitaide (775 +)
alternative label: Taiteilijaelämäkerrat, tanssijat (775 +)
alternative label: Taiteilijat, tanssijat (775 +)
alternative label: Tanssi (775)
alternative label: Tanssi, tanssitaide (775 +)
alternative label: Tanssiarvostelut (775 +)
alternative label: Tanssijat (775 +)
broader: URN:NBN:fi:au:hklj:770
in scheme: URN:NBN:fi:au:hklj:
narrower: Baletti
narrower: Jazzbaletti. Moderni tanssi
notation: 775
related: Teatteri- ja näyttämötaiteen teoria, estetiikka ja filosofia
related: Harrastajateatteri
related: URN:NBN:fi:au:hklj:770.9
related: Teatterityö
related: Teatteritekniikka
related: Teatterimuodot
related: Pantomiimi
related: Elokuva. Elokuvataide
related: Ilmaisutaito. Puhetaito. Lausuntataide
related: Balettimusiikki
related: Viihdemusiikki
related: Suomenkielinen viihdemusiikki
related: Ruotsin-, tanskan- ja norjankielinen viihdemusiikki
related: Saksankielinen viihdemusiikki
related: Englanninkielinen viihdemusiikki
related: Ranskankielinen viihdemusiikki
related: Italiankielinen viihdemusiikki
related: Venäjän-, valkovenäjän- ja ukrainankielinen viihdemusiikki
related: Espanjankielinen viihdemusiikki
related: Muunkielinen viihdemusiikki
related: Kreikankielinen viihdemusiikki
related: Portugalinkielinen viihdemusiikki
related: Vironkielinen viihdemusiikki
related: URN:NBN:fi:au:hklj:795
related: URN:NBN:fi:au:hklj:795.1
scope note: Tanssin yleisteokset. Tanssitaiteen yleisteokset Tässä ja alaluokissa tanssitaiteen historia, henkilöhistoria, koulutus, tekniikka, estetiikka ja koreografia. Koreografian yleisteokset Tanssiteatteri. Buto. Eurytmia Tässä ja alaluokissa myös tanssiesitysten videotallenteet Jos teoksessa on sekä tanssitaidetta että seuratansseja, kansantansseja tai tanssiurheilua, on etusija luokalla 775+
scope note: Allmänna verk om dans. Allmänna verk om danskonst Hit och till underklasserna danskonstens historia, personhistoria, utbildning, tekniker, estetik och koreografi. Allmänna verk som rör koreografi Dansteater. Buto. Eurytmi Hit och till underklasserna också videoinspelningar av dansföreställningar Om verket handlar om såväl danskonst som sällskapsdanser, folkdanser eller danssport, ges företräde åt klass 775+ @sv

Keski- ja Itä-Aasia
type: Class
type: Concept
subclass of: Aasia
broader: Aasia
in scheme: URN:NBN:fi:au:hklj:
narrower: Itsenäisten valtioiden yhteisön Aasian puoleiset alueet
narrower: Korea
narrower: Kiina
narrower: Japani
notation: 784.25
preferred label: Central and Eastern Asia @en
preferred label: Centralasien och Ostasien @sv
related: URN:NBN:fi:au:hklj:473.1
related: URN:NBN:fi:au:hklj:769
related: URN:NBN:fi:au:hklj:783
related: URN:NBN:fi:au:hklj:783.1
related: Etelä-Aasia
related: URN:NBN:fi:au:hklj:784.9
related: URN:NBN:fi:au:hklj:787
related: URN:NBN:fi:au:hklj:787.2
related: Itämaisten uskontojen musiikki
related: Islamilaisten uskonnollinen musiikki
related: URN:NBN:fi:au:hklj:787.29
related: URN:NBN:fi:au:hklj:788.8
related: URN:NBN:fi:au:hklj:789
related: Varhaiskansojen musiikki
related: URN:NBN:fi:au:hklj:795.1
related: URN:NBN:fi:au:hklj:797.2
related: URN:NBN:fi:au:hklj:807
scope note: Yleisteokset ja sekasisältöiset kokoelmat Mongolia. Tässä myös Himalajan alue yleensä
scope note: Allmänna verk och samlingar med blandat innehåll Mongoliet. Hit också Himalayaområdet i allmänhet @sv

Itsenäisten valtioiden yhteisön Aasian puoleiset alueet
type: Class
type: Concept
subclass of: Keski- ja Itä-Aasia
broader: Keski- ja Itä-Aasia
in scheme: URN:NBN:fi:au:hklj:
narrower: Kaukasuksen maat
notation: 784.251
preferred label: Asian countries in the Commonwealth of Independent States @en
preferred label: De asiatiska länderna inom Oberoende staternas samvälde @sv
related: URN:NBN:fi:au:hklj:473.1
related: URN:NBN:fi:au:hklj:769
related: URN:NBN:fi:au:hklj:783
related: URN:NBN:fi:au:hklj:783.1
related: URN:NBN:fi:au:hklj:784.111
related: Itä-Eurooppa
related: Itsenäisten valtioiden yhteisö
related: Venäjä
related: Karjalan tasavalta
related: Ukraina
related: Valko-Venäjä
related: Moldova
related: URN:NBN:fi:au:hklj:784.9
related: URN:NBN:fi:au:hklj:787
related: URN:NBN:fi:au:hklj:787.2
related: Itämaisten uskontojen musiikki
related: Islamilaisten uskonnollinen musiikki
related: URN:NBN:fi:au:hklj:787.29
related: URN:NBN:fi:au:hklj:788.8
related: URN:NBN:fi:au:hklj:789
related: Varhaiskansojen musiikki
related: URN:NBN:fi:au:hklj:795.1
related: URN:NBN:fi:au:hklj:797.2
related: URN:NBN:fi:au:hklj:807
scope note: Venäjän Aasian puoleiset alueet yleensä. Siperia Kazakstan. Kirgisia. Tadzikistan. Turkmenistan. Uzbekistan IVY:n tai Venäjän Aasian puoleisella alueella asuvien suomensukuisten kansojen kansanmusiikki
scope note: De asiatiska områdena av Ryssland i allmänhet. Sibirien Kazakstan. Kirgisistan. Tadjikistan. Turkmenistan. Uzbekistan De i asiatiska områdena av OSS eller Ryssland bosatta finsk-ugriska folkens folkmusik @sv

Liikunta. Urheilu
type: Class
type: Concept
subclass of: LIIKUNTA. URHEILU. LEIKIT. HUVIT
alternative label: Aatteelliset järjestöt, urheilujärjestöt (791)
alternative label: Aatteelliset yhdistykset, urheilujärjestöt (791)
alternative label: Aerobinen harjoittelu (791)
alternative label: Aerobinen suorituskyky (791)
alternative label: Amatööriurheilu (791)
alternative label: Ammattilaiset, urheilu (791)
alternative label: Ammattiurheilu (791)
alternative label: Anaerobinen harjoittelu (791)
alternative label: Anaerobinen kynnys (791)
alternative label: Anaerobinen suorituskyky (791)
alternative label: Askeleet, liikunta (791)
alternative label: Cup-kilpailut (791)
alternative label: Cup-kilpailut, urheilu (791)
alternative label: EM-kisat, urheilu (791 +)
alternative label: Erityisliikunta (791)
alternative label: Erityisliikunta, liikunta (791 +)
alternative label: Euroopan mestaruuskisat, urheilu (791 +)
alternative label: Fyysinen aktiivisuus, kuntoliikunta (791)
alternative label: Fyysinen kunto, kuntoliikunta (791)
alternative label: Fyysinen rasitus, urheilu ja liikunta (791)
alternative label: Fyysinen toimintakyky, kuntoliikunta (791)
alternative label: Hallit, urheilu (791 +)
alternative label: Hapenotto, urheilu (791)
alternative label: Harjoittelu, urheilu (791)
alternative label: Harjoittelupaikat, urheilu (791)
alternative label: Harjoittelutilat, liikunta ja urheilu (791)
alternative label: Harjoitukset, urheilu (791)
alternative label: Harjoitusvaste, urheilu ja liikunta (791)
alternative label: Harrastukset, urheilu (791)
alternative label: Henkinen valmennus (791)
alternative label: Huippu-urheilu (791 +)
alternative label: Intervalliharjoittelu, liikunta (791)
alternative label: Joukkueet, urheilujoukkueet (791)
alternative label: Joukkuelajit (791)
alternative label: Joukkueurheilu (791)
alternative label: Junioriurheilu, urheilu (791)
alternative label: Järjestöt, urheilujärjestöt (791)
alternative label: Jäähallit, urheilu (791)
alternative label: Katsomot, urheilu (791)
alternative label: Keho, liikunta ja urheilu (791)
alternative label: Keinonurmi, urheilukentät (791)
alternative label: Kestokyky, urheilu ja liikunta (791)
alternative label: Kestävyys, urheilu ja liikunta (791)
alternative label: Kestävyysharjoittelu (791)
alternative label: Kestävyyslajit (791)
alternative label: Kesäkisat, urheilu (791)
alternative label: Kesäleirit, urheilu (791)
alternative label: Kesäolympialaiset, urheilu (791)
alternative label: Kilpailukiellot, urheilu (791)
alternative label: Kilpailut, urheilu (791)
alternative label: Kilpailutoiminta (791)
alternative label: Kilparadat (791)
broader: LIIKUNTA. URHEILU. LEIKIT. HUVIT
in scheme: URN:NBN:fi:au:hklj:
narrower: Yleisurheilu
narrower: Uinti. Sukellus
narrower: Pyöräily
narrower: Luistelu
narrower: Hiihto. Alppihiihto. Ampumahiihto
narrower: Purjehdus. Soutu. Melonta
narrower: Hevosurheilu. Ratsastus
narrower: Moottoriurheilu. Lentourheilu
narrower: Muut urheilu- ja liikuntamuodot
notation: 791
related: Liikunnan ja urheilun opetusoppi
related: Keskiasteen koulutus
related: Terveydenhoito
related: Henkilökohtainen terveydenhoito
related: Urheilulääketiede
related: URN:NBN:fi:au:hklj:615
related: URN:NBN:fi:au:hklj:726
related: Liikuntatiede ja -tutkimus. Liikuntapolitiikka
related: Liikunnan ja urheilun historia
related: Suomi
related: URN:NBN:fi:au:hklj:791.083
scope note: Liikunnan yleisteokset. Urheilun yleisteokset Kilpa- ja huippu-urheilun sekä urheiluvalmennukset yleisteokset Amatööri- ja ammattilaisurheilun yleisteokset Kuntourheilun ja kuntoliikunnan yleisteokset Vammaisurheilun ja vammaisliikunnan yleisteokset Vesiurheilu yleensä. Talviurheilu yleensä Liikunta- ja urheilukasvatuksen yleisteokset. Urheilukoulut yleensä Monialaisia urheiluseuroja ja -järjestöjä koskevat yleisteokset Liikunta- ja urheilupaikat ja -tilat yleensä Urheilukeskukset, urheiluopistot, stadionit, urheilukentät, urheilutilat, urheiluhallit, urheilurakennukset ja urheiluvälineet urheilun kannalta yleensä Urheiluvälineteollisuus ja urheiluvälineiden kauppa yleensä Tiettyä urheilulajia, sen historiaa, henkilöhistoriaa, kilpailuja, tuloksia, valmennusta, sääntöjä, tiloja tai välineitä koskevat teokset ko. urheilulajin tai -muodon luokassa
scope note: Allmänna verk om motion. Allmänna verk om sport Allmänna verk om tävlingsidrott och elitidrott samt idrottsträning Allmänna verk om amatöridrott och proffsidrott Allmänna verk om motionsidrott och motion Allmänna verk om handikappidrott och handikappmotion Vattensport i allmänhet. Vintersport i allmänhet Allmänna verk om fysisk fostran. Idrottsskolor i allmänhet Allmänna verk om idrottsföreningar och idrottsorganisationer med flera sportgrenar och idrottsformer på programmet Motionsanläggningar, tävlingsplatser och idrottslokaler i allmänhet Sportcentrum, idrottsinstitut, stadion, idrottsplatser, idrottslokaler, sporthallar, idrottsbyggnader och sportredskap ur sportens synvinkel i allmänhet Industriell tillverkning av och handel med sportredskap i allmänhet Verk som handlar om en bestämd sportgren samt historia, tävlingar, resultat, träning, regler, lokaler eller redskap som hänför sig till den, förs till klassen för sportgrenen eller idrottsformen i fråga @sv

Ruotsin kieli
type: Class
type: Concept
subclass of: GERMAANISET, KELTTILÄISET, BALTTILAISET JA SLAAVILAISET KIELET
alternative label: Kielikurssit, ruotsin kieli (872)
alternative label: Kuullun ymmärtäminen, ruotsin kieli (872)
alternative label: Kuullunymmärtäminen, ruotsin kieli (872)
alternative label: Luetun ymmärtäminen, ruotsin kieli (872)
alternative label: Pohjoisgermaaniset kielet (871 ... 872 +)
alternative label: Pohjoisgermaaniset kielet, kielitiede (871 ... 872 +)
alternative label: Pohjoismaiset kielet (871 ... 872 +)
alternative label: Pohjoismaiset kielet, kielitiede (871 ... 872 +)
alternative label: Riikinruotsi (872 +)
alternative label: Riikinruotsi, kielitiede (872 +)
alternative label: Riikinruotsi, oppikirjat (872)
alternative label: Ruotsin kieli (872 +)
alternative label: Ruotsin kieli, kielitiede (872 +)
alternative label: Ruotsin kieli, oppikirjat (872)
alternative label: Ruotsin ruotsi (872 +)
alternative label: Ruotsin ruotsi, kielitiede (872 +)
alternative label: Ruotsin ruotsi, oppikirjat (872)
alternative label: Ruotsinkieliset, kielipolitiikka (872)
alternative label: Ruotsinmielisyys, kielipolitiikka (872)
alternative label: Ruotsinruotsi (872 +)
alternative label: Ruotsinruotsi, kielitiede (872 +)
alternative label: Ruotsinruotsi, oppikirjat (872)
alternative label: Skandinaaviset kielet (871 ... 872 +)
alternative label: Skandinaaviset kielet, kielitiede (871 ... 872 +)
alternative label: Ylioppilastehtävät, ruotsin kieli (872 +)
alternative label: Hörförståelse, svenska (872) @sv
alternative label: Läsförståelse, svenska (872) @sv
alternative label: Nordgermanska språk (871 ... 872 +) @sv
alternative label: Nordgermanska språk, lingvistik (871 ... 872 +) @sv
alternative label: Nordiska språk (871 ... 872 +) @sv
alternative label: Nordiska språk, lingvistik (871 ... 872 +) @sv
alternative label: Rikssvenska (872 +) @sv
alternative label: Rikssvenska, lingvistik (872 +) @sv
alternative label: Rikssvenska, läroböcker (872) @sv
alternative label: Skandinaviska språk (871 ... 872 +) @sv
alternative label: Skandinaviska språk, lingvistik (871 ... 872 +) @sv
alternative label: Språkkurser, svenska (872) @sv
alternative label: Studentuppgifter, svenska (872 +) @sv
alternative label: Svekomani, språkpolitik (872) @sv
alternative label: Svenska (872 +) @sv
alternative label: Svenska, lingvistik (872 +) @sv
alternative label: Svenska, läroböcker (872) @sv
alternative label: Svenskspråkiga, språkpolitik (872) @sv
alternative label: Sverigesvenska (872 +) @sv
alternative label: Sverigesvenska, lingvistik (872 +) @sv
alternative label: Sverigesvenska, läroböcker (872) @sv
broader: GERMAANISET, KELTTILÄISET, BALTTILAISET JA SLAAVILAISET KIELET
in scheme: URN:NBN:fi:au:hklj:
narrower: Ruotsin kielen äänneoppi
narrower: Ruotsin kielen etymologia ja onomastiikka
narrower: Ruotsin kielen yksikieliset sanakirjat
narrower: Ruotsin kielen kielioppi ja semantiikka
narrower: Ruotsin kielen murteet
narrower: Suomenruotsi
narrower: Ruotsin kielen ainekirjoitusoppaat
narrower: Ruotsin kielen historia
notation: 872
preferred label: Swedish @en
preferred label: Svenska @sv
related: Oppimisen psykologia
related: Kirjallisuuden ja kielten opetusoppi
related: URN:NBN:fi:au:hklj:188.4
related: URN:NBN:fi:au:hklj:2
related: Sähköposti. Verkkojuttelu
related: URN:NBN:fi:au:hklj:627.7512
related: Ruotsinkielisen kirjallisuuden historia ja tutkimus
related: Suomenruotsalaisen kirjallisuuden historia ja tutkimus
related: Kielipsykologia. Kielisosiologia. Kielipolitiikka
related: URN:NBN:fi:au:hklj:860
related: Pohjoismaiset kielet
related: URN:NBN:fi:au:hklj:872.03
related: URN:NBN:fi:au:hklj:872.09
scope note: Ruotsin kieltä tai sen tutkimusta koskevat yleisteokset Ruotsin kielen yleiset oppi- ja harjoituskirjat sekä kielikurssit Ruotsin kielen opiskeluun liittyvät selityksillä tai sanastolla varustetut lukemistot ja lukukirjat Eri ammatteihin ja aloihin liittyvät ruotsin kielen oppi- ja harjoituskirjat, kielikurssit ja lukemistot Kirjakieli. Puhekieli. Oikeakielisyys. Oikeakielisyysoppaat. Kielenhuolto Tyylioppi ja tyylintutkimus kielitieteen kannalta. Leksikologia Kielisosiologia. Kielipsykologia. Sosiolingvistiikka. Psykolingvistiikka. Kielipolitiikka
scope note: Allmänna verk om svenska eller om forskning i svenska Allmänna läroböcker och övningsböcker samt språkkurser i svenska Textböcker och läseböcker för studier i svenska med förklaringar och ordlistor Läroböcker, övningsböcker, språkkurser och textböcker i svenska som rör olika yrken och branscher Skriftspråk. Talspråk. Språkriktighet. Handböcker i språkriktighet. Språkvård Stilistik och stilforskning ur språkvetenskaplig synvinkel. Ordlära (lexikologi) Språksociologi. Språkpsykologi. Sociolingvistik. Psykolingvistik. Språkpolitik @sv

HENKILÖ- JA SUKUHISTORIA
type: Class
type: Concept
subclass of: URN:NBN:fi:au:hklj:900
alternative label: Aateli, historia, henkilöhistoria (990 ... 997 +)
alternative label: Aatelisarvot, aateli, historia, henkilöhistoria (990 ... 997 +)
alternative label: Aateliset, historia, henkilöhistoria (990 ... 997 +)
alternative label: Aatelisto, historia, henkilöhistoria (990 ... 997 +)
alternative label: Adoptiolapset, elämäkerrat ja muistelmat (990 +)
alternative label: Akateemikot, elämäkerrat ja muistelmat (990 ... 997 +)
alternative label: Alkoholistit, elämäkerrat ja muistelmat (990 ... 997 +)
alternative label: Anakoreetit, elämäkerrat ja muistelmat (990 ... 997 +)
alternative label: Assistentit, elämäkerrat ja muistelmat (990 ... 997 +)
alternative label: Biografiat (990 +)
alternative label: Boheemit, elämäkerrat ja muistelmat (990 +)
alternative label: Edelläkävijät, henkilöhistoria (990 +)
alternative label: Eksentrikot, elämäkerrat ja muistelmat (990 +)
alternative label: Elämäkerrat (990 +)
alternative label: Emännät, elämäkerrat ja muistelmat (990 +)
alternative label: Entisöijät, elämäkerrat ja muistelmat (990 +)
alternative label: Erakot, elämäkerrat ja muistelmat (990 ... 997 +)
alternative label: Eremiitit, elämäkerrat ja muistelmat (990 ... 997 +)
alternative label: Eunukit, elämäkerrat ja muist. (990 +)
alternative label: Gangsterit, elämäkerrat ja muistelmat (990 +)
alternative label: Geisat, elämäkerrat ja muistelmat (990)
alternative label: Ghetot, elämäkerrat ja muistelmat (990 +)
alternative label: Haaremit, elämäkerrat ja muistelmat (990)
alternative label: Haastattelut, henkilöhistoria (990 +)
alternative label: Hautausmaat, henkilöhistoria (990 +)
alternative label: Hengellinen elämä, elämäkerrat ja muist. (990 +)
alternative label: Hengellinen herätys, elämäkerrat ja muistelmat (990 ... 997 +)
alternative label: Henkilöhistoria (990 +)
alternative label: Henkilökuvat, elämäkerrat ja muistelmat (990 +)
alternative label: Henkilöt (990 +)
alternative label: Herätys, elämäkerrat ja muistelmat (990 ... 997 +)
alternative label: Historia, henkilöhistoria (990 +)
alternative label: Huijarit, elämäkerrat ja muistelmat (990 +)
alternative label: Huumeongelmaiset, elämäkerrat ja muistelmat (990 ... 997 +)
alternative label: Huutolaiset, elämäkerrat ja muistelmat (990 +)
alternative label: Huutolaislapset, elämäkerrat ja muistelmat (990 +)
alternative label: Ilotytöt, elämäkerrat ja muistelmat (990 +)
alternative label: Informaatikot, elämäkerrat ja muistelmat (990 +)
alternative label: Irtolaiset, elämäkerrat ja muistelmat (990 +)
alternative label: Isännät, elämäkerrat ja muistelmat (990 +)
alternative label: Isät, elämäkerrat ja muistelmat (990 ... 997 +)
alternative label: Itkijät, elämäkerrat ja muistelmat (990 +)
alternative label: Julkisuuden henkilöt, henkilöhistoria (990 +)
alternative label: KGB, elämäkerrat ja muistelmat (990 ... 997 +)
alternative label: Kansalliset suurmiehet (990 +)
alternative label: Kansanelämä, elämäkerrat ja muist. (990 +)
alternative label: Karavaanarit, elämäkerrat ja muistelmat (990 ... 997 +)
alternative label: Karkaaminen, elämäkerrat ja muist. (990 ... 997 +)
alternative label: Kauneuskuningattaret, elämäkerrat ja muistelmat (990 +)
alternative label: Kerjäläiset, elämäkerrat ja muistelmat (990 +)
alternative label: Keräilijät, henkilöhistoria (990 ... 997 +)
alternative label: Kerääjät, henkilöhistria (990 ... 997 +)
alternative label: Keskitysleirit, muistelmat (990 ... 997 +)
alternative label: Kesäasukkaat, henkilöhistoria (990 ... 997 +)
broader: URN:NBN:fi:au:hklj:900
in scheme: URN:NBN:fi:au:hklj:
narrower: Elämäkerralliset hakuteokset
narrower: Suomi
narrower: Filosofit. Psykologit. Kasvatustieteiden edustajat
narrower: URN:NBN:fi:au:hklj:992
narrower: Yhteiskuntaelämän, joukkotiedotuksen, liikenteen ja maanpuolustuksen edustajat
narrower: Maantieteilijät. Tutkimusmatkailijat. Löytöretkeilijät.Kansatieteilijät. Antropologit
narrower: Luonnontieteilijät. Matemaatikot
narrower: Lääketieteen, tuotantoelämän, tekniikan, kaupan ja talous-elämän edustajat
narrower: Humanististen tieteiden edustajat
narrower: Sukuhistoria. Sukututkimus
notation: 990
related: Pelastusoppi. Kristillinen antropologia
related: URN:NBN:fi:au:hklj:323
related: Poliittiset ja aatteelliset vähemmistöt
related: URN:NBN:fi:au:hklj:617
related: URN:NBN:fi:au:hklj:618.24
related: URN:NBN:fi:au:hklj:618.3
related: URN:NBN:fi:au:hklj:909
related: URN:NBN:fi:au:hklj:919
scope note: Tässä ja luokissa 991-997+ elämäkerrat, omaelämäkerrat, muistelmat, päiväkirjat ja kirjekokoelmat, paitsi taiteilijoiden, urheilijoiden ja kirjailijoiden, jotka ovat eri taidemuotojen historian, eri urheilulajien ja kirjallisuudenhistorian luokissa Henkilökohtaista uskoon tulemista tai parannuksen tekoa koskevat muistelmat ja henkilöhistorialliset teokset kohdehenkilön edustaman alan tai ammatin mukaan luokissa 990-997+ Eri sairauksia, niistä paranemista tai kuolemista koskevat muistelmat ja henkilöhistorialliset teokset kohdehenkilön edustaman alan tai ammatin mukaan luokissa 990-997+ Tässä esim. kirja-alalla toimivat henkilöt, kuten kirjankustantajat, kirjakauppiaat ja kirjastonhoitajat sekä museon- ja arkistonhoitajat Tässä myös sellaisten henkilöiden henkilöhistoria, joiden ei voi katsoa edustavan mitään erikoisalaa tai ammattia tai jotka ovat tulleet tunnetuiksi toiminnastaan monilla eri aloilla Elämäkerralliset teokset, joissa enemmän kuin henkilöhistoriaa tarkastellaan jotakin tiettyä alaa alan mukaisessa luokassa Epävarmoissa tapauksissa on etusija luokilla 990-997+
scope note: Hit och till klasserna 991-997+ biografier, självbiografier, memoarer, dagböcker och brevsamlingar, undantaget de som hänför sig till konstnärer, idrottsmän och författare, vilka förs till klasserna för olika konstformers och sportgrenars historia samt olika litteraturhistoriska klasser Memoarer och personhistoriska verk som handlar om personlig frälsning eller bättring förs enligt det område eller yrke som den biograferade personen representerar till klasserna 990-997+ Memoarer och personhistoriska verk som handlar om olika sjukdomar och tillfrisknande från dem eller dessa sjukdomar som dödsorsak, förs enligt det område eller yrke som den biograferade personen representerar till klasserna 990-997+ Hit t.ex. personer verksamma inom bokbranschen, såsom bokförläggare, bokhandlare och bibliotekarier samt museiintendenter och arkivarier Hit också sådana personers personhistoria som inte kan anses representera något specialområde eller yrke eller sådana personer som har blivit kända genom sin verksamhet inom flera olika områden Biografiska verk som mer än om personhistoria handlar om ett bestämt område förs till klassen för området I osäkra fall ges företräde åt klasserna 990-997+ @sv

KIRJA-ALA
type: Class
type: Concept
alternative label: Kirja-ala (000)
alternative label: Kirjoitettu sana (000)
alternative label: Bokbranschen (000) @sv
alternative label: Skrivna ordet (000) @sv
in scheme: URN:NBN:fi:au:hklj:
narrower: Kirjoitus. Kirjoitustaito
narrower: Symbolit. Koodit. Merkkijärjestelmät
narrower: Kirjan historia
narrower: Kustannustoimi. Kirjakauppa
narrower: Kirjapainotaito. Graafinen teollisuus
narrower: Kirjansidonta. Kirjansidontataide
narrower: Lukeminen. Lukutaito
narrower: Johdatukset tieteisiin
narrower: URN:NBN:fi:au:hklj:010
narrower: KIRJASTOT. KIRJASTOTOIMI
narrower: YLEISET TIETOSANAKIRJAT
narrower: YLEISET KOKOOMATEOKSET
narrower: YLEISET KAUSIJULKAISUT
narrower: URN:NBN:fi:au:hklj:060
narrower: SANOMALEHDET
notation: 000
preferred label: BOOKS AND PUBLISHING @en
preferred label: BOKVÄSEN @sv
related: URN:NBN:fi:au:hklj:800
scope note: Teokset, jotka koskevat kirjaa tai kirjoitettua sanaa yleensä Teokset, jotka koskevat sekä luku- että kirjoitustaitoa Teokset, jotka koskevat sekä kirja- että kirjastoalaa
scope note: Verk som rör boken eller det skrivna ordet i allmänhet Verk som rör läs- och skrivkonst Verk som rör både bokväsen och biblioteksverksamhet @sv
top concept of: URN:NBN:fi:au:hklj:

YLEINEN USKONTOTIEDE. YLEINEN USKONNONFILOSOFIA
type: Class
type: Concept
alternative label: Pyhät esineet, uskonto (200)
alternative label: Uskonto (200)
alternative label: Uskonto, oppikirjat (200)
alternative label: Heliga föremål, religion (200) @sv
alternative label: Religion (200) @sv
alternative label: Religion, läroböcker (200) @sv
in scheme: URN:NBN:fi:au:hklj:
narrower: Uskonnonfilosofia
narrower: Teosofia. Antroposofia. Vapaamuurarius
narrower: Elämä. Kuolema
narrower: Luominen. Kehitys
narrower: Uskonto ja valtio
narrower: Uskontososiologia
narrower: URN:NBN:fi:au:hklj:209
narrower: URN:NBN:fi:au:hklj:210
narrower: RAAMATTU. RAAMATUNTUTKIMUS
narrower: KRISTILLINEN DOGMATIIKKA
narrower: KÄYTÄNNÖLLINEN TEOLOGIA
narrower: EVANKELIS-LUTERILAINEN KIRKKO
narrower: URN:NBN:fi:au:hklj:260
narrower: KIRKKOHISTORIA
narrower: URN:NBN:fi:au:hklj:280
notation: 200
preferred label: SCIENCE OF RELIGION. GENERAL RELIGIOUS PHILOSOPHY @en
preferred label: ALLMÄN RELIGIONSVETENSKAP. ALLMÄN RELIGIONSFILOSOFI @sv
related: RAJATIETO
scope note: Teokset, joissa on sekä yleistä uskontotiedettä että yleistä uskonnonfilosofiaa Yleiset uskonnon oppikirjat Uskonnon oppikirjat, jotka koskevat sekä kristinuskoa että muita uskontoja
scope note: Verk som innehåller både allmän religionsvetenskap och allmän religionsfilosofi Allmänna läroböcker i religion Läroböcker i religion som rör både kristendom och övriga religioner @sv
top concept of: URN:NBN:fi:au:hklj:

Käytös- ja tapatieto
type: Class
type: Concept
subclass of: URN:NBN:fi:au:hklj:370
alternative label: Adressit, käytös- ja tapatieto (379 +)
alternative label: Ei-verbaalinen viestintä, käytös-ja tapatieto (379 +)
alternative label: Etiketti (379 +)
alternative label: Farkut, käytös- ja tapatieto (379 +)
alternative label: Farmarihousut, käytös- ja tapatieto (379 +)
alternative label: Hyvä maku, käytös- ja tapatieto (379 +)
alternative label: Hyvä tapa, käytös- ja tapatieto (379 +)
alternative label: Hyvästely, käytös- ja tapatieto (379 +)
alternative label: Juhlapuheet, käytösoppaat (379 +)
alternative label: Kihlaus, käytös- ja tapatieto (379 +)
alternative label: Kiitokset, käytös- ja tapatieto (379 +)
alternative label: Kirjeenvaihto, käytös-ja tapatieto (379)
alternative label: Kiroilu, käytös- ja tapatieto (379)
alternative label: Kohteliaisuus (379 +)
alternative label: Kyläily, käytös- ja tapatieto (379 +)
alternative label: Kättely, tervehdykset (379 +)
alternative label: Käyntikortit, käytös- ja tapatieto (379)
alternative label: Käyttäytyminen, käytös- ja tapatieto (379 +)
alternative label: Käyttäytymisoppaat (379 +)
alternative label: Käytösoppaat (379 +)
alternative label: Käytöstavat (379 +)
alternative label: Lahjat, käytös- ja tapatieto (379 +)
alternative label: Lapsukset, etiketti (379 +)
alternative label: Liikematkat, liikemiesten käytösoppaat (379 +)
alternative label: Liputus (379 +)
alternative label: Muoti, käytös- ja tapatieto (379 +)
alternative label: Nimikortit, käytös- ja tapatieto (379)
alternative label: Perinteet, käytös- ja tapatieto (379 +)
alternative label: Puhe, käytösoppaat (379 +)
alternative label: Puheet, käytösoppaat (379 +)
alternative label: Puhelinkäyttäytyminen, käytös- ja tapatieto (379 +)
alternative label: Puhuminen, käytösoppaat (379 +)
alternative label: Puhuttelumuodot, käytösoppaat (379 +)
alternative label: Pukeutuminen, käytös- ja tapatieto (379 +)
alternative label: Ruokailutavat, käytös- ja tapatieto (379 +)
alternative label: Seuraelämä, käytösoppaat (379 +)
alternative label: Seurustelu, käytösoppaat (379 +)
alternative label: Seurustelutavat, käytösoppaat (379 +)
alternative label: Sosiaalinen elämä, käytösoppaat (379 +)
alternative label: Sosiaaliset taidot, käytös- ja tapatieto (379 +)
alternative label: Suutelu, käytös- ja tapatieto (379 +)
alternative label: Taidot, käytöstavat (379 +)
broader: URN:NBN:fi:au:hklj:370
in scheme: URN:NBN:fi:au:hklj:
narrower: Juhlien järjestäminen
notation: 379
related: Psychology of expression {@en
related: URN:NBN:fi:au:hklj:371
related: Järjestötoiminta. Kokoustekniikka
related: URN:NBN:fi:au:hklj:473
related: URN:NBN:fi:au:hklj:473.1
related: URN:NBN:fi:au:hklj:475
related: URN:NBN:fi:au:hklj:475.1
related: URN:NBN:fi:au:hklj:476
related: URN:NBN:fi:au:hklj:476.1
related: URN:NBN:fi:au:hklj:476.11
related: URN:NBN:fi:au:hklj:476.12
related: URN:NBN:fi:au:hklj:476.5
related: URN:NBN:fi:au:hklj:476.6
related: URN:NBN:fi:au:hklj:476.7
related: URN:NBN:fi:au:hklj:476.8
related: Kulttuuriantropologia. Sosiaaliantropologia
related: Kotijuhlien järjestäminen. Kutsujen järjestäminen
related: Pukeutuminen. Kauneudenhoito
related: Kauneudenhoito
related: Kunniamerkit. Arvonimet. Mitalitiede
related: URN:NBN:fi:au:hklj:919
related: Vanhan ajan kulttuurihistoria
related: Keskiajan kulttuurihistoria 400-1499
related: Uuden ajan kulttuurihistoria 1500-1788
related: Uusimman ajan kulttuurihistoria 1789-1913
related: Nykyajan kulttuurihistoria 1914-1938
related: Nykyajan kulttuurihistoria 1939-
related: Erotiikan historia
related: Muodin historia
scope note: Tässä ja luokassa 379.1 eri maita ja kulttuureja koskevat käyttäytymis- ja seurusteluoppaat Käytöstavat. Etiketti. Hyvä käytös. Tapakasvatus Matkailijoille ja liikemiehille tarkoitetut käytösoppaat
scope note: Hit och till klass 379.1 handböcker om umgängesformer och etikett i olika länder och kulturer Uppförande. Etikett. Hyfs. Umgängesfostran Etiketthandböcker för turister och affärsmän @sv

Vesien suojelu
type: Class
type: Concept
subclass of: Ympäristönsuojelu. Luonnonsuojelu
alternative label: Alkalointi, vesistöjen kunnostus (508.63)
alternative label: Benthos, vesiensuojelu (508.63)
alternative label: Biologinen vedenpuhdistus, vesiensuojelu (508.63)
alternative label: Deltat, vesiensuojelu (508.63)
alternative label: Fosfaatit, vesien saastuminen (508.63)
alternative label: Hajakuormitus, vesien saastuminen (508.63)
alternative label: Hapan laskeuma, vesien happamoituminen (508.63)
alternative label: Happamoituminen, vesien happamoituminen (508.63)
alternative label: Happikato, vesistöt (508.63)
alternative label: Happosateet, vesien happamoituminen (508.63)
alternative label: Hulevesi, vesien saastuminen (508.63)
alternative label: Humus, vesien ekologinen tila (508.63)
alternative label: Humusjärvet, vesien ekologinen tila (508.63)
alternative label: Huuhtoutuminen, vesien saastuminen (508.63)
alternative label: Hydrobiologia, vesiensuojelu (508.63)
alternative label: Hydrosfääri, vesiensuojelu (508.63)
alternative label: Ilmastus, vesien kunnostus (508.63)
alternative label: Itämeri, merensuojelu (508.63)
alternative label: Joenperkaus, vesiensuojelu (508.63)
alternative label: Joenuomat, vesiensuojelu (508.63)
alternative label: Joet, vesiensuojelu (508.63)
alternative label: Jokisuistot, vesiensaastuminen (508.63)
alternative label: Jokisuistot, vesiensuojelu (508.63)
alternative label: Järvenlasku, vesiensuojelu (508.63)
alternative label: Järvet, vesiensaastuminen (508.63)
alternative label: Järvet, vesiensuojelu (508.63)
alternative label: Jätevesi (508.63)
alternative label: Jätevesi, vesien saastuminen (508.63)
alternative label: Jätevesi, vesiensuojelu (508.63)
alternative label: Jätevesikuormitus (508.63)
alternative label: Jäteöljy, öljyvahingot, vesistöt (508.63)
alternative label: Kalakannat, vesiensuojelu (508.63)
alternative label: Kalakuolemat (508.63)
alternative label: Kalasto, vesiensuojelu (508.63)
alternative label: Kalavedet, vesiensuojelu (508.63)
alternative label: Karjanlanta, vesien rehevöityminen (508.63)
alternative label: Koralliriutat, merensuojelu (508.63)
alternative label: Koskenperkaus, koskiensuojelu (508.63)
alternative label: Kosket, suojelu (508.63)
alternative label: Koskiensuojelu (508.63)
alternative label: Koskivoima, vesiensuojelu (508.63)
broader: Ympäristönsuojelu. Luonnonsuojelu
in scheme: URN:NBN:fi:au:hklj:
notation: 508.63
related: Etiikka. Moraalifilosofia
related: Ympäristöoikeus. Talousoikeus
related: Vesioikeus
related: URN:NBN:fi:au:hklj:342
related: Kehitysmaiden taloudelliset olot
related: Aluepolitiikka. Ympäristöpolitiikka
related: Hydrologia
related: Maaperän, metsien ja soiden suojelu
related: BIOLOGIA
related: Ekologia. Eliömaantiede
related: URN:NBN:fi:au:hklj:613.3
related: URN:NBN:fi:au:hklj:620
related: Energia
related: Vesirakennus. Vesikulkuneuvot
related: Satamat. Satamatekniikka
related: Vesiväylät. Vesien säännöstely
related: Vesijohto-, viemäri- ja vedenpuhdistustekniikka
related: Vesikulkuneuvot
related: Laivat. Laivanrakennus
related: URN:NBN:fi:au:hklj:625.72
related: Muut vesikulkuneuvot
related: Sähköenergian tuottaminen. Voimalatekniikka
related: Paperi- ja selluloosateollisuus
related: Kaivos- ja kaivannaisteollisuus
related: Öljy. Maakaasu
related: URN:NBN:fi:au:hklj:650
related: Kalastus
related: URN:NBN:fi:au:hklj:675
related: Markkinointi. Asiakaspalvelu
related: Kuluttajanvalistus
related: Luonnon- ja kulttuurimaiseman suunnittelu
scope note: Sisävesien ja merten suojelu. Vesien tila. Vesivarat Vesien saastuminen ja sen vaikutukset eläimiin, kasveihin ja ihmiseen Vesien rehevöityminen ja happamoituminen. Happikato. Leväkukinnat. Kalakuolemat. Ympäristömyrkyt ja öljyvahingot vesistöjen kannalta Vesien säännöstely ja vesirakennus vesiensuojelun kannalta Koskien suojelu. Vesistöjen kunnostus
scope note: Skydd av sjöar och hav. Vattnets tillstånd i sjöar och hav. Vattenreserver Nedsmutsning av vatten och dess inverkan på djur, växter och människor Eutrofiering och försurning av vatten. Syrebrist. Algblomning. Fiskdöd. Miljögifter och oljeolyckor med hänsyn till vattenområden Vattenreglering och vattenbyggnad ur vattenskyddssynvinkel Skydd av forsar. Sanering av vattendrag och sjöar @sv

Eläinsuojelu
type: Class
type: Concept
subclass of: URN:NBN:fi:au:hklj:590
alternative label: Ansapyynti, eläinsuojelu (590.86)
alternative label: Bioetiikka, eläinsuojelun etiikka (590.86)
alternative label: Delfinaariot, eläinsuojelu (590.86)
alternative label: Eläimet, eläinsuojelu (590.86)
alternative label: Eläinaktivismi (590.86)
alternative label: Eläinkokeet, eläinsuojelu (590.86)
alternative label: Eläinliikkeet (590.86)
alternative label: Eläinoikeusliikkeet (590.86)
alternative label: Eläinrääkkäys (590.86)
alternative label: Eläinsuojelu, yksittäisen eläimen suojelu (590.86)
alternative label: Eläinsuojeluasiamiehet, eläinsuojeluvalvonta (590.86)
alternative label: Eläinsuojeluvalvonta (590.86)
alternative label: Eläinsuojeluyhdistykset (590.86)
alternative label: Eläinten oikeudet (590.86)
alternative label: Eläintenoikeusliikkeet (590.86)
alternative label: Eläinyksilöt, suojelu (590.86)
alternative label: Geenimuuntelu, eläinsuojelu (590.86)
alternative label: Geenitekniikka, eläinsuojelu (590.86)
alternative label: Geeniteknologia, eläinsuojelu (590.86)
alternative label: Heitteillejättö, eläinsuojelu (590.86)
alternative label: Härkätaistelut, eläinsuojelu (590.86)
alternative label: Ihminen-luontosuhde, eläinsuojelu (590.86)
alternative label: Kansainväliset liikkeet, eläinoikeusliikkeet (590.86)
alternative label: Kansalaisliikkeet, eläinoikeusliikkeet (590.86)
alternative label: Kansalaisosallistuminen, eläinoikeusliikkeet (590.86)
alternative label: Kansalaisten osallistuminen, eläinoikeusliikkeet (590.86)
alternative label: Kansalaistoiminta, eläinoikeusliikkeet (590.86)
alternative label: Kasvissyönti, eläinsuojelu (590.86)
alternative label: Koe-eläimet, eläinsuojelu (590.86)
alternative label: Kotieläimet, eläinsuojelu (590.86)
alternative label: Kärsimys, eläinsuojelu (590.86)
alternative label: Lintuhäkit, eläinsuojelu (590.86)
alternative label: Luontosuhde, eläinsuojelu (590.86)
alternative label: Löytöeläimet (590.86)
alternative label: Myötätunto, eläinten oikeudet (590.86)
alternative label: Oikeudet, eläinten oikeudet (590.86)
alternative label: Painostusryhmät, eläinsuojeluliikkeet (590.86)
alternative label: Pentutehtailu, eläinsuojelu (590.86 +)
alternative label: Protestiliikkeet, eläinsuojeluliikkeet (590.86)
alternative label: Sirkuseläimet, eläinsuojelu (590.86)
alternative label: Suojelu, eläinsuojelu (590.86)
broader: URN:NBN:fi:au:hklj:590
in scheme: URN:NBN:fi:au:hklj:
notation: 590.86
related: Ympäristöoikeus. Talousoikeus
related: Ympäristönsuojelu. Luonnonsuojelu
related: Uhanalaiset lajit. Luonnonsuojelualueet
related: URN:NBN:fi:au:hklj:580.85
related: Nisäkkäät
related: URN:NBN:fi:au:hklj:613.1
related: URN:NBN:fi:au:hklj:616
related: Lääketieteellinen kemia ja fysiikka
related: URN:NBN:fi:au:hklj:616.2
related: URN:NBN:fi:au:hklj:616.3
related: Immunologia. Serologia. Verioppi
related: URN:NBN:fi:au:hklj:654
related: Hevoset
related: Nautaeläimet
related: Vuohet ja lampaat
related: Siat
related: Siipikarja
related: Turkiseläimet
related: Porot
related: Hyönteiset
related: Lemmikkieläimet
related: Koirat
related: Kissat
related: Pikkunisäkkäät
related: Häkkilinnut
related: Akvaariot
related: Metsästys. Kalastus
related: Metsästys
related: Kalastus
related: Eläinlääketiede
related: URN:NBN:fi:au:hklj:691.12
scope note: Eläinten oikeudet. Eläinyksilöiden kohtelu ja suojelu Veganismi ja vegetarismi eläinsuojelun kannalta Luonnonvaraisten eläinyksilöiden suojelu Koe-eläinten ja kotieläinten suojelu Eläinrääkkäys. Eläinsuojeluvalvonta
scope note: Djurens rättigheter. Behandling och skydd av enskilda djur Veganism och vegetarianism ur djurskyddssynvinkel Skydd av enskilda vilda djur Skydd av försöksdjur och husdjur Djurplågeri. Djurskyddsövervakning @sv

Iho. Ihotaudit. Sukupuolielimet. Sukupuolitaudit
type: Class
type: Concept
subclass of: URN:NBN:fi:au:hklj:617
alternative label: Akne, ihotaudit (617.6)
alternative label: Albiinous, ihotaudit (617.6)
alternative label: Albinismi, ihotaudit (617.6)
alternative label: Allergia, allergiset ihottumat (617.6)
alternative label: Allergiat, allergiset ihottumat (617.6)
alternative label: Atopia, allergiset ihottumat (617.6)
alternative label: Auringonsuoja-aineet, ihonhoito, ihotaudit (617.6)
alternative label: Dermatologia (617.6)
alternative label: Ekseemat (617.6)
alternative label: Herpesvirukset, sukupuolitaudit (617.6)
alternative label: Hiivasienet, iho- ja sukupuolitaudit (617.6)
alternative label: Hiki, iho, hikirauhaset (617.6)
alternative label: Hilse, iho, ihotaudit (617.6)
alternative label: Hilsetystauti (617.6)
alternative label: Hiukset, anatomia ja fysiologia (617.6)
alternative label: Hiustenlähtö, ihotaudit (617.6)
alternative label: Hiustensiirto, hiustenlähtö, ihotaudit (617.6)
alternative label: Iho, anatomia (617.6)
alternative label: Iho, fysiologia (617.6)
alternative label: Iho- ja sukupuolitaudit (617.6)
alternative label: Ihonhoito, ihotaudit (617.6)
alternative label: Ihosairaudet (617.6)
alternative label: Ihotaudit (617.6)
alternative label: Ihotautioppi (617.6)
alternative label: Ihottumat (617.6)
alternative label: Ilmastohoito, ihotaudit (617.6)
alternative label: Ilmastokuntoutus, ihotaudit (617.6)
alternative label: Kaljuuntuminen, ihotaudit (617.6)
alternative label: Kollageenit, ihokudos (617.6)
alternative label: Kosketusaisti, ihmisen (617.6)
alternative label: Kutina (617.6)
alternative label: Kutina, ihotaudit (617.6)
alternative label: Limakalvot (617.6)
alternative label: Limakalvot, anatomia ja fysiologia (617.6)
alternative label: Lisääntymisterveys, sukupuolitaudit (617.6)
alternative label: Luomet, iho ja ihotaudit (617.6)
alternative label: Mykoosit, ihotaudit (617.6)
alternative label: Palovammat, ihotautioppi (617.6)
alternative label: Pigmentti, iho, ihotaudit (617.6)
alternative label: Psoriaasi (617.6)
alternative label: Psoriasis (617.6)
alternative label: Seksitaudit (617.6)
broader: URN:NBN:fi:au:hklj:617
in scheme: URN:NBN:fi:au:hklj:
notation: 617.6
related: URN:NBN:fi:au:hklj:181.9
related: URN:NBN:fi:au:hklj:332.22
related: URN:NBN:fi:au:hklj:371.6
related: URN:NBN:fi:au:hklj:373
related: URN:NBN:fi:au:hklj:576
related: Anatomia
related: URN:NBN:fi:au:hklj:612
related: URN:NBN:fi:au:hklj:613.1
related: URN:NBN:fi:au:hklj:613.3
related: URN:NBN:fi:au:hklj:613.31
related: URN:NBN:fi:au:hklj:613.5
related: Seksologia
related: URN:NBN:fi:au:hklj:615
related: URN:NBN:fi:au:hklj:615.1
related: URN:NBN:fi:au:hklj:615.3
related: URN:NBN:fi:au:hklj:615.8
related: URN:NBN:fi:au:hklj:616
related: URN:NBN:fi:au:hklj:616.2
related: URN:NBN:fi:au:hklj:616.3
related: URN:NBN:fi:au:hklj:617.1
related: Syöpätaudit
related: URN:NBN:fi:au:hklj:617.4
related: Tartuntataudit
related: URN:NBN:fi:au:hklj:617.7
related: Raskaus. Sikiönkehitys. Synnytys. Gynekologia
related: Virtsaelimet. Virtsaelinten taudit
related: Allergiat
related: URN:NBN:fi:au:hklj:691.1
related: URN:NBN:fi:au:hklj:691.12
related: Kauneudenhoito
scope note: Iho, sen anatomia ja fysiologia Teokset, jotka koskevat sekä miehen että naisen sukupuolielimiä tai niiden anatomiaa ja fysiologiaa Ihotaudit, niiden ennaltaehkäisy, diagnostiikka, hoito ja patologia Ihottumat. Allergiset ihottumat. Psoriasis. Maitorupi. Akne Sukupuolitaudit niiden diagnostiikka, hoito ja patologia
scope note: Huden, dess anatomi och fysiologi Verk som handlar om både kvinnans och mannens könsorgan eller deras anatomi och fysiologi Hudsjukdomar, förebyggande och behandling av dem samt deras diagnostik och patologi Eksem. Allergiska utslag. Psoriasis. Mjölkskorv. Akne Könssjukdomar och behandling av dem samt deras diagnostik och patologi @sv

Neuroosit
type: Class
type: Concept
subclass of: Psyykkiset sairaudet. Mielenterveyden häiriöt
alternative label: Agorafobia (618.67)
alternative label: Ahmimishäiriö (618.67)
alternative label: Ahmintahäiriö (618.67)
alternative label: Ahtaan paikan kammo (618.67)
alternative label: Akrofobia (618.67)
alternative label: Anoreksia (618.67)
alternative label: Anorexia nervosa (618.67)
alternative label: Aukiokammo (618.67)
alternative label: BED, syömishäiriöt (618.67)
alternative label: Bulimia (618.67)
alternative label: Esiintymisjännitys, pelkoneuroosit (618.67)
alternative label: Esiintymiskuume, pelkoneuroosit (618.67)
alternative label: Esiintymispelko, pelkoneuroosit (618.67)
alternative label: Estot, neuroosit, pelot (618.67)
alternative label: Fobiat (618.67)
alternative label: Hamstraus, pakko-oireinen häiriö (618.67)
alternative label: Hypokondria (618.67)
alternative label: Hypokondrinen häiriö (618.67)
alternative label: Inho, fobiat (618.67)
alternative label: Julkisten paikkojen pelko (618.67)
alternative label: Kahvikuppineuroosi (618.67)
alternative label: Kauhu, fobiat (618.67)
alternative label: Klaustrofobia (618.67)
alternative label: Kohtauksittainen ahmimishäiriö, syömishäiriöt (618.67)
alternative label: Korkean paikan kammo (618.67)
alternative label: Kuolemanpelko, pelkoneuroosit (618.67)
alternative label: Laihuushäiriö (618.67)
alternative label: Lentopelko, pelkoneuroosit (618.67)
alternative label: Lihavan ahmimishäiriö, syömishäiriöt (618.67)
alternative label: Luulosairaus (618.67)
alternative label: Luulotauti (618.67)
alternative label: Luulotautisuus (618.67)
alternative label: Murhapoltto, pyromania (618.67)
alternative label: Neurastenia (618.67)
alternative label: Neuroosit (618.67)
alternative label: Ortoreksia (618.67)
alternative label: Pakko-oireinen häiriö (618.67)
alternative label: Pakkoajatukset (618.67)
alternative label: Pakkomielteet (618.67)
alternative label: Pakkoneuroosit (618.67)
alternative label: Pakokauhu (618.67)
alternative label: Paniikki, pelot (618.67)
broader: Psyykkiset sairaudet. Mielenterveyden häiriöt
in scheme: URN:NBN:fi:au:hklj:
notation: 618.67
related: URN:NBN:fi:au:hklj:120
related: Havaintopsykologia
related: Perinnöllisyyspsykologia
related: Kehityspsykologia. Eri ikäkausien psykologia
related: URN:NBN:fi:au:hklj:181.9
related: URN:NBN:fi:au:hklj:332.22
related: URN:NBN:fi:au:hklj:371.6
related: URN:NBN:fi:au:hklj:373
related: URN:NBN:fi:au:hklj:576
related: URN:NBN:fi:au:hklj:613.3
related: URN:NBN:fi:au:hklj:613.31
related: URN:NBN:fi:au:hklj:613.5
related: URN:NBN:fi:au:hklj:615
related: URN:NBN:fi:au:hklj:615.1
related: URN:NBN:fi:au:hklj:615.3
related: URN:NBN:fi:au:hklj:615.8
related: URN:NBN:fi:au:hklj:616
related: URN:NBN:fi:au:hklj:616.2
related: URN:NBN:fi:au:hklj:616.3
related: URN:NBN:fi:au:hklj:617
related: URN:NBN:fi:au:hklj:617.1
related: URN:NBN:fi:au:hklj:617.2
related: URN:NBN:fi:au:hklj:617.4
related: URN:NBN:fi:au:hklj:617.99
related: URN:NBN:fi:au:hklj:618.2
related: URN:NBN:fi:au:hklj:618.8
related: Analyyttinen psykoterapia
related: URN:NBN:fi:au:hklj:618.85
related: URN:NBN:fi:au:hklj:618.86
related: Mielisairaanhoito
scope note: Pelot. Fobiat. Anorexia nervosa. Bulimia. Paniikkihäiriö Neuroosien ennaltaehkäisy, diagnostiikka ja hoito Neuroosien syyt. Neuroosien psykopatologia Neuroosien lääke- ja terapiahoito
scope note: Rädslor. Fobier. Anorexia nervosa. Bulimi. Paniksyndrom Förebyggande och behandling av neuroser samt deras diagnostik Orsaker till neuroser. Neurosernas psykopatologi Läkemedelsbehandling och terapeutisk behandling av neuroser @sv

Maanviljely
type: Class
type: Concept
subclass of: URN:NBN:fi:au:hklj:650
alternative label: AIV-menetelmä (652)
alternative label: AIV-rehu, valmistus (652)
alternative label: Aapasuot, raivaus, maanviljely (652)
alternative label: Aitat, maanviljely (652)
alternative label: Allelopatia, maanviljely (652)
alternative label: Aluskasvit, maanviljely (652)
alternative label: Atratsiini, herbisidit, maanviljely (652)
alternative label: Aurat, maanviljely (652)
alternative label: Auraton viljely (652)
alternative label: Auraus, maanviljely (652)
alternative label: Auringonkukka, öljykasvit (652)
alternative label: Avomaaviljely, maanviljely (652)
alternative label: Biodynaaminen viljely (652)
alternative label: Biodynaaminen viljely, maanviljely (652)
alternative label: Biojätteet, kompostointi, maanviljely (652)
alternative label: Biologinen torjunta, maanviljely (652)
alternative label: Biologinen typensidonta, maanviljely (652)
alternative label: Biologinen viljely (652)
alternative label: Biologinen viljely, maanviljely (652)
alternative label: Biologiset menetelmät, maanviljely (652)
alternative label: Biosidit, maanviljely (652)
alternative label: Denitrifikaatio, maanviljely (652)
alternative label: Dryfarming (652)
alternative label: Eloperäiset lannoitteet (652)
alternative label: Eloperäiset lannoitteet, maanviljely (652)
alternative label: Eloperäiset maat, maanviljely (652)
alternative label: Eläintuhot, maanviljely (652)
alternative label: Ensiharvennus, maanviljely (652)
alternative label: Erikoiskasvit , maanviljely (652)
alternative label: Esikasvit, viljelykierto, maanviljely (652)
alternative label: Fosfaatit, lannoitus, maanviljely (652)
alternative label: Fosforilannoitteet, maanviljely (652)
alternative label: Fungisidit, maanviljely (652)
alternative label: Fysikaalinen torjunta, maanviljely (652)
alternative label: Geenipankit, hyötykasvien jalostus (652 ... 653 +)
alternative label: Geenivarat, hyötykasvien jalostus (652 ... 653 +)
alternative label: Hajuainekasvit (652)
alternative label: Hakkurit, maanviljely (652)
alternative label: Halla, maanviljely (652)
alternative label: Hamppu, viljely (652)
alternative label: Harvennus, maanviljely (652)
alternative label: Heinä, maanviljely (652)
alternative label: Heinäkasvit, maanviljely (652)
alternative label: Heinänkorjuu (652)
alternative label: Heinät, maanviljely (652)
alternative label: Herbisidit, maanviljely (652)
broader: URN:NBN:fi:au:hklj:650
in scheme: URN:NBN:fi:au:hklj:
notation: 652
related: Antroposofia
related: URN:NBN:fi:au:hklj:342
related: KEMIA
related: Sovellettu kemia
related: URN:NBN:fi:au:hklj:576
related: KASVITIEDE
related: Systemaattinen kasvitiede
related: Putkilokasvit
related: Hyönteiset
related: Vesirakennus. Vesikulkuneuvot
related: Vesiväylät. Vesien säännöstely
related: Kivihiili. Turve
related: URN:NBN:fi:au:hklj:649.91
related: Maatalouspolitiikka
related: URN:NBN:fi:au:hklj:650.2
related: URN:NBN:fi:au:hklj:651
related: Puutarhanhoito. Hyötykasvit. Huone- ja koristekasvit
related: Koristekasvit
related: Hyötykasvit
related: Yrtti- ja maustekasvit
related: Hedelmä-, marja- ja vihanneskasvit
related: Huonekasvit
related: URN:NBN:fi:au:hklj:657
related: Rakennusten erillistilat
related: Leipominen
related: URN:NBN:fi:au:hklj:691.12
scope note: Maanviljely yleensä. Maanviljelyä koskeva maatalouspolitiikka, maataloustuki, taloustiede, liiketalous ja kirjanpito Maanviljelytuotteet ja niiden kauppa Satovahingot ja korvaukset maanviljelyn kannalta Kasvinviljelyoppi ja kasvinjalostus yleensä. Peltoviljely. Kesannointi Biologinen, biodynaaminen ja luomuviljely maanviljelyssä. Dryfarming. Vesiviljely. Pengerviljely. Kateviljely ja vuoroviljely maanviljelyn kannalta Maanviljelykoneet, -työkalut ja -rakennukset maanviljelyn kannalta Maanviljelykemia ja -fysiikka. Maan laatu ja viljavuus Maanraivaus, maanmuokkaus, maanparannus, lannoitus, kompostointi, kylvö, kastelu, ojitus, sadonkorjuu sekä sadon käsittely ja varastointi maanviljelyn kannalta Kasvitaudit, kasvituholaiset, rikkakasvit ja kasvinsuojelu maanviljelyn kannalta Biologiset ja kemialliset torjuntamenetelmät maanviljelyksessä Vilja-, heinä-, rehu-, juures-, tärkkelys-, öljy-, kumi- ja kuitukasvien sekä väri-, haju- ja parkkiainekasvien viljely. Rehuteollisuus Jos teos koskee sekä maanviljelyä että puutarhanhoitoa, on etusija luokalla 652
scope note: Jordbruk i allmänhet. Jordbrukspolitik, jordbruksstöd, ekonomi, företagsekonomi och bokföring inom jordbruk Jordbruksprodukter och handel med dem Skördeskador och ersättningar inom jordbruket Växtodlingslära och växtförädling i allmänhet. Åkerbruk. Trädesläggning Biologisk, biodynamisk och ekologisk odling inom jordbruket. Dryfarming. Hydrokultur. Terrassodling. Täckodling och växelbruk inom jordbruket. Jordbruksmaskiner, -redskap coh -byggnader ur jordbrukets synvinkel Jordbrukskemi och jordbruksfysik. Jordens kvalitet och bördighet Markröjning, jordbearbetning, jordförbättring, gödsling, kompostering, sådd, bevattning, dikning, skörd samt hantering och lagring av skörden inom jordbruket Växtsjukdomar, växtskadegörare, ogräs och växtskydd inom jordbruker Biologiska och kemiska bekämpningsmetoder inom jordbruket Odling av spannmålsväxter, hö, foderväxter, rotfrukter, stärkelseväxter, oljeväxter, gummiväxter och spånadsväxter samt odling av växter för utvinning av färgämnen, luktämnen och garvämnen. Foderindustri Om verket handlar om både jordbruk och trädgårdsodling ges företräde åt klass 652 @sv

Merenkulkuoppi
type: Class
type: Concept
subclass of: LIIKETALOUS. KAUPPA. MARKKINOINTI. LIIKENNEOPETUS
alternative label: Ajokyky, vesikulkuneuvot (678)
alternative label: Ajokäyttäytyminen, vesiliikenne (678)
alternative label: Ajonopeus, vesiliikenne (678)
alternative label: Ajoreitit, navigointi (678)
alternative label: Ajotaito ja -tekniikka, vesikulkuneuvot (678)
alternative label: Ajotapa, vesikulkuneuvot (678)
alternative label: Automaattiohjaus , vesiliikenne (678)
alternative label: GPS, merenkulku (678)
alternative label: Haaksirikot, meriselitykset (678)
alternative label: Haverit, meriselitykset (678)
alternative label: Karilleajo , meriselitykset (678)
alternative label: Kelluntaliivit (678)
alternative label: Kompassit, merenkulkuoppi (678)
alternative label: Konemestarit, merenkulku (678)
alternative label: Koululaivat, merenkulun opetus (678)
alternative label: Köydet, merenkulkuoppi (678)
alternative label: Laivaonnettomuudet, meriselitykset (678)
alternative label: Laivat, merenkulkuoppi (678)
alternative label: Laivaväylät, merenkulkuoppi (678)
alternative label: Liikennejuopumus, vesiliikenteen turvallisuus (678)
alternative label: Liikennekasvatus, vesiliikenne (678)
alternative label: Liikennekäyttäytyminen, vesiliikenne (678)
alternative label: Liikennemerkit, vesiliikenne (678)
alternative label: Liikennenopeus, vesiliikenne (678)
alternative label: Liikenneopetus, vesiliikenne (678)
alternative label: Liikenneoppaat, vesiliikenne (678)
alternative label: Liikennepako, vesiliikenteen turvallisuus (678)
alternative label: Liikennepsykologia, vesiliikenne (678)
alternative label: Liikennerikkomukset, vesiliikenteen turvallisuus (678)
alternative label: Liikennerikokset, vesiliikenteen turvallisuus (678)
alternative label: Liikennesäännöt, vesiliikenne (678)
alternative label: Liikenneturvallisuus, vesiliikenne (678)
alternative label: Liikennevalistus, vesiliikenne (678)
alternative label: Liikennevalvonta, vesiliikenteen turvallisuus (678)
alternative label: Liikenteen ammatit, vesiliikenne (678)
alternative label: Liikenteenohjaus, vesiliikenne (678)
alternative label: Loistot (678)
alternative label: Lokalisointi, navigointi (678)
alternative label: Lokikirjat, lokikirjan pito (678)
alternative label: Luotsaus (678)
alternative label: Luotsiasemat (678)
broader: LIIKETALOUS. KAUPPA. MARKKINOINTI. LIIKENNEOPETUS
in scheme: URN:NBN:fi:au:hklj:
notation: 678
related: Merioikeus
related: URN:NBN:fi:au:hklj:360
related: URN:NBN:fi:au:hklj:363
related: URN:NBN:fi:au:hklj:368
related: Vesi- ja ilmaliikenne
related: Vesiliikenne
related: Maailmankartat. Maailmankartastot
related: Kausijulkaisut
related: Yhdistykset. Laitokset. Kokoukset
related: Opinnot
related: Kokoomateokset
related: Yleinen aluemaantiede. Yleinen kulttuurimaantiede. Yleinen poliittinen maantiede
related: EUROOPPA
related: AASIA
related: AFRIKKA
related: AMERIKKA
related: AUSTRALIA. OSEANIA. NAPAMAAT
related: Vesirakennus. Vesikulkuneuvot
related: Satamat. Satamatekniikka
related: Vesiväylät. Vesien säännöstely
related: Vesijohto-, viemäri- ja vedenpuhdistustekniikka
related: Vesikulkuneuvot
related: Laivat. Laivanrakennus
related: URN:NBN:fi:au:hklj:625.72
related: Muut vesikulkuneuvot
related: URN:NBN:fi:au:hklj:650.2
related: Solmeilu. Makramee. Fransut
related: Purjehdus. Soutu. Melonta
related: Moottoriveneurheilu
related: Retkeily. Ulkoilu. Vuorikiipeily. Suunnistus
related: Vaakunatiede. Liput
scope note: Navigaatio. Vesiliikenteen ja merenkulun liikennesäännöt, liikennekasvatus ja liikenneturvallisuus Vesiliikenteen rikkeet ja rikokset vesiliikenteen turvallisuuden kannalta. Meriselitykset Vesiliikenteen ja merenkulun ammatit. Merimiestaidot Solmut. Solmujenteko-ohjeet. Merkinantoliput Merikapteenin, laivurin, perämiehen ja merimiehen työ Luotsi- ja majakkalaitos. Luotsin työ. Majakat Satelliittinavigointijärjestelmä
scope note: Navigation. Sjöfartsregler, trafikfostran och trafiksäkerhet inom sjötrafik och sjöfart Förseelser och brott inom sjötrafik ur sjötrafiksäkerhetens synvinkel. Sjöförklaringar Yrken inom sjötrafik och sjöfart Knopar. Handböcker i att slå knopar. Signalflaggor Sjökaptenens, skepparens, styrmannens och sjömannens arbete Lots- och fyrväsen. Lotsens arbete. Fyrar Satellitnavigeringssystem @sv

Ompelu
type: Class
type: Concept
subclass of: URN:NBN:fi:au:hklj:764
alternative label: Alusvaatteet, ompelu (764.3)
alternative label: Asusteet, tekstiilikäsityöt, ompelu (764.3)
alternative label: Farkut, ompelu (764.3)
alternative label: Farmarihousut, ompelu (764.3)
alternative label: Flanelli, ompelu (764.3)
alternative label: Fleece, ompelu (764.3)
alternative label: Fliis, ompelu (764.3)
alternative label: Fliisi, ompelu (764.3)
alternative label: Huivit, ompeluohjeet (764.3)
alternative label: Hääpuvut, vaatteiden ompelu (764.3)
alternative label: Ikkunaverhot, verhojen ompelu (764.3)
alternative label: Juhlapuvut, vaatteiden ompelu (764.3)
alternative label: Juhlavaatteet, vaatteiden ompelu (764.3)
alternative label: Kaavat, ompelu (764.3)
alternative label: Kaihtimet, valmistus käsityönä (764.3)
alternative label: Kangaslaadut, ompelu (764.3)
alternative label: Kankaat, ompelu (764.3)
alternative label: Kodintekstiilit, ompeluohjeet (764.3)
alternative label: Korjaus, vaatteet (764.3)
alternative label: Korjausompelu (764.3)
alternative label: Kotivalmistus, vaatteet, ompelu (764.3)
alternative label: Käsityöt, ompelu (764.3)
alternative label: Lastenvaatteet, ompeluohjeet (764.3)
alternative label: Laukut, ompelu (764.3)
alternative label: Leikkaus, tekstiilit, vaatteiden ompelu (764.3)
alternative label: Liinavaatteet, ompeluohjeet (764.3)
alternative label: Morsiuspuvut, vaatteiden ompelu (764.3)
alternative label: Nahkavaatteet, ompeluohjeet (764.3)
alternative label: Napit, ompeluohjeet (764.3)
alternative label: Neulatyynyt, ompelutarvikkeet (764.3)
alternative label: Ohjekirjat, ompelu (764.3)
alternative label: Ompelijat, (764.3)
alternative label: Ompelu (764.3)
alternative label: Ompelu, käsityö (764.3)
alternative label: Ompelukoneet, käyttö (764.3)
alternative label: Ompelutarvikkeet (764.3)
alternative label: Ompelutyöt (764.3)
alternative label: Ompelutyöt, käsityöt (764.3)
alternative label: Paikkaus, ompelu (764.3)
alternative label: Pukineet, ompelu (764.3)
alternative label: Pukuompelu (764.3)
alternative label: Pukusuunnittelu, vaatteiden ompelu (764.3 +)
broader: URN:NBN:fi:au:hklj:764
in scheme: URN:NBN:fi:au:hklj:
notation: 764.3
related: Esineellinen kulttuuri
related: URN:NBN:fi:au:hklj:473
related: URN:NBN:fi:au:hklj:473.1
related: URN:NBN:fi:au:hklj:475
related: URN:NBN:fi:au:hklj:475.1
related: URN:NBN:fi:au:hklj:476
related: URN:NBN:fi:au:hklj:476.1
related: URN:NBN:fi:au:hklj:476.11
related: URN:NBN:fi:au:hklj:476.12
related: URN:NBN:fi:au:hklj:476.5
related: URN:NBN:fi:au:hklj:476.6
related: URN:NBN:fi:au:hklj:476.7
related: URN:NBN:fi:au:hklj:476.8
related: Tekstiili- ja vaatetusteollisuus
related: Nahka- ja jalkineteollisuus
related: Kodin korjaustöiden oppaat
related: URN:NBN:fi:au:hklj:681
related: Sisustusoppaat
related: Pukeutuminen. Kauneudenhoito
related: Taideteollisuuden teoria, estetiikka ja filosofia
related: Antiikkiesineiden keräily
related: Taideteollisuuden historia
related: Koruompelu. Kirjonta. Nimikointi
related: Neulonta
related: Tilkkutyöt. Tikatut peitteet
related: Nahkatyöt. Turkistyöt
related: URN:NBN:fi:au:hklj:767
related: Leikkikalut
related: URN:NBN:fi:au:hklj:798
related: Muodin historia
scope note: Vaatteiden, asusteiden, liinavaatteiden ym. kodin tekstiilien ompeluohjeet, -mallit ja -kaavat Ompelun historia, materiaalit, tekniikka ja estetiikka Nahkavaatteiden ja asusteiden ompeluohjeet, -mallit ja -kaavat Ompelijan työ. Räätälin työ. Vaatturin työ Ompelukoneiden käyttö
scope note: Sömnadsbeskrivningar, sömnadsmallar och sömnadsmönster för kläder, plagg, linne o.dyl. textilier i hemmet Sömnadens historia, material, tekniker och estetik Sömnadsbeskrivningar, sömnadsmallar och sömnadsmönster för läderkläder och läderplagg Sömmerskans arbete. Skräddarens arbete Användning av symaskiner @sv

Elokuvatekniikka. Videokuvauksen tekniikka
type: Class
type: Concept
subclass of: Elokuva. Elokuvataide
alternative label: 3-D-elokuvat, elokuvatekniikka (777.1 +)
alternative label: 3-ulotteisuus, elokuvatekniikka (777.1)
alternative label: 3D-elokuvat, elokuvatekniikka (777.1)
alternative label: Amatöörielokuvat, elokuvauksen tekniikka (777.1)
alternative label: Animaatio, elokuva, tekniikka (777.1)
alternative label: Animaatioelokuvat, elokuvatekniikka (777.1)
alternative label: Animaatiohahmot, elokuva, tekniikka (777.1)
alternative label: Anime-elokuvat, elokuvatekniikka (777.1)
alternative label: Anime-sarjat, elokuvatekniikka (777.1)
alternative label: Animet, elokuvatekniikka (777.1)
alternative label: Dokumenttidraamat, elokuvatekniikka (777.1)
alternative label: Dokumenttielokuvat, elokuvatekniikka (777.1)
alternative label: Draamadokumentit, elokuvatekniikka (777.1)
alternative label: Dramatisointi, elokuva (777.1)
alternative label: Editointi, elokuvatekniikka (777.1)
alternative label: Editointi, videotekniikka (777.1)
alternative label: Efektit, elokuvatekniikka (777.1)
alternative label: Elekieli, elokuvanäyttelijän työ (777.1)
alternative label: Elokuva, tekniikka (777.1)
alternative label: Elokuvaaminen (777.1)
alternative label: Elokuvaesitykset, tekniikka (777.1)
alternative label: Elokuvakamerat, elokuvan kuvaaminen (777.1)
alternative label: Elokuvakäsikirjoitukset, käsikirjoitusten laatiminen (777.1)
alternative label: Elokuvanäyttelijät, elokuvanäyttelijän työ (777.1)
alternative label: Elokuvaohjaajat, elokuvaohjaajan työ (777.1)
alternative label: Elokuvaohjaus (777.1)
alternative label: Elokuvaprojektorit, elokuvatekniikka (777.1)
alternative label: Elokuvataide, tekniikka (777.1)
alternative label: Elokuvatallenteet, elokuvauksen tekniikka (777.1)
alternative label: Elokuvateatterit, elokuvatekniikka (777.1)
alternative label: Elokuvatekniikka (777.1)
alternative label: Elokuvaus (777.1)
alternative label: Erikoistehosteet, elokuvatekniikka (777.1)
alternative label: Esiintymistaito, elokuvanäyttelijän työ (777.1)
alternative label: Esittäminen, elokuvanäyttelijän työ (777.1)
alternative label: Filmatisointi (777.1)
alternative label: Filmaus, elokuvaus (777.1)
alternative label: Filmaus, televisiokuvaus (777.1)
alternative label: Filmaus, videokuvaus (777.1)
alternative label: Filmit, valokuvauksen tekniikka, elokuvauksen tekniikka (777.1)
alternative label: Gestiikka, elokuvanäyttelijän työ (777.1)
alternative label: Harrastukset, videokuvaus (777.1)
broader: Elokuva. Elokuvataide
in scheme: URN:NBN:fi:au:hklj:
notation: 777.1
related: URN:NBN:fi:au:hklj:384.42
related: Matkaviestinpalvelut. Puhelinliikenne
related: URN:NBN:fi:au:hklj:627.7532
related: Optiset ja lääketieteelliset laitteet
related: Oppikirjat. Harjoituskirjat. Tehtäväkokoelmat. Taiteen materiaalit ja tekniikka. Taidekasvatus
related: URN:NBN:fi:au:hklj:710
related: URN:NBN:fi:au:hklj:756
related: Valokuvauksen materiaalit ja tekniikka. Valokuvausoppaat
related: Teatteri- ja näyttämötaiteen teoria, estetiikka ja filosofia
related: URN:NBN:fi:au:hklj:777.9
related: Eurooppa
related: Pohjoismaat. Baltian maat
related: Suomi
related: Länsi- ja Keski-Eurooppa
related: Saksa
related: Ranska
related: Brittein saaret
related: Etelä-Eurooppa
related: Italia
related: Espanja
related: Itä-Eurooppa
related: Venäjä
related: Aasia
related: Afrikka
related: Amerikka
related: Yhdysvallat
related: Australia. Oseania
related: Ilmaisutaito. Puhetaito. Lausuntataide
related: URN:NBN:fi:au:hklj:783.67
related: URN:NBN:fi:au:hklj:783.68
scope note: Elokuvan, televisioelokuvan, kaitafilmauksen ja videokuvauksen materiaalit, tekniikka ja käytännön oppaat Käsikirjoituksen laadinta. Ohjaus Elokuvanäyttelijän työ. Sijaisnäyttelijän työ Lavastus. Valaistus. Puvustus. Naamiointi. Erikoistehosteet Kuvaus. Trikkikuvaus. Leikkaus. Editointi Kamerat, nauhat ja filmit elokuvauksen kannalta Elokuvan esitystekniikka Yksittäistä käsikirjoittajaa, ohjaajaa, näyttelijää ym. koskevat teokset elokuvataiteen historian luokassa 777.9+
scope note: Filmens, TV-filmens, smalfilmsinpelningens och videoinspelningens material och tekniker samt praktiska handböcker för dessa Manusförfattande. Regi Filmskådespelarens arbete. Stuntmannens arbete Scenografi. Belysning. Kostymering. Maskering. Specialeffekter Inspelning. Trickinspelning. Klippning. Redigering Kameror, band och filmer ur filminspelningens synvinkel Filmuppspelningsteknik Verk som handlar om enskilda manusförfattare, regissörer, skådespelare m.fl. förs till klassen för filmkonstens historia 777.9+ @sv

Muiden kielten kirjallisuuden historia ja tutkimus
type: Class
type: Concept
subclass of: MUIDEN KIELTEN KIRJALLISUUDEN HISTORIA JA TUTKIMUS
alternative label: Afrikka, alkuperäiskielet, kirjallisuudenhistoria (849)
alternative label: Afroaasialaiset kielet, kirjallisuudenhistoria (845 ... 849)
alternative label: Akanin kieli, kirjallisuudenhistoria (849)
alternative label: Albanian kieli, kirjallisuuden historia (849)
alternative label: Amerikka, alkuperäiskielet, kirjallisuudenhistoria (849)
alternative label: Annamin kieli, kirjallisuuden historia (849)
alternative label: Armenian kieli, kirjallisuudenhistoria (849)
alternative label: Austronesialaiset kielet, kirjallisuuden historia (849)
alternative label: Baskin kieli, kirjallisuuden historia (849)
alternative label: Burman kieli, kirjallisuuden historia (849)
alternative label: Dravidakielet, kirjallisuuden historia (849)
alternative label: Eskimokielet, kirjallisuudenhistoria (849)
alternative label: Esperanto, kirjallisuuden historia (849)
alternative label: Etelä-Amerikka, alkuperäiskielet, kirjalliuudenhistoria (849)
alternative label: Euskeran kieli, kirjallisuudenhistoria (849)
alternative label: Georgian kieli, kirjallisuuden historia (849)
alternative label: Grönlannin kieli, kirjallisuudenhistoria (849)
alternative label: Haamilaiset kielet, kirjallisuuden historia (849)
alternative label: Indonesian kieli, kirjallisuuden historia (849)
alternative label: Intiaanikielet, kirjallisuuden historia (849)
alternative label: Inuiittikielet, kirjallisuuden historia (849)
alternative label: Kannadan kieli, kirjallisuuden historia (849)
alternative label: Keinotekoiset kielet, kirjallisuuden historia (849)
alternative label: Khmerin kieli, kirjallisuuden historia (849)
alternative label: Konstruoidut kielet, kirjallisuuden historia (849)
alternative label: Korean kieli, kirjallisuuden historia (849)
alternative label: Lingalan kieli, kirjallisuuden historia (849)
alternative label: Malaijilais-polynesialaiset kielet, kirjallisuudenhistoria (849)
alternative label: Malajalamin kieli, kirjallisuuden historia (849)
alternative label: Mongolin kieli, kirjallisuuden historia (849)
alternative label: Pohjois-Amerikka, alkuperäiskielet, kirjallisuudenhistoria (849)
alternative label: Somalin kieli, kirjallisuudenhistoria (849)
alternative label: Suahilin kieli, kirjallisuuden historia (849)
alternative label: Swahilin kieli, kirjallisuuden historia (849)
alternative label: Tagalogin kieli, kirjallisuuden historia (849)
alternative label: Tamilin kieli, kirjallisuuden historia (849)
alternative label: Telugun kieli, kirjallisuuden historia (849)
alternative label: Thain kieli, kirjallisuuden historia (849)
alternative label: Tiibetiläis-burmalaiset kielet (849)
alternative label: Vietnamin kieli, kirjallisuuden historia (849)
alternative label: Afrika, ursprungsspråk, litteraturhistoria (849) @sv
alternative label: Afroasiatiska språk, litteraturhistoria (845 ... 849) @sv
alternative label: Akan, litteraturhistoria (849) @sv
alternative label: Albanska, litteraturhistoria (849) @sv
alternative label: Amerika, ursprungsspråk, litteraturhistoria (849) @sv
alternative label: Annamitiska, litteraturhistoria (849) @sv
alternative label: Armeniska, litteraturhistoria (849) @sv
alternative label: Artificiella språk, litteraturhistoria (849) @sv
alternative label: Austronesiska språk, litteraturhistoria (849) @sv
alternative label: Baskiska, litteraturhistoria (849) @sv
alternative label: Burmesiska, litteraturhistoria (849) @sv
broader: MUIDEN KIELTEN KIRJALLISUUDEN HISTORIA JA TUTKIMUS
in scheme: URN:NBN:fi:au:hklj:
notation: 849
related: URN:NBN:fi:au:hklj:2.89
related: URN:NBN:fi:au:hklj:9.7
related: URN:NBN:fi:au:hklj:9.72
related: URN:NBN:fi:au:hklj:9.74
related: URN:NBN:fi:au:hklj:9.92
related: URN:NBN:fi:au:hklj:9.95
related: URN:NBN:fi:au:hklj:9.97
related: URN:NBN:fi:au:hklj:9.971
related: URN:NBN:fi:au:hklj:9.976
related: URN:NBN:fi:au:hklj:9.9761
related: URN:NBN:fi:au:hklj:9.9762
related: URN:NBN:fi:au:hklj:9.9765
related: URN:NBN:fi:au:hklj:9.978
related: URN:NBN:fi:au:hklj:9.9781
related: URN:NBN:fi:au:hklj:9.9783
related: URN:NBN:fi:au:hklj:9.98
related: URN:NBN:fi:au:hklj:9.981
related: URN:NBN:fi:au:hklj:9.984
related: URN:NBN:fi:au:hklj:9.986
related: URN:NBN:fi:au:hklj:9.99
related: URN:NBN:fi:au:hklj:9.991
scope note: Baskin- ja albaniankielisen kirjallisuuden historia ja tutkimus Kaukaasialaisten kielten sekä samojedi-, mongoli- ja tunguusikielten kirjallisuuden historia ja tutkimus Koreankielisen kirjallisuuden historia ja tutkimus Armenian-, georgian-, burjatin-, dahurin-, kalmukin-, mantsun-, mongolin-, oiraattin- ja tunguusinkielisen kirjallisuuden historia ja tutkimus Haamilaisten kielten kirjallisuuden historia ja tutkimus Berberikielten, kuusilaisten kielten ja hausankielisen kirjallisuuden historia ja tutkimus Burman-, khmerin-, laon-, thain-, tiibetin- ja vietnaminkielisen kirjallisuuden historia ja tutkimus Afrikan, Aasian, Australian ja Oseanian sekä Amerikan alkuperäiskansojen kielten kirjallisuuden historia ja tutkimus Sudanilaisten kielten, bantukielten, khoisankielten, busmannikielten, hottentottikielten sekä swahilin-, somalin- ja lingalankielisen kirjallisuuden historia ja tutkimus Dravidakielten, tamilin ja telugun kielen sekä austronesialaisten kielten kirjallisuuden historia ja tutkimus Tagalogin- ja indonesiankielisen kirjallisuuden historia ja tutkimus Eskimo- ja intiaanikielten kirjallisuuden historia ja tutkimus Pidgin- ja kreolikielten kirjallisuuden historia ja tutkimus Keinotekoisten kielten kirjallisuuden historia ja tutkimus
scope note: Litteraturhistoria och litteraturforskning som rör baskiska och albanska Litteraturhistoria och litteraturforskning som rör de kaukasiska språken samt evenkiska (tungusiska), mongoliska och samojediska Litteraturhistoria och litteraturforskning som rör koreanska Litteraturhistoria och litteraturforskning som rör armeniska, georgiska, burjatiska, daguriska och kalmuckiska Litteraturhistoria och litteraturforskning som rör manchuriska, mongoliska och oiratiska Litteraturhistoria och litteraturforskning som rör de hamitiska språken Litteraturhistoria och litteraturforskning som rör berberspråk och kushitiska språk samt hausa Litteraturhistoria och litteraturforskning som rör burmanska, khmer (kambodjanska), laotiska, thailändska (siamesiska), tibetanska och vietnamesiska Litteraturhistoria och litteraturforskning som rör de afrikanska, asiatiska, australiska och oceaniska samt amerikanska ursprungsfolkens litteratur Litteraturhistoria och litteraturforskning som rör bantuspråk, bushmanspråk, hottentottspråk och xhosaspråk samt somaliska, sudanska, swahili och lingala Litteraturhistoria och litteraturforskning som rör dravidiska och austronesiska språk samt tamil och telugu Litteraturhistoria och litteraturforskning som rör tagalog och indonesiska Litteraturhistoria och litteraturforskning som rör somaliska eskimåspråk och indianspråk Litteraturhistoria och litteraturforskning som rör pidginspråk och kreolspråk Litteraturhistoria och litteraturforskning som rör artificiella språk @sv

URN:NBN:fi:au:hklj:1.4
alternative label: 3-D-elokuvat, elokuvatallenteet (1.4)
alternative label: 3D-elokuvat, elokuvatallenteet (1.4)
alternative label: Aarnikotkat, fantasiaromaanit (1.4)
alternative label: Agenttikirjallisuus, kaunokirjallisuus (1.4)
alternative label: Aikakoneet, fantasiakirjallisuus (1.4)
alternative label: Aikamatkat, fantasiakirjallisuus (1.4)
alternative label: Anekdootit, kaunokirjalliset kaskut (1.4)
alternative label: Antiromaanit (1.4)
alternative label: Antologiat, novellit, kertomukset (1.4)
alternative label: Avainromaanit, kaunokirjallisuus (1.4)
alternative label: Dekkarit (1.4)
alternative label: Dogmaelokuvat, elokuvat (1.4)
alternative label: Dokumenttidraamat, näytelmäelokuvat (1.4)
alternative label: Draamadokumentit, näytelmäelokuvat (1.4)
alternative label: Draamaelokuvat (1.4)
alternative label: Eepokset, romaanit (1.4)
alternative label: Elokuvat, näytelmäelokuvat (1.4)
alternative label: Elokuvatallenteet, näytelmäelokuvat (1.4)
alternative label: Eläinkertomukset, novellit, kertomukset (1.4)
alternative label: Elämäkertaelokuvat (1.4)
alternative label: Elämäkertaromaanit (1.4)
alternative label: Epiikka (1.4)
alternative label: Eroottinen kirjallisuus (1.4)
alternative label: Eroottiset elokuvat (1.4)
alternative label: Eräelämä, eräkirjallisuus (1.4)
alternative label: Eräkirjallisuus, kaunokirjallisuus (1.4)
alternative label: Eräkirjat, kaunokirjallisuus (1.4)
alternative label: Erätarinat, kaunokirjallisuus (1.4)
alternative label: Fantasiaelokuvat (1.4)
alternative label: Fantasiakirjallisuus (1.4)
alternative label: Farssit, elokuvat (1.4)
alternative label: Feeniks-lintu, fantasiaromaanit (1.4)
alternative label: Feniks, fantasiaromaanit (1.4)
alternative label: Film noir, elokuvat (1.4)
alternative label: Gangsterielokuvat (1.4)
alternative label: Goottilaiset kauhuromaanit, kaunokirjallisuus (1.4)
alternative label: Goottilaiset romaanit, kaunokirjallisuus (1.4)
alternative label: Griipit, fantasiaromaanit (1.4)
alternative label: Hevoskirjat, romaanit ja novellit (1.4)
alternative label: Historialliset elokuvat (1.4)
alternative label: Historialliset romaanit (1.4)
alternative label: Historialliset tarinat, romaanit, novellit (1.4)
alternative label: Huumori, näytelmäelokuvat (1.4)
alternative label: Huumori, romaanit, novellit (1.4)
alternative label: Huumori, vitsit, kaskut (1.4)
alternative label: Independent-elokuvat , näytelmäelokuvat (1.4)
related: URN:NBN:fi:au:hklj:1.79
related: URN:NBN:fi:au:hklj:390
related: Sotahistoria
related: Suomi
related: Kalat
related: Metsästys. Kalastus
related: Metsästys
related: Kalastus
related: Pilapiirrokset. Karikatyyrit
related: Elokuva. Elokuvataide
related: URN:NBN:fi:au:hklj:777.9
related: Eurooppa
related: Pohjoismaat. Baltian maat
related: Länsi- ja Keski-Eurooppa
related: Saksa
related: Ranska
related: Brittein saaret
related: Etelä-Eurooppa
related: Italia
related: Espanja
related: Itä-Eurooppa
related: Venäjä
related: Aasia
related: Afrikka
related: Amerikka
related: Yhdysvallat
related: Australia. Oseania
related: URN:NBN:fi:au:hklj:783.67
related: I maailmansodan historia 1914-1918
related: II maailmansodan historia 1939-1945
related: Vuoden 1918 sota
related: Sodat 1939-1945
related: Yhteiskuntaelämän, joukkotiedotuksen, liikenteen ja maanpuolustuksen edustajat

Oppimisen psykologia
type: Class
type: Concept
subclass of: Psyyken rakenne ja toiminnot
alternative label: Ajatuskartat (121.4)
alternative label: Déjà vu -ilmiö, muisti, psykologia (121.4)
alternative label: Ehdollistuminen, psykologia (121.4)
alternative label: Elinikäinen oppiminen, oppimisen psykologia (121.4)
alternative label: Erehdys, oppimisen psykologia (121.4)
alternative label: Informaali oppiminen, oppimisen psykologia (121.4)
alternative label: Itsereflektio, oppimisen psykologia (121.4 +)
alternative label: Jatkuva oppiminen, oppimisen psykologia (121.4)
alternative label: Kehittävä arviointi, oppimisen psykolgia (121.4)
alternative label: Keskittymiskyky (121.4)
alternative label: Keskittymiskyky, oppimisen psykologia (121.4)
alternative label: Kielellinen kehitys, oppimisen psykologia (121.4)
alternative label: Kielelliset häiriöt, oppimisen psykologia (121.4)
alternative label: Kielen omaksuminen, oppimisen psykologia (121.4)
alternative label: Kielen oppiminen, oppimisen psykologia (121.4)
alternative label: Kielenoppiminen, oppimisen psykologia (121.4)
alternative label: Kielihäiriöt, oppimisen psykologia (121.4)
alternative label: Kielipsykologia, oppimisen psykologia (121.4)
alternative label: Kirjoittamaan oppiminen, oppimisen psykologia (121.4)
alternative label: Kirjoittaminen, oppimisen psykologia (121.4)
alternative label: Kokemukset, oppimisen psykologia (121.4)
alternative label: Kokemusoppiminen, oppimisen psykologia (121.4)
alternative label: Kollaboratiivinen oppiminen, oppimisen psykologia (121.4)
alternative label: Kooperatiivinen oppiminen, oppimisen psykologia (121.4)
alternative label: Kouluvaikeudet, oppimisen psykologia (121.4)
alternative label: Käsitekartat (121.4)
alternative label: Käsitteenmuodostus, psykologia (121.4)
alternative label: Learning by doing, oppimisen psykologia (121.4)
alternative label: Liikkumaan oppiminen, oppimisen psykologia (121.4)
alternative label: Lukemaan oppiminen (121.4)
alternative label: Lukemaan oppiminen, oppimisen psykologia (121.4)
alternative label: Lukeminen, lukemaan oppiminen (121.4)
alternative label: Lukutaito, lukemaan oppiminen (121.4)
alternative label: Lyhytkestomuisti (121.4)
alternative label: Mallioppiminen, oppimisen psykologia (121.4)
alternative label: Mielikuvakartat (121.4)
alternative label: Miellekartat (121.4)
alternative label: Mind maps (121.4)
alternative label: Mnemotekniikka (121.4)
alternative label: Motivointi, oppimisen psykologia (121.4)
broader: Psyyken rakenne ja toiminnot
in scheme: URN:NBN:fi:au:hklj:
notation: 121.4
related: Ajattelu. Älykkyys. Mielikuvitus
related: Havaintopsykologia
related: Kokeellinen psykologia. Psykometriikka
related: Psykologian suunnat
related: Psychology of expression {@en
related: Lapsuuden ja nuoruuden psykologia
related: Muita psykologian aloja
related: Kehityspsykologia. Eri ikäkausien psykologia
related: Kasvatuspsykologia
related: URN:NBN:fi:au:hklj:181.9
related: Luku-, kirjoitus- ja puhehäiriöiset
related: URN:NBN:fi:au:hklj:182
related: Filosofian ja psykologian opetusoppi
related: Uskonnon opetusoppi
related: Yhteiskuntatieteiden opetusoppi
related: Maantieteen ja kansatieteen opetusoppi
related: Matematiikan ja luonnontieteiden opetusoppi
related: Sovellettujen tieteiden opetusoppi
related: Taideaineiden opetusoppi
related: Musiikin opetusoppi
related: Liikunnan ja urheilun opetusoppi
related: Kirjallisuuden ja kielten opetusoppi
related: Historian opetusoppi
related: URN:NBN:fi:au:hklj:188.4
related: Kielipsykologia. Kielisosiologia. Kielipolitiikka
related: Äänneoppi
related: Ruotsin kieli
related: Ruotsin kielen äänneoppi
related: Saksan kieli
related: Englannin kieli
related: Suomen kieli
related: Suomen kielen äänneoppi
scope note: Oppiminen ja muisti psykologisina ilmiöinä Tiedostava, assosiatiivinen ja sosiaalinen oppiminen Ehdollistaminen. Palkkion ja rangaistuksen vaikutus oppimiseen Tarkkaavaisuus ja keskittymiskyky oppimisen kannalta Muistitekniikka. Oppimis- ja muistitestit Kielellinen kehitys. Motorinen kehitys Puhumaan, lukemaan ja kirjoittamaan oppimisen psykologia Liikkumaan oppimisen psykologia Jos teoksessa on sekä oppimisen psykologiaa että kasvatuspsykologiaa, on etusija luokalla 180.2
scope note: Inlärning och minne som psykologiska fenomen Medveten, associativ och social inlärning Betingning. Hur belöning och straff inverkar på inlärningen Uppmärksamhet och koncentrationsförmåga ur inlärningens synvinkel Minnesteknik. Inlärnings- och minnestest Språkutveckling. Motorisk utveckling Talandets, läsandets och skrivandets inlärningspsykologi Rörelseinlärningens psykologi Om verket rör både inlärningspsykologi och pedagogisk psykologi, ges företräde åt klass 180.2 @sv

KRISTILLINEN DOGMATIIKKA
type: Class
type: Concept
subclass of: YLEINEN USKONTOTIEDE. YLEINEN USKONNONFILOSOFIA
alternative label: Dogmatiikka, kristinusko (230 ... 239)
alternative label: Dogmatismi, kristinusko (230 ... 239)
alternative label: Dogmit, kristinusko (230 ... 239)
alternative label: Ehtoollinen, dogmatiikka (230)
alternative label: Ekklesiologia (230)
alternative label: Eukaristia, dogmatiikka (230)
alternative label: Fundamentalismi, kristillinen dogmatiikka (230)
alternative label: Harhaoppisuus, kristillinen dogmatiikka (230 ... 239)
alternative label: Kaste, dogmatiikka (230)
alternative label: Kerettiläisyys, dogmatiikka (230 ... 239)
alternative label: Kirkko, dogmatiikka (230)
alternative label: Kirkko-oppi (230)
alternative label: Kirkkoisät, dogmatiikka (230 ... 239)
alternative label: Kristillisyys, dogmatiikka (230 ... 239)
alternative label: Kristinusko, dogmatiikka (230 ... 239)
alternative label: Kuvainpalvonta, kristillinen dogmatiikka (230 ... 239)
alternative label: Maailmanuskonnot, kristinusko (210 ... 279 +)
alternative label: Mysteeriuskonnot, kristinusko, dogmatiikka (230 ... 239)
alternative label: Ortodoksisuus, kristillinen dogmatiikka (230 ... 239)
alternative label: Pakanuus, kristillinen dogmatiikka (230 ... 239)
alternative label: Patristiikka (230 ... 239)
alternative label: Puhdasoppisuus, kristillinen dogmatiikka (230)
alternative label: Sakraaliteologia (230)
alternative label: Sakramentit, dogmatiikka (230)
alternative label: Systemaattinen teologia, dogmatiikka (230 ... 239)
alternative label: Uskonnot, kristinusko (210 ... 279 +)
alternative label: Uskonto, kristinusko (210 ... 279 +)
alternative label: Uskontokunnat, kristinusko (210 ... 279 +)
alternative label: Bilddyrkan, kristen dogmatik (230 ... 239) @sv
alternative label: Dogmatik, kristendom (230 ... 239) @sv
alternative label: Dogmatism, kristendom (230 ... 239) @sv
alternative label: Dogmer, kristendom (230 ... 239) @sv
alternative label: Dop, dogmatik (230) @sv
alternative label: Ecklesiologi (230) @sv
alternative label: Eukaristi, dogmatik (230) @sv
alternative label: Fundamentalism, kristen dogmatik (230) @sv
alternative label: Hedendom, kristen dogmatik (230 ... 239) @sv
alternative label: Irrläror, kristen dogmatik (230 ... 239) @sv
alternative label: Kristendom, dogmatik (230 ... 239) @sv
alternative label: Kristlighet, dogmatik (230 ... 239) @sv
alternative label: Kyrkan, dogmatik (230) @sv
alternative label: Kyrkofäder, dogmatik (230 ... 239) @sv
alternative label: Kätteri, dogmatik (230 ... 239) @sv
alternative label: Läran om kyrkan (230) @sv
alternative label: Mysteriereligioner, kristendom, dogmatik (230 ... 239) @sv
alternative label: Nattvard, dogmatik (230) @sv
alternative label: Ortodoxi, kristen dogmatik (230 ... 239) @sv
alternative label: Patristik (230 ... 239) @sv
alternative label: Primitiva religioner, olika religioner (208 ... 289 +) @sv
alternative label: Religion, kristendom (210 ... 279 +) @sv
broader: YLEINEN USKONTOTIEDE. YLEINEN USKONNONFILOSOFIA
in scheme: URN:NBN:fi:au:hklj:
narrower: Jumalan olemus
narrower: Kristologia
narrower: Pelastusoppi. Kristillinen antropologia
narrower: Enkelit. Paholaiset. Demonit
narrower: Eskatologia
narrower: Kuolema ja kuolemanjälkeinen elämä
narrower: Uskontunnustukset. Katekismukset
narrower: Apologetiikka
notation: 230
related: Keskiajan filosofia
related: URN:NBN:fi:au:hklj:210
related: Kristinuskon filosofia
related: Apokryfikirjat. Apostoliset isät
related: URN:NBN:fi:au:hklj:230.09
related: Kristillinen etiikka
related: EVANKELIS-LUTERILAINEN KIRKKO
related: Sakramentit. Kirkolliset toimitukset
related: URN:NBN:fi:au:hklj:260
related: Itämaiset kirkot
related: Roomalaiskatolinen kirkko
related: Ortodoksinen kirkko
related: Protestanttiset kirkot ja yhteisöt
related: Muut kristillisperäiset yhteisöt
scope note: Tässä ja alaluokissa kirkkokunnasta tai kristillisestä yhteisöstä riippumatta kristinuskon dogmatiikka eli uskonoppi Tässä ja alaluokissa myös patristiikka Tässä uskontokunnasta riippumatta dogmatiikan kannalta laaditut teokset, jotka koskevat kristillisiä sakramentteja ja kirkollisia toimituksia, kuten kastetta, kummiutta, konfirmaatiota, ehtoollista, avioliittoa, avioliittoon vihkimistä, rippiä, synninpäästöä, viimeistä voitelua, siunausta tai hautausta. Sakraaliteologia
scope note: Hit och till underklasserna kristendomens dogmatik (trossatser) oavsett kyrkosamfund eller kristet samfund Hit och till underklasserna också patristik Hit oavsett trossamfund verk skrivna ur dogmatisk synvinkel som handlar om de kristna sakramenten och kyrkliga förrättningar, såsom dopet, gudföräldrar, konfirmationen, nattvarden, äktenskapet, vigsel till äktenskap, bikten, absolutionen, sista smörjelsen, välsignelsen eller jordfästningen. Sakralteologi @sv

Sisäpolitiikka. Puolueet
type: Class
type: Concept
subclass of: URN:NBN:fi:au:hklj:320
alternative label: Aatteelliset järjestöt, poliittiset puolueet (324 +)
alternative label: Aatteelliset yhdistykset, poliittiset puolueet (324 +)
alternative label: Agitaatio, politiikka (324 +)
alternative label: Agitointi, politiikka (324 +)
alternative label: Agraaripuolueet (324 +)
alternative label: Delegaatiot, sisäpolitiikka (324 +)
alternative label: Demokratiavaje, sisäpolitiikka (324 +)
alternative label: Demokratisoituminen, sisäpolitiikka (324 +)
alternative label: EU-kriittisyys, poliittiset asenteet, sisäpolitiikka (324)
alternative label: Eturyhmät, sisäpolitiikka (324 +)
alternative label: Eurokommunismi, puolueet (324 +)
alternative label: Europuolueet (324 +)
alternative label: Fasismi, puolueet (324 +)
alternative label: Hajaannus, sisäpolitiikka (324 +)
alternative label: Hallituksen muodostaminen, sisäpolitiikka (324 +)
alternative label: Hallitukset, sisäpolitiikka (324 +)
alternative label: Hallitusohjelmat (324 +)
alternative label: Henkilösuhteet, sisäpolitiikka (324 +)
alternative label: Intressiryhmät, sisäpolitiikka (324 +)
alternative label: Islamismi, poliittiset liikkeet (324)
alternative label: Julkinen keskustelu, sisäpolitiikka (324 +)
alternative label: Järjestöt, poliittiset puolueet (324 +)
alternative label: Kampanjat, vaalikampanjat, EU, Suomi (324 +)
alternative label: Kampanjat, vaalikampanjat, valtiolliset (324 +)
alternative label: Kannatus, sisäpolitiikka (324 +)
alternative label: Kansalaisjärjestöt, puolueet (324 +)
alternative label: Kansalaiskeskustelu, sisäpolitiikka (324 +)
alternative label: Kansalaisliikkeet, poliittiset liikkeet (324 +)
alternative label: Kansalaisosallistuminen, poliittiset liikkeet (324 +)
alternative label: Kansalaisosallistuminen, puoluetoiminta (324 +)
alternative label: Kansalaisten osallistuminen, poliittiset liikkeet (324 +)
alternative label: Kansalaisten osallistuminen, puoluetoiminta (324 +)
alternative label: Kansalaistoiminta, poliittiset liikkeet (324 +)
alternative label: Kansalaistoiminta, puoluetoiminta (324 +)
alternative label: Kansallissosialismi, puolueet (324 +)
alternative label: Kansandemokratia, kansandemokraattiset puolueet (324 +)
alternative label: Kansanliikkeet, poliittiset liikkeet (324 +)
alternative label: Kansanrintama, puolueet (324 +)
alternative label: Keskustapuolueet, muut maat (324)
alternative label: Koalitiot, sisäpolitiikka (324 +)
alternative label: Kommunistipuolueet, muut maat (324)
alternative label: Kommunistiset puolueet, muut maat (324)
broader: URN:NBN:fi:au:hklj:320
in scheme: URN:NBN:fi:au:hklj:
narrower: Suomi
notation: 324
related: URN:NBN:fi:au:hklj:184
related: Muiden maiden yliopistot ja korkeakoulut
related: Nuorisotyö
related: Valtiofilosofia. Valtiomuodot
related: Poliittiset ja aatteelliset vähemmistöt
related: URN:NBN:fi:au:hklj:325
related: Suomen ulkopolitiikka
related: Suomen valtiojärjestelmä
related: Muiden maiden valtiojärjestelmät
related: URN:NBN:fi:au:hklj:370
related: Yhteiskunnalliset aatesuunnat. Poliittiset ideologiat
related: Sosialismi. Kommunismi
related: Konservatismi
related: Liberalismi
related: Fasismi
related: Muut aatesuunnat
related: Järjestötoiminta. Kokoustekniikka
related: Työväenliike
related: Työmarkkinajärjestöt
related: Nuorisoseuratoiminta
related: URN:NBN:fi:au:hklj:920
related: URN:NBN:fi:au:hklj:930
related: SAKSAN HISTORIA
related: BRITTEIN SAARTEN HISTORIA
related: RANSKAN HISTORIA
related: URN:NBN:fi:au:hklj:970
related: MUIDEN MAANOSIEN HISTORIA
related: Yhteiskuntaelämän, joukkotiedotuksen, liikenteen ja maanpuolustuksen edustajat
related: Suomi
scope note: Sisäpolitiikka, puolueet ja puoluejärjestelmät yleensä Eri maiden sisäpolitiikka ja sitä koskeva mielipidekirjallisuus Eri maiden puolueet, poliittiset kansan- ja vaihtoehtoliikkeet sekä niiden ohjelmat ja toiminta Jos teos koskee sekä sisä- että ulkopolitiikkaa, on etusija luokalla 324+
scope note: Inrikespolitik, partier och partisystem i allmänhet Inrikespolitik i olika länder och debattböcker om den Partier, politiska folk- och alternativrörelser samt deras program och verksamhet i olika länder Om verket handlar om både inrikes- och utrikespolitik ges företräde åt klasserna 324+ @sv

Radio- ja televisiotoiminta
type: Class
type: Concept
subclass of: URN:NBN:fi:au:hklj:384
alternative label: AV-ala, viestintä (384.4 +)
alternative label: Audiovisuaalinen ala, viestintä (384.4 +)
alternative label: Audiovisuaalinen viestintä (384.4 +)
alternative label: Satelliittiviestintä, joukkotiedotus (384.4 +)
alternative label: Yleisradio (384.4 +)
alternative label: Yleisradioliitot (384.4 +)
alternative label: Yleisradiotoiminta (384.4 +)
alternative label: Yleisradioyhtiöt (384.4 +)
alternative label: AV-branschen, kommunikation (384.4 +) @sv
alternative label: Audiovisuell kommunikation (384.4 +) @sv
alternative label: Audiovisuella branschen, kommunikation (384.4 +) @sv
alternative label: Rundradiobolag (384.4 +) @sv
alternative label: Rundradioförbund (384.4 +) @sv
alternative label: Rundradion (384.4 +) @sv
alternative label: Rundradioverksamhet (384.4 +) @sv
alternative label: Satellitkommunikation, masskommunikation (384.4 +) @sv
broader: URN:NBN:fi:au:hklj:384
in scheme: URN:NBN:fi:au:hklj:
narrower: Radiotoiminta
narrower: URN:NBN:fi:au:hklj:384.42
notation: 384.4
preferred label: Radio and television work @en
preferred label: Programverksamhet i radio och television @sv
related: Kasvatusfilosofia. Kasvatustavoitteet
related: URN:NBN:fi:au:hklj:182
related: Filosofian ja psykologian opetusoppi
related: Uskonnon opetusoppi
related: Yhteiskuntatieteiden opetusoppi
related: Maantieteen ja kansatieteen opetusoppi
related: Matematiikan ja luonnontieteiden opetusoppi
related: Sovellettujen tieteiden opetusoppi
related: Taideaineiden opetusoppi
related: Musiikin opetusoppi
related: Liikunnan ja urheilun opetusoppi
related: Kirjallisuuden ja kielten opetusoppi
related: Historian opetusoppi
related: URN:NBN:fi:au:hklj:320
related: URN:NBN:fi:au:hklj:332.1
related: Elämäntapojen sosiologia. Kulttuurisosiologia
related: URN:NBN:fi:au:hklj:627.7
related: Tietoliikenne. Viestintätekniikka. Multimedia
related: URN:NBN:fi:au:hklj:627.753
related: URN:NBN:fi:au:hklj:627.7531
related: URN:NBN:fi:au:hklj:627.7532
related: Öljy. Maakaasu
related: Materiaalitoiminnot. Logistiikka
related: Mainonta
related: URN:NBN:fi:au:hklj:721
related: Kaupunkisuunnittelu. Kaupunkiarkkitehtuuri
related: Ilmaisutaito. Puhetaito. Lausuntataide
related: URN:NBN:fi:au:hklj:783.68
scope note: Teokset, jotka koskevat sekä radio- että televisiotoimintaa Sähköiset joukkoviestimet yleensä Jos teos koskee sekä radio- tai televisiotoimintaa että radio- tai televisiotekniikkaa, on etusija luokalla 384.4+
scope note: Verk som rör programverksamhet i både radio och television Elektroniska massmedier i allmänhet Om verket handlar om både programverksamhet i radio eller television och radio- eller televisionsteknik ges företräde åt klass 384.4+ @sv

Sotien yhteiskunnalliset vaikutukset
type: Class
type: Concept
subclass of: URN:NBN:fi:au:hklj:390
alternative label: Epäinhimillisyys, sotarikokset (394)
alternative label: Etniset puhdistukset (394)
alternative label: Etniset puhdistukset, sotalait (394)
alternative label: Etniset puhdistukset, sotavangit, siviiliväestöa asema sodassa (394)
alternative label: Evakuointi, sotien vaikutukset siviiliväestöön (394)
alternative label: Fyysinen väkivalta, siviiliväestö sodassa (394)
alternative label: Fyysinen väkivalta, sotarikokset (394)
alternative label: Hirtto, sotalait (394)
alternative label: Hirtto, sotarikokset (394)
alternative label: Hirttäminen, sotalait (394)
alternative label: Hirttäminen, sotarikokset (394)
alternative label: Hälytystila, sotien yhteiskunnalliset vaikutukset (394)
alternative label: Hävittäminen, sotien yhteiskunnalliset vaikutukset (394)
alternative label: Hävitys, sotiuen yhteiskunnalliset vaikutukset (394)
alternative label: Joukkomurha, etniset puhdistukset (394)
alternative label: Joukkomurha, sotarikokset (394)
alternative label: Joukkotuho, etniset puhdistukset (394)
alternative label: Joukkotuho, sotarikokset (394)
alternative label: Joukkotuhonta (394)
alternative label: Joukkotuhonta, etniset puhdistukset (394)
alternative label: Joukkotuhonta, sotarikokset (394)
alternative label: Jälleenrakennus (394)
alternative label: Jälleenrakentaminen (394)
alternative label: Kansanmurha (394)
alternative label: Kansanmurha, etniset puhdistukset (394)
alternative label: Kansanmurha, sotarikokset (394)
alternative label: Karkaaminen, sotavangit (394)
alternative label: Katastrofiapu, sotien vaikutukset (394)
alternative label: Kenttäoikeudet (394)
alternative label: Keskitysleirit, sotavankeus (394)
alternative label: Kivittäminen, sotalait (394)
alternative label: Kivittäminen, sotarikokset (394)
alternative label: Kivitys, sotalait (394)
alternative label: Kivitys, sotarikokset (394)
alternative label: Korvaukset, sotakorvaukset (394)
alternative label: Korvikkeet (394)
alternative label: Kotirintama (394)
alternative label: Maahanmuuttajat, sotien vaikutukset (394)
alternative label: Maanpako, sotien vaikutukset (394)
alternative label: Mestaus, sotalait (394)
alternative label: Mestaus, sotarikokset (394)
broader: URN:NBN:fi:au:hklj:390
in scheme: URN:NBN:fi:au:hklj:
notation: 394
related: URN:NBN:fi:au:hklj:320
related: URN:NBN:fi:au:hklj:323
related: Rotujen asema. Rotusyrjintä
related: Juutalaisten asema. Antisemitismi
related: Poliittiset ja aatteelliset vähemmistöt
related: Orjuus
related: URN:NBN:fi:au:hklj:325
related: Rauhankysymys. Rauhantutkimus
related: URN:NBN:fi:au:hklj:330
related: URN:NBN:fi:au:hklj:332.2
related: Rikosoikeus
related: Kansainvälinen oikeus
related: URN:NBN:fi:au:hklj:340
related: Organisaatioiden ja laitosten sosiologia
related: Kriminologia. Kriminaalisosiologia
related: Maapolitiikka
related: Siirtolaisuus
related: URN:NBN:fi:au:hklj:373
related: URN:NBN:fi:au:hklj:394.09
related: Väestönsuojelu
related: URN:NBN:fi:au:hklj:909
related: Vanhan ajan historia
related: Keskiajan historia 400-1499
related: Uuden ajan historia 1500-1788
related: Uusimman ajan historia 1789-1913
related: Nykyajan historia 1914-1938
related: I maailmansodan historia 1914-1918
related: Nykyajan historia 1939-
related: II maailmansodan historia 1939-1945
related: Vuoden 1918 sota
related: Sodat 1939-1945
scope note: Siviiliväestön asema sodassa. Kotirintama. Siviilikohteiden pommitus Väestönsiirrot. Siirtoväki. Evakot. Sotalapset Sotalait. Sotarikokset. Sotasyyllisyys Sotapropaganda. Sotavangit. Internointi. Sotakorvaukset. Jälleenrakennus
scope note: Civilbefolkningens ställning i krig. Hemmafronten. Bombning av civila mål Flyttning av befolkningen. Förflyttad befolkning. Evakuerade. Krigsbarn. Krigslagar. Krigsförbrytelser. Krigsansvarighet Krigspropaganda. Krigsfångar. Internering. Krigsskadestånd. Återuppbyggnad @sv

Syöpätaudit
type: Class
type: Concept
subclass of: Sisäelimet. Sisätaudit
alternative label: Adenokarsinooma (617.31)
alternative label: Akuutti myelooinen leukemia (617.31)
alternative label: Altisteet, karsinogeenit (617.31)
alternative label: Altistuminen, karsinogeenit (617.31)
alternative label: Angiofibrooma, kasvaimet (617.31)
alternative label: Apoptoosi, syöpätaudit (617.31)
alternative label: Asbesti, karsinogeenit (617.31)
alternative label: B-solulymfooma, syöpätaudit (617.31)
alternative label: Dieettikeittokirjat, syöpätaudit (617.31)
alternative label: Haima, haimasyöpä (617.31)
alternative label: Haimasairaudet, haimasyöpä (617.31)
alternative label: Haimasyöpä (617.31)
alternative label: Haimataudit, haimasyöpä (617.31)
alternative label: Hengityselinten taudit, keuhkosyöpä (617.31)
alternative label: Hiustenlähtö, sytostaatti- ja sädehoito (617.31)
alternative label: Homemyrkyt, karsinogeenit (617.31)
alternative label: Iho- ja sukupuolitaudit, ihosyöpä (617.31)
alternative label: Ihosairaudet, ihosyöpä (617.31)
alternative label: Ihosyöpä (617.31)
alternative label: Ihotaudit, ihosyöpä (617.31)
alternative label: Imukudoskasvaimet (617.31)
alternative label: Imukudossyövät (617.31)
alternative label: Imusolmukekasvaimet (617.31)
alternative label: Imusolmukesyöpä (617.31)
alternative label: Interferonit, syövän hoito (617.31)
alternative label: Jättisolukasvaimet, lääketiede (617.31)
alternative label: Kaljuuntuminen, sytostaatti- ja sädehoito (617.31)
alternative label: Kaposin sarkooma, syöpätaudit (617.31)
alternative label: Karsinogeenit, lääketiede (617.31)
alternative label: Kasvaimet, lääketiede (617.31)
alternative label: Kasvainoppi (617.31)
alternative label: Keuhkosairaudet, keuhkosyöpä (617.31)
alternative label: Keuhkosyöpä (617.31)
alternative label: Keuhkot, taudit (617.31)
alternative label: Krooninen myelooinen leukemia (617.31)
alternative label: Kurkkusyöpä (617.31)
alternative label: Kurkkutaudit, kurkkusyöpä (617.31)
alternative label: Kurkkutaudit, kurkunpään syöpä (617.31)
alternative label: LGL-leukemia (617.31)
alternative label: Leukemia (617.31)
broader: Sisäelimet. Sisätaudit
in scheme: URN:NBN:fi:au:hklj:
notation: 617.31
related: URN:NBN:fi:au:hklj:181.9
related: URN:NBN:fi:au:hklj:332.22
related: URN:NBN:fi:au:hklj:371.6
related: URN:NBN:fi:au:hklj:373
related: URN:NBN:fi:au:hklj:576
related: Anatomia
related: URN:NBN:fi:au:hklj:612
related: URN:NBN:fi:au:hklj:613.1
related: Henkilökohtainen terveydenhoito
related: URN:NBN:fi:au:hklj:613.3
related: URN:NBN:fi:au:hklj:613.31
related: URN:NBN:fi:au:hklj:613.5
related: URN:NBN:fi:au:hklj:615
related: URN:NBN:fi:au:hklj:615.1
related: URN:NBN:fi:au:hklj:615.3
related: URN:NBN:fi:au:hklj:615.8
related: URN:NBN:fi:au:hklj:616
related: URN:NBN:fi:au:hklj:616.2
related: URN:NBN:fi:au:hklj:616.3
related: URN:NBN:fi:au:hklj:617.1
related: URN:NBN:fi:au:hklj:617.2
related: Sydän- ja verenkiertoelimet. Sydän- ja verenkiertoelinten taudit. Veri. Veritaudit
related: URN:NBN:fi:au:hklj:617.4
related: Iho. Ihotaudit. Sukupuolielimet. Sukupuolitaudit
related: URN:NBN:fi:au:hklj:617.7
related: Raskaus. Sikiönkehitys. Synnytys. Gynekologia
related: Korva. Nenäontelo. Kurkku. Korva-, nenä- ja kurkkutaudit
related: Hengityselimet. Hengityselinten taudit
related: Hampaat. Hammaslääketiede
related: Liikuntaelimet. Liikuntaelinten taudit
related: URN:NBN:fi:au:hklj:691.1
related: URN:NBN:fi:au:hklj:691.12
scope note: Syöpätaudit, niiden ennaltaehkäisy, diagnostiikka, hoito ja patologia Syöpätaudit ja syöpäkasvaimet yleensä. Kasvaimet yleensä Eri elinten ja kudosten syövät Sisä- ja erityselinten syöpä. Mahasyöpä. Keuhkosyöpä. Rintasyöpä. Luu- ja lihaskudossyöpä. Ihosyöpä. Aivo- ja hermokudoksen syöpä. Verikudoksen syöpä. Leukemia. Imukudoksen syöpä. Lasten syövät Syövän leikkaushoito. Sädehoito. Sytostaattihoito. Solumyrkyt Syövän syyt. Karsinogeeniset aineet
scope note: Cancersjukdomar, förebyggande och behandling av dem samt deras diagnostik och patologi Cancersjukdomar och cancertumörer i allmänhet. Tumörer i allmänhet Cancer i olika organ och vävnader Cancer i inre de organen och det inresekretoriska systemet. Magcancer. Lungcancer. Bröstcancer. Skelettcancer och cancer i muskelvävnaden. Hudcancer. Hjärncancer och cancer i nervvävnaden. Cancer i blodvävnaden. Leukemi. Cancer i lymfatiska vävnaden. Cancer hos barn Operativ behandling av cancer. Strålbehandling. Cytostatbehandling. Cellgifter Orsaker till cancer. Karcinogena ämnen @sv

Liikuntaelimet. Liikuntaelinten taudit
type: Class
type: Concept
subclass of: URN:NBN:fi:au:hklj:617.9
alternative label: Ahdas olka, nivelsairaudet (617.94)
alternative label: Akillesjänne, ihmisen liikuntaelimet (617.94)
alternative label: Akillesjänne, ortopedia (617.94)
alternative label: Alaraajat, ihmisen anatomia ja fysiologia (617.94)
alternative label: Alaraajat, ortopedia (617.94)
alternative label: Amputaatio, ortopedia (617.94)
alternative label: Artroosi (617.94)
alternative label: Atrofia, liikuntaelintaudit (617.94)
alternative label: EMG (617.94)
alternative label: Elektromyografia (617.94)
alternative label: Endoteeli (617.94)
alternative label: Eturistiside, anatomia ja fysiologia (617.94)
alternative label: Faskiat (617.94)
alternative label: Hartiat, ortopedia (617.94)
alternative label: Iskias (617.94)
alternative label: Jalat, ihmisen anatomia ja fysiologia (617.94)
alternative label: Jalat, ortopedia (617.94)
alternative label: Jalkaterapia (617.94)
alternative label: Jänteet, ihmisen liikuntaelimet (617.94)
alternative label: Jänteet, ortopedia (617.94)
alternative label: Jäykkähalvaus (617.94)
alternative label: Kallo, ihmisen anatomia (617.94)
alternative label: Kallonpohja, ihmisen anatomia (617.94)
alternative label: Kantajänne, ihmisen liikuntaelimet (617.94)
alternative label: Kantajänne, ortopedia (617.94)
alternative label: Kiertäjäkalvosimen repeämä, tuki- ja liikuntaelinten taudit (617.94)
alternative label: Kipsaus (617.94)
alternative label: Kollageenit, jänne- ja luukudos (617.94)
alternative label: Korvien soiminen (617.94)
alternative label: Kouristuksellisuus (617.94)
alternative label: Kraniosynostoosit, luuston sairaudet (617.94)
alternative label: Kädet, anatomia ja fysiologia (617.94)
alternative label: Kädet, ortopedia (617.94)
alternative label: Kääpiöt, ortopediset taudit (617.94)
alternative label: Lantio, anatomia ja fysiologia (617.94)
alternative label: Lantio, liikuntaelinten taudit (617.94)
alternative label: Lihakset, anatomia ja fysiologia (617.94)
alternative label: Lihakset, liikuntaelintaudit (617.94)
alternative label: Lihaskalvot (617.94)
alternative label: Lihaskunto, lihakset, lihasten taudit ja vammat (617.94)
broader: URN:NBN:fi:au:hklj:617.9
in scheme: URN:NBN:fi:au:hklj:
notation: 617.94
related: URN:NBN:fi:au:hklj:181.9
related: Liikuntavammaiset
related: URN:NBN:fi:au:hklj:332.22
related: URN:NBN:fi:au:hklj:371.6
related: URN:NBN:fi:au:hklj:373
related: URN:NBN:fi:au:hklj:576
related: Lääkärikirjat. Ensiapuoppaat
related: Anatomia
related: URN:NBN:fi:au:hklj:612
related: URN:NBN:fi:au:hklj:613.1
related: URN:NBN:fi:au:hklj:613.3
related: URN:NBN:fi:au:hklj:613.31
related: URN:NBN:fi:au:hklj:613.5
related: Urheilulääketiede
related: URN:NBN:fi:au:hklj:615
related: URN:NBN:fi:au:hklj:615.1
related: Fysioterapia. Fysiologiset hoitomuodot
related: URN:NBN:fi:au:hklj:615.3
related: URN:NBN:fi:au:hklj:615.8
related: Vaihtoehtolääkintä. Luonnonparannus
related: URN:NBN:fi:au:hklj:616
related: URN:NBN:fi:au:hklj:616.2
related: URN:NBN:fi:au:hklj:616.3
related: URN:NBN:fi:au:hklj:617.1
related: Syöpätaudit
related: Reumataudit
related: URN:NBN:fi:au:hklj:617.4
related: URN:NBN:fi:au:hklj:617.7
related: Muut maakulkuneuvot
related: Optiset ja lääketieteelliset laitteet
related: URN:NBN:fi:au:hklj:691.1
related: URN:NBN:fi:au:hklj:691.12
scope note: Ortopedia. Traumatologia Luusto, luut, lihakset, nivelet ja jänteet, niiden anatomia ja fysiologia Liikuntaelinten taudit, niiden ennaltaehkäisy, diagnostiikka, hoito ja patologia Selkäsairaudet. Ortopedian alaan kuuluvat työperäiset sairaudet ja niiden hoito Osteoporoosi. Luukato Liikuntavammaisten lääketieteellinen hoito, kuntoutus, apuvälineet ja proteesit. Pyörätuolit
scope note: Ortopedi. Traumatologi Skelett, ben, muskler, leder och senor, deras anatomi och fysiologi Rörelseorganens sjukdomar, förebyggande och behandling av dem samt deras diagnostik och patologi Ryggens sjukdomar. Arbetsrelaterade sjukdomar inom det ortopediska området och behandling av dem Osteoporos. Benskörhet Medicinsk vård, rehabilitering, hjälpmedel och proteser för rörelsehindrade. Rullstolar @sv

Koneenrakennus. Pneumatiikka. Hydrauliikka
type: Class
type: Concept
subclass of: Yleinen konetekniikka
alternative label: ABS-jarrut, koneet (622.1)
alternative label: ABS-jarrut, moottorit (622.1)
alternative label: Akselit (622.1)
alternative label: Asennus, koneenasennus (622.1)
alternative label: Hammaspyörät (622.1)
alternative label: Hammasvaihteet (622.1)
alternative label: Hihnat, koneen osat (622.1)
alternative label: Hydrauliikka, tekniikka (622.1)
alternative label: Hydraulijärjestelmät (622.1)
alternative label: Hydrauliset koneet (622.1)
alternative label: Hyötysuhde, konetekniikka (622.1)
alternative label: Ilmalämpöpumput, tekniikka (622.1)
alternative label: Ilmapumput (622.1)
alternative label: Jakoelimet, koneet (622.1)
alternative label: Jarrut, koneet (622.1)
alternative label: Jarrut, moottorit (622.1)
alternative label: Jouset, koneen osat (622.1)
alternative label: Jäähdytys (622.1)
alternative label: Jäähdytyslaitokset (622.1)
alternative label: Jäähdytyslaitteet (622.1)
alternative label: Jäähdytystekniikka (622.1)
alternative label: Jääkaapit, jäähdytystekniikka (622.1)
alternative label: Kaasujohdot (622.1)
alternative label: Kaasuputket (622.1)
alternative label: Kaasusäiliöt (622.1)
alternative label: Kampiakselit (622.1)
alternative label: Kampiakselit, konetekniikka (622.1)
alternative label: Kaukojäähdytys (622.1)
alternative label: Kaukokylmä (622.1)
alternative label: Kiinnityslaitteet, koneen osat (622.1)
alternative label: Kokoonpano, koneenrakennus (622.1)
alternative label: Komponentit, koneenosat (622.1)
alternative label: Kompressio, kompressorit (622.1)
alternative label: Kompressorit (622.1)
alternative label: Kone-elimet (622.1)
alternative label: Koneala, hydrauliikka (622.1)
alternative label: Koneala, koneenrakennus (622.1)
alternative label: Koneala, pneumatiikka (622.1)
alternative label: Koneenasennus (622.1)
alternative label: Koneenpiirustus (622.1)
alternative label: Koneenrakennus (622.1)
alternative label: Koneensuunnittelu (622.1)
alternative label: Konstruointi, koneenrakennus (622.1)
alternative label: Kryogeniikka (622.1)
broader: Yleinen konetekniikka
in scheme: URN:NBN:fi:au:hklj:
notation: 622.1
related: Mekaniikka
related: URN:NBN:fi:au:hklj:622.2
related: Voimakoneet. Moottorit. Nosto- ja kuljetuslaitteet
related: URN:NBN:fi:au:hklj:624
related: Tiet. Kadut. Tienrakennus. Kadunrakennus
related: Sillat. Sillanrakennus
related: Raideliikenneväylät. Junat. Raitiovaunut. Metro
related: Eläinten vetämät kulkuneuvot
related: Polkupyörät
related: Moottoripyörät. Mopedit
related: Autot
related: Muut maakulkuneuvot
related: Vesirakennus. Vesikulkuneuvot
related: Satamat. Satamatekniikka
related: Vesiväylät. Vesien säännöstely
related: Vesijohto-, viemäri- ja vedenpuhdistustekniikka
related: Vesikulkuneuvot
related: Laivat. Laivanrakennus
related: URN:NBN:fi:au:hklj:625.72
related: Muut vesikulkuneuvot
related: Ilmakulkuneuvot
related: Lentokoneet
related: Muut ilmakulkuneuvot
related: Sähköenergian muuttaminen, muuntaminen, jakelu ja siirto
related: URN:NBN:fi:au:hklj:631
related: URN:NBN:fi:au:hklj:681
related: Säilöntä
related: Piirustuksen materiaalit ja tekniikka
scope note: Koneenrakennus ja koneenpiirustus yleensä Koneiden suunnittelu, rakentaminen ja asennus yleensä Kone-elimet ja koneen osat yleensä Koneen kiinteät osat, liike-elimet, voimansiirto- ja kiinityslaitteet Pneumatiikka. Hydrauliikka Paineilma-, tyhjö-, kylmä- ja jäähdytystekniikka yleensä Jäähdytyskoneet yleensä. Kompressorit. Paineilmatyökalut Pumpputekniikka. Ilma-, tyhjö- ja lämpöpumput Kaasujen ja nesteiden kuljetuskoneet ja -laitteet Kaasusäiliöt, nestesäiliöt ja nesteputket Erikoisaloihin liittyvät koneet ja niiden suunnittelu alan mukaisessa luokassa
scope note: Maskinbyggnad och maskinritning i allmänhet Konstruktion, tillverkning och installation av maskiner i allmänhet Maskinelement och maskindelar i allmänhet Maskinens fasta delar, rörliga element, kraftöverföring och fästanordningar Pneumatik. Hydraulik Trycklufts-, vakuum-, kyl- och frysteknik i allmänhet Kylaggregat i allmänhet. Kompressorer. Tryckluftsredskap Pumpteknik. Luft-, vakuum- och värmepumpar Transportfordon och transportanläggningar för gas och vätskor Gasbehållare, cisterner och röranläggningar för vätskor Maskiner för specialområden och konstruktion av dem klassificeras enligt område @sv

Vesirakennus. Vesikulkuneuvot
type: Class
type: Concept
subclass of: URN:NBN:fi:au:hklj:620
alternative label: Geotekniikka, vesirakennus (625 +)
alternative label: Jää, vesirakennus (625 +)
alternative label: Koneet, kulkuneuvot (624 ... 626 +)
alternative label: Kulkuväylät, vesirakennus (625 +)
alternative label: Käyttöönotto, liikennevälineet (624 ... 626 +)
alternative label: Maanrakennus, vesirakennus (625 +)
alternative label: Maarakennus, vesirakennus (625 +)
alternative label: Maatyöt, vesirakennus (625 +)
alternative label: Meritekniikka (625 +)
alternative label: Meritekniset rakenteet (625 +)
alternative label: Offshorerakenteet (625 +)
alternative label: Rakennustekniikka, vesirakennus (625 +)
alternative label: Täytemaa, vesirakennus (625 +)
alternative label: Täyttömaa, vesirakennus (625 +)
alternative label: Vesipiirit, vesirakennus (625 +)
alternative label: Vesipolitiikka, vesirakennus (625 +)
alternative label: Vesirakennus (625 +)
alternative label: Vesirakennus, vesirakentaminen (625 +)
alternative label: Vesirakentaminen (625 +)
alternative label: Vesirakentaminen, vesirakennus (625 +)
alternative label: Viat, kulkuneuvojen viat (624 ... 626 +)
alternative label: Ympäristörakentaminen, vesirakennus (625 +)
alternative label: Byggnadsteknik, vattenbyggnad (625 +) @sv
alternative label: Fel, viat, fel på fordon (624 ... 626 +) @sv
alternative label: Fylljord, vattenbyggnad (625 +) @sv
alternative label: Geoteknik, vattenbyggnad (625 +) @sv
alternative label: Havsteknik (625 +) @sv
alternative label: Havstekniska konstruktioner (625 +) @sv
alternative label: Ibruktagande, färdmedel (624 ... 626 +) @sv
alternative label: Is, vattenbyggnad (625 +) @sv
alternative label: Jordbyggnad, vattenbyggnad (625 +) @sv
alternative label: Markarbeten, vattenbyggnad (625 +) @sv
alternative label: Markbyggnad, vattenbyggnad (625 +) @sv
alternative label: Maskiner, färdmedel (624 ... 626 +) @sv
alternative label: Miljöbyggande, vattenbyggnad (625 +) @sv
alternative label: Offshorekonstruktioner (625 +) @sv
alternative label: Passager, vattenbyggnad (625 +) @sv
alternative label: Schaktmassa, vattenbyggnad (625 +) @sv
alternative label: Vattenbyggande (625 +) @sv
alternative label: Vattenbyggande, vattenbyggnad (625 +) @sv
alternative label: Vattenbyggnad (625 +) @sv
alternative label: Vattenbyggnad, vattenbyggande (625 +) @sv
alternative label: Vattendistrikt, vattenbuggnad (625 +) @sv
alternative label: Vattenpolitik, vattenbuggnad (625 +) @sv
broader: URN:NBN:fi:au:hklj:620
in scheme: URN:NBN:fi:au:hklj:
narrower: Satamat. Satamatekniikka
narrower: Vesiväylät. Vesien säännöstely
narrower: Vesijohto-, viemäri- ja vedenpuhdistustekniikka
narrower: Vesikulkuneuvot
notation: 625
preferred label: Hydrological engineering. Watercraft @en
related: Vesioikeus
related: URN:NBN:fi:au:hklj:342
related: URN:NBN:fi:au:hklj:380
related: URN:NBN:fi:au:hklj:460
related: Hydrologia
related: Vesien suojelu
related: Energia
related: Yleinen konetekniikka
related: Koneenrakennus. Pneumatiikka. Hydrauliikka
related: Voimakoneet. Moottorit. Nosto- ja kuljetuslaitteet
related: URN:NBN:fi:au:hklj:624
related: Sillat. Sillanrakennus
related: Sähköenergian tuottaminen. Voimalatekniikka
related: URN:NBN:fi:au:hklj:631
related: Maanviljely
related: URN:NBN:fi:au:hklj:657
related: Kalastus
related: URN:NBN:fi:au:hklj:660
related: Rakennusstatiikka. Rakennusaineet
related: Tekninen rakennussuunnittelu
related: Geotekniikka. Maatyöt
related: Merenkulkuoppi
related: Moottoriurheilu. Lentourheilu
scope note: Vesirakennuksen yleisteokset Teokset, joissa on sekä satamatekniikkaa että vesiväylien rakentamista tai vesien säännöstelyä Rakennusstatiikka, tekninen rakennussuunnittelu sekä geotekniikka ja maatyöt vesirakennuksessa yleensä Teokset, jotka koskevat sekä vesirakennusta että laivoja tai veneitä
scope note: Allmänna verk som rör vattenbyggnad Verk som handlar om såväl hamnteknik som bygge av vattenleder eller vattenreglering Byggnadsstatik, teknisk byggnadsplanering samt geoteknik och anläggningsarbeten ur vattenbyggnadssynvinkel i allmänhet Verk som handlar om såväl vattenbyggnad som fartyg eller båtar @sv

Hyötykasvit
type: Class
type: Concept
subclass of: Puutarhanhoito. Hyötykasvit. Huone- ja koristekasvit
alternative label: Herkkusienet, viljely (653.2)
alternative label: Hyötykasvit (653.2 +)
alternative label: Hyötykasvit, puutarhanhoito (653.2 +)
alternative label: Jalostaminen, hyötykasvit (653.2 +)
alternative label: Jalostus, hyötykasvit (653.2 +)
alternative label: Kaakaopuu, hyötykasvit (653.2)
alternative label: Kasvien hyötykäyttö (653.2)
alternative label: Kasvien hyötykäyttö, hyötykasvit (653.2 +)
alternative label: Kasvien jalostus, hyötykasvit (653.2 +)
alternative label: Kasvilajit, hyötykasvit (653.2 +)
alternative label: Kasvinjalostus, hyötykasvit (653.2 +)
alternative label: Kasvit, hyötykasvit (653.2 +)
alternative label: Kattopuutarhat, hyötykasvit (653.2 +)
alternative label: Kylmänkestävyys, hyötykasvit (653.2 +)
alternative label: Lajimääritys, hyötykasvit (653.2 +)
alternative label: Lajinmääritys, hyötykasvit (653.2 +)
alternative label: Lajit, hyötykasvilajit (653.2 +)
alternative label: Luonnonkasvit, luonnonvaraiset hyötykasvit (653.2 +)
alternative label: Luonnonvaraiset kasvit, luonnonvaraiset hyötykasvit (653.2 +)
alternative label: Luontaiselinkeinot, hyötykasvien keräily (653.2 +)
alternative label: Luonto-oppaat, kalastus (653.2)
alternative label: Maatiaislajikkeet, hyötykasvit (653.2)
alternative label: Määritys, hyötykasvit (653.2 +)
alternative label: Pakkasenkesto, hyötykasvit (653.2 +)
alternative label: Pakkasenkestävyys, hyötykasvit (653.2 +)
alternative label: Pakkaskestävyys, hyötykasvit (653.2 +)
alternative label: Perinnekasvit, hyötykasvit (653.2)
alternative label: Peruna, puutarhanhoito (653.2)
alternative label: Puutarhakasvit, hyötykasvit (653.2 +)
alternative label: Pähkinät, viljely, keräily (653.2)
alternative label: Risteytys, hyötykasvit (653.2 +)
alternative label: Rodut, jalostus, hyötykasvit (653.2 +)
alternative label: Sienenviljely (653.2)
alternative label: Sienenviljelylaitokset (653.2)
alternative label: Sienet, viljely (653.2)
alternative label: Sienimöt (653.2)
alternative label: Sientenviljely (653.2)
alternative label: Siitake, viljely (653.2)
alternative label: Tryffelit, sienet, viljely (653.2)
alternative label: Viljely, sienten viljely (653.2)
alternative label: Villivihannekset, luonnonvaraiset hyötykasvit (653.2 +)
alternative label: Artbestämning, nyttoväxter (653.2 +) @sv
alternative label: Arter, nyttoväxtarter (653.2 +) @sv
broader: Puutarhanhoito. Hyötykasvit. Huone- ja koristekasvit
in scheme: URN:NBN:fi:au:hklj:
narrower: Yrtti- ja maustekasvit
narrower: Hedelmä-, marja- ja vihanneskasvit
notation: 653.2
related: Antroposofia
related: URN:NBN:fi:au:hklj:342
related: URN:NBN:fi:au:hklj:576
related: KASVITIEDE
related: Systemaattinen kasvitiede
related: Sienet
related: Putkilokasvit
related: Hyönteiset
related: URN:NBN:fi:au:hklj:615.1
related: Vaihtoehtolääkintä. Luonnonparannus
related: Kivihiili. Turve
related: URN:NBN:fi:au:hklj:649.91
related: Maatalouspolitiikka
related: URN:NBN:fi:au:hklj:650.2
related: URN:NBN:fi:au:hklj:651
related: Maanviljely
related: Koristekasvit
related: Huonekasvit
related: URN:NBN:fi:au:hklj:657
related: Rakennusten erillistilat
related: URN:NBN:fi:au:hklj:691.1
related: Leipominen
related: URN:NBN:fi:au:hklj:691.12
related: URN:NBN:fi:au:hklj:691.13
related: Kalaruoat
related: Eri maiden ja alueiden ruokalajit ja ruokakulttuuri
related: Luonnon- ja kulttuurimaiseman suunnittelu
scope note: Hyötykasveja koskevat yleisteokset. Yleiset hyötykasvioppaat Hyötykasvien viljely yleensä. Sienten viljely Luonnonvaraiset hyötykasvit ja niiden keräily yleensä Jos teos koskee sekä maanviljelystä että puutarhanhoitoa, on etusija luokalla 652 Jos teoksessa on sekä hyötykasvien esittelyä, viljelyä tai keräilyä että ruoanvalmistusohjeita, on etusija luokalla 691.1+
scope note: Allmänna verk som rör nyttoväxter. Allmänna handledningar som rör nyttoväxter Odling av nyttoväxter i allmänhet. Svampodling Vilda nyttoväxter och samlande av dem i allmänhet Om verket handlar om både jordbruk och trädgårdsodling ges företräde åt klass 652 Om verket handlar om såväl presentationer, odling och samling av nyttoväxter som matrecept, ges företräde åt klass 691.1+ @sv

Viihdemusiikki
type: Class
type: Concept
subclass of: URN:NBN:fi:au:hklj:788
alternative label: Beguinet, viihdemusiikki (788.4 +)
alternative label: Bolerot, viihdemusiikki (788.4 +)
alternative label: Bossa nova, viihdemusiikki (788.4 +)
alternative label: Calypso, viihdemusiikki (788.4 +)
alternative label: Cancanit, viihdemusiikki (788.4 +)
alternative label: Cha-cha-chat, viihdemusiikki (788.4 +)
alternative label: Chansonit (788.4 +)
alternative label: Charlestonit, viihdemusiikki (788.4 +)
alternative label: Congat, viihdemusiikki (788.4 +)
alternative label: Cumbia (788.4 +)
alternative label: Duetot, viihdemusiikki (788.4 +)
alternative label: Duot, viihdemusiikki (788.4 +)
alternative label: Evergreenit, viihdemusiikki (788.4 +)
alternative label: Flamenco, viihdemusiikki (788.4 +)
alternative label: Foxtrotit, tanssimusiikki (788.4 +)
alternative label: Haitarijazz (788.4 +)
alternative label: Humpat, viihdemusiikki (788.4 +)
alternative label: Häävalssit, viihdemusiikki (788.4 +)
alternative label: Ikivihreät, viihdemusiikki (788.4 +)
alternative label: Instrumentaalimusiikki, viihdemusiikki (788.4)
alternative label: Instrumentaalinen viihdemusiikki (788.4)
alternative label: Iskelmälyriikka, viihdemusiikki (788.4 +)
alternative label: Iskelmäsanoitukset, viihdemusiikki (788.4 +)
alternative label: Iskelmät (788.4 +)
alternative label: Itämainen tanssi, viihdemusiikki (788.4)
alternative label: Jenkat, viihdemusiikki (788.4 +)
alternative label: Jivet, viihdemusiikki (788.4 +)
alternative label: Karaoke, viihdemusiikki (788.4 +)
alternative label: Kupletit (788.4 +)
alternative label: Lambada, viihdemusiikki (788.4 +)
alternative label: Laulelmat (788.4 +)
alternative label: Laulumusiikki, laulelmat (788.4 +)
alternative label: Laulut, laulelmat (788.4 +)
alternative label: Lounge, viihdemusiikki (788.4 +)
alternative label: Mambo, viihdemusiikki (788.4 +)
alternative label: Mariachimusiikki, viihdemusiikki (788.4 +)
alternative label: Mento, viihdemusiikki (788.4 +)
alternative label: Merengue, viihdemusiikki (788.4 +)
alternative label: Mestizomusiikki, viihdemusiikki (788.4 +)
alternative label: Muzak (788.4 +)
alternative label: Napatanssi, viihdemusiikki (788.4)
alternative label: Orkesterimusiikki, viihdemusiikki (788.4 +)
alternative label: Orkesterit, viihdeorkesterit (788.4 +)
alternative label: Pasodoblet, viihdemusiikki (788.4 +)
alternative label: Pilkkalaulut, viihdemusiikki (788.4 +)
alternative label: Polkat, viihdemusiikki (788.4 +)
alternative label: Populaarimusiikki, viihdemusiikki, laulelmat (788.4 +)
alternative label: Rapsodiat, viihdemusiikki (788.4 +)
alternative label: Rumbat, viihdemusiikki (788.4 +)
alternative label: Rytmi- ja viihdemusiikki, viihdemusiikki, laulelmat (788.4 +)
alternative label: Rytmimusiikki, viihdemusiikki, laulelmat (788.4 +)
alternative label: Salonkimusiikki, viihdemusiikki (788.4 +)
alternative label: Salonkitanssit, viihdemusiikki (788.4 +)
broader: URN:NBN:fi:au:hklj:788
in scheme: URN:NBN:fi:au:hklj:
narrower: Suomenkielinen viihdemusiikki
narrower: Ruotsin-, tanskan- ja norjankielinen viihdemusiikki
narrower: Saksankielinen viihdemusiikki
narrower: Englanninkielinen viihdemusiikki
narrower: Ranskankielinen viihdemusiikki
narrower: Italiankielinen viihdemusiikki
narrower: Venäjän-, valkovenäjän- ja ukrainankielinen viihdemusiikki
narrower: Espanjankielinen viihdemusiikki
narrower: Muunkielinen viihdemusiikki
notation: 788.4
related: Tanssitaide
related: URN:NBN:fi:au:hklj:782.4
related: URN:NBN:fi:au:hklj:783
related: URN:NBN:fi:au:hklj:783.1
related: URN:NBN:fi:au:hklj:785.7
related: URN:NBN:fi:au:hklj:786.8
related: URN:NBN:fi:au:hklj:787.112
related: Eurooppalainen maailmanmusiikki. Europpalainen etninen pop ja viihdemusikki
related: URN:NBN:fi:au:hklj:789
related: URN:NBN:fi:au:hklj:795
scope note: Yleisteokset ja sekasisältöiset kokoelmat Tässä puhtaasti instrumentaalinen viihdemusiikki Tässä ja alaluokissa myös laulettu viihdemusiikki, iskelmät ja laulelmat sekä niitä koskeva kirjallisuus Tässä myös kilpatanssimusiikki Tässä ja alaluokissa myös viihdemusiikin historia ja henkilöhistoria
scope note: Allmänna verk och samlingar med blandat innehåll Hit rent instrumentell underhållningsmusik Hit och till underklasserna också underhållningsmusik med sång, schlagrar och visor samt litteratur om den Hit också musik till tävlingsdans Hit och till underklasserna också underhållningsmusikens historia och personhistoria @sv

Pelit
type: Class
type: Concept
subclass of: URN:NBN:fi:au:hklj:798
alternative label: Ajanviete, pelit (798.2 +)
alternative label: Ajopelit, digitaaliset pelit (798.2 +)
alternative label: Ammuntapelit (798.2)
alternative label: Arpakuutiot (798.2)
alternative label: Avatarit, tietokonepelit (798.2 +)
alternative label: Backgammon (798.2)
alternative label: Biljardi (798.2)
alternative label: CD-ROM-pelit (798.2 +)
alternative label: Cyberpunk, pelit (798.2)
alternative label: Darts (798.2)
alternative label: Digitaaliset pelit (798.2 +)
alternative label: Domino-peli (798.2)
alternative label: E-urheilu (798.2)
alternative label: Elektroniikkapelit (798.2 +)
alternative label: Fantasiapelit, digitaaliset pelit (798.2)
alternative label: Flipperit (798.2)
alternative label: Halma-peli (798.2)
alternative label: Harrastukset, pelit (798.2 +)
alternative label: Kaksinpelit (798.2)
alternative label: Konsolipelit (798.2 +)
alternative label: Kyberpunk, pelit (798.2)
alternative label: Lastenpelit (798.2 +)
alternative label: Lautapelit (798.2 +)
alternative label: Ludologia (798.2 +)
alternative label: Mah-jong (798.2)
alternative label: Minecraft (798.2)
alternative label: Moninpelit, konsolipelit (798.2 +)
alternative label: Musiikkipelit (798.2 +)
alternative label: Nopat (798.2)
alternative label: Noppapelit (798.2)
alternative label: Ohjekirjat, peliohjeet (798.2 +)
alternative label: Pakohuonepelit (798.2)
alternative label: Pakopelit (798.2)
alternative label: Palapelit (798.2)
alternative label: Pelihahmot (798.2 +)
alternative label: Pelikonsolit (798.2 +)
alternative label: Pelikulttuuri (798.2 +)
alternative label: Pelillistäminen, pelit (798.2 +)
alternative label: Pelillistäminen, tietokonepelit (798.2 +)
alternative label: Pelisuunnittelu (798.2 +)
alternative label: Pelit (798.2 +)
alternative label: Pelit, lautapelit (798.2 +)
alternative label: Pelit, seikkailupelit (798.2)
alternative label: Pelit, seurapelit (798.2)
alternative label: Pelit, tietokonepelit (798.2 +)
broader: URN:NBN:fi:au:hklj:798
in scheme: URN:NBN:fi:au:hklj:
narrower: Korttipelit. Pasianssit
narrower: Shakki
narrower: Roolipelit
notation: 798.2
related: URN:NBN:fi:au:hklj:627.7
related: URN:NBN:fi:au:hklj:627.73
related: Käyttöjärjestelmät
related: Tekstinkäsittelyohjelmat
related: Taulukkolaskentaohjelmat
related: Tietokantaohjelmat
related: Kuvankäsittelyohjelmat. Grafiikkaohjelmat. Taitto-ohjelmat
related: Tietoliikenneohjelmat
related: Tietokoneiden lisälaitteet
related: Elektroniikka
related: Muu näyttämö- tai draamamusiikki. Pelimusiikki
related: Muut urheilu- ja liikuntamuodot
related: Palloilu
related: Jalkapallo
related: Jääkiekko
related: Muut joukkuepelit
related: Tennis. Squash. Sulkapallo
related: Pöytätennis
related: Golf
related: Keilailu
related: Muut pallopelit
related: Leikit
related: Tietokilpailut
related: Arpajaiset. Veikkaus. Uhkapeli
scope note: Pelejä koskevat yleisteokset Tässä ja alaluokissa pelit, peliohjeet ja pelien säännöt Seurapelit. Seikkailupelit. Lauta- ja noppapelit Tässä esim. backgammon, domino, go, halma, mah-jong, tammi ja tangram Tietokonepelit. Pelikonsolit. Videopelit. Elektroniikkapelit. Flipperit Biljardi. Snooker. Tikanheitto. Darts
scope note: Allmänna verk om spel Hit och till underklasserna spel, spelinstruktioner och spelregler Sällskapsspel. Äventyrsspel. Brädspel och tärningsspel Hit t.ex. backgammon, domino, go, halma, mahjong, dam och tangram Datorspel. Spelkonsoler. Videospel. Elektroniska spel. Flipper Biljard. Snooker. Pilkastning. Darts @sv

KIELITIEDE
type: Class
type: Concept
subclass of: URN:NBN:fi:au:hklj:800
alternative label: Alatyyli, kielitiede (850)
alternative label: Alkuperäiskielet (850)
alternative label: Aluelingvistiikka (850)
alternative label: Ammattikieli, kielitiede (850)
alternative label: Ammattislangit (850)
alternative label: Antropologinen kielitiede (850)
alternative label: Areaalilingvistiikka (850)
alternative label: Arkaismit, kielitiede (850)
alternative label: Asiateksti, kielitiede (850)
alternative label: Asiatyyli, kielitiede (850)
alternative label: Australialaiset kielet, kielikunnat (850)
alternative label: Dialektologia (850)
alternative label: Ei-kirjalliset kielet (850)
alternative label: Eksonyymit, kielitiede (850 ... 859)
alternative label: Erikoiskielet (850)
alternative label: Filologia (850 ... 899 +)
alternative label: Haukkumasanat, kielitiede (850)
alternative label: Herjaukset, kielitiede (850)
alternative label: Idiolektit, kielitiede (850)
alternative label: Idiomit, kielitiede (850)
alternative label: Ilmaukset, kielitiede (850 ... 859)
alternative label: Itämaiset kielet (850 ... 859)
alternative label: Kielellinen tietoisuus (850)
alternative label: Kielelliset vaikutukset, kielitiede (850 ... 859)
alternative label: Kielennäytteet, kielitiede (850)
alternative label: Kielentutkimus (850 ... 859)
alternative label: Kielet, kielitiede (850 ... 859)
alternative label: Kielialueet (850)
alternative label: Kielikasvatus, kielitiede (850)
alternative label: Kielikeskukset (850)
alternative label: Kielikokeet (850)
alternative label: Kielikunnat (850)
alternative label: Kielimaantiede (850)
alternative label: Kielisukulaisuus (850)
alternative label: Kieliteknologia, kielitiede (850)
alternative label: Kielitiede (850 ... 859)
alternative label: Kielitutkinnot (850)
alternative label: Kielitypologia (850)
alternative label: Kielten ryhmitys (850)
alternative label: Kiitokset, kielitiede (850)
alternative label: Kirjakieli, kielitiede (850)
alternative label: Kirjallinen ilmaisu, kielitiede (850)
alternative label: Kirjoituksettomat kielet (850)
alternative label: Kiroilu, kielitiede (850)
alternative label: Konteksti, kielitiede (850)
alternative label: Kontrastiivinen tutkimus, vertaileva kielitiede (850 ... 859)
alternative label: Korpukset (850 ... 859)
alternative label: Korpuslingvistiikka (850 ... 859)
alternative label: Lakikieli (850)
broader: URN:NBN:fi:au:hklj:800
in scheme: URN:NBN:fi:au:hklj:
narrower: Kielenkääntäminen. Tulkkaus
narrower: Kielifilosofia
narrower: Kielipsykologia. Kielisosiologia. Kielipolitiikka
narrower: Monikieliset sanakirjat. Sivistyssanakirjat
narrower: Kielioppi. Muoto-oppi. Sanaoppi. Semantiikka
narrower: Äänneoppi
narrower: Etymologia. Onomastiikka
narrower: Keinotekoiset kielet
narrower: Kielihistoria
notation: 850
related: Kirjoitus. Kirjoitustaito
related: Kirjoituksen historia. Paleografia. Epigrafia
related: Konekirjoitus
related: Pikakirjoitus
related: Kirjallisuuden ja kielten opetusoppi
related: URN:NBN:fi:au:hklj:850.09
related: URN:NBN:fi:au:hklj:860
related: GERMAANISET, KELTTILÄISET, BALTTILAISET JA SLAAVILAISET KIELET
related: Ruotsin kielen murteet
related: Suomenruotsi
related: Amerikan englannin kieli
related: URALILAISET KIELET. ALTAILAISET KIELET
related: Suomen kielen murteet
related: MUUT KIELET
scope note: Kielitieteen, lingvistiikan ja filologian yleisteokset Yleinen ja vertaileva kielitiede Kielten ryhmittely ja kielimaantiede yleensä Puhutut ja kirjoitetut kielet yleensä Puhekielet, murteet ja kirjakielet yleensä Maantieteelliset slangit ja ammattislangit yleensä Tyylioppi ja tyylintutkimus kielitieteen kannalta yleensä Tekstikritiikki, leksikologia ja terminologia yleensä Tiettyä kieltä tai kieliryhmää koskevat teokset ko. kielen tai kieliryhmän luokassa 860-899
scope note: Allmänna verk om språkvetenskap, lingvistik och filologi Allmän och jämförande språkvetenskap Indelning av språk och språkgeografi i allmänhet Talade och skrivna språk i allmänhet Talspråk, dialekter och skriftspråk i allmänhet Regionala och lokala slangspråk samt yrkesjargong i allmänhet Stilistik och stilistisk forskning ur språkvetenskaplig synvinkel i allmänhet Textkritik, lexikologi, terminologi i allmänhet Verk som handlar om ett bestämt språk eller en bestämd språkgrupp förs till klassen för språket eller språkgruppen i fråga 860-899 @sv

RANSKAN HISTORIA
type: Class
type: Concept
subclass of: URN:NBN:fi:au:hklj:900
alternative label: Andorra, historia (960 ... 968)
alternative label: Bretagne, historia (960 ... 968)
alternative label: Korsika, historia (960 +)
alternative label: Monaco, historia (960 ... 968)
alternative label: Pariisi, historia (960 ... 968)
alternative label: Ranska, historia (960 ... 968)
alternative label: Ranskan liittokunta, historia (960 ... 968)
alternative label: Riviera, Ranska, historia (960 ... 968)
alternative label: Frankrike, historia (960 ... 968) @sv
alternative label: Franska samväldet, historia (960 ... 968) @sv
alternative label: Paris, historia (960 ... 968) @sv
alternative label: Riviera, Frankrike, historia (960 ... 968) @sv
broader: URN:NBN:fi:au:hklj:900
in scheme: URN:NBN:fi:au:hklj:
narrower: Ranskan esi- ja varhaishistoria vuoteen 986
narrower: Ranskan keskiaika 987-1493
narrower: Ranskan historia 1494-1588
narrower: Ranskan historia 1589-1788
narrower: Ranskan historia 1789-1814
narrower: Ranskan historia 1815-1913
narrower: Ranskan historia 1914-1938
narrower: Ranskan historia 1939-
notation: 960
preferred label: FRANCE'S HISTORY @en
preferred label: FRANKRIKES HISTORIA @sv
related: Sisäpolitiikka. Puolueet
related: URN:NBN:fi:au:hklj:325
related: Muiden maiden valtiojärjestelmät
related: Ranska
related: Pariisi
related: URN:NBN:fi:au:hklj:909
related: I maailmansodan historia 1914-1918
related: II maailmansodan historia 1939-1945
related: URN:NBN:fi:au:hklj:919
related: Muiden Keski-Euroopan maiden historia
related: Afrikan historia
related: Pohjois-Afrikan historia
related: Länsi-, Itä- ja Keski-Afrikan historia
related: Etelä-Afrikan historia
related: URN:NBN:fi:au:hklj:989
scope note: Ranskan historian yleisteokset Tässä ja luokissa 961-968 myös Andorran historia sekä Ranskan liittokunnan yleinen historia Yksittäisten jäsenmaiden ja merentakaisten alueiden historia ko. maan tai alueen historian luokassa Tässä ja luokissa 961-966 myös Ranskan hallitsijoita ja kuningashuonetta koskeva historia ja henkilöhistoria Jos teos koskee vähintään kolmea luokkien 961-968 aikakautta, se kuuluu pääluokkaan 960 Jos teos koskee samassa määrin kahta aikakautta, se kuuluu varhaisemman aikakauden luokkaan, muuten siihen luokkaan, johon se selvästi painottuu
scope note: Allmänna verk om Frankrikes historia Hit och till klasserna 961-968 också Andorras historia samt det franska kolonialväldets allmänna historia Historiska verk om enskilda medlemsländer och transmarina områden inom det franska kolonialväldet förs till klassen för landets eller det geografiska områdets historia Hit och till klasserna 961-966 också historia eller personhistoria som rör regenter, kungligheter eller kungahus i Frankrike Om verket handlar om minst tre tidsperioder inom klasserna 961-968 förs det till huvudklass 960 Om verket behandlar två tidsperioder jämbördigt förs det till klassen för den tidigare tidsperioden, i andra fall till klassen för den tidsperiod som klart dominerar i verket @sv