headshot
type: Concept
definition: A head only view of a person (or animal/s) or persons as in a montage.
in scheme: IPTC NewsCodes: Scene
notation: 010100
preferred label: kasvokuva @fi
top concept of: IPTC NewsCodes: Scene

half-length
type: Concept
definition: A torso and head view of a person or persons.
in scheme: IPTC NewsCodes: Scene
notation: 010200
preferred label: puolikuva @fi
top concept of: IPTC NewsCodes: Scene

full-length
type: Concept
definition: A view from head to toe of a person or persons
in scheme: IPTC NewsCodes: Scene
notation: 010300
preferred label: kokokuva @fi
top concept of: IPTC NewsCodes: Scene

profile
type: Concept
definition: A view of a person from the side
in scheme: IPTC NewsCodes: Scene
notation: 010400
preferred label: profiili @fi
top concept of: IPTC NewsCodes: Scene

rear view
type: Concept
definition: A view of a person or persons from the rear.
in scheme: IPTC NewsCodes: Scene
notation: 010500
preferred label: selin @fi
top concept of: IPTC NewsCodes: Scene

single
type: Concept
definition: A view of only one person, object or animal.
in scheme: IPTC NewsCodes: Scene
notation: 010600
preferred label: yksin @fi
top concept of: IPTC NewsCodes: Scene

couple
type: Concept
definition: A view of two people who are in a personal relationship, for example engaged, married or in a romantic partnership.
in scheme: IPTC NewsCodes: Scene
notation: 010700
preferred label: pariskunta @fi
top concept of: IPTC NewsCodes: Scene

two
type: Concept
definition: A view of two people
in scheme: IPTC NewsCodes: Scene
notation: 010800
preferred label: kaksin @fi
top concept of: IPTC NewsCodes: Scene

group
type: Concept
definition: A view of more than two people
in scheme: IPTC NewsCodes: Scene
notation: 010900
preferred label: ryhmäkuva @fi
top concept of: IPTC NewsCodes: Scene

general view
type: Concept
definition: An overall view of the subject and its surrounds
in scheme: IPTC NewsCodes: Scene
notation: 011000
preferred label: yleiskuva @fi
top concept of: IPTC NewsCodes: Scene

panoramic view
type: Concept
definition: A panoramic or wide angle view of a subject and its surrounds
in scheme: IPTC NewsCodes: Scene
notation: 011100
preferred label: panoraama @fi
top concept of: IPTC NewsCodes: Scene

aerial view
type: Concept
definition: A view taken from above
in scheme: IPTC NewsCodes: Scene
notation: 011200
preferred label: ilmakuva @fi
top concept of: IPTC NewsCodes: Scene

under-water
type: Concept
definition: A photo taken under water
in scheme: IPTC NewsCodes: Scene
notation: 011300
preferred label: vedenalainen @fi
top concept of: IPTC NewsCodes: Scene

night scene
type: Concept
definition: A photo taken during darkness
in scheme: IPTC NewsCodes: Scene
notation: 011400
preferred label: yökuva @fi
top concept of: IPTC NewsCodes: Scene

satellite
type: Concept
definition: A photo taken from a satellite in orbit
in scheme: IPTC NewsCodes: Scene
notation: 011500
preferred label: satelliittikuva @fi
top concept of: IPTC NewsCodes: Scene

exterior view
type: Concept
definition: A photo that shows the exterior of a building or other object
in scheme: IPTC NewsCodes: Scene
notation: 011600
preferred label: ulkokuva @fi
top concept of: IPTC NewsCodes: Scene

interior view
type: Concept
definition: A scene or view of the interior of a building or other object
in scheme: IPTC NewsCodes: Scene
notation: 011700
preferred label: sisäkuva @fi
top concept of: IPTC NewsCodes: Scene

close-up
type: Concept
definition: A view of, or part of a person/object taken at close range in order to emphasize detail or accentuate mood. Macro photography.
in scheme: IPTC NewsCodes: Scene
notation: 011800
preferred label: lähikuva @fi
top concept of: IPTC NewsCodes: Scene

action
type: Concept
definition: Subject in motion such as children jumping, horse running
in scheme: IPTC NewsCodes: Scene
notation: 011900
preferred label: toiminta @fi
top concept of: IPTC NewsCodes: Scene

performing
type: Concept
definition: Subject or subjects on a stage performing to an audience
in scheme: IPTC NewsCodes: Scene
notation: 012000
preferred label: esiintyminen @fi
top concept of: IPTC NewsCodes: Scene

posing
type: Concept
definition: Subject or subjects posing such as a "victory" pose or other stance that symbolizes leadership.
in scheme: IPTC NewsCodes: Scene
notation: 012100
preferred label: poseeraus @fi
top concept of: IPTC NewsCodes: Scene

symbolic
type: Concept
definition: A posed picture symbolizing an event - two rings for marriage
in scheme: IPTC NewsCodes: Scene
notation: 012200
preferred label: symbolikuva @fi
top concept of: IPTC NewsCodes: Scene

off-beat
type: Concept
definition: An attractive, perhaps fun picture of everyday events - dog with sunglasses, people cooling off in the fountain
in scheme: IPTC NewsCodes: Scene
notation: 012300
preferred label: hupikuva @fi
top concept of: IPTC NewsCodes: Scene

movie scene
type: Concept
definition: Photos taken during the shooting of a movie or TV production.
in scheme: IPTC NewsCodes: Scene
notation: 012400
preferred label: kohtaus filmistä @fi
top concept of: IPTC NewsCodes: Scene

archaeology
type: Concept
broader: arts, culture and entertainment
definition: Probing the past through ruins and artefacts
in scheme: IPTC NewsCodes: Subject Code
notation: 01001000
preferred label: Arkeologia @fi

architecture
type: Concept
broader: arts, culture and entertainment
definition: Designing of buildings, monuments and the spaces around them
in scheme: IPTC NewsCodes: Subject Code
notation: 01002000
preferred label: Arkkitehtuuri @fi

bullfighting
type: Concept
broader: arts, culture and entertainment
definition: Classical contest pitting man against the bull
in scheme: IPTC NewsCodes: Subject Code
notation: 01003000
preferred label: Härkätaistelut @fi

festive event (including carnival)
type: Concept
broader: arts, culture and entertainment
definition: Parades, parties, celebrations and the like not necessarily tied to a fixed occasion or date
definition: Myös usean taiteenalan tapahtumat, esim. Helsingin juhlaviikot @fi
in scheme: IPTC NewsCodes: Subject Code
notation: 01004000
preferred label: Kulttuuritapahtumat @fi

film festival
type: Concept
broader: cinema
definition: National and international motion pictures festivals, selections, festival juries, nominations, awards etc.
definition: Kansalliset ja kansainväliset elokuvajuhlat ja festivaalit, niiden valinnat, valintaraadit, ehdokkuudet ja palkinnot @fi
in scheme: IPTC NewsCodes: Subject Code
notation: 01005001
preferred label: Elokuvajuhlat @fi

dance
type: Concept
broader: arts, culture and entertainment
definition: The expression of emotion or message through movement
in scheme: IPTC NewsCodes: Subject Code
notation: 01006000
preferred label: Tanssitaide @fi

jewelry
type: Concept
broader: fashion
definition: Accessories to clothing
definition: Korut asusteina @fi
in scheme: IPTC NewsCodes: Subject Code
notation: 01007001
preferred label: Korut @fi

language
type: Concept
broader: arts, culture and entertainment
definition: The means by which people communicate with each other
in scheme: IPTC NewsCodes: Subject Code
notation: 01008000
preferred label: Kielet @fi

library and museum
type: Concept
broader: arts, culture and entertainment
definition: Edifices used to house collections of books, music, art, or objects from the past and present for public use and display
in scheme: IPTC NewsCodes: Subject Code
notation: 01009000
preferred label: Kirjastot Museot Arkistot @fi

fiction
type: Concept
broader: literature
definition: Structured stories that are usually not based on fact but are the creation of the authors imagination
definition: Tavallisesti kirjailijan luovaan mielikuvitukseen perustuva suorasanainen kertomakirjallisuus @fi
in scheme: IPTC NewsCodes: Subject Code
notation: 01010001
preferred label: Kaunokirjallisuus @fi

poetry
type: Concept
broader: literature
definition: The art, structure, forms of poetic expression
definition: Kaunokirjallisuuden runomuotoinen ilmaisu, rakenne ja muodot @fi
in scheme: IPTC NewsCodes: Subject Code
notation: 01010002
preferred label: Runous @fi

classical music
type: Concept
broader: music
definition: Music that follows classic structures of rhythm and harmony
definition: Klassisia rytmi- ja harmoniarakenteita noudattava musiikki @fi
in scheme: IPTC NewsCodes: Subject Code
notation: 01011001
preferred label: Klassinen musiikki @fi

folk music
type: Concept
broader: music
definition: Music that developed from folk cultures, often based on story-telling
definition: Kansallinen, usein tarinoiva perinnemusiikki @fi
in scheme: IPTC NewsCodes: Subject Code
notation: 01011002
preferred label: Kansanmusiikki @fi

jazz music
type: Concept
broader: music
definition: A music of diverse harmonics, often improvised
definition: Monimuotoisia, usein improvisoituja sointuja käyttävä musiikki @fi
in scheme: IPTC NewsCodes: Subject Code
notation: 01011003
preferred label: Jazz @fi

popular music
type: Concept
broader: music
definition: The latest fad in music, generally aimed at the younger generation
definition: Suosittu viimeisten muotivirtausten mukainen musiikki @fi
in scheme: IPTC NewsCodes: Subject Code
notation: 01011004
preferred label: Populaarimusiikki @fi

country music
type: Concept
broader: music
definition: Similar to folk but is unique to the United States and is less about story telling than about loves sought and lost
definition: Pohjoisamerikkalainen kansanmusiikki, kertoo usein lemmenkaipuusta ja -menetyksestä @fi
in scheme: IPTC NewsCodes: Subject Code
notation: 01011005
preferred label: Country @fi

rock and roll music
type: Concept
broader: music
definition: Popular dance music developed in the 1950s
definition: 1950-luvulla syntynyt populaari tanssimusiikki @fi
in scheme: IPTC NewsCodes: Subject Code
notation: 01011006
preferred label: Rock @fi

hip-hop
type: Concept
broad match: http://cv.iptc.org/newscodes/mediatopic/20000018
broader: music
definition: A contemporary urban music originating in the 1970s.
in scheme: IPTC NewsCodes: Subject Code
notation: 01011007
preferred label: Hiphop @fi

painting
type: Concept
broader: arts, culture and entertainment
definition: Using the mediums of oils, watercolour, pastel, pencils, chalk, crayon etc on various grounds to express emotion or message
in scheme: IPTC NewsCodes: Subject Code
notation: 01012000
preferred label: Maalaustaide @fi

photography
type: Concept
broader: arts, culture and entertainment
definition: Mechanical means of creating images of objects by use of light and light sensitive materials with chemicals or by digitals means
in scheme: IPTC NewsCodes: Subject Code
notation: 01013000
preferred label: Valokuvaus @fi

radio
type: Concept
broader: arts, culture and entertainment
definition: Radio as art and entertainment
definition: Radion sisällöntuotanto @fi
in scheme: IPTC NewsCodes: Subject Code
notation: 01014000
preferred label: Radio @fi

plastic art
type: Concept
broader: sculpture
definition: Forms of hand created art including installations
definition: Käsin muotoillun taiteen eri muodot ja installaatiot @fi
in scheme: IPTC NewsCodes: Subject Code
notation: 01015001
preferred label: Veistokset @fi

soap opera
type: Concept
broad match: http://cv.iptc.org/newscodes/mediatopic/20000051
broader: television
definition: Episodic TV drama or saga, normally aired during daytime
in scheme: IPTC NewsCodes: Subject Code
notation: 01016001
preferred label: Saippuaoopperat @fi

music theatre
type: Concept
broader: theatre
definition: Opera, operetta, music revues etc
definition: Ooppera, operetti, revyy, musikaali jne. @fi
in scheme: IPTC NewsCodes: Subject Code
notation: 01017001
preferred label: Musiikkiteatteri @fi

institution-DEPRECATED
type: Concept
broader: monument and heritage site
definition: NA
in scheme: IPTC NewsCodes: Subject Code
notation: 01018001

customs and tradition
type: Concept
broader: arts, culture and entertainment
definition: A particular way of behaving, or observances that have developed over time by a group of people
in scheme: IPTC NewsCodes: Subject Code
notation: 01019000
preferred label: Perinne Tapakulttuuri @fi

arts (general)
type: Concept
broad match: http://cv.iptc.org/newscodes/mediatopic/20000002
broader: arts, culture and entertainment
definition: The collective expression of message or emotion through music, literature, painting, theatre or other means
in scheme: IPTC NewsCodes: Subject Code
notation: 01020000
preferred label: Taiteet yleistä @fi

entertainment award
type: Concept
broad match: http://cv.iptc.org/newscodes/mediatopic/20000002
broader: entertainment (general)
definition: Awards for achievement in the entertainment industry, such as the Oscars for film, the Booker Prize for Literature, the Grammys for music, or induction into halls of fame.
in scheme: IPTC NewsCodes: Subject Code
notation: 01021001
preferred label: Viihdealan palkinnot @fi

cultural development
type: Concept
broader: culture (general)
definition: The history of the development of art and culture such as the rise of cave paintings, pre-Colombian art, Chinese paper-making, anything non-political
definition: Taiteen ja kulttuurin kehittymisen historia @fi
in scheme: IPTC NewsCodes: Subject Code
notation: 01022001
preferred label: Kulttuurihistoria @fi

nightclub
type: Concept
broader: arts, culture and entertainment
definition: A commercial establishment providing music, or other entertainment along with food and drink to selected clientele
in scheme: IPTC NewsCodes: Subject Code
notation: 01023000
preferred label: Yökerhoviihde @fi

cartoon
type: Concept
broader: arts, culture and entertainment
definition: Still images such as editorial cartoons and comic strips
in scheme: IPTC NewsCodes: Subject Code
notation: 01024000
preferred label: Sarjakuvat Pilakuvat @fi

animation
type: Concept
broader: arts, culture and entertainment
definition: Animation, including full-length and short cinema, artists and merchandising of goods featuring animation characters.
in scheme: IPTC NewsCodes: Subject Code
notation: 01025000
preferred label: Animaatio @fi

periodicals
type: Concept
broader: mass media
definition: Written material that is usually published weekly, bi-weekly, monthly or annually for a long time
definition: Kirjallinen materiaali, jota julkaistaan toistuvasti viikoittain tai harvemmin @fi
in scheme: IPTC NewsCodes: Subject Code
notation: 01026001
preferred label: Aikakauslehdet @fi

news media
type: Concept
broader: mass media
definition: Television, wire services, radio that collect facts about incidents, developing and presenting them to audiences as a whole story
definition: Sähköisten välineiden, esim. television ja radion sisällöntarjonta @fi
in scheme: IPTC NewsCodes: Subject Code
notation: 01026002
preferred label: Sähköinen tiedonvälitys @fi

newspapers
type: Concept
broader: mass media
definition: Daily or weekly publications that present the day to day history of the world, as well as features, comics etc
definition: Päivittäin tai harvemmin ilmestyvät julkaisut, joissa on ajankohtaisia uutisia, reportaaseja ja sarjakuvia @fi
in scheme: IPTC NewsCodes: Subject Code
notation: 01026003
preferred label: Sanomalehdet @fi

reviews
type: Concept
broad match: http://cv.iptc.org/newscodes/mediatopic/20000002
broader: mass media
definition: A critical look at someone else's work, whether film, theatre or writing
definition: Kriittiset elokuva-, teatteri- ja kirjallisuuskatsaukset @fi
in scheme: IPTC NewsCodes: Subject Code
notation: 01026004
preferred label: Katsaukset @fi

internet
type: Concept
broader: arts, culture and entertainment
definition: Internet as art and entertainment
in scheme: IPTC NewsCodes: Subject Code
notation: 01027000
preferred label: Taide ja viihde Internetissä @fi

history
type: Concept
broader: arts, culture and entertainment
definition: Issues connected with the past; discoveries, repair, conservation or display of artifacts; anniversaries of historic events
in scheme: IPTC NewsCodes: Subject Code
notation: 01028000
preferred label: Historia @fi

homicide
type: Concept
broader: crime
definition: Killing of one person by another
in scheme: IPTC NewsCodes: Subject Code
notation: 02001001
preferred label: Henkirikokset @fi

computer crime
type: Concept
broader: crime
definition: Theft or destructive behaviour using a computer
definition: Tietokoneen avulla tehdyt rikokset @fi
in scheme: IPTC NewsCodes: Subject Code
notation: 02001002
preferred label: atk-rikokset @fi

theft
type: Concept
broader: crime
definition: Unlawful taking
definition: Murrot, petokset, ryöstöt, vahingonteot, varkausrikokset (sis. kavallukset ja luvattomat käyttöönotot) @fi
in scheme: IPTC NewsCodes: Subject Code
notation: 02001003
preferred label: Varallisuusrikokset @fi

drug trafficking
type: Concept
broader: crime
definition: Dealing in illicit often harmful substances
definition: Huumaavien aineiden välitys @fi
in scheme: IPTC NewsCodes: Subject Code
notation: 02001004
preferred label: Huumausainerikokset @fi

sexual assault
type: Concept
broader: crime
definition: Sexual battery of one sex against another
definition: Seksuaalinen väkivalta @fi
in scheme: IPTC NewsCodes: Subject Code
notation: 02001005
preferred label: Seksuaalirikokset @fi

assault (general)
type: Concept
broader: crime
definition: Battery, slugfests, brawls and threatening behaviour
definition: Väkivaltarikokset yleisesti: pahoinpitelyt, riidat, tappelut ja uhkaava käyttäytyminen @fi
in scheme: IPTC NewsCodes: Subject Code
notation: 02001006
preferred label: Väkivaltarikokset @fi

kidnapping
type: Concept
broader: crime
definition: To seize and detain or carry away a person against that person's will by unlawful threat, force or fraud
definition: Kidnappaukset, sieppaukset @fi
in scheme: IPTC NewsCodes: Subject Code
notation: 02001007
preferred label: Ihmisryöstöt @fi

arson
type: Concept
broader: crime
definition: Intentional setting of fires with criminal intent
definition: Tahallinen tulipalon sytyttäminen @fi
in scheme: IPTC NewsCodes: Subject Code
notation: 02001008
preferred label: Tuhopoltot @fi

gang activity
type: Concept
broader: crime
definition: Criminal activities by groups of individuals, usually in urban areas, who are allied by common territories, languages, ethnic backgrounds but generally are loosely organized.
in scheme: IPTC NewsCodes: Subject Code
notation: 02001009
preferred label: Jengirikollisuus @fi

terrorism
type: Concept
broader: crime
definition: Violence against people to create fear in order to achieve political or ideological objectives
in scheme: IPTC NewsCodes: Subject Code
notation: 02001010
preferred label: Terrorismi @fi

lawyer
type: Concept
broad match: http://cv.iptc.org/newscodes/mediatopic/20000282
broader: judiciary (system of justice)
definition: Anyone legally able to represent another person or entity in a legal matter, such as a lawyer, solicitor, barrister, procurator, notary.
definition: Lainopillisen koulutuksen saaneet, kuten asianajajat, lainopilliset neuvonantajat, notaarit. @fi
in scheme: IPTC NewsCodes: Subject Code
notation: 02002001
preferred label: Asianajajat @fi

judge
type: Concept
broader: judiciary (system of justice)
definition: Members of the bench that sit in judgement
in scheme: IPTC NewsCodes: Subject Code
notation: 02002002
preferred label: Tuomarit @fi

court administration
type: Concept
broader: judiciary (system of justice)
definition: Court clerks, bailiffs, stenographers etc.
definition: Kirjurit, kanslistit, haastemiehet, voudit, pikakirjoittajat jne. @fi
in scheme: IPTC NewsCodes: Subject Code
notation: 02002003
preferred label: Tuomioistuinten virkamiehet @fi

law enforcement
type: Concept
broader: police
definition: Agencies involved in attempts to prevent disobedience to established laws, or to bring to justice those that disobey those laws
in scheme: IPTC NewsCodes: Subject Code
notation: 02003001
preferred label: Laillisuusvalvonta @fi

investigation
type: Concept
broader: police
definition: Process of inquiry of a possible crime up to the point of arrest
in scheme: IPTC NewsCodes: Subject Code
notation: 02003002
preferred label: Poliisitutkinta @fi

arrest
type: Concept
broader: police
definition: Detention of a suspect of a crime
in scheme: IPTC NewsCodes: Subject Code
notation: 02003003
preferred label: Pidättäminen @fi

fine
type: Concept
broader: punishment
definition: Monetary punishment
definition: Sis. myös rikemaksut @fi
in scheme: IPTC NewsCodes: Subject Code
notation: 02004001
preferred label: Sakko @fi

execution
type: Concept
broad match: http://cv.iptc.org/newscodes/mediatopic/20000134
broader: punishment
definition: The carrying out of executions by a government or state, not by extralegal groups/organisations
in scheme: IPTC NewsCodes: Subject Code
notation: 02004002
preferred label: Kuolemanrangaistus Teloitus @fi

prison
type: Concept
broader: crime, law and justice
definition: Also know as jails, lockups, calaboose, etc. for keeping law breakers from society
in scheme: IPTC NewsCodes: Subject Code
notation: 02005000
preferred label: Vankilat @fi

criminal
type: Concept
broader: laws
definition: The criminal code system
in scheme: IPTC NewsCodes: Subject Code
notation: 02006001
preferred label: Rikoslainsäädäntö @fi

civil
type: Concept
broader: laws
definition: The civil code system
in scheme: IPTC NewsCodes: Subject Code
notation: 02006002
preferred label: Siviililainsäädäntö @fi

civil rights
type: Concept
broader: justice and rights
definition: Rights of individuals under civil law
definition: Kansalaisen perusoikeudet @fi
in scheme: IPTC NewsCodes: Subject Code
notation: 02007001
preferred label: Perusoikeudet @fi

litigation
type: Concept
broader: trials
definition: Taking disputed issues to court for settlement by judge and/or jury
definition: Riidanalaisten asioiden vienti oikeuteen, siviiliprosessit @fi
in scheme: IPTC NewsCodes: Subject Code
notation: 02008001
preferred label: Riita-asiat @fi

arbitration
type: Concept
broader: trials
definition: Resolution of disputed issues by a neutral panel
definition: Riidanlaisten asioiden sopiminen neuvottelemalla. @fi
in scheme: IPTC NewsCodes: Subject Code
notation: 02008002
preferred label: Sovittelu @fi

court preliminary
type: Concept
broader: trials
definition: Pre-trial events including pleas, bail, motions, discovery, depositions.
definition: Oikeudenkäyntiä edeltävät tapahtumat: vetoomukset, takuut, aloitteet,pantit jne. @fi
in scheme: IPTC NewsCodes: Subject Code
notation: 02008003
preferred label: Oikeudenkäynnin valmistelu @fi

defendant
type: Concept
broader: prosecution
definition: The person on trial
in scheme: IPTC NewsCodes: Subject Code
notation: 02009001
preferred label: Syytetyt @fi

witness
type: Concept
broader: prosecution
definition: A person who testifies
in scheme: IPTC NewsCodes: Subject Code
notation: 02009002
preferred label: Todistajat @fi

organized crime
type: Concept
broader: crime, law and justice
definition: Crimes committed by gangs or criminal groups.
definition: Jengien ja rikollisryhmien huume-, prostituutio-, salakuljetus-, talous-, ja väkivaltarikollisuus @fi
in scheme: IPTC NewsCodes: Subject Code
notation: 02010000
preferred label: Järjestäytynyt rikollisuus @fi

international court or tribunal
type: Concept
broader: international law
definition: The activities of international tribunals such as European court for human rights, Hague tribunal, International Court of Justice etc
definition: Euroopan ihmisoikeustuomioistuin, Haagin sotarikostuomioistuin jne. @fi
in scheme: IPTC NewsCodes: Subject Code
notation: 02011001
preferred label: Kansainväliset tuomioistuimet @fi

extradition
type: Concept
broader: international law
definition: Legal transfer of criminals or suspects between countries
definition: Rikollisten ja rikoksista epäiltyjen luovutus valtiosta toiseen. @fi
in scheme: IPTC NewsCodes: Subject Code
notation: 02011002
preferred label: Rikoksentekijän luovutus @fi

fraud
type: Concept
broader: corporate crime
definition: Intentional deception that causes others to give up rights or property
in scheme: IPTC NewsCodes: Subject Code
notation: 02012001
preferred label: Petos @fi

embezzlement
type: Concept
broader: corporate crime
definition: The intentional theft of money left in one's care
in scheme: IPTC NewsCodes: Subject Code
notation: 02012002
preferred label: Kavallus @fi

restraint of trade
type: Concept
broader: corporate crime
definition: Interference in free competition in business and trade
in scheme: IPTC NewsCodes: Subject Code
notation: 02012003
preferred label: Kilpailurajoitukset @fi

breach of contract
type: Concept
broader: corporate crime
definition: Rupture of legal agreements between companies, and with customers
in scheme: IPTC NewsCodes: Subject Code
notation: 02012004
preferred label: Sopimusrikokset @fi

anti-trust crime
type: Concept
broader: corporate crime
definition: Violations of laws against monopolies
in scheme: IPTC NewsCodes: Subject Code
notation: 02012005
preferred label: Kartellirikokset @fi

corruption
type: Concept
broader: corporate crime
definition: General business misbehaviour
in scheme: IPTC NewsCodes: Subject Code
notation: 02012006
preferred label: Korruptio @fi

bribery
type: Concept
broader: corporate crime
definition: Payments or benefits to influence the outcome of a legal case
definition: Maksut ja etuudet, joilla yritetään vaikuttaa oikeudenkäynteihin tai niiden aloittamiseen. @fi
in scheme: IPTC NewsCodes: Subject Code
notation: 02012007
preferred label: Lahjonta @fi

war crime
type: Concept
broader: crime, law and justice
definition: Crimes committed during a war or armed conflict, usually against civilians or POW's, including the prosecution of such crimes
definition: Sodan ja konfliktin aikana tehdyt, erityisesti siviileihin ja sotavankeihin kohdistuvat, rikokset sekä tälläisistä rikoksista syyttäminen. @fi
in scheme: IPTC NewsCodes: Subject Code
notation: 02013000
preferred label: Sotarikokset @fi

inquest
type: Concept
broad match: http://cv.iptc.org/newscodes/mediatopic/20000131
broader: crime, law and justice
definition: Formal investigation of sudden or unexpected death and the hearing to decide cause of death.
in scheme: IPTC NewsCodes: Subject Code
notation: 02014000
preferred label: Kuolemansyyntutkinta @fi

inquiry
type: Concept
broad match: http://cv.iptc.org/newscodes/mediatopic/20000111
broader: crime, law and justice
definition: Formal hearing involving a disaster, political event etc. Eg rail crash, drug prescription scandal.
in scheme: IPTC NewsCodes: Subject Code
notation: 02015000
preferred label: Tutkinta @fi

tribunal
type: Concept
broad match: http://cv.iptc.org/newscodes/mediatopic/20000111
broader: crime, law and justice
definition: Formal hearing usually involving employment issues, property etc.
in scheme: IPTC NewsCodes: Subject Code
notation: 02016000
preferred label: Kuuleminen @fi

drought
type: Concept
broader: disaster and accident
definition: A severe lack of water over a period of time
in scheme: IPTC NewsCodes: Subject Code
notation: 03001000
preferred label: Kuivuus @fi

earthquake
type: Concept
broader: disaster and accident
definition: The shifting of the tectonic plates of the Earth, creating in some cases damage to structures
in scheme: IPTC NewsCodes: Subject Code
notation: 03002000
preferred label: Maanjäristykset @fi

famine
type: Concept
broader: disaster and accident
definition: Severe lack of food for a large population
in scheme: IPTC NewsCodes: Subject Code
notation: 03003000
preferred label: Nälänhätä @fi

fire
type: Concept
broader: disaster and accident
definition: Ignition and consumption of materials through a combination of high heat and oxygen
in scheme: IPTC NewsCodes: Subject Code
notation: 03004000
preferred label: Tulipalot @fi

flood
type: Concept
broader: disaster and accident
definition: Surfeit of water, caused by heavy rains or melting snow, usually in places where it's not wanted
in scheme: IPTC NewsCodes: Subject Code
notation: 03005000
preferred label: Tulvat @fi

structural failures
type: Concept
broader: industrial accident
definition: When a building, bridge or other structures collapse because of unexpected forces or poor design
definition: Rakennuksen, sillan tai muun rakennelman sortuminen @fi
in scheme: IPTC NewsCodes: Subject Code
notation: 03006001
preferred label: Rakennesortumat @fi

windstorms
type: Concept
broader: meteorological disaster
definition: A storm of high velocity but non-hurricane force movements of air with little or no rain or hail. Often highly destructive
definition: Kovan tuulen aiheuttamat tuhoisat myrskyt, ei hurrikaanit. @fi
in scheme: IPTC NewsCodes: Subject Code
notation: 03007001
preferred label: Myrskyt @fi

nuclear accident
type: Concept
broader: disaster and accident
definition: A mishap involving radioactive materials
in scheme: IPTC NewsCodes: Subject Code
notation: 03008000
preferred label: Ydinonnettomuudet @fi

pollution
type: Concept
broader: disaster and accident
definition: Emissions of unwanted materials in areas where it can be harmful
in scheme: IPTC NewsCodes: Subject Code
notation: 03009000
preferred label: Ympäristöonnettomuudet @fi

road accident
type: Concept
broader: transport accident
definition: Accidents on roads.
definition: Moottoriajoneuvo- ja kevyen liikenteen onnettomuudet @fi
in scheme: IPTC NewsCodes: Subject Code
notation: 03010001
preferred label: Tieliikenneonnettomuudet @fi

railway accident
type: Concept
broader: transport accident
definition: Accidents involving trains.
definition: Juna-, metro- ja raitiovaunuonnettomuudet @fi
in scheme: IPTC NewsCodes: Subject Code
notation: 03010002
preferred label: Raideliikenneonnettomuudet @fi

air and space accident
type: Concept
broader: transport accident
definition: Accidents involving craft in air or space.
definition: Siviili- ja sotilaskoneonnettomuudet, kuumailmapallo- ilmalaivaonnettomuudet @fi
in scheme: IPTC NewsCodes: Subject Code
notation: 03010003
preferred label: Lento-onnettomuudet @fi

maritime accident
type: Concept
broader: transport accident
definition: Accidents involving marine vessels.
definition: Haaksirikot, karilleajot, laiva- vene- ja sukellusveneonnettomuudet @fi
in scheme: IPTC NewsCodes: Subject Code
notation: 03010004
preferred label: Vesiliikenneonnettomuudet @fi

volcanic eruption
type: Concept
broader: disaster and accident
definition: A rupture in the skin of the Earth allowing molten material to escape to the surface
in scheme: IPTC NewsCodes: Subject Code
notation: 03011000
preferred label: Tulivuorenpurkaukset @fi

relief and aid organisation
type: Concept
broader: disaster and accident
definition: Organizations set up to provide help to those in need because of lack of food, water or shelter
in scheme: IPTC NewsCodes: Subject Code
notation: 03012000
preferred label: Pelastusjärjestöt @fi

accident (general)
type: Concept
broader: disaster and accident
definition: Any unplanned event that causes unwanted consequences
in scheme: IPTC NewsCodes: Subject Code
notation: 03013000
preferred label: Tapaturmat @fi

explosion
type: Concept
broader: emergency incident
definition: Sudden eruptions, usually of chemical substances
in scheme: IPTC NewsCodes: Subject Code
notation: 03014001
preferred label: Räjähdysonnettomuudet @fi

natural disasters
type: Concept
broader: disaster (general)
definition: Destructive incidents caused by the very nature of nature -- hurricanes, earthquakes, floods etc
definition: Tuhoisat luonnononnettomuudet @fi
in scheme: IPTC NewsCodes: Subject Code
notation: 03015001
preferred label: Luonnononnettomuudet @fi

avalanche/landslide
type: Concept
broader: disaster (general)
definition: Sudden dislodging of massive amounts of snow or soil.
definition: Äkillinen lumen tai maa-aineksen vyöryminen. @fi
in scheme: IPTC NewsCodes: Subject Code
notation: 03015002
preferred label: Lumivyöryt Maanvyörymät @fi

emergency planning
type: Concept
broader: disaster and accident
definition: Planning for actions to deal with sudden, unplanned events
in scheme: IPTC NewsCodes: Subject Code
notation: 03016000
preferred label: Onnettomuuksien ehkäisy @fi

rescue
type: Concept
broad match: http://cv.iptc.org/newscodes/mediatopic/20000168
broader: disaster and accident
definition: An operation to save people, animals or property from harm or danger.
in scheme: IPTC NewsCodes: Subject Code
notation: 03017000
preferred label: Pelastustoiminta @fi

arable farming
type: Concept
broader: agriculture
definition: Production of food in the ground
definition: Sisältää puutarhatalouden. @fi
in scheme: IPTC NewsCodes: Subject Code
notation: 04001001
preferred label: Peltoviljely @fi

fishing industry
type: Concept
broader: agriculture
definition: Raising or gathering of fish
in scheme: IPTC NewsCodes: Subject Code
notation: 04001002
preferred label: Kalatalous @fi

forestry and timber
type: Concept
broader: agriculture
definition: Production and collection and preparation of wood products for future use
in scheme: IPTC NewsCodes: Subject Code
notation: 04001003
preferred label: Metsätalous @fi

livestock farming
type: Concept
broader: agriculture
definition: Raising of animals for food
definition: Sisältää porotalouden. @fi
in scheme: IPTC NewsCodes: Subject Code
notation: 04001004
preferred label: Karjatalous @fi

viniculture
type: Concept
broader: agriculture
definition: Production of wines from the vines to the finish products
in scheme: IPTC NewsCodes: Subject Code
notation: 04001005
preferred label: Viininviljely @fi

aquaculture
type: Concept
broader: agriculture
definition: Growing plants or animals in water for human consumption
definition: Kasvien tai eläinten kasvattaminen vedessä ihmisten käyttöön. @fi
in scheme: IPTC NewsCodes: Subject Code
notation: 04001006
preferred label: Vesiviljely @fi

biotechnology
type: Concept
broader: chemicals
definition: The business of using engineering technology to study and solved problems of living organisms
in scheme: IPTC NewsCodes: Subject Code
notation: 04002001
preferred label: Bioteollisuus @fi

fertiliser
type: Concept
broader: chemicals
definition: Natural or manmade materials used to encourage the growth of plants
in scheme: IPTC NewsCodes: Subject Code
notation: 04002002
preferred label: Lannoitteet @fi

health and beauty product
type: Concept
broader: chemicals
definition: Compilation of chemicals and other substances for use in enhancing ones looks or smell
in scheme: IPTC NewsCodes: Subject Code
notation: 04002003
preferred label: Hygieniatuotteet Kosmetiikka @fi

inorganic chemical
type: Concept
broader: chemicals
definition: The branch of chemistry dealing with minerals and metals
in scheme: IPTC NewsCodes: Subject Code
notation: 04002004
preferred label: Epäorgaaniset kemikaalit @fi

organic chemical
type: Concept
broader: chemicals
definition: The branch of chemistry dealing with human, animal or carbon-based substances
definition: Muovit ja maalit @fi
in scheme: IPTC NewsCodes: Subject Code
notation: 04002005
preferred label: Orgaaniset kemikaalit @fi

pharmaceutical
type: Concept
broader: chemicals
definition: The production of medicines from various chemicals and natural substances
in scheme: IPTC NewsCodes: Subject Code
notation: 04002006
preferred label: Lääketeollisuus @fi

synthetic and plastic
type: Concept
broader: chemicals
definition: Chemicals used to produce plastics and other artificial substances to be used in manufacturing
definition: Synteettinen kumi, tekokuidut, muovit, hartsit @fi
in scheme: IPTC NewsCodes: Subject Code
notation: 04002007
preferred label: Synteettiset tuotteet Muovituotteet @fi

hardware
type: Concept
broad match: http://cv.iptc.org/newscodes/mediatopic/20000222
broader: computing and information technology
definition: The physical devices used to provide computer services, such as monitors, hard drives, keyboards etc. but can also be used for equipment such as routers, servers and other network devices.
in scheme: IPTC NewsCodes: Subject Code
notation: 04003001
preferred label: Tietokoneet Laitteistot @fi

networking
type: Concept
broader: computing and information technology
definition: The interconnectivity between hardware that provides the medium for the transmission of data.
in scheme: IPTC NewsCodes: Subject Code
notation: 04003002
preferred label: Tietoverkot @fi

satellite technology
type: Concept
broader: computing and information technology
definition: Hardware and software that enables groundbased devices to send signals to each other via an orbiting satellite.
in scheme: IPTC NewsCodes: Subject Code
notation: 04003003
preferred label: Satelliittiteknologia @fi

semiconductors and active components
type: Concept
broader: computing and information technology
definition: The basic components that together create working electronic devices such as computers
in scheme: IPTC NewsCodes: Subject Code
notation: 04003004
preferred label: Puolijohteet Komponentit @fi

software
type: Concept
broader: computing and information technology
definition: Programming sets that, when installed on hardware, perform specified functions.
in scheme: IPTC NewsCodes: Subject Code
notation: 04003005
preferred label: Ohjelmistot @fi

telecommunication equipment
type: Concept
broader: computing and information technology
definition: Devices such as telephone sets, voice/data switches, modems etc that facilitate point-to-point voice/data transmissions
definition: Mm. faksit, lankapuhelimet, modeemit @fi
in scheme: IPTC NewsCodes: Subject Code
notation: 04003006
preferred label: Tietoliikennelaitteet @fi

telecommunication service
type: Concept
broader: computing and information technology
definition: Services provided by commercial companies that facilitate connections between telephones, pagers, computers
in scheme: IPTC NewsCodes: Subject Code
notation: 04003007
preferred label: Tietoliikennepalvelut @fi

security
type: Concept
broader: computing and information technology
definition: To encompass technical developments in hardware and software, basic research and related areas such as cyber security
in scheme: IPTC NewsCodes: Subject Code
notation: 04003008
preferred label: Tietoturva @fi

wireless technology
type: Concept
broader: computing and information technology
definition: Transmission of information through means other than point-to-point wired hookups
definition: Mm. matkapuhelimet @fi
in scheme: IPTC NewsCodes: Subject Code
notation: 04003009
preferred label: Langaton teknologia @fi

heavy construction
type: Concept
broader: construction and property
definition: Large scale construction projects, construction of roads, dams, office/factory buildings, offshore and onshore structures, large sport stadiums
in scheme: IPTC NewsCodes: Subject Code
notation: 04004001
preferred label: Maarakennus Teollisuusrakennus Vesirakennus @fi

house building
type: Concept
broader: construction and property
definition: Construction of residences, for private use
in scheme: IPTC NewsCodes: Subject Code
notation: 04004002
preferred label: Talonrakennus @fi

real estate
type: Concept
broader: construction and property
definition: The buying and selling of properties of all types
in scheme: IPTC NewsCodes: Subject Code
notation: 04004003
preferred label: Kiinteistökauppa @fi

farms
type: Concept
broader: construction and property
definition: Agricultural areas for the production of foodstuffs, including dairy products, fruits and livestock, such as cattle and fish
in scheme: IPTC NewsCodes: Subject Code
notation: 04004004
preferred label: Maatilat @fi

land price
type: Concept
broader: construction and property
definition: The price of land in specific zoned areas such as commercial, residential arable as provided by a responsible body
definition: Maan hinta erityisesti kaupalliseen tarkoitukseen, asumiskäyttöön tai viljelyyn sopivilla alueilla @fi
in scheme: IPTC NewsCodes: Subject Code
notation: 04004005
preferred label: Maan hinta @fi

renovation
type: Concept
broader: construction and property
definition: Restoring properties/structures to a former better state by cleaning, repairing or rebuilding.
definition: Kiinteistöjen ym kunnostus entiselle paremmalle tasolleen puhdistamalla, korjaamalla tai uudelleen rakentamalla. @fi
in scheme: IPTC NewsCodes: Subject Code
notation: 04004006
preferred label: Kiinteistöjen kunnostus @fi

design and engineering
type: Concept
broader: construction and property
definition: Design and planning by Engineers, Architects etc. of roads, offices, factories, dams , offshore structures,
definition: Teiden, toimistojen, tehtaiden jne. muotoilu ja suunnittelu tekijöinä insinöörit, arkkitehdit ym @fi
in scheme: IPTC NewsCodes: Subject Code
notation: 04004007
preferred label: Tekninen palvelu ja suunnittelu @fi

alternative energy
type: Concept
broader: energy and resource
definition: Alternative energy business
in scheme: IPTC NewsCodes: Subject Code
notation: 04005001
preferred label: Vaihtoehtoiset energialähteet @fi

coal
type: Concept
broader: energy and resource
definition: Production and mining of anthracite and bituminous products for use in power production
in scheme: IPTC NewsCodes: Subject Code
notation: 04005002
preferred label: Hiili @fi

oil and gas - downstream activities
type: Concept
broader: energy and resource
definition: All matters concerning oil and gas, typically refining and distribution activities
in scheme: IPTC NewsCodes: Subject Code
notation: 04005003
preferred label: Öljyn ja kaasun jalostus @fi

oil and gas - upstream activities
type: Concept
broader: energy and resource
definition: All matters concerning oil and gas, typically supply chain activities from the reservoir to the refinery gate
in scheme: IPTC NewsCodes: Subject Code
notation: 04005004
preferred label: Öljyn ja kaasun etsintä ja tuotanto @fi

nuclear power
type: Concept
broader: energy and resource
definition: Use of radioactive materials for power production
in scheme: IPTC NewsCodes: Subject Code
notation: 04005005
preferred label: Ydinvoima @fi

electricity production and distribution
type: Concept
broader: energy and resource
definition: Primarily concerning the power line distribution system, but also the sale of electrical power at wholesale and retail levels
in scheme: IPTC NewsCodes: Subject Code
notation: 04005006
preferred label: Sähköntuotanto Sähkönjakelu @fi

waste management and pollution control
type: Concept
broader: energy and resource
definition: The business of waste management and pollution control
in scheme: IPTC NewsCodes: Subject Code
notation: 04005007
preferred label: Jätehuolto Päästöjen valvonta @fi

water supply
type: Concept
broader: energy and resource
definition: The business of providing water for human use
in scheme: IPTC NewsCodes: Subject Code
notation: 04005008
preferred label: Vesivarat @fi

natural resources (general)
type: Concept
broad match: http://cv.iptc.org/newscodes/mediatopic/20000256
broader: energy and resource
definition: The general use of natural resources for business purposes, not focused on specific resources such as coal, oil, gas or water
in scheme: IPTC NewsCodes: Subject Code
notation: 04005009
preferred label: Muut energiavarat @fi

energy (general)
type: Concept
broad match: http://cv.iptc.org/newscodes/mediatopic/20000256
broader: energy and resource
definition: Energy industry, not focused on any specific sector
in scheme: IPTC NewsCodes: Subject Code
notation: 04005010
preferred label: Energia yleistä @fi

natural gas
type: Concept
broader: energy and resource
definition: A natural resource, mainly methane in an flammable gaseous state, from the ground
definition: Enimmäkseen metaania sisältävä luonnossa esiintyvä ja maasta saatava helposti syttyvä kaasu. @fi
in scheme: IPTC NewsCodes: Subject Code
notation: 04005011
preferred label: Maakaasu @fi

petrol
type: Concept
broader: energy and resource
definition: Distilled petroleum product used for automotive fuel, with or without additives
definition: Nestemäinen öljynjalostustuote jota käytetään ajoneuvojen moottorien polttoaineena. @fi
in scheme: IPTC NewsCodes: Subject Code
notation: 04005012
preferred label: Bensiini @fi

diesel fuel
type: Concept
broader: energy and resource
definition: A distilled petroleum product heavier than gasoline used not only for trucks, marine engines, but in certain forms for home heating
definition: Bensiiniä raskaampi raakaöljyn jalostustuote, jota käytetään dieselmoottorien polttoaineena. @fi
in scheme: IPTC NewsCodes: Subject Code
notation: 04005013
preferred label: Dieselöljy @fi

kerosene/paraffin
type: Concept
broader: energy and resource
definition: A light petroleum distillate used for cooking fuel, aircraft jet engines, lamps, heating and cleaning
definition: Kerosiini on petroli, jota käytetään lentokoneiden suihkuturbiinien polttoaineena. Öljylampuissa käytettävä valopetroli on myös kerosiinia. @fi
in scheme: IPTC NewsCodes: Subject Code
notation: 04005014
preferred label: Kerosiini @fi

accountancy and auditing
type: Concept
broader: financial and business service
definition: Services provide balance sheet, budgets reconciliation and examine accuracy of financial statements
in scheme: IPTC NewsCodes: Subject Code
notation: 04006001
preferred label: Kirjanpito Tilintarkastus @fi

banking
type: Concept
broader: financial and business service
definition: Services for storing, transmitting, receiving and delivery of cash moneys
in scheme: IPTC NewsCodes: Subject Code
notation: 04006002
preferred label: Pankkitoiminta @fi

consultancy service
type: Concept
broader: financial and business service
definition: Providers of expert knowledge in a wide range of fields usually on a temporary, contract basis
in scheme: IPTC NewsCodes: Subject Code
notation: 04006003
preferred label: Konsultointi @fi

employment agency
type: Concept
broader: financial and business service
definition: A service helping people find jobs, and companies to find workers
in scheme: IPTC NewsCodes: Subject Code
notation: 04006004
preferred label: Työnvälitys @fi

healthcare provider
type: Concept
broader: financial and business service
definition: Providers of medical services at all levels, including doctors, hospitals etc
in scheme: IPTC NewsCodes: Subject Code
notation: 04006005
preferred label: Terveydenhoitopalvelut @fi

insurance
type: Concept
broader: financial and business service
definition: A risk taking venture that allows individuals to pay small amounts periodically to guard financially against unexpected events
in scheme: IPTC NewsCodes: Subject Code
notation: 04006006
preferred label: Vakuutustoiminta @fi

legal service
type: Concept
broader: financial and business service
definition: Lawyers and others who help companies and individuals deal with state, federal and local laws
in scheme: IPTC NewsCodes: Subject Code
notation: 04006007
preferred label: Lakipalvelut @fi

market research
type: Concept
broader: financial and business service
definition: A service that tries to determine what people want to buy
in scheme: IPTC NewsCodes: Subject Code
notation: 04006008
preferred label: Markkinatutkimus @fi

stock broking
type: Concept
broader: financial and business service
definition: The buying and selling of company shares on behalf of individuals or other entities
in scheme: IPTC NewsCodes: Subject Code
notation: 04006009
preferred label: Arvopaperivälitys @fi

personal investing
type: Concept
broader: financial and business service
definition: Personal finance and investment
in scheme: IPTC NewsCodes: Subject Code
notation: 04006010
preferred label: Piensijoittaminen @fi

market trend
type: Concept
broader: financial and business service
definition: Statistically significant consumer behaviour.
in scheme: IPTC NewsCodes: Subject Code
notation: 04006011
preferred label: Kuluttajakäyttäytyminen @fi

shipping service
type: Concept
broader: financial and business service
definition: Companies that prepare and transport packages and documents for individuals or companies by any means, including postal services.
in scheme: IPTC NewsCodes: Subject Code
notation: 04006012
preferred label: Kuljetuspalvelut @fi

personal service
type: Concept
broader: financial and business service
definition: Consumer service that is intangible e.g. beauty care as in hairdressing
definition: Esim. kampaamot, hoitolat jne. @fi
in scheme: IPTC NewsCodes: Subject Code
notation: 04006013
preferred label: Yksityiset palvelut @fi

janitorial service
type: Concept
broader: financial and business service
definition: Companies that provide cleaning and similar services for homes and businesses.
in scheme: IPTC NewsCodes: Subject Code
notation: 04006014
preferred label: Kiinteistöhuolto @fi

funeral parlour and crematorium
type: Concept
broader: financial and business service
definition: Companies that provide services for disposal of the dead
in scheme: IPTC NewsCodes: Subject Code
notation: 04006015
preferred label: Hautauspalvelut @fi

rental service
type: Concept
broader: financial and business service
definition: Companies which provide rentals, including motor vehicles, tuxedos, tools, heavy equipment, and other supplies
definition: Esim. autovuokraamot, pukuvuokraamot, työkaluvuokraamot @fi
in scheme: IPTC NewsCodes: Subject Code
notation: 04006016
preferred label: Vuokraamot @fi

wedding service
type: Concept
broader: financial and business service
definition: Services and products related to the wedding industry
in scheme: IPTC NewsCodes: Subject Code
notation: 04006017
preferred label: Hääpalvelut @fi

personal finance
type: Concept
broader: financial and business service
definition: An individual's income and expenses
definition: Yksityisen ihmisen oma talous: tulot ja menot. @fi
in scheme: IPTC NewsCodes: Subject Code
notation: 04006018
preferred label: Henkilökohtainen talous @fi

personal income
type: Concept
broader: financial and business service
definition: Money that a person earns and is his/hers to keep or spend
in scheme: IPTC NewsCodes: Subject Code
notation: 04006019
preferred label: Ansiotulot @fi

auction service
type: Concept
broader: financial and business service
definition: Sales by bidding
definition: Myynti tarjousten perusteella. @fi
in scheme: IPTC NewsCodes: Subject Code
notation: 04006020
preferred label: Huutokaupat @fi

printing/promotional service
type: Concept
broader: financial and business service
definition: Production of printed matter such as flyers, ads, signs etc
definition: Esitteet, ilmoitukset, kyltit jne. @fi
in scheme: IPTC NewsCodes: Subject Code
notation: 04006021
preferred label: Pienpainatteet @fi

investment service
type: Concept
broader: financial and business service
definition: Financial advisers, as opposed to stock dealers or consultants
definition: Rahoitusneuvonta; ei osakkeiden välitys tai konsultointi. @fi
in scheme: IPTC NewsCodes: Subject Code
notation: 04006022
preferred label: Sijoitusneuvonta ja -palvelu @fi

clothing
type: Concept
broader: consumer goods
definition: Items of apparel to wear
in scheme: IPTC NewsCodes: Subject Code
notation: 04007001
preferred label: Vaatteet @fi

department store
type: Concept
broader: consumer goods
definition: Stores largely devoted to the sale of clothing to individuals
in scheme: IPTC NewsCodes: Subject Code
notation: 04007002
preferred label: Tavaratalot @fi

food
type: Concept
broader: consumer goods
definition: Fruits, vegetables, breads, meats for human consumption
in scheme: IPTC NewsCodes: Subject Code
notation: 04007003
preferred label: Elintarvikkeet @fi

mail order
type: Concept
broader: consumer goods
definition: Items sold through and delivered by mail
in scheme: IPTC NewsCodes: Subject Code
notation: 04007004
preferred label: Postimyynti @fi

retail
type: Concept
broader: consumer goods
definition: The last stage in the sales chain
in scheme: IPTC NewsCodes: Subject Code
notation: 04007005
preferred label: Vähittäiskauppa @fi

speciality store
type: Concept
broader: consumer goods
definition: Retail outlets that specialize in categories such as shoes, coats, power tools, etc
in scheme: IPTC NewsCodes: Subject Code
notation: 04007006
preferred label: Erikoisliikkeet @fi

wholesale
type: Concept
broader: consumer goods
definition: The first link in the sales chain after production
in scheme: IPTC NewsCodes: Subject Code
notation: 04007007
preferred label: Tukkukauppa @fi

beverage
type: Concept
broader: consumer goods
definition: Liquid consumables, both alcoholic and non-alcoholic
in scheme: IPTC NewsCodes: Subject Code
notation: 04007008
preferred label: Juomat @fi

electronic commerce
type: Concept
broader: consumer goods
definition: Buying and selling items through the Internet
in scheme: IPTC NewsCodes: Subject Code
notation: 04007009
preferred label: Verkkokauppa @fi

luxury good
type: Concept
broader: consumer goods
definition: Leather bags, jewellery, haute couture, accessories etc
in scheme: IPTC NewsCodes: Subject Code
notation: 04007010
preferred label: Ylellisyystavarat @fi

non-durable good
type: Concept
broader: consumer goods
definition: Lighters, pens and stationery, tableware, watches, glasses etc
in scheme: IPTC NewsCodes: Subject Code
notation: 04007011
preferred label: Päivittäistavarat @fi

toy
type: Concept
broader: consumer goods
definition: Children's plaything
in scheme: IPTC NewsCodes: Subject Code
notation: 04007012
preferred label: Leikkikalut @fi

central bank
type: Concept
broader: macro economics
definition: A country's major bank that sets interest rates, and provides transfer of funds between commercial banks
in scheme: IPTC NewsCodes: Subject Code
notation: 04008001
preferred label: Keskuspankit @fi

consumer issue
type: Concept
broader: macro economics
definition: Those issues, such as prices, inflation/deflation, quality of goods, at the retail sales level
in scheme: IPTC NewsCodes: Subject Code
notation: 04008002
preferred label: Kuluttaja-asiat @fi

debt market
type: Concept
broader: macro economics
definition: Market for trading debt instruments such as bonds, CDs, bankers acceptances, T bills, notes, IOUs etc
in scheme: IPTC NewsCodes: Subject Code
notation: 04008003
preferred label: Velkamarkkinat @fi

economic indicator
type: Concept
broader: macro economics
definition: Certain indexes, such as company inventories, the movement of prices that show whether the economy is improving or declining
in scheme: IPTC NewsCodes: Subject Code
notation: 04008004
preferred label: Talouden indikaattorit @fi

emerging market
type: Concept
broader: macro economics
definition: Those markets that are struggling to enter the world economies and those requiring financial help from international lenders
definition: Kehittyvien maiden velkaongelma @fi
in scheme: IPTC NewsCodes: Subject Code
notation: 04008005
preferred label: Kehittyvät markkinat @fi

foreign exchange market
type: Concept
broader: macro economics
definition: The trading of shekels, dinars, euros dollars etc around the world through regulated markets
in scheme: IPTC NewsCodes: Subject Code
notation: 04008006
preferred label: Valuuttamarkkinat @fi

government aid
type: Concept
broader: macro economics
definition: Supply of financial and other help by one government, usually to another
in scheme: IPTC NewsCodes: Subject Code
notation: 04008007
preferred label: Valtion tuet @fi

government debt
type: Concept
broader: macro economics
definition: The amount a government owes on bonds, services and for goods and services for which it has no ready cash
in scheme: IPTC NewsCodes: Subject Code
notation: 04008008
preferred label: Valtion velka @fi

interest rate
type: Concept
broader: macro economics
definition: The amount of money one must pay to borrow money
in scheme: IPTC NewsCodes: Subject Code
notation: 04008009
preferred label: Korko @fi

international economic institution
type: Concept
broader: macro economics
definition: Entities such as UNIDO, World Bank, World Trade Organization, the Import-Expert Bank etc that deals at a world level
in scheme: IPTC NewsCodes: Subject Code
notation: 04008010
preferred label: Kansainväliset talousjärjestöt @fi

international (foreign) trade
type: Concept
broader: macro economics
definition: Trade of goods and services between nations
in scheme: IPTC NewsCodes: Subject Code
notation: 04008011
preferred label: Kansainvälinen kauppa @fi

loan market
type: Concept
broader: macro economics
definition: The market where money is available to borrow, at certain rates of interest
definition: Pankkilainamarkkinat, pitkän ja lyhyen rahan markkinat @fi
in scheme: IPTC NewsCodes: Subject Code
notation: 04008012
preferred label: Rahamarkkinat @fi

economic organization
type: Concept
broader: macro economics
definition: Business, industrial and trade associations, societies and other private-sector groups.
definition: Liike-elämän, teollisuuden ja kaupan järjestöt @fi
in scheme: IPTC NewsCodes: Subject Code
notation: 04008013
preferred label: Talousjärjestöt @fi

consumer confidence
type: Concept
broader: macro economics
definition: Reports on consumer confidence in the economy.
in scheme: IPTC NewsCodes: Subject Code
notation: 04008014
preferred label: Kuluttajien luottamus talouteen @fi

trade dispute
type: Concept
broader: macro economics
definition: International dispute over trade barriers, cartels, dumping etc.
in scheme: IPTC NewsCodes: Subject Code
notation: 04008015
preferred label: Kansainväliset kauppakiistat @fi

inflation and deflation
type: Concept
broader: macro economics
definition: An increase in the amount of money in circulation and thereby a rise in prices; deflation, tighter monetary policy causing lower prices
in scheme: IPTC NewsCodes: Subject Code
notation: 04008016
preferred label: Inflaatio Deflaatio @fi

prices
type: Concept
broader: macro economics
definition: The monetary value of goods, services or stocks and bonds
definition: Tavaroiden, palvelujen, osakkeiden ja joukkovelkakirjojen arvo rahassa mitattuna. @fi
in scheme: IPTC NewsCodes: Subject Code
notation: 04008017
preferred label: Hinnat @fi

currency values
type: Concept
broader: macro economics
definition: The value of one currency as measured against another
definition: Valuutan arvo toisella valuutalla mitattuna. @fi
in scheme: IPTC NewsCodes: Subject Code
notation: 04008018
preferred label: Valuuttakurssit @fi

budgets and budgeting
type: Concept
broader: macro economics
definition: A method of balancing revenues against expenses
definition: Tuottojen ja kulujen tasapainottaminen @fi
in scheme: IPTC NewsCodes: Subject Code
notation: 04008019
preferred label: Budjetointi Budjetit @fi

credit and debt
type: Concept
broader: macro economics
definition: Credit: the amount of money available to you, often by loan. Debt, the amount you owe.
in scheme: IPTC NewsCodes: Subject Code
notation: 04008020
preferred label: Luotto Velka @fi

loans
type: Concept
broader: macro economics
definition: An agreement by one individual or institution to temporarily disperse money to another, with an agreed rate and time for its return
definition: Sopimus jolla joku - yksilö tai yhteisö - antaa tilapäisesti toisen käyttöön rahaa sovitulla korolla ja takaisinmaksuajalla. @fi
in scheme: IPTC NewsCodes: Subject Code
notation: 04008021
preferred label: Lainat @fi

mortgages
type: Concept
broader: macro economics
definition: The loan of money for the purpose of purchasing a property, whether land or building. Or, for homeowners to repair or maintain properties, often based on owner equity in a property
definition: Laina maa- tai rakennuskiinteistön ostamiseksi. Myös asuinrakennuksen kunnostukseen kiinteistön osakkaalle myönnetty laina. @fi
in scheme: IPTC NewsCodes: Subject Code
notation: 04008022
preferred label: Kiinnelainat @fi

financial markets
type: Concept
broader: macro economics
definition: Institutions set up to trade the shares or other financial paper of companies or other organizations, can also include currency trading
definition: Instituutiot (organisaatiot, pelisäännöt) joiden puitteissa käydään kauppaa yritysten tai muiden yhteisöjen osakkeilla tai rahoitusinstrumenteilla; valuuttakauppa mukaanlukien. @fi
in scheme: IPTC NewsCodes: Subject Code
notation: 04008023
preferred label: Rahoitusmarkkinat @fi

commodity markets
type: Concept
broader: macro economics
definition: The bartering or trading of goods such as cotton, oil, coal, metals, etc
definition: Puuvillan, öjlyn, hiilen, metallien ja muiden vastaavien hyödykkeiden kauppa ja välitys. @fi
in scheme: IPTC NewsCodes: Subject Code
notation: 04008024
preferred label: Raaka-ainemarkkinat @fi

investments
type: Concept
broader: macro economics
definition: Speculative purchases of corporate instruments, of commodities, currencies, or parts thereof
definition: Yritysvelkakirjojen, osakkeiden, rakaa-aineiden, valuuttojen yms spekulatiivinen hankinta. @fi
in scheme: IPTC NewsCodes: Subject Code
notation: 04008025
preferred label: Investoinnit @fi

stocks
type: Concept
broader: macro economics
definition: Corporate paper that gives an individual an ownership right to a part of a company's earnings
definition: Yrityksen arvopaperi, joka antaa omistajalleen omistusoikeuden osaan yrityksen tuloksesta. @fi
in scheme: IPTC NewsCodes: Subject Code
notation: 04008026
preferred label: Osakkeet @fi

bonds
type: Concept
broader: macro economics
definition: Corporate or governmental paper representing the loan of money at a fixed rate and for a fixed time to that company or government
definition: Yrityksen/julkishallinnon arvopaperi joka vastaa tietynsuuruista ja tietyllä korkotasolla myönnettyä lainaa, jonka yritys/valtio/kunta maksaa takaisin arvopaperin haltijalle. @fi
in scheme: IPTC NewsCodes: Subject Code
notation: 04008027
preferred label: Joukkovelkakirjamarkkinat @fi

mutual funds
type: Concept
broader: macro economics
definition: Pools of shares or bonds for sale often grouped by investment intention, such as growth, income or security
definition: Iso joukko yhteisesti omistettuja osakkeita tai joukkovelkakirjoja jotka usein on ryhmitelty jonkin sijoittamiskriteerin mukaan; esim kasvu, tuotto, riski. @fi
in scheme: IPTC NewsCodes: Subject Code
notation: 04008028
preferred label: Sijoitusrahastot @fi

derivative securities
type: Concept
broader: macro economics
definition: Financial instruments such as futures, swaps and options, used for risk management, whose characteristics and value depend upon the characteristics and value of an underlying instrument, such as a commodity, bond, equity or currency.
definition: Rahoitusinstrumentit kuten futuurit, swapit tai optiot, joita käytetään riskien hallintaan ja joiden ominaispiirteet ja arvo riippuvat niiden pohjana olevien intstrumenttien piirteistä (osakkeet, joukkovelkakirjalainat, raaka-aineet, valuutat) @fi
in scheme: IPTC NewsCodes: Subject Code
notation: 04008029
preferred label: Johdannaisvakuudet @fi

imports
type: Concept
broader: macro economics
definition: What is bought abroad and brought into a country for resale
definition: Ulkomailta tuontimaassa myytäväksi tuodut hyödykkeet.. @fi
in scheme: IPTC NewsCodes: Subject Code
notation: 04008030
preferred label: Tuonti @fi

exports
type: Concept
broader: macro economics
definition: What is produced or manufactured in your country and sent and sold elsewhere
definition: Omassa maassa tuotettujen hyödykkeiden vienti muihin maihin myytäväksi. @fi
in scheme: IPTC NewsCodes: Subject Code
notation: 04008031
preferred label: Vienti @fi

trade agreements
type: Concept
broader: macro economics
definition: Government level agreements between countries for the sale and purchase of goods and services
definition: Maiden väliset sopimukset tavaroiden ja palvelujen ostamiseksi ja myymiseksi. @fi
in scheme: IPTC NewsCodes: Subject Code
notation: 04008032
preferred label: Kauppasopimukset @fi

trade policy
type: Concept
broader: macro economics
definition: Governmental decisions on tariffs, shipping, embargoes, and the types or kinds of goods and services to be imported and exported
definition: Valtiovallan päätökset, joilla säädellään vienti- ja tuontitavaroiden tariffeja, laivausta, kiintiöitä sekä sitä millaisia tavaroita voidaan viedä ja tuoda. @fi
in scheme: IPTC NewsCodes: Subject Code
notation: 04008033
preferred label: Kauppapolitiikka @fi

business enterprises
type: Concept
broader: macro economics
definition: Organizations set up usually for profit-making purposes by creating and selling a product or service
in scheme: IPTC NewsCodes: Subject Code
notation: 04008034
preferred label: Yritykset @fi

tariff
type: Concept
broader: macro economics
definition: Fees placed on goods imported or exported, often punitive
in scheme: IPTC NewsCodes: Subject Code
notation: 04008035
preferred label: Tullimaksut @fi

trade balance
type: Concept
broader: macro economics
definition: The difference between the financial value of imports and exports
definition: Tuonnin ja viennin rahallisen arvon erotus. @fi
in scheme: IPTC NewsCodes: Subject Code
notation: 04008036
preferred label: Kauppatase @fi

energy
type: Concept
broader: market and exchange
definition: Stories related to energy trading and markets
in scheme: IPTC NewsCodes: Subject Code
notation: 04009001
preferred label: Energiapörssit @fi

metal
type: Concept
broader: market and exchange
definition: Markets for trading base metals such as copper, aluminium, steel, zinc etc
in scheme: IPTC NewsCodes: Subject Code
notation: 04009002
preferred label: Metallipörssit @fi

securities
type: Concept
broader: market and exchange
definition: Markets for trading types of company paper such as stocks and bonds
in scheme: IPTC NewsCodes: Subject Code
notation: 04009003
preferred label: Arvopaperipörssit @fi

soft commodity
type: Concept
broader: market and exchange
definition: Trading in commodities such as cotton, sugar, sorghum, soybeans etc.
in scheme: IPTC NewsCodes: Subject Code
notation: 04009004
preferred label: Muut raaka-ainepörssit @fi

advertising
type: Concept
broader: media
definition: Methods of promoting goods and service to consumers through video, graphics, print text etc
in scheme: IPTC NewsCodes: Subject Code
notation: 04010001
preferred label: Mainonta @fi

book
type: Concept
broader: media
definition: The business of producing and selling bound media, whether fiction or non-fiction
in scheme: IPTC NewsCodes: Subject Code
notation: 04010002
preferred label: Kirjankustannus @fi

cinema industry
type: Concept
broader: media
definition: The business of cinema
in scheme: IPTC NewsCodes: Subject Code
notation: 04010003
preferred label: Elokuvateollisuus @fi

news agency
type: Concept
broader: media
definition: Commercial agencies for production and distribution of newsworthy events through print, broadcast, video or electronic media
in scheme: IPTC NewsCodes: Subject Code
notation: 04010004
preferred label: Uutistoimistot @fi

newspaper and magazine
type: Concept
broader: media
definition: The business of producing bound and unbound printed paper products for periodic distribution of news items
in scheme: IPTC NewsCodes: Subject Code
notation: 04010005
preferred label: Sanomalehdet Aikakauslehdet @fi

online
type: Concept
broader: media
definition: The business of distributing news and information through computer networks for public consumption
in scheme: IPTC NewsCodes: Subject Code
notation: 04010006
preferred label: Verkkopalvelut @fi

public relation
type: Concept
broader: media
definition: The job of promoting products and services through advertising campaigns and/or through person-to-person contact or through news releases
in scheme: IPTC NewsCodes: Subject Code
notation: 04010007
preferred label: Suhdetoiminta @fi

radio industry
type: Concept
broader: media
definition: Business of radio
in scheme: IPTC NewsCodes: Subject Code
notation: 04010008
preferred label: Radiotoiminta @fi

satellite and cable service
type: Concept
broader: media
definition: The business of transmitting of news, entertainment and information via satellite or cable television services
in scheme: IPTC NewsCodes: Subject Code
notation: 04010009
preferred label: Satelliittitelevisio Kaapelitelevisio @fi

television industry
type: Concept
broader: media
definition: Business of television
definition: Myös digitelevisiotoiminta @fi
in scheme: IPTC NewsCodes: Subject Code
notation: 04010010
preferred label: Televisiotoiminta @fi

music industry
type: Concept
broader: media
definition: Recording, production, marketing of music
definition: Musiikin äänittäminen, tuottaminen ja markkinointi @fi
in scheme: IPTC NewsCodes: Subject Code
notation: 04010011
preferred label: Musiikkiteollisuus @fi

aerospace
type: Concept
broader: manufacturing and engineering
definition: Companies that assemble or manufacture components for airplanes and space ships.
in scheme: IPTC NewsCodes: Subject Code
notation: 04011001
preferred label: Lentokoneteollisuus Avaruusteknologia @fi

automotive equipment
type: Concept
broader: manufacturing and engineering
definition: Companies that produce components for automobiles
in scheme: IPTC NewsCodes: Subject Code
notation: 04011002
preferred label: Autoteollisuus @fi

defence equipment
type: Concept
broader: manufacturing and engineering
definition: Manufacturers of guns, tanks, cannons, ships etc for the military and non-military protection services
in scheme: IPTC NewsCodes: Subject Code
notation: 04011003
preferred label: Sotateollisuus @fi

electrical appliance
type: Concept
broader: manufacturing and engineering
definition: Makers of large and small electrical goods for use in homes or business
in scheme: IPTC NewsCodes: Subject Code
notation: 04011004
preferred label: Elektroniikkateollisuus Sähkölaiteteollisuus @fi

heavy engineering
type: Concept
broader: manufacturing and engineering
definition: Manufacturers of cranes, bulldozers and the like for use in major construction projects
in scheme: IPTC NewsCodes: Subject Code
notation: 04011005
preferred label: Konepajateollisuus @fi

industrial component
type: Concept
broader: manufacturing and engineering
definition: Manufacturers of mechanical, electrical, electronic items needed in the manufacture of other items
in scheme: IPTC NewsCodes: Subject Code
notation: 04011006
preferred label: Teollisuuden komponentit @fi

instrument engineering
type: Concept
broader: manufacturing and engineering
definition: Manufacturers of instruments for calibration, measurement of things like speed, pressure, distance
in scheme: IPTC NewsCodes: Subject Code
notation: 04011007
preferred label: Hienomekaaninen teollisuus @fi

shipbuilding
type: Concept
broader: manufacturing and engineering
definition: Manufacturers of ships, submarines, barges.
in scheme: IPTC NewsCodes: Subject Code
notation: 04011008
preferred label: Laivanrakennus @fi

machine manufacturing
type: Concept
broader: manufacturing and engineering
definition: Manufacturers of turbines, engines, fans , pumps , motors and components for powered equipment.
in scheme: IPTC NewsCodes: Subject Code
notation: 04011009
preferred label: Koneteollisuus @fi

building material
type: Concept
broader: metal and mineral
definition: Manufacture of materials like wallboard, lumber wiring for the building industry
in scheme: IPTC NewsCodes: Subject Code
notation: 04012001
preferred label: Rakennusaineteollisuus @fi

gold and precious material
type: Concept
broader: metal and mineral
definition: Mining, refining and sales of gold and other precious metals
in scheme: IPTC NewsCodes: Subject Code
notation: 04012002
preferred label: Jalometalliteollisuus @fi

iron and steel
type: Concept
broader: metal and mineral
definition: Mining, refining and sales of iron-based metals
in scheme: IPTC NewsCodes: Subject Code
notation: 04012003
preferred label: Rautateollisuus Terästeollisuus @fi

non ferrous metal
type: Concept
broader: metal and mineral
definition: Mining, refining and sales of copper, zinc, aluminium, and other metals not based on iron
in scheme: IPTC NewsCodes: Subject Code
notation: 04012004
preferred label: Muu metalliteollisuus @fi

mining
type: Concept
broader: metal and mineral
definition: The industry of digging for metals, raw materials such as coal, or precious gems such as diamonds
in scheme: IPTC NewsCodes: Subject Code
notation: 04012005
preferred label: Kaivostoiminta @fi

distiller and brewer
type: Concept
broader: process industry
definition: Manufacture of alcoholic beverages
in scheme: IPTC NewsCodes: Subject Code
notation: 04013001
preferred label: Alkoholijuomateollisuus @fi

food
type: Concept
broader: process industry
definition: The business of processing, distributing and selling for basic human consumption
in scheme: IPTC NewsCodes: Subject Code
notation: 04013002
preferred label: Elintarviketeollisuus @fi

furnishings and furniture
type: Concept
broader: process industry
definition: Manufacture of furniture, wallpaper, paints and fabrics for interior decoration
definition: Sisältää sisustustarviketuotannon @fi
in scheme: IPTC NewsCodes: Subject Code
notation: 04013003
preferred label: Huonekaluteollisuus @fi

paper and packaging product
type: Concept
broader: process industry
definition: Production of paper material for writing, wrapping, printing, or packaging
in scheme: IPTC NewsCodes: Subject Code
notation: 04013004
preferred label: Paperiteollisuus Pakkausteollisuus @fi

rubber product
type: Concept
broader: process industry
definition: Production of rubber based materials for gloves, protective coatings, hoses and the like
in scheme: IPTC NewsCodes: Subject Code
notation: 04013005
preferred label: Kumiteollisuus @fi

soft drinks
type: Concept
broader: process industry
definition: Production of non-alcoholic drinks
in scheme: IPTC NewsCodes: Subject Code
notation: 04013006
preferred label: Virvoitusjuomateollisuus @fi

textile and clothing
type: Concept
broader: process industry
definition: Production of fabrics for furnishings and fixtures, and for clothing of various types
definition: Sisältää kenkäteollisuuden @fi
in scheme: IPTC NewsCodes: Subject Code
notation: 04013007
preferred label: Tekstiiliteollisuus Vaatetusteollisuus @fi

tobacco
type: Concept
broader: process industry
definition: Growing, producing and sale of tobacco products
in scheme: IPTC NewsCodes: Subject Code
notation: 04013008
preferred label: Tupakkateollisuus @fi

casino and gambling
type: Concept
broader: tourism and leisure
definition: The business of providing outlets for various games of chance using cards, dice, spinning wheels to betting on animal races
in scheme: IPTC NewsCodes: Subject Code
notation: 04014001
preferred label: Kasinot Rahapeliyritykset @fi

hotel and accommodation
type: Concept
broader: tourism and leisure
definition: The business of providing food and shelter to travellers
in scheme: IPTC NewsCodes: Subject Code
notation: 04014002
preferred label: Majoituspalvelut @fi

recreational and sporting goods
type: Concept
broader: tourism and leisure
definition: Manufacture of goods for leisure activities
in scheme: IPTC NewsCodes: Subject Code
notation: 04014003
preferred label: Urheiluvälineteollisuus @fi

restaurant and catering
type: Concept
broader: tourism and leisure
definition: The business of providing prepared foods for customers in groups large and small
in scheme: IPTC NewsCodes: Subject Code
notation: 04014004
preferred label: Ravintola-ala @fi

tour operator
type: Concept
broader: tourism and leisure
definition: Operators of trips either locally, as around town, or to other countries
in scheme: IPTC NewsCodes: Subject Code
notation: 04014005
preferred label: Matkanjärjestäjät @fi

air transport
type: Concept
broader: transport
definition: Airplane and airport operations
in scheme: IPTC NewsCodes: Subject Code
notation: 04015001
preferred label: Lentoliikenne @fi

railway
type: Concept
broader: transport
definition: The business of transporting people or cargo by rail
in scheme: IPTC NewsCodes: Subject Code
notation: 04015002
preferred label: Rautatieliikenne @fi

road transport
type: Concept
broader: transport
definition: The business of transport goods by trucks and highways
in scheme: IPTC NewsCodes: Subject Code
notation: 04015003
preferred label: Tieliikenne @fi

waterway and maritime transport
type: Concept
broader: transport
definition: Commercial movement of people or goods via boats, ships and water
in scheme: IPTC NewsCodes: Subject Code
notation: 04015004
preferred label: Vesiliikenne @fi

accounting and audit
type: Concept
broader: company information
definition: Changes in choice of auditing firm. Reports on impact of changes in GAAP.
in scheme: IPTC NewsCodes: Subject Code
notation: 04016001
preferred label: Laskenta Tilintarkastus @fi

annual and special corporate meeting
type: Concept
broader: company information
definition: Announcements of upcoming meetings. Reports on meetings.
in scheme: IPTC NewsCodes: Subject Code
notation: 04016002
preferred label: Yhtiökokoukset @fi

annual report
type: Concept
broader: company information
definition: Availability or contents of annual company reports.
in scheme: IPTC NewsCodes: Subject Code
notation: 04016003
preferred label: Vuosikertomukset @fi

antitrust issue
type: Concept
broader: company information
definition: Antitrust activities, monopoly regulation, etc.
definition: Monopolit, määräävä markkina-asema, kartellit @fi
in scheme: IPTC NewsCodes: Subject Code
notation: 04016004
preferred label: Kilpailuasiat @fi

merger, acquisition and takeover
type: Concept
broader: company information
definition: News on mergers, takeovers or acquisitions.
in scheme: IPTC NewsCodes: Subject Code
notation: 04016005
preferred label: Yritysostot Fuusiot @fi

analysts' comment
type: Concept
broader: company information
definition: Stock analyst comments, analysis and recommendations.
in scheme: IPTC NewsCodes: Subject Code
notation: 04016006
preferred label: Analyytikon kommentit @fi

bankruptcy
type: Concept
broader: company information
definition: Actual bankruptcy filings.
in scheme: IPTC NewsCodes: Subject Code
notation: 04016007
preferred label: Konkurssit @fi

board of directors (appointment and change)
type: Concept
broader: company information
definition: Appointments to or changes in the board of directors for a company.
in scheme: IPTC NewsCodes: Subject Code
notation: 04016008
preferred label: Yhtiöiden hallintoelimet @fi

buyback
type: Concept
broader: company information
definition: Stock buyback programs. This should be kept distinct from Stock Activity (see below).
in scheme: IPTC NewsCodes: Subject Code
notation: 04016009
preferred label: Osakkeiden takaisinosto @fi

C.E.O. interview
type: Concept
broad match: http://cv.iptc.org/newscodes/mediatopic/20000170
broader: company information
definition: Interviews with Chief Executive Officers.
in scheme: IPTC NewsCodes: Subject Code
notation: 04016010
preferred label: Toimitusjohtajan haastattelu @fi

corporate officer
type: Concept
broad match: http://cv.iptc.org/newscodes/mediatopic/20000190
broader: company information
definition: Appointments or changes in corporate officers.
in scheme: IPTC NewsCodes: Subject Code
notation: 04016011
preferred label: Henkilöstö @fi

corporate profile
type: Concept
broad match: http://cv.iptc.org/newscodes/mediatopic/20000170
broader: company information
definition: Descriptive profiles of companies.
in scheme: IPTC NewsCodes: Subject Code
notation: 04016012
preferred label: Yrityskuva @fi

contract
type: Concept
broader: company information
definition: Commercial contracts.
in scheme: IPTC NewsCodes: Subject Code
notation: 04016013
preferred label: Kaupalliset sopimukset @fi

defence contract
type: Concept
broad match: http://cv.iptc.org/newscodes/mediatopic/20000196
broader: company information
definition: The award of government contracts for defence related activity.
definition: Puolustustoimintaan liittyvät sopimukset. @fi
in scheme: IPTC NewsCodes: Subject Code
notation: 04016014
preferred label: Puolustusvoimien hankintasopimukset @fi

dividend announcement
type: Concept
broader: company information
definition: Announcements regarding the disbursement of dividends.
in scheme: IPTC NewsCodes: Subject Code
notation: 04016015
preferred label: Osinkoilmoitukset @fi

earnings forecast
type: Concept
broader: company information
definition: Analyst prediction of company earnings.
in scheme: IPTC NewsCodes: Subject Code
notation: 04016016
preferred label: Tulosennusteet @fi

financially distressed company
type: Concept
broader: company information
definition: Aa company is financially distressed - not yet having filed for bankruptcy.
in scheme: IPTC NewsCodes: Subject Code
notation: 04016017
preferred label: Rahoitusvaikeudet @fi

earnings
type: Concept
broader: company information
definition: Any increase of earnings results.
in scheme: IPTC NewsCodes: Subject Code
notation: 04016018
preferred label: Tulostiedotteet @fi

financing and stock offering
type: Concept
broader: company information
definition: New offerings of equity including initial public offerings.
in scheme: IPTC NewsCodes: Subject Code
notation: 04016019
preferred label: Yritysrahoitus Osakeannit @fi

government contract
type: Concept
broad match: http://cv.iptc.org/newscodes/mediatopic/20000196
broader: company information
definition: The award of government contracts not related to defence activity
in scheme: IPTC NewsCodes: Subject Code
notation: 04016020
preferred label: Julkiset hankinnat @fi

global expansion
type: Concept
broad match: http://cv.iptc.org/newscodes/mediatopic/20000170
broader: company information
definition: Planned or actual openings of offices in countries for the first time.
in scheme: IPTC NewsCodes: Subject Code
notation: 04016021
preferred label: Kansainvälistyminen @fi

insider trading
type: Concept
broader: company information
definition: The purchase or sales of stock by corporate officers or board members.
in scheme: IPTC NewsCodes: Subject Code
notation: 04016022
preferred label: Sisäpiirikaupat @fi

joint venture
type: Concept
broader: company information
definition: Joint ventures between companies. (Not marketing related - see Marketing.)
in scheme: IPTC NewsCodes: Subject Code
notation: 04016023
preferred label: Yhteisyritykset @fi

leveraged buyout
type: Concept
broader: company information
definition: Leveraged buyouts.
in scheme: IPTC NewsCodes: Subject Code
notation: 04016024
preferred label: Velkarahalla rahoitetut yritysostot LBO @fi

layoffs and downsizing
type: Concept
broader: company information
definition: Planned or actual reductions in the labour force.
in scheme: IPTC NewsCodes: Subject Code
notation: 04016025
preferred label: Irtisanomiset @fi

licensing agreement
type: Concept
broader: company information
definition: Licensing agreements between companies.
in scheme: IPTC NewsCodes: Subject Code
notation: 04016026
preferred label: Lisensointisopimukset @fi

litigation and regulation
type: Concept
broader: company information
definition: Corporate law including litigation and regulations.
in scheme: IPTC NewsCodes: Subject Code
notation: 04016027
preferred label: Yhtiöoikeus @fi

management change
type: Concept
broader: company information
definition: Major appointments or changes in management below the level of corporate officer.
in scheme: IPTC NewsCodes: Subject Code
notation: 04016028
preferred label: Yritysjohto @fi

marketing
type: Concept
broader: company information
definition: Includes news regarding joint marketing agreements between companies, adoption of new product marketing strategies, etc.
in scheme: IPTC NewsCodes: Subject Code
notation: 04016029
preferred label: Markkinointi @fi

new product
type: Concept
broader: company information
definition: Announcements of new products.
in scheme: IPTC NewsCodes: Subject Code
notation: 04016030
preferred label: Tuoteuutuudet @fi

patent, copyright and trademark
type: Concept
broader: company information
definition: News related to patents, copyright and trademarks.
in scheme: IPTC NewsCodes: Subject Code
notation: 04016031
preferred label: Patentit Tekijänoikeus Tavaramerkit @fi

plant closing
type: Concept
broad match: http://cv.iptc.org/newscodes/mediatopic/20000170
broader: company information
definition: Announcements of planned or actual plant closings.
in scheme: IPTC NewsCodes: Subject Code
notation: 04016032
preferred label: Toimipaikkojen lakkauttaminen @fi

plant opening
type: Concept
broad match: http://cv.iptc.org/newscodes/mediatopic/20000170
broader: company information
definition: Announcements of planned or actual plant openings.
in scheme: IPTC NewsCodes: Subject Code
notation: 04016033
preferred label: Uudet toimipaikat @fi

privatisation
type: Concept
broader: company information
definition: Privatisation (privatisation) of state run companies.
in scheme: IPTC NewsCodes: Subject Code
notation: 04016034
preferred label: Yksityistäminen @fi

proxy filing
type: Concept
broader: company information
definition: Filings with regulatory agencies of proxy statements for upcoming shareholder votes.
in scheme: IPTC NewsCodes: Subject Code
notation: 04016035
preferred label: Proxy filing @fi

rating
type: Concept
broader: company information
definition: Corporate and sovereign debt and credit ratings (e.g. SandP or Moody's)
in scheme: IPTC NewsCodes: Subject Code
notation: 04016036
preferred label: Luottoluokitus @fi

research and development
type: Concept
broader: company information
definition: Research and expenditure on new product development.
in scheme: IPTC NewsCodes: Subject Code
notation: 04016037
preferred label: Tutkimus ja kehittäminen @fi

quarterly or semiannual financial statement
type: Concept
broader: company information
definition: Availability or contents of quarterly or semi-annual corporate reports.
in scheme: IPTC NewsCodes: Subject Code
notation: 04016038
preferred label: Osavuosikatsaukset @fi

restructuring and recapitalisation
type: Concept
broader: company information
definition: Sale of company units, splits of existing companies into units under a holding company, etc.
in scheme: IPTC NewsCodes: Subject Code
notation: 04016039
preferred label: Rakennejärjestelyt @fi

spin-off
type: Concept
broader: company information
definition: Creation of new companies being spun off from existing companies.
definition: Uusien yritysten luominen yhtiön osista @fi
in scheme: IPTC NewsCodes: Subject Code
notation: 04016040
preferred label: Spin-offs @fi

stock activity
type: Concept
broader: company information
definition: Announcements of major stock events: splits, block trades, new highs or lows, etc.
in scheme: IPTC NewsCodes: Subject Code
notation: 04016041
preferred label: Sijoittajasuhteet @fi

industrial production
type: Concept
broader: company information
definition: Manufacture of durable and non-durable goods
definition: Kulutus- tai kestokulutushyödykkeiden valmistus. @fi
in scheme: IPTC NewsCodes: Subject Code
notation: 04016042
preferred label: Teollisuustuotanto @fi

productivity
type: Concept
broader: company information
definition: The cost of labour to produce an item of value, often measured as output per hour per person
definition: Tavaran tai palvelun tuottamiseen tarvittava työ, mittarina usein tuotettu määrä yhtä henkilötyötuntia kohden. @fi
in scheme: IPTC NewsCodes: Subject Code
notation: 04016043
preferred label: Tuottavuus @fi

inventories
type: Concept
broader: company information
definition: Goods not sold and held by the producer, wholesaler or retailer
definition: Tuottajan, tukkuliikkeen tai vähittäiskaupan hallussa olevat myymättömät tuotteet. @fi
in scheme: IPTC NewsCodes: Subject Code
notation: 04016044
preferred label: Varastot @fi

sales
type: Concept
broader: company information
definition: Either the exchange of goods for money, or the practice of discounting prices to increase the amount of goods sold, or to get rid of outdated merchandise
definition: Tavaroiden vaihtaminen rahaa vastaan @fi
in scheme: IPTC NewsCodes: Subject Code
notation: 04016045
preferred label: Myynti @fi

corporations
type: Concept
broader: company information
definition: Business enterprises formally licensed with boards of directors and hierarchical structures of governance
definition: Muodollisesti organisoitu yritys, jolla on hallitus ja hierarkkinen hallintomalli. @fi
in scheme: IPTC NewsCodes: Subject Code
notation: 04016046
preferred label: Yhtymät @fi

shareholders
type: Concept
broader: company information
definition: Anyone holding a piece of paper issued by a company which changes in value and entitles them to dividends depending on the performance of the company
definition: Kuka tahansa jolla on hallinnassaan yhtiön liikkeesenlaskema arvopaperi, jonka hinta vaihtelee ja oikeuttaa osinkoon. @fi
in scheme: IPTC NewsCodes: Subject Code
notation: 04016047
preferred label: Osakkeenomistajat @fi

corporate performance
type: Concept
broad match: http://cv.iptc.org/newscodes/mediatopic/20000170
broader: company information
definition: How well a company performs, measured by its net earnings, its dividends its earnings per share and price/earnings ratio
definition: Yrityksen menestyminen mitattuna esim. nettotuotolla, tuotolla osaketta kohden, osakkeen hinnan ja tuoton välisellä suhteella. @fi
in scheme: IPTC NewsCodes: Subject Code
notation: 04016048
preferred label: Yrityksen tuloskunto @fi

losses
type: Concept
broad match: http://cv.iptc.org/newscodes/mediatopic/20000170
broader: company information
definition: When expenses exceed revenue
definition: Kun kulut ylittävät tuotot. @fi
in scheme: IPTC NewsCodes: Subject Code
notation: 04016049
preferred label: Tappiot @fi

credit ratings
type: Concept
broader: company information
definition: Formal statements by certain rating agencies such as Standard and Poor's on the investment risk of a company, a country or enterprise
definition: Luottotietoyhtiöiden muodollinen arvio yrityksen tai maan sijoitusriskistä. @fi
in scheme: IPTC NewsCodes: Subject Code
notation: 04016050
preferred label: Luottokelpoisuusluokitus @fi

stock splits
type: Concept
broader: company information
definition: Issuing multiple shares for one share of stock. Usually occurs when the price of a stock has increased so much that its purchase price is not attractive. A reverse split is when one share is issued for multiple shares, to raise the per share value.
definition: Osakeyhtiön yhtä osaketta kohden lasketaan liikkeeseen useampia osakkeita. Käänteinen osakejako tapahtuu kun useampia liikkeeseenlaskettuja osakkeita kohden lasketaan liikkeeseen vain yksi. @fi
in scheme: IPTC NewsCodes: Subject Code
notation: 04016051
preferred label: Osakkeiden pilkkominen @fi

stock options
type: Concept
broader: company information
definition: An agreement to either buy or sell a stock when it meets a certain price
definition: Sopimus myydä tai ostaa osake kun sen hinta saavuttaa tietyn tason @fi
in scheme: IPTC NewsCodes: Subject Code
notation: 04016052
preferred label: Osakeoptiot @fi

recalls (products)
type: Concept
broader: company information
definition: A decision by a company to take back or repair a defective product
definition: Yrityksen päätös vetää markkinoilta tai korjata viallinen tuote. @fi
in scheme: IPTC NewsCodes: Subject Code
notation: 04016053
preferred label: Markkinoiltavedot @fi

globalization
type: Concept
broader: company information
definition: Doing business around the world
definition: Yritystoiminnan ulottaminen eri puolille maailmaa. @fi
in scheme: IPTC NewsCodes: Subject Code
notation: 04016054
preferred label: Globalisaatio @fi

consumers
type: Concept
broader: company information
definition: Buyers of goods and services
definition: Tavaran tai palvelun ostajat @fi
in scheme: IPTC NewsCodes: Subject Code
notation: 04016055
preferred label: Kuluttajat @fi

purchase
type: Concept
broader: company information
definition: Items that companies buy, such as raw materials, office supplies etc.
definition: Tuotannotekijät joita yritykset ostavat (raaka-aineet, toimistotarvikkeet jne.) @fi
in scheme: IPTC NewsCodes: Subject Code
notation: 04016056
preferred label: Ostot Hankinnat @fi

new service
type: Concept
broader: company information
definition: New services added by a company, such as new flight routes, etc.
definition: Yrityksen markkinoille tuomat uudet tuotteet ja palvelut, esim. uusi lentoreitti @fi
in scheme: IPTC NewsCodes: Subject Code
notation: 04016057
preferred label: Uudet tuottteet @fi

economic policy
type: Concept
broader: economy (general)
definition: Government directed policy on production, taxes, tariffs and things that affect the direction and health of the economy
definition: Valtiovallan politiikka, joka ohjaa tuotantoa, veroja, tariffeja ja liiketoiminnan yleisiä edellytyksia ja talouden tilaa @fi
in scheme: IPTC NewsCodes: Subject Code
notation: 04017001
preferred label: Talouspolitiikka @fi

institution
type: Concept
broad match: http://cv.iptc.org/newscodes/mediatopic/04000000
broader: business (general)
definition: Either an established law, practice or system or an organization having a social, religious, educational or similar purpose such as hospital, school, prison
definition: Vakiintunut laki, käytäntö, järjestelmä tai yhteisö, jolla on sosiaalisia, uskonnollisia, kasvatuksellisia yms tavoitteita, esim. sairaalan, vankilan ylläpito. @fi
in scheme: IPTC NewsCodes: Subject Code
notation: 04018001
preferred label: Instituutio @fi

money and monetary policy
type: Concept
broader: finance (general)
definition: Government bank directed policy on the amount of money in circulation and the rate at which it can be loaned
definition: Keskuspankin liikkeessä olevan rahan määrään ja lainauskorkoon kohdistuvat toimenpiteet. @fi
in scheme: IPTC NewsCodes: Subject Code
notation: 04019001
preferred label: Rahapolitiikka @fi

adult education
type: Concept
broader: education
definition: Education provided for older students outside the usual age groups of 5-25
in scheme: IPTC NewsCodes: Subject Code
notation: 05001000
preferred label: Aikuiskoulutus @fi

further education
type: Concept
broader: education
definition: Any form of education beyond basic education of several levels
definition: Jatkokoulutus tarkoittaa ammatti- ja korkeakoulututkinnon jälkeistä usein muodollista pätevyyttä lisäävää koulutusta. @fi
in scheme: IPTC NewsCodes: Subject Code
notation: 05002000
preferred label: Jatkokoulutus @fi

parent organisation
type: Concept
broader: education
definition: Groups of parents set up to support schools
in scheme: IPTC NewsCodes: Subject Code
notation: 05003000
preferred label: Koulun ja kodin yhteistyö @fi

preschool
type: Concept
broader: education
definition: Education for children under the national compulsory education age
definition: Päiväkodeissa tai kouluissa @fi
in scheme: IPTC NewsCodes: Subject Code
notation: 05004000
preferred label: Esiopetus @fi

elementary schools
type: Concept
broader: school
definition: Schools usually of a level from kindergarten through 11 or 12 years of age
definition: Luokat 1–6 @fi
in scheme: IPTC NewsCodes: Subject Code
notation: 05005001
preferred label: Perusopetuksen alaluokat @fi

middle schools
type: Concept
broader: school
definition: Transitional school between elementary and high school, 12 through 13 years of age
definition: Luokat 7–9 (10) @fi
in scheme: IPTC NewsCodes: Subject Code
notation: 05005002
preferred label: Perusopetuksen yläluokat @fi

high schools
type: Concept
broader: school
definition: Pre-college/ university level education, 14 to 17 or 18 years of age, called freshman, sophomore, junior and senior
definition: Lukiokoulutus ja ammatilliset perustutkinnot @fi
in scheme: IPTC NewsCodes: Subject Code
notation: 05005003
preferred label: Toisen asteen koulutus @fi

teachers union
type: Concept
broad match: http://cv.iptc.org/newscodes/mediatopic/20000536
broader: education
definition: Organization of teachers for collective bargaining and other purposes
definition: Opettajien järjestöt palkka- ja muiden etujen ajamiseen, esim. OAJ @fi
in scheme: IPTC NewsCodes: Subject Code
notation: 05006000
preferred label: Opetusalan ammattijärjestöt @fi

university
type: Concept
broader: education
definition: Institutions of higher learning capable of providing doctorate degrees
in scheme: IPTC NewsCodes: Subject Code
notation: 05007000
preferred label: Ammattikorkeakoulut Korkeakoulut Yliopistot @fi

upbringing
type: Concept
broader: education
definition: Lessons learned from parents and others as one grows up
definition: Sisältää varhaiskasvatuksen @fi
in scheme: IPTC NewsCodes: Subject Code
notation: 05008000
preferred label: Kasvatus @fi

entrance examination
type: Concept
broader: education
definition: Exams for entering colleges, universities, junior and senior high schools, and all other higher and lower education institutes, including cram schools, which help students prepare for exams for entry to prestigious schools.
in scheme: IPTC NewsCodes: Subject Code
notation: 05009000
preferred label: Pääsykokeet Hakumenettelyt @fi

students
type: Concept
broader: teaching and learning
definition: People of any age in a structured environment, not necessarily a classroom, in order to learn something
definition: Kaikenikäiset ihmiset oppimassa ohjatussa tilanteessa, ei välttämättä luokkahuoneessa. @fi
in scheme: IPTC NewsCodes: Subject Code
notation: 05010001
preferred label: Opiskelijat @fi

teachers
type: Concept
broader: teaching and learning
definition: People with knowledge who can impart that knowledge to others
in scheme: IPTC NewsCodes: Subject Code
notation: 05010002
preferred label: Opettajat @fi

curriculum
type: Concept
broader: teaching and learning
definition: The courses offered by a learning institution and the regulation of those courses
definition: Oppilaitoksen tarjoamat kurssit ja niiden järjestäminen @fi
in scheme: IPTC NewsCodes: Subject Code
notation: 05010003
preferred label: Opetussuunnitelmat Opinto-ohjelmat @fi

test/examination
type: Concept
broader: teaching and learning
definition: A measurement of student accomplishment
definition: Opiskelutulosten arviointi. @fi
in scheme: IPTC NewsCodes: Subject Code
notation: 05010004
preferred label: Kokeet Tentit Tutkinnot @fi

parochial school
type: Concept
broad match: http://cv.iptc.org/newscodes/mediatopic/20000399
broader: religious education
definition: A school run by the Roman Catholic faith
definition: Roomalaiskatolisen kirkon ylläpitämä koulu. @fi
in scheme: IPTC NewsCodes: Subject Code
notation: 05011001
preferred label: Katolinen koulu @fi

seminary
type: Concept
broad match: http://cv.iptc.org/newscodes/mediatopic/20000399
broader: religious education
definition: A school of any faith specifically designed to train ministers
definition: Minkä tahansa uskontokunnan pappeja kouluttava opetuslaitos. @fi
in scheme: IPTC NewsCodes: Subject Code
notation: 05011002
preferred label: Pappisseminaari @fi

yeshiva
type: Concept
broad match: http://cv.iptc.org/newscodes/mediatopic/20000399
broader: religious education
definition: A school for training rabbis
definition: Rabbien opetuslaitos. @fi
in scheme: IPTC NewsCodes: Subject Code
notation: 05011003
preferred label: Yeshiva @fi

madrasa
type: Concept
broad match: http://cv.iptc.org/newscodes/mediatopic/20000399
broader: religious education
definition: A school for teaching Islam
definition: Islaminuskon opetuslaitos. @fi
in scheme: IPTC NewsCodes: Subject Code
notation: 05011004
preferred label: Madrasa @fi

renewable energy
type: Concept
broader: environmental issue
definition: Environmental impact of renewable energy, including solar, wind, hydro, biomass and geothermal
in scheme: IPTC NewsCodes: Subject Code
notation: 06001000
preferred label: Uusiutuvat energialähteet @fi

endangered species
type: Concept
broader: conservation
definition: Those species of wildlife in danger of disappearing, largely because of changes in environment, hunting, or weather
in scheme: IPTC NewsCodes: Subject Code
notation: 06002001
preferred label: Uhanalaiset lajit @fi

ecosystem
type: Concept
broader: conservation
definition: A system of plants, animals and bacteria interrelated in its physical/chemical environment
in scheme: IPTC NewsCodes: Subject Code
notation: 06002002
preferred label: Ekosysteemit @fi

energy saving
type: Concept
broader: environmental issue
definition: Conservation of electrical, and other power sources
in scheme: IPTC NewsCodes: Subject Code
notation: 06003000
preferred label: Energiansäästö @fi

environmental politics
type: Concept
broader: environmental issue
definition: The debate on environmental policy
in scheme: IPTC NewsCodes: Subject Code
notation: 06004000
preferred label: Ympäristöpolitiikka @fi

air pollution
type: Concept
broader: environmental pollution
definition: Solid or gaseous matter affecting the quality of air that we breathe
in scheme: IPTC NewsCodes: Subject Code
notation: 06005001
preferred label: Ilman saastuminen @fi

water pollution
type: Concept
broader: environmental pollution
definition: Solids or liquids that corrupt the quality of water that could be used for drinking or irrigation
in scheme: IPTC NewsCodes: Subject Code
notation: 06005002
preferred label: Vesien saastuminen @fi

land resources
type: Concept
broader: natural resources
definition: That portion of a nation or state that is above water and available for development either for profit or for the general good of the public
in scheme: IPTC NewsCodes: Subject Code
notation: 06006001
preferred label: Maa-alueet @fi

parks
type: Concept
broader: natural resources
definition: Areas set aside and developed for public enjoyment and recreation, including commercial development such as theme parks
in scheme: IPTC NewsCodes: Subject Code
notation: 06006002
preferred label: Puistot Virkistysalueet @fi

forests
type: Concept
broader: natural resources
definition: Open areas of trees either available for public enjoyment, or for commercial purposes
in scheme: IPTC NewsCodes: Subject Code
notation: 06006003
preferred label: Metsät @fi

wetlands
type: Concept
broader: natural resources
definition: Areas generally marshy and not either under water or dry land. Often related to aquifers for water quality and/or wildlife
in scheme: IPTC NewsCodes: Subject Code
notation: 06006004
preferred label: Suot @fi

mountains
type: Concept
broader: natural resources
definition: Elevated land masses formed over the ages either by erosion, volcanic eruption, or movement of massive geographical formations called plates
in scheme: IPTC NewsCodes: Subject Code
notation: 06006005
preferred label: Vuoret @fi

rivers
type: Concept
broader: natural resources
definition: Moving water areas bounded by land that extend from earth sources and meander through land areas to join with other water areas. In smaller forms they are creeks, rivulets, streams etc
in scheme: IPTC NewsCodes: Subject Code
notation: 06006006
preferred label: Joet @fi

oceans
type: Concept
broader: natural resources
definition: Salt water masses separating continents or other major geographical masses. smaller forms are seas or lakes or ponds
in scheme: IPTC NewsCodes: Subject Code
notation: 06006007
preferred label: Valtameret Meret @fi

wildlife
type: Concept
broader: natural resources
definition: All forms of animal life that have not been domesticated
in scheme: IPTC NewsCodes: Subject Code
notation: 06006008
preferred label: Luonnonvaraiset eläimet @fi

energy resources
type: Concept
broader: natural resources
definition: Such resources as coal, gas, wind, sunlight etc., used to generate heat, electricity and power
in scheme: IPTC NewsCodes: Subject Code
notation: 06006009
preferred label: Energiavarat @fi

invasive species
type: Concept
broader: nature
definition: Non-native plants, animals and other organisms that tend to take over native species
definition: Vierasperäiset eläin- ja kasvilajit @fi
in scheme: IPTC NewsCodes: Subject Code
notation: 06007001
preferred label: Tulokaslajit @fi

population
type: Concept
broader: environmental issue
definition: People and their growth and development within a natural setting
in scheme: IPTC NewsCodes: Subject Code
notation: 06008000
preferred label: Väestökysymykset @fi

waste
type: Concept
broader: environmental issue
definition: Environmental impact of waste, including recycling efforts
definition: Sisältää kierrätyksen, uudelleenkäytön. @fi
in scheme: IPTC NewsCodes: Subject Code
notation: 06009000
preferred label: Jätteet @fi

water
type: Concept
broader: environmental issue
definition: Environmental issues about bodies of water, including oceans, lakes, streams and reservoirs, as well as ice, glaciers and forms of precipitation
in scheme: IPTC NewsCodes: Subject Code
notation: 06010000
preferred label: Vesivarat @fi

global warming
type: Concept
broader: environmental issue
definition: All issues relating to global warming including temperature research, remote sensing on temperature trends, debate on global warming, ways to reduce emissions and carbon trading.
in scheme: IPTC NewsCodes: Subject Code
notation: 06011000
preferred label: Ilmaston lämpeneminen @fi

hazardous materials
type: Concept
broader: environmental issue
definition: Materials that are harmful to humans or animals if they are exposed to them. Includes radiation, poison gases, chemicals, heavy metals, PCBs, and certain plant products
in scheme: IPTC NewsCodes: Subject Code
notation: 06012000
preferred label: Vaaralliset aineet @fi

environmental cleanup
type: Concept
broader: environmental issue
definition: Processes whereby contaminated areas are cleaned of hazardous materials so they can be inhabited again by either people or animals.
in scheme: IPTC NewsCodes: Subject Code
notation: 06013000
preferred label: Saastuneiden alueiden puhdistus @fi

communicable diseases
type: Concept
broader: disease
definition: Diseases that can be transmitted from one person or animal to another
definition: Taudit, jotka voivat tarttua henkilöstä tai eläimestä toiseen. @fi
in scheme: IPTC NewsCodes: Subject Code
notation: 07001001
preferred label: Tartuntataudit @fi

virus diseases
type: Concept
broader: disease
definition: Diseases caused by infection within cells by viruses
definition: Virusten aiheuttamat taudit. @fi
in scheme: IPTC NewsCodes: Subject Code
notation: 07001002
preferred label: Virustaudit @fi

AIDS
type: Concept
broader: disease
definition: Acquired Immunity Deficiency Syndrome, an incurable disease caused by the human immunodeficiency virus
definition: Acquired Immunity Deficiency Syndrome, parantumaton HI-viruksen aiheuttama immuunikatosairaus. @fi
in scheme: IPTC NewsCodes: Subject Code
notation: 07001003

cancer
type: Concept
broader: disease
definition: A serious and often fatal disease caused when normal cells mutate into tumours
definition: Vakava ja usein kuolemaan johtava sairaus, missä normaalit solut muuttuvat kasvaimiksi. @fi
in scheme: IPTC NewsCodes: Subject Code
notation: 07001004
preferred label: Syöpä @fi

heart disease
type: Concept
broader: disease
definition: A degenerative and serious disease caused by narrowing of the arteries feeding the heart
definition: Rappeuttava ja vakava tauti, jonka aiheuttaa sydänvaltimon kalkkeutuminen. @fi
in scheme: IPTC NewsCodes: Subject Code
notation: 07001005
preferred label: Sydäntaudit @fi

alzheimer's disease
type: Concept
broad match: http://cv.iptc.org/newscodes/mediatopic/20000446
broader: disease
definition: A disorder of the brain leading to dementia
definition: Aivojen toimintahäiriö, joka johtaa dementiaan. @fi
in scheme: IPTC NewsCodes: Subject Code
notation: 07001006
preferred label: Alzheimerin tauti @fi

animal diseases
type: Concept
broader: disease
definition: Disorders affecting animals that do not necessarily endanger humans
definition: Eläinten sairaudet, jotka eivät välttämättä vaaranna ihmisiä. @fi
in scheme: IPTC NewsCodes: Subject Code
notation: 07001007
preferred label: Eläintaudit @fi

plant diseases
type: Concept
broader: disease
definition: Disorders affecting plants caused either by parasites or environmental factors
definition: Loisten tai ympäristötekijöiden aiheuttamat kasvisairaudet. @fi
in scheme: IPTC NewsCodes: Subject Code
notation: 07001008
preferred label: Kasvitaudit @fi

retrovirus
type: Concept
broader: disease
definition: A family of RNA viruses such as those causing leukaemia and AIDS
definition: RNA-virusten joukko, jotka aiheuttavat esimerkiksi leukemiaa ja AIDS:ia. @fi
in scheme: IPTC NewsCodes: Subject Code
notation: 07001009
preferred label: Retrovirukset @fi

epidemic and plague
type: Concept
broader: health
definition: An epidemic is a rapidly spreading condition in a community and a plague is usually a deadly disease of epidemic proportions
in scheme: IPTC NewsCodes: Subject Code
notation: 07002000
preferred label: Epidemiat @fi

prescription drugs
type: Concept
broader: health treatment
definition: Drugs that can be purchased only with a doctor's authorization
definition: Lääkkeet, joita voidaan hankkia vain lääkärin antamalla lääkemääräyksellä. @fi
in scheme: IPTC NewsCodes: Subject Code
notation: 07003001
preferred label: Reseptilääkkeet @fi

dietary supplements
type: Concept
broader: health treatment
definition: Nutrients taken in addition to food to bolster health
definition: Ravintoaineet, joita otetaan ruoan lisäksi terveyden vahvistamiseksi. @fi
in scheme: IPTC NewsCodes: Subject Code
notation: 07003002
preferred label: Ravintoainevalmisteet @fi

diet
type: Concept
broader: health treatment
definition: Controlled food consumption
definition: Kontrolloitu ruoan nauttiminen. @fi
in scheme: IPTC NewsCodes: Subject Code
notation: 07003003
preferred label: Ruokavaliot @fi

medical procedure/test
type: Concept
broader: health treatment
definition: Any of a variety of treatments such as stress tests, catheterization, blood tests, computerised axial tomography scan or magnetic resonance imaging
definition: Mitkä tahansa lääketieteelliset toimenpiteet, esimerkiksi rasituskokeet, verikokeet, kerroskuvaukset tai magneettikuvaukset. @fi
in scheme: IPTC NewsCodes: Subject Code
notation: 07003004
preferred label: Lääketieteelliset toimenpiteet ja kokeet @fi

therapy
type: Concept
broader: health treatment
definition: Treatment of physical, mental or medical conditions by non-surgical means
definition: Hoitomenetelmät, joissa ei käytetä leikkausta. @fi
in scheme: IPTC NewsCodes: Subject Code
notation: 07003005
preferred label: Hoitomenetelmät @fi

health organisations
type: Concept
broader: health
definition: Includes stories about specific health organizations, including professional associations, non-profits and international groups
in scheme: IPTC NewsCodes: Subject Code
notation: 07004000
preferred label: Terveysjärjestöt @fi

medical research
type: Concept
broader: health
definition: Investigation into the causes and cures of diseases
in scheme: IPTC NewsCodes: Subject Code
notation: 07005000
preferred label: Lääketieteellinen tutkimus @fi

primary care physician
type: Concept
broad match: http://cv.iptc.org/newscodes/mediatopic/20000485
broader: medical staff
definition: Patient's basic health care doctor - first point of call for all health related problems
in scheme: IPTC NewsCodes: Subject Code
notation: 07006001
preferred label: Omalääkärijärjestelmä @fi

health-workers union
type: Concept
broad match: http://cv.iptc.org/newscodes/mediatopic/20000536
broader: medical staff
definition: Issues involving industry groups for doctors, nurses, health workers etc.
in scheme: IPTC NewsCodes: Subject Code
notation: 07006002
preferred label: Terveydenhuoltohenkilökunnan ammattiliitot @fi

herbal
type: Concept
broader: medicine
definition: Treatment based on the use of herbs and other plants to cure or alleviate disease symptoms
in scheme: IPTC NewsCodes: Subject Code
notation: 07007001
preferred label: Luonnonlääkkeet @fi

holistic
type: Concept
broader: medicine
definition: Treatment of the whole person including mental and social factors rather than just the symptoms of the disease.
in scheme: IPTC NewsCodes: Subject Code
notation: 07007002
preferred label: Kokonaisvaltainen lääketiede @fi

western
type: Concept
broader: medicine
definition: The practice of diagnosis, treatment and prevention of disease based on modern scientific research in the western hemisphere.
in scheme: IPTC NewsCodes: Subject Code
notation: 07007003
preferred label: Länsimainen lääketiede @fi

traditional Chinese
type: Concept
broader: medicine
definition: The practice of diagnosis, treatment and prevention of disease based on traditional methods developed in the orient.
in scheme: IPTC NewsCodes: Subject Code
notation: 07007004
preferred label: Kiinalainen lääketiede @fi

vaccines
type: Concept
broader: preventative medicine
definition: Medications designed to create immunity to diseases
definition: Lääkitys, jonka avulla saavutetaan immuniteetti erilaisiin sairauksiin. @fi
in scheme: IPTC NewsCodes: Subject Code
notation: 07008001
preferred label: Rokotukset @fi

injury
type: Concept
broader: health
definition: A traumatic condition of the human body caused usually by outside forces
in scheme: IPTC NewsCodes: Subject Code
notation: 07009000
preferred label: Vammat @fi

hospital and clinic
type: Concept
broader: health
definition: Medical facilities for the treatment of illnesses and injury
in scheme: IPTC NewsCodes: Subject Code
notation: 07010000
preferred label: Sairaalat Terveyskeskukset @fi

medicare
type: Concept
broad match: http://cv.iptc.org/newscodes/mediatopic/20000480
broader: government health care
definition: A program of the U.S. government to provide health care to senior citizens
definition: Yhdysvaltojen hallituksen vanhuksia koskeva terveysohjelma. @fi
in scheme: IPTC NewsCodes: Subject Code
notation: 07011001
preferred label: Medicare @fi

medicaid
type: Concept
broad match: http://cv.iptc.org/newscodes/mediatopic/20000480
broader: government health care
definition: A program of the U.S. government to provide health care to needy citizens of all ages
definition: Yhdysvaltojen hallituksen koko kansaa koskeva terveysohjelma. @fi
in scheme: IPTC NewsCodes: Subject Code
notation: 07011002
preferred label: Medicaid @fi

private health care
type: Concept
broader: health
definition: Health care provided by privately funded or insured organizations
in scheme: IPTC NewsCodes: Subject Code
notation: 07012000
preferred label: Yksityinen terveydenhuolto @fi

food safety
type: Concept
broader: healthcare policy
definition: Issues relating to food cleanliness and contamination
definition: Ruoan puhtauteen liittyvät asiat @fi
in scheme: IPTC NewsCodes: Subject Code
notation: 07013001
preferred label: Elintarvikehygienia @fi

geriatric
type: Concept
broader: medical specialisation
definition: Research into aging and age-related issues including age-related illnesses, medical research, trends, geriatric medicine and related topics like age discrimination and health insurance for an ageing population.
in scheme: IPTC NewsCodes: Subject Code
notation: 07014001
preferred label: Geriatria @fi

pediatrics
type: Concept
broader: medical specialisation
definition: Research and medicine specifically for the young - includes premature babies, infant care, childhood disease and treatment - also teen-related health and behaviour problems.
in scheme: IPTC NewsCodes: Subject Code
notation: 07014002
preferred label: Lastentaudit @fi

reproduction
type: Concept
broader: medical specialisation
definition: Reproductive technologies like invitro fertilization and cloning as well as related debates. Sexual development matters and sexually transmitted diseases would also fall under this category.
in scheme: IPTC NewsCodes: Subject Code
notation: 07014003
preferred label: Lisääntyminen @fi

genetics
type: Concept
broader: medical specialisation
definition: The science and research into genetic-base disease and cures for disease. This would include proteomics (the study of what proteins are produced by which genes and what those proteins do), general genetics and stem-cell research.
in scheme: IPTC NewsCodes: Subject Code
notation: 07014004
preferred label: Perinnöllisyystiede @fi

obstetrics/gynecology
type: Concept
broader: medical specialisation
definition: Specialty of female reproductive organs
in scheme: IPTC NewsCodes: Subject Code
notation: 07014005
preferred label: Gynekologia @fi

medical service
type: Concept
broader: health
definition: Medical support for doctors, including blood tests and other medical tests on individuals, X-rays CAT scans MRIs etc.
definition: Laboratoriokokeet, röntgentutkimukset ym. @fi
in scheme: IPTC NewsCodes: Subject Code
notation: 07015000
preferred label: Lääketieteelliset tutkimuspalvelut @fi

physical fitness
type: Concept
broader: health
definition: The condition of a person's cardio-vascular and muscular health.
definition: Henkilön verenkiertoelinten ja lihasten terveydentila @fi
in scheme: IPTC NewsCodes: Subject Code
notation: 07016000
preferred label: Fyysinen kunto @fi

mental illness
type: Concept
broader: illness
definition: Those illnesses affecting the mind
definition: Psyykkeeseen vaikuttavat sairaudet @fi
in scheme: IPTC NewsCodes: Subject Code
notation: 07017001
preferred label: Mielenterveyshäiriöt @fi

eating disorder
type: Concept
broader: illness
definition: Anorexia, bulimia, overeating and similar illnesses
definition: Anoreksia, bulimia, ylensyöminen ja muut vastaavat sairaudet @fi
in scheme: IPTC NewsCodes: Subject Code
notation: 07017002
preferred label: Syömishäiriöt @fi

obesity
type: Concept
broader: illness
definition: A condition of body weight generally considered 20 percent above the norm for gender, age, height and bone structure
definition: Tila, jossa henkilön paino ylittää normin 20 prosentilla ottaen huomioon sukupolen, iän, pituuden ja rakenteen @fi
in scheme: IPTC NewsCodes: Subject Code
notation: 07017003
preferred label: Ylipaino @fi

medical conditions
type: Concept
broader: health
definition: Various stages of disease, illness or injury
definition: Sairauksien, tautien ja vammojen eri asteita @fi
in scheme: IPTC NewsCodes: Subject Code
notation: 07018000
preferred label: Terveydentila @fi

patient
type: Concept
broad match: http://cv.iptc.org/newscodes/mediatopic/07000000
broader: health
definition: Issues which affect population in general as attendees at hospitals or doctors' surgeries.
in scheme: IPTC NewsCodes: Subject Code
notation: 07019000
preferred label: Potilaat @fi

animal
type: Concept
broader: human interest
definition: Animals of all types
definition: Eläimiä koskevat jutut. Huom. luonnonvaraiset eläimet Ympäristö-luokassa @fi
in scheme: IPTC NewsCodes: Subject Code
notation: 08001000
preferred label: Eläimet @fi

curiosity
type: Concept
broad match: http://cv.iptc.org/newscodes/mediatopic/08000000
broader: human interest
definition: Content of an unusual nature that can raise questions or amuse
definition: Asiat ja tapahtumat, jotka kiinnostavat erikoisuudellaan tai herättävät uteliaisuutta @fi
in scheme: IPTC NewsCodes: Subject Code
notation: 08002000
preferred label: Erikoisuudet @fi

advice
type: Concept
broad match: http://cv.iptc.org/newscodes/mediatopic/08000000
broader: people
definition: Letters and answers about personal problems that are publishable
definition: Esim. lääkäri- tai puutarhapalstat @fi
in scheme: IPTC NewsCodes: Subject Code
notation: 08003001
preferred label: Asiantuntijoiden neuvot @fi

celebrity
type: Concept
broader: people
definition: Celebrity news, i.e. Madonna has a baby, Elton John sues his accountants etc.
definition: Julkisuuden henkilöitä koskevat uutiset, ns. julkkikset @fi
in scheme: IPTC NewsCodes: Subject Code
notation: 08003002
preferred label: Julkisuuden henkilöt @fi

accomplishment
type: Concept
broader: people
definition: Achievements by individuals or groups, such as charitable fundraising, winning a competitive contest etc
definition: Yksilöiden tai ryhmien saamat julkiset tunnustukset hyväntekeväisyystyöstä, kilpailujen voittamiset jne. @fi
in scheme: IPTC NewsCodes: Subject Code
notation: 08003003
preferred label: Saavutukset @fi

human mishap
type: Concept
broader: people
definition: Stories arising from silly/stupid human errors e.g. like forgetting to tie one end of a bungee cord
definition: Hassut inhimilliset erehdykset tai kömmähdykset @fi
in scheme: IPTC NewsCodes: Subject Code
notation: 08003004
preferred label: Epäonnistumiset @fi

fortune-telling
type: Concept
broad match: http://cv.iptc.org/newscodes/mediatopic/08000000
broader: people
definition: The forecasting of future events or the delineation of character by methods not ordinarily considered to have a rational basis
in scheme: IPTC NewsCodes: Subject Code
notation: 08003005
preferred label: Ennustaminen @fi

mystery
type: Concept
broad match: http://cv.iptc.org/newscodes/mediatopic/08000000
broader: human interest
definition: Something unexplained or unknown
definition: Selittämättömät ja arvoitukselliset ilmiöt ja niitä koskevat uutiset @fi
in scheme: IPTC NewsCodes: Subject Code
notation: 08004000
preferred label: Selittämättömät ilmiöt @fi

ceremony
type: Concept
broader: society
definition: Rituals of a non-religious nature such as dedications, wreath layings, ship launchings etc
definition: Esim. seppeleenlasku-, laivojen vesillelasku- ja vihkimistilaisuudet @fi
in scheme: IPTC NewsCodes: Subject Code
notation: 08005001
preferred label: Juhlatilaisuudet @fi

death
type: Concept
broad match: http://cv.iptc.org/newscodes/mediatopic/08000000
broader: society
definition: The human interest aspects of the demise of a person
in scheme: IPTC NewsCodes: Subject Code
notation: 08005002
preferred label: Kuolema @fi

funeral
type: Concept
broad match: http://cv.iptc.org/newscodes/mediatopic/08000000
broader: society
definition: The ceremony to intern the remains of a person
in scheme: IPTC NewsCodes: Subject Code
notation: 08005003
preferred label: Hautajaiset @fi

estate bestowal
type: Concept
broad match: http://cv.iptc.org/newscodes/mediatopic/08000000
broader: society
definition: The distribution of the estate of a person according to their will and any disagreements between the heirs
in scheme: IPTC NewsCodes: Subject Code
notation: 08005004
preferred label: Perinnönjako @fi

memorial
type: Concept
broad match: http://cv.iptc.org/newscodes/mediatopic/08000000
broader: society
definition: Commemorative ceremony or object - plaque, statue etc - in remembrance of a person.
in scheme: IPTC NewsCodes: Subject Code
notation: 08005005
preferred label: Muistomerkit Muistotilaisuudet @fi

record
type: Concept
broader: award and prize
definition: Non-sport achievement by an individual or group that sets a new record, such as most books read, holding your breath longest
definition: Guinnesin ennätyskirjatyyppiset ennätykset @fi
in scheme: IPTC NewsCodes: Subject Code
notation: 08006001
preferred label: Ennätykset @fi

imperial and royal matters
type: Concept
broader: human interest
definition: Imperial and royal family members, including matters on legal systems.
definition: Kuninkaallisia, heidän perheitään ja muuta yläluokkaa koskevat jutut @fi
in scheme: IPTC NewsCodes: Subject Code
notation: 08007000
preferred label: Kuninkaalliset @fi

plant
type: Concept
broader: human interest
definition: An organism of the kind exemplified by trees, shrubs, grasses, ferns, and mosses, typically growing in a permanent site
in scheme: IPTC NewsCodes: Subject Code
notation: 08008000
preferred label: Kasvit @fi

apprentices
type: Concept
broader: labour
definition: People who are in the work force at a learning level, serving under a master
in scheme: IPTC NewsCodes: Subject Code
notation: 09001000
preferred label: Harjoittelu Oppisopimukset @fi

contract issue-wages
type: Concept
broader: collective contract
definition: Element of contracts and contract discussions centring on remuneration
in scheme: IPTC NewsCodes: Subject Code
notation: 09002001
preferred label: Palkkaus @fi

contract issue-healthcare
type: Concept
broader: collective contract
definition: Element of contracts and contract discussions centring on health care issues
in scheme: IPTC NewsCodes: Subject Code
notation: 09002002
preferred label: Työterveyshuolto @fi

contract issue-work rules
type: Concept
broader: collective contract
definition: Element of contracts and contract discussions centring on rules affecting issues such as lunch and other breaks, work shifts, vacation scheduling, seniority, sick leave etc.
in scheme: IPTC NewsCodes: Subject Code
notation: 09002003
preferred label: Työaikamääräykset @fi

labor market
type: Concept
broader: employment
definition: A pool of people who are working or are seeking work
in scheme: IPTC NewsCodes: Subject Code
notation: 09003001
preferred label: Työmarkkinat @fi

job layoffs
type: Concept
broader: employment
definition: The reduction of a company's work force through dismissal because of changing economic factors
in scheme: IPTC NewsCodes: Subject Code
notation: 09003002
preferred label: Lomautukset @fi

child labor
type: Concept
broader: employment
definition: Employment of children, usually under the age of 18
in scheme: IPTC NewsCodes: Subject Code
notation: 09003003
preferred label: Lapsityövoima @fi

occupations
type: Concept
broader: employment
definition: Generally one's trade, profession or business although professions are usually such things as lawyers and doctors, and occupations are such as clerks or truckers
in scheme: IPTC NewsCodes: Subject Code
notation: 09003004
preferred label: Ammatit @fi

labour dispute
type: Concept
broader: labour
definition: Differences of opinion about work conditions, pay, etc
definition: Muut paitsi lakot @fi
in scheme: IPTC NewsCodes: Subject Code
notation: 09004000
preferred label: Työmarkkinakonfliktit @fi

labour legislation
type: Concept
broader: labour
definition: Laws governing work and labour
in scheme: IPTC NewsCodes: Subject Code
notation: 09005000
preferred label: Työlainsäädäntö @fi

retirement
type: Concept
broader: labour
definition: The years after work
in scheme: IPTC NewsCodes: Subject Code
notation: 09006000
preferred label: Eläkkeelle siirtyminen @fi

retraining
type: Concept
broader: labour
definition: Providing a worker training in new skills when his old skills are no longer applicable
in scheme: IPTC NewsCodes: Subject Code
notation: 09007000
preferred label: Uudelleenkoulutus @fi

strike
type: Concept
broader: labour
definition: A job action involving cessation of work
in scheme: IPTC NewsCodes: Subject Code
notation: 09008000
preferred label: Lakot @fi

unemployment
type: Concept
broader: labour
definition: Lack of paid work
in scheme: IPTC NewsCodes: Subject Code
notation: 09009000
preferred label: Työttömyys @fi

unions
type: Concept
broader: labour
definition: Groups established to represent bodies of workers
in scheme: IPTC NewsCodes: Subject Code
notation: 09010000
preferred label: Työmarkkinajärjestöt @fi

employee benefits
type: Concept
broader: wage and pension
definition: Either benefits provided to an employee by a company, such as pensions, health insurance; or monetary compensation paid by a government to the jobless usually called unemployment benefits
in scheme: IPTC NewsCodes: Subject Code
notation: 09011001
preferred label: Henkilökuntaedut @fi

social security
type: Concept
broader: wage and pension
definition: FICA. Money paid by individual and companies into a government account to be paid out when that individual reaches a certain age
in scheme: IPTC NewsCodes: Subject Code
notation: 09011002
preferred label: Sosiaaliturvamaksut @fi

work relations
type: Concept
broader: labour
definition: The give and take between management and labour
definition: Työpaikkakiusaaminen, työssä viihtyminen, jne. @fi
in scheme: IPTC NewsCodes: Subject Code
notation: 09012000
preferred label: Työyhteisö @fi

health and safety at work
type: Concept
broader: labour
definition: Rules and procedures for guaranteeing the health of workers
definition: Ergonomia, työsuojelu, työssä jaksaminen, jne. @fi
in scheme: IPTC NewsCodes: Subject Code
notation: 09013000
preferred label: Työterveys Työturvallisuus @fi

advanced training
type: Concept
broader: labour
definition: Additional training to enhance current skills
definition: Täydennyskoulutus tarkoittaa ammattitaitoa kehittävää ja ylläpitävää koulutusta. @fi
in scheme: IPTC NewsCodes: Subject Code
notation: 09014000
preferred label: Täydennyskoulutus @fi

employer
type: Concept
broader: labour
definition: The person who employs workers and pays the salaries and other benefits to workers
in scheme: IPTC NewsCodes: Subject Code
notation: 09015000
preferred label: Työnantajat @fi

employee
type: Concept
broader: labour
definition: A person who trades his time and talent for money and other benefits
in scheme: IPTC NewsCodes: Subject Code
notation: 09016000
preferred label: Työntekijät @fi

Go
type: Concept
broad match: http://cv.iptc.org/newscodes/mediatopic/20000547
broader: game
definition: A strategic, deterministic Chinese board game played by alternately placing stones on a grid
in scheme: IPTC NewsCodes: Subject Code
notation: 10001001

chess
type: Concept
broad match: http://cv.iptc.org/newscodes/mediatopic/20000541
broader: game
definition: A game played on a chequered board with 16 pieces to each side with specific ranges of movement depending on their identity
in scheme: IPTC NewsCodes: Subject Code
notation: 10001002
preferred label: Shakki @fi

bridge
type: Concept
broad match: http://cv.iptc.org/newscodes/mediatopic/20000542
broader: game
definition: A card game of four players who bet on the hands of each other, developed from Russian whist
in scheme: IPTC NewsCodes: Subject Code
notation: 10001003
preferred label: Bridge @fi

shogi
type: Concept
broad match: http://cv.iptc.org/newscodes/mediatopic/20000541
broader: game
definition: A strategic board games which is native to Japan and is often called Japanese chess
definition: Japanilainen, shakkia muistuttava lautapeli @fi
in scheme: IPTC NewsCodes: Subject Code
notation: 10001004
preferred label: Shogi @fi

gaming and lottery
type: Concept
broader: lifestyle and leisure
definition: Gambling, often involving selection of sets of numbers one expects to come up
definition: Bingo, lotto, veikkaus, toto ja muut rahapelit @fi
in scheme: IPTC NewsCodes: Subject Code
notation: 10002000
preferred label: Rahapelit @fi

organic foods
type: Concept
broader: gastronomy
definition: Food which is grown using no artificial fertilizers or chemical compounds
definition: Ruoka, joka on tuotettu ja valmistettu ilman keinolannotteita ja lisäaineita @fi
in scheme: IPTC NewsCodes: Subject Code
notation: 10003001
preferred label: Luomuruoka @fi

DIY
type: Concept
broad match: http://cv.iptc.org/newscodes/mediatopic/20000570
broader: hobby
definition: DIY - do it yourself. Normally the construction, repair or maintenance of residential property by an amateur
in scheme: IPTC NewsCodes: Subject Code
notation: 10004001
preferred label: Kädentaidot @fi

shopping
type: Concept
broad match: http://cv.iptc.org/newscodes/mediatopic/10000000
broader: hobby
definition: Consumer purchasing and related trends, but not the business aspects of retailing
in scheme: IPTC NewsCodes: Subject Code
notation: 10004002
preferred label: Shoppailu @fi

gardening
type: Concept
broad match: http://cv.iptc.org/newscodes/mediatopic/20000550
broader: hobby
definition: The non-commercial aspects of landscaping, growing plants, trees and other vegetation that gives pleasure to the gardener and others
in scheme: IPTC NewsCodes: Subject Code
notation: 10004003
preferred label: Puutarhanhoito @fi

holiday or vacation
type: Concept
broader: lifestyle and leisure
definition: Leisure travel to a single location and/or country over a short period of time
in scheme: IPTC NewsCodes: Subject Code
notation: 10005000
preferred label: Lomat @fi

tourism
type: Concept
broader: lifestyle and leisure
definition: Leisure travel involving visits to a number of locations and/or countries over an extended period of time, often as part of an organized group
in scheme: IPTC NewsCodes: Subject Code
notation: 10006000
preferred label: Lomamatkailu @fi

traffic
type: Concept
broader: travel and commuting
definition: Traffic reports and/or warnings
definition: Liikenneraportit ja -varoitukset @fi
in scheme: IPTC NewsCodes: Subject Code
notation: 10007001
preferred label: Liikennetiedotus @fi

club and association
type: Concept
broader: lifestyle and leisure
definition: Organizations joined by individuals because of similar interests
in scheme: IPTC NewsCodes: Subject Code
notation: 10008000
preferred label: Yhdistystoiminta @fi

lifestyle (house and home)
type: Concept
broader: lifestyle and leisure
definition: Unique culture of ones own home
definition: Kotiin, asumiseen, yksityiselämään liittyvät asiat @fi
in scheme: IPTC NewsCodes: Subject Code
notation: 10009000
preferred label: Elämäntyyli @fi

leisure (general)
type: Concept
broader: lifestyle and leisure
definition: Activities carried out in ones' spare time
in scheme: IPTC NewsCodes: Subject Code
notation: 10010000
preferred label: Vapaa-aika yleistä @fi

public holiday
type: Concept
broader: lifestyle and leisure
definition: A day or days set off for celebration
definition: Yleiset vapaapäivät, sekä kirkolliset että maalliset ja niiden vietto @fi
in scheme: IPTC NewsCodes: Subject Code
notation: 10011000
preferred label: Yleiset vapaapäivät @fi

hunting
type: Concept
broader: lifestyle and leisure
definition: An activity involving the use of weapons or traps for the capturing of animals
in scheme: IPTC NewsCodes: Subject Code
notation: 10012000
preferred label: Metsästys @fi

fishing
type: Concept
broader: lifestyle and leisure
definition: An activity involving the use of baits, lures, weapons and traps for the capture of aquatic species
in scheme: IPTC NewsCodes: Subject Code
notation: 10013000
preferred label: Kalastus @fi

auto trends
type: Concept
broader: lifestyle and leisure
definition: The evolution of the automobile
definition: Autojen historia ja kehitys @fi
in scheme: IPTC NewsCodes: Subject Code
notation: 10014000
preferred label: Autoharrastus @fi

adventure
type: Concept
broad match: http://cv.iptc.org/newscodes/mediatopic/10000000
broader: lifestyle and leisure
definition: Expeditions, daring feats, exploration, record-breaking, risk-associated events
in scheme: IPTC NewsCodes: Subject Code
notation: 10015000
preferred label: Extreme-lajit @fi

beauty
type: Concept
broader: lifestyle and leisure
definition: Issues relating to improving one's appearance and attractiveness, including reviews of beauty products
in scheme: IPTC NewsCodes: Subject Code
notation: 10016000
preferred label: Kauneudenhoito @fi

consumer issue
type: Concept
broader: lifestyle and leisure
definition: Shopping, products for the home, relevant surveys, product recalls
in scheme: IPTC NewsCodes: Subject Code
notation: 10017000
preferred label: Ostokäyttäytyminen @fi

wedding
type: Concept
broader: lifestyle and leisure
definition: The marriage ceremony and the events that surround it - showers, rehearsal, parties, honeymoon, etc.
in scheme: IPTC NewsCodes: Subject Code
notation: 10018000
preferred label: Häät @fi

veterans affairs
type: Concept
broader: defence
definition: Care and provision for those who served in the military
in scheme: IPTC NewsCodes: Subject Code
notation: 11001001
preferred label: Veteraanit @fi

national security
type: Concept
broader: defence
definition: The philosophy of securing a nation and its borders, as well as the well being of its citizens
in scheme: IPTC NewsCodes: Subject Code
notation: 11001002
preferred label: Kansallinen turvallisuus @fi

security measures
type: Concept
broader: defence
definition: Means of making a nation, a state, a building or a person secure from harm and outside interference.
in scheme: IPTC NewsCodes: Subject Code
notation: 11001003
preferred label: Turvatoimet @fi

armed Forces
type: Concept
broader: defence
definition: Those employed by a government to conduct war, or to enforce the security of a nation
in scheme: IPTC NewsCodes: Subject Code
notation: 11001004
preferred label: Puolustusvoimat @fi

military equipment
type: Concept
broader: defence
definition: Equipment issued to members of the armed forces
in scheme: IPTC NewsCodes: Subject Code
notation: 11001005
preferred label: Sotakalusto @fi

firearms
type: Concept
broad match: http://cv.iptc.org/newscodes/mediatopic/20000602
broader: defence
definition: Anything that uses an explosive in a directed manner to propel an object that can maim or kill
in scheme: IPTC NewsCodes: Subject Code
notation: 11001006
preferred label: Ampuma-aseet @fi

biological and chemical weapons
type: Concept
broad match: http://cv.iptc.org/newscodes/mediatopic/20000602
broader: defence
definition: Devices using biological agents, or chemical mixtures to disable, maim or kill an opponent
in scheme: IPTC NewsCodes: Subject Code
notation: 11001007
preferred label: Biologiset ja kemialliset aseet @fi

missile systems
type: Concept
broad match: http://cv.iptc.org/newscodes/mediatopic/20000602
broader: defence
definition: Anything that propels an inert, explosive, biological or chemical object through the air with the aim of disabling, maiming or killing an opponent.
in scheme: IPTC NewsCodes: Subject Code
notation: 11001008
preferred label: Ohjusjärjestelmät @fi

nuclear weapons
type: Concept
broad match: http://cv.iptc.org/newscodes/mediatopic/20000602
broader: defence
definition: Weapons that use controlled radioactivity from the decay of certain elements to disable, maim or kill an opponent
in scheme: IPTC NewsCodes: Subject Code
notation: 11001009
preferred label: Ydinaseet @fi

summit
type: Concept
broader: diplomacy
definition: Includes meetings of leaders, foreign and finance ministers from the Group of Eight major nations and Group of Seven industrialized nations.
in scheme: IPTC NewsCodes: Subject Code
notation: 11002001
preferred label: Kansainväliset kokoukset @fi

international relations
type: Concept
broader: diplomacy
definition: Non-violent relations between nations through negotiation, treaty, or personal meetings
in scheme: IPTC NewsCodes: Subject Code
notation: 11002002
preferred label: Kansainväliset suhteet @fi

peace negotiations
type: Concept
broader: diplomacy
definition: Negotiations intended to bring an end to a conflict
in scheme: IPTC NewsCodes: Subject Code
notation: 11002003
preferred label: Rauhanneuvottelut @fi

alliances
type: Concept
broad match: http://cv.iptc.org/newscodes/mediatopic/20000639
broader: diplomacy
definition: Coalitions of like-minded groups formed to present a stronger force against any challenges
in scheme: IPTC NewsCodes: Subject Code
notation: 11002004
preferred label: Liittoutumat @fi

political candidates
type: Concept
broader: election
definition: Individuals who are chosen to stand for office
in scheme: IPTC NewsCodes: Subject Code
notation: 11003001
preferred label: Vaaliehdokkaat @fi

political campaigns
type: Concept
broader: election
definition: Campaigns for public office
in scheme: IPTC NewsCodes: Subject Code
notation: 11003002
preferred label: Vaalikampanjat @fi

campaign finance
type: Concept
broader: election
definition: The money that makes campaigns for public office possible
in scheme: IPTC NewsCodes: Subject Code
notation: 11003003
preferred label: Vaalirahoitus @fi

national elections
type: Concept
broader: election
definition: Choosing individuals for government at a national level
in scheme: IPTC NewsCodes: Subject Code
notation: 11003004
preferred label: Kansalliset vaalit @fi

regional elections
type: Concept
broader: election
definition: Choosing individuals for government at a regional level
in scheme: IPTC NewsCodes: Subject Code
notation: 11003005
preferred label: Maakuntavaalit @fi

local elections
type: Concept
broader: election
definition: Choosing individuals for government at the basic level, whether city, village or county
in scheme: IPTC NewsCodes: Subject Code
notation: 11003006
preferred label: Kunnallisvaalit @fi

voting
type: Concept
broader: election
definition: The act of selecting an individual you would like to represent your interests in government
in scheme: IPTC NewsCodes: Subject Code
notation: 11003007
preferred label: Äänestäminen @fi

poll
type: Concept
broad match: http://cv.iptc.org/newscodes/mediatopic/20000574
broader: election
definition: Periodic measurement of a political candidate's standing with the public
in scheme: IPTC NewsCodes: Subject Code
notation: 11003008
preferred label: Kannatusmittaukset @fi

european elections
type: Concept
broader: election
definition: Choosing individuals for a body which is at a higher level than national government, e.g. European parliament
in scheme: IPTC NewsCodes: Subject Code
notation: 11003009
preferred label: EU-vaalit @fi

primary
type: Concept
broader: election
definition: Preliminary elections on a local or regional basis leading up to a regional or national election
in scheme: IPTC NewsCodes: Subject Code
notation: 11003010
preferred label: Esivaalit @fi

espionage and intelligence
type: Concept
broader: politics
definition: Covert collection of information
in scheme: IPTC NewsCodes: Subject Code
notation: 11004000
preferred label: Vakoilu Tiedustelu @fi

economic sanction
type: Concept
broader: foreign aid
definition: Punitive actions taken by one country against another including trade restrictions, embargoes etc.
in scheme: IPTC NewsCodes: Subject Code
notation: 11005001
preferred label: Talouspakotteet @fi

civil and public service
type: Concept
broader: government
definition: The paid service by civilians for the government, and the often non-paid service of individuals for the benefit of others (public service)
in scheme: IPTC NewsCodes: Subject Code
notation: 11006001
preferred label: Julkiset palvelut @fi

safety of citizens
type: Concept
broader: government
definition: Government policies to protect the well being of its citizens
in scheme: IPTC NewsCodes: Subject Code
notation: 11006002
preferred label: Kansalaisten turvallisuus @fi

think tank
type: Concept
broad match: http://cv.iptc.org/newscodes/mediatopic/20000593
broader: government
definition: Group that undertakes political research and issue position papers, recommendations etc
definition: Yhteiskunnallista päätöksentekoa valmisteleva tai suunnitteleva työryhmä. @fi
in scheme: IPTC NewsCodes: Subject Code
notation: 11006003
preferred label: Työryhmät @fi

national government
type: Concept
broader: government
definition: The ruling body of a nation
in scheme: IPTC NewsCodes: Subject Code
notation: 11006004
preferred label: Hallitus @fi

executive (government)
type: Concept
broader: government
definition: That portion of a ruling body involving the overall operation of government
in scheme: IPTC NewsCodes: Subject Code
notation: 11006005
preferred label: Virkamiehet @fi

heads of state
type: Concept
broader: government
definition: Symbolic or actual chief representative of a nation, such as royalty, or president or emir, for example
in scheme: IPTC NewsCodes: Subject Code
notation: 11006006
preferred label: Valtionpäämiehet @fi

government departments
type: Concept
broader: government
definition: Divisions of a government that concentrate on specific areas such as health, welfare, economy or war
in scheme: IPTC NewsCodes: Subject Code
notation: 11006007
preferred label: Ministeriöt @fi

public officials
type: Concept
broader: government
definition: Individuals, usually elected, who are in public service or commonly in the public eye.
in scheme: IPTC NewsCodes: Subject Code
notation: 11006008
preferred label: Luottamusmiehet @fi

ministers (government)
type: Concept
broader: government
definition: Heads of various government departments at one level, also known as secretaries. At another level they form a legislative body. The chief minister is either prime minister or premier.
in scheme: IPTC NewsCodes: Subject Code
notation: 11006009
preferred label: Ministerit @fi

public employees
type: Concept
broader: government
definition: People employed by a government at all levels
in scheme: IPTC NewsCodes: Subject Code
notation: 11006010
preferred label: Viranhaltijat @fi

privatisation
type: Concept
broader: government
definition: The privatisation of state-owned companies or property
definition: (myös 04016034) @fi
in scheme: IPTC NewsCodes: Subject Code
notation: 11006011
preferred label: Yksityistäminen @fi

nationalisation
type: Concept
broader: government
definition: State takeover of private companies or property
in scheme: IPTC NewsCodes: Subject Code
notation: 11006012
preferred label: Kansallistaminen @fi

impeachment
type: Concept
broader: government
definition: The process of bringing a public official before a tribunal to answer charges of wrongdoing
in scheme: IPTC NewsCodes: Subject Code
notation: 11006013
preferred label: Virkasyyte @fi

human rights
type: Concept
broader: politics
definition: Rights entitled to be enjoyed by all citizens universally
in scheme: IPTC NewsCodes: Subject Code
notation: 11007000
preferred label: Ihmisoikeudet @fi

local authority
type: Concept
broader: politics
definition: Authorities at city, county state or borough level
in scheme: IPTC NewsCodes: Subject Code
notation: 11008000
preferred label: Paikallishallinto @fi

upper house
type: Concept
broader: parliament
definition: Senior chamber of a legislative body
in scheme: IPTC NewsCodes: Subject Code
notation: 11009001
preferred label: Ylähuone @fi

lower house
type: Concept
broader: parliament
definition: The lower chamber of a legislative body
in scheme: IPTC NewsCodes: Subject Code
notation: 11009002
preferred label: Alahuone @fi

non government organizations (NGO)
type: Concept
broader: parties and movements
definition: Groups officially outside of government that lobby, demonstrate or campaign on a wide range of issues such as economics, environment healthcare etc.
in scheme: IPTC NewsCodes: Subject Code
notation: 11010001
preferred label: Etujärjestöt @fi

refugee
type: Concept
broader: politics
definition: A person seeking shelter in another country because of some fear of persecution in his own country
in scheme: IPTC NewsCodes: Subject Code
notation: 11011000
preferred label: Pakolaiset @fi

regional authority
type: Concept
broader: politics
definition: Government bodies at levels encompassing more than one jurisdiction, e.g. the Delaware River Basin Commission
in scheme: IPTC NewsCodes: Subject Code
notation: 11012000
preferred label: Aluehallinto @fi

public finance
type: Concept
broader: state budget and tax
definition: The money of government used for paying for public programs and services and public debt
in scheme: IPTC NewsCodes: Subject Code
notation: 11013001
preferred label: Julkinen rahoitus @fi

international relations-DEPRECATED
type: Concept
broad match: http://cv.iptc.org/newscodes/mediatopic/20000639
broader: treaty and international organisation-DEPRECATED
definition: NA
in scheme: IPTC NewsCodes: Subject Code
notation: 11014001

peace negotiations-DEPRECATED
type: Concept
broad match: http://cv.iptc.org/newscodes/mediatopic/20000639
broader: treaty and international organisation-DEPRECATED
definition: NA
in scheme: IPTC NewsCodes: Subject Code
notation: 11014002

alliances-DEPRECATED
type: Concept
broad match: http://cv.iptc.org/newscodes/mediatopic/20000639
broader: treaty and international organisation-DEPRECATED
definition: NA
in scheme: IPTC NewsCodes: Subject Code
notation: 11014003

constitution
type: Concept
broader: politics
definition: Usually a written document setting forth the operations of a government and the rights of the citizens therein
in scheme: IPTC NewsCodes: Subject Code
notation: 11015000
preferred label: Perustuslaki @fi

data protection
type: Concept
broader: interior policy
definition: Efforts to protect personal information in either written, oral or electronic form
in scheme: IPTC NewsCodes: Subject Code
notation: 11016001
preferred label: Tietosuoja @fi

housing and urban planning
type: Concept
broader: interior policy
definition: Systematic planning of urban and suburban areas and the housing within those areas
in scheme: IPTC NewsCodes: Subject Code
notation: 11016002
preferred label: Yhdyskuntasuunnittelu @fi

pension and welfare
type: Concept
broader: interior policy
definition: Government policies affecting the well being of its citizens through unemployment benefits, state pensions and other similar payments
in scheme: IPTC NewsCodes: Subject Code
notation: 11016003
preferred label: Sosiaalipolitiikka @fi

personal weapon control
type: Concept
broader: interior policy
definition: Government control of personal ownership of firearms and other offensive weapons, including control of weapons used for sports through licenses and other means
in scheme: IPTC NewsCodes: Subject Code
notation: 11016004
preferred label: Aseenkantoluvat @fi

indigenous people
type: Concept
broader: interior policy
definition: Government policies toward indigenous peoples
in scheme: IPTC NewsCodes: Subject Code
notation: 11016005
preferred label: Alkuperäiskansat @fi

personal data collection
type: Concept
broader: interior policy
definition: The collection, by government or other entities of information on individuals
in scheme: IPTC NewsCodes: Subject Code
notation: 11016006
preferred label: Henkilörekisterit @fi

planning inquiries
type: Concept
broader: interior policy
definition: Public hearings or planning inquiries on proposed constructions, e.g. Construction of water driven power station in a National Park.
in scheme: IPTC NewsCodes: Subject Code
notation: 11016007
preferred label: Julkinen kuuleminen rakennushankkeissa @fi

migration
type: Concept
broader: politics
definition: Movement of one body of persons from one place to another
in scheme: IPTC NewsCodes: Subject Code
notation: 11017000
preferred label: Siirtolaisuus @fi

citizens initiative and recall
type: Concept
broader: politics
definition: Political suggestions by non-government officials for corrective action, or for changes in existing rules and regulations
definition: Mm. mielipidetiedustelut @fi
in scheme: IPTC NewsCodes: Subject Code
notation: 11018000
preferred label: Kansalaistoiminta Kansalaismielipide @fi

referenda
type: Concept
broader: politics
definition: Political proposals, laws and actions suggested by non-government officials to be voted on by the entire voting body
in scheme: IPTC NewsCodes: Subject Code
notation: 11019000
preferred label: Kansanäänestykset @fi

nuclear policy
type: Concept
broader: politics
definition: Government policies as regards to use of nuclear fuels for power production or weapons
in scheme: IPTC NewsCodes: Subject Code
notation: 11020000
preferred label: Ydinenergiapolitiikka @fi

lobbying
type: Concept
broader: politics
definition: The attempt by non-government bodies and individual to affect the outcome of legislation through verbal, or other, persuasion
in scheme: IPTC NewsCodes: Subject Code
notation: 11021000
preferred label: Edunvalvonta Lobbaus @fi

regulatory policy and organisation
type: Concept
broader: politics
definition: The rules and bodies, both national and international, that govern conflict of interest and good practice regulations.
definition: Esim. rahoitustarkastus, tietosuojavaltuutettu. @fi
in scheme: IPTC NewsCodes: Subject Code
notation: 11022000
preferred label: Säännösten valvonta @fi

censorship
type: Concept
broader: politics
definition: Attempts by any group to control freedoms of speech, religion, and ideas distributed in print, graphics, cyberspace and other ways. Does not include official standards such as cinema ratings, advertising and broadcast standards.
in scheme: IPTC NewsCodes: Subject Code
notation: 11023000
preferred label: Sensuuri @fi

political systems
type: Concept
broader: politics (general)
definition: Systems designed to provide order to government
in scheme: IPTC NewsCodes: Subject Code
notation: 11024001
preferred label: Poliittiset järjestelmät @fi

democracy
type: Concept
broader: politics (general)
definition: Government in which the people hold the power either directly, or through elected officials.
in scheme: IPTC NewsCodes: Subject Code
notation: 11024002
preferred label: Demokratia @fi

political development
type: Concept
broader: politics (general)
definition: The creation and rise of political systems and the history of the people and nations that are associated with those systems.
in scheme: IPTC NewsCodes: Subject Code
notation: 11024003
preferred label: Poliittinen kehitys @fi

freedom of the press
type: Concept
broader: politics
definition: Mass media rights and freedoms, pressure and intimidation of the journalists, censorship in mass media, activities of government bodies, journalistic associations and/or organizations and other NGOs in regards to press freedom
in scheme: IPTC NewsCodes: Subject Code
notation: 11025000
preferred label: Sananvapaus @fi

freedom of religion
type: Concept
broader: politics
definition: Religious rights and freedoms, pressure and intimidation of the believers, censorship in mass media, activities of government bodies, journalistic associations and/or organizations and other NGOs in regards to freedom of belief and practice
in scheme: IPTC NewsCodes: Subject Code
notation: 11026000
preferred label: Uskonnonvapaus @fi

treaty
type: Concept
broader: politics
definition: A treaty (as defined by the Vienna Convention on the Law of Treaties) is a written agreement between international entities that is binding under international law.
in scheme: IPTC NewsCodes: Subject Code
notation: 11027000
preferred label: Kansainväliset sopimukset @fi

international organisation
type: Concept
broader: politics
definition: Includes organisations with members and functions that cross international borders, and may include intergovernmental organisations of sovereign nations.
in scheme: IPTC NewsCodes: Subject Code
notation: 11028000
preferred label: Kansainväliset järjestöt @fi

cult and sect
type: Concept
broader: religion and belief
definition: Offshoots of established religious bodies, or small narrow-focused group promulgated by one or two individuals
definition: Kansanusko (mm. noidat, loitsut, samaanit), luonnonpalvonta (animismi, eläinten palvonta, seidat, totemismi) ja saatananpalvonta. @fi
in scheme: IPTC NewsCodes: Subject Code
notation: 12001000
preferred label: Kultit Lahkot @fi

unificationism
type: Concept
broader: belief (faith)
definition: The belief system of members of the Unification Church established by the Rev. Sun Myung Moon.
definition: Yhdistymiskirkko. Korealaisen Sun Myung Moonin perustaman (1954) yhteisön kannattajat @fi
in scheme: IPTC NewsCodes: Subject Code
notation: 12002001
preferred label: Moonilaiset @fi

scientology
type: Concept
broader: belief (faith)
definition: Believe that man is a spiritual being endowed with abilities well beyond those which he normally envisages; he's able to solve his own problems, accomplish his goals and gain lasting happiness.
in scheme: IPTC NewsCodes: Subject Code
notation: 12002002
preferred label: Skientologit @fi

freemasonry
type: Concept
broader: religion and belief
definition: A secret international society based on the principles of brotherhood, charity and mutual aid
in scheme: IPTC NewsCodes: Subject Code
notation: 12003000
preferred label: Vapaamuurarit @fi

christianity-DEPRECATED
type: Concept
broader: religion-DEPRECATED
definition: NA
in scheme: IPTC NewsCodes: Subject Code
notation: 12004001

islam-DEPRECATED
type: Concept
broader: religion-DEPRECATED
definition: NA
in scheme: IPTC NewsCodes: Subject Code
notation: 12004002

judaism-DEPRECATED
type: Concept
broader: religion-DEPRECATED
definition: NA
in scheme: IPTC NewsCodes: Subject Code
notation: 12004003

buddhism-DEPRECATED
type: Concept
broader: religion-DEPRECATED
definition: NA
in scheme: IPTC NewsCodes: Subject Code
notation: 12004004

hinduism-DEPRECATED
type: Concept
broader: religion-DEPRECATED
definition: NA
in scheme: IPTC NewsCodes: Subject Code
notation: 12004005

religious facilities-DEPRECATED
type: Concept
broader: church (organisation)-DEPRECATED
definition: NA
in scheme: IPTC NewsCodes: Subject Code
notation: 12005001

ethics
type: Concept
broader: values
definition: A system of beliefs about acceptable behaviour
definition: Hyväksyttävän käyttäytymisen mallit @fi
in scheme: IPTC NewsCodes: Subject Code
notation: 12006001
preferred label: Etiikka @fi

corrupt practices
type: Concept
broader: values
definition: Any action which is harmful to others
definition: Lähimmäiselle haitallinen toiminta @fi
in scheme: IPTC NewsCodes: Subject Code
notation: 12006002
preferred label: Moraaliton toiminta @fi

church and state relations
type: Concept
broader: religion and belief
definition: The legal and social division between religious institutions and the affairs of state
in scheme: IPTC NewsCodes: Subject Code
notation: 12007000
preferred label: Kirkon ja valtion suhde @fi

philosophy
type: Concept
broader: religion and belief
definition: Different thoughts about the way the world works
in scheme: IPTC NewsCodes: Subject Code
notation: 12008000
preferred label: Maailmankatsomus @fi

protestant
type: Concept
broader: christianity
definition: General term for christian churches and religious communities which developed through the reformation in the 16th century
in scheme: IPTC NewsCodes: Subject Code
notation: 12009001
preferred label: Protestantit @fi

lutheran
type: Concept
broader: christianity
definition: Christians who follow the teaching of reformer Martin Luther
in scheme: IPTC NewsCodes: Subject Code
notation: 12009002
preferred label: Evankelis-luterilaiset @fi

reformed
type: Concept
broader: christianity
definition: Christians who follow the teaching of reformers Johannes Calvin and Ulrich Zwingli
definition: Johannes Calvinin ja Ulrich Zwinglin oppien seuraajat @fi
in scheme: IPTC NewsCodes: Subject Code
notation: 12009003
preferred label: Reformoidut @fi

anglican
type: Concept
broader: christianity
definition: Members of the worldwide anglican communion which started in the 16th century in England as a breakaway church from the roman catholic church
in scheme: IPTC NewsCodes: Subject Code
notation: 12009004
preferred label: Anglikaanit @fi

methodist
type: Concept
broader: christianity
definition: Followers of John and Charles Wesley who tried to reform the Church of England in the 18th century and turned into a separate church
in scheme: IPTC NewsCodes: Subject Code
notation: 12009005
preferred label: Metodistit @fi

baptist
type: Concept
broader: christianity
definition: Members of a christian church which only baptises adults who truly believe in Christ
in scheme: IPTC NewsCodes: Subject Code
notation: 12009006
preferred label: Baptistit @fi

mennonite
type: Concept
broader: christianity
definition: Members of a 16th century christian church which is against military service and baptising infants
definition: 1500-luvulla perustettu uskonnollinen ryhmä, joka vastustaa asepalvelusta ja lasten kastamista. @fi
in scheme: IPTC NewsCodes: Subject Code
notation: 12009007
preferred label: Mennoniitit @fi

mormon
type: Concept
broader: christianity
definition: Members of a religious community which believes in the "Book of Mormon" and the revelations of founder M.J. Smith
definition: Myöhempien aikojen pyhien Jeesuksen Kristuksen kirkko uskoo M. J. Smithin ennustuksiin ja Mormonien kirjaan. @fi
in scheme: IPTC NewsCodes: Subject Code
notation: 12009009
preferred label: Mormonit @fi

roman catholic
type: Concept
broader: christianity
definition: Biggest christian church worldwide tracing its origins back to Jesus Christ
in scheme: IPTC NewsCodes: Subject Code
notation: 12009010
preferred label: Roomalaiskatoliset @fi

old catholic
type: Concept
broader: christianity
definition: Members of a catholic church which started in 1870 and denies the dogma of the infallibility of the pope
definition: Syntyi 1870, ei usko paavin erehtymättömyyteen. @fi
in scheme: IPTC NewsCodes: Subject Code
notation: 12009011
preferred label: Vanhakatoliset @fi

orthodoxy
type: Concept
broader: christianity
definition: Eastern rite churches which are characterised by their continuity with the apostolic church, their liturgy and their territorial churches, mainly in eastern and south-eastern Europe and the Middle East
in scheme: IPTC NewsCodes: Subject Code
notation: 12009012
preferred label: Ortodoksit @fi

salvation army
type: Concept
broad match: http://cv.iptc.org/newscodes/mediatopic/20000659
broader: christianity
definition: Christian community organised in a military fashion which does missionary and social work
in scheme: IPTC NewsCodes: Subject Code
notation: 12009013
preferred label: Pelastusarmeija @fi

islam
type: Concept
broader: religion and belief
definition: Those who use Allah and his teachings as their centre of belief
in scheme: IPTC NewsCodes: Subject Code
notation: 12010000
preferred label: Islam Muslimit @fi

judaism
type: Concept
broader: religion and belief
definition: A group believing in one god, basing their beliefs on written scriptures and the Talmud, including the first coming of the Messiah
in scheme: IPTC NewsCodes: Subject Code
notation: 12011000
preferred label: Juutalaiset @fi

buddhism
type: Concept
broader: religion and belief
definition: A major Asian religion founded by Buddha in the 6th century BC in India and preaching that right thinking and self denial will lead to a divine state without desire
in scheme: IPTC NewsCodes: Subject Code
notation: 12012000
preferred label: Buddhalaiset @fi

hinduism
type: Concept
broader: religion and belief
definition: A religious and social system, believing in a caste system with the Brahmans the highest and untouchables the lowest.
in scheme: IPTC NewsCodes: Subject Code
notation: 12013000
preferred label: Hindut @fi

christmas
type: Concept
broader: religious festival or holiday
definition: Christian festival in commemorating the birth of Jesus Christ
in scheme: IPTC NewsCodes: Subject Code
notation: 12014001
preferred label: Joulu @fi

easter
type: Concept
broader: religious festival or holiday
definition: Christian festival in commemorating the resurrection of Jesus Christ
in scheme: IPTC NewsCodes: Subject Code
notation: 12014002
preferred label: Pääsiäinen @fi

pentecost
type: Concept
broader: religious festival or holiday
definition: Christian festival, celebrated on the 50th day after Easter commemorating the descent of the Holy Spirit
in scheme: IPTC NewsCodes: Subject Code
notation: 12014003
preferred label: Helluntai @fi

ramadan
type: Concept
broader: religious festival or holiday
definition: Holy month of fasting in Islam
in scheme: IPTC NewsCodes: Subject Code
notation: 12014004
preferred label: Ramadan @fi

yom kippur
type: Concept
broader: religious festival or holiday
definition: Most solemn of Jewish religious holidays, observed on the 10th day of the lunar month of tishri (in the course of September and October, when Jews seek reconciliation with god
in scheme: IPTC NewsCodes: Subject Code
notation: 12014005
preferred label: Jom kippur @fi

pope
type: Concept
broader: religious leader
definition: Head of the roman catholic church worldwide
in scheme: IPTC NewsCodes: Subject Code
notation: 12015001
preferred label: Paavi @fi

nature religion
type: Concept
broader: religion and belief
definition: Worship of natural elements like fire, water, trees, mountains
definition: Luonnon elementtien palvonta (esim. tuli, vesi, puut, vuoret) @fi
in scheme: IPTC NewsCodes: Subject Code
notation: 12016000
preferred label: Luonnonpalvonta @fi

taoism
type: Concept
broader: religion and belief
definition: Indigenous religio-philosophical tradition that has shaped Chinese life for more than 2000 years
definition: Yli 200 vuotta kiinalaisten elämään vaikuttanut uskonnolis-filosofinen perinne. @fi
in scheme: IPTC NewsCodes: Subject Code
notation: 12017000
preferred label: Taolaiset @fi

shintoism
type: Concept
broader: religion and belief
definition: Indigenous religious beliefs and practices of Japan. The word Shinto came into use in order to distinguish indigenous Japanese beliefs from Buddhism.
in scheme: IPTC NewsCodes: Subject Code
notation: 12018000
preferred label: Shintolaiset @fi

sikhism
type: Concept
broader: religion and belief
definition: The religion of an Indian group, combining Hindu and Islamic elements, founded in the Punjab (or Panjab) in the late 15th century AD by Guru Nanak.
definition: Hindulaisuudesta ja islamilaisuudesta vaikutteita ottanut uskonto Intiassa. Lähtöisin Punjabissa. @fi
in scheme: IPTC NewsCodes: Subject Code
notation: 12019000
preferred label: Sikhit @fi

jainism
type: Concept
broader: religion and belief
definition: A religion of India that teaches a path to spiritual purity and enlightenment through a disciplined mode of life founded upon the tradition of ahimsa, non-violence to all living creatures. It began in the 7th-5th century BC.
definition: Korostaa hengellistä puhtautta ja valaistumista mikä saavutetaan kurinalaisen elämän kautta, väkivallattomuus kaikkia eläviä olentoja kohtaan. Lähtöisin Intiasta. @fi
in scheme: IPTC NewsCodes: Subject Code
notation: 12020000
preferred label: Jainalaiset @fi

parsasm
type: Concept
broader: religion and belief
definition: A religion in India following the Iranian prophet Zoroaster, mainly in Bombay, but also in Karachi (Pakistan).
definition: 1700-1400eKr Persiassa eläneen Zarahustran kannattajat, joita on pääosin Bombayssa ja Pakistanin Karachissa. @fi
in scheme: IPTC NewsCodes: Subject Code
notation: 12021000
preferred label: Zarathustralaiset @fi

confucianism
type: Concept
broader: religion and belief
definition: The way of life propagated by Confucius in the 6th-5th century BC and followed by the Chinese people for more than 2000 years. Its influence has extended to Korea, Japan, and Vietnam.
definition: Pääosin Koreassa, Japanissa ja Vietnamissa kiinalaisväestön joukossa yli 200 vuotta vaikuttanut elämäntapa. @fi
in scheme: IPTC NewsCodes: Subject Code
notation: 12022000
preferred label: Kungfutselaiset @fi

bible
type: Concept
broader: religious text
definition: Sacred scriptures of Christianity consisting of the old and new testament
in scheme: IPTC NewsCodes: Subject Code
notation: 12023001
preferred label: Raamattu @fi

qur'an
type: Concept
broader: religious text
definition: Holy book of Islam
in scheme: IPTC NewsCodes: Subject Code
notation: 12023002
preferred label: Koraani @fi

torah
type: Concept
broader: religious text
definition: Holy scriptures of Judaism
in scheme: IPTC NewsCodes: Subject Code
notation: 12023003
preferred label: Toora @fi

interreligious dialogue
type: Concept
broader: religion and belief
definition: Any form of communication between religions
in scheme: IPTC NewsCodes: Subject Code
notation: 12024000
preferred label: Uskontojen vuoropuhelu @fi

catholic convention
type: Concept
broad match: http://cv.iptc.org/newscodes/mediatopic/20000689
broader: religious event
definition: A catholic convention
in scheme: IPTC NewsCodes: Subject Code
notation: 12025001
preferred label: Katolisten konventit @fi

protestant convention
type: Concept
broad match: http://cv.iptc.org/newscodes/mediatopic/20000689
broader: religious event
definition: A protestant convention
in scheme: IPTC NewsCodes: Subject Code
notation: 12025002
preferred label: Protestanttien konventit @fi

ritual
type: Concept
broader: religious event
definition: Established religious rituals such as mass, baptism, prayer meetings
definition: Uskonnolliset seremoniat kuten messu, kaste, rukoustilaisuudet @fi
in scheme: IPTC NewsCodes: Subject Code
notation: 12025004
preferred label: Seremoniat @fi

concordat
type: Concept
broader: religion and belief
definition: Treaty between the Holy See and another country for the regulation of ecclesiastical affairs in the territory of the latter
definition: Paavinistuimen ja valtion välinen, katolisen kirkon asemaa valtiossa koskeva sopimus @fi
in scheme: IPTC NewsCodes: Subject Code
notation: 12026000
preferred label: Konkordaatti @fi

ecumenism
type: Concept
broader: religion and belief
definition: Relations between christian churches
definition: Kristillisten kirkkojen väliset suhteet @fi
in scheme: IPTC NewsCodes: Subject Code
notation: 12027000
preferred label: Ekumenia @fi

physics
type: Concept
broader: applied science
definition: The study of the properties and changes of matter
in scheme: IPTC NewsCodes: Subject Code
notation: 13001001
preferred label: Fysiikka @fi

chemistry
type: Concept
broader: applied science
definition: The study of the composition and reaction of substances
in scheme: IPTC NewsCodes: Subject Code
notation: 13001002
preferred label: Kemia @fi

cosmology
type: Concept
broader: applied science
definition: Study of the organization and structure of the universe
in scheme: IPTC NewsCodes: Subject Code
notation: 13001003
preferred label: Kosmologia @fi

particle physics
type: Concept
broader: applied science
definition: The study of elementary particles and atomic nuclei through the use of high-energy particles
in scheme: IPTC NewsCodes: Subject Code
notation: 13001004
preferred label: Hiukkasfysiikka @fi

material science
type: Concept
broader: engineering
definition: The study of materials used in manufacturing
in scheme: IPTC NewsCodes: Subject Code
notation: 13002001
preferred label: Materiaalitiede @fi

social sciences
type: Concept
broader: human science
definition: The study of people living in groups, as families, tribes and communities
in scheme: IPTC NewsCodes: Subject Code
notation: 13003001
preferred label: Yhteiskuntatieteet @fi

history
type: Concept
broader: human science
definition: The study of human events of the past
in scheme: IPTC NewsCodes: Subject Code
notation: 13003002
preferred label: Historiantutkimus @fi

psychology
type: Concept
broader: human science
definition: The study of the human mind and mental and emotional processes
in scheme: IPTC NewsCodes: Subject Code
notation: 13003003
preferred label: Psykologia @fi

sociology
type: Concept
broader: human science
definition: The study of human social relations, organization and change
in scheme: IPTC NewsCodes: Subject Code
notation: 13003004
preferred label: Sosiologia @fi

anthropology
type: Concept
broader: human science
definition: The study of human beings in groups or societies
in scheme: IPTC NewsCodes: Subject Code
notation: 13003005
preferred label: Antropologia @fi

geology
type: Concept
broader: natural science
definition: The study of Earth's physical processes
in scheme: IPTC NewsCodes: Subject Code
notation: 13004001
preferred label: Geologia @fi

paleontology
type: Concept
broader: natural science
definition: The study of ancient animals
in scheme: IPTC NewsCodes: Subject Code
notation: 13004002
preferred label: Paleontologia @fi

geography
type: Concept
broader: natural science
definition: The study of the surface of Earth and its political divisions
in scheme: IPTC NewsCodes: Subject Code
notation: 13004003
preferred label: Maantiede @fi

botany
type: Concept
broader: natural science
definition: The study of plants
in scheme: IPTC NewsCodes: Subject Code
notation: 13004004
preferred label: Kasvitiede @fi

zoology
type: Concept
broader: natural science
definition: The study of animals
in scheme: IPTC NewsCodes: Subject Code
notation: 13004005
preferred label: Eläintiede @fi

physiology
type: Concept
broader: natural science
definition: The study of vital processes of living organisms
in scheme: IPTC NewsCodes: Subject Code
notation: 13004006
preferred label: Fysiologia @fi

astronomy
type: Concept
broader: natural science
definition: The study of the stars and planets
in scheme: IPTC NewsCodes: Subject Code
notation: 13004007
preferred label: Astronomia @fi

biology
type: Concept
broader: natural science
definition: The study of living organisms
in scheme: IPTC NewsCodes: Subject Code
notation: 13004008
preferred label: Biologia @fi

philosophical science
type: Concept
broader: science and technology
definition: Philosophy, logic and ethics, among others
in scheme: IPTC NewsCodes: Subject Code
notation: 13005000
preferred label: Filosofia @fi

survey
type: Concept
broader: research
definition: Examination of public attitudes on various subjects or issues, such as the quality of goods, the value of services etc.
in scheme: IPTC NewsCodes: Subject Code
notation: 13006001
preferred label: Kyselytutkimukset @fi

scientific exploration
type: Concept
broader: science and technology
definition: Methodical land, sea and space journeys to discover new information about them
in scheme: IPTC NewsCodes: Subject Code
notation: 13007000
preferred label: Tutkimusmatkat @fi

space programme
type: Concept
broader: science and technology
definition: The government's organized effort for the exploration of outer space and the bodies therein
in scheme: IPTC NewsCodes: Subject Code
notation: 13008000
preferred label: Avaruustutkimus @fi

science (general)
type: Concept
broad match: http://cv.iptc.org/newscodes/mediatopic/13000000
broader: science and technology
definition: Establishing and systematizing information about nature and the physical world through observation, experimentation and hypothesis
in scheme: IPTC NewsCodes: Subject Code
notation: 13009000
preferred label: Tiede yleistä @fi

rocketry
type: Concept
broader: technology (general)
definition: The development of rockets
in scheme: IPTC NewsCodes: Subject Code
notation: 13010001
preferred label: Raketit @fi

laser
type: Concept
broad match: http://cv.iptc.org/newscodes/mediatopic/13000000
broader: technology (general)
definition: The development and use of light amplification by stimulated emission of radiation
in scheme: IPTC NewsCodes: Subject Code
notation: 13010002
preferred label: Laser @fi

standards
type: Concept
broader: science and technology
definition: The rules, national and international, that govern science and technology. These might include international standards setting for equipment and interference standards.
in scheme: IPTC NewsCodes: Subject Code
notation: 13011000
preferred label: Standardit @fi

animal science
type: Concept
broader: science and technology
definition: Science involving animals
in scheme: IPTC NewsCodes: Subject Code
notation: 13012000
preferred label: Eläintiede @fi

micro science
type: Concept
broader: science and technology
definition: The multi-disciplinary areas of nanotechnology and Micro-Electrical Mechanical Systems.
in scheme: IPTC NewsCodes: Subject Code
notation: 13013000
preferred label: Mikrotieteet @fi

marine science
type: Concept
broader: science and technology
definition: The multi-disciplinary research areas involving the worlds' waterways and oceans. This could include hyper-spectral sensing of ice flows, fisheries studies and underwater research.
in scheme: IPTC NewsCodes: Subject Code
notation: 13014000
preferred label: Merentutkimus @fi

weather science
type: Concept
broader: science and technology
definition: All scientific aspects of the weather and climate.
in scheme: IPTC NewsCodes: Subject Code
notation: 13015000
preferred label: Meteorologia @fi

electronics
type: Concept
broader: science and technology
definition: The branch of engineering or physics concerned with the controlled flow of electrons or other carriers of electric charges, especially in semiconductor devices, including the design, manufacture, and maintenance of electronic devices
definition: Tietokoneisiin, tiedonsiirtoon liittyvä tutkimus. @fi
in scheme: IPTC NewsCodes: Subject Code
notation: 13016000
preferred label: Elektroniikka @fi

identification technology
type: Concept
broader: science and technology
definition: Includes biometrics, new computer-based identification cards, retinal scans, face scanning and mobile augmented reality systems (MARS) and other ways technology can identify individuals. Also technology vs. the privacy of personal information.
in scheme: IPTC NewsCodes: Subject Code
notation: 13017000
preferred label: Sähköinen tunnistaminen @fi

mathematics
type: Concept
broader: science and technology
definition: The study of quantities and shapes and their symbolic relationships.
in scheme: IPTC NewsCodes: Subject Code
notation: 13018000
preferred label: Matematiikka @fi

biotechnology
type: Concept
broader: science and technology
definition: Manipulating natural organisms for scientific, medical or agricultural purposes
in scheme: IPTC NewsCodes: Subject Code
notation: 13019000
preferred label: Biotekniikka @fi

agricultural research and technology
type: Concept
broader: science and technology
definition: Pertaining to the growing of crops and management of farm animals
in scheme: IPTC NewsCodes: Subject Code
notation: 13020000
preferred label: Maataloustieteet ja teknologia @fi

nanotechnology
type: Concept
broader: science and technology
definition: Manipulating objects at the molecular scale
in scheme: IPTC NewsCodes: Subject Code
notation: 13021000
preferred label: Nanotekniikka @fi

IT/computer sciences
type: Concept
broader: science and technology
definition: The study and design of computer systems and networks.
in scheme: IPTC NewsCodes: Subject Code
notation: 13022000
preferred label: Tietojenkäsittelytieteet @fi

scientific institutions
type: Concept
broader: science and technology
definition: Institutions that carry out or govern scientific work (e.g. National Academy of Arts and Sciences )
in scheme: IPTC NewsCodes: Subject Code
notation: 13023000
preferred label: Tieteelliset laitokset @fi

addiction
type: Concept
broader: social issue
definition: The habitual and often uncontrollable use of harmful substances such as alcohol, tobacco and pharmaceuticals or drugs
in scheme: IPTC NewsCodes: Subject Code
notation: 14001000
preferred label: Riippuvuudet @fi

charity
type: Concept
broader: social issue
definition: Philanthropic giving
in scheme: IPTC NewsCodes: Subject Code
notation: 14002000
preferred label: Hyväntekeväisyys Vapaaehtoistyö @fi

population and census
type: Concept
broader: demographics
definition: Population is the number of people in a geographical region and census is the process of counting them
in scheme: IPTC NewsCodes: Subject Code
notation: 14003001
preferred label: Väestönlaskenta @fi

immigration
type: Concept
broader: demographics
definition: Movement of individuals from one country to the other
in scheme: IPTC NewsCodes: Subject Code
notation: 14003002
preferred label: Maahanmuutto @fi

illegal immigrants
type: Concept
broader: demographics
definition: Movement of individuals from one country to the other by illicit means
in scheme: IPTC NewsCodes: Subject Code
notation: 14003003
preferred label: Laiton maahanmuutto @fi

emigrants
type: Concept
broader: demographics
definition: People who leave their country of origin, their relationship with their country of origin and their association with fellow emigrants
in scheme: IPTC NewsCodes: Subject Code
notation: 14003004
preferred label: Maastamuuttajat @fi

disabled
type: Concept
broader: social issue
definition: Being incapacitated either physically, emotionally or mentally
in scheme: IPTC NewsCodes: Subject Code
notation: 14004000
preferred label: Vammaiset @fi

suicide
type: Concept
broader: euthanasia (also includes assisted suicide)
definition: Death by one's own hand
in scheme: IPTC NewsCodes: Subject Code
notation: 14005001
preferred label: Itsemurhat @fi

parent and child
type: Concept
broader: family
definition: Two or more individuals with a hierarchical familial relationship
in scheme: IPTC NewsCodes: Subject Code
notation: 14006001
preferred label: Vanhemmat ja lapset @fi

adoption
type: Concept
broader: family
definition: A legal process of bringing a child with no supporting parents into a supportive union
in scheme: IPTC NewsCodes: Subject Code
notation: 14006002
preferred label: Adoptio @fi

marriage
type: Concept
broader: family
definition: The union of two individuals who pledge fidelity, respect and support for each other
in scheme: IPTC NewsCodes: Subject Code
notation: 14006003
preferred label: Avioliitto @fi

divorce
type: Concept
broader: family
definition: The process by which a marriage is dissolved
in scheme: IPTC NewsCodes: Subject Code
notation: 14006004
preferred label: Avioero @fi

sex
type: Concept
broader: family
definition: The classification of individuals as either male or female. Or conjugal relationship between two individuals.
in scheme: IPTC NewsCodes: Subject Code
notation: 14006005
preferred label: Seksuaalisuus @fi

courtship
type: Concept
broader: family
definition: Preliminaries of wooing and winning a partner
in scheme: IPTC NewsCodes: Subject Code
notation: 14006006
preferred label: Seurustelu @fi

family planning
type: Concept
broader: social issue
definition: Conscious decisions and efforts involving reproduction
in scheme: IPTC NewsCodes: Subject Code
notation: 14007000
preferred label: Perhesuunnittelu @fi

health insurance
type: Concept
broader: social issue
definition: Insurance covering extraordinary medical costs
in scheme: IPTC NewsCodes: Subject Code
notation: 14008000
preferred label: Sairausvakuutus @fi

homelessness
type: Concept
broader: social issue
definition: Lacking a fixed place of residence
in scheme: IPTC NewsCodes: Subject Code
notation: 14009000
preferred label: Asunnottomuus Asumisen ongelmat @fi

gays and lesbians
type: Concept
broader: minority group
definition: Those that consider themselves attracted to their same gender in an erotic or sensual or similar way.
in scheme: IPTC NewsCodes: Subject Code
notation: 14010001
preferred label: Seksuaaliset vähemmistöt @fi

national or ethnic minority
type: Concept
broader: minority group
definition: Groups of people that form a minority on ethnic or national basis, their status, problems and relations to the majority
in scheme: IPTC NewsCodes: Subject Code
notation: 14010002
preferred label: Etniset vähemmistöt @fi

pornography
type: Concept
broader: social issue
definition: Audio or visual depictions of various sex related acts considered outside accepted community standards
in scheme: IPTC NewsCodes: Subject Code
notation: 14011000
preferred label: Pornografia @fi

poverty
type: Concept
broader: social issue
definition: Having insufficient resources to provide for basic services to oneself or family
in scheme: IPTC NewsCodes: Subject Code
notation: 14012000
preferred label: Köyhyys @fi

prostitution
type: Concept
broader: social issue
definition: Sex for sale, either male or female, and those who profit from it
in scheme: IPTC NewsCodes: Subject Code
notation: 14013000
preferred label: Prostituutio @fi

racism
type: Concept
broader: social issue
definition: Harmful attitudes toward another group based on racial differences
in scheme: IPTC NewsCodes: Subject Code
notation: 14014000
preferred label: Rasismi @fi

welfare
type: Concept
broader: social issue
definition: Generally government help for those in need of food, housing health and other services
in scheme: IPTC NewsCodes: Subject Code
notation: 14015000
preferred label: Hyvinvointi Sosiaaliturva @fi

abortion
type: Concept
broader: social issue
definition: Usually the planned disruption of the process of reproduction of human life
in scheme: IPTC NewsCodes: Subject Code
notation: 14016000
preferred label: Abortti @fi

missing due to hostilities
type: Concept
broader: missing person
definition: People, both civilian and military, missing during or after hostilities
in scheme: IPTC NewsCodes: Subject Code
notation: 14017001
preferred label: Sodassa kadonneet @fi

long term care
type: Concept
broader: social issue
definition: Extensive health care because of serious illness or disability
in scheme: IPTC NewsCodes: Subject Code
notation: 14018000
preferred label: Pitkäaikaishoito Omaishoito @fi

juvenile delinquency
type: Concept
broader: social issue
definition: Incidents involving perpetrators who are minors.
in scheme: IPTC NewsCodes: Subject Code
notation: 14019000
preferred label: Nuorisorikollisuus @fi

nuclear radiation victims
type: Concept
broader: social issue
definition: Includes antinuclear movements and compensation for atomic blast victims.
in scheme: IPTC NewsCodes: Subject Code
notation: 14020000
preferred label: Ydinsäteilyn uhrit @fi

slavery
type: Concept
broader: social issue
definition: The involuntary servitude, outside of legal incarceration for statuary criminal offences, of men, women and children, including involuntary unpaid labour, coerced actions, child labour
in scheme: IPTC NewsCodes: Subject Code
notation: 14021000
preferred label: Orjuus @fi

abusive behaviour
type: Concept
broader: social issue
definition: The maltreatment of one or more individuals by others through dehumanizing treatment including sexual or mental abuse, deprivation of sensory abilities, deprivation of physical needs, physical mistreatment including beatings, and other forms of torture
in scheme: IPTC NewsCodes: Subject Code
notation: 14022000
preferred label: Hyväksikäyttö Väkivalta @fi

death and dying
type: Concept
broader: social issue
definition: Dying is the route to death. Death is the state you are in when there are no signs that you can function as a human being either physically or mentally
in scheme: IPTC NewsCodes: Subject Code
notation: 14023000
preferred label: Kuoleminen @fi

children
type: Concept
broader: people
definition: Immature people, usually up to the age of puberty
in scheme: IPTC NewsCodes: Subject Code
notation: 14024001
preferred label: Lapset @fi

infants
type: Concept
broader: people
definition: Those people from birth until ages of one or two, usually when they begin walking
in scheme: IPTC NewsCodes: Subject Code
notation: 14024002
preferred label: Vauvat @fi

teen-agers
type: Concept
broader: people
definition: People aged 13 to 19 years of age
in scheme: IPTC NewsCodes: Subject Code
notation: 14024003
preferred label: Nuoret @fi

adults
type: Concept
broader: people
definition: People aged 20 and above
in scheme: IPTC NewsCodes: Subject Code
notation: 14024004
preferred label: Aikuiset @fi

senior citizens
type: Concept
broader: people
definition: People aged 60 or 65 and older
in scheme: IPTC NewsCodes: Subject Code
notation: 14024005
preferred label: Vanhukset @fi

social conditions
type: Concept
broader: social issues (general)
definition: Conditions under which people live in terms of housing, water supply, availability of education
in scheme: IPTC NewsCodes: Subject Code
notation: 14025001
preferred label: Elinolot @fi

social problems
type: Concept
broader: social issues (general)
definition: Issues affecting the lives of individuals such as housing, education nutrition, communication etc
in scheme: IPTC NewsCodes: Subject Code
notation: 14025002
preferred label: Sosiaaliset ongelmat @fi

discrimination
type: Concept
broader: social issues (general)
definition: Denial of services to one or more people because of race, colour, sexual identity, religion, political beliefs etc
in scheme: IPTC NewsCodes: Subject Code
notation: 14025003
preferred label: Syrjintä @fi

social services
type: Concept
broader: social issues (general)
definition: Government supported programs to improve the well-being of individuals or groups of individuals
in scheme: IPTC NewsCodes: Subject Code
notation: 14025004
preferred label: Sosiaalihuolto @fi

death penalty policies
type: Concept
broader: social issues (general)
definition: National or international polices regarding death sentences
in scheme: IPTC NewsCodes: Subject Code
notation: 14025005
preferred label: Suhtautuminen kuolemanrangaistukseen @fi

ordnance clearance
type: Concept
broader: social issue
definition: The removal or neutralization of ordnance such as landmines or cluster bombs, remaining after a war or armed conflict
in scheme: IPTC NewsCodes: Subject Code
notation: 14026000
preferred label: Taisteluvälineraivaukset @fi

reconstruction
type: Concept
broader: social issue
definition: The reconstruction of economy, infrastructure and property, as well as life in general, after a war or natural disaster
in scheme: IPTC NewsCodes: Subject Code
notation: 14027000
preferred label: Jälleenrakentaminen @fi

parachuting
type: Concept
broader: aero and aviation sport
definition: Parachuting competitions: precision landings, voltige, individual and team
in scheme: IPTC NewsCodes: Subject Code
notation: 15001001
preferred label: Laskuvarjohypyt @fi

sky diving
type: Concept
broader: aero and aviation sport
definition: Parachuting competitions involving sky-diving
in scheme: IPTC NewsCodes: Subject Code
notation: 15001002
preferred label: Vapaapudotuslajit @fi

downhill
type: Concept
broad match: http://cv.iptc.org/newscodes/mediatopic/20001057
broader: alpine skiing
definition: Skiing at top speed down a steep slope with interspersed turns but no gates. The fastest wins.
in scheme: IPTC NewsCodes: Subject Code
notation: 15002001
preferred label: Syöksylasku @fi

giant slalom
type: Concept
broad match: http://cv.iptc.org/newscodes/mediatopic/20001057
broader: alpine skiing
definition: Skiing down a slope, but with more turns and bends than in super-G skiing. The fastest wins.
in scheme: IPTC NewsCodes: Subject Code
notation: 15002002
preferred label: Suurpujottelu @fi

super G
type: Concept
broad match: http://cv.iptc.org/newscodes/mediatopic/20001057
broader: alpine skiing
definition: Skiing down a steep slope, but with more turns and bends than in the downhill. The fastest wins.
in scheme: IPTC NewsCodes: Subject Code
notation: 15002003
preferred label: Supersuurpujottelu @fi

slalom
type: Concept
broad match: http://cv.iptc.org/newscodes/mediatopic/20001057
broader: alpine skiing
definition: Skiers must zig-zag their way down a slope with closely positioned gates which they must negotiate. It is run over two legs with the combined fastest winning.
in scheme: IPTC NewsCodes: Subject Code
notation: 15002004
preferred label: Pujottelu @fi

combined
type: Concept
broad match: http://cv.iptc.org/newscodes/mediatopic/20001057
broader: alpine skiing
definition: Race, usually competed over two days that combines a downhill leg and a slalom leg rewarding the most complete skiers. Combined fastest time wins.
in scheme: IPTC NewsCodes: Subject Code
notation: 15002005
preferred label: Alppiyhdistetty @fi

(US) National Football League (NFL) (North American)
type: Concept
broad match: http://cv.iptc.org/newscodes/mediatopic/20000823
broader: American football
definition: The association of professional American football teams
in scheme: IPTC NewsCodes: Subject Code
notation: 15003001

CFL
type: Concept
broad match: http://cv.iptc.org/newscodes/mediatopic/20000876
broader: American football
definition: The Canadian Football League (CFL), also known as Ligue Canadienne de Football (LCF), is a professional league located entirely in Canada that plays Canadian football.
in scheme: IPTC NewsCodes: Subject Code
notation: 15003002

AFL-DEPRECATED
type: Concept
broad match: http://cv.iptc.org/newscodes/mediatopic/20000823
broader: American football
definition: The American Football League (AFL) was a professional league of American football that operated from 1960 to 1969. In 1970, the AFL merged with the National Football League.
in scheme: IPTC NewsCodes: Subject Code
notation: 15003003

FITA / Outdoor target archery
type: Concept
broad match: http://cv.iptc.org/newscodes/mediatopic/20000824
broader: archery
definition: The competition is held outdoors on an open (flat) field, at various fixed distances. The archery competition in the Olympic Games is a part of the FITA outdoor target archery program.
in scheme: IPTC NewsCodes: Subject Code
notation: 15004001
preferred label: FITA-jousiammunta @fi

crossbow shooting
type: Concept
broader: archery
definition: Shooting with crossbow on targets from different distances
definition: Varsijousella tauluun ampuminen eri etäisyyksiltä @fi
in scheme: IPTC NewsCodes: Subject Code
notation: 15004002
preferred label: Varsijousiammunta @fi

100 m
type: Concept
broad match: http://cv.iptc.org/newscodes/mediatopic/20000844
broader: athletics, track and field
definition: Running over a distance of 100 metres with the fastest time winning
in scheme: IPTC NewsCodes: Subject Code
notation: 15005001
preferred label: Juoksu 100 m @fi

200 m
type: Concept
broad match: http://cv.iptc.org/newscodes/mediatopic/20000844
broader: athletics, track and field
definition: Running over a distance of 200 metres with the fastest time winning
in scheme: IPTC NewsCodes: Subject Code
notation: 15005002
preferred label: Juoksu 200 m @fi

400 m
type: Concept
broad match: http://cv.iptc.org/newscodes/mediatopic/20000844
broader: athletics, track and field
definition: Running over a distance of 400 metres with the fastest time winning
in scheme: IPTC NewsCodes: Subject Code
notation: 15005003
preferred label: Juoksu 400 m @fi

800 m
type: Concept
broad match: http://cv.iptc.org/newscodes/mediatopic/20000838
broader: athletics, track and field
definition: Running over a distance of 800 metres with the fastest time winning
in scheme: IPTC NewsCodes: Subject Code
notation: 15005004
preferred label: Juoksu 800 m @fi

1000 m
type: Concept
broad match: http://cv.iptc.org/newscodes/mediatopic/20000838
broader: athletics, track and field
definition: Running over a distance of 1000 metres with the fastest time winning
in scheme: IPTC NewsCodes: Subject Code
notation: 15005005
preferred label: Juoksu 1000 m @fi

1500 m
type: Concept
broad match: http://cv.iptc.org/newscodes/mediatopic/20000838
broader: athletics, track and field
definition: Running over a distance of 1000 metres with the fastest time winning
in scheme: IPTC NewsCodes: Subject Code
notation: 15005006
preferred label: Juoksu 1500 m @fi

mile
type: Concept
broad match: http://cv.iptc.org/newscodes/mediatopic/20000836
broader: athletics, track and field
definition: Running over a distance of one mile with the fastest time winning
in scheme: IPTC NewsCodes: Subject Code
notation: 15005007
preferred label: Juoksu maili @fi

2000 m
type: Concept
broad match: http://cv.iptc.org/newscodes/mediatopic/20000836
broader: athletics, track and field
definition: Running over a distance of 2000 metres with the fastest time winning
in scheme: IPTC NewsCodes: Subject Code
notation: 15005008
preferred label: Juoksu 2000 m @fi

3000 m
type: Concept
broad match: http://cv.iptc.org/newscodes/mediatopic/20000836
broader: athletics, track and field
definition: Running over a distance of 3000 metres with the fastest time winning
in scheme: IPTC NewsCodes: Subject Code
notation: 15005009
preferred label: Juoksu 3000 m @fi

5000 m
type: Concept
broad match: http://cv.iptc.org/newscodes/mediatopic/20000836
broader: athletics, track and field
definition: Running over a distance of 5000 metres with the fastest time winning
in scheme: IPTC NewsCodes: Subject Code
notation: 15005010
preferred label: Juoksu 5000 m @fi

10,000 m
type: Concept
broad match: http://cv.iptc.org/newscodes/mediatopic/20000836
broader: athletics, track and field
definition: Running over a distance of 10,000 metres with the fastest time winning
in scheme: IPTC NewsCodes: Subject Code
notation: 15005011
preferred label: Juoksu 10000 m @fi

20 km
type: Concept
broad match: http://cv.iptc.org/newscodes/mediatopic/20000841
broader: athletics, track and field
definition: Walking over a distance of 20 km on public roads with the fastest time winning
in scheme: IPTC NewsCodes: Subject Code
notation: 15005012
preferred label: Kävely 20 km @fi

one hour
type: Concept
broad match: http://cv.iptc.org/newscodes/mediatopic/20000841
broader: athletics, track and field
definition: Walking as far as possible in the time of one hour
in scheme: IPTC NewsCodes: Subject Code
notation: 15005013
preferred label: Kävely tunti @fi

25000
type: Concept
broad match: http://cv.iptc.org/newscodes/mediatopic/20000841
broader: athletics, track and field
definition: Walking over a distance of 25km with the fastest time winning
in scheme: IPTC NewsCodes: Subject Code
notation: 15005014
preferred label: Kävely 25000 @fi

30000
type: Concept
broad match: http://cv.iptc.org/newscodes/mediatopic/20000841
broader: athletics, track and field
definition: Walking over a distance of 30kms with the fastest time winning
in scheme: IPTC NewsCodes: Subject Code
notation: 15005015
preferred label: Kävely 30000 @fi

110 m hurdles
type: Concept
broad match: http://cv.iptc.org/newscodes/mediatopic/20000834
broader: athletics, track and field
definition: Race consisting of covering 110 metres as fast as possible while jumping over 10 hurdles placed on the track
in scheme: IPTC NewsCodes: Subject Code
notation: 15005016
preferred label: Aitajuoksu 110 m @fi

400 m hurdles
type: Concept
broad match: http://cv.iptc.org/newscodes/mediatopic/20000834
broader: athletics, track and field
definition: Race consisting of covering 400 metres as fast as possible while jumping over 10 hurdles placed on the track
in scheme: IPTC NewsCodes: Subject Code
notation: 15005017
preferred label: Aitajuoksu 400 m @fi

3000 m steeplechase
type: Concept
broad match: http://cv.iptc.org/newscodes/mediatopic/20000827
broader: athletics, track and field
definition: Race consisting of covering 3000 metres as fast as possible while jumping over 28 hurdles which are 91/4 centimetres high and seven water obstacles
in scheme: IPTC NewsCodes: Subject Code
notation: 15005018
preferred label: Estejuoksu 3000 m @fi

high jump
type: Concept
broader: athletics, track and field
definition: Competitors jump as high as possible over a bar which is raised each time they clear the height. The highest clearance wins.
in scheme: IPTC NewsCodes: Subject Code
notation: 15005019
preferred label: Korkeushyppy @fi

pole vault
type: Concept
broader: athletics, track and field
definition: Competitors use a flexible pole to propel themselves feet-first into the air and clear a bar which is raised higher at each round of jumps.
in scheme: IPTC NewsCodes: Subject Code
notation: 15005020
preferred label: Seiväshyppy @fi

long jump
type: Concept
broader: athletics, track and field
definition: Competitors build up speed over a short sprint and them attempt to jump as far forward as they can from a given point into sand trap. The longest jump wins.
in scheme: IPTC NewsCodes: Subject Code
notation: 15005021
preferred label: Pituushyppy @fi

triple jump
type: Concept
broader: athletics, track and field
definition: Competitors build up speed over a short sprint and then attempt to jump as far forward as they can using a hop, skip and a jump technique. The longest jump wins.
in scheme: IPTC NewsCodes: Subject Code
notation: 15005022
preferred label: Kolmiloikka @fi

shot put
type: Concept
broader: athletics, track and field
definition: Competitors stand in a circle with a 2.13 metres diameter and attempt to throw a metal ball weighing 7.26 kg for men and 4kg for women as far as possible. The longest throw wins.
in scheme: IPTC NewsCodes: Subject Code
notation: 15005023
preferred label: Kuulantyöntö @fi

discus throw
type: Concept
broader: athletics, track and field
definition: Competitors stand in a netted circle with a 2.50 metres diameter and with a turning motion attempt to throw a discus weighing 2kg for men and 1kg for women as far as possible. The longest throw wins.
in scheme: IPTC NewsCodes: Subject Code
notation: 15005024
preferred label: Kiekonheitto @fi

hammer throw
type: Concept
broader: athletics, track and field
definition: Competitors throw a hammer consisting of a metal ball, chain and handle as far as they can from a netted circle which is 2.13 metres in diameter. The hammer weighs 7.26 kg for men and 4 kg for women.
in scheme: IPTC NewsCodes: Subject Code
notation: 15005025
preferred label: Moukarinheitto @fi

javelin throw
type: Concept
broader: athletics, track and field
definition: Competitors in a specially-designated throwing area attempt to fling a spear-like javelin as far as possible. The javelin weighs 800 grammes for men and 600 grammes for women.
in scheme: IPTC NewsCodes: Subject Code
notation: 15005026
preferred label: Keihäänheitto @fi

decathlon
type: Concept
broader: athletics, track and field
definition: Individual men's competition which involves accumulating points in 10 different disciplines over two days: 1st day - 100m, long-jump, shot-putt, high-jump, 400m. 2nd day - 110m hurdles, discus, pole-vault, javelin and 1,500 metres.
in scheme: IPTC NewsCodes: Subject Code
notation: 15005027
preferred label: Kymmenottelu @fi

4x100 m
type: Concept
broad match: http://cv.iptc.org/newscodes/mediatopic/20000842
broader: athletics, track and field
definition: Team race involving four runners each covering 100 metres.
in scheme: IPTC NewsCodes: Subject Code
notation: 15005028
preferred label: Viestijuoksu 4x100 m @fi

4x200 m
type: Concept
broad match: http://cv.iptc.org/newscodes/mediatopic/20000842
broader: athletics, track and field
definition: Team race involving four runners each covering 200 metres.
in scheme: IPTC NewsCodes: Subject Code
notation: 15005029
preferred label: Viestijuoksu 4x200 m @fi

4x400 m
type: Concept
broad match: http://cv.iptc.org/newscodes/mediatopic/20000842
broader: athletics, track and field
definition: Team race involving four runners each covering 400 metres.
in scheme: IPTC NewsCodes: Subject Code
notation: 15005030
preferred label: Viestijuoksu 4x400 m @fi

4x800 m
type: Concept
broad match: http://cv.iptc.org/newscodes/mediatopic/20000842
broader: athletics, track and field
definition: Team race involving four runners each covering 800 metres.
in scheme: IPTC NewsCodes: Subject Code
notation: 15005031
preferred label: Viestijuoksu 4x800 m @fi

4x1500 m
type: Concept
broad match: http://cv.iptc.org/newscodes/mediatopic/20000842
broader: athletics, track and field
definition: Team race involving four runners each covering 1500 metres.
in scheme: IPTC NewsCodes: Subject Code
notation: 15005032
preferred label: Viestijuoksu 4x1500 m @fi

walk 1 h
type: Concept
broad match: http://cv.iptc.org/newscodes/mediatopic/20000841
broader: athletics, track and field
definition: One-hour long race where competitors must maintain at least one foot in contact with the ground and are not allowed to run.
in scheme: IPTC NewsCodes: Subject Code
notation: 15005033
preferred label: Kävelykilpailu 1 t @fi

walk 2 h
type: Concept
broad match: http://cv.iptc.org/newscodes/mediatopic/20000841
broader: athletics, track and field
definition: Two-hour long walking race where competitors must maintain at least one foot in contact with the ground and are not allowed to run.
in scheme: IPTC NewsCodes: Subject Code
notation: 15005034
preferred label: Kävelykilpailu 2 t @fi

10 km walk
type: Concept
broad match: http://cv.iptc.org/newscodes/mediatopic/20000841
broader: athletics, track and field
definition: Walking race over 10 kilometres where competitors must maintain at least one foot in contact with the ground and are not allowed to run.
in scheme: IPTC NewsCodes: Subject Code
notation: 15005035
preferred label: Kävelykilpailu 10 km @fi

15 km walk
type: Concept
broad match: http://cv.iptc.org/newscodes/mediatopic/20000841
broader: athletics, track and field
definition: Walking race over 15 kilometres where competitors must maintain at least one foot in contact with the ground and are not allowed to run.
in scheme: IPTC NewsCodes: Subject Code
notation: 15005036
preferred label: Kävelykilpailu 15 km @fi

20 km walk
type: Concept
broad match: http://cv.iptc.org/newscodes/mediatopic/20000841
broader: athletics, track and field
definition: Walking race over 20 kilometres where competitors must maintain at least one foot in contact with the ground and are not allowed to run.
in scheme: IPTC NewsCodes: Subject Code
notation: 15005037
preferred label: Kävelykilpailu 20 km @fi

30 km walk
type: Concept
broad match: http://cv.iptc.org/newscodes/mediatopic/20000841
broader: athletics, track and field
definition: Walking race over 30 kilometres where competitors must maintain at least one foot in contact with the ground and are not allowed to run.
in scheme: IPTC NewsCodes: Subject Code
notation: 15005038
preferred label: Kävelykilpailu 30 km @fi

50 km walk
type: Concept
broad match: http://cv.iptc.org/newscodes/mediatopic/20000841
broader: athletics, track and field
definition: Walking race over 50 kilometres where competitors must maintain at least one foot in contact with the ground and are not allowed to run.
in scheme: IPTC NewsCodes: Subject Code
notation: 15005039
preferred label: Kävelykilpailu 50 km @fi

100 m hurdles
type: Concept
broad match: http://cv.iptc.org/newscodes/mediatopic/20000834
broader: athletics, track and field
definition: Sprint over a distance of 100 metres with competitors having to clear 10 hurdles placed in their way.
in scheme: IPTC NewsCodes: Subject Code
notation: 15005040
preferred label: Aitajuoksu 100 m @fi

5 km walk
type: Concept
broad match: http://cv.iptc.org/newscodes/mediatopic/20000841
broader: athletics, track and field
definition: Walking race over 5 kilometres where competitors must maintain at least one foot in contact with the ground and are not allowed to run.
in scheme: IPTC NewsCodes: Subject Code
notation: 15005041
preferred label: Kävely 5 km @fi

heptathlon
type: Concept
broader: athletics, track and field
definition: Individual women's competition involving seven separate disciplines over two days. 1st day - 100m hurdles, high-jump, shot-putt, 200 metres. 2nd day - long-jump, javelin, 800 metres.
in scheme: IPTC NewsCodes: Subject Code
notation: 15005042
preferred label: Seitsenottelu @fi

1500 m walk
type: Concept
broad match: http://cv.iptc.org/newscodes/mediatopic/20000841
broader: athletics, track and field
definition: Walking race over 1500 metres where competitors must maintain at least one foot in contact with the ground and are not allowed to run.
in scheme: IPTC NewsCodes: Subject Code
notation: 15005043
preferred label: Kävely 1500 m @fi

2000 m walk
type: Concept
broad match: http://cv.iptc.org/newscodes/mediatopic/20000841
broader: athletics, track and field
definition: Walking race over 2000 metres where competitors must maintain at least one foot in contact with the ground and are not allowed to run.
in scheme: IPTC NewsCodes: Subject Code
notation: 15005044
preferred label: Kävely 2000 m @fi

3000 m walk
type: Concept
broad match: http://cv.iptc.org/newscodes/mediatopic/20000841
broader: athletics, track and field
definition: Walking race over 3000 metres where competitors must maintain at least one foot in contact with the ground and are not allowed to run.
in scheme: IPTC NewsCodes: Subject Code
notation: 15005045
preferred label: Kävely 3000 m @fi

50 m
type: Concept
broad match: http://cv.iptc.org/newscodes/mediatopic/20000844
broader: athletics, track and field
definition: Short sprint race over 50 metres with the fastest time winning.
in scheme: IPTC NewsCodes: Subject Code
notation: 15005046
preferred label: Juoksu 50 m @fi

50 m hurdles
type: Concept
broad match: http://cv.iptc.org/newscodes/mediatopic/20000834
broader: athletics, track and field
definition: Short sprint race over 50 metres interspersed with hurdles.
in scheme: IPTC NewsCodes: Subject Code
notation: 15005047
preferred label: Aitajuoksu 50 m @fi

50 yards
type: Concept
broad match: http://cv.iptc.org/newscodes/mediatopic/20000844
broader: athletics, track and field
definition: Short sprint race over 50 yards with the fastest time winning.
in scheme: IPTC NewsCodes: Subject Code
notation: 15005048

50 yard hurdles
type: Concept
broad match: http://cv.iptc.org/newscodes/mediatopic/20000834
broader: athletics, track and field
definition: Short sprint race over 50 yards interspersed with hurdles.
in scheme: IPTC NewsCodes: Subject Code
notation: 15005049

60 m
type: Concept
broad match: http://cv.iptc.org/newscodes/mediatopic/20000844
broader: athletics, track and field
definition: Short sprint race over 60 metres with the fastest time winning.
in scheme: IPTC NewsCodes: Subject Code
notation: 15005050
preferred label: Juoksu 60 m @fi

60 m hurdles
type: Concept
broad match: http://cv.iptc.org/newscodes/mediatopic/20000834
broader: athletics, track and field
definition: Short sprint race over 60 metres interspersed with hurdles.
in scheme: IPTC NewsCodes: Subject Code
notation: 15005051
preferred label: Aitajuoksu 60 m @fi

60 yards
type: Concept
broad match: http://cv.iptc.org/newscodes/mediatopic/20000844
broader: athletics, track and field
definition: Short sprint race over 60 yards with the fastest time winning.
in scheme: IPTC NewsCodes: Subject Code
notation: 15005052

60 yard hurdles
type: Concept
broad match: http://cv.iptc.org/newscodes/mediatopic/20000834
broader: athletics, track and field
definition: Short sprint race over 60 yards interspersed with hurdles.
in scheme: IPTC NewsCodes: Subject Code
notation: 15005053

100 yards
type: Concept
broad match: http://cv.iptc.org/newscodes/mediatopic/20000844
broader: athletics, track and field
definition: Sprint race over 100 yards with the fastest time winning.
in scheme: IPTC NewsCodes: Subject Code
notation: 15005054

100 yard hurdles
type: Concept
broad match: http://cv.iptc.org/newscodes/mediatopic/20000834
broader: athletics, track and field
definition: Sprint race over 100 yards interspersed with hurdles.
in scheme: IPTC NewsCodes: Subject Code
notation: 15005055

300 m
type: Concept
broad match: http://cv.iptc.org/newscodes/mediatopic/20000844
broader: athletics, track and field
definition: Race over 300 metres with the fastest time winning.
in scheme: IPTC NewsCodes: Subject Code
notation: 15005056
preferred label: Juoksu 300 m @fi

300 yards
type: Concept
broad match: http://cv.iptc.org/newscodes/mediatopic/20000844
broader: athletics, track and field
definition: Race over 300 yards with the fastest time winning.
in scheme: IPTC NewsCodes: Subject Code
notation: 15005057

440 yards
type: Concept
broad match: http://cv.iptc.org/newscodes/mediatopic/20000838
broader: athletics, track and field
definition: Race over 440 yards with the fastest time winning.
in scheme: IPTC NewsCodes: Subject Code
notation: 15005058

500 m
type: Concept
broad match: http://cv.iptc.org/newscodes/mediatopic/20000838
broader: athletics, track and field
definition: Race over 500 metres with the fastest time winning.
in scheme: IPTC NewsCodes: Subject Code
notation: 15005059
preferred label: Juoksu 500 m @fi

500 yards
type: Concept
broad match: http://cv.iptc.org/newscodes/mediatopic/20000838
broader: athletics, track and field
definition: Race over 500 yards with the fastest time winning.
in scheme: IPTC NewsCodes: Subject Code
notation: 15005060

600 m
type: Concept
broad match: http://cv.iptc.org/newscodes/mediatopic/20000838
broader: athletics, track and field
definition: Race over 600 metres with the fastest time winning.
in scheme: IPTC NewsCodes: Subject Code
notation: 15005061
preferred label: Juoksu 600 m @fi

600 yards
type: Concept
broad match: http://cv.iptc.org/newscodes/mediatopic/20000838
broader: athletics, track and field
definition: Race over 600 yards with the fastest time winning.
in scheme: IPTC NewsCodes: Subject Code
notation: 15005062

880 yards
type: Concept
broad match: http://cv.iptc.org/newscodes/mediatopic/20000838
broader: athletics, track and field
definition: Race over 880 yards with the fastest time winning.
in scheme: IPTC NewsCodes: Subject Code
notation: 15005063

1000 yards
type: Concept
broad match: http://cv.iptc.org/newscodes/mediatopic/20000838
broader: athletics, track and field
definition: Race over 1000 yards with the fastest time winning.
in scheme: IPTC NewsCodes: Subject Code
notation: 15005064

2 miles
type: Concept
broad match: http://cv.iptc.org/newscodes/mediatopic/20000836
broader: athletics, track and field
definition: Race over two miles with the fastest time winning.
in scheme: IPTC NewsCodes: Subject Code
notation: 15005065
preferred label: Juoksu 2 mailia @fi

3 miles
type: Concept
broad match: http://cv.iptc.org/newscodes/mediatopic/20000836
broader: athletics, track and field
definition: Race over three miles with the fastest time winning.
in scheme: IPTC NewsCodes: Subject Code
notation: 15005066
preferred label: Juoksu 3 mailia @fi

6 miles
type: Concept
broad match: http://cv.iptc.org/newscodes/mediatopic/20000836
broader: athletics, track and field
definition: Race over six miles with the fastest time winning.
in scheme: IPTC NewsCodes: Subject Code
notation: 15005067
preferred label: Juoksu 6 mailia @fi

4x1 mile
type: Concept
broad match: http://cv.iptc.org/newscodes/mediatopic/20000842
broader: athletics, track and field
definition: Team Relay race with four runners on each team running for one mile.
in scheme: IPTC NewsCodes: Subject Code
notation: 15005068
preferred label: Viestijuoksu 4x1 maili @fi

pentathlon
type: Concept
broader: athletics, track and field
definition: Only indoor, 60m hurdles, high jump, shot put, long jump, 800 m
definition: Vain sisätiloissa: 60m aidat, korkeyshyppy, kuula, pituushyppy, juoksu 800m @fi
in scheme: IPTC NewsCodes: Subject Code
notation: 15005069
preferred label: Viisiottelu @fi

badminton
type: Concept
broader: sport
definition: Two players or two teams of two compete by hitting a shuttlecock weighing approximately five grams over a high net. The aim for each player/team is to prevent the shuttlecock landing on their side of the court.
in scheme: IPTC NewsCodes: Subject Code
notation: 15006000
preferred label: Sulkapallo @fi

Major League Baseball (North American Professional) - American League
type: Concept
broad match: http://cv.iptc.org/newscodes/mediatopic/20000849
broader: baseball
definition: Baseball league comprising 14 teams.
in scheme: IPTC NewsCodes: Subject Code
notation: 15007001

Major League Baseball (North American Professional) - National League
type: Concept
broad match: http://cv.iptc.org/newscodes/mediatopic/20000849
broader: baseball
definition: Baseball league comprising 16 teams.
in scheme: IPTC NewsCodes: Subject Code
notation: 15007002

Major League Baseball (North American Professional) - Special (e.g. All-Star, World Series)
type: Concept
broad match: http://cv.iptc.org/newscodes/mediatopic/20000849
broader: baseball
definition: Baseball competition other than the World Series.
in scheme: IPTC NewsCodes: Subject Code
notation: 15007003

rubberball baseball
type: Concept
broader: baseball
definition: Sometimes called ''soft baseball,'' the game is played with a rubber baseball of varying degrees of hardness depending upon the age and level of the players.
in scheme: IPTC NewsCodes: Subject Code
notation: 15007004

Major League Baseball Playoffs
type: Concept
broad match: http://cv.iptc.org/newscodes/mediatopic/20000849
broader: baseball
definition: Consists of several rounds of play to determine representatives to the U.S.-based World Series
definition: Koostuu useista pelikierroksista, joiden avulla selvitetään mitkä joukkueet pelaavat Yhdysvaltain World Series -sarjassa @fi
in scheme: IPTC NewsCodes: Subject Code
notation: 15007005

World Series
type: Concept
broad match: http://cv.iptc.org/newscodes/mediatopic/20000849
broader: baseball
definition: U.S.-based annual series of games between the top two teams of Major League Baseball to determine the overall champion
definition: Yhdysvaltain Major League Baseball -sarjan kahden parhaan joukkueen välinen mestaruusottelusarja @fi
in scheme: IPTC NewsCodes: Subject Code
notation: 15007006

National Basketball Association (North American Professional)
type: Concept
broad match: http://cv.iptc.org/newscodes/mediatopic/20000851
broader: basketball
definition: The NBA is the umbrella organisation running professional basketball in the United States. The NBA is made up of two conferences (east and west), four divisions (Atlantic and Central for the East, and Midwest and Pacific for the west).
in scheme: IPTC NewsCodes: Subject Code
notation: 15008001
preferred label: NBA @fi

professional - Women general
type: Concept
broad match: http://cv.iptc.org/newscodes/mediatopic/20000851
broader: basketball
definition: Women's professional league
in scheme: IPTC NewsCodes: Subject Code
notation: 15008002

Swiss netball
type: Concept
broad match: http://cv.iptc.org/newscodes/mediatopic/20001010
broader: basketball
definition: Similar to Basketball. Basket without a board. Mainly executed by women
definition: Samantyyppinen peli kuin koripallo, kori ilman takalevyä. Pääasiassa naiset pelaavat. @fi
in scheme: IPTC NewsCodes: Subject Code
notation: 15008003
preferred label: Sveitsiläinen verkkopallo @fi

German netball
type: Concept
alternative label: Hollantilainen verkkopallo @fi
broad match: http://cv.iptc.org/newscodes/mediatopic/20001010
broader: basketball
definition: Same as Swiss Netball, but with specific German rules
definition: Sama kuin Sveitsiläinen verkkopallo, mutta hollantilaisilla säännöillä. @fi
definition: Sama kuin Sveitsiläinen verkkopallo, mutta saksalaisilla säännöillä. @fi
in scheme: IPTC NewsCodes: Subject Code
notation: 15008004
preferred label: Saksalainen verkkopallo @fi

Dutch netball
type: Concept
broad match: http://cv.iptc.org/newscodes/mediatopic/20001010
broader: basketball
definition: Same as Swiss Netball, but with specific Dutch rule
in scheme: IPTC NewsCodes: Subject Code
notation: 15008005

7.5 km
type: Concept
broad match: http://cv.iptc.org/newscodes/mediatopic/20000852
broader: biathlon
definition: Timed cross country skiing race. Competitors set off at 30sec intervals for three circuits totalling 7.5km.
in scheme: IPTC NewsCodes: Subject Code
notation: 15009001

10 km
type: Concept
broad match: http://cv.iptc.org/newscodes/mediatopic/20000852
broader: biathlon
definition: Sprint races for men, pursuit for women.
in scheme: IPTC NewsCodes: Subject Code
notation: 15009002

15 km
type: Concept
broad match: http://cv.iptc.org/newscodes/mediatopic/20000852
broader: biathlon
definition: Individual women's race in sprint format staged over three laps with competitors setting off at intervals of a minute.
in scheme: IPTC NewsCodes: Subject Code
notation: 15009003

20 km
type: Concept
broad match: http://cv.iptc.org/newscodes/mediatopic/20000852
broader: biathlon
definition: Individual men's race in sprint format staged over five laps with competitors setting off at intervals of a minute.
in scheme: IPTC NewsCodes: Subject Code
notation: 15009004

4x7.5 km relay
type: Concept
broad match: http://cv.iptc.org/newscodes/mediatopic/20000852
broader: biathlon
definition: Teams consisting of four biathletes with each team covering a distance of 7.5km with two rounds of target shooting.
in scheme: IPTC NewsCodes: Subject Code
notation: 15009005

12.5 km pursuit
type: Concept
broad match: http://cv.iptc.org/newscodes/mediatopic/20000852
broader: biathlon
definition: The start is determined by the results from the sprint. A race held over five laps with target shooting (standing or prone)
in scheme: IPTC NewsCodes: Subject Code
notation: 15009006

8 ball
type: Concept
broad match: http://cv.iptc.org/newscodes/mediatopic/20001015
broader: billiards, snooker and pool
definition: A game using 15 balls and a white. The first player aims to pot the balls numbered 1-7 (solids) with the second player potting balls 9-15 (stripes). After that the first player to pot the black wins.
in scheme: IPTC NewsCodes: Subject Code
notation: 15010001

9 ball
type: Concept
broad match: http://cv.iptc.org/newscodes/mediatopic/20001015
broader: billiards, snooker and pool
definition: A game played with nine balls numbered 1-9, and a white. On each turn the player must hit the lowest numbered ball.
in scheme: IPTC NewsCodes: Subject Code
notation: 15010002

14.1
type: Concept
broad match: http://cv.iptc.org/newscodes/mediatopic/20001015
broader: billiards, snooker and pool
definition: A player nominates the ball he is attempting to pot and into which pocket. He collects points for each successful hit. He continues until he makes a mistake. Before hitting the 15th ball, the 14 reds are set up again in the triangle.
in scheme: IPTC NewsCodes: Subject Code
notation: 15010003

continuous-DEPRECATED
type: Concept
broader: billiards, snooker and pool
definition: NA
in scheme: IPTC NewsCodes: Subject Code
notation: 15010004

other-DEPRECATED
type: Concept
broader: billiards, snooker and pool
definition: NA
in scheme: IPTC NewsCodes: Subject Code
notation: 15010005

snooker
type: Concept
broader: billiards, snooker and pool
definition: Two players using a cue and a white ball to "sink" other coloured balls in a correct order on a baize table and to cause an opponent to miss-hit by positioning the white ball in an inappropriate place - snookering.
in scheme: IPTC NewsCodes: Subject Code
notation: 15010006

two-man sled
type: Concept
broad match: http://cv.iptc.org/newscodes/mediatopic/20000854
broader: bobsleigh
definition: race consisting of a team of two competitors
in scheme: IPTC NewsCodes: Subject Code
notation: 15011001

four-man sled
type: Concept
broad match: http://cv.iptc.org/newscodes/mediatopic/20000854
broader: bobsleigh
definition: race consisting of a team of four competitors
in scheme: IPTC NewsCodes: Subject Code
notation: 15011002

bowling
type: Concept
broader: sport
definition: A game in which a player scores points by trying to knock down ten 'pins' using a ball - if unsuccessful the player has a second attempt. A game consists of ten frames.
in scheme: IPTC NewsCodes: Subject Code
notation: 15012000
preferred label: Keilailu @fi

bowls and petanque
type: Concept
broader: sport
definition: A game in which players throw bowls at a target, the winner being the player who lands closest.
in scheme: IPTC NewsCodes: Subject Code
notation: 15013000
preferred label: Petankki @fi

super-heavyweight
type: Concept
broad match: http://cv.iptc.org/newscodes/mediatopic/20000856
broader: boxing
definition: Weight category in boxing which varies according to the federation
in scheme: IPTC NewsCodes: Subject Code
notation: 15014001

heavyweight
type: Concept
broad match: http://cv.iptc.org/newscodes/mediatopic/20000856
broader: boxing
definition: Weight category in boxing which varies according to the federation
in scheme: IPTC NewsCodes: Subject Code
notation: 15014002

cruiserweight
type: Concept
broad match: http://cv.iptc.org/newscodes/mediatopic/20000856
broader: boxing
definition: Weight category in boxing which varies according to the federation
in scheme: IPTC NewsCodes: Subject Code
notation: 15014003

light-heavyweight
type: Concept
broad match: http://cv.iptc.org/newscodes/mediatopic/20000856
broader: boxing
definition: Weight category in boxing which varies according to the federation
in scheme: IPTC NewsCodes: Subject Code
notation: 15014004

super-middleweight
type: Concept
broad match: http://cv.iptc.org/newscodes/mediatopic/20000856
broader: boxing
definition: Weight category in boxing which varies according to the federation
in scheme: IPTC NewsCodes: Subject Code
notation: 15014005

middleweight
type: Concept
broad match: http://cv.iptc.org/newscodes/mediatopic/20000856
broader: boxing
definition: Weight category in boxing which varies according to the federation
in scheme: IPTC NewsCodes: Subject Code
notation: 15014006

light-middleweight
type: Concept
broad match: http://cv.iptc.org/newscodes/mediatopic/20000856
broader: boxing
definition: Weight category in boxing which varies according to the federation
in scheme: IPTC NewsCodes: Subject Code
notation: 15014007

welterweight
type: Concept
broad match: http://cv.iptc.org/newscodes/mediatopic/20000856
broader: boxing
definition: Weight category in boxing which varies according to the federation
in scheme: IPTC NewsCodes: Subject Code
notation: 15014008

light-welterweight
type: Concept
broad match: http://cv.iptc.org/newscodes/mediatopic/20000856
broader: boxing
definition: Weight category in boxing which varies according to the federation
in scheme: IPTC NewsCodes: Subject Code
notation: 15014009

lightweight
type: Concept
broad match: http://cv.iptc.org/newscodes/mediatopic/20000856
broader: boxing
definition: Weight category in boxing which varies according to the federation
in scheme: IPTC NewsCodes: Subject Code
notation: 15014010

super-featherweight
type: Concept
broad match: http://cv.iptc.org/newscodes/mediatopic/20000856
broader: boxing
definition: Weight category in boxing which varies according to the federation
in scheme: IPTC NewsCodes: Subject Code
notation: 15014011

featherweight
type: Concept
broad match: http://cv.iptc.org/newscodes/mediatopic/20000856
broader: boxing
definition: Weight category in boxing which varies according to the federation
in scheme: IPTC NewsCodes: Subject Code
notation: 15014012

super-bantamweight
type: Concept
broad match: http://cv.iptc.org/newscodes/mediatopic/20000856
broader: boxing
definition: Weight category in boxing which varies according to the federation
in scheme: IPTC NewsCodes: Subject Code
notation: 15014013

bantamweight
type: Concept
broad match: http://cv.iptc.org/newscodes/mediatopic/20000856
broader: boxing
definition: Weight category in boxing which varies according to the federation
in scheme: IPTC NewsCodes: Subject Code
notation: 15014014

super-flyweight
type: Concept
broad match: http://cv.iptc.org/newscodes/mediatopic/20000856
broader: boxing
definition: Weight category in boxing which varies according to the federation
in scheme: IPTC NewsCodes: Subject Code
notation: 15014015

flyweight
type: Concept
broad match: http://cv.iptc.org/newscodes/mediatopic/20000856
broader: boxing
definition: Weight category in boxing which varies according to the federation
in scheme: IPTC NewsCodes: Subject Code
notation: 15014016

light flyweight
type: Concept
broad match: http://cv.iptc.org/newscodes/mediatopic/20000856
broader: boxing
definition: Weight category in boxing which varies according to the federation
in scheme: IPTC NewsCodes: Subject Code
notation: 15014017

straw
type: Concept
broad match: http://cv.iptc.org/newscodes/mediatopic/20000856
broader: boxing
definition: Weight category in boxing which varies according to the federation
in scheme: IPTC NewsCodes: Subject Code
notation: 15014018

IBF
type: Concept
broad match: http://cv.iptc.org/newscodes/mediatopic/20000856
broader: boxing
definition: International boxing federation
in scheme: IPTC NewsCodes: Subject Code
notation: 15014019

WBA
type: Concept
broad match: http://cv.iptc.org/newscodes/mediatopic/20000856
broader: boxing
definition: World boxing association
in scheme: IPTC NewsCodes: Subject Code
notation: 15014020

WBC
type: Concept
broad match: http://cv.iptc.org/newscodes/mediatopic/20000856
broader: boxing
definition: World boxing council
in scheme: IPTC NewsCodes: Subject Code
notation: 15014021

WBO
type: Concept
broad match: http://cv.iptc.org/newscodes/mediatopic/20000856
broader: boxing
definition: World boxing organisation
in scheme: IPTC NewsCodes: Subject Code
notation: 15014022

French boxing
type: Concept
broad match: http://cv.iptc.org/newscodes/mediatopic/20000856
broader: boxing
definition: Combat sport in which kicking with all parts of the feet are permitted and punching with the front of the fist is also allowed
in scheme: IPTC NewsCodes: Subject Code
notation: 15014023

Thai boxing
type: Concept
broad match: http://cv.iptc.org/newscodes/mediatopic/20000856
broader: boxing
definition: Form of boxing involving punches with fists, feet, knees, elbows and legs.
in scheme: IPTC NewsCodes: Subject Code
notation: 15014024

Slalom
type: Concept
broader: canoeing and kayaking
definition: White water course set out with gates consisting of two poles suspended vertically over the water. Competitors must negotiate the gates or face penalties
in scheme: IPTC NewsCodes: Subject Code
notation: 15015001

200 m
type: Concept
broader: canoeing and kayaking
definition: race held over 200m
in scheme: IPTC NewsCodes: Subject Code
notation: 15015002

500 m
type: Concept
broader: canoeing and kayaking
definition: race held over 500m
in scheme: IPTC NewsCodes: Subject Code
notation: 15015003

1000 m
type: Concept
broader: canoeing and kayaking
definition: race held over 1000m
in scheme: IPTC NewsCodes: Subject Code
notation: 15015004

K1
type: Concept
broad match: http://cv.iptc.org/newscodes/mediatopic/20000979
broader: canoeing and kayaking
definition: an enclosed boat with the competitor sitting on a fixed seat for one person using a double bladed paddle
in scheme: IPTC NewsCodes: Subject Code
notation: 15015005

K2
type: Concept
broad match: http://cv.iptc.org/newscodes/mediatopic/20000979
broader: canoeing and kayaking
definition: an enclosed boat with the competitor sitting on a fixed seat for two people using double bladed paddles.
in scheme: IPTC NewsCodes: Subject Code
notation: 15015006

K4
type: Concept
broad match: http://cv.iptc.org/newscodes/mediatopic/20000979
broader: canoeing and kayaking
definition: an enclosed boat with the competitor sitting on a fixed seat for four people using double bladed paddles.
in scheme: IPTC NewsCodes: Subject Code
notation: 15015007

C1
type: Concept
broad match: http://cv.iptc.org/newscodes/mediatopic/20000877
broader: canoeing and kayaking
definition: One-seater canoe (open boat with competitor using a single bladed paddle.
in scheme: IPTC NewsCodes: Subject Code
notation: 15015008

C2
type: Concept
broad match: http://cv.iptc.org/newscodes/mediatopic/20000877
broader: canoeing and kayaking
definition: Two-seater canoe (open boat) - competitors use a single bladed paddle.
in scheme: IPTC NewsCodes: Subject Code
notation: 15015009

C4
type: Concept
broad match: http://cv.iptc.org/newscodes/mediatopic/20000877
broader: canoeing and kayaking
definition: Four-seater canoe (open boat) with each competitor using a single bladed paddle.
in scheme: IPTC NewsCodes: Subject Code
notation: 15015010

canoe sailing
type: Concept
broader: canoeing and kayaking
definition: A race involving a canoe equipped with a sail.
in scheme: IPTC NewsCodes: Subject Code
notation: 15015011

pontoniering
type: Concept
broader: canoeing and kayaking
definition: Team sport, military tradition, similar to canoe regatta, in boats
in scheme: IPTC NewsCodes: Subject Code
notation: 15015012

mountaineering
type: Concept
broader: climbing
definition: Alpine climbing
in scheme: IPTC NewsCodes: Subject Code
notation: 15016001
preferred label: Vuorikiipeily @fi

sport climbing
type: Concept
broader: climbing
definition: Sport climbing as a special category: individual competition, on an artificial wall with time measurement
definition: Yksilökilpailu keinotekoisella kiipeilyseinällä @fi
in scheme: IPTC NewsCodes: Subject Code
notation: 15016002
preferred label: Seinäkiipeily @fi

cricket
type: Concept
broader: sport
definition: Ball sport involving two teams of 11 players, balls, bats and wickets. The aim is to score as many runs as possible, and to get the opposing team 'out'. A 'run' involves a player running between two wickets. The opposing team try to get their rivals 'out'
in scheme: IPTC NewsCodes: Subject Code
notation: 15017000
preferred label: Kriketti @fi

icestock sport
type: Concept
broader: curling
definition: Similar to curling, played on targets on ice, different stones with straight handle and different rules, played in alpine countries
definition: Samantyyppinen laji kuin curling, jäällä olevalle maalialueille heitetään suorakahvaista kiveä, pelataan alppimaissa @fi
in scheme: IPTC NewsCodes: Subject Code
notation: 15018001
preferred label: Jääkolkka @fi

track
type: Concept
broader: cycling
definition: A race staged on a track in a velodrome
in scheme: IPTC NewsCodes: Subject Code
notation: 15019001
preferred label: Ratapyöräily @fi

pursuit
type: Concept
broader: cycling
definition: Two cyclists or teams set off from midway down opposite straights and try to make up the gap between them.
in scheme: IPTC NewsCodes: Subject Code
notation: 15019002

Olympic sprint
type: Concept
broader: cycling
definition: Qualifying race held over 200m. From the quarter-finals two cyclists go head-to-heads. By teams races consist of three cyclists from different countries.
in scheme: IPTC NewsCodes: Subject Code
notation: 15019003

sprint
type: Concept
broader: cycling
definition: Races between two cyclists over two or three laps, with a timed sprint finish over the last 200m.
in scheme: IPTC NewsCodes: Subject Code
notation: 15019004

Keirin
type: Concept
broader: cycling
definition: Sprint between six cyclists where a pacemaker on a moped gradually increases the pace over the first 1400m. When the pacemaker leaves the track the race develops into a sprint finish over the final 6-700m.
in scheme: IPTC NewsCodes: Subject Code
notation: 15019005

points race
type: Concept
broader: cycling
definition: Cyclists aim to complete the highest number of laps. Bonus points are picked up in intermediate sprints held every 2500m.
in scheme: IPTC NewsCodes: Subject Code
notation: 15019006

Madison race
type: Concept
broader: cycling
definition: A points race by teams comprising two cyclists in relay-format.
in scheme: IPTC NewsCodes: Subject Code
notation: 15019007

500 m time trial
type: Concept
broad match: http://cv.iptc.org/newscodes/mediatopic/20000900
broader: cycling
definition: Individual race against the clock over 500m for women.
in scheme: IPTC NewsCodes: Subject Code
notation: 15019008

1 km time trial
type: Concept
broad match: http://cv.iptc.org/newscodes/mediatopic/20000900
broader: cycling
definition: Individual race over 1000m against the clock for men.
in scheme: IPTC NewsCodes: Subject Code
notation: 15019009

one hour
type: Concept
broad match: http://cv.iptc.org/newscodes/mediatopic/20000892
broader: cycling
definition: Competitors aim to complete as many kilometres as possible in one hour.
in scheme: IPTC NewsCodes: Subject Code
notation: 15019010

road race
type: Concept
broader: cycling
definition: Road race with all the competitor starting en masse.
in scheme: IPTC NewsCodes: Subject Code
notation: 15019011
preferred label: Maantiepyöräily @fi

road time trial
type: Concept
broader: cycling
definition: A race or stage against the clock with each cyclist setting off individually.
in scheme: IPTC NewsCodes: Subject Code
notation: 15019012

staging race
type: Concept
broader: cycling
definition: A race disputed by teams with the classifications determined by the combined times over a day.
in scheme: IPTC NewsCodes: Subject Code
notation: 15019013

cyclo-cross
type: Concept
broader: cycling
definition: Staged on various surfaces - earth, grass, sand or tarmac.
in scheme: IPTC NewsCodes: Subject Code
notation: 15019014

Vtt
type: Concept
broader: cycling
definition: Mountain bikes
in scheme: IPTC NewsCodes: Subject Code
notation: 15019015
preferred label: Maastopyöräily @fi

Vtt-cross
type: Concept
broad match: http://cv.iptc.org/newscodes/mediatopic/20000903
broader: cycling
definition: An endurance race on mountain bikes around a 10km circuit over various terrain and with different degrees of slopes. Competitors are not allowed any exterior help.
in scheme: IPTC NewsCodes: Subject Code
notation: 15019016

Vtt-downhill
type: Concept
broad match: http://cv.iptc.org/newscodes/mediatopic/20000903
broader: cycling
definition: Individual mountain bike race against the clock staged on a downhill circuit featuring obstacles.
in scheme: IPTC NewsCodes: Subject Code
notation: 15019017

bi-crossing
type: Concept
broader: cycling
definition: A race where competitors have to cover a circuit with obstacles as quickly as possible.
in scheme: IPTC NewsCodes: Subject Code
notation: 15019018

trial
type: Concept
broad match: http://cv.iptc.org/newscodes/mediatopic/20000903
broader: cycling
definition: A timed race in which competitors on mountain bikes must negotiate tricky terrain and obstacles without putting their feet down.
in scheme: IPTC NewsCodes: Subject Code
notation: 15019019

artistic cycling
type: Concept
broader: cycling
definition: Individual or teams on one or two bicycles in an arena. Points are awarded by a jury.
in scheme: IPTC NewsCodes: Subject Code
notation: 15019020

cycle ball
type: Concept
broader: cycling
definition: Competitive team sport using bicycles. One team against another with two persons per team. The aim is for competitors to move the ball using the front and rear wheels without letting their feet touch the ground.
in scheme: IPTC NewsCodes: Subject Code
notation: 15019021

dancing
type: Concept
broader: sport
definition: Dancing competition where couples are judged on technique and interpretation.
in scheme: IPTC NewsCodes: Subject Code
notation: 15020000
preferred label: Tanssiurheilu @fi

10 m platform
type: Concept
broad match: http://cv.iptc.org/newscodes/mediatopic/20000914
broader: diving
definition: Divers take off from a ten metre high platform.
in scheme: IPTC NewsCodes: Subject Code
notation: 15021001

10 m platform synchronised
type: Concept
broad match: http://cv.iptc.org/newscodes/mediatopic/20000916
broader: diving
definition: Two competitors from the same team dive off at the same time from separate platforms. As well as being judged on the standard criteria they are also awarded marks for synchronisation.
in scheme: IPTC NewsCodes: Subject Code
notation: 15021002

3 m springboard
type: Concept
broad match: http://cv.iptc.org/newscodes/mediatopic/20000915
broader: diving
definition: Divers dive from a three-metre high springboard.
in scheme: IPTC NewsCodes: Subject Code
notation: 15021003

3 m springboard synchronised
type: Concept
broad match: http://cv.iptc.org/newscodes/mediatopic/20000916
broader: diving
definition: Two competitors from the same team dive off at the same time from separate three-metre high springboards. As well as being judged on the standard criteria they are also awarded marks for synchronisation.
in scheme: IPTC NewsCodes: Subject Code
notation: 15021004

subaquatics
type: Concept
broader: diving
definition: Sports like hockey held under water
in scheme: IPTC NewsCodes: Subject Code
notation: 15021005

scuba diving
type: Concept
broader: diving
definition: Diving into different depths, with time measurement
definition: Sukeltamista eri syvyyksiin, aikaa mitataan @fi
in scheme: IPTC NewsCodes: Subject Code
notation: 15021006
preferred label: Urheilusukellus @fi

three-day event
type: Concept
broader: equestrian
definition: Equestrian event involving three disciplines - Dressage, cross-country and show jumping.
in scheme: IPTC NewsCodes: Subject Code
notation: 15022001

dressage
type: Concept
broader: equestrian
definition: A rider is judged on a series of moves at three different paces - walk, trot and gallop.
in scheme: IPTC NewsCodes: Subject Code
notation: 15022002
preferred label: Kouluratsastus @fi

jumping
type: Concept
broader: equestrian
definition: A rider and horse attempt to jump a series of obstacles in an enclosed arena against the clock.
in scheme: IPTC NewsCodes: Subject Code
notation: 15022003
preferred label: Esteratsastus @fi

cross country
type: Concept
broader: equestrian
definition: Equestrian event held on a designated circuit in the countryside featuring artificial and natural obstacles.
in scheme: IPTC NewsCodes: Subject Code
notation: 15022004
preferred label: Maastoratsastus @fi

epee
type: Concept
broader: fencing
definition: category of fencing using a weapon with a triangular cross-section blade and a large bell guard.
in scheme: IPTC NewsCodes: Subject Code
notation: 15023001

foil
type: Concept
broader: fencing
definition: category of fencing using a weapon with a rectangular cross-section blade and a small bell guard.
in scheme: IPTC NewsCodes: Subject Code
notation: 15023002

sabre
type: Concept
broader: fencing
definition: a fencing weapon with a flat blade and knuckle guard used with cutting or thrusting moves.
in scheme: IPTC NewsCodes: Subject Code
notation: 15023003

roll hockey
type: Concept
broader: field Hockey
definition: Team sport similar to ice hockey, executed on 4 wheel roller skates with sticks and a ball
in scheme: IPTC NewsCodes: Subject Code
notation: 15024001

singles
type: Concept
broad match: http://cv.iptc.org/newscodes/mediatopic/20000934
broader: figure Skating
definition: The individual events comprise a short program which counts for 33.3% of the score, and the free skate which is worth 66.7%.
in scheme: IPTC NewsCodes: Subject Code
notation: 15025001
preferred label: Yksinluistelu @fi

pairs
type: Concept
broad match: http://cv.iptc.org/newscodes/mediatopic/20000934
broader: figure Skating
definition: The pairs event comprise a short program which counts for 33.3% of the score, and the free skate which is worth 66.7%.
in scheme: IPTC NewsCodes: Subject Code
notation: 15025002
preferred label: Pariluistelu @fi

ice dance
type: Concept
broader: figure Skating
definition: Takes place over three days with, in order, two compulsory dances, the original dance (2min 30sec) and the free dance (4min).
in scheme: IPTC NewsCodes: Subject Code
notation: 15025003
preferred label: Jäätanssi @fi

moguls
type: Concept
broad match: http://cv.iptc.org/newscodes/mediatopic/20001058
broader: freestyle Skiing
definition: Contestants attack a heavily moguled slope, performing technically challenging turns and jumps, while maintaining the most direct line from the top to the bottom of the hill.
in scheme: IPTC NewsCodes: Subject Code
notation: 15026001
preferred label: Kumparelasku @fi

aerials
type: Concept
broad match: http://cv.iptc.org/newscodes/mediatopic/20001058
broader: freestyle Skiing
definition: Competitors perform a series of aerial twists and turns from a prepared jump.
in scheme: IPTC NewsCodes: Subject Code
notation: 15026002
preferred label: Hypyt @fi

artistic skiing
type: Concept
broad match: http://cv.iptc.org/newscodes/mediatopic/20001058
broader: freestyle Skiing
definition: Competitors perform a series of artistic moves (jumps and twists) all set to music. The use of ski poles is permitted.
in scheme: IPTC NewsCodes: Subject Code
notation: 15026003
preferred label: Taitohiihto @fi

golf
type: Concept
broader: sport
definition: Competitors attempt to hit a small white ball with different clubs around a course of 18 holes varying in distance. The object is to make the fewest strokes possible.
in scheme: IPTC NewsCodes: Subject Code
notation: 15027000
preferred label: Golf @fi

floor exercise
type: Concept
broad match: http://cv.iptc.org/newscodes/mediatopic/20001152
broader: gymnastics
definition: A gymnastics floor exercise on a 12m/sq matt.
in scheme: IPTC NewsCodes: Subject Code
notation: 15028001

vault
type: Concept
broad match: http://cv.iptc.org/newscodes/mediatopic/20001152
broader: gymnastics
definition: gymnasts propel themselves by jumping on a trampoline after running quickly down a 25m lane
in scheme: IPTC NewsCodes: Subject Code
notation: 15028002

pommel horse
type: Concept
broad match: http://cv.iptc.org/newscodes/mediatopic/20001152
broader: gymnastics
definition: Gymnasts perform an uninterrupted swing motion over a handled horse using balance and strength.
in scheme: IPTC NewsCodes: Subject Code
notation: 15028003

uneven bars
type: Concept
broad match: http://cv.iptc.org/newscodes/mediatopic/20001152
broader: gymnastics
definition: Gymnasts run through an airborne routine swinging around and between the uneven bars.
in scheme: IPTC NewsCodes: Subject Code
notation: 15028004

parallel bars
type: Concept
broad match: http://cv.iptc.org/newscodes/mediatopic/20001152
broader: gymnastics
definition: Gymnasts swing and turn with guile and grace around the parallel bars.
in scheme: IPTC NewsCodes: Subject Code
notation: 15028005

horizontal bar
type: Concept
broad match: http://cv.iptc.org/newscodes/mediatopic/20001152
broader: gymnastics
definition: Gymnasts turn, spin and perform pirouettes around the horizontal bar.
in scheme: IPTC NewsCodes: Subject Code
notation: 15028006

rings
type: Concept
broad match: http://cv.iptc.org/newscodes/mediatopic/20001152
broader: gymnastics
definition: Gymnasts perform feats of balance and strength from two suspended rings.
in scheme: IPTC NewsCodes: Subject Code
notation: 15028007

beam
type: Concept
broad match: http://cv.iptc.org/newscodes/mediatopic/20001152
broader: gymnastics
definition: Gymnasts perform leaps and flips from the much feared balance beam just 10 cm wide.
in scheme: IPTC NewsCodes: Subject Code
notation: 15028008

rhythmic
type: Concept
broader: gymnastics
definition: A mixture of dance and gymnastic moves.
in scheme: IPTC NewsCodes: Subject Code
notation: 15028009

clubs
type: Concept
broad match: http://cv.iptc.org/newscodes/mediatopic/20000951
broader: gymnastics
definition: Dance and gymnastic moves whilst juggling clubs.
in scheme: IPTC NewsCodes: Subject Code
notation: 15028010

hoop
type: Concept
broad match: http://cv.iptc.org/newscodes/mediatopic/20000951
broader: gymnastics
definition: A hoop is rolled and thrown whilst performing a dance routine.
in scheme: IPTC NewsCodes: Subject Code
notation: 15028011

ribbon
type: Concept
broad match: http://cv.iptc.org/newscodes/mediatopic/20000951
broader: gymnastics
definition: Gymnasts work through a pre-arranged routine whilst manipulating a spectacular length of ribbon.
in scheme: IPTC NewsCodes: Subject Code
notation: 15028012

rope
type: Concept
broad match: http://cv.iptc.org/newscodes/mediatopic/20000951
broader: gymnastics
definition: Jump and figure movements are performed while a rope is manipulated.
in scheme: IPTC NewsCodes: Subject Code
notation: 15028013

ball
type: Concept
broad match: http://cv.iptc.org/newscodes/mediatopic/20000951
broader: gymnastics
definition: An exercise based on suppleness of the body using a ball.
in scheme: IPTC NewsCodes: Subject Code
notation: 15028014

trampoline
type: Concept
broader: gymnastics
definition: Competitors perform complicated twists and turns whilst bouncing on the trampoline.
in scheme: IPTC NewsCodes: Subject Code
notation: 15028015

handball (team)
type: Concept
broader: sport
definition: A ball game using the hands contested by two teams of seven trying to throw the ball into the opponents goal.
in scheme: IPTC NewsCodes: Subject Code
notation: 15029000
preferred label: Käsipallo @fi

flat racing
type: Concept
broader: horse racing, harness racing
definition: A horse race over a flat course.
in scheme: IPTC NewsCodes: Subject Code
notation: 15030001
preferred label: Laukkaurheilu @fi

steeple chase
type: Concept
broader: horse racing, harness racing
definition: A mounted horse race over at least eight classic obstacles, four of which must be different, such as the water jump, spruce fences, mud walls etc.
in scheme: IPTC NewsCodes: Subject Code
notation: 15030002

trotting
type: Concept
broader: horse racing, harness racing
definition: Horses pitched to a jockeyed buggy race in a trot round a flat course.
in scheme: IPTC NewsCodes: Subject Code
notation: 15030003
preferred label: Raviurheilu @fi

cross country
type: Concept
broad match: http://cv.iptc.org/newscodes/mediatopic/20000960
broader: horse racing, harness racing
definition: A long distance race including rustic obstacles such as real fences, streams and fallen trees.
in scheme: IPTC NewsCodes: Subject Code
notation: 15030004

National Hockey League (North American)
type: Concept
broad match: http://cv.iptc.org/newscodes/mediatopic/20000965
broader: ice hockey
definition: Teams from the US and Canada make up the North American continents top league.
in scheme: IPTC NewsCodes: Subject Code
notation: 15031001
preferred label: NHL @fi

sledge hockey
type: Concept
broader: ice hockey
definition: Like ice hockey but instead of skates small sledges are used. Competitors move by pushing with the arms
in scheme: IPTC NewsCodes: Subject Code
notation: 15031002

fronton
type: Concept
broad match: http://cv.iptc.org/newscodes/mediatopic/20000968
broader: Jai Alai (Pelota)
definition: The "fronton" known as "Fronton Place Libre" consists of a rectangular outdoor court plus a large pink shaped wall at one end. The two sides and the other end are left opened.
in scheme: IPTC NewsCodes: Subject Code
notation: 15032001

jai-alai
type: Concept
broad match: http://cv.iptc.org/newscodes/mediatopic/20000968
broader: Jai Alai (Pelota)
definition: A "Jaï-Alai" is an indoor fronton with a 56 meters long court which is used exclusively to play "chistera-ancha". Three walls are used in the game: the front, the back and the left hand wall.
in scheme: IPTC NewsCodes: Subject Code
notation: 15032002

left wall
type: Concept
broad match: http://cv.iptc.org/newscodes/mediatopic/20000968
broader: Jai Alai (Pelota)
definition: A "fronton with left hand wall" is an indoor fronton with a 36 meters long court where Pala or Main Nue are played. Three walls are used in the game: the front, the back and the left hand wall.
in scheme: IPTC NewsCodes: Subject Code
notation: 15032003

trinquet
type: Concept
broad match: http://cv.iptc.org/newscodes/mediatopic/20000968
broader: Jai Alai (Pelota)
definition: A "Trinquet" is an indoor fronton with a 28.5 meters long court surrounded by four walls. The four walls are used in the game.
in scheme: IPTC NewsCodes: Subject Code
notation: 15032004

rebot
type: Concept
broad match: http://cv.iptc.org/newscodes/mediatopic/20000968
broader: Jai Alai (Pelota)
definition: The "rebot" is the game played in a fronton "place libre" with 5 players in each team. They use a "chistera" (56 cm long and 12 cm large) or bare hands.
in scheme: IPTC NewsCodes: Subject Code
notation: 15032005

chistera ancha
type: Concept
broad match: http://cv.iptc.org/newscodes/mediatopic/20000968
broader: Jai Alai (Pelota)
definition: The "chistera-ancha" also called the "cesta punta" is the game played in a "jaï alai" with 1 or 2 players in each team. The players use a long curved basket called the "chistera" (68 cm long and 13 cm wide).
in scheme: IPTC NewsCodes: Subject Code
notation: 15032006

chistera corta
type: Concept
broad match: http://cv.iptc.org/newscodes/mediatopic/20000968
broader: Jai Alai (Pelota)
definition: The "chistera-corta" is the game played in a fronton "place libre" with left hand wall and 3 players in each team. The players use a long curved basket called the "chistera" (56 cm long and 12 cm wide).
in scheme: IPTC NewsCodes: Subject Code
notation: 15032007

bare hand
type: Concept
broad match: http://cv.iptc.org/newscodes/mediatopic/20000968
broader: Jai Alai (Pelota)
definition: The "Main Nue" (bare hand) is the ancestor of all Basque sports.
in scheme: IPTC NewsCodes: Subject Code
notation: 15032008

pala-ancha
type: Concept
broad match: http://cv.iptc.org/newscodes/mediatopic/20000968
broader: Jai Alai (Pelota)
definition: The "pala-ancha" is the game played in a fronton "place libre" with 2 players in each team. The players use a heavy wooden bat "the pala" (50 cm long and 20 cm wide).
in scheme: IPTC NewsCodes: Subject Code
notation: 15032009

pala-corta
type: Concept
broad match: http://cv.iptc.org/newscodes/mediatopic/20000968
broader: Jai Alai (Pelota)
definition: The "pala-corta" is the game played in a fronton with left hand wall and 2 players in each team. The players use a heavy wooden bat the "pala-corta" (50 cm long and 10 cm wide). The "pala" is the name for a heavy wooden bat.
in scheme: IPTC NewsCodes: Subject Code
notation: 15032010

pasaka
type: Concept
broad match: http://cv.iptc.org/newscodes/mediatopic/20000968
broader: Jai Alai (Pelota)
definition: The "pasaka" is the name of the game played in a trinquet by teams of 2 players facing each other on each side of a net where the pelota is hit between opponents.
in scheme: IPTC NewsCodes: Subject Code
notation: 15032011

xare
type: Concept
broad match: http://cv.iptc.org/newscodes/mediatopic/20000968
broader: Jai Alai (Pelota)
definition: The "xare", is the name of the game played in a trinquet by teams of 2 players. The players use a "xare" (or the Argentina bat) 55 cm long and 16 cm wide.
in scheme: IPTC NewsCodes: Subject Code
notation: 15032012

heavyweight
type: Concept
broad match: http://cv.iptc.org/newscodes/mediatopic/20000974
broader: judo
definition: Weight categoriy in Judo: open but usually over 100kg for men and over 78kg for women
in scheme: IPTC NewsCodes: Subject Code
notation: 15033001

half-heavyweight
type: Concept
broad match: http://cv.iptc.org/newscodes/mediatopic/20000971
broader: judo
definition: Weight categoriy in Judo: up to 100kg for men and 78kg for women.
in scheme: IPTC NewsCodes: Subject Code
notation: 15033002

middleweight
type: Concept
broad match: http://cv.iptc.org/newscodes/mediatopic/20000976
broader: judo
definition: Weight categoriy in Judo: up to 90kg for men and 70kg for women.
in scheme: IPTC NewsCodes: Subject Code
notation: 15033003

half-middleweight
type: Concept
broad match: http://cv.iptc.org/newscodes/mediatopic/20000973
broader: judo
definition: Weight categoriy in Judo: up to 81kg for men and 63kg for women.
in scheme: IPTC NewsCodes: Subject Code
notation: 15033004

half-lightweight
type: Concept
broad match: http://cv.iptc.org/newscodes/mediatopic/20000972
broader: judo
definition: Weight categoriy in Judo: up to 73kg for men and 57kg for women.
in scheme: IPTC NewsCodes: Subject Code
notation: 15033005

lightweight
type: Concept
broad match: http://cv.iptc.org/newscodes/mediatopic/20000975
broader: judo
definition: Weight categoriy in Judo: up to 66kg for men and 52kg for women.
in scheme: IPTC NewsCodes: Subject Code
notation: 15033006

extra lightweight
type: Concept
broad match: http://cv.iptc.org/newscodes/mediatopic/20000970
broader: judo
definition: Weight categoriy in Judo: up to 60kg for men and 48kg for women.
in scheme: IPTC NewsCodes: Subject Code
notation: 15033007

sparring
type: Concept
broad match: http://cv.iptc.org/newscodes/mediatopic/20000983
broader: karate
definition: Boxing without competition, with padded helmets
in scheme: IPTC NewsCodes: Subject Code
notation: 15034001

formal exercise-DEPRECATED
type: Concept
broad match: http://cv.iptc.org/newscodes/mediatopic/20000983
broader: karate
definition: NA
in scheme: IPTC NewsCodes: Subject Code
notation: 15034002

lacrosse
type: Concept
broader: sport
definition: Two teams of helmeted and padded players try and outscore each other using a netted stick and hard ball.
in scheme: IPTC NewsCodes: Subject Code
notation: 15035000
preferred label: Lacrosse @fi

singles
type: Concept
broad match: http://cv.iptc.org/newscodes/mediatopic/20000987
broader: luge
definition: individual time trial event in a one seater luge
in scheme: IPTC NewsCodes: Subject Code
notation: 15036001

doubles
type: Concept
broad match: http://cv.iptc.org/newscodes/mediatopic/20000987
broader: luge
definition: time trial for a twin berth luge
in scheme: IPTC NewsCodes: Subject Code
notation: 15036002

marathon
type: Concept
broader: sport
definition: A road race where competitors run 42.195km, generally through city streets
in scheme: IPTC NewsCodes: Subject Code
notation: 15037000
preferred label: Maraton @fi

running
type: Concept
broad match: http://cv.iptc.org/newscodes/mediatopic/20000989
broader: modern pentathlon
definition: Pentathlon event
in scheme: IPTC NewsCodes: Subject Code
notation: 15038001

shooting
type: Concept
broad match: http://cv.iptc.org/newscodes/mediatopic/20000989
broader: modern pentathlon
definition: Pentathlon event
in scheme: IPTC NewsCodes: Subject Code
notation: 15038002

swimming
type: Concept
broad match: http://cv.iptc.org/newscodes/mediatopic/20000989
broader: modern pentathlon
definition: Pentathlon event
in scheme: IPTC NewsCodes: Subject Code
notation: 15038003

fencing
type: Concept
broad match: http://cv.iptc.org/newscodes/mediatopic/20000989
broader: modern pentathlon
definition: Pentathlon event
in scheme: IPTC NewsCodes: Subject Code
notation: 15038004

showjumping
type: Concept
broad match: http://cv.iptc.org/newscodes/mediatopic/20000989
broader: modern pentathlon
definition: Pentathlon event
in scheme: IPTC NewsCodes: Subject Code
notation: 15038005

Formula One
type: Concept
broader: motor racing
definition: Single cockpit car racing where 20 or so competitors race head to head over varied circuits around the world to win Grand Prix points in an individual and constructors championship
in scheme: IPTC NewsCodes: Subject Code
notation: 15039001
preferred label: Formula 1 @fi

F3000
type: Concept
broader: motor racing
definition: Using less powerful motors than the Formula One, designated construction teams race over varied circuits the world over in speed races for individual and team honours over a season.
in scheme: IPTC NewsCodes: Subject Code
notation: 15039002

endurance
type: Concept
broader: motor racing
definition: Endurance races for a driver and co-pilot using specially built cars.
in scheme: IPTC NewsCodes: Subject Code
notation: 15039003
preferred label: Endurance @fi

Indy
type: Concept
broader: motor racing
definition: North American top range professional league speed racing over circuits.
in scheme: IPTC NewsCodes: Subject Code
notation: 15039004

CART
type: Concept
broad match: http://cv.iptc.org/newscodes/mediatopic/20000991
broader: motor racing
definition: North American professional league speed racing.
in scheme: IPTC NewsCodes: Subject Code
notation: 15039005

NHRA
type: Concept
broad match: http://cv.iptc.org/newscodes/mediatopic/20000991
broader: motor racing
definition: North American professional league speed racing.
in scheme: IPTC NewsCodes: Subject Code
notation: 15039006

NASCAR
type: Concept
broad match: http://cv.iptc.org/newscodes/mediatopic/20000991
broader: motor racing
definition: North American professional league speed racing.
in scheme: IPTC NewsCodes: Subject Code
notation: 15039007

TRUCKI
type: Concept
broad match: http://cv.iptc.org/newscodes/mediatopic/20000991
broader: motor racing
definition: North American professional league speed racing.
in scheme: IPTC NewsCodes: Subject Code
notation: 15039008

rallying
type: Concept
broad match: http://cv.iptc.org/newscodes/mediatopic/20000997
broader: motor rallying
definition: Stage races
in scheme: IPTC NewsCodes: Subject Code
notation: 15040001

pursuit
type: Concept
broad match: http://cv.iptc.org/newscodes/mediatopic/20000997
broader: motor rallying
definition: Cross-country race with mass start, first half of the distance in classic and the other half in free style.
in scheme: IPTC NewsCodes: Subject Code
notation: 15040002

rallycross
type: Concept
broader: motor rallying
definition: Stage races over dirt tracks
in scheme: IPTC NewsCodes: Subject Code
notation: 15040003
preferred label: Rallicross @fi

speed-Grand-Prix
type: Concept
broad match: http://cv.iptc.org/newscodes/mediatopic/20000998
broader: motorcycling
definition: A fast and furious race where every second counts
in scheme: IPTC NewsCodes: Subject Code
notation: 15041001

enduro
type: Concept
broader: motorcycling
definition: A race of speed, endurance and regularity over varied surfaces such as through forests and on dirt tracks
in scheme: IPTC NewsCodes: Subject Code
notation: 15041002
preferred label: Enduro @fi

grass-track
type: Concept
broader: motorcycling
definition: A race competed on turf
in scheme: IPTC NewsCodes: Subject Code
notation: 15041003

moto-ball
type: Concept
broader: motorcycling
definition: Team sport where drivers play a ball
in scheme: IPTC NewsCodes: Subject Code
notation: 15041004

moto-cross
type: Concept
broader: motorcycling
definition: Raced over dirt tracks featuring severe mounds
in scheme: IPTC NewsCodes: Subject Code
notation: 15041005
preferred label: Motocross @fi

rallying
type: Concept
broader: motorcycling
definition: Races run over regular roads
in scheme: IPTC NewsCodes: Subject Code
notation: 15041006

trial
type: Concept
broader: motorcycling
definition: A race of consistency and endurance over varied terrain
in scheme: IPTC NewsCodes: Subject Code
notation: 15041007
preferred label: Trial @fi

endurance
type: Concept
broader: motorcycling
definition: A road race of consistency and endurance
in scheme: IPTC NewsCodes: Subject Code
notation: 15041008

superbike
type: Concept
broad match: http://cv.iptc.org/newscodes/mediatopic/20000998
broader: motorcycling
definition: Engine size
in scheme: IPTC NewsCodes: Subject Code
notation: 15041009

125 cm3
type: Concept
broad match: http://cv.iptc.org/newscodes/mediatopic/20000998
broader: motorcycling
definition: Engine size
in scheme: IPTC NewsCodes: Subject Code
notation: 15041010

250 cm3
type: Concept
broad match: http://cv.iptc.org/newscodes/mediatopic/20000998
broader: motorcycling
definition: Engine size
in scheme: IPTC NewsCodes: Subject Code
notation: 15041011

500 cm3
type: Concept
broad match: http://cv.iptc.org/newscodes/mediatopic/20000998
broader: motorcycling
definition: Engine size
in scheme: IPTC NewsCodes: Subject Code
notation: 15041012

side-cars
type: Concept
broader: motorcycling
definition: Of different engine sizes but attached to a side car featuring a passenger
in scheme: IPTC NewsCodes: Subject Code
notation: 15041013

motoGP
type: Concept
broader: motorcycling
definition: Capacity class 1000ccm
definition: Tilavuusluokka 1000cc @fi
in scheme: IPTC NewsCodes: Subject Code
notation: 15041014
preferred label: MotoGP @fi

netball
type: Concept
broader: sport
definition: A woman's sport similar to basketball without a board behind the basket
in scheme: IPTC NewsCodes: Subject Code
notation: 15042000
preferred label: Netball @fi

cross-country
type: Concept
broader: nordic skiing
definition: Nordic ski race
in scheme: IPTC NewsCodes: Subject Code
notation: 15043001
preferred label: Maastohiihto @fi

5 km classical time
type: Concept
broad match: http://cv.iptc.org/newscodes/mediatopic/20001060
broader: nordic skiing
definition: A 5km classic race in that the competitor keeps his skis parallel except on steep inclines where the scissor move is used
in scheme: IPTC NewsCodes: Subject Code
notation: 15043002

10 km classical style
type: Concept
broad match: http://cv.iptc.org/newscodes/mediatopic/20001060
broader: nordic skiing
definition: A 10km classic race in that the competitor keeps his skis parallel except on steep inclines where the scissor move is used
in scheme: IPTC NewsCodes: Subject Code
notation: 15043003

10 km pursuit free style
type: Concept
broad match: http://cv.iptc.org/newscodes/mediatopic/20001060
broader: nordic skiing
definition: Staggered start depending on positions with competitors using a skating like technique on skis
in scheme: IPTC NewsCodes: Subject Code
notation: 15043004

15 km classical style
type: Concept
broad match: http://cv.iptc.org/newscodes/mediatopic/20001060
broader: nordic skiing
definition: A 15km race using the classical style of keeping skies parallel
in scheme: IPTC NewsCodes: Subject Code
notation: 15043005

15 km pursuit free style
type: Concept
broad match: http://cv.iptc.org/newscodes/mediatopic/20001060
broader: nordic skiing
definition: 15km race with staggered start using free style technique similar to a skating motion
in scheme: IPTC NewsCodes: Subject Code
notation: 15043006

10 km + 15 km combined
type: Concept
broad match: http://cv.iptc.org/newscodes/mediatopic/20001060
broader: nordic skiing
definition: 10km classic followed by 15km free-style race
in scheme: IPTC NewsCodes: Subject Code
notation: 15043007

30 km classical style
type: Concept
broad match: http://cv.iptc.org/newscodes/mediatopic/20001060
broader: nordic skiing
definition: A 30km classic race in that the competitor keeps his skis parallel except on steep inclines where the scissor move is used
in scheme: IPTC NewsCodes: Subject Code
notation: 15043008

30km free style
type: Concept
broad match: http://cv.iptc.org/newscodes/mediatopic/20001060
broader: nordic skiing
definition: A 30km free-style race where the most common style is the skate style where competitors slide and the skis do not need to be parallel
in scheme: IPTC NewsCodes: Subject Code
notation: 15043009

50 km free style
type: Concept
broad match: http://cv.iptc.org/newscodes/mediatopic/20001060
broader: nordic skiing
definition: A 50km free style race where the most common style is the skate style where competitors slide and the skis do not need to be parallel
in scheme: IPTC NewsCodes: Subject Code
notation: 15043010

4x5 km relay
type: Concept
broad match: http://cv.iptc.org/newscodes/mediatopic/20001060
broader: nordic skiing
definition: Teams of four competitors ski 5km each in relay fashion
in scheme: IPTC NewsCodes: Subject Code
notation: 15043011

4x10 km relay
type: Concept
broad match: http://cv.iptc.org/newscodes/mediatopic/20001060
broader: nordic skiing
definition: Teams of four competitors ski 10km each in relay fashion
in scheme: IPTC NewsCodes: Subject Code
notation: 15043012

nordic combined
type: Concept
broader: nordic skiing
definition: A two day competition combining the ski jump and a cross-country race.
in scheme: IPTC NewsCodes: Subject Code
notation: 15043013
preferred label: Yhdistetty hiihto @fi

raid
type: Concept
broad match: http://cv.iptc.org/newscodes/mediatopic/20001060
broader: nordic skiing
definition: NA
in scheme: IPTC NewsCodes: Subject Code
notation: 15043014

5 km pursuit free style
type: Concept
broad match: http://cv.iptc.org/newscodes/mediatopic/20001060
broader: nordic skiing
definition: Cross-country skiing over a 5km course in a pursuit format
in scheme: IPTC NewsCodes: Subject Code
notation: 15043015

1.5 km sprint free
type: Concept
broad match: http://cv.iptc.org/newscodes/mediatopic/20001060
broader: nordic skiing
definition: Cross-country skiing over a 1.5km course in a sprint format
in scheme: IPTC NewsCodes: Subject Code
notation: 15043016

50 km classic style
type: Concept
broad match: http://cv.iptc.org/newscodes/mediatopic/20001060
broader: nordic skiing
definition: Cross-country skiing over a 50km course in a classic style format
in scheme: IPTC NewsCodes: Subject Code
notation: 15043017

ski orienteering
type: Concept
broader: orienteering
definition: An individual ski time-trial over a route marked out by beacons, that the competitor has to search out and find in a specific order. The contestant makes his way with the help of a compass and map
in scheme: IPTC NewsCodes: Subject Code
notation: 15044001
preferred label: Hiihtosuunnistus @fi

polo
type: Concept
broader: sport
definition: With the aid of a mallet two teams of four horsemen try and knock a bamboo ball into the opponents goal over a pitch 250m long and 150m wide. The game is divided into 4, 6, or 8 time periods of 7min 30sec called chukkas.
in scheme: IPTC NewsCodes: Subject Code
notation: 15045000
preferred label: Hevospoolo @fi

F1
type: Concept
broad match: http://cv.iptc.org/newscodes/mediatopic/20001016
broader: power boating
definition: Sprint race
in scheme: IPTC NewsCodes: Subject Code
notation: 15046001

F2
type: Concept
broad match: http://cv.iptc.org/newscodes/mediatopic/20001016
broader: power boating
definition: Long distance race
in scheme: IPTC NewsCodes: Subject Code
notation: 15046002

single sculls
type: Concept
broad match: http://cv.iptc.org/newscodes/mediatopic/20001026
broader: rowing
definition: Single person boats with two oars
in scheme: IPTC NewsCodes: Subject Code
notation: 15047001

double sculls
type: Concept
broad match: http://cv.iptc.org/newscodes/mediatopic/20001026
broader: rowing
definition: Two person boats with two oars each
in scheme: IPTC NewsCodes: Subject Code
notation: 15047002

quadruple sculls
type: Concept
broad match: http://cv.iptc.org/newscodes/mediatopic/20001026
broader: rowing
definition: Four person boats with two oars each and without a team mate to give directions
in scheme: IPTC NewsCodes: Subject Code
notation: 15047003

coxless pair
type: Concept
broad match: http://cv.iptc.org/newscodes/mediatopic/20001026
broader: rowing
definition: Two person boats with just one oar each and without a team mate to give directions
in scheme: IPTC NewsCodes: Subject Code
notation: 15047004

coxless four
type: Concept
broad match: http://cv.iptc.org/newscodes/mediatopic/20001026
broader: rowing
definition: Four person boats with just one oar each and without a team mate to give directions
in scheme: IPTC NewsCodes: Subject Code
notation: 15047005

eight
type: Concept
broad match: http://cv.iptc.org/newscodes/mediatopic/20001026
broader: rowing
definition: Eight person boats with just one oar each and without a team mate to give directions
in scheme: IPTC NewsCodes: Subject Code
notation: 15047006

lightweight
type: Concept
broad match: http://cv.iptc.org/newscodes/mediatopic/20001026
broader: rowing
definition: Where a weight category is imposed on competitors
in scheme: IPTC NewsCodes: Subject Code
notation: 15047007

rugby league
type: Concept
broader: sport
definition: Two teams of 13 compete on a pitch where they score tries and penalties by running with and passing an oval ball to be touched down behind the goal line or kicked between goal posts in a tough physical contest
in scheme: IPTC NewsCodes: Subject Code
notation: 15048000
preferred label: Rugby league @fi

rugby 7
type: Concept
broader: rugby union
definition: A more fun and exciting variety where two teams of 7 compete on a pitch where they score tries and penalties by running with and passing an oval ball to be touched down behind the goal line or kicked between goal posts in a tough physical contest
in scheme: IPTC NewsCodes: Subject Code
notation: 15049001

Tornado
type: Concept
broad match: http://cv.iptc.org/newscodes/mediatopic/20001039
broader: sailing
definition: Boat Category: two man catamaran (21m/sq mainsail) Olympic sport
in scheme: IPTC NewsCodes: Subject Code
notation: 15050001

soling
type: Concept
broad match: http://cv.iptc.org/newscodes/mediatopic/20001041
broader: sailing
definition: Boat Category: three man keel boat
in scheme: IPTC NewsCodes: Subject Code
notation: 15050002

49er
type: Concept
broad match: http://cv.iptc.org/newscodes/mediatopic/20001040
broader: sailing
definition: Boat Category: two man dinghy (8.23m/sq mainsail) Olympic sport
in scheme: IPTC NewsCodes: Subject Code
notation: 15050003

Europe
type: Concept
broad match: http://cv.iptc.org/newscodes/mediatopic/20001040
broader: sailing
definition: Boat Category: one man dinghy (4.57m/sq mainsail) Olympic sport
in scheme: IPTC NewsCodes: Subject Code
notation: 15050004

Laser
type: Concept
broad match: http://cv.iptc.org/newscodes/mediatopic/20001040
broader: sailing
definition: Boat Category: one man dinghy (4.6m/sq mainsail) Olympic sport
in scheme: IPTC NewsCodes: Subject Code
notation: 15050005

470
type: Concept
broad match: http://cv.iptc.org/newscodes/mediatopic/20001040
broader: sailing
definition: Boat Category: two man dinghy (7.10m/sq mainsail) Olympic sport
in scheme: IPTC NewsCodes: Subject Code
notation: 15050006

Finn
type: Concept
broad match: http://cv.iptc.org/newscodes/mediatopic/20001040
broader: sailing
definition: Boat Category: one man dinghy (10m/sq mainsail) Olympic sport
in scheme: IPTC NewsCodes: Subject Code
notation: 15050007

Star
type: Concept
broad match: http://cv.iptc.org/newscodes/mediatopic/20001041
broader: sailing
definition: Boat Category: two man keel boat (7.10m/sq mainsail) Olympic sport
in scheme: IPTC NewsCodes: Subject Code
notation: 15050008

flying dutchmann
type: Concept
broad match: http://cv.iptc.org/newscodes/mediatopic/20001040
broader: sailing
definition: Boat Category: two man dinghy
in scheme: IPTC NewsCodes: Subject Code
notation: 15050009

505
type: Concept
broad match: http://cv.iptc.org/newscodes/mediatopic/20001040
broader: sailing
definition: Boat Category: two man dinghy
in scheme: IPTC NewsCodes: Subject Code
notation: 15050010

staging race
type: Concept
broad match: http://cv.iptc.org/newscodes/mediatopic/20001038
broader: sailing
definition: Sea racing
in scheme: IPTC NewsCodes: Subject Code
notation: 15050011

around the world
type: Concept
broader: sailing
definition: Open seas racing
in scheme: IPTC NewsCodes: Subject Code
notation: 15050012

monohull
type: Concept
broad match: http://cv.iptc.org/newscodes/mediatopic/20001038
broader: sailing
definition: Single hull craft
in scheme: IPTC NewsCodes: Subject Code
notation: 15050013

multihulls
type: Concept
broader: sailing
definition: Multi hull craft
in scheme: IPTC NewsCodes: Subject Code
notation: 15050014

yngling
type: Concept
broad match: http://cv.iptc.org/newscodes/mediatopic/20001038
broader: sailing
definition: Olympic boat-class. A race around different courses in a boat of 6.35 metres (20ft 10in) long and 1.73 metres (5ft 8in) wide, crewed in Olympic competition only by women. The number of races and the length of the courses varies.
definition: Purjehduksen olympialuokka. @fi
in scheme: IPTC NewsCodes: Subject Code
notation: 15050015
preferred label: Yngling @fi

mistral
type: Concept
broad match: http://cv.iptc.org/newscodes/mediatopic/20001038
broader: sailing
definition: Olympic boat class. A staged race using boats of the mistral type, which are 4.24 metres (13ft 11in) long and 1.3 metres (4ft 3in) wide. The number of races and the length of the courses varies.
definition: Purjehduksen olympialuokka. @fi
in scheme: IPTC NewsCodes: Subject Code
notation: 15050016
preferred label: Mistral @fi

10 m air rifle
type: Concept
broad match: http://cv.iptc.org/newscodes/mediatopic/20001051
broader: shooting
definition: Shooting event
in scheme: IPTC NewsCodes: Subject Code
notation: 15051001

10 m air pistol
type: Concept
broad match: http://cv.iptc.org/newscodes/mediatopic/20001050
broader: shooting
definition: Shooting event
in scheme: IPTC NewsCodes: Subject Code
notation: 15051002

10 m running target
type: Concept
broad match: http://cv.iptc.org/newscodes/mediatopic/20001052
broader: shooting
definition: Shooting event
in scheme: IPTC NewsCodes: Subject Code
notation: 15051003

25 m rapid fire pistol
type: Concept
broad match: http://cv.iptc.org/newscodes/mediatopic/20001050
broader: shooting
definition: Shooting event
in scheme: IPTC NewsCodes: Subject Code
notation: 15051004

25 m sport pistol
type: Concept
broad match: http://cv.iptc.org/newscodes/mediatopic/20001050
broader: shooting
definition: Shooting event
in scheme: IPTC NewsCodes: Subject Code
notation: 15051005

50 m free pistol
type: Concept
broad match: http://cv.iptc.org/newscodes/mediatopic/20001050
broader: shooting
definition: Shooting event
in scheme: IPTC NewsCodes: Subject Code
notation: 15051006

50 m free rifle prone
type: Concept
broad match: http://cv.iptc.org/newscodes/mediatopic/20001051
broader: shooting
definition: Shooting event
in scheme: IPTC NewsCodes: Subject Code
notation: 15051007

50 m free rifle 3x40
type: Concept
broad match: http://cv.iptc.org/newscodes/mediatopic/20001051
broader: shooting
definition: Shooting event
in scheme: IPTC NewsCodes: Subject Code
notation: 15051008

50 m sport rifle 3x20
type: Concept
broad match: http://cv.iptc.org/newscodes/mediatopic/20001051
broader: shooting
definition: Shooting event
in scheme: IPTC NewsCodes: Subject Code
notation: 15051009

trap
type: Concept
broad match: http://cv.iptc.org/newscodes/mediatopic/20001054
broader: shooting
definition: Shooting event with moving targets
in scheme: IPTC NewsCodes: Subject Code
notation: 15051010

double trap
type: Concept
broad match: http://cv.iptc.org/newscodes/mediatopic/20001054
broader: shooting
definition: Shooting event with two moving targets launched at the same time
in scheme: IPTC NewsCodes: Subject Code
notation: 15051011

skeet
type: Concept
broad match: http://cv.iptc.org/newscodes/mediatopic/20001054
broader: shooting
definition: Shooting event with moving targets, competitor shoots from a series of positions
in scheme: IPTC NewsCodes: Subject Code
notation: 15051012

K90 jump
type: Concept
broad match: http://cv.iptc.org/newscodes/mediatopic/20001061
broader: ski jumping
definition: Competitors jump from 70m and must clear 90m distance in their jump before scoring points for it
in scheme: IPTC NewsCodes: Subject Code
notation: 15052001

K120 jump
type: Concept
broad match: http://cv.iptc.org/newscodes/mediatopic/20001061
broader: ski jumping
definition: Competitors jump from 90m and must clear 120m distance in their jump before scoring points for it
in scheme: IPTC NewsCodes: Subject Code
notation: 15052002

K180 (flying jump)
type: Concept
broad match: http://cv.iptc.org/newscodes/mediatopic/20001061
broader: ski jumping
definition: Competitors jump from 180m and must clear 180m in their jump before scoring points for it
in scheme: IPTC NewsCodes: Subject Code
notation: 15052003

giant slalom
type: Concept
broad match: http://cv.iptc.org/newscodes/mediatopic/20001064
broader: snow boarding
definition: Knock-out head-to-head downhill racing
in scheme: IPTC NewsCodes: Subject Code
notation: 15053001
preferred label: Lumilautasuurpujottelu @fi

half-pipe
type: Concept
broad match: http://cv.iptc.org/newscodes/mediatopic/20001064
broader: snow boarding
definition: Over a semi-cylindrical tube of 100m competitors must perform a series of moves that are marked for style by 5 judges
in scheme: IPTC NewsCodes: Subject Code
notation: 15053002
preferred label: Lumikouru @fi

soccer
type: Concept
broader: sport
definition: Two teams of eleven try to kick or head a ball into the opponents goal over a match usually of 90 minutes
in scheme: IPTC NewsCodes: Subject Code
notation: 15054000
preferred label: Jalkapallo @fi

softball
type: Concept
broader: sport
definition: Similar to baseball but with a larger and softer ball, a thinner bat, shorter gaps between bases and less innings
in scheme: IPTC NewsCodes: Subject Code
notation: 15055000
preferred label: Softball @fi

500 m
type: Concept
broad match: http://cv.iptc.org/newscodes/mediatopic/20001067
broader: speed skating
definition: Speed skating race over 500m
in scheme: IPTC NewsCodes: Subject Code
notation: 15056001

1000 m
type: Concept
broad match: http://cv.iptc.org/newscodes/mediatopic/20001067
broader: speed skating
definition: Speed skating race over 1000m
in scheme: IPTC NewsCodes: Subject Code
notation: 15056002

1500 m
type: Concept
broad match: http://cv.iptc.org/newscodes/mediatopic/20001067
broader: speed skating
definition: Speed skating race over 1500m
in scheme: IPTC NewsCodes: Subject Code
notation: 15056003

3000 m
type: Concept
broad match: http://cv.iptc.org/newscodes/mediatopic/20001067
broader: speed skating
definition: Speed skating race over 3000m
in scheme: IPTC NewsCodes: Subject Code
notation: 15056004

5000 m
type: Concept
broad match: http://cv.iptc.org/newscodes/mediatopic/20001067
broader: speed skating
definition: Speed skating race over 5000m
in scheme: IPTC NewsCodes: Subject Code
notation: 15056005

10000 m
type: Concept
broad match: http://cv.iptc.org/newscodes/mediatopic/20001067
broader: speed skating
definition: Speed skating race over 10000m
in scheme: IPTC NewsCodes: Subject Code
notation: 15056006

Short-track
type: Concept
broad match: http://cv.iptc.org/newscodes/mediatopic/20001067
broader: speed skating
definition: Races of four or more skaters on an oval ice track. Qualifying, semi-finals and finals determine winners.
in scheme: IPTC NewsCodes: Subject Code
notation: 15056007

st 500 m
type: Concept
broad match: http://cv.iptc.org/newscodes/mediatopic/20001067
broader: speed skating
definition: Short track speed skate race over 500m
in scheme: IPTC NewsCodes: Subject Code
notation: 15056008

st 1000m
type: Concept
broad match: http://cv.iptc.org/newscodes/mediatopic/20001067
broader: speed skating
definition: Short track speed skate race over 1000m
in scheme: IPTC NewsCodes: Subject Code
notation: 15056009

st 1500m
type: Concept
broad match: http://cv.iptc.org/newscodes/mediatopic/20001067
broader: speed skating
definition: Short track speed skate race over 1500m
in scheme: IPTC NewsCodes: Subject Code
notation: 15056010

st 3000m
type: Concept
broad match: http://cv.iptc.org/newscodes/mediatopic/20001067
broader: speed skating
definition: Short track speed skate race over 3000m
in scheme: IPTC NewsCodes: Subject Code
notation: 15056011

st 3000m relay
type: Concept
broad match: http://cv.iptc.org/newscodes/mediatopic/20001067
broader: speed skating
definition: Short track relay speed skate race over 3000m
in scheme: IPTC NewsCodes: Subject Code
notation: 15056012

st 5000m
type: Concept
broad match: http://cv.iptc.org/newscodes/mediatopic/20001067
broader: speed skating
definition: Short track speed skate race over 5000m
in scheme: IPTC NewsCodes: Subject Code
notation: 15056013

st 5000m relay
type: Concept
broad match: http://cv.iptc.org/newscodes/mediatopic/20001067
broader: speed skating
definition: Short track relay speed skate race over 5000m
in scheme: IPTC NewsCodes: Subject Code
notation: 15056014

speedway
type: Concept
broader: sport
definition: Fast track
in scheme: IPTC NewsCodes: Subject Code
notation: 15057000
preferred label: Speedway Jääspeedway @fi

IOC
type: Concept
broad match: http://cv.iptc.org/newscodes/mediatopic/20001125
broader: sports organisations
definition: International Olympic Committee
in scheme: IPTC NewsCodes: Subject Code
notation: 15058001
preferred label: Kansainvälinen olympiakomitea @fi

international federation
type: Concept
broad match: http://cv.iptc.org/newscodes/mediatopic/20001125
broader: sports organisations
definition: A body responsible for the international coordination of a specific sport
in scheme: IPTC NewsCodes: Subject Code
notation: 15058002
preferred label: Kansainväliset urheilujärjestöt @fi

continental federation
type: Concept
broad match: http://cv.iptc.org/newscodes/mediatopic/20001125
broader: sports organisations
definition: A body responsible for the continental coordination of a specific sport
in scheme: IPTC NewsCodes: Subject Code
notation: 15058003
preferred label: Maanosien urheilujärjestöt @fi

national federation
type: Concept
broad match: http://cv.iptc.org/newscodes/mediatopic/20001125
broader: sports organisations
definition: A body responsible for the national coordination of a specific sport
in scheme: IPTC NewsCodes: Subject Code
notation: 15058004
preferred label: Kansalliset urheilujärjestöt @fi

GAISF
type: Concept
broad match: http://cv.iptc.org/newscodes/mediatopic/20001125
broader: sports organisations
definition: General Association of International Sports Federations
in scheme: IPTC NewsCodes: Subject Code
notation: 15058005
preferred label: GAISF Kansainvälinen urheilujärjestöjen keskusjärjestö @fi

squash
type: Concept
broader: sport
definition: A racket sport of strategy and endurance played by singles or doubles teams in a walled court with a small rubber ball
in scheme: IPTC NewsCodes: Subject Code
notation: 15059000
preferred label: Squash @fi

sumo wrestling
type: Concept
broader: sport
definition: A combat sport of speed and rapidity with much ceremony where two contestants try to throw or slap a competitor out of a marked area. Generally practiced in Japan by large men.
in scheme: IPTC NewsCodes: Subject Code
notation: 15060000
preferred label: Sumopaini @fi

surfing
type: Concept
broader: sport
definition: Water sport where contestants catch and ride waves upright on a surfboard
in scheme: IPTC NewsCodes: Subject Code
notation: 15061000
preferred label: Lainelautailu @fi

50 m freestyle
type: Concept
broad match: http://cv.iptc.org/newscodes/mediatopic/20001071
broader: swimming
definition: Competitors cover 50m in any style, though front crawl is universally employed
in scheme: IPTC NewsCodes: Subject Code
notation: 15062001

100 m freestyle
type: Concept
broad match: http://cv.iptc.org/newscodes/mediatopic/20001071
broader: swimming
definition: Competitors cover 100m in any style, though front crawl is universally employed
in scheme: IPTC NewsCodes: Subject Code
notation: 15062002

200 m freestyle
type: Concept
broad match: http://cv.iptc.org/newscodes/mediatopic/20001071
broader: swimming
definition: Competitors cover 200m in any style, though front crawl is universally employed
in scheme: IPTC NewsCodes: Subject Code
notation: 15062003

400 m freestyle
type: Concept
broad match: http://cv.iptc.org/newscodes/mediatopic/20001071
broader: swimming
definition: Competitors cover 400m in any style, though front crawl is universally employed
in scheme: IPTC NewsCodes: Subject Code
notation: 15062004

800 m freestyle
type: Concept
broad match: http://cv.iptc.org/newscodes/mediatopic/20001071
broader: swimming
definition: Competitors cover 800m in any style, though front crawl is universally employed
in scheme: IPTC NewsCodes: Subject Code
notation: 15062005

1500 m freestyle
type: Concept
broad match: http://cv.iptc.org/newscodes/mediatopic/20001071
broader: swimming
definition: Competitors cover 1500m in any style, though front crawl is universally employed
in scheme: IPTC NewsCodes: Subject Code
notation: 15062006

relay 4x50 m freestyle
type: Concept
broad match: http://cv.iptc.org/newscodes/mediatopic/20001071
broader: swimming
definition: Teams of four swimmers cover 50m freestyle in a 200m race
in scheme: IPTC NewsCodes: Subject Code
notation: 15062007

relay 4x100 m freestyle
type: Concept
broad match: http://cv.iptc.org/newscodes/mediatopic/20001071
broader: swimming
definition: Teams of four swimmers cover 100m freestyle in a 400m race
in scheme: IPTC NewsCodes: Subject Code
notation: 15062008

relay 4x200 m freestyle
type: Concept
broad match: http://cv.iptc.org/newscodes/mediatopic/20001071
broader: swimming
definition: Teams of four swimmers cover 200m freestyle in a 800m race
in scheme: IPTC NewsCodes: Subject Code
notation: 15062009

50 m backstroke
type: Concept
broad match: http://cv.iptc.org/newscodes/mediatopic/20001071
broader: swimming
definition: Competitors cover 50m in the backstroke style
in scheme: IPTC NewsCodes: Subject Code
notation: 15062010

100 m backstroke
type: Concept
broad match: http://cv.iptc.org/newscodes/mediatopic/20001071
broader: swimming
definition: Competitors cover 100m in the backstroke style
in scheme: IPTC NewsCodes: Subject Code
notation: 15062011

200 m backstroke
type: Concept
broad match: http://cv.iptc.org/newscodes/mediatopic/20001071
broader: swimming
definition: Competitors cover 200m in the backstroke style
in scheme: IPTC NewsCodes: Subject Code
notation: 15062012

50 m breaststroke
type: Concept
broad match: http://cv.iptc.org/newscodes/mediatopic/20001071
broader: swimming
definition: A 50m race in the breaststroke style, on the front, effecting forward and outward push movements with the arms and backward and outward pushes with the legs
in scheme: IPTC NewsCodes: Subject Code
notation: 15062013

100 m breaststroke
type: Concept
broad match: http://cv.iptc.org/newscodes/mediatopic/20001071
broader: swimming
definition: A 100m race in the breaststroke style, on the front, effecting forward and outward push movements with the arms and backward and outward pushes with the legs
in scheme: IPTC NewsCodes: Subject Code
notation: 15062014

200 m breaststroke
type: Concept
broad match: http://cv.iptc.org/newscodes/mediatopic/20001071
broader: swimming
definition: A 200m race in the breaststroke style, on the front, effecting forward and outward push movements with the arms and backward and outward pushes with the legs
in scheme: IPTC NewsCodes: Subject Code
notation: 15062015

50 m butterfly
type: Concept
broad match: http://cv.iptc.org/newscodes/mediatopic/20001071
broader: swimming
definition: A 50m butterfly race, swum on the front with the shoulders remaining parallel to the water both arms moving in simultaneous windmill fashion, the legs remain together and are moved in a flapping motion. The most physical of all styles.
in scheme: IPTC NewsCodes: Subject Code
notation: 15062016

100 m butterfly
type: Concept
broad match: http://cv.iptc.org/newscodes/mediatopic/20001071
broader: swimming
definition: A 100m butterfly race, swum on the front with the shoulders remaining parallel to the water both arms moving in simultaneous windmill fashion, the legs remain together and are moved in a flapping motion. The most physical of all styles
in scheme: IPTC NewsCodes: Subject Code
notation: 15062017

200 m butterfly
type: Concept
broad match: http://cv.iptc.org/newscodes/mediatopic/20001071
broader: swimming
definition: A 200m butterfly race, swum on the front with the shoulders remaining parallel to the water both arms moving in simultaneous windmill fashion, the legs remain together and are moved in a flapping motion. The most physical of all styles
in scheme: IPTC NewsCodes: Subject Code
notation: 15062018

100 m medley
type: Concept
broad match: http://cv.iptc.org/newscodes/mediatopic/20001071
broader: swimming
definition: Swimmers complete four laps, each in a different style and in this order: butterfly, backstroke, breaststroke and freestyle, covering a total of 100m.
in scheme: IPTC NewsCodes: Subject Code
notation: 15062019

200 m medley
type: Concept
broad match: http://cv.iptc.org/newscodes/mediatopic/20001071
broader: swimming
definition: Swimmers complete four laps, each in a different style and in this order: butterfly, backstroke, breaststroke and freestyle, covering a total of 200m.
in scheme: IPTC NewsCodes: Subject Code
notation: 15062020

400 m medley
type: Concept
broad match: http://cv.iptc.org/newscodes/mediatopic/20001071
broader: swimming
definition: Swimmers complete eight laps, two in each style and in this order: butterfly, backstroke, breaststroke and freestyle, covering a total of 400m.
in scheme: IPTC NewsCodes: Subject Code
notation: 15062021

relay 4x50 m medlay
type: Concept
broad match: http://cv.iptc.org/newscodes/mediatopic/20001071
broader: swimming
definition: A relay team of four, each of whom completes a single lap and each in a different style in this order: backstroke, breaststroke, butterfly and freestyle in a race of 200m total.
in scheme: IPTC NewsCodes: Subject Code
notation: 15062022

relay4x100 m medley
type: Concept
broad match: http://cv.iptc.org/newscodes/mediatopic/20001071
broader: swimming
definition: A relay team of four, each of whom completes two laps and each in a different style in this order: backstroke, breaststroke, butterfly and freestyle in a race of 400m total.
in scheme: IPTC NewsCodes: Subject Code
notation: 15062023

short course
type: Concept
broad match: http://cv.iptc.org/newscodes/mediatopic/20001071
broader: swimming
definition: Races competed in a 25m length pool
in scheme: IPTC NewsCodes: Subject Code
notation: 15062024

synchronised technical routine
type: Concept
broader: swimming
definition: Contestants obtain points from 10 sitting judges by executing certain synchronised artistic shapes and movements in the water. In the technical programme, competitors must execute a range of specific moves in a given order.
in scheme: IPTC NewsCodes: Subject Code
notation: 15062025

synchronised free routine
type: Concept
broader: swimming
definition: In the free programme, music, movements and their order of execution are not restricted.
in scheme: IPTC NewsCodes: Subject Code
notation: 15062026

table tennis
type: Concept
broader: sport
definition: A racket sport for two or four (in doubles), who compete at a table divided by a net using a small bat to play a lightweight ball
in scheme: IPTC NewsCodes: Subject Code
notation: 15063000
preferred label: Pöytätennis @fi

under 49 kg
type: Concept
broad match: http://cv.iptc.org/newscodes/mediatopic/20001084
broader: Taekwon-Do
definition: Weight category in Taekwon-Do
in scheme: IPTC NewsCodes: Subject Code
notation: 15064001

under 58 kg
type: Concept
broad match: http://cv.iptc.org/newscodes/mediatopic/20001084
broader: Taekwon-Do
definition: Weight category in Taekwon-Do
in scheme: IPTC NewsCodes: Subject Code
notation: 15064002

49-57 kg
type: Concept
broad match: http://cv.iptc.org/newscodes/mediatopic/20001084
broader: Taekwon-Do
definition: Weight category in Taekwon-Do
in scheme: IPTC NewsCodes: Subject Code
notation: 15064003

58-68 kg
type: Concept
broad match: http://cv.iptc.org/newscodes/mediatopic/20001084
broader: Taekwon-Do
definition: Weight category in Taekwon-Do
in scheme: IPTC NewsCodes: Subject Code
notation: 15064004

57-67 kg
type: Concept
broad match: http://cv.iptc.org/newscodes/mediatopic/20001084
broader: Taekwon-Do
definition: Weight category in Taekwon-Do
in scheme: IPTC NewsCodes: Subject Code
notation: 15064005

68-80 kg
type: Concept
broad match: http://cv.iptc.org/newscodes/mediatopic/20001084
broader: Taekwon-Do
definition: Weight category in Taekwon-Do
in scheme: IPTC NewsCodes: Subject Code
notation: 15064006

over 67 kg
type: Concept
broad match: http://cv.iptc.org/newscodes/mediatopic/20001084
broader: Taekwon-Do
definition: Weight category in Taekwon-Do
in scheme: IPTC NewsCodes: Subject Code
notation: 15064007

over 80 kg
type: Concept
broad match: http://cv.iptc.org/newscodes/mediatopic/20001084
broader: Taekwon-Do
definition: Weight category in Taekwon-Do
in scheme: IPTC NewsCodes: Subject Code
notation: 15064008

soft tennis
type: Concept
broad match: http://cv.iptc.org/newscodes/mediatopic/20000822
broader: tennis
definition: Tennis with a soft rubber ball. (Programme of National Sports Festival in Japan)
definition: Tennistä, jossa käytetään pehmeää kumipalloa. (Japanin kansallisen urheilufestivaalin ohjelmassa) @fi
in scheme: IPTC NewsCodes: Subject Code
notation: 15065001
preferred label: Soft tennis @fi

triathlon swimming
type: Concept
broad match: http://cv.iptc.org/newscodes/mediatopic/20001087
broader: triathlon
definition: Triathlon event
in scheme: IPTC NewsCodes: Subject Code
notation: 15066001

triathlon cycling
type: Concept
broad match: http://cv.iptc.org/newscodes/mediatopic/20001087
broader: triathlon
definition: Triathlon event
in scheme: IPTC NewsCodes: Subject Code
notation: 15066002

triathlon run
type: Concept
broad match: http://cv.iptc.org/newscodes/mediatopic/20001087
broader: triathlon
definition: Triathlon event
in scheme: IPTC NewsCodes: Subject Code
notation: 15066003

beach volleyball
type: Concept
broader: volleyball
definition: Two teams of two players compete on a sand court. Unlike indoor volleyball, points are scored only when the serving team wins a rally or forces an error. The sand surface makes it more physically demanding than volleyball.
in scheme: IPTC NewsCodes: Subject Code
notation: 15067001
preferred label: Rantalentopallo @fi

water polo
type: Concept
broader: sport
definition: Played in a pool between two teams of 7, who must stay afloat and can only use one hand to pass the ball or swim with it before trying to throw it into the opponents net to score goals.
in scheme: IPTC NewsCodes: Subject Code
notation: 15068000
preferred label: Vesipallo @fi

slalom
type: Concept
broad match: http://cv.iptc.org/newscodes/mediatopic/20001092
broader: water skiing
definition: Speed event where contestants round a course marked out by buoys
in scheme: IPTC NewsCodes: Subject Code
notation: 15069001

trick
type: Concept
broad match: http://cv.iptc.org/newscodes/mediatopic/20001092
broader: water skiing
definition: Skiers perform a maximum of figures in a limited time period
in scheme: IPTC NewsCodes: Subject Code
notation: 15069002

jump
type: Concept
broad match: http://cv.iptc.org/newscodes/mediatopic/20001092
broader: water skiing
definition: Skiers perform as long a jump as possible from a ramp in the water
in scheme: IPTC NewsCodes: Subject Code
notation: 15069003

combined
type: Concept
broad match: http://cv.iptc.org/newscodes/mediatopic/20001092
broader: water skiing
definition: A combined event made up of the slalom, jump and trick
in scheme: IPTC NewsCodes: Subject Code
notation: 15069004

snatch
type: Concept
broader: weightlifting
definition: The bar must be lifted from floor to above the head in one movement
in scheme: IPTC NewsCodes: Subject Code
notation: 15070001

clean and jerk
type: Concept
broader: weightlifting
definition: The bar is first lifted to the shoulders and then jerk it above the head and keep it there while maintaining straight legs
in scheme: IPTC NewsCodes: Subject Code
notation: 15070002

48 kg
type: Concept
broad match: http://cv.iptc.org/newscodes/mediatopic/20001093
broader: weightlifting
definition: Competitor weight category in weightlifting
in scheme: IPTC NewsCodes: Subject Code
notation: 15070003

53 kg
type: Concept
broad match: http://cv.iptc.org/newscodes/mediatopic/20001093
broader: weightlifting
definition: Competitor weight category in weightlifting
in scheme: IPTC NewsCodes: Subject Code
notation: 15070004

63 kg
type: Concept
broad match: http://cv.iptc.org/newscodes/mediatopic/20001093
broader: weightlifting
definition: Competitor weight category in weightlifting
in scheme: IPTC NewsCodes: Subject Code
notation: 15070005

75 kg
type: Concept
broad match: http://cv.iptc.org/newscodes/mediatopic/20001093
broader: weightlifting
definition: Competitor weight category in weightlifting
in scheme: IPTC NewsCodes: Subject Code
notation: 15070006

over 75 kg
type: Concept
broad match: http://cv.iptc.org/newscodes/mediatopic/20001093
broader: weightlifting
definition: Competitor weight category in weightlifting
in scheme: IPTC NewsCodes: Subject Code
notation: 15070007

56 kg
type: Concept
broad match: http://cv.iptc.org/newscodes/mediatopic/20001093
broader: weightlifting
definition: Competitor weight category in weightlifting
in scheme: IPTC NewsCodes: Subject Code
notation: 15070008

62 kg
type: Concept
broad match: http://cv.iptc.org/newscodes/mediatopic/20001093
broader: weightlifting
definition: Competitor weight category in weightlifting
in scheme: IPTC NewsCodes: Subject Code
notation: 15070009

69 kg
type: Concept
broad match: http://cv.iptc.org/newscodes/mediatopic/20001093
broader: weightlifting
definition: Competitor weight category in weightlifting
in scheme: IPTC NewsCodes: Subject Code
notation: 15070010

77 kg
type: Concept
broad match: http://cv.iptc.org/newscodes/mediatopic/20001093
broader: weightlifting
definition: Competitor weight category in weightlifting
in scheme: IPTC NewsCodes: Subject Code
notation: 15070011

85 kg
type: Concept
broad match: http://cv.iptc.org/newscodes/mediatopic/20001093
broader: weightlifting
definition: Competitor weight category in weightlifting
in scheme: IPTC NewsCodes: Subject Code
notation: 15070012

94 kg
type: Concept
broad match: http://cv.iptc.org/newscodes/mediatopic/20001093
broader: weightlifting
definition: Competitor weight category in weightlifting
in scheme: IPTC NewsCodes: Subject Code
notation: 15070013

105 kg
type: Concept
broad match: http://cv.iptc.org/newscodes/mediatopic/20001093
broader: weightlifting
definition: Competitor weight category in weightlifting
in scheme: IPTC NewsCodes: Subject Code
notation: 15070014

over 105 kg
type: Concept
broad match: http://cv.iptc.org/newscodes/mediatopic/20001093
broader: weightlifting
definition: Competitor weight category in weightlifting
in scheme: IPTC NewsCodes: Subject Code
notation: 15070015

powerlifting
type: Concept
broader: weightlifting
definition: A strength test where competitors lift as heavy a weight as possible
in scheme: IPTC NewsCodes: Subject Code
notation: 15070016
preferred label: Voimanosto @fi

ocean
type: Concept
broad match: http://cv.iptc.org/newscodes/mediatopic/20001097
broader: windsurfing
definition: Races on the open seas
in scheme: IPTC NewsCodes: Subject Code
notation: 15071001

lake
type: Concept
broad match: http://cv.iptc.org/newscodes/mediatopic/20001097
broader: windsurfing
definition: Races competed on lakes
in scheme: IPTC NewsCodes: Subject Code
notation: 15071002

river
type: Concept
broad match: http://cv.iptc.org/newscodes/mediatopic/20001097
broader: windsurfing
definition: Races competed on rivers
in scheme: IPTC NewsCodes: Subject Code
notation: 15071003

land
type: Concept
broad match: http://cv.iptc.org/newscodes/mediatopic/20001097
broader: windsurfing
definition: Races competed on land with a board equipped with wheels
in scheme: IPTC NewsCodes: Subject Code
notation: 15071004

freestyle
type: Concept
broader: wrestling
definition: A style where leg holds are allowed
in scheme: IPTC NewsCodes: Subject Code
notation: 15072001
preferred label: Vapaapaini @fi

greco-roman
type: Concept
broader: wrestling
definition: A style where the only holds allowed are those between the head and the belt
in scheme: IPTC NewsCodes: Subject Code
notation: 15072002
preferred label: Kreikkalais-roomalainen paini @fi

over 130 kg
type: Concept
broad match: http://cv.iptc.org/newscodes/mediatopic/20001098
broader: wrestling
definition: Competitor weight category in wrestling
in scheme: IPTC NewsCodes: Subject Code
notation: 15072003

130 kg
type: Concept
broad match: http://cv.iptc.org/newscodes/mediatopic/20001098
broader: wrestling
definition: Competitor weight category in wrestling
in scheme: IPTC NewsCodes: Subject Code
notation: 15072004

97 kg
type: Concept
broad match: http://cv.iptc.org/newscodes/mediatopic/20001098
broader: wrestling
definition: Competitor weight category in wrestling
in scheme: IPTC NewsCodes: Subject Code
notation: 15072005

85 kg
type: Concept
broad match: http://cv.iptc.org/newscodes/mediatopic/20001098
broader: wrestling
definition: Competitor weight category in wrestling
in scheme: IPTC NewsCodes: Subject Code
notation: 15072006

76 kg
type: Concept
broad match: http://cv.iptc.org/newscodes/mediatopic/20001098
broader: wrestling
definition: Competitor weight category in wrestling
in scheme: IPTC NewsCodes: Subject Code
notation: 15072007

69 kg
type: Concept
broad match: http://cv.iptc.org/newscodes/mediatopic/20001098
broader: wrestling
definition: Competitor weight category in wrestling
in scheme: IPTC NewsCodes: Subject Code
notation: 15072008

63 kg
type: Concept
broad match: http://cv.iptc.org/newscodes/mediatopic/20001098
broader: wrestling
definition: Competitor weight category in wrestling
in scheme: IPTC NewsCodes: Subject Code
notation: 15072009

58 kg
type: Concept
broad match: http://cv.iptc.org/newscodes/mediatopic/20001098
broader: wrestling
definition: Competitor weight category in wrestling
in scheme: IPTC NewsCodes: Subject Code
notation: 15072010

54 kg
type: Concept
broad match: http://cv.iptc.org/newscodes/mediatopic/20001098
broader: wrestling
definition: Competitor weight category in wrestling
in scheme: IPTC NewsCodes: Subject Code
notation: 15072011

Swiss wrestling
type: Concept
broader: wrestling
definition: Traditional Swiss sport similar to wrestling with specific rules
definition: Perinteinen sveitsiläinen painilaji @fi
in scheme: IPTC NewsCodes: Subject Code
notation: 15072012

Summer Olympics
type: Concept
broad match: http://cv.iptc.org/newscodes/mediatopic/20001108
broader: sports event
definition: Summer Olympics
in scheme: IPTC NewsCodes: Subject Code
notation: 15073001
preferred label: Kesäolympialaiset @fi

Winter Olympics
type: Concept
broad match: http://cv.iptc.org/newscodes/mediatopic/20001108
broader: sports event
definition: Winter Olympics
in scheme: IPTC NewsCodes: Subject Code
notation: 15073002
preferred label: Talviolympialaiset @fi

Summer universiade
type: Concept
broad match: http://cv.iptc.org/newscodes/mediatopic/20001108
broader: sports event
definition: Summer universiade
in scheme: IPTC NewsCodes: Subject Code
notation: 15073003
preferred label: Kesäuniversiadit @fi

Winter Universiade
type: Concept
broad match: http://cv.iptc.org/newscodes/mediatopic/20001108
broader: sports event
definition: Winter Universiade
in scheme: IPTC NewsCodes: Subject Code
notation: 15073004
preferred label: Talviuniversiadit @fi

Commonwealth Games
type: Concept
broad match: http://cv.iptc.org/newscodes/mediatopic/20001108
broader: sports event
definition: Commonwealth Games
in scheme: IPTC NewsCodes: Subject Code
notation: 15073005

Winter Goodwill Games
type: Concept
broad match: http://cv.iptc.org/newscodes/mediatopic/20001108
broader: sports event
definition: Winter Goodwill Games
in scheme: IPTC NewsCodes: Subject Code
notation: 15073006

Summer Asian Games
type: Concept
broad match: http://cv.iptc.org/newscodes/mediatopic/20001108
broader: sports event
definition: Summer Asian Games
in scheme: IPTC NewsCodes: Subject Code
notation: 15073007

Winter Asian Games
type: Concept
broad match: http://cv.iptc.org/newscodes/mediatopic/20001108
broader: sports event
definition: Winter Asian Games
in scheme: IPTC NewsCodes: Subject Code
notation: 15073008

Panamerican Games
type: Concept
broad match: http://cv.iptc.org/newscodes/mediatopic/20001108
broader: sports event
definition: Panamerican Games
in scheme: IPTC NewsCodes: Subject Code
notation: 15073009

African Games
type: Concept
broad match: http://cv.iptc.org/newscodes/mediatopic/20001108
broader: sports event
definition: African Games
in scheme: IPTC NewsCodes: Subject Code
notation: 15073010

Mediterranean Games
type: Concept
broad match: http://cv.iptc.org/newscodes/mediatopic/20001108
broader: sports event
definition: Mediterranean Games
in scheme: IPTC NewsCodes: Subject Code
notation: 15073011

SouthEast Asiatic Games
type: Concept
broad match: http://cv.iptc.org/newscodes/mediatopic/20001108
broader: sports event
definition: SouthEast Asiatic Games
in scheme: IPTC NewsCodes: Subject Code
notation: 15073012

PanPacific Games
type: Concept
broad match: http://cv.iptc.org/newscodes/mediatopic/20001108
broader: sports event
definition: PanPacific Games
in scheme: IPTC NewsCodes: Subject Code
notation: 15073013

SouthPacific Games
type: Concept
broad match: http://cv.iptc.org/newscodes/mediatopic/20001108
broader: sports event
definition: SouthPacific Games
in scheme: IPTC NewsCodes: Subject Code
notation: 15073014

PanArabic Games
type: Concept
broad match: http://cv.iptc.org/newscodes/mediatopic/20001108
broader: sports event
definition: PanArabic Games
in scheme: IPTC NewsCodes: Subject Code
notation: 15073015

Summer Goodwill Games
type: Concept
broad match: http://cv.iptc.org/newscodes/mediatopic/20001108
broader: sports event
definition: Summer Goodwill Games
in scheme: IPTC NewsCodes: Subject Code
notation: 15073016

World games
type: Concept
broader: sports event
definition: A competition featuring world class athletes
in scheme: IPTC NewsCodes: Subject Code
notation: 15073017
preferred label: World Games @fi

World Cup
type: Concept
broader: sports event
definition: Sports meeting with competitors from the five continents
in scheme: IPTC NewsCodes: Subject Code
notation: 15073018
preferred label: Maailmancup @fi

intercontinental cup
type: Concept
broad match: http://cv.iptc.org/newscodes/mediatopic/20001108
broader: sports event
definition: Sports meeting bringing together competitors from different continents
in scheme: IPTC NewsCodes: Subject Code
notation: 15073019
preferred label: Maanosien väliset cupit @fi

continental cup
type: Concept
broader: sports event
definition: Sports meeting where competitors come from a single continent
in scheme: IPTC NewsCodes: Subject Code
notation: 15073020
preferred label: Maanosien cupit @fi

international cup
type: Concept
broader: sports event
definition: Sports meeting where competitors come from several nations
in scheme: IPTC NewsCodes: Subject Code
notation: 15073021
preferred label: Kansainväliset cupit @fi

National Cup
type: Concept
broader: sports event
definition: Sports meeting where competitors come from a single nation
in scheme: IPTC NewsCodes: Subject Code
notation: 15073022
preferred label: Kansalliset cupit @fi

interregional cup
type: Concept
broad match: http://cv.iptc.org/newscodes/mediatopic/20001108
broader: sports event
definition: Sports meeting where competitors come from several regions
in scheme: IPTC NewsCodes: Subject Code
notation: 15073023
preferred label: Alueiden väliset cupit @fi

regional cup
type: Concept
broader: sports event
definition: Sports meeting where competitors come from a single region
in scheme: IPTC NewsCodes: Subject Code
notation: 15073024
preferred label: Alueelliset cupit @fi

league cup
type: Concept
broad match: http://cv.iptc.org/newscodes/mediatopic/20001108
broader: sports event
definition: A competition within a sports league
in scheme: IPTC NewsCodes: Subject Code
notation: 15073025
preferred label: Liigacupit @fi

world championship
type: Concept
broader: sports event
definition: A championship where competitors from the five continents take part
in scheme: IPTC NewsCodes: Subject Code
notation: 15073026
preferred label: Maailmanmestaruuskilpailut @fi

intercontinental championship
type: Concept
broad match: http://cv.iptc.org/newscodes/mediatopic/20001108
broader: sports event
definition: A championship where competitors from the different continents take part
in scheme: IPTC NewsCodes: Subject Code
notation: 15073027
preferred label: Maanosien väliset mestaruuskilpailut @fi

continental championship 1st level
type: Concept
broad match: http://cv.iptc.org/newscodes/mediatopic/20001109
broader: sports event
definition: A championship where top level competitors from a single continent take part
in scheme: IPTC NewsCodes: Subject Code
notation: 15073028
preferred label: Maanosien mestaruuskilpailut @fi

continental championship 2nd level
type: Concept
broad match: http://cv.iptc.org/newscodes/mediatopic/20001109
broader: sports event
definition: A championship where second string competitors from a single continent take part
in scheme: IPTC NewsCodes: Subject Code
notation: 15073029

continental championship 3rd level
type: Concept
broad match: http://cv.iptc.org/newscodes/mediatopic/20001109
broader: sports event
definition: A championship where third string competitors from a single continent take part
in scheme: IPTC NewsCodes: Subject Code
notation: 15073030

national championship 1st level
type: Concept
broad match: http://cv.iptc.org/newscodes/mediatopic/20001115
broader: sports event
definition: A championship where top level competitors from a single nation take part
in scheme: IPTC NewsCodes: Subject Code
notation: 15073031
preferred label: Kansalliset mestaruuskilpailut @fi

national championship 2nd level
type: Concept
broad match: http://cv.iptc.org/newscodes/mediatopic/20001115
broader: sports event
definition: A championship where second string competitors from a single continent take part
in scheme: IPTC NewsCodes: Subject Code
notation: 15073032

national championship3rdlevel
type: Concept
broad match: http://cv.iptc.org/newscodes/mediatopic/20001115
broader: sports event
definition: A championship where third string competitors from a single continent take part
in scheme: IPTC NewsCodes: Subject Code
notation: 15073033

national championship 4th level
type: Concept
broad match: http://cv.iptc.org/newscodes/mediatopic/20001115
broader: sports event
definition: A championship where fourth string competitors from a single continent take part
in scheme: IPTC NewsCodes: Subject Code
notation: 15073034

regional championship
type: Concept
broader: sports event
definition: A championship where competitors from a single region take part
in scheme: IPTC NewsCodes: Subject Code
notation: 15073035
preferred label: Alueelliset mestaruuskilpailut @fi

Grand Prix
type: Concept
broad match: http://cv.iptc.org/newscodes/mediatopic/20001108
broader: sports event
definition: High level sports competition, most often motor racing
in scheme: IPTC NewsCodes: Subject Code
notation: 15073036

intercontinental tournament
type: Concept
broad match: http://cv.iptc.org/newscodes/mediatopic/20001108
broader: sports event
definition: Tournament where competitors from several continents take part
in scheme: IPTC NewsCodes: Subject Code
notation: 15073037
preferred label: Maanosien väliset turnaukset @fi

continental tournament
type: Concept
broad match: http://cv.iptc.org/newscodes/mediatopic/20001108
broader: sports event
definition: Tournament where competitors from a single continent take part
in scheme: IPTC NewsCodes: Subject Code
notation: 15073038
preferred label: Maanosien turnaukset @fi

international tournament
type: Concept
broad match: http://cv.iptc.org/newscodes/mediatopic/20001108
broader: sports event
definition: Tournament where competitors from several nations take part
in scheme: IPTC NewsCodes: Subject Code
notation: 15073039
preferred label: Kansainväliset turnaukset @fi

national tournament
type: Concept
broad match: http://cv.iptc.org/newscodes/mediatopic/20001108
broader: sports event
definition: Tournament where competitors from a single nation take part
in scheme: IPTC NewsCodes: Subject Code
notation: 15073040
preferred label: Kansalliset turnaukset @fi

inter-nations competition
type: Concept
broad match: http://cv.iptc.org/newscodes/mediatopic/20001108
broader: sports event
definition: Tournament where athletes from several nations take part
in scheme: IPTC NewsCodes: Subject Code
notation: 15073041
preferred label: Maaottelut @fi

inter-clubs competition
type: Concept
broad match: http://cv.iptc.org/newscodes/mediatopic/20001108
broader: sports event
definition: Tournament where competitors from several clubs take part
in scheme: IPTC NewsCodes: Subject Code
notation: 15073042

friendly competition
type: Concept
broad match: http://cv.iptc.org/newscodes/mediatopic/20001108
broader: sports event
definition: Sports played but not in a tournament
in scheme: IPTC NewsCodes: Subject Code
notation: 15073043
preferred label: Ystävyysottelut @fi

all-stars competition
type: Concept
broad match: http://cv.iptc.org/newscodes/mediatopic/20001108
broader: sports event
definition: Competition between teams made up of invited stars
in scheme: IPTC NewsCodes: Subject Code
notation: 15073044

exhibition
type: Concept
broad match: http://cv.iptc.org/newscodes/mediatopic/20001108
broader: sports event
definition: demonstration
in scheme: IPTC NewsCodes: Subject Code
notation: 15073045

Super Bowl
type: Concept
broad match: http://cv.iptc.org/newscodes/mediatopic/20001108
broader: sports event
definition: The American football final that determines the champion
definition: Amerikkalaisen jalkapallon loppuottelu, jossa ratkaistaan mestari @fi
in scheme: IPTC NewsCodes: Subject Code
notation: 15073046

paralympic games
type: Concept
broad match: http://cv.iptc.org/newscodes/mediatopic/20001108
broader: sports event
definition: Olympic style Games for athletes with a disability
definition: Vammaisten olympialaistyyppiset kisat @fi
in scheme: IPTC NewsCodes: Subject Code
notation: 15073047
preferred label: Paralympialaiset @fi

barrel racing
type: Concept
broader: rodeo
definition: Rodeo discipline
in scheme: IPTC NewsCodes: Subject Code
notation: 15074001

calf roping
type: Concept
broader: rodeo
definition: Rodeo discipline
in scheme: IPTC NewsCodes: Subject Code
notation: 15074002

bull riding
type: Concept
broader: rodeo
definition: Rodeo discipline
in scheme: IPTC NewsCodes: Subject Code
notation: 15074003

bulldogging
type: Concept
broader: rodeo
definition: Rodeo discipline
in scheme: IPTC NewsCodes: Subject Code
notation: 15074004

saddle bronc
type: Concept
broader: rodeo
definition: Rodeo discipline
in scheme: IPTC NewsCodes: Subject Code
notation: 15074005

bareback
type: Concept
broader: rodeo
definition: Rodeo discipline
in scheme: IPTC NewsCodes: Subject Code
notation: 15074006

goat roping
type: Concept
broader: rodeo
definition: Rodeo discipline
in scheme: IPTC NewsCodes: Subject Code
notation: 15074007

mini golf sport
type: Concept
broader: sport
definition: A game where balls must be holed on an artificial course in as few strokes from the club as possible
in scheme: IPTC NewsCodes: Subject Code
notation: 15075000
preferred label: Minigolf @fi

bandy
type: Concept
broader: sport
definition: Played outdoors on ice. The size of the ice rink is about the size of a soccer field. Skates like ice hockey. A small hard ball is used for playing. Players play with sticks, much like in ice hockey, but the sticks are shorter and more rounded.
in scheme: IPTC NewsCodes: Subject Code
notation: 15076000
preferred label: Jääpallo @fi

ultimate
type: Concept
broad match: http://cv.iptc.org/newscodes/mediatopic/20000938
broader: flying disc
definition: Team game. Played outdoors on soccer-size field with 7 players per team and indoors with 5 players per team. Games are played to a preset number of goals. Goals are scored by passing the disc to a team-member catching it inside the goal area.
in scheme: IPTC NewsCodes: Subject Code
notation: 15077001

guts
type: Concept
broad match: http://cv.iptc.org/newscodes/mediatopic/20000938
broader: flying disc
definition: Team game where two teams of 5 players each face each other. Teams take turns to throw the disc towards the other team. Points are scored if the opposing team does not catch the disc.
in scheme: IPTC NewsCodes: Subject Code
notation: 15077002

overall
type: Concept
broad match: http://cv.iptc.org/newscodes/mediatopic/20000938
broader: flying disc
definition: Not an event in itself but in most competitions with individual events the winner of the competition will be awarded to the player with the highest combined score in the events.
in scheme: IPTC NewsCodes: Subject Code
notation: 15077003

distance
type: Concept
broad match: http://cv.iptc.org/newscodes/mediatopic/20000938
broader: flying disc
definition: The object is to throw the disc as far as possible. Each player get five throws per turn. Throws are made downwind. World record is over 200 meters.
in scheme: IPTC NewsCodes: Subject Code
notation: 15077004

discathon
type: Concept
broad match: http://cv.iptc.org/newscodes/mediatopic/20000938
broader: flying disc
definition: The object is to throw and run a park course of about 1 kilometre. Four players compete in each heat. They have two discs each. They may also carry a third disc in reserve. Where one thrown disc stops the second disc must be thrown.
in scheme: IPTC NewsCodes: Subject Code
notation: 15077005

DDC
type: Concept
broad match: http://cv.iptc.org/newscodes/mediatopic/20000938
broader: flying disc
definition: Abbreviation for Double Disc Court. Two players per team in a square 13x13 metre. The teams start with one disc per team and throw at each other. Discs are thrown back and forth until one or both hit the ground.
in scheme: IPTC NewsCodes: Subject Code
notation: 15077006

SCF
type: Concept
broad match: http://cv.iptc.org/newscodes/mediatopic/20000938
broader: flying disc
definition: Abbreviation for Self Caught Flights. Divided into two sub events called MTA (Maximum Time Aloft) and TRC (Throw Run Catch). In both sub events the player throws a disc and then runs to catch it with one hand before it hits the ground.
in scheme: IPTC NewsCodes: Subject Code
notation: 15077007

freestyle
type: Concept
broad match: http://cv.iptc.org/newscodes/mediatopic/20000938
broader: flying disc
definition: A judged event where groups of two or three players perform as many tricks as possible. In competitions the judges can use either a ranking system or set scores on presentation, execution and difficulty.
in scheme: IPTC NewsCodes: Subject Code
notation: 15077008

accuracy
type: Concept
broad match: http://cv.iptc.org/newscodes/mediatopic/20000938
broader: flying disc
definition: Each player has 28 throws from various distances and angles to throw the disc through a goal 1.5 x 1.5 meters. World record is 25 of 28 possible.
in scheme: IPTC NewsCodes: Subject Code
notation: 15077009

disc golf
type: Concept
broad match: http://cv.iptc.org/newscodes/mediatopic/20000938
broader: flying disc
definition: Much like golf but played with discs instead of balls and clubs. Instead of a hole in the ground there is a metal basket with light metal chains to throw the disc at. Players often carry discs specialized for long throws, right or left bends.
in scheme: IPTC NewsCodes: Subject Code
notation: 15077010

floorball
type: Concept
broader: sport
definition: Played indoors in a court the size of a basketball court. 6 players per team, of which one is a who plays in a kneeling position without a stick like in ice hockey. The other players use plastic clubs and a light plastic ball to pass and shoot goals.
in scheme: IPTC NewsCodes: Subject Code
notation: 15078000
preferred label: Salibandy @fi

casting
type: Concept
broader: sport
definition: Using fishing equipment to hit a target and score points
in scheme: IPTC NewsCodes: Subject Code
notation: 15079000
preferred label: Casting @fi

tug-of-war
type: Concept
broader: sport
definition: Two teams pulling against each other on a rope
in scheme: IPTC NewsCodes: Subject Code
notation: 15080000
preferred label: Köydenveto @fi

croquette
type: Concept
broader: sport
definition: Using mallets to hit a ball through hoops
in scheme: IPTC NewsCodes: Subject Code
notation: 15081000
preferred label: Kroketti @fi

sled
type: Concept
broader: dog racing
definition: Harnessed to a sled
in scheme: IPTC NewsCodes: Subject Code
notation: 15082001
preferred label: Koiravaljakkourheilu @fi

oval track
type: Concept
broader: dog racing
definition: Pursuing an artificial rabbit around an oval track
in scheme: IPTC NewsCodes: Subject Code
notation: 15082002
preferred label: Ratajuoksu @fi

skeleton
type: Concept
broader: sport
definition: In skeleton the competitor lays on his/hers stomach when racing down the course. The competitor must be on the sled when crossing the finishing line. The total time of all races in a competition is added together.
in scheme: IPTC NewsCodes: Subject Code
notation: 15083000
preferred label: Skeleton @fi

Australian rules football
type: Concept
broader: sport
definition: Football played under Australian rules
in scheme: IPTC NewsCodes: Subject Code
notation: 15084000

Canadian football
type: Concept
broader: sport
definition: Football played under Canadian rules
in scheme: IPTC NewsCodes: Subject Code
notation: 15085000

duathlon
type: Concept
broader: sport
definition: Duathlon
in scheme: IPTC NewsCodes: Subject Code
notation: 15086000
preferred label: Duathlon @fi

hornuss
type: Concept
broader: sport
definition: Swiss team sport with 16 or 18 men per team. A rubber puck is hit towards the field of the adversary team which tries to hit the puck in the air with a wooden board thrown in the air
definition: Sveitsiläinen laji 16-18 hengen joukkueille. Kuminen kiekko lyödään kentälle kohti vastustajajoukkuetta, joka yrittää osua kiekkoon ilmaan heitetyllä puisella laudalla. @fi
in scheme: IPTC NewsCodes: Subject Code
notation: 15087000
preferred label: Hornuss @fi

fist ball
type: Concept
broader: sport
definition: Men's team sport similar to volleyball (with a much lower net) executed mainly in gymnastics clubs
definition: Miesten joukkueurheilulaji, samantapainen kuin lentopallo (matalampi verkko), pelataan yleensä urheiluseuroissa @fi
in scheme: IPTC NewsCodes: Subject Code
notation: 15088000
preferred label: Fist ball @fi

inline skating
type: Concept
broader: sport
definition: Competitive sports using inline skates
definition: Kilpaurheilua rullaluistimilla @fi
in scheme: IPTC NewsCodes: Subject Code
notation: 15089000
preferred label: Rullaluistelu @fi

grass ski
type: Concept
broader: sport
definition: Alpine skiing on roller skis and grass
definition: Laskettelua nurmikolla rullasuksilla @fi
in scheme: IPTC NewsCodes: Subject Code
notation: 15090000
preferred label: Grass ski @fi

snowbiking
type: Concept
broad match: http://cv.iptc.org/newscodes/mediatopic/20000822
broader: sport
definition: Individual sport on snow on a snow bike, the athlete has two mini skis, previous name: ski bob
definition: Aiemmin ski bob @fi
in scheme: IPTC NewsCodes: Subject Code
notation: 15091000
preferred label: Snowbiking @fi

twirling
type: Concept
broad match: http://cv.iptc.org/newscodes/mediatopic/20000822
broader: sport
definition: Team competition with majorettes and a jury
definition: Joukkuelaji, jossa tuomaristo arvioi kilpailijoiden kepinkäsittelytaitoja @fi
in scheme: IPTC NewsCodes: Subject Code
notation: 15092000
preferred label: Twirling @fi

kendo
type: Concept
broader: sport
definition: Japanese traditional martial art using a bamboo sword, sometimes called Japanese fencing. (Programme of National Sports Festival in Japan)
definition: Perinteinen japanilainen budolaji, jossa käytetään bambumiekkaa, joskus kutsutaan myös japanilaiseksi miekkailuksi. (Japanin kansallisen urheilufestivaalin ohjelmassa) @fi
in scheme: IPTC NewsCodes: Subject Code
notation: 15093000
preferred label: Kendo @fi

jukendo
type: Concept
broader: sport
definition: Japanese traditional martial art using a model rifle made of wood. "Juken" means a rifle or gun with blade (bayonet). (Programme of National Sports Festival in Japan)
definition: Perinteinen japanilainen budolaji, jossa käytetään puista kivääriä. "Juken" tarkoittaa kivääriä tai asetta, jossa on terä (pistin). (Japanin kansallisen urheilufestivaalin ohjelmassa) @fi
in scheme: IPTC NewsCodes: Subject Code
notation: 15094000
preferred label: Jukendo @fi

naginata
type: Concept
broader: sport
definition: Japanese traditional martial art using a pole sword made of wood. "Naginata" means a spear with a curved blade. (Programme of National Sports Festival in Japan)
definition: Perintainen japanilainen budolaji, jossa aseena on puinen peitsi. "Naginata" tarkoittaa keihästä, jossa on kaartuva terä. @fi
in scheme: IPTC NewsCodes: Subject Code
notation: 15095000
preferred label: Naginata @fi

kyudo
type: Concept
broader: sport
definition: Japanese traditional martial art using a bamboo bow and arrows, sometimes called Japanese archery. (Programme of National Sports Festival in Japan)
definition: Perinteinen japanilainen budolaji, jossa aseena on bambusta valmistettu jousi ja nuolet, joskus kutsutaan myös japanilaiseksi jousiammunnaksi. (Japanin kansallisen urheilufestivaalin ohjelmassa) @fi
in scheme: IPTC NewsCodes: Subject Code
notation: 15096000
preferred label: Kyudo @fi

kabaddi
type: Concept
broader: sport
definition: The attacking side scores by touching, and the side to guard scores by capturing. The attacker continues calling it "kabaddi".
definition: Peli, jossa hyökkäävä puoli saa pisteitä koskettamalla vastapuolta ja puolustajat ottamalla vastapuolen jäseniä kiinni. Hyökkääjä jatkaa peliä huutamalla "kabaddi". @fi
in scheme: IPTC NewsCodes: Subject Code
notation: 15097000
preferred label: Kabaddi @fi

sepak takraw
type: Concept
broader: sport
definition: The game like volleyball which must not use a hand. The ball made of rattan is used. (Programme of National Sports Festival in Japan)
definition: Lentopallon tyyppinen peli, jossa ei saa käyttää käsiä. Pallo on valmistettu rottingista. (Japanin kansallisen urheilufestivaalin ohjelmassa) @fi
in scheme: IPTC NewsCodes: Subject Code
notation: 15098000
preferred label: Sepak takraw @fi

wushu
type: Concept
broader: sport
definition: Generally, Chinese traditional martial art. (Programme of National Sports Festival in Japan)
definition: Perinteinen kiinalainen kamppailulaji. (Japanin kansallisen urheilufestivaalin ohjelmassa) @fi
in scheme: IPTC NewsCodes: Subject Code
notation: 15099000
preferred label: Wushu @fi

darts
type: Concept
broader: sport
definition: Two players compete by throwing metal darts at a wall-mounted circular board divided radially into segments of different scores
in scheme: IPTC NewsCodes: Subject Code
notation: 15100000
preferred label: Darts @fi

bodybuilding
type: Concept
broad match: http://cv.iptc.org/newscodes/mediatopic/20000822
broader: sport
definition: A person displays pronounced muscle tone and exaggerated muscle mass and definition for overall aesthetic effect
in scheme: IPTC NewsCodes: Subject Code
notation: 15101000
preferred label: Kehonrakennus @fi

sports disciplinary action
type: Concept
broader: sport
definition: Actions, including fines and suspensions levied by sports organisations and teams
in scheme: IPTC NewsCodes: Subject Code
notation: 15102000
preferred label: Urheilun kurinpitotoimet @fi

sports awards
type: Concept
broad match: http://cv.iptc.org/newscodes/mediatopic/15000000
broader: sport
definition: Awards and honors given by sports organisations or won by sports figures
in scheme: IPTC NewsCodes: Subject Code
notation: 15103000
preferred label: Urheilupalkinnot @fi

act of terror
type: Concept
broader: unrest, conflicts and war
definition: Act of violence, often deadly, designed to raise fear and anxiety in a population
in scheme: IPTC NewsCodes: Subject Code
notation: 16001000
preferred label: Terroriteot @fi

armed conflict
type: Concept
broader: unrest, conflicts and war
definition: Disputes between opposing groups involving the use of weaponry, but not formally declared a war
in scheme: IPTC NewsCodes: Subject Code
notation: 16002000
preferred label: Aseelliset konfliktit @fi

revolutions
type: Concept
broader: civil unrest
definition: An often violent change in a nation's system of government by internal forces that results in systematic social change.
in scheme: IPTC NewsCodes: Subject Code
notation: 16003001
preferred label: Vallankumoukset @fi

rebellions
type: Concept
broader: civil unrest
definition: Armed uprising by citizens of a nation with the intent to overthrow the government, without necessarily achieving social change
in scheme: IPTC NewsCodes: Subject Code
notation: 16003002
preferred label: Kapinat @fi

political dissent
type: Concept
broader: civil unrest
definition: Disagreement between political groups, usually organized and sometimes resulting in imprisonment of the dissenters
in scheme: IPTC NewsCodes: Subject Code
notation: 16003003
preferred label: Poliittiset kiistat Toisinajattelijat @fi

religious conflict
type: Concept
broader: civil unrest
definition: Conflicts involving religious differences
in scheme: IPTC NewsCodes: Subject Code
notation: 16003004
preferred label: Uskonnolliset ristiriidat @fi

social conflict
type: Concept
broad match: http://cv.iptc.org/newscodes/mediatopic/16000000
broader: civil unrest
definition: Conflicts involving social differences
in scheme: IPTC NewsCodes: Subject Code
notation: 16003005
preferred label: Sosiaaliset ristiriidat @fi

coup d'etat
type: Concept
broader: unrest, conflicts and war
definition: The overthrow of an established government by an organized group, often the military or a political party
in scheme: IPTC NewsCodes: Subject Code
notation: 16004000
preferred label: Vallankaappaukset @fi

bioterrorism
type: Concept
broader: guerrilla activity
definition: Use of biological agent to raise the level of fear within a population, whether deaths occur or not.
in scheme: IPTC NewsCodes: Subject Code
notation: 16005001
preferred label: Bioterrorismi @fi

bombings
type: Concept
broader: guerrilla activity
definition: Use of explosive devices against people, buildings or structures
in scheme: IPTC NewsCodes: Subject Code
notation: 16005002
preferred label: Pommitukset @fi

genocide
type: Concept
broader: massacre
definition: Systematic killing of one clan, tribe or ethnic type by another
in scheme: IPTC NewsCodes: Subject Code
notation: 16006001
preferred label: Kansanmurha @fi

riots
type: Concept
broader: unrest, conflicts and war
definition: Violent, destructive demonstrations often involving injury to individuals and destruction of property
in scheme: IPTC NewsCodes: Subject Code
notation: 16007000
preferred label: Mellakat @fi

demonstration
type: Concept
broader: unrest, conflicts and war
definition: A public show of feeling or opinion, as by a mass meeting or parade
in scheme: IPTC NewsCodes: Subject Code
notation: 16008000
preferred label: Mielenosoitukset @fi

civil war
type: Concept
broader: war
definition: Armed conflict between members of the same nation or geographical region, in some cases with a desire to divide the nation or region.
in scheme: IPTC NewsCodes: Subject Code
notation: 16009001
preferred label: Sisällissota @fi

international military intervention
type: Concept
broader: war
definition: Temporary use of international forces by invitation or by a decision of an outside body in another country or region for the purpose of resolving a crisis.
in scheme: IPTC NewsCodes: Subject Code
notation: 16009002
preferred label: Kansainvälinen sotilaallinen väliintulo @fi

prisoners and detainees
type: Concept
broader: war
definition: People captured and imprisoned by their enemy during war or armed conflict
in scheme: IPTC NewsCodes: Subject Code
notation: 16009003
preferred label: Sotavangit @fi

peacekeeping force
type: Concept
broader: conflict (general)
definition: Varied national military forces under unified international command to maintain order in disputed areas.
in scheme: IPTC NewsCodes: Subject Code
notation: 16010001
preferred label: Rauhanturvajoukot @fi

crisis
type: Concept
broader: unrest, conflicts and war
definition: Conflict of all kinds that rises to a level where, depending on events, governments can fall, war be declared or stock markets crash, or not
in scheme: IPTC NewsCodes: Subject Code
notation: 16011000
preferred label: Kriisit @fi

weaponry
type: Concept
broader: unrest, conflicts and war
definition: Armaments of all types used to conduct war
in scheme: IPTC NewsCodes: Subject Code
notation: 16012000
preferred label: Aseet @fi

forecast
type: Concept
broader: weather
definition: Prediction of the course of the weather in the future either near term or long term
in scheme: IPTC NewsCodes: Subject Code
notation: 17001000
preferred label: Sääennusteet @fi

global change
type: Concept
broader: weather
definition: The determination whether the Earth is getting warm, or colder, whether seas are rising or falling and the like
definition: Kasvihuoneilmiö ympäristössä @fi
in scheme: IPTC NewsCodes: Subject Code
notation: 17002000
preferred label: Ilmastonmuutokset @fi

weather news
type: Concept
broad match: http://cv.iptc.org/newscodes/mediatopic/17000000
broader: report
definition: General information about weather events
in scheme: IPTC NewsCodes: Subject Code
notation: 17003001
preferred label: Sääuutiset @fi

statistic
type: Concept
broader: weather
definition: Numerical facts about the weather such as temperature, barometric pressure, river levels, humidity, high and low tides and the like
in scheme: IPTC NewsCodes: Subject Code
notation: 17004000
preferred label: Säätilastot @fi

warning
type: Concept
broader: weather
definition: Alerts to the general populace about severe weather coming their way
definition: Jää, kulo, levä, lumi, metsäpalo, myrsky, tuuli @fi
in scheme: IPTC NewsCodes: Subject Code
notation: 17005000
preferred label: Säävaroitukset @fi

IPTC NewsCodes
type: ConceptScheme
creator: International Press Telecommunications Council (IPTC)
description: IPTC creates and maintains sets of concepts – called a controlled vocabulary or a taxonomy – to be assigned as metadata values to news objects like text, photographs, graphics, audio and video files and streams. This allows for a consistent coding of news metadata across news providers and over the course of time – that’s the reason why we call them IPTC NewsCodes.
language: eng
license: http://creativecommons.org/licenses/by/4.0/

cinema
type: Concept
broader: arts, culture and entertainment
definition: Cinema as art and entertainment
in scheme: IPTC NewsCodes: Subject Code
narrower: film festival
notation: 01005000
preferred label: Elokuva @fi

fashion
type: Concept
broader: arts, culture and entertainment
definition: The design of clothing and accessories
definition: Muotitalot, muodin luominen ja suunnittelu, haute couture Vaatteiden ja asusteiden suunnittelu @fi
in scheme: IPTC NewsCodes: Subject Code
narrower: jewelry
notation: 01007000
preferred label: Muoti @fi

sculpture
type: Concept
broader: arts, culture and entertainment
definition: Representation of forms in clays, stone, woods, metals or other materials
definition: Saven, kiven, puun, metallin ja muiden materiaalien käyttö taiteellisen ilmaisun välineenä @fi
in scheme: IPTC NewsCodes: Subject Code
narrower: plastic art
notation: 01015000
preferred label: Kuvanveisto @fi

television
type: Concept
broader: arts, culture and entertainment
definition: Television as art and entertainment
definition: Television sisällöntuotanto @fi
in scheme: IPTC NewsCodes: Subject Code
narrower: soap opera
notation: 01016000
preferred label: Televisio @fi

theatre
type: Concept
broader: arts, culture and entertainment
definition: Telling of a story or idea through dialogue, music and physical expression in a space or building designed for it
in scheme: IPTC NewsCodes: Subject Code
narrower: music theatre
notation: 01017000
preferred label: Teatteri @fi

monument and heritage site
type: Concept
broader: arts, culture and entertainment
definition: Areas containing commemorative objects for historical people or events
in scheme: IPTC NewsCodes: Subject Code
narrower: institution-DEPRECATED
notation: 01018000
preferred label: Kulttuuriperintö @fi

entertainment (general)
type: Concept
broad match: http://cv.iptc.org/newscodes/mediatopic/20000002
broader: arts, culture and entertainment
definition: The collective use of television, radio, theatre, music and the like for the amusement of people
in scheme: IPTC NewsCodes: Subject Code
narrower: entertainment award
notation: 01021000
preferred label: Viihde yleistä @fi

culture (general)
type: Concept
broader: arts, culture and entertainment
definition: The ideas, customs, arts, skills of a particular group
in scheme: IPTC NewsCodes: Subject Code
narrower: cultural development
notation: 01022000
preferred label: Kulttuuri yleistä @fi

justice and rights
type: Concept
broader: crime, law and justice
definition: The equitable administration of laws and regulations
in scheme: IPTC NewsCodes: Subject Code
narrower: civil rights
notation: 02007000
preferred label: Oikeusturva @fi

industrial accident
type: Concept
broader: disaster and accident
definition: A mishap in a factory, a shop or an office, potentially harmful to humans
in scheme: IPTC NewsCodes: Subject Code
narrower: structural failures
notation: 03006000
preferred label: Teollisuusonnettomuudet @fi

meteorological disaster
type: Concept
broader: disaster and accident
definition: A weather-related disaster
definition: Säästä johtuvat ja säähän liittyvät onnettomuudet @fi
in scheme: IPTC NewsCodes: Subject Code
narrower: windstorms
notation: 03007000
preferred label: Säätuhot @fi

emergency incident
type: Concept
broader: disaster and accident
definition: A sudden, unexpected event that requires immediate action
in scheme: IPTC NewsCodes: Subject Code
narrower: explosion
notation: 03014000
preferred label: Onnettomuudet yleistä @fi

economy (general)
type: Concept
broader: economy, business and finance
definition: Content of a general nature about trade and the economy
in scheme: IPTC NewsCodes: Subject Code
narrower: economic policy
notation: 04017000
preferred label: Talouselämä @fi

business (general)
type: Concept
broad match: http://cv.iptc.org/newscodes/mediatopic/04000000
broader: economy, business and finance
definition: Content of a general nature about business
in scheme: IPTC NewsCodes: Subject Code
narrower: institution
notation: 04018000
preferred label: Liike-elämä @fi

finance (general)
type: Concept
broad match: http://cv.iptc.org/newscodes/mediatopic/04000000
broader: economy, business and finance
definition: Content of a general nature about finance
in scheme: IPTC NewsCodes: Subject Code
narrower: money and monetary policy
notation: 04019000
preferred label: Rahoitus @fi

nature
type: Concept
broader: environmental issue
definition: Taken as a whole the natural environment of flora and fauna
in scheme: IPTC NewsCodes: Subject Code
narrower: invasive species
notation: 06007000
preferred label: Luonto @fi

preventative medicine
type: Concept
broader: health
definition: Substances used to prevent diseases or illnesses
in scheme: IPTC NewsCodes: Subject Code
narrower: vaccines
notation: 07008000
preferred label: Ehkäisevä terveydenhoito @fi

healthcare policy
type: Concept
broader: health
definition: Health-related policy decisions including what different countries are doing regarding prescription drug policies, AIDS, psychiatric care, health care funding and related topics.
in scheme: IPTC NewsCodes: Subject Code
narrower: food safety
notation: 07013000
preferred label: Terveyspolitiikka @fi

award and prize
type: Concept
broader: human interest
definition: Decorations, awards and prizes, including those given by the government.
definition: Kunniamerkit , palkinnot ja muut huomionosoitukset @fi
in scheme: IPTC NewsCodes: Subject Code
narrower: record
notation: 08006000
preferred label: Kunniamerkit Palkinnot @fi

gastronomy
type: Concept
broader: lifestyle and leisure
definition: The art of good eating
definition: Ruokaan ja gastronomiaan liittyvät jutut @fi
in scheme: IPTC NewsCodes: Subject Code
narrower: organic foods
notation: 10003000
preferred label: Ruoka @fi

travel and commuting
type: Concept
broader: lifestyle and leisure
definition: Transport options, travel networks, commuting, car pooling and business travel
definition: Säännöllinen matkustaminen esim. kodin ja työpaikan välillä @fi
in scheme: IPTC NewsCodes: Subject Code
narrower: traffic
notation: 10007000
preferred label: Koulumatkat Työmatkat @fi

foreign aid
type: Concept
broader: politics
definition: Help provided by one nation to another
in scheme: IPTC NewsCodes: Subject Code
narrower: economic sanction
notation: 11005000
preferred label: Ulkomainen apu @fi

parties and movements
type: Concept
broader: politics
definition: Covers both formally recognized and informal political associations
in scheme: IPTC NewsCodes: Subject Code
narrower: non government organizations (NGO)
notation: 11010000
preferred label: Puolueet Poliittiset liikkeet @fi

state budget and tax
type: Concept
broader: politics
definition: The national budget as promulgated by the government
in scheme: IPTC NewsCodes: Subject Code
narrower: public finance
notation: 11013000
preferred label: Valtion budjetti Verot @fi

church (organisation)-DEPRECATED
type: Concept
broader: religion and belief
definition: NA
in scheme: IPTC NewsCodes: Subject Code
narrower: religious facilities-DEPRECATED
notation: 12005000

religious leader
type: Concept
broader: religion and belief
definition: Person or persons who have a ritual, juridical or otherwise leading role in their respective church or religion
in scheme: IPTC NewsCodes: Subject Code
narrower: pope
notation: 12015000
preferred label: Uskonnolliset johtajat @fi

engineering
type: Concept
broad match: http://cv.iptc.org/newscodes/mediatopic/20000756
broader: science and technology
definition: Stories about putting scientific knowledge to practical uses in the fields of civil, electrical, mechanical and chemical engineering
in scheme: IPTC NewsCodes: Subject Code
narrower: material science
notation: 13002000
preferred label: Tekniset tieteet @fi

research
type: Concept
broader: science and technology
definition: Methodical investigation of events, procedures etc to explain why they occur, or to find solutions for problems
definition: Mm. tutkimusyhteistyö, tutkimusohjelmat, tutkimusrahoitus @fi
in scheme: IPTC NewsCodes: Subject Code
narrower: survey
notation: 13006000
preferred label: Tutkimus @fi

euthanasia (also includes assisted suicide)
type: Concept
broader: social issue
definition: Voluntary death with the aid of another
in scheme: IPTC NewsCodes: Subject Code
narrower: suicide
notation: 14005000
preferred label: Eutanasia @fi

missing person
type: Concept
broader: social issue
definition: A person who is not where they are expected to be for a period of time
in scheme: IPTC NewsCodes: Subject Code
narrower: missing due to hostilities
notation: 14017000
preferred label: Kadonneet @fi

curling
type: Concept
broader: sport
definition: A game played on ice with large flat round stones. A player throws the stone, aiming at a target. Team mates of the player who has thrown the stone can sweep the ice in front of the stone to help smooth its path towards the target.
in scheme: IPTC NewsCodes: Subject Code
narrower: icestock sport
notation: 15018000
preferred label: Curling @fi

field Hockey
type: Concept
broader: sport
definition: A ball sport involving two teams of 11 players using curved sticks. The aim is to score as many goals as possible.
in scheme: IPTC NewsCodes: Subject Code
narrower: roll hockey
notation: 15024000
preferred label: Maahockey @fi

orienteering
type: Concept
broader: sport
definition: An individual time-trial over a route marked out by beacons. The competitor has to search out and find in a specific order. The contestant makes his way with the help of a compass and map
in scheme: IPTC NewsCodes: Subject Code
narrower: ski orienteering
notation: 15044000
preferred label: Suunnistus @fi

rugby union
type: Concept
broader: sport
definition: Two teams of 15 compete on a pitch where they score tries and penalties by running with and passing an oval ball to be touched down behind the goal line or kicked between goal posts in a tough physical contest
in scheme: IPTC NewsCodes: Subject Code
narrower: rugby 7
notation: 15049000
preferred label: Rugby union @fi

tennis
type: Concept
broader: sport
definition: A sport where two players, four in doubles, equipped with a racket compete by hitting the ball over a net into the opponent's side of the court with the aim of putting it out of reach within the regulation lines, thus winning points.
in scheme: IPTC NewsCodes: Subject Code
narrower: soft tennis
notation: 15065000
preferred label: Tennis @fi

volleyball
type: Concept
broader: sport
definition: Two teams of six record points by hitting a ball over a net into the opponent's half of the court, keeping it in the air at all times. Points are won when opponents fail to return the ball.
in scheme: IPTC NewsCodes: Subject Code
narrower: beach volleyball
notation: 15067000
preferred label: Lentopallo @fi

massacre
type: Concept
broader: unrest, conflicts and war
definition: The death of a large group of people over a brief period of time
in scheme: IPTC NewsCodes: Subject Code
narrower: genocide
notation: 16006000
preferred label: Joukkomurha @fi

conflict (general)
type: Concept
broad match: http://cv.iptc.org/newscodes/mediatopic/16000000
broader: unrest, conflicts and war
definition: A dispute which can be at several levels,
in scheme: IPTC NewsCodes: Subject Code
narrower: peacekeeping force
notation: 16010000
preferred label: Muut konfliktit @fi

report
type: Concept
broad match: http://cv.iptc.org/newscodes/mediatopic/17000000
broader: weather
definition: Any distributed announcement about the weather
definition: Ajokeli, merisää, siitepöly @fi
in scheme: IPTC NewsCodes: Subject Code
narrower: weather news
notation: 17003000
preferred label: Säätiedotteet @fi

literature
type: Concept
broader: arts, culture and entertainment
definition: The use of pamphlets, books or other printed matter to convey ideas, stories or other messages for the public
in scheme: IPTC NewsCodes: Subject Code
narrower: fiction
narrower: poetry
notation: 01010000
preferred label: Kirjallisuus @fi

punishment
type: Concept
broader: crime, law and justice
definition: The retribution handed out to those who break the laws
in scheme: IPTC NewsCodes: Subject Code
narrower: fine
narrower: execution
notation: 02004000
preferred label: Rangaistukset @fi

laws
type: Concept
broader: crime, law and justice
definition: The codification of rules of behaviour
in scheme: IPTC NewsCodes: Subject Code
narrower: criminal
narrower: civil
notation: 02006000
preferred label: Lait @fi

prosecution
type: Concept
broader: crime, law and justice
definition: Stories regarding activities and investigations by public prosecutors.
in scheme: IPTC NewsCodes: Subject Code
narrower: defendant
narrower: witness
notation: 02009000
preferred label: Syyttäjälaitos @fi

international law
type: Concept
broader: crime, law and justice
definition: The system of laws embraced by all nations, such as the Geneva Convention, the International Law of the Seas, etc.
in scheme: IPTC NewsCodes: Subject Code
narrower: international court or tribunal
narrower: extradition
notation: 02011000
preferred label: Kansainväliset lait @fi

disaster (general)
type: Concept
broader: disaster and accident
definition: Serious or sudden misfortune
definition: Vakava tai äkillinen, laaja onnettomuus SELITYSLISÄYS? @fi
in scheme: IPTC NewsCodes: Subject Code
narrower: natural disasters
narrower: avalanche/landslide
notation: 03015000
preferred label: Katastrofit @fi

conservation
type: Concept
broader: environmental issue
definition: Preservation of wilderness areas, flora and fauna, including species extinction
definition: Ihmisten toimien haitallisten vaikutusten vähentäminen. @fi
in scheme: IPTC NewsCodes: Subject Code
narrower: endangered species
narrower: ecosystem
notation: 06002000
preferred label: Luonnonsuojelu @fi

environmental pollution
type: Concept
broader: environmental issue
definition: Corruption of air, water, land etc. by harmful substances
in scheme: IPTC NewsCodes: Subject Code
narrower: air pollution
narrower: water pollution
notation: 06005000
preferred label: Saastuminen @fi

medical staff
type: Concept
broader: health
definition: Doctors, nurses, interns and others in a medical facility
in scheme: IPTC NewsCodes: Subject Code
narrower: primary care physician
narrower: health-workers union
notation: 07006000
preferred label: Terveydenhoidon henkilökunta @fi

government health care
type: Concept
broader: health
definition: Health care provided by national governments
in scheme: IPTC NewsCodes: Subject Code
narrower: medicare
narrower: medicaid
notation: 07011000
preferred label: Julkinen terveydenhuolto @fi

wage and pension
type: Concept
broader: labour
definition: Parts of a salary divided for current income and future income
in scheme: IPTC NewsCodes: Subject Code
narrower: employee benefits
narrower: social security
notation: 09011000
preferred label: Palkat Työeläkkeet @fi

parliament
type: Concept
broader: politics
definition: The collective body of elected officials representing the people
in scheme: IPTC NewsCodes: Subject Code
narrower: upper house
narrower: lower house
notation: 11009000
preferred label: Eduskunta @fi

belief (faith)
type: Concept
broader: religion and belief
definition: The established beliefs of an individuals religion
definition: Esim. rukous, sielunhoito. @fi
in scheme: IPTC NewsCodes: Subject Code
narrower: unificationism
narrower: scientology
notation: 12002000
preferred label: Usko @fi

values
type: Concept
broader: religion and belief
definition: Personal levels of social behaviour
in scheme: IPTC NewsCodes: Subject Code
narrower: ethics
narrower: corrupt practices
notation: 12006000
preferred label: Arvot @fi

technology (general)
type: Concept
broad match: http://cv.iptc.org/newscodes/mediatopic/20000756
broader: science and technology
definition: The study of the practical or industrial arts, and applied sciences such as physics, hydrodynamics and thermodynamics
in scheme: IPTC NewsCodes: Subject Code
narrower: rocketry
narrower: laser
notation: 13010000
preferred label: Teknologia yleistä @fi

minority group
type: Concept
broader: social issue
definition: A group of people classified by race, language, religion or other characteristic numerically smaller than others of the same classification
in scheme: IPTC NewsCodes: Subject Code
narrower: gays and lesbians
narrower: national or ethnic minority
notation: 14010000
preferred label: Vähemmistöt @fi

aero and aviation sport
type: Concept
broad match: http://cv.iptc.org/newscodes/mediatopic/15000000
broader: sport
definition: Parachuting, freefall (parapente, delta-plane), gliding, aerostat, motorised flight (airplane, ultra light craft, helicopter)
in scheme: IPTC NewsCodes: Subject Code
narrower: parachuting
narrower: sky diving
notation: 15001000
preferred label: Urheiluilmailu @fi

archery
type: Concept
broader: sport
definition: Archers use bows and arrows to aim at targets 1.22 metres in diameter which are on average 70 metres distant.
in scheme: IPTC NewsCodes: Subject Code
narrower: FITA / Outdoor target archery
narrower: crossbow shooting
notation: 15004000
preferred label: Jousiammunta @fi

bobsleigh
type: Concept
broader: sport
definition: In bobsleigh two or four persons race down a course sitting in a sled that consists of a main hull, a frame, two axles and sets of runners. The total time of all heats in a competition is added together to determine the winner.
definition: Paitsi luge ja skeleton @fi
in scheme: IPTC NewsCodes: Subject Code
narrower: two-man sled
narrower: four-man sled
notation: 15011000
preferred label: Rattikelkkailu @fi

climbing
type: Concept
broader: sport
definition: mountain sports
in scheme: IPTC NewsCodes: Subject Code
narrower: mountaineering
narrower: sport climbing
notation: 15016000
preferred label: Kiipeily @fi

ice hockey
type: Concept
broader: sport
definition: Two teams of six heavily padded skaters try and outscore each other by hitting a puck into the opponents goal.
in scheme: IPTC NewsCodes: Subject Code
narrower: National Hockey League (North American)
narrower: sledge hockey
notation: 15031000
preferred label: Jääkiekko @fi

karate
type: Concept
broader: sport
definition: A martial art where chops, punches, kicks and throws are used to defeat an opponent.
in scheme: IPTC NewsCodes: Subject Code
narrower: sparring
narrower: formal exercise-DEPRECATED
notation: 15034000
preferred label: Karate @fi

luge
type: Concept
broader: sport
definition: Luge (French word for sled) is competed in singles or doubles. The competitor(s) lay on their back(s) on an open sled and race down a course. The competitor(s) and the sled must be in contact when passing the finishing line.
in scheme: IPTC NewsCodes: Subject Code
narrower: singles
narrower: doubles
notation: 15036000
preferred label: Ohjaskelkkailu @fi

power boating
type: Concept
broader: sport
definition: Races between motor boats on rivers or lakes
in scheme: IPTC NewsCodes: Subject Code
narrower: F1
narrower: F2
notation: 15046000
preferred label: Moottoriveneily @fi

snow boarding
type: Concept
broader: sport
definition: Practiced with a single board (rather than two skis)
in scheme: IPTC NewsCodes: Subject Code
narrower: giant slalom
narrower: half-pipe
notation: 15053000
preferred label: Lumilautailu @fi

dog racing
type: Concept
broader: sport
definition: Dogs racing around a track
in scheme: IPTC NewsCodes: Subject Code
narrower: sled
narrower: oval track
notation: 15082000
preferred label: Koiraurheilulajit @fi

guerrilla activity
type: Concept
broader: unrest, conflicts and war
definition: Anti-government actions by clandestine groups using hit-and-run techniques or sabotage, kidnapping and the like
in scheme: IPTC NewsCodes: Subject Code
narrower: bioterrorism
narrower: bombings
notation: 16005000
preferred label: Sissitoiminta @fi

judiciary (system of justice)
type: Concept
broader: crime, law and justice
definition: The system set up to deal with crime and those who do them
in scheme: IPTC NewsCodes: Subject Code
narrower: lawyer
narrower: judge
narrower: court administration
notation: 02002000
preferred label: Oikeuslaitos @fi

police
type: Concept
broader: crime, law and justice
definition: Agents of the legal system set up enforce the laws
in scheme: IPTC NewsCodes: Subject Code
narrower: law enforcement
narrower: investigation
narrower: arrest
notation: 02003000
preferred label: Poliisi @fi

trials
type: Concept
broader: crime, law and justice
definition: The process by which guilt or innocence, or right or wrong is determined and adjudged
in scheme: IPTC NewsCodes: Subject Code
narrower: litigation
narrower: arbitration
narrower: court preliminary
notation: 02008000
preferred label: Oikeudenkäynti @fi

school
type: Concept
broader: education
definition: A building or institution in which education of various sorts is provided
in scheme: IPTC NewsCodes: Subject Code
narrower: elementary schools
narrower: middle schools
narrower: high schools
notation: 05005000
preferred label: Koulut Oppilaitokset @fi

illness
type: Concept
broader: health
definition: Non-specific maladies such as stomach aches, headaches, flat feet, lumbago
definition: Määrittämättömiä sairauksia kuten vatsakipu, päänsärky, lättäjalat, noidannuoli @fi
in scheme: IPTC NewsCodes: Subject Code
narrower: mental illness
narrower: eating disorder
narrower: obesity
notation: 07017000
preferred label: Vaivat Kivut @fi

collective contract
type: Concept
broader: labour
definition: Usually written contracts covering a specific class of worker
in scheme: IPTC NewsCodes: Subject Code
narrower: contract issue-wages
narrower: contract issue-healthcare
narrower: contract issue-work rules
notation: 09002000
preferred label: Työehtosopimukset @fi

hobby
type: Concept
broader: lifestyle and leisure
definition: Various types of activities for amusement, such as collecting stamps, building models, quilting, crafts
definition: Ei kalastus eikä metsästys @fi
in scheme: IPTC NewsCodes: Subject Code
narrower: DIY
narrower: shopping
narrower: gardening
notation: 10004000
preferred label: Harrastukset @fi

treaty and international organisation-DEPRECATED
type: Concept
broad match: http://cv.iptc.org/newscodes/mediatopic/20000638
broader: politics
definition: NA
in scheme: IPTC NewsCodes: Subject Code
narrower: international relations-DEPRECATED
narrower: peace negotiations-DEPRECATED
narrower: alliances-DEPRECATED
notation: 11014000

politics (general)
type: Concept
broader: politics
definition: The art or science of participating in the affairs of government, a state of political party
in scheme: IPTC NewsCodes: Subject Code
narrower: political systems
narrower: democracy
narrower: political development
notation: 11024000
preferred label: Politiikka yleistä @fi

religious text
type: Concept
broader: religion and belief
definition: Scriptures holy or important for a church or religion
definition: Kirkolle ja uskonnolle tärkeät pyhät kirjat ja kirjoitukset. @fi
in scheme: IPTC NewsCodes: Subject Code
narrower: bible
narrower: qur'an
narrower: torah
notation: 12023000
preferred label: Uskonnolliset tekstit @fi

religious event
type: Concept
broader: religion and belief
definition: News regarding a religious event but not a festival or holiday
definition: Uutiset, joissa käsitellään hengellisiä tai uskonnollisia tapahtumia. Ei uskonnolliset juhlat ja vapaapäivät. @fi
in scheme: IPTC NewsCodes: Subject Code
narrower: catholic convention
narrower: protestant convention
narrower: ritual
notation: 12025000
preferred label: Uskonnolliset tapahtumat @fi

American football
type: Concept
broader: sport
definition: Team ball game that opposes two teams that have attack sections and defence sections. Each attack goes up against the other defence and attempts to move an oval-shaped ball down the field and into the end-zone to mark a touchdown and earn points.
in scheme: IPTC NewsCodes: Subject Code
narrower: (US) National Football League (NFL) (North American)
narrower: CFL
narrower: AFL-DEPRECATED
notation: 15003000
preferred label: Amerikkalainen jalkapallo @fi

fencing
type: Concept
broader: sport
definition: Combat sport using a sword or foil.
in scheme: IPTC NewsCodes: Subject Code
narrower: epee
narrower: foil
narrower: sabre
notation: 15023000
preferred label: Miekkailu @fi

figure Skating
type: Concept
broader: sport
definition: To obtain the best marks possible from nine judges who award scores after two prepared sections - both skated to music - during which competitors must attempt to achieve the greatest possible harmony between artistic flair and technical precision.
in scheme: IPTC NewsCodes: Subject Code
narrower: singles
narrower: pairs
narrower: ice dance
notation: 15025000
preferred label: Taitoluistelu @fi

freestyle Skiing
type: Concept
broader: sport
definition: Competitors perform a series of breathtaking acrobatic leaps from a prepared jump. Combined with moguls, jumps and ski ballet.
in scheme: IPTC NewsCodes: Subject Code
narrower: moguls
narrower: aerials
narrower: artistic skiing
notation: 15026000
preferred label: Freestylehiihto @fi

motor rallying
type: Concept
broader: sport
definition: A season of endurance races over closed circuits including dirt tracks, roads and even snowy conditions featuring specials using adapted road cars with a driver and co-pilot.
in scheme: IPTC NewsCodes: Subject Code
narrower: rallying
narrower: pursuit
narrower: rallycross
notation: 15040000
preferred label: Ralliautoilu @fi

ski jumping
type: Concept
broader: sport
definition: Competitors descend a snow covered elevated ramp on skis and try to fly off it as far as possible, receiving marks for distance, style of flight and landing
in scheme: IPTC NewsCodes: Subject Code
narrower: K90 jump
narrower: K120 jump
narrower: K180 (flying jump)
notation: 15052000
preferred label: Mäkihyppy @fi

triathlon
type: Concept
broader: sport
definition: An endurance multi-sport where competitors first swim, then cycle and then run a road race. Distances vary according to the competition, the Olympic version being 1.5, 40 and 10km respectively.
in scheme: IPTC NewsCodes: Subject Code
narrower: triathlon swimming
narrower: triathlon cycling
narrower: triathlon run
notation: 15066000
preferred label: Triathlon @fi

war
type: Concept
broader: unrest, conflicts and war
definition: A formal declaration of hostilities by one country against another
in scheme: IPTC NewsCodes: Subject Code
narrower: civil war
narrower: international military intervention
narrower: prisoners and detainees
notation: 16009000
preferred label: Sodat @fi

mass media
type: Concept
broader: arts, culture and entertainment
definition: Television, radio, magazines, newspapers etc
definition: Televisio, radio, aikakausilehdet, sanomalehdet jne. @fi
in scheme: IPTC NewsCodes: Subject Code
narrower: periodicals
narrower: news media
narrower: newspapers
narrower: reviews
notation: 01026000
preferred label: Joukkoviestintä @fi

transport accident
type: Concept
broader: disaster and accident
definition: An accident involving one or more vehicles
in scheme: IPTC NewsCodes: Subject Code
narrower: road accident
narrower: railway accident
narrower: air and space accident
narrower: maritime accident
notation: 03010000
preferred label: Liikenneonnettomuudet @fi

market and exchange
type: Concept
broader: economy, business and finance
definition: Organized entities for buying and selling stocks, currencies, commodities and other goods
in scheme: IPTC NewsCodes: Subject Code
narrower: energy
narrower: metal
narrower: securities
narrower: soft commodity
notation: 04009000
preferred label: Markkinat Pörssit @fi

transport
type: Concept
broader: economy, business and finance
definition: The means of getting from one place to the other without walking
definition: Matkustajaliikenne ja rahtiliikenne @fi
in scheme: IPTC NewsCodes: Subject Code
narrower: air transport
narrower: railway
narrower: road transport
narrower: waterway and maritime transport
notation: 04015000
preferred label: Liikenne @fi

teaching and learning
type: Concept
broader: education
definition: Either end of the education equation
definition: Oppimistapahtuman molemmat osapuolet. @fi
in scheme: IPTC NewsCodes: Subject Code
narrower: students
narrower: teachers
narrower: curriculum
narrower: test/examination
notation: 05010000
preferred label: Opetus ja oppiminen @fi

religious education
type: Concept
broader: education
definition: Instruction by any faith, in that faith or about other faiths, usually, but not always, conducted in schools run by religious bodies
definition: Minkä tahansa uskontokunnan järjestämä opetus. Tavallisesti, mutta ei aina, järjestetty kouluissa, joita ylläpitävät uskonnolliset yhteisöt. @fi
in scheme: IPTC NewsCodes: Subject Code
narrower: parochial school
narrower: seminary
narrower: yeshiva
narrower: madrasa
notation: 05011000
preferred label: Uskonnollinen opetus @fi

medicine
type: Concept
broader: health
definition: A substance used with the expectation that it will eliminate disease or illness
in scheme: IPTC NewsCodes: Subject Code
narrower: herbal
narrower: holistic
narrower: western
narrower: traditional Chinese
notation: 07007000
preferred label: Lääkkeet @fi

employment
type: Concept
broader: labour
definition: Paid labour
in scheme: IPTC NewsCodes: Subject Code
narrower: labor market
narrower: job layoffs
narrower: child labor
narrower: occupations
notation: 09003000
preferred label: Työllisyys @fi

game
type: Concept
broader: lifestyle and leisure
definition: Contests generally for ones amusement
definition: Kaikki muut pelit paitsi go, shakki, bridge ja rahapelit @fi
in scheme: IPTC NewsCodes: Subject Code
narrower: Go
narrower: chess
narrower: bridge
narrower: shogi
notation: 10001000
preferred label: Pelit @fi

diplomacy
type: Concept
broader: politics
definition: The use of verbal and written skills for persuading others to your point of view
in scheme: IPTC NewsCodes: Subject Code
narrower: summit
narrower: international relations
narrower: peace negotiations
narrower: alliances
notation: 11002000
preferred label: Diplomatia Ulkopolitiikka @fi

applied science
type: Concept
broad match: http://cv.iptc.org/newscodes/mediatopic/13000000
broader: science and technology
definition: Stories about putting scientific knowledge to practical uses in the fields of the medical sciences, agriculture, domestic sciences as well as trades and crafts
in scheme: IPTC NewsCodes: Subject Code
narrower: physics
narrower: chemistry
narrower: cosmology
narrower: particle physics
notation: 13001000
preferred label: Soveltavat tieteet @fi

demographics
type: Concept
broader: social issue
definition: The study of people and here they live and how they interact
in scheme: IPTC NewsCodes: Subject Code
narrower: population and census
narrower: immigration
narrower: illegal immigrants
narrower: emigrants
notation: 14003000
preferred label: Väestötutkimus @fi

equestrian
type: Concept
broader: sport
definition: Sport involving a horse and rider.
in scheme: IPTC NewsCodes: Subject Code
narrower: three-day event
narrower: dressage
narrower: jumping
narrower: cross country
notation: 15022000
preferred label: Ratsastus @fi

horse racing, harness racing
type: Concept
broader: sport
definition: Mounted horse races.
in scheme: IPTC NewsCodes: Subject Code
narrower: flat racing
narrower: steeple chase
narrower: trotting
narrower: cross country
notation: 15030000
preferred label: Hevosurheilu @fi

water skiing
type: Concept
broader: sport
definition: On one or two skis contestants are pulled by a power boat along the water's surface
in scheme: IPTC NewsCodes: Subject Code
narrower: slalom
narrower: trick
narrower: jump
narrower: combined
notation: 15069000
preferred label: Vesihiihto @fi

windsurfing
type: Concept
broader: sport
definition: Contestants must complete a marked out course as fast as possible on a windsurf board
in scheme: IPTC NewsCodes: Subject Code
narrower: ocean
narrower: lake
narrower: river
narrower: land
notation: 15071000
preferred label: Purjelautailu @fi

metal and mineral
type: Concept
broader: economy, business and finance
definition: Production and refining of ores into metals
in scheme: IPTC NewsCodes: Subject Code
narrower: building material
narrower: gold and precious material
narrower: iron and steel
narrower: non ferrous metal
narrower: mining
notation: 04012000
preferred label: Metallit Mineraalit @fi

tourism and leisure
type: Concept
broader: economy, business and finance
definition: Tourism and leisure industries
in scheme: IPTC NewsCodes: Subject Code
narrower: casino and gambling
narrower: hotel and accommodation
narrower: recreational and sporting goods
narrower: restaurant and catering
narrower: tour operator
notation: 04014000
preferred label: Matkailu- ja vapaa-aikateollisuus @fi

health treatment
type: Concept
broader: health
definition: In general treatment of diseases and other conditions to produce wellness
in scheme: IPTC NewsCodes: Subject Code
narrower: prescription drugs
narrower: dietary supplements
narrower: diet
narrower: medical procedure/test
narrower: therapy
notation: 07003000
preferred label: Terveydenhoito @fi

medical specialisation
type: Concept
broader: health
definition: The different medical specialist areas.
in scheme: IPTC NewsCodes: Subject Code
narrower: geriatric
narrower: pediatrics
narrower: reproduction
narrower: genetics
narrower: obstetrics/gynecology
notation: 07014000
preferred label: Lääketieteen erikoisalat @fi

people
type: Concept
broader: human interest
definition: Unusual content about people of all levels
definition: Epätavalliset jutut ihmisistä. @fi
in scheme: IPTC NewsCodes: Subject Code
narrower: advice
narrower: celebrity
narrower: accomplishment
narrower: human mishap
narrower: fortune-telling
notation: 08003000
preferred label: Ihmiset human interest @fi

society
type: Concept
broader: human interest
definition: Stories of well-known people
in scheme: IPTC NewsCodes: Subject Code
narrower: ceremony
narrower: death
narrower: funeral
narrower: estate bestowal
narrower: memorial
notation: 08005000
preferred label: Seurapiirit @fi

religion-DEPRECATED
type: Concept
broader: religion and belief
definition: NA
in scheme: IPTC NewsCodes: Subject Code
narrower: christianity-DEPRECATED
narrower: islam-DEPRECATED
narrower: judaism-DEPRECATED
narrower: buddhism-DEPRECATED
narrower: hinduism-DEPRECATED
notation: 12004000

religious festival or holiday
type: Concept
broader: religion and belief
definition: Holy day or day of observance in a religion which sometimes is a public holiday as well
in scheme: IPTC NewsCodes: Subject Code
narrower: christmas
narrower: easter
narrower: pentecost
narrower: ramadan
narrower: yom kippur
notation: 12014000
preferred label: Kirkolliset juhlat @fi

human science
type: Concept
broader: science and technology
definition: Sociology, psychology, anthropology and political science
in scheme: IPTC NewsCodes: Subject Code
narrower: social sciences
narrower: history
narrower: psychology
narrower: sociology
narrower: anthropology
notation: 13003000
preferred label: Humanistiset tieteet Yhteiskuntatieteet @fi

people
type: Concept
broader: social issue
definition: Individuals as a whole, sometimes broken down into various classes, such as indigenous people, people of class etc
in scheme: IPTC NewsCodes: Subject Code
narrower: children
narrower: infants
narrower: teen-agers
narrower: adults
narrower: senior citizens
notation: 14024000
preferred label: Ihmiset sosiaalikysymykset @fi

social issues (general)
type: Concept
broader: social issue
definition: Issues affecting a number of individuals in their daily lives like housing, food, education, personal relationships
in scheme: IPTC NewsCodes: Subject Code
narrower: social conditions
narrower: social problems
narrower: discrimination
narrower: social services
narrower: death penalty policies
notation: 14025000
preferred label: Sosiaalikysymykset yleistä @fi

alpine skiing
type: Concept
broader: sport
definition: Skiing downhill on snow-covered slopes as fast as possible. The slopes contain intermediate gates which are spaced according to the discipline involved
in scheme: IPTC NewsCodes: Subject Code
narrower: downhill
narrower: giant slalom
narrower: super G
narrower: slalom
narrower: combined
notation: 15002000
preferred label: Alppihiihto @fi

basketball
type: Concept
broader: sport
definition: Game played between two teams of five - points are scored by placing the large inflated ball into a net fixed on a ring 3.05m above the ground.
in scheme: IPTC NewsCodes: Subject Code
narrower: National Basketball Association (North American Professional)
narrower: professional - Women general
narrower: Swiss netball
narrower: German netball
narrower: Dutch netball
notation: 15008000
preferred label: Koripallo @fi

modern pentathlon
type: Concept
broader: sport
definition: The Modern Pentathlon comprises five events run over a single day in the following order: shooting, fencing, swimming, horse riding and running.
in scheme: IPTC NewsCodes: Subject Code
narrower: running
narrower: shooting
narrower: swimming
narrower: fencing
narrower: showjumping
notation: 15038000
preferred label: Nykyaikainen viisiottelu @fi

sports organisations
type: Concept
broader: sport
definition: Organisations responsible for a specific sport
in scheme: IPTC NewsCodes: Subject Code
narrower: IOC
narrower: international federation
narrower: continental federation
narrower: national federation
narrower: GAISF
notation: 15058000
preferred label: Urheilujärjestöt @fi

civil unrest
type: Concept
broader: unrest, conflicts and war
definition: Dissatisfaction among the general population as evidenced by rallies, strikes, demonstrations or sabotage
in scheme: IPTC NewsCodes: Subject Code
narrower: revolutions
narrower: rebellions
narrower: political dissent
narrower: religious conflict
narrower: social conflict
notation: 16003000
preferred label: Levottomuudet @fi

weather
type: Concept
definition: The study, reporting and prediction of meteorological phenomena.
definition: Meteorologisten ilmiöiden tutkiminen ja ennustaminen sekä niistä tiedottaminen. @fi
in scheme: IPTC NewsCodes: Subject Code
narrower: forecast
narrower: global change
narrower: report
narrower: statistic
narrower: warning
notation: 17000000
preferred label: Sää @fi
top concept of: IPTC NewsCodes: Subject Code

agriculture
type: Concept
broader: economy, business and finance
definition: The process of producing natural materials for consumption
in scheme: IPTC NewsCodes: Subject Code
narrower: arable farming
narrower: fishing industry
narrower: forestry and timber
narrower: livestock farming
narrower: viniculture
narrower: aquaculture
notation: 04001000
preferred label: Maatalous Metsätalous @fi

family
type: Concept
broader: social issue
definition: A group of individuals related by blood or marriage
in scheme: IPTC NewsCodes: Subject Code
narrower: parent and child
narrower: adoption
narrower: marriage
narrower: divorce
narrower: sex
narrower: courtship
notation: 14006000
preferred label: Perhe @fi

baseball
type: Concept
broader: sport
definition: A game between two teams of nine played on an enclosed ground. The team which scores the most points wins. A point is scored when a player runs around the ground marked out by four bases.
in scheme: IPTC NewsCodes: Subject Code
narrower: Major League Baseball (North American Professional) - American League
narrower: Major League Baseball (North American Professional) - National League
narrower: Major League Baseball (North American Professional) - Special (e.g. All-Star, World Series)
narrower: rubberball baseball
narrower: Major League Baseball Playoffs
narrower: World Series
notation: 15007000
preferred label: Baseball @fi

biathlon
type: Concept
broader: sport
definition: A combination of cross country skiing and target shooting in a pursuit format.
in scheme: IPTC NewsCodes: Subject Code
narrower: 7.5 km
narrower: 10 km
narrower: 15 km
narrower: 20 km
narrower: 4x7.5 km relay
narrower: 12.5 km pursuit
notation: 15009000
preferred label: Ampumahiihto @fi

billiards, snooker and pool
type: Concept
broader: sport
definition: A game played on a flat table covered with a cloth (baize) where players hit balls according to specific rules using a wooden cue.
definition: Myös snooker ja pool @fi
in scheme: IPTC NewsCodes: Subject Code
narrower: 8 ball
narrower: 9 ball
narrower: 14.1
narrower: continuous-DEPRECATED
narrower: other-DEPRECATED
narrower: snooker
notation: 15010000
preferred label: Biljardi @fi

diving
type: Concept
broader: sport
definition: Competitors dive off a fixed or spring board and are assessed by seven judges giving marks up to ten for their acrobatic moves.
in scheme: IPTC NewsCodes: Subject Code
narrower: 10 m platform
narrower: 10 m platform synchronised
narrower: 3 m springboard
narrower: 3 m springboard synchronised
narrower: subaquatics
narrower: scuba diving
notation: 15021000
preferred label: Uimahypyt @fi

music
type: Concept
broader: arts, culture and entertainment
definition: Expressing emotion or message through instruments or voice using different sounds, tones, harmonies and the like
in scheme: IPTC NewsCodes: Subject Code
narrower: classical music
narrower: folk music
narrower: jazz music
narrower: popular music
narrower: country music
narrower: rock and roll music
narrower: hip-hop
notation: 01011000
preferred label: Musiikki @fi

corporate crime
type: Concept
broader: crime, law and justice
definition: Misdeeds of corporations and corporate officers
in scheme: IPTC NewsCodes: Subject Code
narrower: fraud
narrower: embezzlement
narrower: restraint of trade
narrower: breach of contract
narrower: anti-trust crime
narrower: corruption
narrower: bribery
notation: 02012000
preferred label: Organisaatiorikokset @fi

chemicals
type: Concept
broader: economy, business and finance
definition: Natural or manmade materials used to produce other materials
in scheme: IPTC NewsCodes: Subject Code
narrower: biotechnology
narrower: fertiliser
narrower: health and beauty product
narrower: inorganic chemical
narrower: organic chemical
narrower: pharmaceutical
narrower: synthetic and plastic
notation: 04002000
preferred label: Kemianteollisuus @fi

construction and property
type: Concept
broader: economy, business and finance
definition: All items pertaining to the construction and sale of property
in scheme: IPTC NewsCodes: Subject Code
narrower: heavy construction
narrower: house building
narrower: real estate
narrower: farms
narrower: land price
narrower: renovation
narrower: design and engineering
notation: 04004000
preferred label: Rakentaminen Kiinteistöt @fi

interior policy
type: Concept
broader: politics
definition: Government policies affecting internal affairs of a country
in scheme: IPTC NewsCodes: Subject Code
narrower: data protection
narrower: housing and urban planning
narrower: pension and welfare
narrower: personal weapon control
narrower: indigenous people
narrower: personal data collection
narrower: planning inquiries
notation: 11016000
preferred label: Sisäpolitiikka @fi

judo
type: Concept
broader: sport
definition: A defensive martial art.
in scheme: IPTC NewsCodes: Subject Code
narrower: heavyweight
narrower: half-heavyweight
narrower: middleweight
narrower: half-middleweight
narrower: half-lightweight
narrower: lightweight
narrower: extra lightweight
notation: 15033000
preferred label: Judo @fi

rowing
type: Concept
broader: sport
definition: Boat racing usually on flat calm waters with boats for 1, 2, 4 or 8 rowers
in scheme: IPTC NewsCodes: Subject Code
narrower: single sculls
narrower: double sculls
narrower: quadruple sculls
narrower: coxless pair
narrower: coxless four
narrower: eight
narrower: lightweight
notation: 15047000
preferred label: Soutu @fi

rodeo
type: Concept
broader: sport
definition: A discipline where wild horses or bulls must be mounted and mastered
in scheme: IPTC NewsCodes: Subject Code
narrower: barrel racing
narrower: calf roping
narrower: bull riding
narrower: bulldogging
narrower: saddle bronc
narrower: bareback
narrower: goat roping
notation: 15074000
preferred label: Rodeo @fi

process industry
type: Concept
broader: economy, business and finance
definition: The business of turning raw materials into useable products
in scheme: IPTC NewsCodes: Subject Code
narrower: distiller and brewer
narrower: food
narrower: furnishings and furniture
narrower: paper and packaging product
narrower: rubber product
narrower: soft drinks
narrower: textile and clothing
narrower: tobacco
notation: 04013000
preferred label: Prosessiteollisuus @fi

human interest
type: Concept
definition: Lighter items about individuals, groups, animals or objects.
definition: Ihmisyksilöitä, ryhmiä, eläimiä tai esineitä koskevat kevyet jutut. @fi
in scheme: IPTC NewsCodes: Subject Code
narrower: animal
narrower: curiosity
narrower: people
narrower: mystery
narrower: society
narrower: award and prize
narrower: imperial and royal matters
narrower: plant
notation: 08000000
preferred label: Human interest @fi
top concept of: IPTC NewsCodes: Subject Code

natural science
type: Concept
broader: science and technology
definition: Astronomy, astrophysics, physics, chemistry, earth sciences, palaeontology, biological sciences, botany and zoology, as well as mathematics
in scheme: IPTC NewsCodes: Subject Code
narrower: geology
narrower: paleontology
narrower: geography
narrower: botany
narrower: zoology
narrower: physiology
narrower: astronomy
narrower: biology
notation: 13004000
preferred label: Luonnontieteet @fi

motor racing
type: Concept
broader: sport
definition: Motor racing where speed and trusty mechanics are key
in scheme: IPTC NewsCodes: Subject Code
narrower: Formula One
narrower: F3000
narrower: endurance
narrower: Indy
narrower: CART
narrower: NHRA
narrower: NASCAR
narrower: TRUCKI
notation: 15039000
preferred label: Autourheilu @fi

Taekwon-Do
type: Concept
broader: sport
definition: A martial art of Korean origin
in scheme: IPTC NewsCodes: Subject Code
narrower: under 49 kg
narrower: under 58 kg
narrower: 49-57 kg
narrower: 58-68 kg
narrower: 57-67 kg
narrower: 68-80 kg
narrower: over 67 kg
narrower: over 80 kg
notation: 15064000
preferred label: Taekwondo @fi

computing and information technology
type: Concept
broader: economy, business and finance
definition: Anything to do with the computing and/or transmission of information from one point to another.
in scheme: IPTC NewsCodes: Subject Code
narrower: hardware
narrower: networking
narrower: satellite technology
narrower: semiconductors and active components
narrower: software
narrower: telecommunication equipment
narrower: telecommunication service
narrower: security
narrower: wireless technology
notation: 04003000
preferred label: Tietotekniikka @fi

manufacturing and engineering
type: Concept
broader: economy, business and finance
definition: Manufacturers of electrical, electronic and mechanical equipment but does not cover civil engineering.
in scheme: IPTC NewsCodes: Subject Code
narrower: aerospace
narrower: automotive equipment
narrower: defence equipment
narrower: electrical appliance
narrower: heavy engineering
narrower: industrial component
narrower: instrument engineering
narrower: shipbuilding
narrower: machine manufacturing
notation: 04011000
preferred label: Metalliteollisuus Konepajateollisuus @fi

natural resources
type: Concept
broader: environmental issue
definition: Stories about the environmental issues related to the exploitation of natural resources for human use
in scheme: IPTC NewsCodes: Subject Code
narrower: land resources
narrower: parks
narrower: forests
narrower: wetlands
narrower: mountains
narrower: rivers
narrower: oceans
narrower: wildlife
narrower: energy resources
notation: 06006000
preferred label: Luonnonvarat @fi

disease
type: Concept
broader: health
definition: Any harmful or destructive condition
in scheme: IPTC NewsCodes: Subject Code
narrower: communicable diseases
narrower: virus diseases
narrower: AIDS
narrower: cancer
narrower: heart disease
narrower: alzheimer's disease
narrower: animal diseases
narrower: plant diseases
narrower: retrovirus
notation: 07001000
preferred label: Sairaudet Taudit @fi

defence
type: Concept
broader: politics
definition: Anything involving the defence of one's own country
in scheme: IPTC NewsCodes: Subject Code
narrower: veterans affairs
narrower: national security
narrower: security measures
narrower: armed Forces
narrower: military equipment
narrower: firearms
narrower: biological and chemical weapons
narrower: missile systems
narrower: nuclear weapons
notation: 11001000
preferred label: Puolustus @fi

crime
type: Concept
broader: crime, law and justice
definition: Violation of established laws by individuals, companies or organizations
in scheme: IPTC NewsCodes: Subject Code
narrower: homicide
narrower: computer crime
narrower: theft
narrower: drug trafficking
narrower: sexual assault
narrower: assault (general)
narrower: kidnapping
narrower: arson
narrower: gang activity
narrower: terrorism
notation: 02001000
preferred label: Rikokset @fi

election
type: Concept
broader: politics
definition: The selection of representatives by the casting of votes
in scheme: IPTC NewsCodes: Subject Code
narrower: political candidates
narrower: political campaigns
narrower: campaign finance
narrower: national elections
narrower: regional elections
narrower: local elections
narrower: voting
narrower: poll
narrower: european elections
narrower: primary
notation: 11003000
preferred label: Vaalit @fi

flying disc
type: Concept
broader: sport
definition: A group of events all played with a flying plastic disc. The exact regulation for the disc is different in different events but it has to be unbroken of solid plastic and a production model with no modification. Flying disc is sometimes called Frisbee.
in scheme: IPTC NewsCodes: Subject Code
narrower: ultimate
narrower: guts
narrower: overall
narrower: distance
narrower: discathon
narrower: DDC
narrower: SCF
narrower: freestyle
narrower: accuracy
narrower: disc golf
notation: 15077000
preferred label: Frisbee Liitokiekkoilu @fi

media
type: Concept
broader: economy, business and finance
definition: The various means of disseminating news and information to the public
in scheme: IPTC NewsCodes: Subject Code
narrower: advertising
narrower: book
narrower: cinema industry
narrower: news agency
narrower: newspaper and magazine
narrower: online
narrower: public relation
narrower: radio industry
narrower: satellite and cable service
narrower: television industry
narrower: music industry
notation: 04010000
preferred label: Media @fi

education
type: Concept
definition: All aspects of furthering knowledge of human individuals from birth to death.
definition: Kaikenikäisten ihmisten tiedon ja tietämyksen lisääminen. @fi
in scheme: IPTC NewsCodes: Subject Code
narrower: adult education
narrower: further education
narrower: parent organisation
narrower: preschool
narrower: school
narrower: teachers union
narrower: university
narrower: upbringing
narrower: entrance examination
narrower: teaching and learning
narrower: religious education
notation: 05000000
preferred label: Koulutus @fi
top concept of: IPTC NewsCodes: Subject Code

consumer goods
type: Concept
broader: economy, business and finance
definition: Items produced for and sold to individuals
in scheme: IPTC NewsCodes: Subject Code
narrower: clothing
narrower: department store
narrower: food
narrower: mail order
narrower: retail
narrower: speciality store
narrower: wholesale
narrower: beverage
narrower: electronic commerce
narrower: luxury good
narrower: non-durable good
narrower: toy
notation: 04007000
preferred label: Kulutustavarat @fi

christianity
type: Concept
broader: religion and belief
definition: Those that use Jesus Christ and his teachings as their centre of belief
in scheme: IPTC NewsCodes: Subject Code
narrower: protestant
narrower: lutheran
narrower: reformed
narrower: anglican
narrower: methodist
narrower: baptist
narrower: mennonite
narrower: mormon
narrower: roman catholic
narrower: old catholic
narrower: orthodoxy
narrower: salvation army
notation: 12009000
preferred label: Kristinusko @fi

canoeing and kayaking
type: Concept
broader: sport
definition: races in either 'white' or 'dead' water
in scheme: IPTC NewsCodes: Subject Code
narrower: Slalom
narrower: 200 m
narrower: 500 m
narrower: 1000 m
narrower: K1
narrower: K2
narrower: K4
narrower: C1
narrower: C2
narrower: C4
narrower: canoe sailing
narrower: pontoniering
notation: 15015000
preferred label: Melonta @fi

Jai Alai (Pelota)
type: Concept
broader: sport
definition: Because of the game organization, the proper identification of a specific game may require the combination of 2 subject details
in scheme: IPTC NewsCodes: Subject Code
narrower: fronton
narrower: jai-alai
narrower: left wall
narrower: trinquet
narrower: rebot
narrower: chistera ancha
narrower: chistera corta
narrower: bare hand
narrower: pala-ancha
narrower: pala-corta
narrower: pasaka
narrower: xare
notation: 15032000
preferred label: Pelota (jai alai) @fi

shooting
type: Concept
broader: sport
definition: Precision sport using a hand gun, rifle or shotgun
in scheme: IPTC NewsCodes: Subject Code
narrower: 10 m air rifle
narrower: 10 m air pistol
narrower: 10 m running target
narrower: 25 m rapid fire pistol
narrower: 25 m sport pistol
narrower: 50 m free pistol
narrower: 50 m free rifle prone
narrower: 50 m free rifle 3x40
narrower: 50 m sport rifle 3x20
narrower: trap
narrower: double trap
narrower: skeet
notation: 15051000
preferred label: Ammunta @fi

wrestling
type: Concept
broader: sport
definition: Combat sport where each wrestler attempts to win over his adversary, by holding both shoulders on the ground (fall) long enough to be in control. Points can also be decisive.
in scheme: IPTC NewsCodes: Subject Code
narrower: freestyle
narrower: greco-roman
narrower: over 130 kg
narrower: 130 kg
narrower: 97 kg
narrower: 85 kg
narrower: 76 kg
narrower: 69 kg
narrower: 63 kg
narrower: 58 kg
narrower: 54 kg
narrower: Swiss wrestling
notation: 15072000
preferred label: Paini @fi

unrest, conflicts and war
type: Concept
definition: Acts of socially or politically motivated protest and/or violence.
definition: Protestit ja/tai väkivalta, joiden vaikuttimet ovat poliittiset tai yhteiskunnalliset. Esim. terrorismin alle omia kokonaisuuksia: New Yorkin terrori-isku 2001 @fi
in scheme: IPTC NewsCodes: Subject Code
narrower: act of terror
narrower: armed conflict
narrower: civil unrest
narrower: coup d'etat
narrower: guerrilla activity
narrower: massacre
narrower: riots
narrower: demonstration
narrower: war
narrower: conflict (general)
narrower: crisis
narrower: weaponry
notation: 16000000
preferred label: Levottomuudet Konfliktit Sodat @fi
top concept of: IPTC NewsCodes: Subject Code

environmental issue
type: Concept
definition: All aspects of protection, damage, and condition of the ecosystem of the planet earth and its surroundings.
definition: Kaikki asiat, jotka liittyvät maapallon ja sen lähiympäristön ekosysteemin tilaan, suojeluun ja vahingoittumiseen. @fi
in scheme: IPTC NewsCodes: Subject Code
narrower: renewable energy
narrower: conservation
narrower: energy saving
narrower: environmental politics
narrower: environmental pollution
narrower: natural resources
narrower: nature
narrower: population
narrower: waste
narrower: water
narrower: global warming
narrower: hazardous materials
narrower: environmental cleanup
notation: 06000000
preferred label: Ympäristö @fi
top concept of: IPTC NewsCodes: Subject Code

government
type: Concept
broader: politics
definition: The system for ruling a country
in scheme: IPTC NewsCodes: Subject Code
narrower: civil and public service
narrower: safety of citizens
narrower: think tank
narrower: national government
narrower: executive (government)
narrower: heads of state
narrower: government departments
narrower: public officials
narrower: ministers (government)
narrower: public employees
narrower: privatisation
narrower: nationalisation
narrower: impeachment
notation: 11006000
preferred label: Julkinen hallinto @fi

energy and resource
type: Concept
broader: economy, business and finance
definition: Production of electrical power, and the water, air, sunlight, and fuels used to produce them
in scheme: IPTC NewsCodes: Subject Code
narrower: alternative energy
narrower: coal
narrower: oil and gas - downstream activities
narrower: oil and gas - upstream activities
narrower: nuclear power
narrower: electricity production and distribution
narrower: waste management and pollution control
narrower: water supply
narrower: natural resources (general)
narrower: energy (general)
narrower: natural gas
narrower: petrol
narrower: diesel fuel
narrower: kerosene/paraffin
notation: 04005000
preferred label: Energia Raaka-aineet @fi

motorcycling
type: Concept
broader: sport
definition: Races with 2, 3 or 4 wheels vehicles with a saddle and handlebars
in scheme: IPTC NewsCodes: Subject Code
narrower: speed-Grand-Prix
narrower: enduro
narrower: grass-track
narrower: moto-ball
narrower: moto-cross
narrower: rallying
narrower: trial
narrower: endurance
narrower: superbike
narrower: 125 cm3
narrower: 250 cm3
narrower: 500 cm3
narrower: side-cars
narrower: motoGP
notation: 15041000
preferred label: Moottoripyöräily @fi

speed skating
type: Concept
broader: sport
definition: Timed races competed by two skaters at a time on an oval ice track
in scheme: IPTC NewsCodes: Subject Code
narrower: 500 m
narrower: 1000 m
narrower: 1500 m
narrower: 3000 m
narrower: 5000 m
narrower: 10000 m
narrower: Short-track
narrower: st 500 m
narrower: st 1000m
narrower: st 1500m
narrower: st 3000m
narrower: st 3000m relay
narrower: st 5000m
narrower: st 5000m relay
notation: 15056000
preferred label: Pikaluistelu @fi

gymnastics
type: Concept
broader: sport
definition: A sport consisting of a variety of disciplines in which gymnasts perform artistic and acrobatic moves on different apparatus. There are 6 disciplines for men and 4 for women.
in scheme: IPTC NewsCodes: Subject Code
narrower: floor exercise
narrower: vault
narrower: pommel horse
narrower: uneven bars
narrower: parallel bars
narrower: horizontal bar
narrower: rings
narrower: beam
narrower: rhythmic
narrower: clubs
narrower: hoop
narrower: ribbon
narrower: rope
narrower: ball
narrower: trampoline
notation: 15028000
preferred label: Voimistelu @fi

crime, law and justice
type: Concept
definition: Establishment and/or statement of the rules of behaviour in society, the enforcement of these rules, breaches of the rules and the punishment of offenders. Organizations and bodies involved in these activities.
definition: Yhteiskunnan käyttäytymissääntöjen luominen ja/tai niiden ilmituominen. Näiden sääntöjen toimeenpano, niiden rikkominen ja rikkojien rankaiseminen. Näissä toimissa mukana olevat järjestöt ja elimet. @fi
in scheme: IPTC NewsCodes: Subject Code
narrower: crime
narrower: judiciary (system of justice)
narrower: police
narrower: punishment
narrower: prison
narrower: laws
narrower: justice and rights
narrower: trials
narrower: prosecution
narrower: organized crime
narrower: international law
narrower: corporate crime
narrower: war crime
narrower: inquest
narrower: inquiry
narrower: tribunal
notation: 02000000
preferred label: Laki Oikeus Rikokset @fi
top concept of: IPTC NewsCodes: Subject Code

labour
type: Concept
definition: Social aspects, organizations, rules and conditions affecting the employment of human effort for the generation of wealth or provision of services and the economic support of the unemployed.
definition: Työ ja siihen liittyvät järjestöt, säännöt ja työehdot. @fi
in scheme: IPTC NewsCodes: Subject Code
narrower: apprentices
narrower: collective contract
narrower: employment
narrower: labour dispute
narrower: labour legislation
narrower: retirement
narrower: retraining
narrower: strike
narrower: unemployment
narrower: unions
narrower: wage and pension
narrower: work relations
narrower: health and safety at work
narrower: advanced training
narrower: employer
narrower: employee
notation: 09000000
preferred label: Työelämä @fi
top concept of: IPTC NewsCodes: Subject Code

sailing
type: Concept
broader: sport
definition: Sail boat racing over a route marked by buoys.
in scheme: IPTC NewsCodes: Subject Code
narrower: Tornado
narrower: soling
narrower: 49er
narrower: Europe
narrower: Laser
narrower: 470
narrower: Finn
narrower: Star
narrower: flying dutchmann
narrower: 505
narrower: staging race
narrower: around the world
narrower: monohull
narrower: multihulls
narrower: yngling
narrower: mistral
notation: 15050000
preferred label: Purjehdus @fi

weightlifting
type: Concept
broader: sport
definition: A strength test where competitors lift as heavy a weight as possible
in scheme: IPTC NewsCodes: Subject Code
narrower: snatch
narrower: clean and jerk
narrower: 48 kg
narrower: 53 kg
narrower: 63 kg
narrower: 75 kg
narrower: over 75 kg
narrower: 56 kg
narrower: 62 kg
narrower: 69 kg
narrower: 77 kg
narrower: 85 kg
narrower: 94 kg
narrower: 105 kg
narrower: over 105 kg
narrower: powerlifting
notation: 15070000
preferred label: Painonnosto @fi

disaster and accident
type: Concept
definition: Man made and natural events resulting in loss of life or injury to living creatures and/or damage to inanimate objects or property.
definition: Ihmisten aiheuttamat tapahtumat tai luonnonilmiöt, joiden johdosta kuolee tai vammautuu eläviä olentoja tai jotka johtavat omaisuuden vahingoittumiseen. @fi
in scheme: IPTC NewsCodes: Subject Code
narrower: drought
narrower: earthquake
narrower: famine
narrower: fire
narrower: flood
narrower: industrial accident
narrower: meteorological disaster
narrower: nuclear accident
narrower: pollution
narrower: transport accident
narrower: volcanic eruption
narrower: relief and aid organisation
narrower: accident (general)
narrower: emergency incident
narrower: disaster (general)
narrower: emergency planning
narrower: rescue
notation: 03000000
preferred label: Onnettomuudet @fi
top concept of: IPTC NewsCodes: Subject Code

nordic skiing
type: Concept
broader: sport
definition: Practiced in snowy countryside and based on power and endurance. There are classic and free style events with mass or staggered starts.
in scheme: IPTC NewsCodes: Subject Code
narrower: cross-country
narrower: 5 km classical time
narrower: 10 km classical style
narrower: 10 km pursuit free style
narrower: 15 km classical style
narrower: 15 km pursuit free style
narrower: 10 km + 15 km combined
narrower: 30 km classical style
narrower: 30km free style
narrower: 50 km free style
narrower: 4x5 km relay
narrower: 4x10 km relay
narrower: nordic combined
narrower: raid
narrower: 5 km pursuit free style
narrower: 1.5 km sprint free
narrower: 50 km classic style
notation: 15043000
preferred label: Pohjoismaiset hiihtolajit @fi

lifestyle and leisure
type: Concept
definition: Activities undertaken for pleasure, relaxation or recreation outside paid employment, including eating and travel.
definition: Työn ulkopuoliset mielihyvään, rentoutumiseen ja virkistykseen liittyvät toiminnot, mm. ruoka ja matkailu. @fi
in scheme: IPTC NewsCodes: Subject Code
narrower: game
narrower: gaming and lottery
narrower: gastronomy
narrower: hobby
narrower: holiday or vacation
narrower: tourism
narrower: travel and commuting
narrower: club and association
narrower: lifestyle (house and home)
narrower: leisure (general)
narrower: public holiday
narrower: hunting
narrower: fishing
narrower: auto trends
narrower: adventure
narrower: beauty
narrower: consumer issue
narrower: wedding
notation: 10000000
preferred label: Vapaa-aika @fi
top concept of: IPTC NewsCodes: Subject Code

economy, business and finance
type: Concept
definition: All matters concerning the planning, production and exchange of wealth.
definition: Vaurauden ja varallisuuden suunnitteluun, tuottamiseen ja vaihtoon liittyvät asiat. @fi
in scheme: IPTC NewsCodes: Subject Code
narrower: agriculture
narrower: chemicals
narrower: computing and information technology
narrower: construction and property
narrower: energy and resource
narrower: financial and business service
narrower: consumer goods
narrower: macro economics
narrower: market and exchange
narrower: media
narrower: manufacturing and engineering
narrower: metal and mineral
narrower: process industry
narrower: tourism and leisure
narrower: transport
narrower: company information
narrower: economy (general)
narrower: business (general)
narrower: finance (general)
notation: 04000000
preferred label: Talous @fi
top concept of: IPTC NewsCodes: Subject Code

health
type: Concept
definition: All aspects pertaining to the physical and mental welfare of human beings.
definition: Ihmisten kehon ja mielen hyvinvointiin liittyvät asiat. @fi
in scheme: IPTC NewsCodes: Subject Code
narrower: disease
narrower: epidemic and plague
narrower: health treatment
narrower: health organisations
narrower: medical research
narrower: medical staff
narrower: medicine
narrower: preventative medicine
narrower: injury
narrower: hospital and clinic
narrower: government health care
narrower: private health care
narrower: healthcare policy
narrower: medical specialisation
narrower: medical service
narrower: physical fitness
narrower: illness
narrower: medical conditions
narrower: patient
notation: 07000000
preferred label: Terveys @fi
top concept of: IPTC NewsCodes: Subject Code

cycling
type: Concept
broader: sport
definition: A race over a given distance on bicycles.
in scheme: IPTC NewsCodes: Subject Code
narrower: track
narrower: pursuit
narrower: Olympic sprint
narrower: sprint
narrower: Keirin
narrower: points race
narrower: Madison race
narrower: 500 m time trial
narrower: 1 km time trial
narrower: one hour
narrower: road race
narrower: road time trial
narrower: staging race
narrower: cyclo-cross
narrower: Vtt
narrower: Vtt-cross
narrower: Vtt-downhill
narrower: bi-crossing
narrower: trial
narrower: artistic cycling
narrower: cycle ball
notation: 15019000
preferred label: Pyöräily @fi

financial and business service
type: Concept
broader: economy, business and finance
definition: Services that transmit, safeguard, keep track of money or provide backup to commercial enterprises
in scheme: IPTC NewsCodes: Subject Code
narrower: accountancy and auditing
narrower: banking
narrower: consultancy service
narrower: employment agency
narrower: healthcare provider
narrower: insurance
narrower: legal service
narrower: market research
narrower: stock broking
narrower: personal investing
narrower: market trend
narrower: shipping service
narrower: personal service
narrower: janitorial service
narrower: funeral parlour and crematorium
narrower: rental service
narrower: wedding service
narrower: personal finance
narrower: personal income
narrower: auction service
narrower: printing/promotional service
narrower: investment service
notation: 04006000
preferred label: Rahoituspalvelut Liike-elämän palvelut @fi

science and technology
type: Concept
definition: All aspects pertaining to human understanding of nature and the physical world and the development and application of this knowledge
definition: Ihmisten fysikaalisen maailman toimintaan ja luontoon liittyvä ymmärrys. Tämän tiedon kehittyminen ja soveltaminen. @fi
in scheme: IPTC NewsCodes: Subject Code
narrower: applied science
narrower: engineering
narrower: human science
narrower: natural science
narrower: philosophical science
narrower: research
narrower: scientific exploration
narrower: space programme
narrower: science (general)
narrower: technology (general)
narrower: standards
narrower: animal science
narrower: micro science
narrower: marine science
narrower: weather science
narrower: electronics
narrower: identification technology
narrower: mathematics
narrower: biotechnology
narrower: agricultural research and technology
narrower: nanotechnology
narrower: IT/computer sciences
narrower: scientific institutions
notation: 13000000
preferred label: Tiede Teknologia @fi
top concept of: IPTC NewsCodes: Subject Code

boxing
type: Concept
broader: sport
definition: Combat sport in which two men/women fight using only their fists covered by padded gloves in a square ring measuring 6m a side. The fight is usually split into 12 rounds of three minutes each.
in scheme: IPTC NewsCodes: Subject Code
narrower: super-heavyweight
narrower: heavyweight
narrower: cruiserweight
narrower: light-heavyweight
narrower: super-middleweight
narrower: middleweight
narrower: light-middleweight
narrower: welterweight
narrower: light-welterweight
narrower: lightweight
narrower: super-featherweight
narrower: featherweight
narrower: super-bantamweight
narrower: bantamweight
narrower: super-flyweight
narrower: flyweight
narrower: light flyweight
narrower: straw
narrower: IBF
narrower: WBA
narrower: WBC
narrower: WBO
narrower: French boxing
narrower: Thai boxing
notation: 15014000
preferred label: Nyrkkeily @fi

swimming
type: Concept
broader: sport
definition: A water sport where contestants swim as fast as possible in a given style and win races by being the first to touch home
in scheme: IPTC NewsCodes: Subject Code
narrower: 50 m freestyle
narrower: 100 m freestyle
narrower: 200 m freestyle
narrower: 400 m freestyle
narrower: 800 m freestyle
narrower: 1500 m freestyle
narrower: relay 4x50 m freestyle
narrower: relay 4x100 m freestyle
narrower: relay 4x200 m freestyle
narrower: 50 m backstroke
narrower: 100 m backstroke
narrower: 200 m backstroke
narrower: 50 m breaststroke
narrower: 100 m breaststroke
narrower: 200 m breaststroke
narrower: 50 m butterfly
narrower: 100 m butterfly
narrower: 200 m butterfly
narrower: 100 m medley
narrower: 200 m medley
narrower: 400 m medley
narrower: relay 4x50 m medlay
narrower: relay4x100 m medley
narrower: short course
narrower: synchronised technical routine
narrower: synchronised free routine
notation: 15062000
preferred label: Uinti @fi

religion and belief
type: Concept
definition: All aspects of human existence involving theology, philosophy, ethics and spirituality.
definition: Teologiaan, filosofiaan, etiikkaan tai henkisyyteen liittyvät asiat. @fi
in scheme: IPTC NewsCodes: Subject Code
narrower: cult and sect
narrower: belief (faith)
narrower: freemasonry
narrower: religion-DEPRECATED
narrower: church (organisation)-DEPRECATED
narrower: values
narrower: church and state relations
narrower: philosophy
narrower: christianity
narrower: islam
narrower: judaism
narrower: buddhism
narrower: hinduism
narrower: religious festival or holiday
narrower: religious leader
narrower: nature religion
narrower: taoism
narrower: shintoism
narrower: sikhism
narrower: jainism
narrower: parsasm
narrower: confucianism
narrower: religious text
narrower: interreligious dialogue
narrower: religious event
narrower: concordat
narrower: ecumenism
notation: 12000000
preferred label: Uskonto @fi
top concept of: IPTC NewsCodes: Subject Code

social issue
type: Concept
definition: Aspects of the behaviour of humans affecting the quality of life.
definition: Elämänlaatuun liittyvä inhimillinen käyttäytyminen. @fi
in scheme: IPTC NewsCodes: Subject Code
narrower: addiction
narrower: charity
narrower: demographics
narrower: disabled
narrower: euthanasia (also includes assisted suicide)
narrower: family
narrower: family planning
narrower: health insurance
narrower: homelessness
narrower: minority group
narrower: pornography
narrower: poverty
narrower: prostitution
narrower: racism
narrower: welfare
narrower: abortion
narrower: missing person
narrower: long term care
narrower: juvenile delinquency
narrower: nuclear radiation victims
narrower: slavery
narrower: abusive behaviour
narrower: death and dying
narrower: people
narrower: social issues (general)
narrower: ordnance clearance
narrower: reconstruction
notation: 14000000
preferred label: Sosiaalikysymykset @fi
top concept of: IPTC NewsCodes: Subject Code

arts, culture and entertainment
type: Concept
definition: Matters pertaining to the advancement and refinement of the human mind, of interests, skills, tastes and emotions
definition: Ihmisten luova toiminta ja henkisten kykyjen ja saavutusten kehittäminen. @fi
in scheme: IPTC NewsCodes: Subject Code
narrower: archaeology
narrower: architecture
narrower: bullfighting
narrower: festive event (including carnival)
narrower: cinema
narrower: dance
narrower: fashion
narrower: language
narrower: library and museum
narrower: literature
narrower: music
narrower: painting
narrower: photography
narrower: radio
narrower: sculpture
narrower: television
narrower: theatre
narrower: monument and heritage site
narrower: customs and tradition
narrower: arts (general)
narrower: entertainment (general)
narrower: culture (general)
narrower: nightclub
narrower: cartoon
narrower: animation
narrower: mass media
narrower: internet
narrower: history
notation: 01000000
preferred label: Taide Kulttuuri Viihde @fi
top concept of: IPTC NewsCodes: Subject Code

politics
type: Concept
definition: Local, regional, national and international exercise of power, or struggle for power, and the relationships between governing bodies and states.
definition: Yhteiskunnan asioiden hoito paikallisella, alueellisella, kansallisella ja kansainvälisellä tasolla. @fi
in scheme: IPTC NewsCodes: Subject Code
narrower: defence
narrower: diplomacy
narrower: election
narrower: espionage and intelligence
narrower: foreign aid
narrower: government
narrower: human rights
narrower: local authority
narrower: parliament
narrower: parties and movements
narrower: refugee
narrower: regional authority
narrower: state budget and tax
narrower: treaty and international organisation-DEPRECATED
narrower: constitution
narrower: interior policy
narrower: migration
narrower: citizens initiative and recall
narrower: referenda
narrower: nuclear policy
narrower: lobbying
narrower: regulatory policy and organisation
narrower: censorship
narrower: politics (general)
narrower: freedom of the press
narrower: freedom of religion
narrower: treaty
narrower: international organisation
notation: 11000000
preferred label: Politiikka @fi
top concept of: IPTC NewsCodes: Subject Code

macro economics
type: Concept
broader: economy, business and finance
definition: Broad scale economics and the world or national level
definition: Kansantalous, globaali talous @fi
in scheme: IPTC NewsCodes: Subject Code
narrower: central bank
narrower: consumer issue
narrower: debt market
narrower: economic indicator
narrower: emerging market
narrower: foreign exchange market
narrower: government aid
narrower: government debt
narrower: interest rate
narrower: international economic institution
narrower: international (foreign) trade
narrower: loan market
narrower: economic organization
narrower: consumer confidence
narrower: trade dispute
narrower: inflation and deflation
narrower: prices
narrower: currency values
narrower: budgets and budgeting
narrower: credit and debt
narrower: loans
narrower: mortgages
narrower: financial markets
narrower: commodity markets
narrower: investments
narrower: stocks
narrower: bonds
narrower: mutual funds
narrower: derivative securities
narrower: imports
narrower: exports
narrower: trade agreements
narrower: trade policy
narrower: business enterprises
narrower: tariff
narrower: trade balance
notation: 04008000
preferred label: Makrotalous @fi

sports event
type: Concept
broader: sport
definition: Sports meeting
in scheme: IPTC NewsCodes: Subject Code
narrower: Summer Olympics
narrower: Winter Olympics
narrower: Summer universiade
narrower: Winter Universiade
narrower: Commonwealth Games
narrower: Winter Goodwill Games
narrower: Summer Asian Games
narrower: Winter Asian Games
narrower: Panamerican Games
narrower: African Games
narrower: Mediterranean Games
narrower: SouthEast Asiatic Games
narrower: PanPacific Games
narrower: SouthPacific Games
narrower: PanArabic Games
narrower: Summer Goodwill Games
narrower: World games
narrower: World Cup
narrower: intercontinental cup
narrower: continental cup
narrower: international cup
narrower: National Cup
narrower: interregional cup
narrower: regional cup
narrower: league cup
narrower: world championship
narrower: intercontinental championship
narrower: continental championship 1st level
narrower: continental championship 2nd level
narrower: continental championship 3rd level
narrower: national championship 1st level
narrower: national championship 2nd level
narrower: national championship3rdlevel
narrower: national championship 4th level
narrower: regional championship
narrower: Grand Prix
narrower: intercontinental tournament
narrower: continental tournament
narrower: international tournament
narrower: national tournament
narrower: inter-nations competition
narrower: inter-clubs competition
narrower: friendly competition
narrower: all-stars competition
narrower: exhibition
narrower: Super Bowl
narrower: paralympic games
notation: 15073000
preferred label: Urheilutapahtumat @fi

IPTC NewsCodes: Scene
type: ConceptScheme
creator: International Press Telecommunications Council (IPTC)
description: Indicates a type of scene covered by an item.
publisher: National Library of Finland
publisher: Kansalliskirjasto @fi
publisher: Nationalbiblioteket i Finland @sv
is part of: IPTC NewsCodes
language: eng
license: http://creativecommons.org/licenses/by/4.0/
has top concept: headshot
has top concept: half-length
has top concept: full-length
has top concept: profile
has top concept: rear view
has top concept: single
has top concept: couple
has top concept: two
has top concept: group
has top concept: general view
has top concept: panoramic view
has top concept: aerial view
has top concept: under-water
has top concept: night scene
has top concept: satellite
has top concept: exterior view
has top concept: interior view
has top concept: close-up
has top concept: action
has top concept: performing
has top concept: posing
has top concept: symbolic
has top concept: off-beat
has top concept: movie scene

company information
type: Concept
broader: economy, business and finance
definition: Information about individual companies or business entities
in scheme: IPTC NewsCodes: Subject Code
narrower: accounting and audit
narrower: annual and special corporate meeting
narrower: annual report
narrower: antitrust issue
narrower: merger, acquisition and takeover
narrower: analysts' comment
narrower: bankruptcy
narrower: board of directors (appointment and change)
narrower: buyback
narrower: C.E.O. interview
narrower: corporate officer
narrower: corporate profile
narrower: contract
narrower: defence contract
narrower: dividend announcement
narrower: earnings forecast
narrower: financially distressed company
narrower: earnings
narrower: financing and stock offering
narrower: government contract
narrower: global expansion
narrower: insider trading
narrower: joint venture
narrower: leveraged buyout
narrower: layoffs and downsizing
narrower: licensing agreement
narrower: litigation and regulation
narrower: management change
narrower: marketing
narrower: new product
narrower: patent, copyright and trademark
narrower: plant closing
narrower: plant opening
narrower: privatisation
narrower: proxy filing
narrower: rating
narrower: research and development
narrower: quarterly or semiannual financial statement
narrower: restructuring and recapitalisation
narrower: spin-off
narrower: stock activity
narrower: industrial production
narrower: productivity
narrower: inventories
narrower: sales
narrower: corporations
narrower: shareholders
narrower: corporate performance
narrower: losses
narrower: credit ratings
narrower: stock splits
narrower: stock options
narrower: recalls (products)
narrower: globalization
narrower: consumers
narrower: purchase
narrower: new service
notation: 04016000
preferred label: Yritysinformaatio @fi

athletics, track and field
type: Concept
broader: sport
definition: Competitions involving foot races, jumping and throwing which can be on a track inside a stadium or on outside roads
in scheme: IPTC NewsCodes: Subject Code
narrower: 100 m
narrower: 200 m
narrower: 400 m
narrower: 800 m
narrower: 1000 m
narrower: 1500 m
narrower: mile
narrower: 2000 m
narrower: 3000 m
narrower: 5000 m
narrower: 10,000 m
narrower: 20 km
narrower: one hour
narrower: 25000
narrower: 30000
narrower: 110 m hurdles
narrower: 400 m hurdles
narrower: 3000 m steeplechase
narrower: high jump
narrower: pole vault
narrower: long jump
narrower: triple jump
narrower: shot put
narrower: discus throw
narrower: hammer throw
narrower: javelin throw
narrower: decathlon
narrower: 4x100 m
narrower: 4x200 m
narrower: 4x400 m
narrower: 4x800 m
narrower: 4x1500 m
narrower: walk 1 h
narrower: walk 2 h
narrower: 10 km walk
narrower: 15 km walk
narrower: 20 km walk
narrower: 30 km walk
narrower: 50 km walk
narrower: 100 m hurdles
narrower: 5 km walk
narrower: heptathlon
narrower: 1500 m walk
narrower: 2000 m walk
narrower: 3000 m walk
narrower: 50 m
narrower: 50 m hurdles
narrower: 50 yards
narrower: 50 yard hurdles
narrower: 60 m
narrower: 60 m hurdles
narrower: 60 yards
narrower: 60 yard hurdles
narrower: 100 yards
narrower: 100 yard hurdles
narrower: 300 m
narrower: 300 yards
narrower: 440 yards
narrower: 500 m
narrower: 500 yards
narrower: 600 m
narrower: 600 yards
narrower: 880 yards
narrower: 1000 yards
narrower: 2 miles
narrower: 3 miles
narrower: 6 miles
narrower: 4x1 mile
narrower: pentathlon
notation: 15005000
preferred label: Yleisurheilu @fi

sport
type: Concept
definition: Competitive exercise involving physical effort. Organizations and bodies involved in these activities.
in scheme: IPTC NewsCodes: Subject Code
narrower: aero and aviation sport
narrower: alpine skiing
narrower: American football
narrower: archery
narrower: athletics, track and field
narrower: badminton
narrower: baseball
narrower: basketball
narrower: biathlon
narrower: billiards, snooker and pool
narrower: bobsleigh
narrower: bowling
narrower: bowls and petanque
narrower: boxing
narrower: canoeing and kayaking
narrower: climbing
narrower: cricket
narrower: curling
narrower: cycling
narrower: dancing
narrower: diving
narrower: equestrian
narrower: fencing
narrower: field Hockey
narrower: figure Skating
narrower: freestyle Skiing
narrower: golf
narrower: gymnastics
narrower: handball (team)
narrower: horse racing, harness racing
narrower: ice hockey
narrower: Jai Alai (Pelota)
narrower: judo
narrower: karate
narrower: lacrosse
narrower: luge
narrower: marathon
narrower: modern pentathlon
narrower: motor racing
narrower: motor rallying
narrower: motorcycling
narrower: netball
narrower: nordic skiing
narrower: orienteering
narrower: polo
narrower: power boating
narrower: rowing
narrower: rugby league
narrower: rugby union
narrower: sailing
narrower: shooting
narrower: ski jumping
narrower: snow boarding
narrower: soccer
narrower: softball
narrower: speed skating
narrower: speedway
narrower: sports organisations
narrower: squash
narrower: sumo wrestling
narrower: surfing
narrower: swimming
narrower: table tennis
narrower: Taekwon-Do
narrower: tennis
narrower: triathlon
narrower: volleyball
narrower: water polo
narrower: water skiing
narrower: weightlifting
narrower: windsurfing
narrower: wrestling
narrower: sports event
narrower: rodeo
narrower: mini golf sport
narrower: bandy
narrower: flying disc

IPTC NewsCodes: Subject Code
type: ConceptScheme
contributor: Finnish Newspapers Association
contributor: Sanomalehtien Liitto @fi
creator: International Press Telecommunications Council (IPTC)
description: Indicates a subject of an item. NOTE: The Subject Codes is IPTC's original subject taxonomy, with a focus on text. It consists of about 1400 terms organized into 3 levels. Finnish translations of terms and some definitions added by Finnish Newspapers Association.
description: Sanasto on IPTC:n (International Press Telecommunications Council) laatima toimituksellisen aineiston kuvailuun ja luokitteluun tarkoitettu sanasto. Sanaston englanninkielinen nimi on IPTC Subject Code, ja se on osa NewsCodes-sisällönkuvailukokonaisuutta. Kuvien sisällönkuvailussa tuettava kentästö on IPTC Core. Suomennokset luokkien nimille ja osalle määritelmissä tehty Sanomalehtien Liitossa. @fi
publisher: National Library of Finland
publisher: Kansalliskirjasto @fi
publisher: Nationalbiblioteket i Finland @sv
is part of: IPTC NewsCodes
language: eng
language: fin
license: http://creativecommons.org/licenses/by/4.0/
has top concept: arts, culture and entertainment
has top concept: crime, law and justice
has top concept: disaster and accident
has top concept: economy, business and finance
has top concept: education
has top concept: environmental issue
has top concept: health
has top concept: human interest
has top concept: labour
has top concept: lifestyle and leisure
has top concept: politics
has top concept: religion and belief
has top concept: science and technology
has top concept: social issue
has top concept: sport
has top concept: unrest, conflicts and war
has top concept: weather