RDA-käsitteet
type: ConceptGroup
type: Collection
created: 2022-11-16
modified: 2026-01-23
member: Manifestaatio
member: Ekspressio
member: Suhteet
member: Toimija
member: Paikka
member: Nomen
member: Kappale
member: Teos
preferred label: RDA-begrepp @sv

Muut kuvailussa tarvittavat käsitteet
type: ConceptGroup
type: Collection
created: 2022-11-16
modified: 2023-05-05
member: Aineistotyyppi
member: MARC 21
preferred label: Övriga begrepp som behövs vid beskrivning @sv

Vastavuoroinen suhde
type: Property
label: Inverse relationship @en
label: Parallell relation @sv

4 raitaa
type: Concept
source: Kansallinen RDA-termi
source: Nationell RDA-term @sv
created: 2016-01-08
modified: 2024-05-24
in scheme: Metatietosanasto
preferred label: 4 ljudspår @sv

isopistekirjoitus
type: Concept
source: RDA-termi
source: RDA-term @sv
created: 2016-01-08
modified: 2023-05-17
alternative label: jumbo punktskrift @sv
definition: Kirjasinkoko, joka on tarkoitettu auttamaan lukijoita, joilla on vaikeuksia lukea tavallisen kokoista tekstiä.
definition: Typgrad, som är avsedd att underlätta för läsare som har svårigheter att läsa text i vanlig storlek. @sv
in scheme: Metatietosanasto
preferred label: jumbo braille @en
preferred label: storstilspunktskrift @sv

malli
type: Concept
source: RDA-termi
source: RDA-term @sv
created: 2016-01-08
modified: 2023-05-17
definition: Laajuuden yksikkö, kolmiulotteinen esine, joka kuvaa todellista tai kuvitteellista objektia.
definition: Enhet, tredimensionellt föremål som beskriver ett verkligt eller fiktivt objekt. @sv
in scheme: Metatietosanasto
preferred label: model @en
preferred label: modell @sv

piirtoheitinkalvo
type: Concept
source: RDA-termi
source: RDA-term @sv
created: 2016-01-08
modified: 2023-05-17
alternative label: overheadbild @sv
alternative label: stordia @sv
alternative label: transparang @sv
definition: Kuvia tai tekstiä sisältävä läpinäkyvä arkki, joka voi olla kehyksissä, ja joka on suunniteltu käytettäväksi piirtoheittimellä; yksittäisellä kalvolla voi olla päällekkäiskalvoja.
definition: Genomskinligt ark, eventuellt inom ramar, som innehåller bilder eller text och som är avsett för användning med overheadprojektor; ett enskilt ark kan också ha överlappande ark. @sv
in scheme: Metatietosanasto
preferred label: overhead transparency @en
preferred label: OH-bild @sv
scope note: Heijastettava kuvatallenne.
scope note: Bärare för projicerbara bilder. @sv

mikromuoto
type: Concept
source: RDA-termi
source: RDA-term @sv
created: 2016-01-08
modified: 2023-05-05
definition: Viestin sisältää pienennettyjä kuvia jotka eivät ole luettavissa ilman apuvälinettä. Mikrofilmit tai mikrokortit ovat suunniteltu käytettäväksi lukulaitteen avulla. Käsittää sekä läpinäkyvän että läpinäkymättömän mikromuotoisen viestimen.
definition: Förminskade bilder som inte går att betrakta med blotta ögat utan behöver mikrofilms- eller mikrokortläsare. Material i mikroform kan antingen vara genomskinligt eller ogenomskinligt. Materialet förutsätter mikroläsare. @sv
in scheme: Metatietosanasto
preferred label: microform @en
preferred label: mikroform @sv

irtolehtiä
type: Concept
source: Kansallinen RDA-termi
source: Nationell RDA-term @sv
created: 2016-01-08
modified: 2024-07-06
in scheme: Metatietosanasto
preferred label: lösblad @sv

taktiili liikenotaatio
type: Concept
source: RDA-termi
source: RDA-term @sv
created: 2016-01-08
modified: 2023-05-05
definition: Liikettä kuvailevan merkkijärjestelmän avulla esitetty sisältö, joka on tarkoitettu kosketeltavaksi.
definition: Innehåll uttryckt med teckensystem för beskrivning av rörelse, avsett att vidröras. @sv
in scheme: Metatietosanasto
preferred label: tactile notated movement @en
preferred label: taktil noterad rörelse @sv

äänifilmin standardikuvakoko
type: Concept
source: RDA-termi
source: RDA-term @sv
created: 2016-01-08
modified: 2024-05-09
definition: Elokuvafilmin esitysformaatti, joka käyttää ääniraidallisen filmin projektoriaukon standardikokoa.
definition: Visningsformat för film, med ljudfilmens standardstorlek för projektoröppning. @sv
in scheme: Metatietosanasto
preferred label: standard sound aperture @en
preferred label: standardbildstorlek för ljudfilm @sv

lahjoitus
type: Concept
source: Kansallinen RDA-termi
source: Nationell RDA-term @sv
created: 2016-01-08
modified: 2024-05-24
in scheme: Metatietosanasto
preferred label: donation @sv

metalliraha
type: Concept
source: RDA-termi
source: RDA-term @sv
created: 2016-01-08
modified: 2023-05-17
alternative label: metallmynt @sv
definition: Laajuuden yksikkö, rahana käytetty metallikappale, jossa on virallisen tahon kuten valtion, hallitsijan tms. leima.
definition: Enhet, metallstycke avsett att användas som pengar, försedd med officiell stämpel tillhörande stat, regent e.d. @sv
in scheme: Metatietosanasto
preferred label: coin @en
preferred label: mynt @sv

originaalilevy
type: Concept
source: RDA-termi
source: RDA-term @sv
created: 2016-01-08
modified: 2023-05-17
definition: Äänitteen sukupolven määrite tallenteen negatiiviselle metallikopiolle, joka on kaiverrettu lakkapäällysteiselle levylle levysorvin avulla.
definition: Bestämning av generation för en upptagnings negativa metallkopia, som har ristats in på en lackbelagd skiva med en skivsvarv. @sv
in scheme: Metatietosanasto
preferred label: disc master @en
preferred label: originalskiva @sv

USB-muisti
type: Concept
source: Kansallinen RDA-termi
source: Nationell RDA-term @sv
created: 2016-01-08
modified: 2025-10-04
in scheme: Metatietosanasto
preferred label: USB-minne @sv

magneettinen
type: Concept
source: RDA-termi
source: RDA-term @sv
created: 2016-01-08
modified: 2023-05-17
definition: Tallennusmedia, joka perustuu navanvaihtoon ferromagneettisella alustalla, tyypillisesti ferromagneettisiin oksidihiukkasiin, jotka on kiinnitetty nauhalle tai levylle.
definition: Lagringsmedium som grundar sig på polbyte i ett ferromagnetiskt medium, typiskt ferromagnetiska oxidpartiklar som är fästa på ett band eller en skiva. @sv
in scheme: Metatietosanasto
preferred label: magnetic @en
preferred label: magnetisk @sv

dbx
type: Concept
source: RDA-termi
source: RDA-term @sv
created: 2016-01-08
modified: 2023-05-17
definition: Dbx:n kehittämä melunvaimennusjärjestelmä.
definition: Brusreduceringssystem utvecklat av Dbx. @sv
in scheme: Metatietosanasto
preferred label: dbx encoded @en

IMAX
type: Concept
source: RDA-termi
source: RDA-term @sv
created: 2016-01-08
modified: 2023-05-17
definition: Elokuvafilmin esitysformaatti, joka heijastaa tavanomaisia filmijärjestelmiä paljon suurempikokoisia ja -resoluutioisia kuvia.
definition: Visningsformat för film, som återger mycket större bilder, med större resolution än vanliga filmsystem. @sv
in scheme: Metatietosanasto

videolevy
type: Concept
source: RDA-termi
source: RDA-term @sv
created: 2016-01-08
modified: 2025-10-31
definition: Levy, jolle tallennetaan videosignaaleja, sisältäen ääntä tai ilman ääntä.
definition: Skiva som bär videosignaler med eller utan ljud. @sv
in scheme: Metatietosanasto
preferred label: videodisc @en
preferred label: videoskiva @sv
scope note: Videotallenne.
scope note: Videobärare. @sv

kolme kertaa vuodessa
type: Concept
source: RDA-termi
source: RDA-term @sv
created: 2016-01-08
modified: 2023-05-17
alternative label: tre gånger i året @sv
definition: Ilmestymis- tai päivittymistiheys aineistolle, joka ilmestyy tai päivittyy kolme kertaa vuodessa.
definition: Utgivnings- eller uppdateringsfrekvens för material som utkommer eller uppdateras tre gånger i året. @sv
in scheme: Metatietosanasto
preferred label: three times a year @en
preferred label: tre gånger per år @sv

kansio
type: Concept
source: Kansallinen RDA-termi
source: Nationell RDA-term @sv
created: 2016-01-08
modified: 2024-07-06
in scheme: Metatietosanasto
preferred label: mapp @sv

verkkoaineisto
type: Concept
source: RDA-termi
source: RDA-term @sv
created: 2016-01-08
modified: 2023-05-05
definition: Digitaalinen aineisto, joka on saatavana laitteisto- ja ohjelmistoyhteydellä tietoverkosta.
definition: Digitalt innehåll som är tillgängligt via uppkoppling av hård- och mjukvara till datanät. @sv
in scheme: Metatietosanasto
preferred label: onlineresurs @sv
scope note: Tietokonetallenne.
scope note: Datorbärare. @sv

Blu-ray-levy
type: Concept
source: Kansallinen RDA-termi
source: Nationell RDA-term @sv
created: 2016-01-08
modified: 2025-10-31
in scheme: Metatietosanasto
preferred label: Blu-ray-skiva @sv
scope note: Korkeatarkkuuksinen optinen levy. Blu-ray on Philipsin ja Sonyn UDO- (Ultra Density Optical) ja Pioneerin DVDR Blue -tutkimusprojektien yhteistyössä syntynyt levyformaatti (Wikipedia, 27.9.2011)
scope note: Högupplöst optisk skiva. Blu-ray är ett skivformat som bildats i samarbete med Philips och Sonys UDO- samt Pioneers DVDR Blue-forskningsprojekt. @sv

painomaster
type: Concept
source: RDA-termi
source: RDA-term @sv
created: 2016-01-08
modified: 2023-05-17
definition: Sukupolven määrite mikromuotoiselle aineistolle, jota käytetään seuraavien sukupolvien mikromuotoisten aineistojen valmistamiseen.
definition: Bestämning av generation för material i mikroform, som används för att tillverka de följande generationerna för material i mikroform. @sv
in scheme: Metatietosanasto
preferred label: printing master @en
preferred label: tryckmaster @sv

MID/MIF
type: Concept
source: Kansallinen RDA-termi
source: Nationell RDA-term @sv
created: 2016-01-08
modified: 2024-05-24
in scheme: Metatietosanasto

XML
type: Concept
source: Kansallinen RDA-termi
source: Nationell RDA-term @sv
created: 2016-01-08
modified: 2024-05-24
in scheme: Metatietosanasto

tuloste
type: Concept
source: Kansallinen RDA-termi
source: Nationell RDA-term @sv
created: 2016-01-08
modified: 2025-10-04
in scheme: Metatietosanasto
preferred label: utskrift @sv

video
type: Concept
source: RDA-termi
source: RDA-term @sv
created: 2016-01-08
modified: 2023-05-05
definition: Viestin sisältää liikkuvaa kuvaa tai stillkuvia ja on suunniteltu käytettäväksi toistolaitteen, kuten videokasettinauhurin tai DVD-soittimen avulla. Käsittää sekä digitaalisesti koodattua että analogista kuvaa sisältävät viestimet.
definition: Rörlig bild eller stillbilder som betraktas med hjälp av en bildåtergivande apparat, såsom en videobandspelare eller dvd-spelare. Termen video anknyter till både digitalt och analogt material. Resurser som används med hjälp av videoapparat. @sv
in scheme: Metatietosanasto

Mikael Agricola -palkinto
type: Concept
source: Kansallinen RDA-termi
source: Nationell RDA-term @sv
created: 2016-01-08
modified: 2023-05-17
definition: Myönnetään edellisen vuoden merkittävän kaunokirjallisen teoksen erinomaisesta suomennoksesta. Palkinnon myöntää Suomen kääntäjien ja tulkkien liitto. Palkinto perustettiin 1957.
definition: Utdelas för en utmärkt finskspråkig översättning av ett framstående skönlitterärt verk från föregående år. Priset utdelas av Finlands översättar- och tolkförbund. Priset instiftades år 1957. @sv
example: MARC 21 -formaatissa: 586 ## ‡a Mikael Agricola -palkinto, 2020
example: I MARC 21-formatet: 586 ## ‡a Mikael Agricola-priset, 2020 @sv
in scheme: Metatietosanasto
preferred label: Mikael Agricola-priset @sv

digitaalinen data
type: Concept
source: RDA-termi
source: RDA-term @sv
created: 2016-01-08
modified: 2023-05-05
definition: Tietokoneen käsiteltäväksi tarkoitettu digitaalinen sisältö. Esimerkiksi numeerinen data, ympäristödata jne., jota käytetään keskiarvojen, korrelaatioiden jne. laskemiseen tai mallien tms. tuottamiseen, mutta jota tavallisesti ei esitetä sellaisenaan raakamateriaalina. Katso myös liikenotaatio, nuottikirjoitus, stillkuva, teksti, kolmiulotteinen muoto, kolmiulotteinen liikkuva kuva, kaksiulotteinen liikkuva kuva, esitetty musiikki, ääni, puhe, kartografinen data.
definition: Digitalt innehåll avsett att bearbetas med dator. T.ex. numerisk data eller miljödata som används för att räkna medelvärden, korrelationer o.s.v., och som inte är avsett att återges som sådant. Se även rörelsenotation, noterad musik, stillbild, text, tredimensionell form, tredimensionell rörlig bild, tvådimensionell rörlig bild, framförd musik, ljud, tal, kartografisk data. @sv
in scheme: Metatietosanasto
preferred label: computer dataset @en
preferred label: digitalt dataset @sv

HTML
type: Concept
source: Kansallinen RDA-termi
source: Nationell RDA-term @sv
created: 2016-01-08
modified: 2024-05-24
in scheme: Metatietosanasto

valokemigrafia
type: Concept
source: RDA-termi
source: RDA-term @sv
created: 2016-01-08
modified: 2023-05-17
definition: Fotomekaaninen menetelmä kemiallisesti syövytettyjen painolaattojen valmistamiseksi.
definition: Fotomekanisk metod för att framställa kemiskt etsade tryckplåtar. @sv
in scheme: Metatietosanasto
preferred label: photoengraving @en
preferred label: fotokemigrafi @sv

kysymyskortti
type: Concept
source: Kansallinen RDA-termi
source: Nationell RDA-term @sv
created: 2016-01-08
modified: 2025-10-04
in scheme: Metatietosanasto
preferred label: frågekort @sv

äiti
type: Concept
source: Kansallinen RDA-termi
source: Nationell RDA-term @sv
created: 2016-01-08
modified: 2024-05-24
definition: Nunnan kunnioittava nimitys.
definition: Vördnadsfull benämning på nunna. @sv
in scheme: Metatietosanasto
preferred label: moder @sv

stereoskooppinen
type: Concept
source: RDA-termi
source: RDA-term @sv
created: 2016-01-08
modified: 2023-05-17
definition: Elokuvafilmin esitysformaatti, joka luo kolmiulotteisuuden vaikutelman käyttämällä stereoskooppisia kuvia.
definition: Visningsformat för film, som skapar ett tredimensionellt intryck genom användning av stereoskopiska bilder. @sv
in scheme: Metatietosanasto
preferred label: stereoscopic @en
preferred label: stereoskopisk @sv

ASCII
type: Concept
source: Kansallinen RDA-termi
source: Nationell RDA-term @sv
created: 2016-01-08
modified: 2024-05-24
in scheme: Metatietosanasto

taktiili teksti
type: Concept
source: RDA-termi
source: RDA-term @sv
created: 2016-01-08
modified: 2023-05-05
definition: Kielen merkkijärjestelmällä esitetty sisältö, joka on tarkoitettu kosketeltavaksi. Esimerkiksi pistekirjoitus ja muut taktiilit tekstinkirjoitusmuodot.
definition: Innehåll uttryckt med teckensystem för språk, avsett att vidröras. T.ex. punktskrift och andra former av taktil text. @sv
in scheme: Metatietosanasto
preferred label: tactile text @en
preferred label: taktil text @sv

Ääninauhan raitojen määrä
type: ConceptGroup
type: Collection
source: RDA-termi
source: RDA-term @sv
created: 2016-01-08
modified: 2023-05-05
alternative label: Spårkonfiguration (ljudband) @sv
member: 4 raitaa
member: 1 raita
member: 16 raitaa
member: 3 raitaa
member: 8 raitaa
member: 2 raitaa
member: 12 raitaa
preferred label: Tape configuration @en
preferred label: Antal spår (ljudband) @sv

kohopaino
type: Concept
source: RDA-termi
source: RDA-term @sv
created: 2016-01-08
modified: 2023-05-17
definition: Valmistusmenetelmä, jossa joko metalli- tai muovilevystä valmistetaan tuntoaistilla havainnoitavan manifestaation kopioita.
definition: Produktionsmetod, i vilken kopior av en manifestation som registreras med känselsinnet tillverkas av antingen metall- eller plastplattor. @sv
in scheme: Metatietosanasto
preferred label: embossing @en
preferred label: relieftryck @sv

kartta
type: Concept
source: RDA-termi
source: RDA-term @sv
created: 2016-01-08
modified: 2023-05-17
definition: Kuvasisältö, joka koostuu yleensä mittakaavassa ja kaksiulotteisena esitetystä kartasta, joka on maan tai muun tähtitaivaan kappaleen tai kuvitteellisen paikan pinnan kuvaus kokonaisuudessaan tai osittain.
definition: Illustrativt innehåll som vanligen består av en tvådimensionell karta i skala, som i sin helhet eller delvis är en beskrivning av ytan av ett objekt på jorden, stjärnhimlen eller en fiktiv plats. @sv
in scheme: Metatietosanasto
preferred label: karta @sv
scope note: Monikossa: karttoja, xx karttaa
scope note: I plural: kartor, xx kartor @sv

pergamentti
type: Concept
source: RDA-termi
source: RDA-term @sv
created: 2016-01-08
modified: 2024-03-13
definition: Vasikan, lampaan tai vuohennahasta valmistettu ohut, kestävä, läpikuultava tai läpinäkymätön materiaali, jolle voi kirjoittaa tai jota voi käyttää kirjansitomiseen tai muihin tarkoituksiin.
definition: Tunnt, hållbart, genomskinligt eller ogenomskinligt material tillverkat att kalv-, får-, eller getskinn, och på vilket man kan skriva eller som kan användas för andra ändamål. @sv
in scheme: Metatietosanasto
preferred label: parchment @en
preferred label: pergament @sv

SECAM
type: Concept
source: RDA-termi
source: RDA-term @sv
created: 2016-01-08
modified: 2023-05-17
definition: Lähetysstandardi, joka on Ranskassa ensin käytetyn analogisen television värikoodausjärjestelmä, nimetty Séquentiel couleur à mémoiren mukaan.
definition: Sändningsstandard och färgkodningssystem för analog television som först användes i Frankrike. Namngett enligt Séquentiel couleur à mémoire. @sv
in scheme: Metatietosanasto

Ikäsuositus
type: Concept
source: Kansallinen RDA-termi
source: Nationell RDA-term @sv
created: 2016-01-08
modified: 2024-08-27
example: Ikäsuositus: 3–7-vuotiaille.
example: Ikäsuositus: yli 10-vuotiaille.
example: Åldersrekommendation: för 3–7-åringar. @sv
example: Åldersrekommendation: för över 10-åringar. @sv
in scheme: Metatietosanasto
preferred label: Åldersrekommendation @sv

optinen levy
type: Concept
source: RDA-termi
source: RDA-term @sv
created: 2016-01-08
modified: 2023-05-17
definition: Optisen levyn laserluettava videoformaatti.
definition: Videoformat för optisk skiva som kan avläsas med laser. @sv
in scheme: Metatietosanasto
preferred label: Laser optical @en
preferred label: optisk skiva @sv

kolme kertaa viikossa
type: Concept
source: RDA-termi
source: RDA-term @sv
created: 2016-01-08
modified: 2023-05-17
alternative label: tre gånger i veckan @sv
definition: Ilmestymis- tai päivittymistiheys aineistolle, joka ilmestyy tai päivittyy kolme kertaa viikossa.
definition: Utgivnings- eller uppdateringsfrekvens för material som utkommer eller uppdateras tre gånger i veckan. @sv
in scheme: Metatietosanasto
preferred label: three times a week @en
preferred label: tre gånger per vecka @sv

exlibris
type: Concept
source: Kansallinen RDA-termi
source: Nationell RDA-term @sv
created: 2016-01-08
modified: 2024-05-24
in scheme: Metatietosanasto
scope note: Henkilön/yhteisön nimi
scope note: Persons/institutions namn @sv

Hankintalähde
type: ConceptGroup
type: Collection
source: RDA-termi
source: RDA-term @sv
created: 2016-01-08
modified: 2023-05-05
member: lahjoitus
member: vapaakappaleiden luovuttaja
member: ostettu
preferred label: Immediate source of acquisition of item @en
preferred label: Förvärvskälla @sv

puhe
type: Concept
source: RDA-termi
source: RDA-term @sv
created: 2016-01-08
modified: 2025-11-04
alternative label: tal (ljudinnehåll) @sv
definition: Kuunneltavaksi tarkoitettu kielellinen sisältö. Sisältää esim. puheäänitteet, runonlausunnat, puheet, haastattelut, suulliset tarinat, tietokoneella tuotetun puheen jne.
definition: Språkligt innehåll avsett att lyssnas på. Omfattar inbandade tal, poesiuppläsning, tal (föredrag), intervjuer, muntliga berättelser, tal producerat på dator o.s.v. @sv
in scheme: Metatietosanasto
preferred label: spoken word @en
preferred label: tal @sv

valopaino
type: Concept
source: Kansallinen RDA-termi
source: Nationell RDA-term @sv
created: 2016-01-08
modified: 2025-10-04
in scheme: Metatietosanasto
preferred label: ljustryck @sv

Kiitos kirjasta -mitali
type: Concept
source: Kansallinen RDA-termi
source: Nationell RDA-term @sv
created: 2016-01-08
modified: 2023-05-17
definition: Kirjallisuuspalkinto, jota Kirjakauppaliitto, Libro ja Suomen Kirjastoseura ovat jakaneet vuodesta 1966. Palkinto annetaan kotimaiselle kirjailijalle, jonka edellisen vuoden suomen- tai ruotsinkielinen teos on elähdyttänyt kaunokirjallisuutta.
definition: Litteraturpris som har utdelats av Bokhandelsförbundet, Libro och Finlands biblioteksförening sedan 1966. Priset utdelas åt en inhemsk författare, som föregående år gett ut ett stimulerande skönlitterärt verk på finska eller svenska. @sv
example: MARC 21 -formaatissa: 586 ## ‡a Kiitos kirjasta -mitali, 1966
example: I MARC 21-formatet: 586 ## ‡a Tack för boken-medaljen, 1966 @sv
in scheme: Metatietosanasto
preferred label: Tack för boken-medaljen @sv

magneettijauhe
type: Concept
source: RDA-termi
source: RDA-term @sv
created: 2016-01-08
modified: 2023-05-17
alternative label: magneettiset partikkelit
alternative label: magnetiska partiklar @sv
definition: Materiaali, joka on luonnollista tai synteettistä epäorgaanista yhdistettä ja joka muodostuu erittäin magneettisista partikkeleista. Käytetään tavallisesti binaaristen tai analogisten tietojen tallentamiseen.
definition: Material som är naturlig eller syntetisk oorganisk förening och som bildas av mycket magnetiska partiklar. Används vanligen gällande lagring av binär eller analog data. @sv
in scheme: Metatietosanasto
preferred label: magnetic particles @en
preferred label: magnetpulver @sv

synteettinen
type: Concept
source: RDA-termi
source: RDA-term @sv
created: 2016-01-08
modified: 2024-03-13
definition: Materiaali, joka on valmistettu prosessoimalla keinotekoisia materiaaleja, yleensä luonnollisten materiaalien korvaajana.
definition: Material som har tillverkats genom att bearbeta konstgjorda material, vanligen som ersättning för naturliga material. @sv
in scheme: Metatietosanasto
preferred label: synthetic @en
preferred label: syntetisk @sv

Finlandia-palkinto
type: Concept
source: Kansallinen RDA-termi
source: Nationell RDA-term @sv
created: 2016-01-08
modified: 2023-05-17
definition: Jaetaan vuosittain ansiokkaan romaanin kirjoittajalle. Palkinto perustettiin vuonna 1984. Alun perin palkinto myönnettiin mille tahansa kaunokirjalliselle teokselle mutta vuodesta 1993 sen on voinut saada vain romaani.
definition: Utdelas årligen åt en författare som skrivit en meriterad roman. Priset grundades år 1984. Ursprungligen utdelades priset åt vilken skönlitterär genre som helst, men från och med år 1993 har endast romaner kunnat få priset. @sv
example: MARC 21 -formaatissa: 586 ## ‡a Finlandia-palkinto, 2020
example: I MARC 21-formatet: 586 ## ‡a Finlandiapriset, 2020 @sv
in scheme: Metatietosanasto
preferred label: Finlandiapriset @sv

äänikela
type: Concept
source: RDA-termi
source: RDA-term @sv
created: 2016-01-08
modified: 2024-03-09
definition: Avokela, jossa on ääninauha. Käytetään kelanauhurilaitteistolla.
definition: Spole som innehåller ljudband. Används i rullbandspelare. @sv
in scheme: Metatietosanasto
preferred label: audiotape reel @en
preferred label: ljudspole @sv
scope note: Äänitallenne.
scope note: Ljudbärare. @sv

white print -menetelmä
type: Concept
source: RDA-termi
source: RDA-term @sv
created: 2016-01-08
modified: 2023-05-17
definition: Valmistusmenetelmä, jossa valmistetaan kopioita valoherkässä prosessissa, joka toistaa läpinäkymättömät sävyt tai värit mustana tai värinä valkoisella taustalla.
definition: Produktionsmetod, i vilken kopior framställs i en ljuskänslig process, som återger opaka toner eller färger som svarta eller färg på vit botten. @sv
in scheme: Metatietosanasto
preferred label: white print process @en
preferred label: white print-metod @sv

litografia
type: Concept
source: RDA-termi
source: RDA-term @sv
created: 2016-01-08
modified: 2023-05-17
definition: Laakapainomenetelmä, jossa kivi tai laatta käsitellään vettähylkivällä aineella, joka tekee osan laatasta vastaanottavaiseksi musteelle.
definition: Plantrycksmetod, i vilken en sten eller en platta behandlas med vattenavstötande ämne som gör en del av plattan mottagglig för bläck. @sv
in scheme: Metatietosanasto
preferred label: lithography @en
preferred label: litografi @sv

taktiili kolmiulotteinen muoto
type: Concept
source: RDA-termi
source: RDA-term @sv
created: 2016-01-08
modified: 2023-05-05
definition: Muotona tai muotoina esitetty sisältö, joka on tarkoitettu kosketeltavaksi kolmiulotteiseksi muodoksi.
definition: Innehåll uttryckt som en form eller former, avsett att vidröras som en tredimensionell form. @sv
in scheme: Metatietosanasto
preferred label: three-dimensional form @en
preferred label: taktil tredimensionell form @sv

DEM
type: Concept
source: Kansallinen RDA-termi
source: Nationell RDA-term @sv
created: 2016-01-08
modified: 2024-05-24
in scheme: Metatietosanasto

kaiverrus
type: Concept
source: RDA-termi
source: RDA-term @sv
created: 2016-01-08
modified: 2023-05-17
alternative label: gravering @sv
definition: Valmistusmenetelmä, jossa tehdään kuvioita kovan materiaalin pintaan terävällä työkalulla kaivertamalla.
definition: Produktionsmetod, i vilken figurer i ett hårt materials yta görs genom att gravera med ett vasst redskap. @sv
in scheme: Metatietosanasto
preferred label: engraving @en
preferred label: gravyr @sv

Dolby B
type: Concept
source: RDA-termi
source: RDA-term @sv
created: 2016-01-08
modified: 2023-05-17
definition: Dolby Laboratoriesin analogiselle magneettinauhalle kehittämä melunvaimennusjärjestelmä, joka on Dolby-A:n yksinkertaistettu versio kuluttajakäyttöön.
definition: Brusreduceringssystem för analogt magnetband, som är en förenklad version av Dolby-A för konsumentbruk, utvecklat av Dolby Laboratories. @sv
in scheme: Metatietosanasto
preferred label: Dolby-B encoded @en

CCIR-standardi
type: Concept
source: RDA-termi
source: RDA-term @sv
created: 2016-01-08
modified: 2023-05-17
definition: CCIR:n alun perin antama standardi lomitettujen analogisten videosignaalien koodaamiseksi digitaalisessa videomuodossa.
definition: Standard för kodning av analoga videosignaler i digitalt videoformat, ursprungligen utgiven av CCIR. @sv
in scheme: Metatietosanasto
preferred label: CCIR encoded @en
preferred label: CCIR standard @sv

DVD-äänilevy
type: Concept
source: Kansallinen RDA-termi
source: Nationell RDA-term @sv
created: 2016-01-08
modified: 2025-10-31
definition: Pääosin audiodataa sisältävä DVD-levy
definition: DVD-skiva som i huvudsak innehåller audiodata. @sv
in scheme: Metatietosanasto
preferred label: DVD-ljudskiva @sv

1 raita
type: Concept
source: Kansallinen RDA-termi
source: Nationell RDA-term @sv
created: 2016-01-08
modified: 2024-05-24
in scheme: Metatietosanasto
preferred label: 1 ljudspår @sv

Bristol-paperi
type: Concept
source: RDA-termi
source: RDA-term @sv
created: 2016-01-08
modified: 2024-03-13
definition: Korkealuokkaisesta valkoisesta kartongista muodostuva materiaali, yleisimmin valmistettu liimaamalla yhteen vahvoja paperiarkkeja.
definition: Material som består av högklassig vit kartong, vanligen tillverkad genom att limma samman starka pappersark. @sv
in scheme: Metatietosanasto
preferred label: Bristol board @en
preferred label: bristolpapper @sv

EPUB
type: Concept
source: Kansallinen RDA-termi
source: Nationell RDA-term @sv
created: 2016-01-08
modified: 2024-05-24
in scheme: Metatietosanasto

objekti
type: Concept
source: RDA-termi
source: RDA-term @sv
created: 2016-01-08
modified: 2023-05-17
definition: Kolmiulotteinen artefakti (tai artefaktin jäljennös) tai luonnollinen objekti.
definition: Tredimensionell artefakt (eller kopia av artefakt) eller ett i naturen förekommande objekt. @sv
in scheme: Metatietosanasto
preferred label: object @en
preferred label: föremål @sv
scope note: Ilman laitetta käytettävä tallennetyyppi.
scope note: Omedierad bärartyp. @sv

Kappaleen suhteet toimijaan
type: ConceptGroup
type: Collection
created: 2016-01-08
modified: 2026-01-23
member: aiempi omistaja
member: kappaleen entisöijä
member: kappaleen omistuksen kohde
member: illuminoinnin tekijä
member: nykyinen omistaja
member: lahjoittaja
member: sitoja
member: myyjä
member: kappaleella kunnioitettu toimija
member: tallettaja
member: omistaja
member: säilyttäjä
member: muokkaaja
member: kappaleeseen liittyvä toimija
preferred label: Exemplars relationer till aktörer @sv

kuvatiedosto
type: Concept
source: RDA-termi
source: RDA-term @sv
created: 2016-01-08
modified: 2023-05-17
definition: Tiedostotyyppi elektronisesti taltioidun still-kuvasisällön tallentamiseksi.
definition: Filformat för lagring av elektroniskt upptaget stillbildsinnehåll. @sv
in scheme: Metatietosanasto
preferred label: image file @en
preferred label: bildfil @sv

syväpainomenetelmä
type: Concept
source: Kansallinen RDA-termi
source: Nationell RDA-term @sv
created: 2016-01-08
modified: 2025-10-04
definition: Syväpainomenetelmässä painopinnan painava osa on painamatonta pintaa alempana. Painoväri siirtyy painettavaan materiaaliin rasterikupeista eli painopinnan syvennyksistä.
definition: I djuptrycksmetoden ligger den tryckande delen lägre ner än den otryckta ytan. Tryckfärgen överförs till det tryckta materialet ur rasterkoppar, alltså fördjupningar i tryckytan. @sv
in scheme: Metatietosanasto
preferred label: intaglio @en
preferred label: djuptryck @sv

CX
type: Concept
source: RDA-termi
source: RDA-term @sv
created: 2016-01-08
modified: 2023-05-17
definition: CBS Laboratoriesin 1970-luvun lopulla kehittämä melunvaimennusjärjestelmä analogisesti tallennetulle äänelle.
definition: Brusreduceringssystem för analogt inspelat ljud, utvecklat av CBS Laboratories i slutet av 1970-talet. @sv
in scheme: Metatietosanasto
preferred label: CX encoded @en

GIF
type: Concept
source: Kansallinen RDA-termi
source: Nationell RDA-term @sv
created: 2016-01-08
modified: 2024-05-24
in scheme: Metatietosanasto

magneto-optinen
type: Concept
source: RDA-termi
source: RDA-term @sv
created: 2016-01-08
modified: 2023-05-17
definition: Tallennusmedia, jossa käytetään laserkuumennuksen ja vaihtelevan magneettikentän yhdistelmää datan kirjoittamiseksi levylle.
definition: Lagringsmedium, i vilket en kombination av laservärmning och varierande magnetfält används för att skriva data på en skiva. @sv
in scheme: Metatietosanasto
preferred label: magneto-optical @en
preferred label: magnet-optisk @sv

pappismunkki
type: Concept
source: Kansallinen RDA-termi
source: Nationell RDA-term @sv
created: 2016-01-08
modified: 2024-06-04
alternative label: pappismunkki (arvonimi)
alternative label: prästmunk (hederstitel) @sv
definition: Ortodoksisessa kirkossa papiksi vihitty munkki.
definition: Prästvigd munk i ortodoxa kyrkan. @sv
in scheme: Metatietosanasto
preferred label: prästmunk @sv

filmisilmukkakasetti
type: Concept
source: RDA-termi
source: RDA-term @sv
created: 2016-01-08
modified: 2023-05-17
definition: Kasetti, joka sisältää silmukkamaisen elokuvafilmin.
definition: Kasett som innehåller slingartad film. @sv
in scheme: Metatietosanasto
preferred label: film cartridge @en
preferred label: filmmagasin @sv
scope note: Heijastettava kuvatallenne.
scope note: Bärare för projicerbara bilder. @sv

raina
type: Concept
source: RDA-termi
source: RDA-term @sv
created: 2016-01-08
modified: 2023-05-17
definition: Filmirulla, joka koostuu sarjasta kuvia, jotka esitetään yksitellen. Voi sisältää myös ääntä.
definition: Filmlängd innehållande en följd av bilder avsedda för visning en i taget som stillbilder. Kan även innehålla ljud. @sv
in scheme: Metatietosanasto
preferred label: bildband @sv
scope note: Heijastettava kuvatallenne.
scope note: Bärare för projicerbara bilder. @sv

vähäinen pienennys
type: Concept
source: RDA-termi
source: RDA-term @sv
created: 2016-01-08
modified: 2023-05-17
definition: Pienennyssuhde mikromuotoiselle aineistolle, joka on pienempi kuin 16x.
definition: Förminskningsgrad för material i mikroform, som är mindre än 16x. @sv
in scheme: Metatietosanasto
preferred label: low reduction @en
preferred label: låg förminskning @sv

henkilön arvonimi tai asema
type: ConceptGroup
type: Collection
source: RDA-termi
source: RDA-term @sv
created: 2016-01-08
modified: 2025-06-14
definition: A word or phrase indicative of royalty, nobility, rank, honour, or office, or a term of address for a person of religious vocation. @en
definition: Sana tai ilmaus, joka osoittaa kuninkaallista tai aatelisarvoa, kirkollista virkaa tai asemaa tai uskonnolliseen tehtävään liittyvää puhuttelua.
definition: Ord eller fras som påvisar kunglig eller adlig titel, kyrkligt ämbete eller kyrklig ställning, eller annan titel i anslutning till religiös uppgift. @sv
member: kirkollinen tai uskonnollinen arvo(nimi)
member: kuninkaallinen tai aatelisarvo
member: muu, mm. kunnioitusta osoittava arvonimi
preferred label: term of rank or honour or office @en
preferred label: hederstitel @sv

toimintakortti
type: Concept
source: RDA-termi
source: RDA-term @sv
created: 2016-01-08
modified: 2023-05-17
definition: Laajuuden yksikkö, kortti, johon on painettu sanoja, numeroita, tai/ja kuvia, ja jota käytetään tietyn toiminnan toteuttamisessa.
definition: Enhet, kort med tryckta ord, siffror och/eller bilder som används för att förverkliga en särskild aktivitet. (eng. activity card) @sv
in scheme: Metatietosanasto
preferred label: activity card @en
preferred label: aktivitetskort @sv

diagrammi
type: Concept
source: RDA-termi
source: RDA-term @sv
created: 2016-01-08
modified: 2023-05-17
definition: Laajuuden yksikkö, kartta-aineisto, joka on numeerisen tiedon tai jonkin tapahtuman tai prosessin etenemisen tai vaikutusten maantieteellinen esitysmuoto.
definition: Enhet, kartografisk resurs som är en geografisk representation av numerisk data eller händelser, processer eller verkningar. @sv
in scheme: Metatietosanasto
preferred label: diagram @en

veli
type: Concept
source: Kansallinen RDA-termi
source: Nationell RDA-term @sv
created: 2016-01-08
modified: 2024-05-24
definition: Munkkikunnan miespuolinen jäsenen nimitys.
definition: Benämning på manlig medlem i munkorden. @sv
in scheme: Metatietosanasto
preferred label: broder @sv

videokela
type: Concept
source: RDA-termi
source: RDA-term @sv
created: 2016-01-08
modified: 2023-05-17
definition: Videonauhan sisältävä avokela, jota käytetään videokelanauhurilla.
definition: Spole med videoband, avsedd att användas i rullbandspelare. @sv
in scheme: Metatietosanasto
preferred label: videotape reel @en
preferred label: videospole @sv
scope note: Videotallenne.
scope note: Videobärare. @sv

Äänen tallennusmedian tyyppi
type: ConceptGroup
type: Collection
source: RDA-termi
source: RDA-term @sv
created: 2016-01-08
modified: 2023-05-05
alternative label: Typ av lagringsmedium för ljud @sv
definition: Liittää manifestaation menetelmään, jolla ääni tallennetaan äänitteelle.
definition: Sammankopplar manifestation med metod för inspelning av ljud på ett lagringsmedium. @sv
member: magneettinen
member: magneto-optinen
member: optinen
preferred label: Recording medium @en
preferred label: Inspelningssätt @sv

Dolby C
type: Concept
source: RDA-termi
source: RDA-term @sv
created: 2016-01-08
modified: 2023-05-17
definition: Dolby Laboratoriesin vuonna 1980 kehittämä melunvaimennusjärjestelmä, joka on Dolby-A:n ja Dolby-B:n yhdistetty versio käytettäväksi analogisessa magneettinauhassa.
definition: Brusreduceringssystem som är en kombinerad version av Dolby-A och Dolby-B avsedd för användning i analogt magnetband, utvecklat av Dolby Laboratories år 1980. @sv
in scheme: Metatietosanasto
preferred label: Dolby-C encoded @en

kuva
type: Concept
source: RDA-termi
source: RDA-term @sv
created: 2016-01-08
modified: 2023-05-05
definition: Laajuuden yksikkö, kaksiulotteinen liikkumaton kuva.
definition: Enhet, tvådimensionell stillbild. @sv
in scheme: Metatietosanasto
preferred label: picture @en
preferred label: bild @sv

metropoliitta
type: Concept
source: Kansallinen RDA-termi
source: Nationell RDA-term @sv
created: 2016-01-08
modified: 2024-05-24
definition: Arvoltaan patriarkan ja arkkipiispan välinen ortodoksinen piispa; katolisessa kirkossa arkkipiispasta.
definition: Ortodox biskop mellan patriark och ärkebiskop i rang; i katolska kyrkan om ärkebiskop. @sv
in scheme: Metatietosanasto
preferred label: metropolit @sv

tietonauhan silmukkakasetti
type: Concept
source: RDA-termi
source: RDA-term @sv
created: 2016-01-08
modified: 2023-05-17
definition: Silmukkamaisen tietonauhan sisältävä kasetti.
definition: Magasin som innehåller datorband. @sv
in scheme: Metatietosanasto
preferred label: computer tape cartrigde @en
preferred label: datorbandmagasin @sv
scope note: Tietokonetallenne.
scope note: Datorbärare. @sv

guassi
type: Concept
source: RDA-termi
source: RDA-term @sv
created: 2016-01-08
modified: 2023-05-17
alternative label: täckfärg @sv
definition: Materiaali, joka koostuu väriaineesta ja sideaineesta, johon on toisinaan lisätty myös kiinteää ainetta. Muodostaa läpinäkymättömän, värillisen, vesiliukoisen pinnan.
definition: Material som består av färg- och bindemedel, i vilket ibland även ett fast ämne tillfogats. Bildar en ogenomskinlig, vattenlöslig yta i färg. @sv
in scheme: Metatietosanasto
preferred label: gouache @en

QuickTime
type: Concept
source: Kansallinen RDA-termi
source: Nationell RDA-term @sv
created: 2016-01-08
modified: 2024-05-24
in scheme: Metatietosanasto

Kirjasinkoko
type: ConceptGroup
type: Collection
source: RDA-termi
source: RDA-term @sv
created: 2016-01-08
modified: 2023-05-05
definition: Liittää manifestaation manifestaatiossa esiintyvien merkkien sekä symbolien kokoon.
definition: Sammankopplar manifestation med storleken på tecken och symboler som förekommer i manifestationen. @sv
member: isopistekirjoitus
member: erittäin suuri teksti
member: isotekstinen
preferred label: Font size @en
preferred label: Teckenstorlek @sv
scope note: Jos aineiston kirjasinkoko on tarkoitettu näkövammaisille, merkitään kirjasinkoko käyttämällä soveltuvaa termiä seuraavasta luettelosta:
scope note: Om resursens teckenstorlek är avsedd för synskadade, anges denna genom att använda en lämplig term från följande lista: @sv

120 kierr./min
type: Concept
source: Kansallinen RDA-termi
source: Nationell RDA-term @sv
created: 2016-01-08
modified: 2024-05-24
in scheme: Metatietosanasto
preferred label: 120 varv/min @sv

metalli
type: Concept
source: RDA-termi
source: RDA-term @sv
created: 2016-01-08
modified: 2024-03-13
definition: Materiaali, jolle on tyypillistä hyvät sähkön- ja lämmönjohto-ominaisuudet, läpinäkymättömyys, ominaisuuksiin kuuluvat myös kiilto, helppo sulatettavuus ja muokattavuus ja taottavuus.
definition: Material för vilket god ström- och värmeledning, opacitet, glans, smältbarhet, formbarhet och smidbarhet är typiska. @sv
in scheme: Metatietosanasto
preferred label: metal @en
preferred label: metall @sv

igumeeni
type: Concept
source: Kansallinen RDA-termi
source: Nationell RDA-term @sv
created: 2016-01-08
modified: 2024-05-24
definition: Ortodoksisen luostarin esimies
definition: Föreståndre i ortodoxt kloster. @sv
in scheme: Metatietosanasto
preferred label: igumen @sv

EIAJ
type: Concept
source: RDA-termi
source: RDA-term @sv
created: 2016-01-08
modified: 2023-05-17
definition: Analogisen nauhan videoformaatti, jonka Electronic Industries Association of Japan kehitti ammattilaiskäyttöön vuonna 1969.
definition: Videoformat för analogt band, som Electronic Industries Association of Japan utvecklade för professionellt bruk år 1969. @sv
in scheme: Metatietosanasto

karttalehti
type: Concept
source: Kansallinen RDA-termi
source: Nationell RDA-term @sv
created: 2016-01-08
modified: 2025-10-04
in scheme: Metatietosanasto
preferred label: kartblad @sv
scope note: kartta-aineiston laajuuden yksikkö
scope note: enhet för kartmaterial @sv

kuvasalkku
type: Concept
source: Kansallinen RDA-termi
source: Nationell RDA-term @sv
created: 2016-01-08
modified: 2025-10-04
definition: Kotelo, joka sisältää esim. grafiikanlehtiä, kuvakortteja tms. (Kuvailusäännöt)
definition: Fodral, som innehåller t.ex. grafikblad, bildkort e.d. @sv
in scheme: Metatietosanasto
preferred label: bildportfölj @sv

BIL
type: Concept
source: Kansallinen RDA-termi
source: Nationell RDA-term @sv
created: 2016-01-08
modified: 2024-05-24
in scheme: Metatietosanasto

15/16 tuumaa/s
type: Concept
source: Kansallinen RDA-termi
source: Nationell RDA-term @sv
created: 2016-01-08
modified: 2024-05-24
in scheme: Metatietosanasto
preferred label: 15/16 tum/s @sv

8 mm
type: Concept
source: RDA-termi
source: RDA-term @sv
created: 2016-01-08
modified: 2023-05-17
definition: Analogisen ja digitaalisen nauhan videoformaatti, johon sisältyvät Video8, Hi-8 sekä Digital8 -formaatit.
definition: Videoformat för analogt och digitalt band, i vilket ingår Video8, Hi-8 och Digital8-format. @sv
in scheme: Metatietosanasto

lisensiaatintyö
type: Concept
source: Kansallinen RDA-termi
source: Nationell RDA-term @sv
created: 2016-01-08
modified: 2024-05-24
alternative label: licentiatarbete @sv
in scheme: Metatietosanasto
preferred label: licentiatavhandling @sv

pahvi
type: Concept
source: RDA-termi
source: RDA-term @sv
created: 2016-01-08
modified: 2024-03-13
definition: Hyvälaatuisesta selluloosasta tai lumppumassasta valmistettu materiaali, joka vaihtelee suuresti tyypiltään ja vahvuudeltaan, ja joka on paksuudeltaan vähintään 0.1524 mm.
definition: Material tillverkat av kvalitativ cellulosa eller lumpmassa, som till sin typ och styrka varierar och vars tjocklek är minst 0.1524 mm. @sv
in scheme: Metatietosanasto
preferred label: cardboard @en
preferred label: papp och kartong @sv

koneella kirjoitettu
type: Concept
source: Kansallinen RDA-termi
source: Nationell RDA-term @sv
created: 2016-01-08
modified: 2025-10-04
definition: Käytetään manifestaatiosta, jonka sisältämän teoksen tai teosten vastuullisuustekijä tai -tekijät on itse kirjoittanut koneella.
definition: Används om manifestation, som innehåller verk som en ansvarig upphovsman själv skrivit ned på maskin. @sv
in scheme: Metatietosanasto
preferred label: typescript @en
preferred label: maskinskriven @sv

hyvin voimakas pienennys
type: Concept
source: RDA-termi
source: RDA-term @sv
created: 2016-01-08
modified: 2023-05-17
definition: Pienennyssuhde mikromuotoiselle tallenteelle, kun kuvan suhde alkuperäiseen kuvaan on enemmän kuin 90x.
definition: Förminskningsgrad för en upptagning i mikroform, då bildens relation till den ursprungliga bilden är mer än 90x. @sv
in scheme: Metatietosanasto
preferred label: ultra high reduction @en
preferred label: ultrastark förminskning @sv

NTSC
type: Concept
source: RDA-termi
source: RDA-term @sv
created: 2016-01-08
modified: 2023-05-17
definition: Analogisen televisiojärjestelmän lähetysstandardi joka oli käytössä suurimmassa osassa Amerikkaa sekä kaukoidässä, nimetty National Television System Committeen mukaan.
definition: Sändningsstandard för analogt televisionssystem, som användes i större delen av Amerika samt i Fjärran Östern. Förkortning av National Television System Committee. @sv
in scheme: Metatietosanasto

SGML
type: Concept
source: Kansallinen RDA-termi
source: Nationell RDA-term @sv
created: 2016-01-08
modified: 2024-05-24
in scheme: Metatietosanasto

rulla
type: Concept
source: RDA-termi
source: RDA-term @sv
created: 2016-01-08
modified: 2023-05-17
definition: Rullalle kääritty aineisto (paperia, filmiä, nauhaa tms.).
definition: Material (papper, film, band e.d.) som lindats upp på rulle. @sv
in scheme: Metatietosanasto
preferred label: roll @en
preferred label: rulle @sv
scope note: Ilman laitetta käytettävä tallennetyyppi.
scope note: Omedierad bärartyp. @sv

määrittelemätön
type: Concept
source: Kansallinen RDA-termi
source: Nationell RDA-term @sv
created: 2016-01-08
modified: 2024-03-15
in scheme: Metatietosanasto
preferred label: ospecificerad @sv
scope note: Käytetään kun mediatyyppiä tai -tyyppejä, jotka soveltuvat kuvailtavaan aineistoon, ei voida helposti todentaa.
scope note: Används då medietypen eller -typerna som passar in på den beskrivna resursen, inte enkelt kan fastställas. @sv

mikrofilmikela
type: Concept
source: RDA-termi
source: RDA-term @sv
created: 2016-01-08
modified: 2023-05-17
definition: Avokela, jossa on mikrofilmin lukijalla katsottava mikrofilmi.
definition: Spole med mikrofilm avsedd att läsas i mikrofilmsläsare. @sv
in scheme: Metatietosanasto
preferred label: microfilm reel @en
preferred label: mikrofilmsspole @sv
scope note: Mikromuotoinen tallenne.
scope note: Mikroformsbärare. @sv

tekstiili
type: Concept
source: RDA-termi
source: RDA-term @sv
created: 2016-01-08
modified: 2024-03-13
definition: Materiaali, joka valmistetaan kutomalla, huovuttamalla, sitomalla, punomalla tai muulla tavalla käsittelemällä luonnollisia tai synteettisiä kuituja niin että ne kiinnittyvät toisiinsa.
definition: Material som tillverkas genom att väva, tova, binda, fläta eller på annat sätt behandla naturliga eller syntetiska fibrer så att de fästs vid varandra. @sv
in scheme: Metatietosanasto
preferred label: textile @en
preferred label: textil @sv

JPEG
type: Concept
source: Kansallinen RDA-termi
source: Nationell RDA-term @sv
created: 2016-01-08
modified: 2024-05-24
in scheme: Metatietosanasto

harvennettu riviväli
type: Concept
source: RDA-termi
source: RDA-term @sv
created: 2016-01-08
modified: 2023-05-17
definition: Layout, jossa tekstirivien välillä on tyhjä rivi.
definition: Layout med en tom rad mellan textraderna. @sv
in scheme: Metatietosanasto
preferred label: double line spacing @en
preferred label: utökat radavstånd @sv

sisar
type: Concept
source: Kansallinen RDA-termi
source: Nationell RDA-term @sv
created: 2016-01-08
modified: 2024-05-24
definition: Nunnakunnan naispuolisen henkilön nimitys.
definition: Benämning på kvinnlig person i nunneorden. @sv
in scheme: Metatietosanasto
preferred label: syster @sv

arkkimandriitta
type: Concept
source: Kansallinen RDA-termi
source: Nationell RDA-term @sv
created: 2016-01-08
modified: 2024-05-24
definition: Ortodoksisessa kirkossa ylimmän arvoasteen pappismunkki.
definition: Prästmunk av högsta rang i ortodoxa kyrkan. @sv
in scheme: Metatietosanasto
preferred label: arkimandrit @sv

outline
type: Concept
source: RDA-termi
source: RDA-term @sv
created: 2016-01-08
modified: 2024-08-27
definition: Layout, joka koostuu outline-muotoisesta nuottikirjoituksesta.
definition: Layout som består av notskrift i outline-form. @sv
in scheme: Metatietosanasto

kuukausittain
type: Concept
source: RDA-termi
source: RDA-term @sv
created: 2016-01-08
modified: 2023-05-17
alternative label: kerran kuukaudessa
alternative label: en gång i månaden @sv
alternative label: månatligen @sv
definition: Ilmestymis- tai päivittymistiheys aineistolle, joka ilmestyy tai päivittyy kerran kuukaudessa.
definition: Utgivnings- eller uppdateringsfrekvens för material som utkommer eller uppdateras en gång i månaden. @sv
in scheme: Metatietosanasto
preferred label: monthly @en
preferred label: en gång per månad @sv

mono
type: Concept
source: RDA-termi
source: RDA-term @sv
created: 2016-01-08
modified: 2023-05-17
definition: Yhdestä kanavasta koostuva monofonisen äänen äänikanava.
definition: Ljudkanal för monofoniskt ljud, som består av en kanal. @sv
in scheme: Metatietosanasto

TIFF
type: Concept
source: Kansallinen RDA-termi
source: Nationell RDA-term @sv
created: 2016-01-08
modified: 2024-05-24
in scheme: Metatietosanasto

48:o
type: Concept
source: RDA-termi
source: RDA-term @sv
created: 2016-01-08
modified: 2025-05-13
definition: Bibliografinen koko muodostuu yhdestä tai useammasta lehdestä, jotka ovat kooltaan 1/48 arkista.
definition: Bokens format består av ett eller flera blad som till sin storlek är 1/48 av ett tryckark. @sv
in scheme: Metatietosanasto
preferred label: 48mo @en

Lotus
type: Concept
source: Kansallinen RDA-termi
source: Nationell RDA-term @sv
created: 2016-01-08
modified: 2024-05-24
in scheme: Metatietosanasto

PDF
type: Concept
source: Kansallinen RDA-termi
source: Nationell RDA-term @sv
created: 2016-01-08
modified: 2024-05-24
in scheme: Metatietosanasto

kartografinen liikkuva kuva
type: Concept
source: RDA-termi
source: RDA-term @sv
created: 2016-01-08
modified: 2023-05-05
definition: Kaksiulotteisena liikkuvana kuvana esitetty kartografinen sisältö. Esimerkiksi liikkuvat satelliittikuvat maasta tai muista taivaankappaleista.
definition: Kartografiskt innehåll uttryckt som tvådimensionell rörlig bild. T.ex. rörliga satellitbilder av jorden eller andra himlakroppar. @sv
in scheme: Metatietosanasto
preferred label: cartographic moving image @en
preferred label: kartografisk rörlig bild @sv

voimakas pienennys
type: Concept
source: RDA-termi
source: RDA-term @sv
created: 2016-01-08
modified: 2023-05-17
definition: Pienennyssuhde mikromuotoiselle aineistolle, kun suhde alkuperäiseen kuvaan on 61x–90x.
definition: Förminskningsgrad för material i mikroform, då förhållandet till den ursprungliga bilden är 61x-90x. @sv
in scheme: Metatietosanasto
preferred label: very high reduction @en
preferred label: mycket stark förminskning @sv

piirikotelo
type: Concept
source: RDA-termi
source: RDA-term @sv
created: 2016-01-08
modified: 2023-05-17
definition: Kotelo joka sisältää mikropiirin puolijohtavalla piilevyllä.
definition: Magasin som innehåller en mikrokrets på en halvledande kiselplatta. @sv
in scheme: Metatietosanasto
preferred label: computer chip cartridge @en
preferred label: datorminnesmodul @sv
scope note: Tietokonetallenne.
scope note: Datorbärare. @sv

160 kierr./min
type: Concept
source: Kansallinen RDA-termi
source: Nationell RDA-term @sv
created: 2016-01-08
modified: 2024-05-24
in scheme: Metatietosanasto
preferred label: 160 varv/min @sv

CD-äänilevy
type: Concept
source: Kansallinen RDA-termi
source: Nationell RDA-term @sv
created: 2016-01-08
modified: 2025-10-31
in scheme: Metatietosanasto
preferred label: CD-ljudskiva @sv
scope note: engl. Audio CD
scope note: eng. Audio CD @sv

johdannaismaster
type: Concept
source: RDA-termi
source: RDA-term @sv
created: 2016-01-08
modified: 2023-05-17
alternative label: derivativ master @sv
definition: Alkuperäisen tallenteen ja siihen perustuvan kopion välinen suhde.
definition: Relation mellan en originalupptagning och en kopia som grundar sig på den. @sv
in scheme: Metatietosanasto
preferred label: derivative master @en
preferred label: härledd master @sv

öljyväri
type: Concept
source: RDA-termi
source: RDA-term @sv
created: 2016-01-08
modified: 2023-05-17
definition: Materiaali, joka koostuu kuivuvaan öljyyn sekoitetusta väriaineesta.
definition: Material som består av färgämne som blandats i torkande olja. @sv
in scheme: Metatietosanasto
preferred label: oil paint @en
preferred label: oljefärg @sv

Vakiintunut kokoava nimeke
type: ConceptGroup
type: Collection
source: RDA-termi
source: RDA-term @sv
created: 2016-01-08
modified: 2024-07-06
alternative label: Konventionell titel @sv
member: Runot
member: Libretot
member: Kirjeet
member: Puheet
member: Näytelmät
member: Proosateokset
member: Sanoitukset
member: Romaanit
member: Esseet
member: Novellit
member: Valikoima
member: Teokset
member: Saarnat
member: Sarjakuvat
member: Sadut
member: Sävellykset
preferred label: Conventional collective title @en
preferred label: Grupptitel @sv
scope note: Nimeke, jota käytetään ensisijaisena nimekkeenä kokoelmasta, joka sisältää kaksi tai useampia teoksia tai kaksi tai useampia teoksen osia (esim. Teokset, Runot, Valikoima).
scope note: Titel som används som föredragen titel för en samling innehållande två eller flera verk, eller två eller flera delar av ett verk. (t.ex. Verk, Dikter, Urval). @sv

postikortti
type: Concept
source: RDA-termi
source: RDA-term @sv
created: 2016-01-08
modified: 2023-05-17
definition: Laajuuden yksikkö, kortti, johon voi kirjoittaa tai painaa viestin ja lähettää postitse ilman kirjekuorta.
definition: Enhet, kort, på vilket man kan skriva eller trycka meddelande, och som skickas per post utan kuvert. @sv
in scheme: Metatietosanasto
preferred label: postcard @en
preferred label: postkort @sv

JPEG2000
type: Concept
source: Kansallinen RDA-termi
source: Nationell RDA-term @sv
created: 2016-01-08
modified: 2024-05-24
in scheme: Metatietosanasto

kaavio
type: Concept
source: RDA-termi
source: RDA-term @sv
created: 2016-01-08
modified: 2023-05-17
definition: Kuvasisältö, joka kuvaa graafisessa muodossa tietoaineiston määrällisiä tai laadullisia tekijöitä.
definition: Illustrativt innehåll som i grafisk form beskriver kvantitativa eller kvalitativa faktorer i ett informationsmaterial. @sv
in scheme: Metatietosanasto
preferred label: schematisk bild @sv
scope note: Monikossa: kaavioita, xx kaaviota
scope note: I plural: schematiska bilder, xx schematiska bilder @sv

Manifestaatio
type: ConceptGroup
type: Collection
source: RDA-termi
source: RDA-term @sv
created: 2016-01-08
modified: 2025-10-03
definition: Teoksen ekspression saama ilmiasu.
definition: Den fysiska gestaltningen av ett uttryck för ett verk. @sv
member: Ääninauhan raitojen määrä
member: Äänen tallennusmedian tyyppi
member: Kirjasinkoko
member: Ääniraidan asemointi
member: Kartografinen datatyyppi
member: Värisisältö
member: Esitysformaatti
member: Tallennetyyppi
member: Manifestaation nimeke
member: Videoformaatti
member: Äänisisältö
member: Huomautus manifestaatiosta
member: Sukupolvi
member: Äänentoiston erityisominaisuudet
member: Äänen toistonopeus
member: Valmistusmenetelmä
member: Mikrofilmin ja mikrokortin emulsio
member: Julkaisutapa
member: Kuvasisältö
member: Aluekoodi
member: Sidostyyppi
member: Toistokanavien määrä
member: Lisätty sisältö
member: Alkuperäinen taltiointi- ja tallennustekniikka
member: Bibliografinen koko
member: Manifestaation kategoria
member: Kansityyppi
member: Tiedostotyyppi
member: Polariteetti
member: Pienennyssuhteen määrite
member: Layout
member: Ikärajat
member: Urajako
member: Uran leveys
member: Äänen tallennustapa
member: Materiaali
member: Lähetysstandardi
member: Mediatyyppi
member: Extent
member: Koodausmuoto
member: Pohjamateriaali
preferred label: Manifestation @en

skeemaigumeeni
type: Concept
source: Kansallinen RDA-termi
source: Nationell RDA-term @sv
created: 2016-01-08
modified: 2024-05-24
definition: Suureen skeemaan vihitty igumeeni.
definition: Igumen som vigts till det stora schemat. @sv
in scheme: Metatietosanasto
preferred label: schemaigumen @sv

ohjelmatiedosto
type: Concept
source: RDA-termi
source: RDA-term @sv
created: 2016-01-08
modified: 2023-05-17
definition: Tiedostotyyppi sähköisesti taltioitujen ohjelmien tallentamiseksi, jotka koostuvat tietokoneohjelman suoritettaviksi tarkoitetuista järjestetyistä komentolistoista.
definition: Filtyp för lagring av elektroniska program, som består av kommandolistor som ordnats för utförande med datorrogram. @sv
in scheme: Metatietosanasto
preferred label: program file @en
preferred label: programfil @sv

pro gradu -tutkielma
type: Concept
source: Kansallinen RDA-termi
source: Nationell RDA-term @sv
created: 2016-01-08
modified: 2024-05-24
alternative label: D-uppsats @sv
alternative label: gradu @sv
alternative label: magisteruppsats @sv
alternative label: pro gradu @sv
alternative label: trebetygsuppsats @sv
definition: Ylempään korkeakoulututkintoon yliopistossa vaadittava tutkielma. (Kielitoimiston sanakirja)
definition: Avhandling som krävs för att avklara högre högskoleexamen vid ett universitet. @sv
in scheme: Metatietosanasto
preferred label: pro gradu-avhandling @sv

Tieto-Lauri-palkinto
type: Concept
source: Kansallinen RDA-termi
source: Nationell RDA-term @sv
created: 2016-01-08
modified: 2023-05-17
definition: Myöntää Lauri Jäntin säätiö, ja se jaetaan joka kolmas vuosi ansiokkaalle lasten tai nuorten tietokirjalle.
definition: Utdelas vart tredje år av Lauri Jäntin säätiö för en meriterad fackbok för barn eller ungdomar. @sv
example: MARC 21 -formaatissa: 586 ## ‡a Tieto-Lauri-palkinto, 2016
example: I MARC 21-formatet: 586 ## ‡a Tieto-Lauri-priset, 2016 @sv
in scheme: Metatietosanasto
preferred label: Tieto-Lauri-priset @sv

mykkäfilmin standardikuvakoko
type: Concept
source: RDA-termi
source: RDA-term @sv
created: 2016-01-08
modified: 2024-05-09
definition: Elokuvafilmin esitysformaatti, joka käyttää mykkäfilmin projektoriaukon standardikokoa.
definition: Visningsformat för film, med stumfilmens standardstorlek för projektoröppning. @sv
in scheme: Metatietosanasto
preferred label: standard silent aperture @en
preferred label: standardbildstorlek för stumfilm @sv

kandidaatintutkielma
type: Concept
source: Kansallinen RDA-termi
source: Nationell RDA-term @sv
created: 2016-01-08
modified: 2024-05-24
alternative label: kandidaatintyö
alternative label: C-uppsats @sv
alternative label: kandidatarbete @sv
alternative label: kandidatuppsats @sv
in scheme: Metatietosanasto
preferred label: kandidatavhandling @sv

kardinaali
type: Concept
source: Kansallinen RDA-termi
source: Nationell RDA-term @sv
created: 2016-01-08
modified: 2024-05-24
definition: Paavin jälkeen korkeimpia katolilaisia virkamiehiä.
definition: Efter påven i rang högsta tjänstemän i katolska kyrkan. @sv
in scheme: Metatietosanasto
preferred label: kardinal @sv

polyesteri
type: Concept
source: RDA-termi
source: RDA-term @sv
created: 2016-01-08
modified: 2024-03-13
definition: Materiaali, joka kuuluu polymeerien kategoriaan, jossa estereiden funktionaalinen ryhmä sisältyy pääketjuun.
definition: Material tillhörande polymerernas kategori, i vilket estrarnas funktionella grupp ingår i huvudkedjan. @sv
in scheme: Metatietosanasto
preferred label: polyester @en

veliini
type: Concept
source: RDA-termi
source: RDA-term @sv
created: 2016-01-08
modified: 2024-03-13
alternative label: velin @sv
definition: Hienolaatuista vasikan- tai lampaannahkaa oleva pergamentti.
definition: Kvalitativt pergament av kalv- eller lammskinn. @sv
in scheme: Metatietosanasto
preferred label: vellum @en
preferred label: veläng @sv

vuota
type: Concept
source: RDA-termi
source: RDA-term @sv
created: 2016-01-08
modified: 2024-03-13
definition: Materiaali, joka muodostuu eläimen, esimerkiksi lampaan, vuohen tai vasikan nyljetystä nahasta, jota on käsitelty eri tavoin karvojen poistamiseksi, kuivaamiseksi, värjäämiseksi tai muuten koristelemiseksi.
definition: Material som utgörs av skinn från t.ex. får, get eller kalv och som behandlats på olika sätt för att ta bort hår, torkas, färgas eller på annat sätt dekoreras. @sv
in scheme: Metatietosanasto
preferred label: skin @en
preferred label: hud @sv

Runeberg-palkinto
type: Concept
source: Kansallinen RDA-termi
source: Nationell RDA-term @sv
created: 2016-01-08
modified: 2023-05-17
definition: Jaettu vuodesta 1987 lähtien. Sen jakavat yhdessä sanomalehti Uusimaa, Porvoon kaupunki, Suomen kirjailijaliitto, Suomen arvostelijain liitto ja Finlands Svenska Författarföreningen.
definition: Har utdelats sedan 1987. Priset utdelas av tidningen Uusimaa, Borgå stad, Suomen kirjailijaliitto, Finlands kritikerförbund och Finlands svenska författareförening. @sv
example: MARC 21 -formaatissa: 586 ## ‡a Runeberg-palkinto, 1987
example: I MARC 21-formatet: 586 ## ‡a Runebergspriset, 1987 @sv
in scheme: Metatietosanasto
preferred label: Runebergspriset @sv

HD-DVD
type: Concept
source: Kansallinen RDA-termi
source: Nationell RDA-term @sv
created: 2016-01-08
modified: 2024-05-24
in scheme: Metatietosanasto

C-kasetti
type: Concept
source: Kansallinen RDA-termi
source: Nationell RDA-term @sv
created: 2016-01-08
modified: 2025-10-31
in scheme: Metatietosanasto
preferred label: Kassettband @sv

Quadruplex
type: Concept
source: RDA-termi
source: RDA-term @sv
created: 2016-01-08
modified: 2023-05-17
definition: Analogisen nauhan videoformaatti, jonka Ampex kehitti ammattilaiskäyttöön vuonna 1956.
definition: Videoformat för analogt band, som Ampex utvecklade för professionellt bruk år 1956. @sv
in scheme: Metatietosanasto

liimasidonta
type: Concept
source: RDA-termi
source: RDA-term @sv
created: 2016-01-08
modified: 2025-10-21
alternative label: paperback @en
alternative label: nidottu
alternative label: häftad @sv
definition: Sidonnan tyyppi, joka liimaa arkit yhteen toistensa ja päällysten kanssa muodostaen selkämyksen.
definition: Typ av bindning som limmar ihop arken med varandra och omslaget och således bildar en rygg. @sv
in scheme: Metatietosanasto
preferred label: perfect binding @en
preferred label: limbindning @sv

tietolevykotelo
type: Concept
source: RDA-termi
source: RDA-term @sv
created: 2016-01-08
modified: 2023-05-17
definition: Kotelo, joka sisältää yhden tai useita tietolevyjä.
definition: Magasin som innehåller en eller flera datorskivor. @sv
in scheme: Metatietosanasto
preferred label: computer disc cartridge @en
preferred label: datorskivmagasin @sv
scope note: Tietokonetallenne.
scope note: Datorbärare. @sv

sarjan nimeke
type: Concept
source: RDA-termi
source: RDA-term @sv
created: 2016-01-08
modified: 2025-10-21
alternative label: seriens titel @sv
alternative label: titel för serie @sv
definition: Nimeke, joka ilmaisee, mihin sarjaan manifestaatio kuuluu.
definition: Titel som uttrycker till vilken serie en manifestation hör. @sv
in scheme: Metatietosanasto
preferred label: title of series @en
preferred label: serietitel @sv

karttaliite
type: Concept
source: Kansallinen RDA-termi
source: Nationell RDA-term @sv
created: 2016-01-08
modified: 2025-10-04
in scheme: Metatietosanasto
preferred label: kartbilaga @sv
scope note: kartta-aineiston laajuuden yksikkö
scope note: enhet för kartmaterial @sv

abbedissa
type: Concept
source: Kansallinen RDA-termi
source: Nationell RDA-term @sv
created: 2016-01-08
modified: 2024-05-24
definition: Katolilaisen nunnaluostarin johtajatar.
definition: Ledare för katolskt nunnekloster. @sv
in scheme: Metatietosanasto

Ääniraidan asemointi
type: ConceptGroup
type: Collection
source: RDA-termi
source: RDA-term @sv
created: 2016-01-08
modified: 2024-10-01
alternative label: Spårkonfiguration (ljudfilm) @sv
definition: Liittää manifestaation ääniraidan sijaintiin äänifilmissä.
definition: Sammankopplar manifestation med placering av ljudspår i ljudfilm. @sv
member: edge track
member: centre track
preferred label: Track configuration @en
preferred label: Ljudspårskonfiguration för film @sv

väriliitu
type: Concept
source: Kansallinen RDA-termi
source: Nationell RDA-term @sv
created: 2016-01-08
modified: 2024-03-15
in scheme: Metatietosanasto
preferred label: färgkrita @sv

valokuva
type: Concept
source: RDA-termi
source: RDA-term @sv
created: 2016-01-08
modified: 2023-05-17
definition: Kuvasisältö, joka muodostuu valoherkälle pinnalle, tavallisesti valokuvafilmille tai elektroniseen tallennusvälineeseen, osuvan valon muodostamasta kuvasta.
definition: Illustrativt innehåll som utgörs av en bild som uppstår från ljus som träffar på ljuskänsligt material, vanligen fotografisk film eller i något elektroniskt lagringsmedium. @sv
in scheme: Metatietosanasto
preferred label: photograph @en
preferred label: fotografi @sv
scope note: Monikossa: valokuvia, xx valokuvaa
scope note: I plural: fotografier, xx fotografier @sv

iBooks
type: Concept
source: Kansallinen RDA-termi
source: Nationell RDA-term @sv
created: 2016-01-08
modified: 2024-05-24
in scheme: Metatietosanasto

kaksiulotteinen liikkuva kuva
type: Concept
source: RDA-termi
source: RDA-term @sv
created: 2016-01-08
modified: 2023-05-05
definition: Kaksiulotteisena liikkuvana kuvana esitetty sisältö. Esimerkiksi kaksiulotteiset elokuvat (näytellyt tai piirretyt), esitysten ja tapahtumien jne. filmi- ja videotallenteet. Liikkuvaan kuvaan voi liittyä ääntä. Katso myös kartografinen liikkuva kuva.
definition: Innehåll uttryckt som tvådimensionell rörlig bild. T.ex. tvådimensionella filmer (spelfilmer eller tecknade filmer) och filminspelningar av framträdanden, händelser o.s.v. Även ljud kan anslutas till den rörliga bilden. Se även kartografisk rörlig bild. @sv
in scheme: Metatietosanasto
preferred label: two-dimensional moving image @en
preferred label: tvådimensionell rörlig bild @sv

kangas
type: Concept
source: RDA-termi
source: RDA-term @sv
created: 2016-01-08
modified: 2024-03-13
definition: Materiaali, joka on tiheästi kudottua tekstiiliä, usein pellavaa, hamppua, juuttia tai puuvillaa ja jota käytetään öljyvärimaalausten pohjana.
definition: Material som är tätt vävd textil, ofta linne, hampa, jute eller bomull, och som används som botten till oljefärgsmålningar. @sv
in scheme: Metatietosanasto
preferred label: canvas @en
preferred label: tyg @sv

Cinerama
type: Concept
source: RDA-termi
source: RDA-term @sv
created: 2016-01-08
modified: 2023-05-17
definition: Elokuvafilmin esitysformaatti, jonka kuvasuhde on enintään 2.76:1 ja joka käyttää alun perin kolmea synkronoitua projektoria.
definition: Visningsformat för film, vars bildförhållande är högst 2.76:1 och som ursprungligen använder tre synkroniserade projektorer. @sv
in scheme: Metatietosanasto

pyhä
type: Concept
source: Kansallinen RDA-termi
source: Nationell RDA-term @sv
created: 2016-01-08
modified: 2024-07-05
alternative label: autuas
alternative label: pyhittäjä
alternative label: heliga @sv
alternative label: helige @sv
alternative label: salig @sv
alternative label: salige @sv
definition: Pyhimysten nimitys.
in scheme: Metatietosanasto
preferred label: helgon @sv

tahdit peräkkäin
type: Concept
source: RDA-termi
source: RDA-term @sv
created: 2016-01-08
modified: 2023-05-17
alternative label: takter efter varandra @sv
definition: Layout, joka koostuu sisennetyissä kappaleissa esitetystä nuottikirjoituksesta, ja jossa jokaisen tahdin stemmat on merkitty peräkkäin.
definition: Layout, som består av notskrift förevisad i indragna stycken, och i vilken varje takts stämmor har angetts i följd efter varandra. @sv
in scheme: Metatietosanasto
preferred label: bar by bar @en
preferred label: takt för takt @sv

surround
type: Concept
source: RDA-termi
source: RDA-term @sv
created: 2016-01-08
modified: 2023-05-17
definition: Useammasta kuin neljästä kanavasta koostuva surround-äänen äänikanava.
definition: Ljudkanal som består av flera än fyra kanaler, för surround-ljud. @sv
in scheme: Metatietosanasto

kivi
type: Concept
source: RDA-termi
source: RDA-term @sv
created: 2016-01-08
modified: 2024-03-13
definition: Materiaali, joka muodostuu kiviaineksesta sen luonnollisessa muodossa tai leikattuna, muotoiltuna, murskattuna tai muulla tavalla muokattuna.
definition: Material som består av sten i dess naturliga form eller i skuren, formad, krossad eller på annat sätt bearbetad form. @sv
in scheme: Metatietosanasto
preferred label: stone @en
preferred label: sten @sv

Vuoden johtolanka
type: Concept
source: Kansallinen RDA-termi
source: Nationell RDA-term @sv
created: 2016-01-08
modified: 2023-05-17
alternative label: Vuoden johtolanka -palkinto
alternative label: Årets ledtråd-priset @sv
definition: Suomen dekkariseuran myöntämä palkinto edellisen vuoden merkittävästä dekkariteoksesta tai dekkariteosta.
definition: Pris beviljat av Finska deckarsällskapet för ett betydande litterärt verk inom deckargenren. @sv
example: MARC 21 -formaatissa: 586 ## ‡a Vuoden johtolanka, 2020
example: I MARC 21-formatet: 586 ## ‡a Årets ledtråd, 2020 @sv
in scheme: Metatietosanasto
preferred label: Årets ledtråd @sv

nunna
type: Concept
source: Kansallinen RDA-termi
source: Nationell RDA-term @sv
created: 2016-01-08
modified: 2024-05-24
definition: Nunnakunnan jäsenen nimitys.
definition: Benämning på medlem i nunneorden. @sv
in scheme: Metatietosanasto

3D
type: Concept
source: RDA-termi
source: RDA-term @sv
created: 2016-01-08
modified: 2023-05-17
alternative label: 3D-esitysformaatti
alternative label: 3D-visningsformat @sv
definition: Elokuvafilmin esitysformaatti, joka luo kolmiulotteisuuden vaikutelman.
definition: Visningsformat för film, som skapar ett tredimensionellt intryck. @sv
in scheme: Metatietosanasto

päivitetään jatkuvasti
type: Concept
source: Kansallinen RDA-termi
source: Nationell RDA-term @sv
created: 2016-01-08
modified: 2025-10-04
alternative label: kontinuerlig uppdatering @sv
in scheme: Metatietosanasto
preferred label: uppdateras kontinuerligt @sv

puu
type: Concept
source: RDA-termi
source: RDA-term @sv
created: 2016-01-08
modified: 2024-03-13
definition: Materiaali, joka muodostuu puiden ja niiden kaltaisten kasvien pääkudoksesta.
definition: Material som bildas av huvudvävnaden i träd och andra liknande växter. @sv
in scheme: Metatietosanasto
preferred label: wood @en
preferred label: trä @sv

piirustus
type: Concept
source: RDA-termi
source: RDA-term @sv
created: 2016-01-08
modified: 2023-05-17
definition: Laajuuden yksikkö, piirtämällä tehty liikkumaton kuva pohjamateriaalille, usein paperille, käyttäen kynää, hiiltä, liitua tai puuta piirustusvälinettä ja korostaen muotoa ennemmin kuin värejä.
definition: Enhet, stillbild tecknad på bottenmaterial, oftast papper, med hjälp av penna, kol, krita eller annat teckningsredskap. I teckningar framhävs form mer än färg. @sv
in scheme: Metatietosanasto
preferred label: drawing @en
preferred label: teckning @sv

manifestaation varianttinimeke
type: Concept
source: RDA-termi
source: RDA-term @sv
created: 2016-01-08
modified: 2025-10-21
definition: Manifestaation nimeke, jota ei ole valittu ensisijaiseksi tietyssä sovelluksessa tai kontekstissa.
definition: Titel för manifestation, som inte har valts till primär i en viss tillämpning eller kontext. @sv
in scheme: Metatietosanasto
preferred label: variant title of manifestation @en
preferred label: varianttitel @sv

ommeltu liimasidonta
type: Concept
source: RDA-termi
source: RDA-term @sv
created: 2016-01-08
modified: 2025-10-21
alternative label: hardback @en
alternative label: sidottu
alternative label: inbunden @sv
alternative label: sydd limbindning @sv
definition: Sidonnan tyyppi, jossa arkit ommellaan tai liimataan ryhmiksi, jotka liimataan yhteen litteäksi selkämykseksi. Arkkien ryhmät kiinnitetään kansipapereihin, jotka puolestaan kiinnitetään jäykkään päällykseen.
definition: Typ av bindning, i vilken arken sys eller limmas till grupper, som limmas samman till en platt rygg. Grupperna av ark fästs vid omslagspapper, som i sin tur fästs vid ett styvt omslag. @sv
in scheme: Metatietosanasto
preferred label: case binding @en
preferred label: tråd- och limbindning @sv

positiivi
type: Concept
source: RDA-termi
source: RDA-term @sv
created: 2016-01-08
modified: 2023-05-17
definition: Polariteetti, jossa kuvan värit ja valoisuus ovat ihmissilmän normaalisti näkemässä muodossa.
definition: Polaritet, i vilken en bilds färg och ljus är i den form människoögat normalt ser den. @sv
in scheme: Metatietosanasto
preferred label: positive @en
preferred label: positiv @sv

negatiivi
type: Concept
source: RDA-termi
source: RDA-term @sv
created: 2016-01-08
modified: 2023-05-17
definition: Polariteetti, jossa kuvan värit ja valoisuus ovat ihmissilmin nähtävien värien ja valoisuuden vastakohtia.
definition: Polaritet, i vilken bildens färg och ljus är de motsatta till dem som ses med människoögat. @sv
in scheme: Metatietosanasto
preferred label: negative @en
preferred label: negativ @sv

näyttelyesine
type: Concept
source: RDA-termi
source: RDA-term @sv
created: 2016-01-08
modified: 2023-05-17
definition: Laajuuden yksikkö, esine joka on esillä näyttelynomaisessa ympäristössä mukaan lukien kotelo, etiketti tms.
definition: Enhet, föremål som finns i utställningsliknande miljö, inklusive föremål som fodral, etikett m.m. @sv
in scheme: Metatietosanasto
preferred label: exhibit @en
preferred label: utställningsföremål @sv

nimiösivu puuttuu
type: Concept
source: Kansallinen RDA-termi
source: Nationell RDA-term @sv
created: 2016-01-08
modified: 2024-05-24
example: MARC 21 562 ## ‡a Kpl 3: Nimiösivu puuttuu.
example: MARC 21 562 ## ‡a Ex. 3: Titelsida saknas. @sv
in scheme: Metatietosanasto
preferred label: titelsida saknas @sv

koepainos
type: Concept
source: RDA-termi
source: RDA-term @sv
created: 2016-01-08
modified: 2023-05-17
alternative label: provupplaga @sv
definition: Sukupolven määrite äänitteen painoserälle, joka tehdään virheiden tarkistamiseksi ennen täyden painoksen valmistamista.
definition: Bestämning av generation för en ljudupptagnings upplaga som görs för att kontrollera fel innan en full upplaga tillverkas. @sv
in scheme: Metatietosanasto
preferred label: test pressing @en
preferred label: provtryck @sv

pastelli
type: Concept
source: RDA-termi
source: RDA-term @sv
created: 2016-01-08
modified: 2023-05-17
definition: Materiaali, joka kostuu sideaineeseen sekoitetusta väriaineesta, yleensä puikkomaisessa muodossa.
definition: Material som består av färgämne blandat i bindemedel, vanligen i stickform. @sv
in scheme: Metatietosanasto
preferred label: pastel @en
preferred label: pastell @sv

C-tyyppi
type: Concept
source: RDA-termi
source: RDA-term @sv
created: 2016-01-08
modified: 2023-05-17
definition: Analogisen nauhan videoformaatti, jonka Ampex ja Sony kehittivät ammattilaiskäyttöön vuonna 1976.
definition: Videoformat för analogt band, som Ampex och Sony utvecklade för professionellt bruk år 1976. @sv
in scheme: Metatietosanasto
preferred label: Type C @en

standardi
type: Concept
source: RDA-termi
source: RDA-term @sv
created: 2016-01-08
modified: 2025-09-10
definition: Uran ominaisuus analogiselle äänilieriölle, jonka urajako on 40 kierrosta/cm (100 kierrosta/tuuma).
definition: Spåregenskap för analog ljudcylinder, vars spårfördelning är 40 varv/cm (100 varv/tum). @sv
in scheme: Metatietosanasto
preferred label: standard @en

keisarinna
type: Concept
source: Kansallinen RDA-termi
source: Nationell RDA-term @sv
created: 2016-01-08
modified: 2024-05-24
definition: Keisarin puoliso; keisarikuntaa hallitseva naispuolinen monarkki.
definition: Kejsarens gemål; kvinnlig monark som regerar över kejsardöme. @sv
in scheme: Metatietosanasto
preferred label: kejsarinna @sv

VCD
type: Concept
source: Kansallinen RDA-termi
source: Nationell RDA-term @sv
created: 2016-01-08
modified: 2024-05-24
in scheme: Metatietosanasto

Teoksen suhteet teokseen
type: ConceptGroup
type: Collection
created: 2016-01-08
modified: 2025-12-19
member: sarjakuvaversio
member: televisiosovitus teoksesta
member: elokuvaversio teoksesta
member: itsenäinen jatko-osa teokselle
member: musiikki elokuvaan
member: mukaelma teoksesta
member: laajennus teokseen
member: selkokielisen version perustana (teos)
member: uusintaproduktio teoksesta
member: sarjakuvaversio teoksesta
member: lastenversion perustana (teos)
member: korvaa teoksen
member: eronnut teoksesta
member: jakautunut teoksesta
member: korvaa osittain teoksen
member: esiosa
member: runomukaelma teoksesta
member: osittain sulautunut teos
member: jatko-osa
member: innoitus teokselle
member: teokseen yhdistyjä
member: jakautunut teokseen
member: sulautunut teos
member: yhdistynyt teokseksi
member: myöhempi teos
member: edeltävä teos
member: sulautunut osittain teokseen
member: jäljitelmä
member: abstrakti
member: eronnut teokseksi
member: osittain korvattu teoksella
member: musikaaliversio
member: sulautunut teokseen
member: laajennelma
member: korvaava teos
member: abstraktit (teos)
member: parodia
member: lyhennelmä
member: seuraaja
member: dramatisointi
member: oopperasovitus
member: oratoriosovitus
member: yhteenveto
member: parafraasi
member: uusintaproduktio
member: runomukaelma
member: tekstiin perustuva musiikki
member: videopelisovitus
member: mukautettu lyhennelmä
member: radiosovitus
member: vapaamuotoinen käännös
member: romaanimukaelma
member: televisiosovitus
member: sovitettu käsikirjoitukseksi
member: muuntelun tuloksena muodostunut teos
member: sovitettu televisiokäsikirjoitukseksi
member: sovitettu libretoksi
member: sovitettu radiokäsikirjoitukseksi
member: sovitettu videokäsikirjoitukseksi
member: lastenversio (teos)
member: videosovitus
member: sovitettu elokuvakäsikirjoitukseksi
member: selkokielinen versio (teos)
member: abstraktit teoksesta
member: abstrakti teoksesta
member: dramatisointi teoksesta
member: elokuvakäsikirjoituksen perustana oleva teos
member: radiokäsikirjoituksen perustana oleva teos
member: videokäsikirjoituksen perustana oleva teos
member: lyhennelmä teoksesta
member: laajennettu versio teoksesta
member: televisiokäsikirjoituksen perustana oleva teos
member: radiosovitus teoksesta
member: koreografinen sovitus teoksesta
member: innoittaja
member: libreton perustana oleva teos

Kartografinen datatyyppi
type: ConceptGroup
type: Collection
source: RDA-termi
source: RDA-term @sv
created: 2016-01-08
modified: 2023-12-08
alternative label: Kartografiskt dataset @sv
definition: Liittää manifestaation tietokoneen käsiteltäväksi tarkoitettuun digitaaliseen kartografiseen sisältöön. Katso myös kartografinen kuva, kartografinen liikkuva kuva, kartografinen taktiili kuva, kartografinen taktiili kolmiulotteinen muoto tai kartografinen kolmiulotteinen muoto.
definition: Sammankopplar manifestation med digitalt kartografiskt innehåll som är avsett att behandlas med dator. Se även kartografisk bild, kartografisk rörlig bild, kartografisk taktil bild, kartografisk taktil tredimensionell form och kartografisk tredimensionell form. @sv
member: rasteri
member: vektori
member: piste
preferred label: Cartographic data type @en
preferred label: Kartografisk datatyp @sv

valokuva
type: Concept
source: RDA-termi
source: RDA-term @sv
created: 2016-01-08
modified: 2023-05-17
definition: Laajuuden yksikkö, linssillä otettu kuva joka on siirretty arkin pinnalle.
definition: Enhet, bild som tagits genom kameralins och framställts på ark. @sv
in scheme: Metatietosanasto
preferred label: photograph @en
preferred label: fotografi @sv

vertikaalinen partituuri
type: Concept
source: RDA-termi
source: RDA-term @sv
created: 2016-01-08
modified: 2023-05-17
definition: Layout, joka koostuu nuottistemmoista, jotka on yhdistetty ja merkitty sointuina.
definition: Layout som består av notstämmor som har kombinerats och märkts ut som ackord. @sv
in scheme: Metatietosanasto
preferred label: vertical score @en
preferred label: vertikalt partitur @sv

audio
type: Concept
source: RDA-termi
source: RDA-term @sv
created: 2016-01-08
modified: 2023-05-05
definition: Viestin sisältää tallennettua ääntä, ja se on suunniteltu käytettäväksi soittolaitteella kuten levysoittimella, kasettisoittimella, CD-soittimella, MP3-soittimella. Käsittää sekä digitaalisesti koodattua että analogisesti tallennettua ääntä sisältävät viestimet.
definition: Mediet innehåller lagrat ljud och används med hjälp av en uppspelsningsapparat såsom skivspelare, kasettbandspelare, CD-spelare, MP3-spelare. Omfattar medier som innehåller både digitalt kodat och analogt lagrat ljud. @sv
in scheme: Metatietosanasto

avoin partituuri
type: Concept
source: RDA-termi
source: RDA-term @sv
created: 2016-01-08
modified: 2023-05-17
definition: Layout, joka koostuu rinnakkain esitetystä nuottikirjoituksesta. Open score muistuttaa tahdit allekkain -layoutia, mutta sitä käytetään yhtyenuoteissa. Tämä termi koskee taktiileja musiikkiaineistoja.
definition: Layout som består av notskrift presenterad parallellt. Termen gäller taktila musikmaterial. @sv
in scheme: Metatietosanasto
preferred label: open score @en

galleria
type: Concept
source: Kansallinen RDA-termi
source: Nationell RDA-term @sv
created: 2016-01-08
modified: 2024-05-24
example: Halvat huvit (galleria)
example: GRO (galleri) @sv
in scheme: Metatietosanasto
preferred label: galleri @sv

U-matic
type: Concept
source: RDA-termi
source: RDA-term @sv
created: 2016-01-08
modified: 2023-05-17
definition: Analogisen nauhan videoformaatti, jonka Sony kehitti ammattilaiskäyttöön vuonna 1969.
definition: Videoformat för analogt band, som Sony utvecklade för professionellt bruk år 1969. @sv
in scheme: Metatietosanasto

Ekspression suhteet toimijaan
type: ConceptGroup
type: Collection
created: 2016-01-08
modified: 2026-03-03
member: näyttämöohjaaja
member: esittäjä
member: transkriboija
member: panelisti
member: tanssija
member: animaattori
member: valosuunnittelija
member: puhuja
member: sovittaja
member: leikkaaja
member: näyttelijä
member: pöytäkirjan laatija
member: äänisuunnittelija
member: miksaaja
member: juontaja
member: nukettaja
member: ääniteknikko
member: tuomioistuimen kirjuri
member: johtaja
member: tekstaaja
member: piirtäjä
member: esittämisestä vastaava toimija
member: värittäjä
member: ääninäyttelijä
member: visuaalisten tehosteiden tekijä
member: maskeeraaja
member: entisöijä (ekspressio)
member: haastateltava (ekspressio)
member: kääntäjä
member: äänittäjä
member: lavastaja
member: DJ
member: kertoja
member: sensori
member: esittelijä
member: erikoistehosteiden tekijä
member: musiikkiohjelmoija
member: kapellimestari
member: tuotantosuunnittelija
member: ohjelmistokehittäjä
member: liikkuvaan kuvaan osallistuja
member: moderoija
member: kuoronjohtaja
member: dubbausohjaaja
member: opettaja
member: taltioija
member: lyhentäjä
member: laulaja
member: versioon liittyvä toimija
member: esitykseen osallinen toimija
member: toimittaja
member: yhdistymään osallinen toimija
member: tarkistaja
member: version tekijä
member: tarinankertoja
member: kommentaattori
member: puvustaja
member: soittaja
member: musiikillinen johtaja
member: haastattelija (ekspressio)
preferred label: Uttrycks relationer till aktörer @sv

1,4 m/s
type: Concept
source: Kansallinen RDA-termi
source: Nationell RDA-term @sv
created: 2016-01-08
modified: 2024-05-24
in scheme: Metatietosanasto

muotokuva
type: Concept
source: RDA-termi
source: RDA-term @sv
created: 2016-01-08
modified: 2023-05-17
alternative label: porträtt (visuella alster) @sv
definition: Kuvasisältö, joka esittää yhtä tai useampia henkilöitä tai eläimiä, tavoitteena tunnettu tai oletettu näköisyys, erityisesti henkilön kasvoissa.
definition: Illustrativt innehåll som föreställer en eller flera personer eller djur och eftersträvande känd eller förmodad likhet, särskilt i personens ansikte. @sv
in scheme: Metatietosanasto
preferred label: portrait @en
preferred label: porträtt @sv
scope note: Monikossa: muotokuvia, xx muotokuvaa
scope note: I plural: porträtt, xx porträtt @sv

Anni Swan -mitali
type: Concept
source: Kansallinen RDA-termi
source: Nationell RDA-term @sv
created: 2016-01-08
modified: 2023-05-17
definition: Lasten- ja nuortenkirjallisuuspalkinto. Palkinnon myöntää joka 3. vuosi IBBY Finland (ent. Suomen nuortenkirjaneuvosto). Palkinto jaettiin ensimmäisen kerran 1961. Palkittavan teoksen täytyy olla Suomessa julkaistu, korkeatasoinen, suomen- tai ruotsinkielinen lasten- tai nuortenkirja.
definition: Litteraturpris för barn- och ungdomslitteratur. Priset delas ut vart tredje år av IBBY Finland (f.d. Finska ungdomsboksrådet). Priset utdelades första gången år 1961. Det verk som erhåller priset bör vara publicerat i Finland och vara en kvalitativt högtstående finsk- eller svenskspråkig barn- eller ungdomsbok. @sv
example: MARC 21 -formaatissa: 586 ## ‡a Anni Swan -mitali, 2019
example: I MARC 21-formatet: 586 ## ‡a Anni Swan-medaljen, 2019 @sv
in scheme: Metatietosanasto
preferred label: Anni Swan-medaljen @sv

pienoismalli
type: Concept
source: Kansallinen RDA-termi
source: Nationell RDA-term @sv
created: 2016-01-08
modified: 2025-10-04
in scheme: Metatietosanasto
preferred label: miniatyrmodell @sv

prinsessa
type: Concept
source: Kansallinen RDA-termi
source: Nationell RDA-term @sv
created: 2016-01-08
modified: 2024-05-24
definition: Hallitsijahuoneen naispuolinen ei-hallitseva jäsen.
definition: Icke-härskande kvinnlig medlem i furstehus. @sv
in scheme: Metatietosanasto

Helsingin Sanomien kirjallisuuspalkinto
type: Concept
source: Kansallinen RDA-termi
source: Nationell RDA-term @sv
created: 2016-01-08
modified: 2023-05-17
alternative label: Helsingin Sanomain kirjallisuuspalkinto
definition: Helsingin Sanomien vuodesta 1995 vuosittain jakama palkinto vuoden parhaalle suomenkieliselle esikoisteokselle.
definition: Ett pris som sedan 1995 delats ut årligen av Helsingin Sanomat, för årets bästa finskspråkiga debutverk. @sv
example: MARC 21 -formaatissa: 586 ## ‡a Helsingin Sanomien kirjallisuuspalkinto, 1995
example: I MARC 21-formatet: 586 ## ‡a Helsingin Sanomats litteraturpris, 1995 @sv
in scheme: Metatietosanasto
preferred label: Helsingin Sanomats litteraturpris @sv

ääniraitakela
type: Concept
source: RDA-termi
source: RDA-term @sv
created: 2016-01-08
modified: 2023-05-17
definition: Avokelalla oleva rullattu filmi, jolle ääni on tallennettu.
definition: Film på spole med inspelat ljud. @sv
in scheme: Metatietosanasto
preferred label: sound-track reel @en
preferred label: filmljudspole @sv
scope note: Äänitallenne.
scope note: Ljudbärare. @sv

Hi-8 mm
type: Concept
source: RDA-termi
source: RDA-term @sv
created: 2016-01-08
modified: 2023-05-17
definition: Analogisen nauhan videoformaatti joka on osa 8 mm -formaattia.
definition: Videoformat för analogt band, som är en del av 8 mm-formatet. @sv
in scheme: Metatietosanasto

museo
type: Concept
source: Kansallinen RDA-termi
source: Nationell RDA-term @sv
created: 2016-01-08
modified: 2024-05-24
example: Halosenniemi (museo)
example: Halosenniemi (museum) @sv
in scheme: Metatietosanasto
preferred label: museum @sv

CD-DA
type: Concept
source: Kansallinen RDA-termi
source: Nationell RDA-term @sv
created: 2016-01-08
modified: 2024-05-24
alternative label: Audio-CD
alternative label: CDDA
definition: Optinen digitaalisen datan tallennusmedia. CD-levyissä käytettävä äänen tallennusformaatti.
definition: Inspelningsmedium för optisk digital data. Inspelningsformat som används för ljud på CD-skivor. @sv
in scheme: Metatietosanasto
scope note: Äänen koodausmuoto.
scope note: Kodningsformat för ljud. @sv

hopeahalidi
type: Concept
source: RDA-termi
source: RDA-term @sv
created: 2016-01-08
modified: 2024-03-13
definition: Hopean ja halogeenin (kloori, bromi, jodi tai fluori) yhdisteen ja sideaineen (yleensä gelatiini) muodostama valoherkkä kerros. Materiaali, jota tavallisesti käytetään mikrofilmin tai mikrokortin pohjamateriaalina.
definition: Ljuskänsligt lager bildat av en förening av silver och halogen (klor, brom, jod, fluor) och ett bindemedel (vanligen gelatin). Material som vanligtvis används som bottenmaterial för mikrofilm eller mikrofiche. @sv
in scheme: Metatietosanasto
preferred label: silver halide emulsion @en
preferred label: silverhalid @sv

aikuisopiskelu
type: Concept
source: Kansallinen RDA-termi
source: Nationell RDA-term @sv
created: 2016-01-08
modified: 2024-05-24
in scheme: Metatietosanasto
preferred label: vuxenstudier @sv

Teoksen nimeke
type: ConceptGroup
type: Collection
source: RDA-termi
source: RDA-term @sv
created: 2016-01-08
modified: 2025-10-21
definition: Luonnollisella kielellä ja sanamuodolla oleva, yleisessä kielessä käytetty teoksen nimitys.
definition: Titel för verk, som är på naturligt språk och har en ordalydelse som används i allmänt språkbruk. @sv
member: Teoksen ensisijainen nimeke
member: Teoksen varianttinimeke
member: Avainnimeke
preferred label: Title of work @en
preferred label: Verkets titel @sv

Tanssiva karhu -runopalkinto
type: Concept
source: Kansallinen RDA-termi
source: Nationell RDA-term @sv
created: 2016-01-08
modified: 2023-05-17
alternative label: Tanssiva karhu
alternative label: Den dansande björnen @sv
definition: Yleisradio oy:n jakama palkinto korkeatasoiselle kotimaiselle runoteokselle. Jaettu vuodesta 1994 alkaen.
definition: Ett pris som utdelas av Rundradion Ab för ett kvalitativt högtstående inhemskt diktverk. Utdelat sedan år 1994. @sv
example: MARC 21 -formaatissa: 586 ## ‡a Tanssiva karhu -runopalkinto, 2020
example: I MARC 21-formatet: 586 ## ‡a Den dansande björnen-priset, 2020 @sv
in scheme: Metatietosanasto
preferred label: Den dansande björnen-priset @sv

valokopio
type: Concept
source: RDA-termi
source: RDA-term @sv
created: 2016-01-08
modified: 2023-05-17
definition: Valmistusmenetelmä, jossa tuotetaan makromuotoinen valojäljitelmä suoraan läpinäkymättömälle materiaalille säteilyenergialla, kosketuksen tai heijastamisen kautta.
definition: Produktionsmetod, i vilken en fotoreproduktion i makroform framställs med strålningsenergi via beröring eller reflektion direkt på ett ogenomskinligt material. @sv
in scheme: Metatietosanasto
preferred label: photocopying @en
preferred label: fotokopia @sv

SACD
type: Concept
source: Kansallinen RDA-termi
source: Nationell RDA-term @sv
created: 2016-01-08
modified: 2024-05-24
alternative label: Super Audio Compact Disc @en
in scheme: Metatietosanasto
scope note: Optinen äänilevyformaatti.
scope note: Optiskt ljudskivsformat @sv

15 tuumaa/s
type: Concept
source: Kansallinen RDA-termi
source: Nationell RDA-term @sv
created: 2016-01-08
modified: 2024-05-24
in scheme: Metatietosanasto
preferred label: 15 tum/s @sv

BMP
type: Concept
source: Kansallinen RDA-termi
source: Nationell RDA-term @sv
created: 2016-01-08
modified: 2024-05-24
in scheme: Metatietosanasto

2:o
type: Concept
source: RDA-termi
source: RDA-term @sv
created: 2016-01-08
modified: 2025-05-13
definition: Bibliografinen koko muodostuu yhdestä tai useammasta lehdestä, jotka ovat kooltaan 1/2 arkista.
definition: Bokens format består av ett eller flera blad som till sin storlek är 1/2 av ett tryckark. @sv
in scheme: Metatietosanasto
preferred label: folio @en

liikenotaatio
type: Concept
source: RDA-termi
source: RDA-term @sv
created: 2016-01-08
modified: 2023-05-05
definition: Liikettä kuvailevan merkkijärjestelmän avulla esitetty sisältö, joka on tarkoitettu katsottavaksi. Sisältää kaikki muut kuin kosketeltavassa muodossa olevat liikenotaatiot. Katso myös taktiili liikenotaatio.
definition: Innehåll som presenteras med teckensystem som beskriver rörelse och som är avsett att beskådas. Innehåller allt annat än rörelsenotationer som är i taktil form. Se även taktil noterad rörelse. @sv
in scheme: Metatietosanasto
preferred label: notated movement @en
preferred label: rörelsenotation @sv

kaukokartoituskuva
type: Concept
source: RDA-termi
source: RDA-term @sv
created: 2016-01-08
modified: 2023-05-17
definition: Laajuuden yksikkö, kartta-aineisto, joka perustuu kaukokartoitusmittalaitteen etäältä havaitsemaan ja mittaamaan heijastuneeseen ja/tai säteilleeseen elektromagneettiseen säteilyyn tai, kaikuluotaimen ollessa kyseessä, heijastuneisiin vedenalaisiin ääniaaltoihin.
definition: Enhet, kartografisk resurs som avser bildframställning av reflekterad och/eller utstrålad elektromagnetisk strålning, observerad och mätt på avstånd med hjälp av fjärranalysinstrument, och, i fråga om ekolod, ljudvågor som reflekteras under vatten. @sv
in scheme: Metatietosanasto
preferred label: remote-sensing image @en
preferred label: fjärranalysbild @sv

käsikirjoitus
type: Concept
source: Kansallinen RDA-termi
source: Nationell RDA-term @sv
created: 2016-01-08
modified: 2025-10-04
alternative label: käsikirjoitus (valmistusmenetelmä)
alternative label: handskrift @sv
alternative label: manus @sv
definition: Käytetään mistä tahansa käsikirjoitusaineistosta, jota vastuullisuustekijä ei ole itse kirjoittanut.
definition: Används om vilket som helst manuskriptmaterial som den ansvariga upphovsmannen inte själv har skrivit. @sv
in scheme: Metatietosanasto
preferred label: manuscript @en
preferred label: manuskript @sv

melody chord system
type: Concept
source: RDA-termi
source: RDA-term @sv
created: 2016-01-08
modified: 2023-05-17
definition: Layout, joka koostuu sointumerkeistä ja melodiasta kappaleisiin jaettuina, ja jossa sointumerkit on merkitty pistekirjoituksella.
definition: Layout som består av ackordsymboler och melodi indelad i stycken, och i vilken ackordsymbolerna anges med punktskrift. @sv
in scheme: Metatietosanasto

yksipuolinen
type: Concept
source: RDA-termi
source: RDA-term @sv
created: 2016-01-08
modified: 2023-05-17
definition: Layout vain arkin toisella puolella.
definition: Layout endast på ena sidan av ett ark. @sv
in scheme: Metatietosanasto
preferred label: single sides @en
preferred label: enkelsidig @sv

Aineiston käsittelyyn liittyvät termit ja fraasit
type: ConceptGroup
type: Collection
source: Kansallinen RDA-termi
created: 2016-01-08
modified: 2025-08-27
member: sidos korjattu
member: sidottavana
member: kuntokartoitettu
member: konservoitavana
member: näyttelylainassa
preferred label: Termer och fraser angående hantering av materialet @sv

Vuoden tiedekirja
type: Concept
source: Kansallinen RDA-termi
source: Nationell RDA-term @sv
created: 2016-01-08
modified: 2023-05-17
alternative label: Vuoden tiedekirja -palkinto
alternative label: Priset Årets vetenskapliga bok @sv
alternative label: Årets vetenskapliga bok @sv
definition: Tieteellisten seuran valtuuskunnan ja Suomen tiedekustantajien liiton myöntämä kirjallisuuspalkinto Suomessa julkaistulle tutkimuskirjallisuudelle. Palkinto myönnettiin ensimmäisen kerran 1989.
definition: Litteraturpris för forskningslitteratur som publicerats i Finland, beviljat av Vetenskapliga samfundets delegation och Förbundet för vetenskapspublicering i Finland rf. Priset utdelades första gången år 1989. @sv
example: MARC 21 -formaatissa: 586 ## ‡a Vuoden tiedekirja, 2020
example: I MARC 21-formatet: 586 ## ‡a Årets vetenskapsbok, 2020 @sv
in scheme: Metatietosanasto
preferred label: Årets vetenskapsbok @sv

teksti
type: Concept
source: RDA-termi
source: RDA-term @sv
created: 2016-01-08
modified: 2023-05-05
definition: Kielen merkkijärjestelmällä esitetty sisältö, joka on tarkoitettu katsottavaksi. Sisältää kaikki muut kielen merkkijärjestelmät, paitsi kosketeltavaksi tarkoitetun tekstin. Katso myös taktiili teksti.
definition: Med språkets teckensystem uttryckt innehåll, avsett att betraktas. Innehåller alla språks teckensystem förutom text som är avsedd att vidröras. Se även taktil text. @sv
in scheme: Metatietosanasto
preferred label: text @en

Topelius-palkinto
type: Concept
source: Kansallinen RDA-termi
source: Nationell RDA-term @sv
created: 2016-01-08
modified: 2023-05-17
definition: 1946 perustettu palkinto, jolla pyritään nostamaan esiin korkeatasoista suomen- tai ruotsinkielistä lasten- ja nuortenkirjallisuutta.
definition: Pris instiftat år 1946, med syfte att lyfta fram kvalitativt högtstående finsk- eller svenskspråkig barn- och ungdomslitteratur. @sv
example: MARC 21 -formaatissa: 586 ## ‡a Topelius-palkinto, 2020
example: I MARC 21-formatet: 586 ## ‡a Topeliuspriset (ungdomsböcker), 2020 @sv
in scheme: Metatietosanasto
preferred label: Topeliuspriset (ungdomsböcker) @sv

yksi-kaksi kertaa vuodessa
type: Concept
source: Kansallinen RDA-termi
source: Nationell RDA-term @sv
created: 2016-01-08
modified: 2025-10-04
in scheme: Metatietosanasto
preferred label: en-två gånger per år @sv

Teoksen ensisijainen nimeke
type: ConceptGroup
type: Collection
source: RDA-termi
source: RDA-term @sv
created: 2016-01-08
modified: 2025-10-21
alternative label: Verkets primära titel @sv
definition: Teoksen nimeke, joka on valittu ensisijaiseksi tietyssä sovelluksessa tai kontekstissa.
definition: Titel för verk, som har valts till primär i en viss tillämpning eller kontext. @sv
member: Vakiintunut kokoava nimeke
member: Sävellystyyppien nimet
preferred label: Preferred title for work @en
preferred label: Föredragen titel för verket @sv

Betacam
type: Concept
source: RDA-termi
source: RDA-term @sv
created: 2016-01-08
modified: 2023-05-17
definition: Analogisen nauhan videoformaatti, jonka Sony kehitti ammattilaiskäyttöön vuonna 1982.
definition: Videoformat för analogt band, som Sony utvecklade för professionellt bruk år 1982. @sv
in scheme: Metatietosanasto

Pohjoismaiden neuvoston kirjallisuuspalkinto
type: Concept
source: Kansallinen RDA-termi
source: Nationell RDA-term @sv
created: 2016-01-08
modified: 2023-05-17
definition: Myönnetään vuosittain kaunokirjalliselle teokselle ja sen myöntää Pohjoismaiden neuvosto. Vaatimuksena on, että teos on kirjoitettu jollakin pohjoismaisella kielellä.
definition: Utdelas årligen av Nordiska rådet till ett skönlitterärt verk. Verket bör vara skrivet på något av de nordiska språken. @sv
example: MARC 21 -formaatissa: 586 ## ‡a Pohjoismaiden neuvoston kirjallisuuspalkinto, 2019
example: I MARC 21-formatet: 586 ## ‡a Nordiska rådets litteraturpris, 2019 @sv
in scheme: Metatietosanasto
preferred label: Nordiska rådets litteraturpris @sv

levy
type: Concept
source: Kansallinen RDA-termi
source: Nationell RDA-term @sv
created: 2016-01-08
modified: 2025-10-04
in scheme: Metatietosanasto
preferred label: skiva @sv

osat peräkkäin
type: Concept
source: RDA-termi
source: RDA-term @sv
created: 2016-01-08
modified: 2023-05-17
definition: Layout, joka koostuu käsi- tai stemmamerkeistä, jotka on ryhmitelty vasemmassa marginaalissa.
definition: Layout som består av tecken för hand eller stämma, grupperade i den vänstra marginalen. @sv
in scheme: Metatietosanasto
preferred label: section by section @en
preferred label: sektion för sektion @sv

VHS
type: Concept
source: RDA-termi
source: RDA-term @sv
created: 2016-01-08
modified: 2023-05-17
definition: Analogisen nauhan videoformaatti, jonka JVC kehitti kuluttajakäyttöön 1970-luvulla.
definition: Videoformat för analogt band, som JVC utvecklade för konsumentbruk på 1970-talet. @sv
in scheme: Metatietosanasto

epäsäännöllinen
type: Concept
source: RDA-termi
source: RDA-term @sv
created: 2016-01-08
modified: 2023-05-17
definition: Ilmestymis- tai päivittymistiheys aineistolle, joka ilmestyy tai päivittyy epäsäännöllisesti.
definition: Utgivnings- eller uppdateringsfrekvens för material som utkommer eller uppdateras oregelbundet. @sv
in scheme: Metatietosanasto
preferred label: irregular @en
preferred label: oregelbunden @sv

mikrofilmiliuska
type: Concept
source: RDA-termi
source: RDA-term @sv
created: 2016-01-08
modified: 2023-05-17
definition: Mikrofilmirullasta leikattu lyhyt osa.
definition: Kort bit mikrofilm som klippts från rulle. @sv
in scheme: Metatietosanasto
preferred label: microfilm slip @en
preferred label: mikrofilmsremsa @sv
scope note: Mikromuotoinen tallenne.
scope note: Mikroformsbärare. @sv

vapaakappaleiden luovuttaja
type: Concept
source: Kansallinen RDA-termi
source: Nationell RDA-term @sv
created: 2016-01-08
modified: 2024-05-24
in scheme: Metatietosanasto
preferred label: överlåtare av friexemplar @sv

triasetaatti
type: Concept
source: RDA-termi
source: RDA-term @sv
created: 2016-01-08
modified: 2024-03-13
definition: Materiaali, joka on valmistettu selluloosasta ja asetaattiestereiden lähteestä, tyypillisesti etikkahappoanhydridistä.
definition: Material som tillverkats av cellulosa och en källa för acetatestrar, vanligen ättiksyraanhydrid. @sv
in scheme: Metatietosanasto
preferred label: triacetate @en
preferred label: triacetat @sv

paavi
type: Concept
source: Kansallinen RDA-termi
source: Nationell RDA-term @sv
created: 2016-01-08
modified: 2024-06-04
alternative label: paavi (arvonimi)
alternative label: påve (hederstitel) @sv
definition: Katolisen kirkon päämies.
definition: Överhuvud för katolska kyrkan. @sv
in scheme: Metatietosanasto
preferred label: påve @sv

kymmenen numeroa vuodessa
type: Concept
source: Kansallinen RDA-termi
source: Nationell RDA-term @sv
created: 2016-02-05
modified: 2025-10-04
in scheme: Metatietosanasto
preferred label: tio nummer per år @sv

viikoittain
type: Concept
source: RDA-termi
source: RDA-term @sv
created: 2016-02-05
modified: 2024-08-27
alternative label: kerran viikossa
alternative label: en gång i veckan @sv
definition: Ilmestymis- tai päivittymistiheys aineistolle, joka ilmestyy tai päivittyy kerran viikossa.
definition: Utgivnings- eller uppdateringsfrekvens för material som utkommer eller uppdateras en gång i veckan. @sv
in scheme: Metatietosanasto
preferred label: weekly @en
preferred label: en gång per vecka @sv

33 1/3 kierr./min
type: Concept
source: Kansallinen RDA-termi
source: Nationell RDA-term @sv
created: 2016-01-08
modified: 2024-05-24
in scheme: Metatietosanasto
preferred label: 33 1/3 varv/min @sv

oBook
type: Concept
source: Kansallinen RDA-termi
source: Nationell RDA-term @sv
created: 2016-03-01
modified: 2024-05-24
in scheme: Metatietosanasto

Värisisältö
type: ConceptGroup
type: Collection
source: RDA-termi
source: RDA-term @sv
created: 2016-04-15
modified: 2025-08-13
alternative label: Värillisyys
alternative label: Färg @sv
definition: Manifestaatioon sisältyvän värin tai sävyn ilmaus.
definition: Uttryck för färg eller nyans i en manifestation. @sv
member: mustavalkoinen
member: värillinen
member: yksivärinen
member: monivärinen
preferred label: Colour content @en
preferred label: Färginnehåll @sv

mikrofilmikasetti
type: Concept
source: RDA-termi
source: RDA-term @sv
created: 2016-01-08
modified: 2023-05-17
definition: Kasetti, joka sisältää mikrofilmin.
definition: Kassett som innehåller mikrofilm. @sv
in scheme: Metatietosanasto
preferred label: microfilm cassette @en
preferred label: mikrofilmskassett @sv
scope note: Mikromuotoinen tallenne.
scope note: Mikroformsbärare. @sv

faksimile
type: Concept
source: RDA-termi
source: RDA-term @sv
created: 2016-04-21
modified: 2024-05-23
alternative label: faksimilejäljennös
alternative label: faksimilavtryck @sv
alternative label: faksimiler @sv
alternative label: faksimiltryck @sv
definition: Kuvasisältö, joka koostuu originaalin tarkasta jäljennöksestä, yleensä samanmittaisena kuin originaali, erityisesti kirjoista, asiakirjoista, painokuvista ja piirustuksista.
definition: Illustrativt innehåll som består av en exakt reproduktion av ett original, vanligen också med samma mått som originalet. Särskilt om böcker, dokument, tryckta bilder och ritningar. @sv
in scheme: Metatietosanasto
preferred label: faksimil @sv
scope note: Monikossa: faksimileja, xx faksimilea.
scope note: I plural: faksimil, xx faksimil. @sv

illuminointi
type: Concept
source: RDA-termi
source: RDA-term @sv
created: 2016-04-21
modified: 2023-05-17
definition: Kuvasisältö, joka koostuu yleensä yksi- tai monivärisestä koristelusta ja joka on tehty käsin maalilla, musteella tai folioiden avulla.
definition: Illustrativt innehåll som vanligen består av en- eller flerfärgad dekoration och som är handgjord med målfärg, bläck eller folie. @sv
in scheme: Metatietosanasto
preferred label: illumination @sv
scope note: Monikossa: illuminointeja, xx illuminointia
scope note: I plural: illuminationer, xx illuminationer @sv

lomake
type: Concept
source: RDA-termi
source: RDA-term @sv
created: 2016-04-21
modified: 2023-05-17
definition: Kuvasisältö, joka muodostuu merkityistä alueista joihin syötetään määrämuotoista tietoa määriteltyjen henkilöiden toimesta ja määriteltyjä tarkoituksia varten, sisältää yleensä täyttämisohjeet.
definition: Illustrativt innehåll som utgörs av märkta områden, i vilka data i viss form inmatas av bestämda personer och för bestämda syften, inkluderar vanligen ifyllningsanvisningar. @sv
in scheme: Metatietosanasto
preferred label: form @en
preferred label: blankett @sv
scope note: Monikossa: lomakkeita, xx lomaketta
scope note: I plural: blanketter, xx blanketter @sv

Esitysformaatti
type: ConceptGroup
type: Collection
source: RDA-termi
source: RDA-term @sv
created: 2016-01-08
modified: 2023-05-05
alternative label: Presentationsformat @sv
definition: Liittää manifestaation heijastettavan kuvan tuottamiseen käytettyyn formaattiin.
definition: Sammankopplar manifestation med ett format som använts för att producera projicerbar bild. @sv
member: äänifilmin standardikuvakoko
member: IMAX
member: stereoskooppinen
member: mykkäfilmin standardikuvakoko
member: Cinerama
member: 3D
member: Panavision
member: Cinemiracle
member: monikangas
member: multiprojektori
member: techniscope
member: Circarama
preferred label: Presentation format @en
preferred label: Filmprojektionssystem @sv

muu stereografinen tallenne
type: Concept
source: Kansallinen RDA-termi
source: Nationell RDA-term @sv
created: 2016-08-20
modified: 2025-10-04
definition: Jos mikään sanastossa olevista stereografisista tallennetyypeistä ei sovellu kuvaamaan aineiston sisältöä, merkitään muu.
definition: Om ingen tidigare nämnd typ av stereografisk bärare passar in på det material som beskrivs, anges termen annan stereografisk bärare. @sv
in scheme: Metatietosanasto
preferred label: annan stereografisk bärare @sv
scope note: MARC 21 tallennetyypin koodi ez.
scope note: MARC 21 bärartypens kod ez. @sv

muu mikromuotoinen tallenne
type: Concept
source: Kansallinen RDA-termi
source: Nationell RDA-term @sv
created: 2016-08-20
modified: 2025-10-04
definition: Jos mikään sanastossa olevista mikromuotoisista tallennetyypeistä ei sovellu kuvaamaan aineiston sisältöä, merkitään muu.
definition: Om ingen tidigare nämnd mikroformsbärartyp passar in på det material som beskrivs, anges annan. @sv
in scheme: Metatietosanasto
preferred label: annan mikroformsbärare @sv
scope note: MARC 21 tallennetyypin koodi hz.
scope note: MARC 21 bärartypens kod hz. @sv

muu äänitallenne
type: Concept
source: Kansallinen RDA-termi
source: Nationell RDA-term @sv
created: 2016-08-20
modified: 2025-10-04
definition: Jos mikään sanastossa olevista äänitallennetyypeistä ei sovellu kuvaamaan aineiston sisältöä, merkitään muu.
definition: Om ingen tidigare nämnd ljudbärartyp passar in på det material som beskrivs, anges annan. @sv
in scheme: Metatietosanasto
preferred label: annan ljudbärare @sv
scope note: MARC 21 tallennetyypin koodi sz.
scope note: MARC 21 bärartypens kod sz. @sv

muu ilman laitetta käytettävä tallenne
type: Concept
source: Kansallinen RDA-termi
source: Nationell RDA-term @sv
created: 2016-08-20
modified: 2025-10-04
definition: Jos mikään sanastossa olevista ilman laitetta käytettävistä tallennetyypeistä ei sovellu kuvaamaan aineiston sisältöä, merkitään muu.
definition: Om ingen tidigare nämnd typ av omedierad bärare passar in på det material som beskrivs, anges annan. @sv
in scheme: Metatietosanasto
preferred label: annan omedierad bärare @sv
scope note: MARC 21 tallennetyypin koodi nz.
scope note: MARC 21 bärartypens kod nz. @sv

muu videotallenne
type: Concept
source: Kansallinen RDA-termi
source: Nationell RDA-term @sv
created: 2016-08-20
modified: 2025-10-04
definition: Jos mikään sanastossa olevista videotallennetyypeistä ei sovellu kuvaamaan aineiston sisältöä, merkitään muu.
definition: Om ingen tidigare nämnd videobärartyp lämpar sig för att beskriva materialets innehåll anges annan. @sv
in scheme: Metatietosanasto
preferred label: annan videobärare @sv
scope note: MARC 21 tallennetyypin koodi vz.
scope note: MARC 21 bärartypens kod vz. @sv

muu tietokonetallenne
type: Concept
source: Kansallinen RDA-termi
source: Nationell RDA-term @sv
created: 2016-08-20
modified: 2025-10-04
definition: Jos mikään sanastossa olevista tietokonetallennetyypeistä ei sovellu kuvaamaan aineiston sisältöä, merkitään muu.
definition: Om ingen tidigare nämnd datorbärartyp passar in på det material som beskrivs, anges termen annan datorbärare. @sv
in scheme: Metatietosanasto
preferred label: annan datorbärare @sv
scope note: MARC 21 tallennetyypin koodi cz.
scope note: MARC 21 bärartypens kod cz. @sv

Betacam SP
type: Concept
source: RDA-termi
source: RDA-term @sv
created: 2016-01-08
modified: 2023-05-17
definition: Analogisen nauhan Betacam-formaattiin perustuva videoformaatti, joka nostaa horisontaalisen resoluution 340:een raitaan.
definition: Videoformat för analogt band, som grundar sig på Betacam-format och som höjer den horisontella upplösningen till 340 spår. @sv
in scheme: Metatietosanasto

muu mikroskooppinen tallenne
type: Concept
source: Kansallinen RDA-termi
source: Nationell RDA-term @sv
created: 2016-08-20
modified: 2025-10-04
definition: Jos mikään sanastossa olevista mikroskooppisista tallennetyypeistä ei sovellu kuvaamaan aineiston sisältöä, merkitään muu.
definition: Om ingen tidigare nämnd typ av mikroskopisk bärare passar in på det material som beskrivs, anges annan. @sv
in scheme: Metatietosanasto
preferred label: annan mikroskopisk bärare @sv
scope note: MARC 21 tallennetyypin koodi pz.
scope note: MARC 21 bärartypens kod pz. @sv

äänihihna
type: Concept
source: RDA-termi
source: RDA-term @sv
created: 2016-08-20
modified: 2024-03-09
definition: Silmukanmuotoinen joustava muovi- tai magneettikalvo, jolle äänisignaaleja tallennetaan mekaanisesti. Tunnetaan yleisesti tuotenimellä Dictabelt.
definition: Slinga av elastisk plast- eller magnetfilm, på vilken ljudsignaler upptas mekaniskt. Går vanligvis under produktnamnet Dictabelt. @sv
in scheme: Metatietosanasto
preferred label: audio belt @en
preferred label: ljudslinga @sv
scope note: Äänitallenne.
scope note: Ljudbärare. @sv

muu heijastettava kuvatallenne
type: Concept
source: Kansallinen RDA-termi
source: Nationell RDA-term @sv
created: 2016-08-20
modified: 2025-10-04
definition: Jos mikään sanastossa olevista heijastettavista kuvatallennetyypeistä ei sovellu kuvaamaan aineiston sisältöä, merkitään muu.
definition: Om ingen tidigare nämnd typ av bärare för projicerbara bilder passar in på det material som beskrivs, anges annan. @sv
in scheme: Metatietosanasto
preferred label: annan bärare för projicerbara bilder @sv
scope note: MARC 21 tallennetyypin koodi mz.
scope note: MARC 21 bärartypens kod mz. @sv

äänilankakela
type: Concept
source: RDA-termi
source: RDA-term @sv
created: 2016-08-20
modified: 2023-05-17
definition: Kelalla tai rullalla oleva teräksinen tai ruostumatonta terästä oleva lanka, jolle äänisignaaleja tallennetaan magneettisesti.
definition: Tråd på rulle eller spole, gjord av stål eller rostfritt stål och på vilken ljudsignaler upptas magnetiskt. @sv
in scheme: Metatietosanasto
preferred label: audio wire reel @en
preferred label: ljudtråd @sv
scope note: Äänitallenne.
scope note: Ljudbärare. @sv

kuva
type: Concept
source: RDA-termi
source: RDA-term @sv
created: 2016-08-23
modified: 2024-03-16
definition: Kuvasisältö, joka koostuu stillkuvasta.
definition: Illustrativt innehåll som består av stillbild. @sv
in scheme: Metatietosanasto
preferred label: illustration @en

fiktiivinen hahmo
type: Concept
source: Kansallinen RDA-termi
source: Nationell RDA-term @sv
created: 2016-08-23
modified: 2025-10-21
alternative label: satuhahmo
alternative label: fiktiv karaktär @sv
alternative label: sagofigur @sv
alternative label: sagogestalt @sv
in scheme: Metatietosanasto
preferred label: fiktiv gestalt @sv
scope note: Ei ole RDA:n mukainen toimija.
scope note: Är inte en aktör i enlighet med RDA. @sv

videokasetti
type: Concept
source: RDA-termi
source: RDA-term @sv
created: 2016-01-08
modified: 2023-05-17
definition: Kasetti, joka sisältää videonauhan.
definition: Kassett som innehåller videoband. @sv
in scheme: Metatietosanasto
preferred label: videocassette @en
preferred label: videokassett @sv
scope note: Videotallenne.
scope note: Videobärare. @sv

kielletty alle 12-vuotiailta
type: Concept
source: Kansallinen RDA-termi
source: Nationell RDA-term @sv
created: 2016-09-20
modified: 2025-03-04
in scheme: Metatietosanasto
preferred label: förbjuden under 12 år @sv

Muu
type: ConceptGroup
type: Collection
source: Kansallinen RDA-termi
source: Nationell RDA-term @sv
created: 2016-09-22
modified: 2024-05-24
preferred label: Unspecified @en
preferred label: Annan @sv
scope note: Käytetään määrittämään ryhmän jäsenten muuta sosiaalista keskinäistä samankaltaisuutta kuvaavia termejä (esim. erolapset, sosialistit, sotalesket, vaihto-opiskelijat, vangit).
scope note: Används för att bestämma termer som beskriver annan social inbördes likhet hos medlemmar av en grupp (t.ex. skilsmässobarn, socialister, krigsänkor, utbytesstuderande, fångar). @sv

Kohderyhmä
type: ConceptGroup
type: Collection
source: RDA-termi
source: RDA-term @sv
created: 2016-01-08
modified: 2024-10-01
definition: Kohderyhmä tarkoittaa käyttäjäryhmää, jolle aineiston sisältö on tarkoitettu tai jolle sisällön on katsottu sopivan, kuten tiettyä ikäryhmää (esim. lapset, nuoret, aikuiset), opiskelutasoa (esim. peruskoulu, lukio), esteellisyyttä (esim. näkörajoitteiset) tai muuta ryhmittelyä.
definition: Målgrupp avser den användargrupp som resursen riktar sig till eller för vilken resursen ansetts lämplig, såsom en viss åldersgrupp (t.ex. barn, unga, vuxna), utbildningsnivå (t.ex. grundskola, gymnasium) funktionsvariation (t.ex. synskadade) eller annan gruppindelning. @sv
member: Muu
member: Opiskelutaso
member: Kieli
member: Ikä
member: Ammatti/harrastus
member: Seksuaalinen suuntautuneisuus
member: Terveys/toimintakyky
member: Kansallisuus/asuinalue
member: Uskonto
member: Etnisyys
member: Sukupuoli
preferred label: Intended audience @en
preferred label: Målgrupp @sv

lelu
type: Concept
source: RDA-termi
source: RDA-term @sv
created: 2016-01-08
modified: 2023-05-17
definition: Laajuuden yksikkö, objekti, joka on suunniteltu opetusta, huvia tai leikkiä varten.
definition: Enhet, objekt som är utformat för användning i undervisning, förströelse eller lek. @sv
in scheme: Metatietosanasto
preferred label: toy @en
preferred label: leksak @sv

sidos korjattu
type: Concept
source: Kansallinen RDA-termi
source: Nationell RDA-term @sv
created: 2017-01-06
modified: 2024-05-24
in scheme: Metatietosanasto
preferred label: reparerat bokband @sv

sidottavana
type: Concept
source: Kansallinen RDA-termi
source: Nationell RDA-term @sv
created: 2017-01-06
modified: 2024-05-24
in scheme: Metatietosanasto
preferred label: för inbindning @sv

kuntokartoitettu
type: Concept
source: Kansallinen RDA-termi
source: Nationell RDA-term @sv
created: 2017-01-06
modified: 2024-05-24
in scheme: Metatietosanasto
preferred label: konditionsgranskad @sv

konservoitavana
type: Concept
source: Kansallinen RDA-termi
source: Nationell RDA-term @sv
created: 2017-01-06
modified: 2024-05-24
in scheme: Metatietosanasto
preferred label: konserveras @sv

näyttelylainassa
type: Concept
source: Kansallinen RDA-termi
source: Nationell RDA-term @sv
created: 2017-01-06
modified: 2024-05-24
in scheme: Metatietosanasto
preferred label: utlånad till utställning @sv

Tallennetyyppi
type: ConceptGroup
type: Collection
source: RDA-termi
source: RDA-term @sv
created: 2016-01-08
modified: 2023-05-05
definition: Liittää manifestaation jaotteluun, joka ilmaisee tallennusvälineen muotoa yhdessä manifestaation sisällön katsomiseen, toistamiseen, suorittamiseen ym. tarvittavan laitetyypin kanssa. Jos mikään alla olevista RDA-tallennetyypeistä ei sovellu kuvaamaan aineiston sisältöä, merkitään 'muu'.
definition: Sammankopplar manifestation med en indelning som anger lagringsmediets form tillsammans med apparattypen som behövs för att titta på, spela upp, utföra e.d. innehållet i en manifestation. Om ingen av RDA-innehållstyperna nedan kan användas för att beskriva materialets innehåll anges "annan". @sv
member: piirtoheitinkalvo
member: videolevy
member: verkkoaineisto
member: äänikela
member: objekti
member: filmisilmukkakasetti
member: raina
member: videokela
member: tietonauhan silmukkakasetti
member: rulla
member: mikrofilmikela
member: piirikotelo
member: tietolevykotelo
member: ääniraitakela
member: mikrofilmiliuska
member: mikrofilmikasetti
member: muu stereografinen tallenne
member: muu mikromuotoinen tallenne
member: muu äänitallenne
member: muu ilman laitetta käytettävä tallenne
member: muu videotallenne
member: muu tietokonetallenne
member: muu mikroskooppinen tallenne
member: äänihihna
member: muu heijastettava kuvatallenne
member: äänilankakela
member: videokasetti
member: määrittelemäton
member: mikrokorttikasetti
member: äänisylinteri
member: filmikasetti
member: tietolevy
member: arkki
member: tietokasetti
member: mikrokortti
member: filmirulla
member: äänilevy
member: mikrofilmisilmukkakasetti
member: stereografinen kortti
member: filmikela
member: lehtiötaulu
member: äänisilmukkakasetti
member: äänikasetti
member: äänirulla
member: mikrofilmirulla
member: dia
member: nide
member: stereografinen levy
member: rainakasetti
member: muistikortti
member: tietonauhakela
member: videosilmukkakasetti
member: preparaattilasi
member: kortti
member: filmiliuska
member: ikkunakortti
member: mikrokortti (läpinäkymätön)
preferred label: Carrier type @en
preferred label: Bärartyp @sv

Sävellystyyppien nimet
type: ConceptGroup
type: Collection
source: RDA-termi
source: RDA-term @sv
created: 2017-01-12
modified: 2024-04-26
member: Alkusoitot
member: Airit
member: Allemandet
member: Aariat
member: Antifonit
member: Arabeskit
member: Anthemit
member: Canariet
member: Basse danset
member: Divertimentot
member: Capricciot
member: Deutschet
member: Barkarolit
member: Ariosot
member: Divisionit
member: Canzonat
member: Branlet
member: Duot
member: Berceuset
member: Courantet
member: Etydit
member: Chaconnet
member: Elegiat
member: Bagatellit
member: Bourréet
member: Intradat
member: Ductiat
member: Conductukset
member: Balladit
member: Duetot
member: Concerto grossot
member: Ecossaiset
member: Concertinot
member: Ariettat
member: Divertissementit
member: Fughetat
member: Fantasiat ja fuugat
member: Carolit
member: Canzonettat
member: Frottolat
member: Fanfaarit
member: Fantasiat
member: Capricciettot
member: Fugatot
member: Fuugat
member: Fantasiat ja fughetat
member: Kantaatit
member: Humoreskit
member: Giguet
member: Johdannot
member: Graduaalit
member: Gagliardat
member: Hymnit
member: Impromptut
member: Kadenssit
member: Kaanonit
member: Inventiot
member: Interludit
member: Intermediot
member: Introitukset
member: Improvisaatiot
member: Galopit
member: Kappaleet
member: Lamentaatiot
member: Toccatat ja fuugat
member: Solfeesit
member: Vokaliisit
member: Sarjat
member: Toccatat
member: Preludit
member: Virelait
member: Organumit
member: Muunnelmat
member: Responsoriot

Manifestaation nimeke
type: ConceptGroup
type: Collection
source: RDA-termi
source: RDA-term @sv
created: 2017-01-13
modified: 2025-10-18
definition: Manifestaation nimitys, joka on luonnollisen kielen ja yleisen diskurssin sanamuodon mukainen.
definition: Titel för en manifestation, som är i enlighet med naturligt språk och ordalydelse i allmänt språkbruk. @sv
member: sarjan nimeke
member: manifestaation varianttinimeke
member: rinnakkainen päänimeke
member: lyhennetty nimeke
member: sarjan rinnakkainen nimeke
member: päänimeke
preferred label: Title of manifestation @en
preferred label: Manifestationstitel @sv

opinnäytetyö
type: Concept
source: Kansallinen RDA-termi
source: Nationell RDA-term @sv
created: 2017-01-27
modified: 2026-02-12
alternative label: analyysiseminaarityö
alternative label: erikoistyö
alternative label: laudaturseminaarityö
alternative label: laudaturtyö
alternative label: lopputyö
alternative label: opinnäyte
alternative label: proseminaarityö
alternative label: seminaarityö
alternative label: tohtorintutkinnon kirjallinen työ
alternative label: analysseminariearbete @sv
alternative label: examensarbete @sv
alternative label: laudaturarbete @sv
alternative label: proseminariearbete @sv
alternative label: seminariearbete @sv
alternative label: slutarbete @sv
alternative label: specialarbete @sv
in scheme: Metatietosanasto
preferred label: lärdomsprov @sv
scope note: Yleistermi, joka kattaa kaikki sellaiset opinnäytetyöt, joille ei ole omaa tarkempaa termiä.
scope note: Allmän term som täcker alla sådana lärdomsprov, för vilka ingen egen exaktare term finns. @sv

määrittelemäton
type: Concept
source: Kansallinen RDA-termi
source: Nationell RDA-term @sv
created: 2016-01-08
modified: 2025-10-04
in scheme: Metatietosanasto
preferred label: ospecificerad @sv
scope note: Jos tallennetyyppiä tai -tyyppejä, jotka soveltuvat kuvailtavaan aineistoon ei voida helposti todentaa, merkitään määrittelemätön.
scope note: Används då bärartypen eller -typerna som passar in på den resurs som beskrivs, inte enkelt kan fastställas. @sv

Alkusoitot
type: Concept
source: Kansallinen RDA-termi
source: Nationell RDA-term @sv
created: 2017-02-11
modified: 2024-05-24
alternative label: Juhla-alkusoitot
alternative label: Ooppera-alkusoitot
alternative label: Orkesterialkusoitot
alternative label: Ouverturet
alternative label: Overturet
alternative label: Operaouvertyrer @sv
alternative label: Orkesterouvertyrer @sv
alternative label: Overtyrer @sv
in scheme: Metatietosanasto
preferred label: Ouvertyrer @sv

Airit
type: Concept
source: Kansallinen RDA-termi
source: Nationell RDA-term @sv
created: 2017-02-11
modified: 2024-05-24
in scheme: Metatietosanasto
preferred label: Airer @sv

Allemandet
type: Concept
source: Kansallinen RDA-termi
source: Nationell RDA-term @sv
created: 2017-02-11
modified: 2024-05-24
alternative label: Almainit
alternative label: Almandit
in scheme: Metatietosanasto
preferred label: Allemander @sv

Aariat
type: Concept
source: Kansallinen RDA-termi
source: Nationell RDA-term @sv
created: 2017-02-11
modified: 2024-05-24
alternative label: Ooppera-aariat
alternative label: Operaarior @sv
in scheme: Metatietosanasto
preferred label: Arior @sv

Antifonit
type: Concept
source: Kansallinen RDA-termi
source: Nationell RDA-term @sv
created: 2017-02-14
modified: 2024-05-24
alternative label: Antiphonit
alternative label: Johdantovuorolaulut
in scheme: Metatietosanasto
preferred label: Antifoner @sv

Arabeskit
type: Concept
source: Kansallinen RDA-termi
source: Nationell RDA-term @sv
created: 2017-02-14
modified: 2024-05-24
in scheme: Metatietosanasto
preferred label: Arabesker @sv

Anthemit
type: Concept
source: Kansallinen RDA-termi
source: Nationell RDA-term @sv
created: 2017-02-14
modified: 2024-05-24
in scheme: Metatietosanasto
preferred label: Anthems @sv

Canariet
type: Concept
source: Kansallinen RDA-termi
source: Nationell RDA-term @sv
created: 2017-02-15
modified: 2024-05-24
alternative label: Canariot
in scheme: Metatietosanasto
preferred label: Canarier @sv

Basse danset
type: Concept
source: Kansallinen RDA-termi
source: Nationell RDA-term @sv
created: 2017-02-15
modified: 2024-05-24
alternative label: Bassa danzat
alternative label: Basse danse @sv
in scheme: Metatietosanasto
preferred label: Basses danses @sv

Divertimentot
type: Concept
source: Kansallinen RDA-termi
source: Nationell RDA-term @sv
created: 2017-02-15
modified: 2024-05-24
in scheme: Metatietosanasto
preferred label: Divertimenton @sv

Capricciot
type: Concept
source: Kansallinen RDA-termi
source: Nationell RDA-term @sv
created: 2017-02-15
modified: 2024-05-24
alternative label: Capricet
alternative label: Kapriisit
alternative label: Kapriser @sv
in scheme: Metatietosanasto
preferred label: Capriccion @sv

Deutschet
type: Concept
source: Kansallinen RDA-termi
source: Nationell RDA-term @sv
created: 2017-02-15
modified: 2024-05-24
in scheme: Metatietosanasto
preferred label: Tyska danser @sv

Barkarolit
type: Concept
source: Kansallinen RDA-termi
source: Nationell RDA-term @sv
created: 2017-02-15
modified: 2024-05-24
alternative label: Barcarolit
alternative label: Venelaulu
alternative label: Barcaroler @sv
in scheme: Metatietosanasto
preferred label: Barkaroller @sv

Ariosot
type: Concept
source: Kansallinen RDA-termi
source: Nationell RDA-term @sv
created: 2017-02-15
modified: 2024-05-24
in scheme: Metatietosanasto
preferred label: Arioson @sv

Divisionit
type: Concept
source: Kansallinen RDA-termi
source: Nationell RDA-term @sv
created: 2017-02-15
modified: 2024-05-24
alternative label: Diminutions
alternative label: Diminutioner @sv
in scheme: Metatietosanasto
preferred label: Divisions @sv

Canzonat
type: Concept
source: Kansallinen RDA-termi
source: Nationell RDA-term @sv
created: 2017-02-15
modified: 2024-05-24
alternative label: Canzonet
in scheme: Metatietosanasto
preferred label: Canzoner @sv

Branlet
type: Concept
source: Kansallinen RDA-termi
source: Nationell RDA-term @sv
created: 2017-02-15
modified: 2024-05-24
alternative label: Branslet
in scheme: Metatietosanasto
preferred label: Branler @sv

16 raitaa
type: Concept
source: Kansallinen RDA-termi
source: Nationell RDA-term @sv
created: 2016-01-08
modified: 2024-05-24
in scheme: Metatietosanasto
preferred label: 16 ljudspår @sv

Duot
type: Concept
source: Kansallinen RDA-termi
source: Nationell RDA-term @sv
created: 2017-02-15
modified: 2024-05-24
in scheme: Metatietosanasto
preferred label: Duor @sv

Berceuset
type: Concept
source: Kansallinen RDA-termi
source: Nationell RDA-term @sv
created: 2017-02-15
modified: 2024-05-24
in scheme: Metatietosanasto
preferred label: Berceuser @sv

Courantet
type: Concept
source: Kansallinen RDA-termi
source: Nationell RDA-term @sv
created: 2017-02-15
modified: 2024-05-24
alternative label: Corantot
in scheme: Metatietosanasto
preferred label: Couranter @sv

Etydit
type: Concept
source: Kansallinen RDA-termi
source: Nationell RDA-term @sv
created: 2017-02-15
modified: 2024-05-24
alternative label: Etudet
in scheme: Metatietosanasto
preferred label: Etyder @sv

Chaconnet
type: Concept
source: Kansallinen RDA-termi
source: Nationell RDA-term @sv
created: 2017-02-15
modified: 2024-05-24
alternative label: Antiphonit
in scheme: Metatietosanasto
preferred label: Chaconner @sv

Elegiat
type: Concept
source: Kansallinen RDA-termi
source: Nationell RDA-term @sv
created: 2017-02-15
modified: 2024-05-24
in scheme: Metatietosanasto
preferred label: Elegier @sv

Bagatellit
type: Concept
source: Kansallinen RDA-termi
source: Nationell RDA-term @sv
created: 2017-02-15
modified: 2024-05-24
in scheme: Metatietosanasto
preferred label: Bagateller @sv

Bourréet
type: Concept
source: Kansallinen RDA-termi
source: Nationell RDA-term @sv
created: 2017-02-15
modified: 2024-05-24
in scheme: Metatietosanasto
preferred label: Bourréer @sv

Intradat
type: Concept
source: Kansallinen RDA-termi
source: Nationell RDA-term @sv
created: 2017-02-15
modified: 2024-05-24
alternative label: Entradat
alternative label: Entrador @sv
in scheme: Metatietosanasto
preferred label: Intrador @sv

Ductiat
type: Concept
source: Kansallinen RDA-termi
source: Nationell RDA-term @sv
created: 2017-02-15
modified: 2024-05-24
in scheme: Metatietosanasto
preferred label: Ductior @sv

Conductukset
type: Concept
source: Kansallinen RDA-termi
source: Nationell RDA-term @sv
created: 2017-02-15
modified: 2024-05-24
in scheme: Metatietosanasto
preferred label: Conductus @sv

Balladit
type: Concept
source: Kansallinen RDA-termi
source: Nationell RDA-term @sv
created: 2017-02-15
modified: 2024-05-24
alternative label: Balladet
in scheme: Metatietosanasto
preferred label: Ballader @sv

Duetot
type: Concept
source: Kansallinen RDA-termi
source: Nationell RDA-term @sv
created: 2017-02-15
modified: 2024-05-24
in scheme: Metatietosanasto
preferred label: Duetter @sv

Concerto grossot
type: Concept
source: Kansallinen RDA-termi
source: Nationell RDA-term @sv
created: 2017-02-15
modified: 2024-05-24
in scheme: Metatietosanasto
preferred label: Concerto grosson @sv

Ecossaiset
type: Concept
source: Kansallinen RDA-termi
source: Nationell RDA-term @sv
created: 2017-02-16
modified: 2024-05-24
alternative label: Ecossäser @sv
in scheme: Metatietosanasto
preferred label: Écossaiser @sv

Concertinot
type: Concept
source: Kansallinen RDA-termi
source: Nationell RDA-term @sv
created: 2017-02-16
modified: 2024-05-24
in scheme: Metatietosanasto
preferred label: Concertinor @sv

Ariettat
type: Concept
source: Kansallinen RDA-termi
source: Nationell RDA-term @sv
created: 2017-02-16
modified: 2024-05-24
in scheme: Metatietosanasto
preferred label: Ariettor @sv

Divertissementit
type: Concept
source: Kansallinen RDA-termi
source: Nationell RDA-term @sv
created: 2017-02-16
modified: 2024-05-24
in scheme: Metatietosanasto
preferred label: Divertissementer @sv

Fughetat
type: Concept
source: Kansallinen RDA-termi
source: Nationell RDA-term @sv
created: 2017-02-16
modified: 2024-05-24
in scheme: Metatietosanasto
preferred label: Fughettor @sv

Fantasiat ja fuugat
type: Concept
source: Kansallinen RDA-termi
source: Nationell RDA-term @sv
created: 2017-02-16
modified: 2024-05-24
in scheme: Metatietosanasto
preferred label: Fantasier och fugor @sv

Carolit
type: Concept
source: Kansallinen RDA-termi
source: Nationell RDA-term @sv
created: 2017-02-16
modified: 2024-05-24
alternative label: Joululaulut
alternative label: Julsånger @sv
in scheme: Metatietosanasto
preferred label: Carols @sv

Canzonettat
type: Concept
source: Kansallinen RDA-termi
source: Nationell RDA-term @sv
created: 2017-02-16
modified: 2024-05-24
in scheme: Metatietosanasto
preferred label: Canzonetter @sv

Frottolat
type: Concept
source: Kansallinen RDA-termi
source: Nationell RDA-term @sv
created: 2017-02-16
modified: 2024-05-24
in scheme: Metatietosanasto
preferred label: Frottoler @sv

Fanfaarit
type: Concept
source: Kansallinen RDA-termi
source: Nationell RDA-term @sv
created: 2017-02-16
modified: 2024-05-24
in scheme: Metatietosanasto
preferred label: Fanfarer @sv

Fantasiat
type: Concept
source: Kansallinen RDA-termi
source: Nationell RDA-term @sv
created: 2017-02-16
modified: 2024-05-24
alternative label: Fancyt
alternative label: Koraalifantasiat
alternative label: Fancy @sv
alternative label: Koralfantasier @sv
in scheme: Metatietosanasto
preferred label: Fantasier @sv

Capricciettot
type: Concept
source: Kansallinen RDA-termi
source: Nationell RDA-term @sv
created: 2017-02-16
modified: 2024-05-24
in scheme: Metatietosanasto
preferred label: Capriccietton @sv

Fugatot
type: Concept
source: Kansallinen RDA-termi
source: Nationell RDA-term @sv
created: 2017-02-16
modified: 2024-05-24
in scheme: Metatietosanasto
preferred label: Fugaton @sv

Fuugat
type: Concept
source: Kansallinen RDA-termi
source: Nationell RDA-term @sv
created: 2017-02-16
modified: 2024-05-24
in scheme: Metatietosanasto
preferred label: Fugor @sv

Fantasiat ja fughetat
type: Concept
source: Kansallinen RDA-termi
source: Nationell RDA-term @sv
created: 2017-02-16
modified: 2024-05-24
in scheme: Metatietosanasto
preferred label: Fantasier och fughettor @sv

Kantaatit
type: Concept
source: Kansallinen RDA-termi
source: Nationell RDA-term @sv
created: 2017-02-17
modified: 2024-05-24
alternative label: Andliga kantater @sv
alternative label: Koralkantater @sv
alternative label: Kyrkokantater @sv
alternative label: Solokantater @sv
in scheme: Metatietosanasto
preferred label: Kantater @sv

Humoreskit
type: Concept
source: Kansallinen RDA-termi
source: Nationell RDA-term @sv
created: 2017-02-17
modified: 2024-05-24
alternative label: Humoresquet
in scheme: Metatietosanasto
preferred label: Humoresker @sv

Giguet
type: Concept
source: Kansallinen RDA-termi
source: Nationell RDA-term @sv
created: 2017-02-17
modified: 2024-05-24
alternative label: Gigat
alternative label: Jigit
alternative label: Gigor @sv
alternative label: Jiggar @sv
in scheme: Metatietosanasto
preferred label: Giguer @sv

Johdannot
type: Concept
source: Kansallinen RDA-termi
source: Nationell RDA-term @sv
created: 2017-02-17
modified: 2024-05-24
alternative label: Introduktiot
in scheme: Metatietosanasto
preferred label: Introduktioner @sv

Graduaalit
type: Concept
source: Kansallinen RDA-termi
source: Nationell RDA-term @sv
created: 2017-02-17
modified: 2024-05-24
alternative label: Gradualet
in scheme: Metatietosanasto
preferred label: Gradualer @sv

Gagliardat
type: Concept
source: Kansallinen RDA-termi
source: Nationell RDA-term @sv
created: 2017-02-17
modified: 2024-05-24
alternative label: Gagliardet
alternative label: Gagliardit
alternative label: Gagliarder @sv
alternative label: Gaillarder @sv
in scheme: Metatietosanasto
preferred label: Galliarder @sv

Hymnit
type: Concept
source: Kansallinen RDA-termi
source: Nationell RDA-term @sv
created: 2017-02-17
modified: 2024-05-24
in scheme: Metatietosanasto
preferred label: Hymner @sv

tietokoneohjelma
type: Concept
source: RDA-termi
source: RDA-term @sv
created: 2016-01-08
modified: 2023-05-05
definition: Tietokoneen käsiteltäväksi ja suoritettavaksi tarkoitettu (digitaalisesti koodattu) ohjelma. Esimerkiksi käyttöjärjestelmät, sovellusohjelmat jne.
definition: Digitalt kodat program som behandlas och utförs på dator. Till exempel operativsystem, applikationsprogram. @sv
in scheme: Metatietosanasto
preferred label: computer program @en
preferred label: datorprogram @sv

Impromptut
type: Concept
source: Kansallinen RDA-termi
source: Nationell RDA-term @sv
created: 2017-02-17
modified: 2024-05-24
in scheme: Metatietosanasto
preferred label: Impromptun @sv

Kadenssit
type: Concept
source: Kansallinen RDA-termi
source: Nationell RDA-term @sv
created: 2017-02-17
modified: 2024-05-24
in scheme: Metatietosanasto
preferred label: Kadenser @sv

Kaanonit
type: Concept
source: Kansallinen RDA-termi
source: Nationell RDA-term @sv
created: 2017-02-17
modified: 2024-05-24
alternative label: Canonit
in scheme: Metatietosanasto
preferred label: Kanon @sv

Inventiot
type: Concept
source: Kansallinen RDA-termi
source: Nationell RDA-term @sv
created: 2017-02-17
modified: 2024-05-24
in scheme: Metatietosanasto
preferred label: Inventioner @sv

Interludit
type: Concept
source: Kansallinen RDA-termi
source: Nationell RDA-term @sv
created: 2017-02-17
modified: 2024-05-24
in scheme: Metatietosanasto
preferred label: Interludier @sv

Intermediot
type: Concept
source: Kansallinen RDA-termi
source: Nationell RDA-term @sv
created: 2017-02-17
modified: 2024-05-24
in scheme: Metatietosanasto
preferred label: Intermedier @sv

Introitukset
type: Concept
source: Kansallinen RDA-termi
source: Nationell RDA-term @sv
created: 2017-02-17
modified: 2024-05-24
in scheme: Metatietosanasto
preferred label: Introitus @sv

Improvisaatiot
type: Concept
source: Kansallinen RDA-termi
source: Nationell RDA-term @sv
created: 2017-02-17
modified: 2024-05-24
in scheme: Metatietosanasto
preferred label: Improvisationer @sv

levy-yhtiö
type: Concept
source: Kansallinen RDA-termi
source: Nationell RDA-term @sv
created: 2017-02-17
modified: 2024-05-24
in scheme: Metatietosanasto
preferred label: skivbolag @sv

Galopit
type: Concept
source: Kansallinen RDA-termi
source: Nationell RDA-term @sv
created: 2017-02-17
modified: 2024-05-24
in scheme: Metatietosanasto
preferred label: Galopper @sv

Kappaleet
type: Concept
source: Kansallinen RDA-termi
source: Nationell RDA-term @sv
created: 2017-02-17
modified: 2024-05-24
alternative label: Morceau
alternative label: Morceaux
alternative label: Sävelmät
alternative label: Låtar @sv
alternative label: Melodier @sv
in scheme: Metatietosanasto
preferred label: Musikstycken @sv

Lamentaatiot
type: Concept
source: Kansallinen RDA-termi
source: Nationell RDA-term @sv
created: 2017-02-18
modified: 2024-05-24
in scheme: Metatietosanasto
preferred label: Lamentationer @sv

Toccatat ja fuugat
type: Concept
source: Kansallinen RDA-termi
source: Nationell RDA-term @sv
created: 2017-02-18
modified: 2024-05-24
in scheme: Metatietosanasto
preferred label: Toccator och fugor @sv

Solfeesit
type: Concept
source: Kansallinen RDA-termi
source: Nationell RDA-term @sv
created: 2017-02-18
modified: 2024-05-24
in scheme: Metatietosanasto
preferred label: Solféger @sv

Vokaliisit
type: Concept
source: Kansallinen RDA-termi
source: Nationell RDA-term @sv
created: 2017-02-18
modified: 2024-05-24
in scheme: Metatietosanasto
preferred label: Vokaliser @sv

Sarjat
type: Concept
source: Kansallinen RDA-termi
source: Nationell RDA-term @sv
created: 2017-02-18
modified: 2024-05-24
alternative label: Suite
in scheme: Metatietosanasto
preferred label: Sviter @sv

Toccatat
type: Concept
source: Kansallinen RDA-termi
source: Nationell RDA-term @sv
created: 2017-02-18
modified: 2024-05-24
in scheme: Metatietosanasto
preferred label: Toccator @sv

Preludit
type: Concept
source: Kansallinen RDA-termi
source: Nationell RDA-term @sv
created: 2017-02-18
modified: 2024-05-24
alternative label: Praembulumit
alternative label: Prealudiumit
in scheme: Metatietosanasto
preferred label: Preludier @sv

Virelait
type: Concept
source: Kansallinen RDA-termi
source: Nationell RDA-term @sv
created: 2017-02-18
modified: 2024-05-24
in scheme: Metatietosanasto
preferred label: Virelais @sv
scope note: Vokaalimusiikissa käytä Laulut.
scope note: I vokalmusik använd Sånger. @sv

Organumit
type: Concept
source: Kansallinen RDA-termi
source: Nationell RDA-term @sv
created: 2017-02-18
modified: 2024-05-24
in scheme: Metatietosanasto
preferred label: Organum @sv

Muunnelmat
type: Concept
source: Kansallinen RDA-termi
source: Nationell RDA-term @sv
created: 2017-02-18
modified: 2024-05-24
alternative label: Diferencias
alternative label: Koraalimuunnelmat
alternative label: Teema ja muunnelma
alternative label: Theme and variations
alternative label: Variaatiot
alternative label: Koralvariationer @sv
alternative label: Tema och variation @sv
in scheme: Metatietosanasto
preferred label: Variationer @sv

Responsoriot
type: Concept
source: Kansallinen RDA-termi
source: Nationell RDA-term @sv
created: 2017-02-18
modified: 2024-05-24
in scheme: Metatietosanasto
preferred label: Responsorier @sv

Resitatiivit ja aariat
type: Concept
source: Kansallinen RDA-termi
source: Nationell RDA-term @sv
created: 2017-02-18
modified: 2024-05-24
in scheme: Metatietosanasto
preferred label: Recitativ och arior @sv

Scénet
type: Concept
source: Kansallinen RDA-termi
source: Nationell RDA-term @sv
created: 2017-02-18
modified: 2024-05-24
alternative label: Näyttämökohtaukset
alternative label: Szenet
in scheme: Metatietosanasto
preferred label: Scéner @sv

Psalmit
type: Concept
source: Kansallinen RDA-termi
source: Nationell RDA-term @sv
created: 2017-02-18
modified: 2024-05-24
in scheme: Metatietosanasto
preferred label: Psaltarpsalmer @sv

Välisoitot
type: Concept
source: Kansallinen RDA-termi
source: Nationell RDA-term @sv
created: 2017-02-18
modified: 2024-05-24
in scheme: Metatietosanasto
preferred label: Mellanspel @sv

Tientot
type: Concept
source: Kansallinen RDA-termi
source: Nationell RDA-term @sv
created: 2017-02-18
modified: 2024-05-24
in scheme: Metatietosanasto
preferred label: Tiento @sv

Panavision
type: Concept
source: RDA-termi
source: RDA-term @sv
created: 2016-01-08
modified: 2023-05-17
definition: Elokuvafilmin esitysformaatti, joka esittää kuvan laajakangaskuvasuhteessa käyttäen Panavisionin anamorfisia linssejä.
definition: Visningsformat för film som visar bilden i wide screen-förhållande genom användning av Panavisions anamorfa linser. @sv
in scheme: Metatietosanasto

Kontratanssit
type: Concept
source: Kansallinen RDA-termi
source: Nationell RDA-term @sv
created: 2017-02-18
modified: 2024-05-24
alternative label: Contratanzet
in scheme: Metatietosanasto
preferred label: Kontradanser @sv

Villanellat
type: Concept
source: Kansallinen RDA-termi
source: Nationell RDA-term @sv
created: 2017-02-18
modified: 2024-05-24
alternative label: Canzona villanescat
alternative label: Villottat
in scheme: Metatietosanasto
preferred label: Villanellor @sv

Tertsetot
type: Concept
source: Kansallinen RDA-termi
source: Nationell RDA-term @sv
created: 2017-02-18
modified: 2024-05-24
alternative label: Terzetter @sv
in scheme: Metatietosanasto
preferred label: Tersetter @sv

Polkat
type: Concept
source: Kansallinen RDA-termi
source: Nationell RDA-term @sv
created: 2017-02-18
modified: 2024-05-24
in scheme: Metatietosanasto
preferred label: Polkor @sv

Requiemit
type: Concept
source: Kansallinen RDA-termi
source: Nationell RDA-term @sv
created: 2017-02-18
modified: 2024-05-24
alternative label: Messa da requiem
alternative label: Missa da requiem
alternative label: Misso pro defunctis
alternative label: Rekviemit
alternative label: Sielunmessut
alternative label: Rekvier @sv
alternative label: Själamässor @sv
in scheme: Metatietosanasto
preferred label: Rekviem @sv

Lamentot
type: Concept
source: Kansallinen RDA-termi
source: Nationell RDA-term @sv
created: 2017-02-18
modified: 2024-05-24
in scheme: Metatietosanasto
preferred label: Lamenton @sv

Partitat
type: Concept
source: Kansallinen RDA-termi
source: Nationell RDA-term @sv
created: 2017-02-18
modified: 2024-05-24
in scheme: Metatietosanasto
preferred label: Partitor @sv

Madrigaalit
type: Concept
source: Kansallinen RDA-termi
source: Nationell RDA-term @sv
created: 2017-02-18
modified: 2024-05-24
alternative label: Madrigalettot
in scheme: Metatietosanasto
preferred label: Madrigaler @sv

Ricercaret
type: Concept
source: Kansallinen RDA-termi
source: Nationell RDA-term @sv
created: 2017-02-18
modified: 2024-05-24
in scheme: Metatietosanasto
preferred label: Ricercarer @sv

Postludit
type: Concept
source: Kansallinen RDA-termi
source: Nationell RDA-term @sv
created: 2017-02-18
modified: 2024-05-24
alternative label: Jälkisoitot
in scheme: Metatietosanasto
preferred label: Postludier @sv

Videoformaatti
type: ConceptGroup
type: Collection
source: RDA-termi
source: RDA-term @sv
created: 2016-01-08
modified: 2023-05-05
definition: Liittää manifestaation analogisen videon koodaukseen käytettyyn standardiin tms.
definition: Sammankopplar manifestation med standard e.d. som används för kodning av analog video. @sv
member: optinen levy
member: EIAJ
member: 8 mm
member: Quadruplex
member: C-tyyppi
member: U-matic
member: Hi-8 mm
member: Betacam
member: VHS
member: Betacam SP
member: M-II
member: Super-VHS
member: Betamax
member: D-2
member: CED
preferred label: Video format @en
preferred label: Videoformat @sv

Ländlerit
type: Concept
source: Kansallinen RDA-termi
source: Nationell RDA-term @sv
created: 2017-02-18
modified: 2024-05-24
in scheme: Metatietosanasto
preferred label: Ländler @sv

Tanssit
type: Concept
source: Kansallinen RDA-termi
source: Nationell RDA-term @sv
created: 2017-02-18
modified: 2024-05-24
alternative label: Dancet
alternative label: Danset
in scheme: Metatietosanasto
preferred label: Danser @sv

Serenatat
type: Concept
source: Kansallinen RDA-termi
source: Nationell RDA-term @sv
created: 2017-02-18
modified: 2024-05-24
in scheme: Metatietosanasto
preferred label: Serenater @sv

Resitatiivit
type: Concept
source: Kansallinen RDA-termi
source: Nationell RDA-term @sv
created: 2017-02-18
modified: 2024-05-24
in scheme: Metatietosanasto
preferred label: Recitativ @sv

Rondinot
type: Concept
source: Kansallinen RDA-termi
source: Nationell RDA-term @sv
created: 2017-02-18
modified: 2024-05-24
in scheme: Metatietosanasto
preferred label: Rondino @sv

Masurkat
type: Concept
source: Kansallinen RDA-termi
source: Nationell RDA-term @sv
created: 2017-02-18
modified: 2024-05-24
alternative label: Mazurkat
alternative label: Mazurkor @sv
in scheme: Metatietosanasto
preferred label: Masurkor @sv

Koraalit
type: Concept
source: Kansallinen RDA-termi
source: Nationell RDA-term @sv
created: 2017-02-18
modified: 2024-05-24
alternative label: Koraalisovitukset
alternative label: Koralbearbetningar @sv
in scheme: Metatietosanasto
preferred label: Koraler @sv

Kvartetot
type: Concept
source: Kansallinen RDA-termi
source: Nationell RDA-term @sv
created: 2017-02-18
modified: 2024-05-24
in scheme: Metatietosanasto
preferred label: Kvartetter (kompositioner) @sv

Sonetit
type: Concept
source: Kansallinen RDA-termi
source: Nationell RDA-term @sv
created: 2017-02-18
modified: 2024-05-24
in scheme: Metatietosanasto
preferred label: Sonetter @sv

Lait
type: Concept
source: Kansallinen RDA-termi
source: Nationell RDA-term @sv
created: 2017-02-18
modified: 2024-05-24
alternative label: Leich't
alternative label: Leich @sv
in scheme: Metatietosanasto
preferred label: Lai @sv

M-II
type: Concept
source: RDA-termi
source: RDA-term @sv
created: 2016-01-08
modified: 2023-05-17
definition: Analogisen nauhan videoformaatti, jonka Panasonic kehitti ammattilaiskäyttöön vuonna 1986.
definition: Videoformat för analogt band, som Panasonic utvecklade för professionellt bruk år 1986. @sv
in scheme: Metatietosanasto

Sonatiinit
type: Concept
source: Kansallinen RDA-termi
source: Nationell RDA-term @sv
created: 2017-02-18
modified: 2024-05-24
in scheme: Metatietosanasto
preferred label: Sonatiner @sv

Sinfoniat
type: Concept
source: Kansallinen RDA-termi
source: Nationell RDA-term @sv
created: 2017-02-18
modified: 2024-05-24
in scheme: Metatietosanasto
preferred label: Sinfonier @sv

Tangot
type: Concept
source: Kansallinen RDA-termi
source: Nationell RDA-term @sv
created: 2017-02-18
modified: 2024-05-24
in scheme: Metatietosanasto
preferred label: Tango @sv

Romanssit
type: Concept
source: Kansallinen RDA-termi
source: Nationell RDA-term @sv
created: 2017-02-18
modified: 2024-05-24
in scheme: Metatietosanasto
preferred label: Romanser @sv

Preludit ja fughetat
type: Concept
source: Kansallinen RDA-termi
source: Nationell RDA-term @sv
created: 2017-02-18
modified: 2024-05-24
in scheme: Metatietosanasto
preferred label: Preludier och fughettor @sv

Rondot
type: Concept
source: Kansallinen RDA-termi
source: Nationell RDA-term @sv
created: 2017-02-18
modified: 2024-05-24
alternative label: Rondeau't
alternative label: Rondeau @sv
in scheme: Metatietosanasto
preferred label: Rondon @sv

Pastoraalit
type: Concept
source: Kansallinen RDA-termi
source: Nationell RDA-term @sv
created: 2017-02-18
modified: 2024-05-24
in scheme: Metatietosanasto
preferred label: Pastoraler @sv

Serenadit
type: Concept
source: Kansallinen RDA-termi
source: Nationell RDA-term @sv
created: 2017-02-18
modified: 2024-05-24
in scheme: Metatietosanasto
preferred label: Serenader @sv

Voltat
type: Concept
source: Kansallinen RDA-termi
source: Nationell RDA-term @sv
created: 2017-02-18
modified: 2024-05-24
in scheme: Metatietosanasto
preferred label: Volta @sv

Magnificatit
type: Concept
source: Kansallinen RDA-termi
source: Nationell RDA-term @sv
created: 2017-02-18
modified: 2024-05-24
in scheme: Metatietosanasto
preferred label: Magnificat @sv

Motetit
type: Concept
source: Kansallinen RDA-termi
source: Nationell RDA-term @sv
created: 2017-02-18
modified: 2024-05-24
in scheme: Metatietosanasto
preferred label: Motetter @sv

Pavanat
type: Concept
source: Kansallinen RDA-termi
source: Nationell RDA-term @sv
created: 2017-02-18
modified: 2024-05-24
alternative label: Paduanat
alternative label: Paduanit
alternative label: Pavanet
alternative label: Pavanit
alternative label: Padovana @sv
alternative label: Paduana @sv
in scheme: Metatietosanasto
preferred label: Pavaner @sv

Sinfoniettat
type: Concept
source: Kansallinen RDA-termi
source: Nationell RDA-term @sv
created: 2017-02-18
modified: 2024-05-24
in scheme: Metatietosanasto
preferred label: Sinfoniettor @sv

Voluntaryt
type: Concept
source: Kansallinen RDA-termi
source: Nationell RDA-term @sv
created: 2017-02-18
modified: 2024-05-24
in scheme: Metatietosanasto
preferred label: Voluntaries @sv

Messut
type: Concept
source: Kansallinen RDA-termi
source: Nationell RDA-term @sv
created: 2017-02-18
modified: 2024-05-24
in scheme: Metatietosanasto
preferred label: Mässor @sv

Offertoriumit
type: Concept
source: Kansallinen RDA-termi
source: Nationell RDA-term @sv
created: 2017-02-18
modified: 2024-05-24
in scheme: Metatietosanasto
preferred label: Offertorier @sv

Oodit
type: Concept
source: Kansallinen RDA-termi
source: Nationell RDA-term @sv
created: 2017-02-18
modified: 2024-05-24
alternative label: Odet
in scheme: Metatietosanasto
preferred label: Oden @sv

Konsertot
type: Concept
source: Kansallinen RDA-termi
source: Nationell RDA-term @sv
created: 2017-02-18
modified: 2024-05-24
alternative label: Concertot
alternative label: Concerto @sv
in scheme: Metatietosanasto
preferred label: Konserter @sv

Laulut
type: Concept
source: Kansallinen RDA-termi
source: Nationell RDA-term @sv
created: 2017-02-18
modified: 2024-05-24
alternative label: Ayret
alternative label: Chansonit
alternative label: Joululaulut
alternative label: Lied
alternative label: Liedit
alternative label: Luuttulaulut
alternative label: Minnelaulut
alternative label: Partsongit
alternative label: Trubaduurilaulu
alternative label: Chansoner @sv
alternative label: Flerstämmiga sånger @sv
alternative label: Julsånger @sv
alternative label: Lieder @sv
alternative label: Lutsånger @sv
alternative label: Minnesånger @sv
alternative label: Trubadursånger @sv
in scheme: Metatietosanasto
preferred label: Sånger @sv

Marssit
type: Concept
source: Kansallinen RDA-termi
source: Nationell RDA-term @sv
created: 2017-02-18
modified: 2024-05-24
alternative label: Juhlamarssit
alternative label: Marchet
alternative label: Surumarssit
alternative label: Jubileumsmarscher @sv
alternative label: Marche @sv
alternative label: Sorgmarscher @sv
in scheme: Metatietosanasto
preferred label: Marscher @sv

Sinfonia concertantet
type: Concept
source: Kansallinen RDA-termi
source: Nationell RDA-term @sv
created: 2017-02-18
modified: 2024-05-24
in scheme: Metatietosanasto
preferred label: Sinfonia concertante @sv

Ritomellit
type: Concept
source: Kansallinen RDA-termi
source: Nationell RDA-term @sv
created: 2017-02-18
modified: 2024-05-24
in scheme: Metatietosanasto
preferred label: Ritomello @sv

Preludit ja fuugat
type: Concept
source: Kansallinen RDA-termi
source: Nationell RDA-term @sv
created: 2017-02-18
modified: 2024-05-24
in scheme: Metatietosanasto
preferred label: Preludier och fugor @sv

Passacagliat
type: Concept
source: Kansallinen RDA-termi
source: Nationell RDA-term @sv
created: 2017-02-18
modified: 2024-05-24
in scheme: Metatietosanasto
preferred label: Passacaglior @sv

Oktetot
type: Concept
source: Kansallinen RDA-termi
source: Nationell RDA-term @sv
created: 2017-02-18
modified: 2024-05-24
in scheme: Metatietosanasto
preferred label: Oktetter @sv

Monodiat
type: Concept
source: Kansallinen RDA-termi
source: Nationell RDA-term @sv
created: 2017-02-18
modified: 2024-05-24
in scheme: Metatietosanasto
preferred label: Monodier @sv

Triot
type: Concept
source: Kansallinen RDA-termi
source: Nationell RDA-term @sv
created: 2017-02-18
modified: 2024-05-24
in scheme: Metatietosanasto
preferred label: Trior @sv

Parafraasit
type: Concept
source: Kansallinen RDA-termi
source: Nationell RDA-term @sv
created: 2017-02-18
modified: 2024-05-24
in scheme: Metatietosanasto
preferred label: Parafraser @sv

Rapsodiat
type: Concept
source: Kansallinen RDA-termi
source: Nationell RDA-term @sv
created: 2017-02-18
modified: 2024-05-24
in scheme: Metatietosanasto
preferred label: Rapsodier @sv

Katrillit
type: Concept
source: Kansallinen RDA-termi
source: Nationell RDA-term @sv
created: 2017-02-18
modified: 2024-05-24
alternative label: Quadrillet
alternative label: Quadriljer @sv
in scheme: Metatietosanasto
preferred label: Kadriljer @sv

Vesperit
type: Concept
source: Kansallinen RDA-termi
source: Nationell RDA-term @sv
created: 2017-02-18
modified: 2024-05-24
in scheme: Metatietosanasto
preferred label: Vesprar @sv

Koraalialkusoitot
type: Concept
source: Kansallinen RDA-termi
source: Nationell RDA-term @sv
created: 2017-02-18
modified: 2024-05-24
in scheme: Metatietosanasto
preferred label: Koralförspel @sv

Passiot
type: Concept
source: Kansallinen RDA-termi
source: Nationell RDA-term @sv
created: 2017-02-18
modified: 2024-05-24
alternative label: Kärsimysnäytelmät
alternative label: Passionsspel @sv
in scheme: Metatietosanasto
preferred label: Passioner @sv

Valssit
type: Concept
source: Kansallinen RDA-termi
source: Nationell RDA-term @sv
created: 2017-02-18
modified: 2024-05-24
alternative label: Valset
alternative label: Valsettet
in scheme: Metatietosanasto
preferred label: Valser @sv

Villancicot
type: Concept
source: Kansallinen RDA-termi
source: Nationell RDA-term @sv
created: 2017-02-18
modified: 2024-05-24
in scheme: Metatietosanasto
preferred label: Villancicor @sv

Romanescat
type: Concept
source: Kansallinen RDA-termi
source: Nationell RDA-term @sv
created: 2017-02-18
modified: 2024-05-24
in scheme: Metatietosanasto
preferred label: Romanescor @sv

Poloneesit
type: Concept
source: Kansallinen RDA-termi
source: Nationell RDA-term @sv
created: 2017-02-18
modified: 2024-05-24
in scheme: Metatietosanasto
preferred label: Polonäser @sv

Saltarellot
type: Concept
source: Kansallinen RDA-termi
source: Nationell RDA-term @sv
created: 2017-02-18
modified: 2024-05-24
in scheme: Metatietosanasto
preferred label: Saltarello @sv

Novellettet
type: Concept
source: Kansallinen RDA-termi
source: Nationell RDA-term @sv
created: 2017-02-18
modified: 2024-05-24
alternative label: Nouvellettet
alternative label: Novellettit
alternative label: Nouvelletter @sv
alternative label: Noveletter @sv
in scheme: Metatietosanasto
preferred label: Novelletter @sv

Sekstetot
type: Concept
source: Kansallinen RDA-termi
source: Nationell RDA-term @sv
created: 2017-02-18
modified: 2024-05-24
in scheme: Metatietosanasto
preferred label: Sextetter (kompositioner) @sv

category of corporate body
type: ConceptGroup
type: Collection
source: RDA-termi
source: RDA-term @sv
created: 2016-01-08
modified: 2025-08-27
alternative label: type of corporate body @en
alternative label: yhteisön tyyppi
alternative label: typ av institution @sv
definition: A type to which a corporate body belongs. @en
definition: Tyyppi, johon yhteisö kuuluu.
definition: Typ till vilken en institution hör. @sv
member: yhtye
member: rykmentti
member: osuuskunta
member: toimintakeskus
member: galleria
member: museo
member: tuomioistuin
member: musiikkikustantamo
member: levy-yhtiö
member: kuoro
member: sekakuoro
member: puhallinkvintetti
member: jousikvartetti
member: pianokvartetti
member: kamariorkesteri
member: pianotrio
member: jousikvintetti
member: pianokvintetti
member: soitinyhtye
member: jousitrio
member: jousiorkesteri
member: puupuhallinkvartetti
member: lauluyhtye
member: naiskuoro
member: unisonokuoro
member: nuorisokuoro
member: mieskuoro
member: lapsikuoro
member: puupuhallinyhtye
member: jousiyhtye
member: puhallinorkesteri
member: vaskipuhallinyhtye
member: puhallinyhtye
member: näppäilysoitinyhtye
member: lyömäsoitinyhtye
member: kosketinsoitinyhtye
member: instituutti
member: säätiö
member: toiminimi
member: puolue
member: koulutuskeskus
member: kaupunki
member: festivaali
member: orkesteri
member: järjestö
member: tutkimusryhmä
member: erityiskoulu
member: valtionpäämies
member: satama
member: yhdistys (julkisoikeudellinen)
member: komitea
member: kunnallinen liikelaitos
member: osakeyhtiö
member: alayksikkö
member: pappisseminaari
member: kansanedustuslaitos
member: divisioona
member: alus
member: toimikunta
member: lautakunta
member: sosiaalihuoltolaitos
member: viranomainen
member: piispainkokous
member: prikaati
member: alioikeus
member: sairaala
member: sotatuomioistuin
member: lentue

Menuetit
type: Concept
source: Kansallinen RDA-termi
source: Nationell RDA-term @sv
created: 2017-02-18
modified: 2024-05-24
alternative label: Menuetot
in scheme: Metatietosanasto
preferred label: Menuetter @sv

Kvintetot
type: Concept
source: Kansallinen RDA-termi
source: Nationell RDA-term @sv
created: 2017-02-18
modified: 2024-05-24
in scheme: Metatietosanasto
preferred label: Kvintetter (kompositioner) @sv

Sonaatit
type: Concept
source: Kansallinen RDA-termi
source: Nationell RDA-term @sv
created: 2017-02-18
modified: 2024-05-24
alternative label: Triosonaatit
alternative label: Triosonater @sv
in scheme: Metatietosanasto
preferred label: Sonater @sv

Passepied't
type: Concept
source: Kansallinen RDA-termi
source: Nationell RDA-term @sv
created: 2017-02-18
modified: 2024-05-24
in scheme: Metatietosanasto
preferred label: Passepieder @sv

Passamezzot
type: Concept
source: Kansallinen RDA-termi
source: Nationell RDA-term @sv
created: 2017-02-18
modified: 2024-05-24
in scheme: Metatietosanasto
preferred label: Passamezzo @sv

Septetot
type: Concept
source: Kansallinen RDA-termi
source: Nationell RDA-term @sv
created: 2017-02-18
modified: 2024-05-24
in scheme: Metatietosanasto
preferred label: Septetter (kompositioner) @sv

Oratoriot
type: Concept
source: Kansallinen RDA-termi
source: Nationell RDA-term @sv
created: 2017-02-18
modified: 2024-05-24
in scheme: Metatietosanasto
preferred label: Oratorier @sv

Sicilianot
type: Concept
source: Kansallinen RDA-termi
source: Nationell RDA-term @sv
created: 2017-02-18
modified: 2024-05-24
in scheme: Metatietosanasto
preferred label: Siciliano @sv

Scherzot
type: Concept
source: Kansallinen RDA-termi
source: Nationell RDA-term @sv
created: 2017-02-18
modified: 2024-05-24
in scheme: Metatietosanasto
preferred label: Scherzon @sv

Nocturnet
type: Concept
source: Kansallinen RDA-termi
source: Nationell RDA-term @sv
created: 2017-02-18
modified: 2024-05-24
alternative label: Nokturnit
in scheme: Metatietosanasto
preferred label: Nocturner @sv

Sarabandet
type: Concept
source: Kansallinen RDA-termi
source: Nationell RDA-term @sv
created: 2017-02-18
modified: 2024-05-24
in scheme: Metatietosanasto
preferred label: Sarabander @sv

Litaniat
type: Concept
source: Kansallinen RDA-termi
source: Nationell RDA-term @sv
created: 2017-02-18
modified: 2024-05-24
in scheme: Metatietosanasto
preferred label: Litanior @sv

Nonetot
type: Concept
source: Kansallinen RDA-termi
source: Nationell RDA-term @sv
created: 2017-02-18
modified: 2024-05-24
in scheme: Metatietosanasto
preferred label: Nonetter @sv

Cassazionet
type: Concept
source: Kansallinen RDA-termi
source: Nationell RDA-term @sv
created: 2017-02-22
modified: 2024-05-24
alternative label: Cassationer @sv
alternative label: Cassazioner @sv
in scheme: Metatietosanasto
preferred label: Kassationer @sv

Estampiet
type: Concept
source: Kansallinen RDA-termi
source: Nationell RDA-term @sv
created: 2017-02-22
modified: 2024-05-24
in scheme: Metatietosanasto
preferred label: Estampier @sv

Applikaatiot
type: Concept
source: Kansallinen RDA-termi
source: Nationell RDA-term @sv
created: 2017-02-22
modified: 2024-05-24
in scheme: Metatietosanasto
preferred label: Application @sv

Liikenotaation tyyppi
type: ConceptGroup
type: Collection
source: RDA-termi
source: RDA-term @sv
created: 2017-02-28
modified: 2023-05-05
definition: Liittää ekspression joukkoon merkkejä tai symboleja, joita käytetään ekspression liikesisällön ilmaisemiseen.
definition: Sammankopplar uttryck med en uppsättning tecken eller symboler som används för att ange rörelseinnehåll i uttrycket. @sv
member: Laban-notaatio
member: Eshkol-Wachman-liikenotaatio
member: action stroke -tanssinotaatio
member: Benesh-liikenotaatio
member: Stepanov-tanssinotaatio
member: Beauchamp-Feuillet-notaatio
member: pelinotaatio
member: DanceWriting
member: Kinetography Laban -notaatio
preferred label: Form of notated movement @en
preferred label: Typ av rörelsenotation @sv

viivastonuottikirjoitus
type: Concept
source: RDA-termi
source: RDA-term @sv
created: 2017-02-28
modified: 2023-05-17
definition: Länsimaisessa taidemusiikissa laajasti käytössä oleva nuottikirjoitusjärjestelmä, jossa sävelkorkeus ja kesto ilmaistaan useista samansuuntaisista viivoista koostuvalla viivastolla usein muiden nuottiviivastojen kanssa olevassa yhdistelmässä. Tavallisessa nuottiviivastossa on viisi viivaa, lyömäsoittimien nuoteissa voi olla 1–4-viivaisia viistoja.
definition: Notskriftssystem som är i allmänt bruk inom västerländsk konstmusik. I ett vanligt notsystem finns fem linjer, för slaginstrument 1-4 linjer. @sv
in scheme: Metatietosanasto
preferred label: staff notation @en
preferred label: traditionell västerländsk notskrift @sv

pistekirjoitus (8-pisteinen)
type: Concept
source: RDA-termi
source: RDA-term @sv
created: 2017-02-28
modified: 2023-05-17
definition: Tuntoaistiin perustuva kirjoitustapa tietotekniikkaan liittyvissä aineistoissa, mahdollistaa symbolien ja ASCII-merkistön esittämisen.
definition: Skrivsätt som baserar sig på känselsinnet, i material som relaterar till datorteknik. Möjliggör visande av symboler och ASCII-tecken. @sv
in scheme: Metatietosanasto
preferred label: computing braille code @en
preferred label: punktskrift (8-punkt) @sv

yhdistelmä (kuvasuhde)
type: Concept
source: RDA-termi
source: RDA-term @sv
created: 2017-02-28
modified: 2023-05-17
alternative label: kombination @sv
definition: Kuvasuhde liikkuvaa kuvaa sisältävälle aineistolle, joka käsittää useita eri kuvasuhteita.
definition: Kombination av bildförhållandena full screen och wide screen. @sv
in scheme: Metatietosanasto
preferred label: mixed aspect ratio @en
preferred label: blandade bildförhållanden @sv

johtostemma
type: Concept
source: Kansallinen RDA-termi
source: Nationell RDA-term @sv
created: 2017-02-28
modified: 2024-10-02
alternative label: johtoääni
definition: Pienehköissä orkestereissa yleisesti käytetty tärkeimpien äänien tiivistelmä, jota myös instrumenttia soittava orkesterin johtaja voi käyttää parituurin sijasta. Katso myös pianojohtostemma ja viulujohtostemma.
definition: Ett sammandrag av de viktigaste stämmorna i en mindre orkester. Kan också användas av orkesterledaren i stället för partitur. Se även pianodirektion och violindirektion. @sv
in scheme: Metatietosanasto
preferred label: conductor score @en
preferred label: dirigentstämma @sv

mensuraalinuottikirjoitus
type: Concept
source: RDA-termi
source: RDA-term @sv
created: 2017-02-28
modified: 2023-05-17
alternative label: mensuralnotskrift @sv
definition: Mensuraalinotaatio eli mensuraalinuottikirjoitus (lat. mensura 'mitta') osoittaa musiikin rytmiä nuottien aika-arvoilla. Järjestelmä oli käytössä 1200–1600-luvulla, ja se on nykyisen viivastonotaation edeltäjä. (Lähde: Wikipedia.)
definition: Mensuralnotation anger musikens rytm med hjälp av noters tidsvärde. Systemet användes mellan 1200- och 1600-talet, och det är föregångare till den moderna notskriften. @sv
in scheme: Metatietosanasto
preferred label: mensural notation @en
preferred label: mensuralnotation @sv

Laban-notaatio
type: Concept
source: RDA-termi
source: RDA-term @sv
created: 2017-02-28
modified: 2023-05-17
definition: Tanssinotaatio, jossa abstrakteilla symboleilla esitetään kehon ja raajojen asentoja takaapäin nähtynä. Notaatio merkitään pystysuoralle kolmiriviselle viivastolle. Kehitetty Yhdysvalloissa ja Iso-Britanniassa 1900-luvun keskivaiheilla.
definition: Dansnotation som med abstrakta symboler visar kroppens och extremiteterna positioner sedda bakifrån. Notationen anges i ett vertikalt linjesystem med tre rader. Utvecklat i USA och Storbritannien vid mitten av 1900-talet. @sv
in scheme: Metatietosanasto
preferred label: Labanotation @en

Kuvasuhdemäärite
type: ConceptGroup
type: Collection
source: RDA-termi
source: RDA-term @sv
created: 2017-02-28
modified: 2026-01-09
definition: Liikkuvan kuvan leveyden suhde kuvan korkeuteen.
definition: I rörlig bild breddens förhållande till höjden. @sv
member: yhdistelmä (kuvasuhde)
member: wide screen
member: full screen
preferred label: Attribut till bildförhållande @sv

Eshkol-Wachman-liikenotaatio
type: Concept
source: RDA-termi
source: RDA-term @sv
created: 2017-02-28
modified: 2023-05-17
definition: Liikenotaatio, jossa käytetään pallokoordinaatistoa ilmaisemaan kehon ja raajojen asentoa.
definition: Rörelsenotation, i vilken ett system med sfäriska koordinater används för att ange kroppens och extremiteternas positioner. @sv
in scheme: Metatietosanasto
preferred label: Eshkol-Wachman movement notation @en
preferred label: Eshkol-Wachmannotation @sv

Nuottikirjoituksen tyyppi
type: ConceptGroup
type: Collection
source: RDA-termi
source: RDA-term @sv
created: 2017-02-28
modified: 2026-03-03
definition: Liittää ekspression joukkoon merkkejä tai symboleja, joita käytetään ekspression musiikillisen sisällön ilmaisemiseen.
definition: Sammankopplar uttryck med en uppsättning tecken eller symboler som används för att uttrycka musikaliskt innehåll i uttrycket. @sv
member: viivastonuottikirjoitus
member: mensuraalinuottikirjoitus
member: tabulatuuri
member: neumikirjoitus
member: kirjainnuottikirjoitus
member: graafinen nuottikirjoitus
member: numeronotaatio
member: ekfoneettinen nuottikirjoitus
member: kenraalibasso
member: tavunuottikirjoitus
member: sointuotteet
member: sointumerkit
member: kuvionuottikirjoitus
preferred label: Form of musical notation @en
preferred label: Typ av musiknotation @sv

action stroke -tanssinotaatio
type: Concept
source: RDA-termi
source: RDA-term @sv
created: 2017-02-28
modified: 2024-05-09
definition: Liikenotaation tyyppi, jossa abstrakteilla symboleilla esitetään kehon ja raajojen asentoja ja liikkeitä.
definition: Typ av rörelsenotation, i vilken kroppens positioner och rörelser beskrivs med abstrakta symboler. @sv
in scheme: Metatietosanasto
preferred label: action stroke-dansnotation @en
preferred label: action stroke dance notation @sv

pistenuottikirjoitus
type: Concept
source: RDA-termi
source: RDA-term @sv
created: 2017-02-28
modified: 2023-05-17
definition: Tuntoaistiin perustuva nuottikirjoitustapa, jossa käytetään pistekirjoitussoluja.
definition: Notskriftsmetod som grundar sig på känselsinnet och i vilken brailleceller används. @sv
in scheme: Metatietosanasto
preferred label: music braille code @en
preferred label: punktskrift för musik @sv

Benesh-liikenotaatio
type: Concept
source: RDA-termi
source: RDA-term @sv
created: 2017-02-28
modified: 2023-05-17
definition: Tanssinotaatio, jossa abstrakteilla symboleilla esitetään kehon ja raajojen asentoja takaapäin nähtynä.
definition: Dansnotation, i vilken kroppens och extremiteternas positioner visas sedda bakifrån och med abstrakta symboler. @sv
in scheme: Metatietosanasto
preferred label: Benesh movement notation @en
preferred label: Beneshnotation @sv

tabulatuuri
type: Concept
source: RDA-termi
source: RDA-term @sv
created: 2017-02-28
modified: 2023-05-17
alternative label: tabit
alternative label: tablaruuri
alternative label: täbit
alternative label: tabbar @sv
alternative label: tablatur @sv
definition: Tabulatuuri (usein myös muodossa tablatuuri, tabit tai täbit) on erityisesti kielisoittimelle tarkoitettu soitto-ohje, joka on verrattavissa pianon nuotteihin. Tabulatuureissa käytetään yleensä kirjain- ja numerosymboleita merkitsemään soitossa käytettävien sormien asettelua. Tabulatuureja käytetään soitto-ohjeina muun muassa kitaralle, bassolle, rummuille, huuliharpulle ja ukulelelle. (Lähde: Wikipedia.)
definition: Med tabulatur avses spelanvisningar som är avsedda speciellt för stränginstrument. I tabulaturskrift används vanligtvis bokstavs- och siffersymboler för att ange hur fingrarna positioneras i spelandet. Tabulatur används vid anvisningar för t.ex. gitarr-, bas-, trum-, munspels- och ukulelespelning. @sv
in scheme: Metatietosanasto
preferred label: tablature @en
preferred label: tabulatur @sv

neumikirjoitus
type: Concept
source: RDA-termi
source: RDA-term @sv
created: 2017-02-28
modified: 2023-05-17
alternative label: neumskrift @sv
definition: Yksiäänisessä bysanttilaisessa, ortodoksisessa ja katolisessa kirkkolaulussa käytetty nuottikirjoitus, jossa rytmiä ei yleensä merkitä. (Lähde: englanninkielinen Wikipedia.)
definition: Notskrift använd i enstämmig bysantisk, ortodox och katolsk kyrkosång. Neumer anger vanligtvis inte rytm. @sv
in scheme: Metatietosanasto
preferred label: neumatic notation @en
preferred label: neumer @sv

Stepanov-tanssinotaatio
type: Concept
source: RDA-termi
source: RDA-term @sv
created: 2017-02-28
modified: 2023-05-17
definition: Tanssinotaatio, jossa musiikkinotaatiota käytetään esittämään kehon yksittäisten osien liikettä.
definition: Dansnotation, i vilken musiknotation används för att visa rörelse i enskilda delar av kroppen. @sv
in scheme: Metatietosanasto
preferred label: Stepanov dance notation @en
preferred label: Stepanovnotation @sv

kuoropartituuri
type: Concept
source: RDA-termi
source: RDA-term @sv
created: 2017-02-28
modified: 2024-10-02
alternative label: vokaalipartituuri (kuoropartituuri)
alternative label: vokalpartitur (körpartitur) @sv
definition: Kuoron harjoituskäyttöön tarkoitettu, kuorolle ja soittimille, mahdollisesti myös solistisille lauluäänille sävelletyn teoksen partituuri, jossa kuoroäänet on merkitty omille viivastoilleen, ja josta soitinsäestys on joko jätetty kokonaan pois tai sisällytetty osittain ja pelkistetysti kosketinsoittimelle tai muille sointusoittimille sovitettuna. Jos soitinsäestys on merkitty täydellisenä, käytetään termiä partituuri. Jos teos on alun perin sävelletty säestyksettömälle kuorolle, käytetään termiä partituuri.
definition: Partitur avsett för körövning, innehållande körens, instrumentens och möjligtvis även solistens stämmor. Körens stämmor är noterade i separata notsystem och ackompanjemanget är bortlämnat helt eller ingår delvis i arrangemang för tangent- eller andra instrument. Om ackompanjemanget är noterat i sin helhet, används termen partitur. Ifall verket ursprungligen är komponerat för kör utan ackompanjemang, används termen partitur. @sv
in scheme: Metatietosanasto
preferred label: chorus score @en
preferred label: körpartitur @sv

pistekirjoitus (6-pisteinen)
type: Concept
source: RDA-termi
source: RDA-term @sv
created: 2017-02-28
modified: 2023-05-17
definition: Tuntoaistiin perustuva kirjoitustapa, jossa kirjoitusmerkit muodostuvat kuuden pisteen kohokuvioista.
definition: Skrivsätt baserat på känselsinnet, i vilket skrivtecknen utgörs av upphöjda mönster med sex punkter. @sv
in scheme: Metatietosanasto
preferred label: braille code @en
preferred label: punktskrift (6-punkt) @sv

kirjainnuottikirjoitus
type: Concept
source: RDA-termi
source: RDA-term @sv
created: 2017-02-28
modified: 2023-05-17
alternative label: bokstavsnotation @sv
alternative label: bokstavsnotskrift @sv
definition: Nuottikirjoitus, jossa sävelkorkeudet on merkitty kirjaimin.
definition: Notation som anger tonhöjd med hjälp av bokstäver. @sv
in scheme: Metatietosanasto
preferred label: letter notation @en
preferred label: bokstavsnotering @sv

Nuottiaineiston muoto
type: ConceptGroup
type: Collection
source: RDA-termi
source: RDA-term @sv
created: 2017-02-28
modified: 2024-04-30
definition: Liittää ekspression ekspressioon sisältyvän nuottikirjoituksen tyypin musiikilliseen tai fyysiseen taittoon.
definition: Sammankopplar uttryck med en musikalisk eller fysisk layout för notskrift som ingår i uttrycket. @sv
member: johtostemma
member: kuoropartituuri
member: stemma
member: partituuri
member: partituurin tiivistelmä
member: viulujohtostemma
member: sävelmänuotti
member: partiselli
member: kuorokirja
member: pianopartituuri
member: table book
member: pienoispartituuri
member: pianojohtostemma
member: soolonuotti
preferred label: Format of Notated Music @en
preferred label: Notmaterialets form @sv

Taktiilin merkkijärjestelmän tyyppi
type: ConceptGroup
type: Collection
source: RDA-termi
source: RDA-term @sv
created: 2017-02-28
modified: 2024-03-13
alternative label: Typ av taktilt system @sv
definition: Liittää ekspression joukkoon merkkejä tai symboleja, joita käytetään kosketeltavassa muodossa olevan ekspression sisällön ilmaisemiseen.
definition: Sammankopplar uttryck med en uppsättning tecken eller symboler som används för att ange innehållet i ett material i taktil form. @sv
member: pistekirjoitus (8-pisteinen)
member: pistenuottikirjoitus
member: pistekirjoitus (6-pisteinen)
member: taktiili nuottikirjoitus
member: Moonin kirjoitus
member: matematiikan pistekirjoitus
member: kohokuva
preferred label: Form of tactile notation @en
preferred label: Typ av taktil notation @sv

taktiili nuottikirjoitus
type: Concept
source: RDA-termi
source: RDA-term @sv
created: 2017-02-28
modified: 2023-05-17
alternative label: kosketeltava nuottikirjoitus
definition: Tuntoaistiin perustuva nuottikirjoitustapa musiikille.
definition: Musiknotation som avläses genom beröring. @sv
in scheme: Metatietosanasto
preferred label: tactile musical notation @en
preferred label: taktil musiknotation @sv

graafinen nuottikirjoitus
type: Concept
source: RDA-termi
source: RDA-term @sv
created: 2017-02-28
modified: 2023-05-17
alternative label: grafisk notering @sv
alternative label: grafisk notskrift @sv
definition: Nuottikirjoitus, jossa musiikkia merkitään perinteisessä nuottikirjoituksessa käytettävistä symboleista eroavien visuaalisten symbolien avulla. (Lähde: englanninkielinen Wikipedia.)
definition: Noterad musik som uttrycker musik med hjälp av grafiska symboler, annorlunda än i traditionell noterad musik. @sv
in scheme: Metatietosanasto
preferred label: graphic notation @en
preferred label: grafisk notation @sv

Beauchamp-Feuillet-notaatio
type: Concept
source: RDA-termi
source: RDA-term @sv
created: 2017-02-28
modified: 2023-05-17
definition: Tanssinotaatio, jossa abstraktit symbolit esittävät jalkojen liikkeitä yhdistettynä samaan aikaan esitettävän musiikin kanssa.
definition: Dansnotation i vilken abstrakta symboler visar fötternas rörelser, förenade med musiken som ska framföras samtidigt. @sv
in scheme: Metatietosanasto
preferred label: Beauchamp-Feuillet notation @en
preferred label: Feuilletnotation @sv

pelinotaatio
type: Concept
source: RDA-termi
source: RDA-term @sv
created: 2017-02-28
modified: 2023-05-17
definition: Liikenotaatio pelaajien tai pelinappuloiden asemien tallentamiseksi pelin aikana.
definition: Rörelsenotation för att lagra spelarnas eller spelknapparnas positioner under spelets gång. @sv
in scheme: Metatietosanasto
preferred label: game play notation @en
preferred label: spelnotation @sv

kartografinen kuva
type: Concept
source: RDA-termi
source: RDA-term @sv
created: 2016-01-08
modified: 2023-05-05
definition: Viivana, muotona, varjostuksena tms. esitetty kartografinen sisältö, joka on tarkoitettu katsottavaksi kaksiulotteisena stillkuvana tai -kuvina. Esimerkiksi kartat, näkymäkartat, kartastot, kaukokartoituskuvat jne.
definition: Kartografiskt innehåll uttryckt som linje, form, skugga e.d., avsett att ses som tvådimensionell stillbild eller -bilder. T.ex. kartor, utsiktskartor, kartböcker och fjärranalysbilder. @sv
in scheme: Metatietosanasto
preferred label: cartographic image @en
preferred label: kartografisk bild @sv

wide screen
type: Concept
source: RDA-termi
source: RDA-term @sv
created: 2017-02-28
modified: 2023-05-17
alternative label: bredbild @sv
definition: Liikkuvan kuvan kuvasuhde, joka on 1.5:1 tai suurempi
definition: Bildförhållande i rörlig bild, som är 1.5:1 eller större. @sv
in scheme: Metatietosanasto

full screen
type: Concept
source: RDA-termi
source: RDA-term @sv
created: 2017-02-28
modified: 2023-05-17
definition: Liikkuvan kuvan kuvasuhde, joka on pienempi kuin 1.5:1
definition: Bildförhållande för rörlig bild, som är mindre än 1.5:1. @sv
in scheme: Metatietosanasto
preferred label: normalbild @sv

DanceWriting
type: Concept
source: RDA-termi
source: RDA-term @sv
created: 2017-02-28
modified: 2023-05-17
definition: Tanssinotaatio, jossa esittävin ja abstraktein symbolein esitetään kehon ja raajojen asentoja ja liikkeitä.
definition: Dansnotation, i vilken kroppens och extremiteternas positioner och rörelser visas med deskriptiva och abstrakta symboler. @sv
in scheme: Metatietosanasto

numeronotaatio
type: Concept
source: RDA-termi
source: RDA-term @sv
created: 2017-02-28
modified: 2024-04-12
alternative label: numeronuottikirjoitus
alternative label: numerisk notation @sv
alternative label: siffernotskrift @sv
definition: Nuottikirjoituksen tyyppi, jossa sävelkorkeus ilmaistaan numeroilla, jotka edustavat asteikon säveliä, kosketinsoittimen koskettimia, kielisoittimen otteita tai nauhoja tai puhallinsoittimen reikiä tai venttiilejä.
definition: Notation i vilken tonhöjder är markerade med siffror. Siffernotation har också använts för att markera tonklasser eller intervall med siffror i teoriböcker som behandlar tolvtonssystem. @sv
in scheme: Metatietosanasto
preferred label: number notation @en
preferred label: siffernotation @sv

Kinetography Laban -notaatio
type: Concept
source: RDA-termi
source: RDA-term @sv
created: 2017-02-28
modified: 2023-05-17
definition: Tanssinotaatio, jossa abstrakteilla symboleilla merkitään pystysuoralle kolmiriviselle viivastolle kehon ja raajojen liikkeitä takaapäin nähtynä. Kehitetty Euroopassa 1900-luvun keskivaiheilla.
definition: Dansnotation, i vilken kroppens rörelser anges sedda bakifrån, med abstrakta symboler på ett lodrätt treradigt linjesystem. Utvecklat i Europa i mitten av 1900-talet. @sv
in scheme: Metatietosanasto
preferred label: Kinetography Laban @en
preferred label: Kinetography Laban-notation @sv

Moonin kirjoitus
type: Concept
source: RDA-termi
source: RDA-term @sv
created: 2017-02-28
modified: 2023-05-17
definition: Tuntoaistiin perustuva kirjoitustapa, joka perustuu yksinkertaistettuihin kirjainmerkkeihin.
definition: Skrivsätt som baserar sig på känselsinnet och på förenklade skrivtecken. @sv
in scheme: Metatietosanasto
preferred label: Moon code @en
preferred label: Moonskrift @sv

matematiikan pistekirjoitus
type: Concept
source: RDA-termi
source: RDA-term @sv
created: 2017-02-28
modified: 2023-05-17
definition: Tuntoaistiin perustuvan kirjoitustavan muoto, jota käytetään matemaattisen ja tieteellisen tiedon kirjoittamiseen.
definition: Form av skrivsätt som baserar sig på känselsinnet och används för författandet av matematiska eller e.d. vetenskapliga texter. @sv
in scheme: Metatietosanasto
preferred label: mathematics braille code @en
preferred label: matematisk punktskrift @sv

kohokuva
type: Concept
source: RDA-termi
source: RDA-term @sv
created: 2017-02-28
modified: 2024-10-03
alternative label: taktil grafik @sv
definition: Tuntoaistiin perustuva merkintätapa, jossa käytetään kohotettua versiota painetusta kuvasta.
definition: Märkning som baserar sig på känselsinnet och i vilket en upphöjd version av en tryckt bild används. @sv
in scheme: Metatietosanasto
preferred label: tactile graphic @en
preferred label: relief @sv

stemma
type: Concept
source: RDA-termi
source: RDA-term @sv
created: 2017-03-01
modified: 2024-10-02
alternative label: ääni
definition: Sellaisen nuottiaineiston muoto, joka sisältää nuotit yhdelle tai useammalle, mutta ei kaikille esittäjille (esimerkiksi viulukonserton viulustemma tai orkesteriteoksen harppustemma).
definition: Notmaterial bestående av noter för en eller flera, men inte alla, framförare (t.ex. violinstämmorna i en violinkonsert eller harpstämman i ett orkesterverk.) @sv
in scheme: Metatietosanasto
preferred label: part @en
preferred label: stämma @sv

CAD
type: Concept
source: Kansallinen RDA-termi
source: Nationell RDA-term @sv
created: 2016-01-08
modified: 2024-05-24
in scheme: Metatietosanasto

partituuri
type: Concept
source: RDA-termi
source: RDA-term @sv
created: 2017-03-01
modified: 2024-10-02
alternative label: score @en
definition: Sellaisen nuottiaineiston muoto, joka koostuu graafisesta, symbolisesta tai sanallisesta nuottikirjoituksesta, ja johon sisältyy kokoonpanon kaikkien stemmojen sisältö. Nuottiaineistosta, joka edustaa teosta yhdelle soittimelle tai yhdelle soittajalle, käytetään termiä soolonuotti.
definition: Nottryck som består av grafisk, symbolisk eller verbal notskrift, och i vilken hela orkesterbesättningens stämmor ingår. För notskrift för ett instrument eller för en musiker används termen solonot. @sv
in scheme: Metatietosanasto
preferred label: (full) score @en
preferred label: partitur @sv

partituurin tiivistelmä
type: Concept
source: RDA-termi
source: RDA-term @sv
created: 2017-03-01
modified: 2024-10-02
definition: Partituuri, jossa nuottiviivastojen määrä on rajattu kahteen tai muutamaan, yleensä soitinryhmittäin järjestettynä ja usein sisältäen viittauksia yksittäisiin ääniin.
definition: Partitur i vilket notlinjernas mängd har begränsats till två eller några, vanligen ordnade i instrumentgrupper och ofta innehållande hävisningar till enskilda stämmor. @sv
in scheme: Metatietosanasto
preferred label: condensed score @en
preferred label: reducerat partitur @sv

soitonopas
type: Concept
source: Kansallinen RDA-termi
source: Nationell RDA-term @sv
created: 2017-03-01
modified: 2023-05-17
definition: Soitonopetusaineistoa sisältävä nuottiaineisto.
definition: Resurs för musikundervisning innehållande notmaterial. @sv
in scheme: Metatietosanasto
preferred label: instrumentskola @sv
scope note: Soitonoppaan kaltaiset aineistot, joissa nuottiaineiston osuus on tekstiaineistoon verrattuna vähäinen, käsitellään tekstiaineistona.
scope note: Resurser som påminner om instrumentskolor, men har mindre notmaterial än textmaterial, bör behandlas på samma sätt som textresurser. @sv

viulujohtostemma
type: Concept
source: RDA-termi
source: RDA-term @sv
created: 2017-03-01
modified: 2024-10-02
definition: Yhtyeen tai orkesterin viulistin esitysstemma, jossa on viitteitä muihin soittimiin, jotta stemman soittaja voi myös johtaa yhtyettä. Katso myös johtostemma ja pianojohtostemma.
definition: Framförandestämma för en ensembles eller orkesters violinist, i vilken hänvisningar till övriga instrument framkommer så att violinisten kan leda ensemblen. Se även dirigentstämma och pianodirektion. @sv
in scheme: Metatietosanasto
preferred label: violin conductor part @en
preferred label: violindirektion @sv

sävelmänuotti
type: Concept
source: Kansallinen RDA-termi
source: Nationell RDA-term @sv
created: 2017-03-01
modified: 2024-10-02
alternative label: sävelmänuotinnos
definition: Populaari- tai kansanmusiikin nuottiaineisto, joka sisältää vokaali- ja/tai soitinteoksen yksinkertaistetun nuotinnoksen (sisältää yleensä pelkästään melodian ja sointumerkit tai melodian yksinkertaistetulla pianosäestyksellä).
definition: Notmaterial för populär- eller folkmusik, som innehåller förenklad notation för ett vokalt och/eller instrumentalt verk (innehåller vanligen endast melodi och ackordbeteckningar eller melodi med förenklat pianoackompanjemang). @sv
in scheme: Metatietosanasto
preferred label: melodinoter @sv

partiselli
type: Concept
source: Kansallinen RDA-termi
source: Nationell RDA-term @sv
created: 2017-03-01
modified: 2024-10-02
alternative label: compressed score @en
alternative label: short score @en
definition: Muutamalle (2–5) viivastolle pelkistetty yhtye- tai orkesteriteoksen partituuri, jota käytetään esimerkiksi sävellys- ja sovitustyössä ennen varsinaisen partituurin kirjoittamista. Termiä on syytä käyttää vain silloin, kun se esiintyy itse julkaisussa.
definition: Förenklad ensemble- eller orkesterpartitur på 2-5 linjer som används i t.ex. tonsättning eller arrangemang innan skrivandet av det egentliga partituret. Används endast ifall termen anges i själva publikationen. @sv
in scheme: Metatietosanasto
preferred label: close score @en
preferred label: particell @sv

kuorokirja
type: Concept
source: RDA-termi
source: RDA-term @sv
created: 2017-03-01
modified: 2024-10-02
alternative label: korbok @sv
definition: Suuri, kuoron eteen telineelle asetettava nuottikirja. Jokainen ääni on nuotinnettu erikseen yleensä noudattaen asetelmaa, jossa avoinna olevassa kirjassa lehden kääntöpuolella ovat sopraano- ja tenoriäänet ja seuraavan lehden etupuolella altto- ja bassoäänet.
definition: Stor bok med notskrift som placeras på notställ framför kör. Varje stämma är separat noterad. Vanligtvis är sopran- och tenorstämmorna uppställda på uppslagets vänstra sida, alt- och basstämmorna på uppslagets högra sida. @sv
in scheme: Metatietosanasto
preferred label: choir book @en
preferred label: körbok @sv

pianopartituuri
type: Concept
source: RDA-termi
source: RDA-term @sv
created: 2017-03-01
modified: 2024-10-02
alternative label: vokaalipartituuri (pianopartituuri)
alternative label: klaverutdrag @sv
alternative label: vokalpartitur (pianopartitur) @sv
definition: Ensisijaisesti harjoituskäyttöön tarkoitettu, soololauluäänille/kuorolle ja/tai solistisille soittimille ja orkesterille sävelletyn teoksen pelkistys versioksi, jossa laulu- ja soolosoitinäänet ovat partituurimuodossa ja koko teoksen orkesterisäestys on sovitettu kosketinsoittimelle. Kuoron harjoituskäyttöön tarkoitetusta partituurista käytetään termiä kuoropartituuri. Termiä vokaalipartituuri ei käytetä nuottiaineiston muodon merkitsemisessä
definition: I första hand ämnad för övning, en förenklad version av ett verk komponerat för soloröst/kör och/eller soloinstrument/orkester i vilket sång- och soloinstrumentstämman är i partiturformat och hela verkets orkesterackompanjemang är anpassat till tangentinstrument. För partitur avsett för körövning används termen körpartitur. @sv
in scheme: Metatietosanasto
preferred label: pianopartitur @sv

omakätinen käsikirjoitus
type: Concept
source: Kansallinen RDA-termi
source: Nationell RDA-term @sv
created: 2016-01-08
modified: 2025-10-04
definition: Käytetään manifestaatiosta, jonka sisältämän teoksen tai teosten vastuullisuustekijä tai -tekijät on itse kirjoittanut käsin.
definition: Anges om en manifestation som innehåller verk som en upphovsman själv skrivit ner för hand. @sv
in scheme: Metatietosanasto
preferred label: holograph @en
preferred label: egenhändig handskrift @sv

teorianopas
type: Concept
source: Kansallinen RDA-termi
source: Nationell RDA-term @sv
created: 2017-03-01
modified: 2023-05-17
definition: Musiikinteorian opetusaineistoa sisältävä nuottiaineisto.
definition: Notmaterial som innehåller undervisningsmaterial för musikteori. @sv
in scheme: Metatietosanasto
preferred label: teoribok @sv
scope note: Musiikinteorian aineistot, joissa nuottiaineiston osuus on tekstiaineistoon verrattuna vähäinen, käsitellään tekstiaineistona.
scope note: Musikteoretiskt material, i vilket notmaterialets andel är liten jämfört med textmaterialets, behandlas som textmaterial. @sv

table book
type: Concept
source: RDA-termi
source: RDA-term @sv
created: 2017-03-01
modified: 2024-10-02
definition: Nuottikirja, joka on tehty asetettavaksi pöydälle ja näytettäväksi siten, että esittäjät voivat lukea stemmansa istuessaan tai seistessään pöydän ympärillä. Jokainen stemma nuotinnetaan erikseen ja asetellaan yleensä siten, että kirjan ollessa auki eri stemmat esitetään käännetyssä ja/tai kohtisuorassa asennossa.
definition: Bok med notskrift, avsedd att läggas fram på ett bord på ett sådant sätt att framförarna kan avläsa sin stämma sittande eller stående runt bordet. Varje stämma noteras skilt och arrangeras vanligtvis så, att när boken ligger öppen står olika stämmor upp och nedvänt och/eller vinkelrätt mot varandra. @sv
in scheme: Metatietosanasto

pienoispartituuri
type: Concept
source: RDA-termi
source: RDA-term @sv
created: 2017-03-01
modified: 2024-10-02
alternative label: miniature score @en
alternative label: fickpartitur @sv
definition: Pienennetyssä muodossa julkaistu partituuri, ei tarkoitettu ensisijaisesti esityskäyttöön. Aineistossa esiintyy tavallisesti kuvaileva ilmaus, kuten "pienoispartituuri", "Miniature score", "Taschenpartitur", "Partition de poche" tms.
definition: Partitur som publicerats i förminskat format, inte avsett i första hand för användning vid framförande. I materialet förekommer vanligen någon beskrivande fras, såsom "studiepartitur", "Miniature score", "Taschenpartitur", "Partition de poche" e.d. @sv
in scheme: Metatietosanasto
preferred label: study score @en
preferred label: Partition de poche @fr
preferred label: studiepartitur @sv

pianojohtostemma
type: Concept
source: RDA-termi
source: RDA-term @sv
created: 2017-03-01
modified: 2024-10-02
definition: Yhtyeen tai orkesterin pianistin esitysstemma, jossa on viitteitä muihin soittimiin, jotta stemman soittaja voi myös johtaa yhtyettä. Katso myös johtostemma ja viulujohtostemma.
definition: Framförandestämma för ensemblens eller orkesterns pianist, i vilken hänvisningar till övriga instrument framkommer så att pianisten kan leda ensemblen. Se även dirigentstämma och violindirektion. @sv
in scheme: Metatietosanasto
preferred label: piano conductor part @en
preferred label: pianodirektion @sv

soolonuotti
type: Concept
source: Kansallinen RDA-termi
source: Nationell RDA-term @sv
created: 2017-03-01
modified: 2024-10-02
alternative label: soolonuotinnos
alternative label: solonoter @sv
alternative label: solostämma @sv
definition: Nuottiaineisto, joka sisältää yhdelle soittimelle tai yhdelle esittäjälle tarkoitetun musiikkiteoksen nuotinnoksen (esimerkiksi Beethovenin Für Elise (pianolle), Messiaenin Le banquet céleste (uruille), Xenakiksen Pléïades (lyömäsoittimille) ja Debussyn Syrinx (huilulle))
definition: Nottryck som består av notskrift för ett instrument eller en framförare, t.ex. Beethovens Für Elise (för piano), Messiaens Le banquet céleste (för orgel), Xenakis Pléïades (för slaginstrument) och Debussys Syrinx (för flöjt). @sv
in scheme: Metatietosanasto
preferred label: solonot @sv

mikrokorttikasetti
type: Concept
source: RDA-termi
source: RDA-term @sv
created: 2017-03-01
modified: 2023-05-17
definition: Kasetti, joka sisältää mikrokortteja.
definition: Kassett som innehåller mikroficher. @sv
in scheme: Metatietosanasto
preferred label: microfiche casette @en
preferred label: mikrofichekassett @sv
scope note: Mikromuotoinen tallenne.
scope note: Mikroformsbärare. @sv

sävelmäkokoelma
type: Concept
source: Kansallinen RDA-termi
source: Nationell RDA-term @sv
created: 2017-03-01
modified: 2024-07-05
definition: Populaari- tai kansanmusiikin nuottiaineisto, joka koostuu sävelmänuoteista eli vokaali- ja/tai soitinteosten yksinkertaistetuista nuotinnoksista (sisältävät yleensä pelkästään melodian ja sointumerkit tai melodian yksinkertaistetulla pianosäestyksellä).
definition: Notmaterial för populär- eller folkmusik, bestående av melodinoter, alltså förenklade noter för vokala och/eller instrumentala verk (innehåller vanligen endast melodi och ackordbeteckningar eller melodi med förenklat pianoackompanjemang). @sv
in scheme: Metatietosanasto
preferred label: melodisamling @sv

laulunopas
type: Concept
source: Kansallinen RDA-termi
source: Nationell RDA-term @sv
created: 2017-03-01
modified: 2023-05-17
definition: Laulunopetusaineistoa sisältävä nuottiaineisto.
definition: Notmaterial för sångundervisning. @sv
in scheme: Metatietosanasto
preferred label: sångskola (publikation) @sv
scope note: Laulunoppaan kaltaiset aineistot, joissa nuottiaineiston osuus on tekstiaineistoon verrattuna vähäinen, käsitellään tekstiaineistona.
scope note: Material som påminner om sångskolor, men i vilket notmaterialet utgör en mindre andel än textmaterialet, behandlas som textmaterial. @sv

fiktiivinen yhteisö
type: Concept
source: Kansallinen RDA-termi
source: Nationell RDA-term @sv
created: 2017-03-02
modified: 2025-10-21
in scheme: Metatietosanasto
preferred label: fiktiv institution @sv
scope note: Ei ole RDA:n mukainen toimija.
scope note: Är inte en aktör i enlighet med RDA. @sv

romaani
type: Concept
source: Kansallinen RDA-termi
source: Nationell RDA-term @sv
created: 2017-06-01
modified: 2024-11-14
in scheme: Metatietosanasto
preferred label: roman @sv
scope note: Teoksen muoto -terminä käytetään erottamaan toisistaan samannimiset teokset.
scope note: Verkets form-termer används för att åtskilja verk med samma namn. @sv

kuunnelma
type: Concept
source: Kansallinen RDA-termi
source: Nationell RDA-term @sv
created: 2017-06-01
modified: 2024-11-14
in scheme: Metatietosanasto
preferred label: hörspel @sv
scope note: Teoksen muoto -termejä käytetään erottamaan toisistaan samannimiset teokset.
scope note: Verkets form-termer används för att åtskilja verk med samma namn. @sv

näytelmä
type: Concept
source: Kansallinen RDA-termi
source: Nationell RDA-term @sv
created: 2017-06-01
modified: 2024-11-14
in scheme: Metatietosanasto
preferred label: skådespel @sv
scope note: Teoksen muoto -terminä käytetään erottamaan samannimiset teokset toisistaan.
scope note: Verkets form-termer används för att åtskilja verk med samma namn. @sv

satu
type: Concept
source: Kansallinen RDA-termi
source: Nationell RDA-term @sv
created: 2017-06-01
modified: 2024-11-14
in scheme: Metatietosanasto
preferred label: saga @sv
scope note: Teoksen muoto -termejä käytetään erottamaan toisistaan samannimiset teokset.
scope note: Verkets form-termer används för att åtskilja verk med samma namn. @sv

kansansatu
type: Concept
source: Kansallinen RDA-termi
source: Nationell RDA-term @sv
created: 2017-06-01
modified: 2024-11-14
in scheme: Metatietosanasto
preferred label: folksaga @sv
scope note: Teoksen muoto -termejä käytetään erottamaan toisistaan samannimiset teokset.
scope note: Verkets form-termer används för att åtskilja verk med samma namn. @sv

koreografia
type: Concept
source: Kansallinen RDA-termi
source: Nationell RDA-term @sv
created: 2017-06-01
modified: 2024-11-14
in scheme: Metatietosanasto
preferred label: koreografi @sv
scope note: Teoksen muoto -termejä käytetään erottamaan toisistaan samannimiset teokset.
scope note: Verkets form-termer används för att åtskilja verk med samma namn. @sv

runo
type: Concept
source: Kansallinen RDA-termi
source: Nationell RDA-term @sv
created: 2017-06-01
modified: 2024-11-14
in scheme: Metatietosanasto
preferred label: dikt @sv
scope note: Teoksen muoto -termejä käytetään erottamaan toisistaan samannimiset teokset.
scope note: Verkets form-termer används för att åtskilja verk med samma namn. @sv

novelli
type: Concept
source: Kansallinen RDA-termi
source: Nationell RDA-term @sv
created: 2017-06-01
modified: 2024-11-14
in scheme: Metatietosanasto
preferred label: novell @sv
scope note: Teoksen muoto -termejä käytetään erottamaan toisistaan samannimiset teokset.
scope note: Verkets form-termer används för att åtskilja verk med samma namn. @sv

tiedosto
type: Concept
source: Kansallinen RDA-termi
source: Nationell RDA-term @sv
created: 2017-06-01
modified: 2024-11-14
in scheme: Metatietosanasto
preferred label: fil @sv
scope note: Teoksen muoto -termejä käytetään erottamaan toisistaan samannimiset teokset.
scope note: Verkets form-termer används för att åtskilja verk med samma namn. @sv

isä
type: Concept
source: Kansallinen RDA-termi
source: Nationell RDA-term @sv
created: 2016-01-08
modified: 2024-05-24
definition: Varsinkin katolisten tai ortodoksisten pappien tai muiden hengenmiehien arvonimi.
definition: Hederstitel för präster e.d. andliga män, särskilt inom katolska eller ortodoxa kyrkan. @sv
in scheme: Metatietosanasto
preferred label: fader @sv

kuvaliite
type: Concept
source: Kansallinen RDA-termi
source: Nationell RDA-term @sv
created: 2017-07-06
modified: 2025-10-04
in scheme: Metatietosanasto
preferred label: bildbilaga @sv

pelikortti
type: Concept
source: Kansallinen RDA-termi
source: Nationell RDA-term @sv
created: 2017-09-01
modified: 2023-10-25
in scheme: Metatietosanasto
preferred label: spelkort @sv

DCP
type: Concept
source: Kansallinen RDA-termi
source: Nationell RDA-term @sv
created: 2017-10-13
modified: 2024-05-24
definition: Digital Cinema Package on nimitys standardoidulle tavalle tomittaa elokuvien esityskopiot teattereihin digitaalisessa muodossa.
definition: Digital Cinema Package är en benämning på ett standardiserat sätt att leverera filmers visningskopior i digitalt format till teatrar. @sv
in scheme: Metatietosanasto

WAV
type: Concept
source: Kansallinen RDA-termi
source: Nationell RDA-term @sv
created: 2016-01-08
modified: 2024-05-24
alternative label: Waveform Audio File @en
in scheme: Metatietosanasto
scope note: Äänen koodausmuoto, tiedostopääte .wav, .wave
scope note: Kodningsformat för ljud, filändelse .wav, .wave @sv

videopeli
type: Concept
source: Kansallinen RDA-termi
source: Nationell RDA-term @sv
created: 2017-10-18
modified: 2024-11-14
in scheme: Metatietosanasto
preferred label: videospel @sv
scope note: Teoksen muoto -termejä käytetään erottamaan toisistaan samannimiset teokset.
scope note: Verkets form-termer används för att åtskilja verk med samma namn. @sv

peli
type: Concept
source: Kansallinen RDA-termi
source: Nationell RDA-term @sv
created: 2017-10-18
modified: 2024-11-14
in scheme: Metatietosanasto
preferred label: spel @sv
scope note: Teoksen muoto -termejä käytetään erottamaan toisistaan samannimiset teokset.
scope note: Verkets form-termer används för att åtskilja verk med samma namn. @sv

kreivitär
type: Concept
source: Kansallinen RDA-termi
source: Nationell RDA-term @sv
created: 2017-11-30
modified: 2024-05-24
definition: Kreivin puoliso; (naimisissa oleva tai ollut) kreivin tytär.
definition: Greves maka; greves dotter (som är eller har varit gift). @sv
in scheme: Metatietosanasto
preferred label: grevinna @sv

ruhtinas
type: Concept
source: Kansallinen RDA-termi
source: Nationell RDA-term @sv
created: 2017-11-30
modified: 2024-05-24
definition: Eräiden ylhäisten aatelissukujen päämies tai miespuolinen jäsen, eräiden pienten valtioiden hallitsijasta; yleensä miespuolinen hallitsija tai hallitsijahuoneen jäsen.
definition: Huvudman för eller manlig medlem i vissa förnäma adelssläkter, om vissa mindre staters regent; vanligen manlig regent eller medlem i furstehus. @sv
in scheme: Metatietosanasto
preferred label: furste @sv

laatikko
type: Concept
source: Kansallinen RDA-termi
source: Nationell RDA-term @sv
created: 2018-01-27
modified: 2025-10-04
example: 1 laatikko (5 opetustaulua)
example: 1 låda (5 skolplanscher) @sv
in scheme: Metatietosanasto
preferred label: låda @sv

kotelo
type: Concept
source: RDA-termi
source: RDA-term @sv
created: 2018-01-27
modified: 2023-05-17
definition: Laajuuden yksikkö, muodostuu sidottuja tai sitomattomia aineistoja sisältävästä laatikosta.
definition: Enhet, består av låda som innehåller inbundna eller oinbundna resurser. @sv
example: Esim. 1 kotelo (25 korttia) tai 1 kotelo (52 pelikorttia)
example: 1 fodral (52 spelkort) @sv
in scheme: Metatietosanasto
preferred label: case @en
preferred label: fodral @sv

Runot
type: Concept
source: Kansallinen RDA-termi
source: Nationell RDA-term @sv
created: 2018-03-30
modified: 2024-05-24
definition: Vakiintunut kokoava nimeke kokoelmalle, joka käsittää kaikki toimijan kirjoittamat runot. Jos kokoelmassa ei ole kaikkia runoja, tietoon lisätään termi Valikoima.
definition: Grupptitel för en samling som innefattar alla dikter skrivna av en aktör. Om samlingen inte innehåller alla dikter, anges också termen Urval @sv
in scheme: Metatietosanasto
preferred label: Poems @en
preferred label: Dikter @sv

Libretot
type: Concept
source: Kansallinen RDA-termi
source: Nationell RDA-term @sv
created: 2018-03-30
modified: 2024-05-24
definition: Vakiintunut kokoava nimeke kokoelmalle, joka käsittää kaikki toimijan kirjoittamat libretot. Jos kokoelmassa ei ole kaikkia librettoja, tietoon lisätään termi Valikoima.
definition: Grupptitel för en samling som innefattar alla libretton som skrivits av samma aktör. Om samlingen inte innehåller alla libretton anges också termen Urval. @sv
in scheme: Metatietosanasto
preferred label: Libretton @sv

Kirjeet
type: Concept
source: Kansallinen RDA-termi
source: Nationell RDA-term @sv
created: 2018-03-30
modified: 2024-05-24
definition: Vakiintunut kokoava nimeke kokoelmalle, joka käsittää kaikki toimijan kirjoittamat kirjeet. Jos kokoelmassa ei ole kaikkia kirjeitä, tietoon lisätään termi Valikoima.
definition: Grupptitel för en samling som innehåller alla brev som en aktör skrivit. Om samlingen inte innehåller alla brev anges också termen Urval. @sv
in scheme: Metatietosanasto
preferred label: Correspondence @en
preferred label: Korrespondens @sv

Puheet
type: Concept
source: Kansallinen RDA-termi
source: Nationell RDA-term @sv
created: 2018-03-30
modified: 2024-05-24
alternative label: Tal (föredrag) @sv
definition: Vakiintunut kokoava nimeke kokoelmalle, joka käsittää kaikki toimijan pitämät puheet. Jos kokoelmassa ei ole kaikkia puheita, tietoon lisätään termi Valikoima.
definition: Grupptitel för en samling som innefattar alla tal skrivna av en aktör. Om samlingen inte innehåller alla tal anges också termen Urval. @sv
example: MARC 21 -formaatissa 240 10 ‡a Puheet. ‡k Valikoima
example: I MARC 21-formatet 240 10 ‡a Tal. ‡k Urval @sv
in scheme: Metatietosanasto
preferred label: Speeches @en
preferred label: Tal @sv

Näytelmät
type: Concept
source: Kansallinen RDA-termi
source: Nationell RDA-term @sv
created: 2018-03-30
modified: 2024-05-24
definition: Vakiintunut kokoava nimeke kokoelmalle, joka käsittää kaikki toimijan kirjoittamat näytelmät. Jos kokoelmassa ei ole kaikkia näytelmiä, tietoon lisätään termi Valikoima.
definition: Grupptitel för en samling som innefattar alla skådespel skrivna av en aktör. Om samlingen inte innehåller alla skådespel anges också termen Urval. @sv
in scheme: Metatietosanasto
preferred label: Plays @en
preferred label: Dramatik @sv

Proosateokset
type: Concept
source: Kansallinen RDA-termi
source: Nationell RDA-term @sv
created: 2018-03-30
modified: 2024-05-24
definition: Vakiintunut kokoava nimeke kokoelmalle, joka käsittää kaikki toimijan kirjoittamat proosateokset. Jos kokoelmassa ei ole kaikkia proosateoksia, tietoon lisätään termi Valikoima.
definition: Grupptitel för en samling som innefattar alla prosaverk skrivna av samma aktör. Om samlingen inte innehåller alla prosaverk anges också termen Urval. @sv
in scheme: Metatietosanasto
preferred label: Prose works @en
preferred label: Prosa @sv

Sanoitukset
type: Concept
source: Kansallinen RDA-termi
source: Nationell RDA-term @sv
created: 2018-03-30
modified: 2024-05-24
definition: Vakiintunut kokoava nimeke kokoelmalle, joka käsittää kaikki toimijan kirjoittamat sanoitukset. Jos kokoelmassa ei ole kaikkia sanoituksia, tietoon lisätään termi Valikoima.
definition: Grupptitel för en samling som innefattar alla sångtexter skrivna av en aktör. Om samlingen inte innehåller alla sångtexter anges också termen Urval. @sv
in scheme: Metatietosanasto
preferred label: Lyrics @en
preferred label: Sångtexter @sv

Romaanit
type: Concept
source: Kansallinen RDA-termi
source: Nationell RDA-term @sv
created: 2018-03-30
modified: 2024-05-24
definition: Vakiintunut kokoava nimeke kokoelmalle, joka käsittää kaikki toimijan kirjoittamat romaanit. Jos kokoelmassa ei ole kaikkia romaaneja, tietoon lisätään termi Valikoima.
definition: Grupptitel för en samling som innefattar alla romaner skrivna av en aktör. Om samlingen inte innehåller alla romaner anges också termen Urval. @sv
in scheme: Metatietosanasto
preferred label: Novels @en
preferred label: Romaner @sv

Esseet
type: Concept
source: Kansallinen RDA-termi
source: Nationell RDA-term @sv
created: 2018-03-30
modified: 2024-05-24
definition: Vakiintunut kokoava nimeke kokoelmalle, joka käsittää kaikki toimijan kirjoittamat esseet. Jos kokoelmassa ei ole kaikkia esseitä, tietoon lisätään termi Valikoima.
definition: Grupptitel för en samling som innefattar alla essäer skrivna av en aktör. Om samlingen inte innehåller alla essäer anges också termen Urval. @sv
in scheme: Metatietosanasto
preferred label: Essays @en
preferred label: Essäer @sv

Novellit
type: Concept
source: Kansallinen RDA-termi
source: Nationell RDA-term @sv
created: 2018-03-30
modified: 2024-05-24
definition: Vakiintunut kokoava nimeke kokoelmalle, joka käsittää kaikki toimijan kirjoittamat novellit. Jos kokoelmassa ei ole kaikkia novelleja, tietoon lisätään termi Valikoima.
definition: Grupptitel för en samling som innefattar alla noveller skrivna av samma aktör. Om samlingen inte innehåller alla noveller anges också termen Urval. @sv
in scheme: Metatietosanasto
preferred label: Short stories @en
preferred label: Noveller @sv

korttipakka
type: Concept
source: Kansallinen RDA-termi
source: Nationell RDA-term @sv
created: 2018-04-04
modified: 2023-05-17
definition: Laajuuden yksikkö, joka on muodostuu irrallisten korttien säilyttämiseen pakkana.
definition: Enhet som utgörs av lösa kort som förvaras tillsammans i en packe. @sv
example: 302 sivua : kuvitettu ; 25 cm + 1 korttipakka (78 korttia)
example: 302 sidor : illustrerad ; 25 cm + 1 kortlek (78 kort) @sv
in scheme: Metatietosanasto
preferred label: kortlek @sv

profiili
type: Concept
source: RDA-termi
source: RDA-term @sv
created: 2018-04-04
modified: 2024-04-12
definition: Laajuuden yksikkö on mittakaavassa esitetty poikkileikkaus pystysuorasta pinnasta, joka voi olla tasossa oleva kuvaus maanpinnasta tai liittyä jatkuvasti jakautuvien ilmiöiden kolmiulotteiseen malliin.
definition: Enhet som är en skalenlig framställning av skärningspunkten mellan en vertikal yta och markytan, eller skärningspunkten mellan en sådan vertikal yta och en tredimensionell modell som representerar fenomen med kontinuerlig utbredning. @sv
in scheme: Metatietosanasto
preferred label: profile @en
preferred label: profil @sv

palsta
type: Concept
source: RDA-termi
source: RDA-term @sv
created: 2018-04-04
modified: 2023-05-17
definition: Laajuuden yksikkö, kahdelle tai useammalle pystysuoralle saman sivun osalle jaetun tekstin yksi pystysuora osa.
definition: Enhet, textstycke som utgör en del av vertikal indelning av sidans text i två eller flera stycken. @sv
in scheme: Metatietosanasto
preferred label: column @en
preferred label: kolumn @sv

kuntoiluväline
type: Concept
source: Kansallinen RDA-termi
source: Nationell RDA-term @sv
created: 2018-04-04
modified: 2023-05-17
alternative label: konditionsredskap @sv
alternative label: träningsredskap @sv
example: 1 kuntoiluväline
example: 3 kuntoiluvälinettä (1 kahvakuula, 2 käsipainoa)
example: 1 motionsredskap @sv
example: 3 motionsredskap (1 kettlebell, 2 hantlar) @sv
in scheme: Metatietosanasto
preferred label: motionsredskap @sv
scope note: Voidaan käyttää yleistermiä tai tarkempia termejä, esim. kahvakuula, käsipaino jne.
scope note: Allmän term eller mer specifika termer kan användas, t.ex. kettlebell, hantlar etc. @sv

kansio
type: Concept
source: RDA-termi
source: RDA-term @sv
created: 2018-04-04
modified: 2023-05-17
preferred label: portfolio
definition: Laajuuden yksikkö, joka on kotelo irrallisen aineiston säilyttämiseen. Koostuu yleensä kahdesta kannesta jotka on liitetty takana yhteen.
definition: Enhet, som är fodral för förvaring av löst material. Utgörs vanligen av två pärmar som är förenade i ryggen. @sv
in scheme: Metatietosanasto
preferred label: mapp @sv

työväline
type: Concept
source: Kansallinen RDA-termi
source: Nationell RDA-term @sv
created: 2018-04-04
modified: 2023-05-17
alternative label: arbetsverktyg @sv
example: 3 työvälinettä
example: 3 työvälinettä (1 saha, 1 puutarhasakset)
example: 3 arbetsredskap @sv
example: 3 arbetsredskap (1 såg, 1 trädgårdssax) @sv
in scheme: Metatietosanasto
preferred label: arbetsredskap @sv
scope note: Voidaan käyttää yleistermiä tai tarkempia termejä, esim. roskapihdit, puutarhasakset jne.
scope note: Allmän term eller mer specifika termer kan användas, t.ex. såg, trädgårdssax etc. @sv

lehti
type: Concept
source: RDA-termi
source: RDA-term @sv
created: 2018-04-04
modified: 2026-02-03
definition: Laajuuden yksikkö on niteen alayksiköksi sidottu tai muuten kiinnitetty yksittäinen arkki. Lehti koostuu lehden kahdella puolelle sijoittuvista sivuista, joista jompikumpi tai molemmat voivat olla tyhjiä.
definition: Enhet som är ett ark som sammanbundits eller på annat sätt sammanfogats till en underordnad enhet av en volym. Ett blad består av sidorna på bägge sidor av bladet, av vilka en eller bägge kan vara tomma. @sv
example: 21 lehteä, 1 taitelehti : kuvitettu ; 44 cm
example: 21 blad, 1 folder : illustrationer ; 44 cm @sv
in scheme: Metatietosanasto
preferred label: leaf @en
preferred label: blad @sv
scope note: Monikossa lehteä.

edge track
type: Concept
source: RDA-termi
source: RDA-term @sv
created: 2016-01-08
modified: 2023-05-17
definition: Ääniraita, joka on sijoitettu lähelle filmirullan reunaa.
definition: Ljudspår som placerats nära filmrullens kant. @sv
in scheme: Metatietosanasto
preferred label: kantspår @sv

sivu
type: Concept
source: RDA-termi
source: RDA-term @sv
created: 2018-04-04
modified: 2023-12-19
definition: Laajuuden yksikkö, muodostuu lehden yhdestä puolesta.
definition: Enhet, omfattar den ena ytan av ett tvåsidigt blad. @sv
example: 1 verkkoaineisto (34 sivua)
example: 66 sivua : kuvitettu, karttoja ; 28 cm
example: 1 nätresurs (34 sidor) @sv
example: 66 sidor : illustrationer, kartor ; 28 cm @sv
in scheme: Metatietosanasto
preferred label: page @en
preferred label: sida @sv

äänisylinteri
type: Concept
source: RDA-termi
source: RDA-term @sv
created: 2016-01-08
modified: 2023-05-17
definition: Rullamainen esine, jonka pintaan on kaiverrettu tai uurrettu äänisignaaleja yhtenäiseksi kiertäväksi uraksi. Esim. vahasylinterit yms.
definition: Föremål format som en rulle, på vars yta ljudsignaler skurits eller ristats in i ett enhetligt, cirkulärt spår. T.ex. vaxcylinder. @sv
in scheme: Metatietosanasto
preferred label: audio cylinder @en
preferred label: ljudcylinder @sv
scope note: Äänitallenne.
scope note: Ljudbärare. @sv

kaksipuolinen
type: Concept
source: RDA-termi
source: RDA-term @sv
created: 2016-01-08
modified: 2023-05-17
definition: Layout molemmin puolin arkkia.
definition: Layout på båda sidorna av ett ark. @sv
in scheme: Metatietosanasto
preferred label: double sided @en
preferred label: dubbelsidig @sv

lakka
type: Concept
source: RDA-termi
source: RDA-term @sv
created: 2016-01-08
modified: 2023-05-17
definition: Läpinäkyvänä tai värillisenä pinnoitteena käytettävä materiaali, joka koostuu haihtuvien orgaanisten yhdisteiden tai muista liuoksista muodostetuista polyymeereistä tai akryyliyhdisteistä. Muodostaa kuivuneena kovan ja kestävän pinnan.
definition: Transparent eller färgat material använt som ytbeläggning, som består av avdunstande organiska föreningar eller polymerer och akrylföreningar som består av andra lösningar. Bildar som torkad en hård och beständig yta. @sv
in scheme: Metatietosanasto
preferred label: lacquer @en
preferred label: lack @sv

Opiskelutaso
type: ConceptGroup
type: Collection
source: Kansallinen RDA-termi
source: Nationell RDA-term @sv
created: 2018-04-28
modified: 2024-05-24
member: aikuisopiskelu
member: ammatillinen koulutus
member: aikuiskoulutus
member: lukio
member: peruskoulu
member: korkeakoulu
preferred label: Educational level @en
preferred label: Utbildningsnivå @sv
scope note: Käytetään määrittämään ryhmän jäsenten opiskelutasoa kuvaavia termejä (esim. aikuisopiskelu, peruskoulu, lukio).
scope note: Används för att bestämma termer som beskriver utbildningsnivå hos medlemmar av en grupp (t.ex. vuxenstudier, grundskola, gymnasium). @sv

Kieli
type: ConceptGroup
type: Collection
source: Kansallinen RDA-termi
source: Nationell RDA-term @sv
created: 2018-04-28
modified: 2024-10-04
preferred label: Language @en
preferred label: Språk @sv
scope note: Käytetään määrittämään ryhmän jäsenten kielellisyyttä kuvaavia termejä (esim. englanninkieliset, ruotsinkieliset, suomenkieliset) YSO-sanastosta kieleen liittyvä rooli.
scope note: Används för att bestämma termer som beskriver språk hos medlemmar av en grupp (t.ex. engelskspråkiga, svenskspråkiga, finskspråkiga) ur ALLFO roll relaterad till språk. @sv

Ikä
type: ConceptGroup
type: Collection
source: Kansallinen RDA-termi
source: Nationell RDA-term @sv
created: 2018-04-28
modified: 2024-10-04
member: Ikäsuositus
preferred label: Age @en
preferred label: Ålder @sv
scope note: Käytetään määrittämään ryhmän jäsenten kronologista ikää kuvaavia termejä (esim. Ikäsuositus: yli 3-vuotiaille). Voidaan käyttää myös YSOn termejä ikään liittyvä rooli.
scope note: Används för att bestämma termer som beskriver kronologisk ålder hos medlemmar av en grupp (t.ex. Åldersrekommendation: för över 3-åringar). Även termer ur ALLFO kan användas roll relaterad till ålder. @sv

MPEG-4
type: Concept
source: Kansallinen RDA-termi
source: Nationell RDA-term @sv
created: 2016-01-08
modified: 2024-05-24
in scheme: Metatietosanasto

rinnakkainen päänimeke
type: Concept
source: RDA-termi
source: RDA-term @sv
created: 2016-01-08
modified: 2023-08-15
in scheme: Metatietosanasto
preferred label: parallel title proper @en
preferred label: parallell huvudtitel @sv
scope note: Päänimeke toisella kielellä ja/tai kirjoitusjärjestelmällä.
scope note: Huvudtitel på ett annat språk och/eller skriftsystem. @sv

äänetön
type: Concept
source: RDA-termi
source: RDA-term @sv
created: 2018-05-05
modified: 2025-05-29
alternative label: mykkä
alternative label: stum @sv
alternative label: tyst @sv
definition: Äänisisältömerkintä aineistolle, joka ei sisällä ääntä.
definition: Uppgift om ljudinnehåll för resurser som inte innehåller ljud. @sv
in scheme: Metatietosanasto
preferred label: silent @en
preferred label: ljudlös @sv

Äänisisältö
type: ConceptGroup
type: Collection
source: RDA-termi
source: RDA-term @sv
created: 2018-05-05
modified: 2024-04-13
definition: Liittää manifestaation ilmaukseen manifestaation sisältämän äänen mukanaolosta tai puuttumisesta.
definition: Sammankopplar manifestation med en uppgift om ljud som manifestationen innehåller, eller som den saknar. @sv
member: äänetön
member: ääni
preferred label: Sound content @en
preferred label: Ljudinnehåll @sv

ääni
type: Concept
source: RDA-termi
source: RDA-term @sv
created: 2018-05-05
modified: 2024-04-13
definition: Äänisisältömerkintä aineistolle, joka sisältää ääntä.
definition: Uppgift om ljudinnehåll för resurser som innehåller ljud. @sv
in scheme: Metatietosanasto
preferred label: sound @en
preferred label: ljud @sv

Valikoima
type: Concept
source: Kansallinen RDA-termi
source: Nationell RDA-term @sv
created: 2018-06-01
modified: 2024-05-24
definition: Kahta tai usempaa kohteeseen sisältyvää teosta tai teoksen osaa identifioidessa merkitään auktorisoitu hakutieto tai vakiintunut kokoava nimeke, jota seuraa sana Valikoima. Valikoima voidaan merkitä myös kahta tai useampaa numeroimatonta tai muuta kuin peräkkäistä osaa identifioitaessa osien ensisijaiseksi nimekkeeksi
definition: För att identifiera ett objekt i vilket två eller flera verk eller delar av verk ingår används auktoriserad sökterm eller grupptitel, följd av ordet Urval. Urval kan också användas som föredragen titel för att identifiera två eller flera onumrerade delar eller delar som inte är efterföljande. @sv
example: Homeros. Ilias. Valikoima.
example: Sullivan, Arthur, 1842-1900. Oopperat. Valikoima. Libretot.
example: The Simpsons (televisio-ohjelma). Valikoima.
example: Homeros. Illiaden. Urval. @sv
example: Sullivan, Arthur, 1842-1900. Operor. Urval. Libretton. @sv
in scheme: Metatietosanasto
preferred label: Urval @sv

Runeberg Junior -palkinto
type: Concept
source: Kansallinen RDA-termi
source: Nationell RDA-term @sv
created: 2018-06-01
modified: 2023-05-17
definition: Myönnetään suomen- tai ruotsinkieliselle lastenkirjalle, jonka kohderyhmänä ovat 6-9-vuotiaat lapset. Palkinto myönnettiin ensimmäisen kerran 5.2.2017
definition: Priset tilldelas en finsk- eller svenskspråkig barnbok som riktas till åldergruppen 6-9 år. Det utdelades första gången den 5.2.2017. @sv
example: MARC 21 -formaatissa: 586 ## ‡a Runeberg Junior -palkinto, 2020
example: I MARC 21-formatet: 586 ## ‡a Runeberg Junior-priset, 2020 @sv
in scheme: Metatietosanasto
preferred label: Runeberg Junior-priset @sv

seinätekstiili
type: Concept
source: Kansallinen RDA-termi
source: Nationell RDA-term @sv
created: 2018-06-13
modified: 2024-11-14
alternative label: seinävaate
alternative label: väggbonad @sv
in scheme: Metatietosanasto
preferred label: väggtextil @sv
scope note: Teoksen muoto -termejä käytetään erottamaan toisistaan samannimiset teokset.
scope note: Verkets form-termer används för att åtskilja verk med samma namn. @sv

ammatillinen koulutus
type: Concept
source: Kansallinen RDA-termi
source: ONIX-termi
source: Nationell RDA-term @sv
source: ONIX-term @sv
created: 2018-06-14
modified: 2024-05-24
in scheme: Metatietosanasto
preferred label: yrkesutbildning @sv

aikuiskoulutus
type: Concept
source: Kansallinen RDA-termi
source: ONIX-termi
source: Nationell RDA-term @sv
source: ONIX-term @sv
created: 2018-06-14
modified: 2024-05-24
in scheme: Metatietosanasto
preferred label: vuxenutbildning @sv

lukio
type: Concept
source: Kansallinen RDA-termi
source: ONIX-termi
source: Nationell RDA-term @sv
source: ONIX-term @sv
created: 2018-06-14
modified: 2024-05-24
alternative label: lukio (opiskelutaso)
alternative label: gymnasium (utbildningsnivå) @sv
in scheme: Metatietosanasto
preferred label: gymnasiet @sv

peruskoulu
type: Concept
source: Kansallinen RDA-termi
source: ONIX-termi
source: Nationell RDA-term @sv
source: ONIX-term @sv
created: 2018-06-14
modified: 2024-05-24
alternative label: peruskoulu (opiskelutaso)
alternative label: grundskolan (utbildningsnivå) @sv
in scheme: Metatietosanasto
preferred label: grundskolan @sv

korkeakoulu
type: Concept
source: Kansallinen RDA-termi
source: ONIX-termi
source: Nationell RDA-term @sv
source: ONIX-term @sv
created: 2018-06-14
modified: 2024-05-24
alternative label: korkeakoulu (opiskelutaso)
alternative label: högskola (utbildningsnivå) @sv
in scheme: Metatietosanasto
preferred label: högskola @sv

Huomautus manifestaatiosta
type: ConceptGroup
type: Collection
source: RDA-termi
source: RDA-term @sv
created: 2018-06-15
modified: 2025-09-16
member: Huomautus nimekkeestä
preferred label: Note on manifestation @en
preferred label: Anmärkning om manifestation @sv

12:o
type: Concept
source: RDA-termi
source: RDA-term @sv
created: 2016-01-08
modified: 2023-05-17
definition: Kirjan formaatti muodostuu yhdestä tai useammasta lehdestä, jotka ovat kooltaan 1/12 painoarkista.
definition: Bokens format består av ett eller flera blad som till sin storlek är 1/12 av ett tryckark. @sv
in scheme: Metatietosanasto
preferred label: 12mo @en

kielletty alle 7-vuotiailta
type: Concept
source: Kansallinen RDA-termi
source: Nationell RDA-term @sv
created: 2018-08-09
modified: 2025-03-04
in scheme: Metatietosanasto
preferred label: förbjuden under 7 år @sv

sallittu kaikenikäisille
type: Concept
source: Kansallinen RDA-termi
source: Nationell RDA-term @sv
created: 2018-08-09
modified: 2025-05-29
alternative label: kielletty alle 3-vuotiailta
alternative label: förbjuden under 3 år @sv
in scheme: Metatietosanasto
preferred label: tillåten för alla åldrar @sv

kielletty alle 16-vuotiailta
type: Concept
source: Kansallinen RDA-termi
source: Nationell RDA-term @sv
created: 2018-08-09
modified: 2025-03-04
in scheme: Metatietosanasto
preferred label: förbjuden under 16 år @sv

kaava-arkki
type: Concept
source: Kansallinen RDA-termi
source: Nationell RDA-term @sv
created: 2018-08-10
modified: 2025-10-04
in scheme: Metatietosanasto
preferred label: mönsterark @sv
scope note: laajuuden yksikkö
scope note: enhet @sv

sarjakuva
type: Concept
source: Kansallinen RDA-termi
source: Nationell RDA-term @sv
created: 2018-08-10
modified: 2024-11-14
in scheme: Metatietosanasto
preferred label: tecknad serie @sv
scope note: Teoksen muoto -termejä käytetään erottamaan toisistaan samannimiset teokset.
scope note: Verkets form-termer används för att åtskilja verk med samma namn. @sv

nimiösivu puutteellinen
type: Concept
source: Kansallinen RDA-termi
source: Nationell RDA-term @sv
created: 2018-08-10
modified: 2024-05-24
example: MARC 21 562 ## ‡a Kpl 2: Nimiösivu puutteellinen.
example: MARC 21 562 ## ‡a Ex 2: Titelsidan ofullständig. @sv
in scheme: Metatietosanasto
preferred label: titelsidan ofullständig @sv

filmikasetti
type: Concept
source: RDA-termi
source: RDA-term @sv
created: 2016-01-08
modified: 2023-05-17
definition: Kasetti, joka sisältää elokuvafilmin.
definition: Kassett som innehåller spelfilm. @sv
in scheme: Metatietosanasto
preferred label: film cassette @en
preferred label: filmkassett @sv
scope note: Heijastettava kuvatallenne.
scope note: Bärare för projicerbara bilder. @sv

AIFF
type: Concept
source: Kansallinen RDA-termi
source: Nationell RDA-term @sv
created: 2018-09-15
modified: 2024-05-24
alternative label: Audio Interchange File Format
in scheme: Metatietosanasto
scope note: Äänen koodausmuoto, tiedostopääte .aiff, .aif, .aifc
scope note: Kodningsformat för ljud, filändelse .aiff, .aif, .aifc . @sv

ACC
type: Concept
source: Kansallinen RDA-termi
source: Nationell RDA-term @sv
created: 2018-09-15
modified: 2024-05-24
alternative label: Audio Interchange File Format @en
in scheme: Metatietosanasto
scope note: Äänen koodausmuoto, tiedostopääte .m4a, .m4b, .m4p, .m4v, .m4r, .3gp, .mp4, .aac .
scope note: Kodningsformat för ljud, filändelse .m4a, .m4b, .m4p, .m4v, .m4r, .3gp, .mp4, .aac . @sv

ekfoneettinen nuottikirjoitus
type: Concept
source: Kansallinen RDA-termi
source: Nationell RDA-term @sv
created: 2018-10-13
modified: 2025-10-04
definition: Nuottikirjoitus, joka perustuu laulettavan tekstin yhteyteen lisättyihin sävelkuvioita yms. kuvastaviin kirjaimiin, pisteisiin ja muihin graafisiin elementteihin.
definition: Notskrift som grundar sig på tonfigurer och andra dylika beskrivande bokstäver, punkter och andra grafiska element som tillfogats i samband med text som ska sjungas. @sv
in scheme: Metatietosanasto
preferred label: ekfonetisk notation @sv

virastomestari
type: Concept
source: Kansallinen RDA-termi
source: YSO-termi
source: ALLFO-term @sv
source: Nationell RDA-term @sv
created: 2018-11-01
modified: 2024-08-27
alternative label: office caretakers @en
alternative label: virastomestarit
in scheme: Metatietosanasto
preferred label: office caretaker @en
preferred label: expeditionsmästare @sv

sosiaalipoliitikko
type: Concept
source: Kansallinen RDA-termi
source: YSO-termi
source: ALLFO-term @sv
source: Nationell RDA-term @sv
created: 2018-11-01
modified: 2024-08-27
alternative label: social politicians @en
alternative label: sosiaalipoliitikot
in scheme: Metatietosanasto
preferred label: social politician @en
preferred label: socialpolitiker @sv

työvoimaneuvoja
type: Concept
source: Kansallinen RDA-termi
source: YSO-termi
source: ALLFO-term @sv
source: Nationell RDA-term @sv
created: 2018-11-01
modified: 2024-08-27
alternative label: employment counsellors @en
alternative label: työvoimaneuvojat
alternative label: arbetskraftskonsulenter @sv
in scheme: Metatietosanasto
preferred label: employment counsellor @en
preferred label: arbetskraftsrådgivare @sv

karjakko
type: Concept
source: Kansallinen RDA-termi
source: YSO-termi
source: ALLFO-term @sv
source: Nationell RDA-term @sv
created: 2018-11-01
modified: 2024-08-27
alternative label: milkers @en
alternative label: milkmaids @en
alternative label: karjakot
alternative label: dejor @sv
alternative label: kreaturskötare @sv
alternative label: mjölkpigor @sv
in scheme: Metatietosanasto
preferred label: milker @en
preferred label: mjölkpiga @sv

uimavalvoja
type: Concept
source: Kansallinen RDA-termi
source: YSO-termi
source: ALLFO-term @sv
source: Nationell RDA-term @sv
created: 2018-11-01
modified: 2024-08-27
alternative label: lifeguards @en
alternative label: uimavalvojat
alternative label: uinninvalvojat
alternative label: badvakter @sv
alternative label: simövervakare @sv
in scheme: Metatietosanasto
preferred label: lifeguard @en
preferred label: badvakt @sv

tietolevy
type: Concept
source: RDA-termi
source: RDA-term @sv
created: 2016-01-08
modified: 2025-10-31
definition: Levy joka sisältää tietoa digitaalisessa muodossa optisesti tai magneettisesti tallennettuna.
definition: Skiva som innehåller digitala data, lagrade optiskt eller magnetiskt. @sv
in scheme: Metatietosanasto
preferred label: computer disc @en
preferred label: datorskiva @sv
scope note: Tietokonetallenne.
scope note: Datorbärare. @sv

omaishoitaja
type: Concept
source: Kansallinen RDA-termi
source: YSO-termi
source: ALLFO-term @sv
source: Nationell RDA-term @sv
created: 2018-11-01
modified: 2024-08-27
alternative label: family caregivers @en
alternative label: omaishoitajat
alternative label: anhörigvårdare @sv
in scheme: Metatietosanasto
preferred label: family caregiver @en
preferred label: närståendevårdare @sv

muurari
type: Concept
source: Kansallinen RDA-termi
source: YSO-termi
source: ALLFO-term @sv
source: Nationell RDA-term @sv
created: 2018-11-01
modified: 2024-08-27
alternative label: bricklayers @en
alternative label: muurarit
in scheme: Metatietosanasto
preferred label: bricklayer @en
preferred label: murare @sv

profession or occupation
type: ConceptGroup
type: Collection
source: RDA-termi
source: RDA-term @sv
created: 2018-11-01
modified: 2026-05-06
definition: A vocation or avocation. @en
definition: Henkilön ammatti tai harrastus.
definition: En persons yrke eller hobby. @sv
member: virastomestari
member: fagotisti
member: sosiaalipoliitikko
member: työvoimaneuvoja
member: karjakko
member: urheiluohjaaja
member: mediataiteilija
member: poliittinen avustaja
member: ajoneuvoasentaja
member: uimavalvoja
member: uittopäällikkö
member: suksiseppä
member: erikoislääkäri
member: omaishoitaja
member: kymmenottelija
member: museojohtaja
member: lumilautailija
member: lehtori (kirkon työntekijä)
member: kansantaiteilija
member: sosiaaliterapeutti
member: ampuja
member: muurari
member: kuntoutusohjaaja
member: meklari
member: johtaja
member: koulutoimenjohtaja
member: liikenneopettaja
member: lapsityönohjaaja
member: ohjaaja (kasvatus ja opastus)
member: liikunnanohjaaja
member: tinanvalaja
member: teologi
member: leipuri
member: kirjanpitäjä
member: pormestari
member: karjatalousteknikko
member: työnjohtaja
member: tekninen eristäjä
member: koripalloilija
member: sotilashenkilö
member: kenttäpiispa
member: turkistarhaaja
member: psykoterapeutti
member: perheterapeutti
member: elokuvatutkija
member: laulaja
member: muusikko
member: kampaajamestari
member: eversti
member: kuntajohtaja
member: kauppalanjohtaja
member: satamatyöntekijä
member: yhteiskunnallinen vaikuttaja
member: kansakoulunopettaja
member: linja-autonkuljettaja
member: sisustusarkkitehti
member: ratsastaja
member: urheilija
member: automaatioasentaja
member: asentaja
member: ensihoitaja
member: opintopsykologi
member: šaahi
member: hallitsija
member: ahtaaja
member: uimaopettaja
member: rakennuspeltiseppä
member: LVI-asentaja
member: yleislääkäri
member: jalkaterapeutti
member: pukuompelija

tinanvalaja
type: Concept
source: Kansallinen RDA-termi
source: YSO-termi
source: ALLFO-term @sv
source: Nationell RDA-term @sv
created: 2018-11-01
modified: 2024-08-27
alternative label: tin founders @en
alternative label: tinanvalajat
in scheme: Metatietosanasto
preferred label: tin founder @en
preferred label: tennstöpare @sv

kirjanpitäjä
type: Concept
source: Kansallinen RDA-termi
source: YSO-termi
source: ALLFO-term @sv
source: Nationell RDA-term @sv
created: 2018-11-01
modified: 2024-08-27
alternative label: accountants @en
alternative label: bookkeepers @en
alternative label: kirjanpitäjät
in scheme: Metatietosanasto
preferred label: bookkeeper @en
preferred label: bokförare @sv

pormestari
type: Concept
source: Kansallinen RDA-termi
source: YSO-termi
source: ALLFO-term @sv
source: Nationell RDA-term @sv
created: 2018-11-01
modified: 2024-08-27
alternative label: pormestari (ammatti)
alternative label: borgmästare (yrke) @sv
in scheme: Metatietosanasto
preferred label: borgmästare @sv

tekninen eristäjä
type: Concept
source: Kansallinen RDA-termi
source: YSO-termi
source: ALLFO-term @sv
source: Nationell RDA-term @sv
created: 2018-11-01
modified: 2024-08-27
alternative label: technical insulators @en
alternative label: tekniset eristäjät
alternative label: tekniska isolerare @sv
in scheme: Metatietosanasto
preferred label: technical insulator @en
preferred label: teknisk isolerare @sv

sisustusarkkitehti
type: Concept
source: Kansallinen RDA-termi
source: YSO-termi
source: ALLFO-term @sv
source: Nationell RDA-term @sv
created: 2018-11-01
modified: 2024-08-27
alternative label: sisustusarkkitehdit
alternative label: inredningsarkitekter @sv
in scheme: Metatietosanasto
preferred label: inredningsarkitekt @sv

šaahi
type: Concept
source: Kansallinen RDA-termi
source: YSO-termi
source: ALLFO-term @sv
source: Nationell RDA-term @sv
created: 2018-11-01
modified: 2025-10-30
alternative label: shahs @en
alternative label: shaahit
alternative label: šaahit
alternative label: schaher @sv
alternative label: shaher @sv
in scheme: Metatietosanasto
preferred label: shah @en

hallitsija
type: Concept
source: Kansallinen RDA-termi
source: YSO-termi
source: ALLFO-term @sv
source: Nationell RDA-term @sv
created: 2018-11-01
modified: 2025-10-30
alternative label: ruler (profession) @en
alternative label: rulers @en
alternative label: hallitsija (ammatti)
alternative label: hallitsijat
alternative label: härskare @sv
alternative label: regent (yrke) @sv
alternative label: regenter @sv
in scheme: Metatietosanasto
preferred label: ruler (role) @en
preferred label: regent @sv

ahtaaja
type: Concept
source: Kansallinen RDA-termi
source: YSO-termi
source: ALLFO-term @sv
source: Nationell RDA-term @sv
created: 2018-11-01
modified: 2024-08-27
alternative label: stevedores @en
alternative label: ahtaajat
in scheme: Metatietosanasto
preferred label: stevedore @en
preferred label: stuvare @sv

arkki
type: Concept
source: RDA-termi
source: RDA-term @sv
created: 2016-01-08
modified: 2023-05-17
definition: Tallennetyyppi, joka koostuu litteästä palasta ohutta paperia, muovia tms.
definition: Bärartyp som består av ett platt stycke tunt papper, plast e.d. @sv
in scheme: Metatietosanasto
preferred label: sheet @en
preferred label: ark @sv
scope note: Ilman laitetta käytettävä tallenne.
scope note: Omedierad bärare. @sv

jalkaterapeutti
type: Concept
source: Kansallinen RDA-termi
source: YSO-termi
source: ALLFO-term @sv
source: Nationell RDA-term @sv
created: 2018-11-01
modified: 2024-08-27
alternative label: podiatrists @en
alternative label: jalkaterapeutit
alternative label: fotterapeuter @sv
in scheme: Metatietosanasto
preferred label: podiatrist @en
preferred label: fotterapeut @sv

olympiavoittaja
type: Concept
source: Kansallinen RDA-termi
source: YSO-termi
source: ALLFO-term @sv
source: Nationell RDA-term @sv
created: 2018-11-01
modified: 2024-08-27
alternative label: Olympic medalists @en
alternative label: Olympic winners @en
alternative label: olympiavoittajat
in scheme: Metatietosanasto
preferred label: Olympic winner @en
preferred label: olympiamästare @sv

radiosähköttäjä
type: Concept
source: Kansallinen RDA-termi
source: YSO-termi
source: ALLFO-term @sv
source: Nationell RDA-term @sv
created: 2018-11-01
modified: 2024-08-27
alternative label: radio operators @en
alternative label: radiosähköttäjät
alternative label: radiotelegrafister @sv
definition: Radiosähköttäjä lähettää ja vastaanottaa viestejä käyttäen radioaaltoja.
definition: En radiotelegrafist skickar och tar emot meddelanden med hjälp av radiovågor. @sv
in scheme: Metatietosanasto
preferred label: radio operator @en
preferred label: radiotelegrafist @sv

kaavoittaja
type: Concept
source: Kansallinen RDA-termi
source: YSO-termi
source: ALLFO-term @sv
source: Nationell RDA-term @sv
created: 2018-11-01
modified: 2024-08-27
alternative label: land use planners @en
alternative label: kaavoittajat
in scheme: Metatietosanasto
preferred label: land use planner @en
preferred label: planläggare @sv

perämies
type: Concept
source: Kansallinen RDA-termi
source: YSO-termi
source: ALLFO-term @sv
source: Nationell RDA-term @sv
created: 2018-11-01
modified: 2024-08-27
alternative label: navigating officers @en
alternative label: perämiehet
alternative label: styrmän @sv
in scheme: Metatietosanasto
preferred label: navigating officer @en
preferred label: styrman @sv

lasinpuhaltaja
type: Concept
source: Kansallinen RDA-termi
source: YSO-termi
source: ALLFO-term @sv
source: Nationell RDA-term @sv
created: 2018-11-01
modified: 2024-08-27
alternative label: glassblowers @en
alternative label: lasinpuhaltajat
in scheme: Metatietosanasto
preferred label: glassblower @en
preferred label: glasblåsare @sv

HDTV
type: Concept
source: RDA-termi
source: RDA-term @sv
created: 2016-01-08
modified: 2023-05-17
definition: Teräväpiirtotelevision mukaan nimetty lähetysstandardi, joka on digitaalisen television koodausjärjestelmä.
definition: Sändningsformat namngett enligt högupplösningstelevision (HD), som är ett kodningssystem för digital television. @sv
in scheme: Metatietosanasto

laitosapulainen
type: Concept
source: Kansallinen RDA-termi
source: YSO-termi
source: ALLFO-term @sv
source: Nationell RDA-term @sv
created: 2018-11-01
modified: 2024-08-27
alternative label: nursing aids @en
alternative label: laitosapulaiset
alternative label: anstaltsbiträden @sv
in scheme: Metatietosanasto
preferred label: nursing aid @en
preferred label: anstaltsbiträde @sv

notaari
type: Concept
source: Kansallinen RDA-termi
source: YSO-termi
source: ALLFO-term @sv
source: Nationell RDA-term @sv
created: 2018-11-01
modified: 2024-08-27
alternative label: notaries @en
alternative label: notaarit
alternative label: notarier @sv
in scheme: Metatietosanasto
preferred label: notary @en
preferred label: notarie @sv

desantti
type: Concept
source: Kansallinen RDA-termi
source: YSO-termi
source: ALLFO-term @sv
source: Nationell RDA-term @sv
created: 2018-11-01
modified: 2024-08-27
alternative label: desantniks @en
alternative label: desantit
alternative label: desanter @sv
in scheme: Metatietosanasto
preferred label: desantnik @en
preferred label: desant @sv

vartiopäällikkö
type: Concept
source: Kansallinen RDA-termi
source: YSO-termi
source: ALLFO-term @sv
source: Nationell RDA-term @sv
created: 2018-11-01
modified: 2024-08-27
alternative label: guard commanders @en
alternative label: vartiopäälliköt
alternative label: vaktchefer @sv
in scheme: Metatietosanasto
preferred label: guard commander @en
preferred label: vaktchef @sv

kuntotarkastaja
type: Concept
source: Kansallinen RDA-termi
source: YSO-termi
source: ALLFO-term @sv
source: Nationell RDA-term @sv
created: 2018-11-01
modified: 2024-08-27
alternative label: condition surveyors @en
alternative label: kuntotarkastajat
in scheme: Metatietosanasto
preferred label: condition inspector @en
preferred label: konditionsgranskare @sv

ohjelmistokehittäjä
type: Concept
source: Kansallinen RDA-termi
source: YSO-termi
source: ALLFO-term @sv
source: Nationell RDA-term @sv
created: 2018-11-01
modified: 2024-08-27
alternative label: ohjelmistokehittäjä (ammatti)
alternative label: programutvecklare (yrke) @sv
in scheme: Metatietosanasto
preferred label: software developer @en
preferred label: programutvecklare @sv

Cinemiracle
type: Concept
source: RDA-termi
source: RDA-term @sv
created: 2016-01-08
modified: 2023-05-17
definition: Elokuvafilmin esitysformaatti, jonka kuvasuhde on 2.59:1 ja joka käyttää kolmea synkronoitua projektoria.
definition: Visningsformat för film, vars bildförhållande är 2.59:1 och som använder tre synkroniserade projektorer. @sv
in scheme: Metatietosanasto

isäntä
type: Concept
source: Kansallinen RDA-termi
source: YSO-termi
source: ALLFO-term @sv
source: Nationell RDA-term @sv
created: 2018-11-01
modified: 2024-08-27
alternative label: farm owners @en
alternative label: isännät
alternative label: husbönder @sv
in scheme: Metatietosanasto
preferred label: farm owner (male) @en
preferred label: husbonde @sv

tatuoija
type: Concept
source: Kansallinen RDA-termi
source: YSO-termi
source: ALLFO-term @sv
source: Nationell RDA-term @sv
created: 2018-11-01
modified: 2024-08-27
alternative label: tattoo artists @en
alternative label: tatuoijat
in scheme: Metatietosanasto
preferred label: tattoo artist @en
preferred label: tatuerare @sv

dekaani
type: Concept
source: Kansallinen RDA-termi
source: YSO-termi
source: ALLFO-term @sv
source: Nationell RDA-term @sv
created: 2018-11-01
modified: 2024-08-27
alternative label: deans @en
alternative label: dekaanit
alternative label: dekaner @sv
in scheme: Metatietosanasto
preferred label: dean @en
preferred label: dekan @sv

kirjanpainaja
type: Concept
source: Kansallinen RDA-termi
source: YSO-termi
source: ALLFO-term @sv
source: Nationell RDA-term @sv
created: 2018-11-01
modified: 2024-08-27
alternative label: kirjanpainaja (ammatti)
alternative label: boktryckare (yrke) @sv
in scheme: Metatietosanasto
preferred label: bookprinter @en
preferred label: boktryckare @sv

yksityisetsivä
type: Concept
source: Kansallinen RDA-termi
source: YSO-termi
source: ALLFO-term @sv
source: Nationell RDA-term @sv
created: 2018-11-01
modified: 2024-08-27
alternative label: private investigators @en
alternative label: dekkarit
alternative label: etsivät
alternative label: salapoliisit
alternative label: yksityisetsivät
alternative label: deckare @sv
alternative label: privatdetektiver @sv
in scheme: Metatietosanasto
preferred label: private investigator @en
preferred label: privatdetektiv @sv

sovittelija
type: Concept
source: Kansallinen RDA-termi
source: YSO-termi
source: ALLFO-term @sv
source: Nationell RDA-term @sv
created: 2018-11-01
modified: 2024-08-27
alternative label: mediators @en
alternative label: sovittelijat
alternative label: förlikningsmän @sv
in scheme: Metatietosanasto
preferred label: mediator @en
preferred label: medlare @sv

sairaala-apulainen
type: Concept
source: Kansallinen RDA-termi
source: YSO-termi
source: ALLFO-term @sv
source: Nationell RDA-term @sv
created: 2018-11-01
modified: 2024-08-27
alternative label: hospital cleaners @en
alternative label: sairaala-apulaiset
alternative label: sjukhusbiträden @sv
in scheme: Metatietosanasto
preferred label: hospital cleaner @en
preferred label: sjukhusbiträde @sv

Sukupolvi
type: ConceptGroup
type: Collection
source: RDA-termi
source: RDA-term @sv
created: 2016-01-08
modified: 2024-03-14
member: originaalilevy
member: painomaster
member: johdannaismaster
member: koepainos
member: isiö
member: äitiö
member: kopiomasternauha
member: käyttökopio
member: alkuperäinen negatiivi
member: koevedos
member: master-positiivi
member: duplikaatti
member: masternauha
member: negatiivikopio
member: originaali
member: masterkopio
member: ensimmäinen sukupolvi
member: sukupolvien yhdistelmä
member: katselukopio
preferred label: Generation @en

meikkitaiteilija
type: Concept
source: Kansallinen RDA-termi
source: YSO-termi
source: ALLFO-term @sv
source: Nationell RDA-term @sv
created: 2018-11-01
modified: 2024-08-27
alternative label: meikkitaiteilija (ammatti)
alternative label: makeupartist (yrke) @sv
in scheme: Metatietosanasto
preferred label: makeup artist @en
preferred label: makeupartist @sv

valamies
type: Concept
source: Kansallinen RDA-termi
source: YSO-termi
source: ALLFO-term @sv
source: Nationell RDA-term @sv
created: 2018-11-01
modified: 2024-08-27
alternative label: jurors @en
alternative label: valamiehet
alternative label: jurymedlemmar @sv
in scheme: Metatietosanasto
preferred label: juror @en
preferred label: jurymedlem @sv

8:o
type: Concept
source: RDA-termi
source: RDA-term @sv
created: 2016-01-08
modified: 2025-05-13
definition: Bibliografinen koko muodostuu yhdestä tai useammasta lehdestä, jotka ovat kooltaan 1/8 arkista.
definition: Bokens format består av ett eller flera blad som till sin storlek är 1/8 av ett tryckark. @sv
in scheme: Metatietosanasto
preferred label: 8vo @en

esittelijä
type: Concept
source: Kansallinen RDA-termi
source: YSO-termi
source: ALLFO-term @sv
source: Nationell RDA-term @sv
created: 2018-11-01
modified: 2024-08-27
alternative label: esittelijä (ammatti)
alternative label: föredragande (yrke) @sv
in scheme: Metatietosanasto
preferred label: presenting officer @en
preferred label: föredragande @sv

perhepäivähoitaja
type: Concept
source: Kansallinen RDA-termi
source: YSO-termi
source: ALLFO-term @sv
source: Nationell RDA-term @sv
created: 2018-11-01
modified: 2024-08-27
alternative label: family day care childminders @en
alternative label: perhepäivähoitajat
alternative label: dagbarnvårdare @sv
in scheme: Metatietosanasto
preferred label: family day care childminder @en
preferred label: familjedagvårdare @sv

haastemies
type: Concept
source: Kansallinen RDA-termi
source: YSO-termi
source: ALLFO-term @sv
source: Nationell RDA-term @sv
created: 2018-11-01
modified: 2024-08-27
alternative label: process servers @en
alternative label: summoners @en
alternative label: haastemiehet
alternative label: stämningsmän @sv
in scheme: Metatietosanasto
preferred label: process server @en
preferred label: stämningsman @sv

analyytikko
type: Concept
source: Kansallinen RDA-termi
source: YSO-termi
source: ALLFO-term @sv
source: Nationell RDA-term @sv
created: 2018-11-01
modified: 2024-08-27
alternative label: analysts @en
alternative label: analyytikot
in scheme: Metatietosanasto
preferred label: analyst @en
preferred label: analytiker @sv

PAL
type: Concept
source: RDA-termi
source: RDA-term @sv
created: 2016-01-08
modified: 2023-05-17
definition: Lähetysstandardi, joka on useimmissa maissa käytetyn analogisen television värikoodausstandardi, jota käytetään 625 juovaa / 25 ruutua sekunnissa -lähetyksiin. Nimetty Phase Alternating Linen mukaan.
definition: Sändningsstandard, som är färgkodningsstandard för analog television som används i de flesta länder och som används för 625 linjer / 25 rutor i sekunden -sändningar. Förkortning för Phase Alternating Line. @sv
in scheme: Metatietosanasto

vouti
type: Concept
source: Kansallinen RDA-termi
source: YSO-termi
source: ALLFO-term @sv
source: Nationell RDA-term @sv
created: 2018-11-01
modified: 2024-08-27
alternative label: voudit
alternative label: fogdar @sv
in scheme: Metatietosanasto
preferred label: fogde @sv

laboratoriohoitaja
type: Concept
source: Kansallinen RDA-termi
source: YSO-termi
source: ALLFO-term @sv
source: Nationell RDA-term @sv
created: 2018-11-01
modified: 2024-08-27
alternative label: laboratory technologists @en
alternative label: medical laboratory technologists @en
alternative label: laboratoriohoitajat
alternative label: laboratorieassistenter @sv
alternative label: laboratoriesköterskor @sv
in scheme: Metatietosanasto
preferred label: laboratory technologist @en
preferred label: laboratorieskötare @sv

valmentaja
type: Concept
source: Kansallinen RDA-termi
source: YSO-termi
source: ALLFO-term @sv
source: Nationell RDA-term @sv
created: 2018-11-01
modified: 2024-08-27
alternative label: coaches @en
alternative label: trainers @en
alternative label: valmentajat
in scheme: Metatietosanasto
preferred label: coach (occupation) @en
preferred label: tränare @sv

muotipiirtäjä
type: Concept
source: Kansallinen RDA-termi
source: YSO-termi
source: ALLFO-term @sv
source: Nationell RDA-term @sv
created: 2018-11-01
modified: 2024-08-27
alternative label: fashion illustrators @en
alternative label: muotipiirtäjät
in scheme: Metatietosanasto
preferred label: fashion designer @en
preferred label: modetecknare @sv

konservaattori
type: Concept
source: Kansallinen RDA-termi
source: YSO-termi
source: ALLFO-term @sv
source: Nationell RDA-term @sv
created: 2018-11-01
modified: 2024-08-27
alternative label: conservators @en
alternative label: eläintentäyttäjät
alternative label: entistäjät
alternative label: entisöijät
alternative label: konservaattorit
alternative label: konservatorer @sv
alternative label: restauratorer @sv
in scheme: Metatietosanasto
preferred label: conservator @en
preferred label: konservator @sv

perhehoitaja
type: Concept
source: Kansallinen RDA-termi
source: YSO-termi
source: ALLFO-term @sv
source: Nationell RDA-term @sv
created: 2018-11-01
modified: 2024-08-27
alternative label: private caretakers @en
alternative label: perhehoitajat
in scheme: Metatietosanasto
preferred label: private caretaker @en
preferred label: familjevårdare @sv

optikko
type: Concept
source: Kansallinen RDA-termi
source: YSO-termi
source: ALLFO-term @sv
source: Nationell RDA-term @sv
created: 2018-11-01
modified: 2024-08-27
alternative label: opticians @en
alternative label: optikot
in scheme: Metatietosanasto
preferred label: optician @en
preferred label: optiker @sv

assyriologi
type: Concept
source: Kansallinen RDA-termi
source: YSO-termi
source: ALLFO-term @sv
source: Nationell RDA-term @sv
created: 2018-11-01
modified: 2024-08-27
alternative label: Assyriologists @en
alternative label: assyriologit
alternative label: assyriologer @sv
in scheme: Metatietosanasto
preferred label: assyriologist @en
preferred label: assyriolog @sv

hieroja
type: Concept
source: Kansallinen RDA-termi
source: YSO-termi
source: ALLFO-term @sv
source: Nationell RDA-term @sv
created: 2018-11-01
modified: 2024-08-27
alternative label: massagers @en
alternative label: masseurs @en
alternative label: hierojat
alternative label: massörer @sv
in scheme: Metatietosanasto
preferred label: masseur @en
preferred label: massör @sv

kansanedustaja
type: Concept
source: Kansallinen RDA-termi
source: YSO-termi
source: ALLFO-term @sv
source: Nationell RDA-term @sv
created: 2018-11-01
modified: 2024-08-27
alternative label: members of parliament @en
alternative label: kansanedustajat
alternative label: riksdagskvinnor @sv
alternative label: riksdagsledamöter @sv
alternative label: riksdagsmän @sv
in scheme: Metatietosanasto
preferred label: member of parliament @en
preferred label: riksdagsledamot @sv

rehtori
type: Concept
source: Kansallinen RDA-termi
source: YSO-termi
source: ALLFO-term @sv
source: Nationell RDA-term @sv
created: 2018-11-01
modified: 2024-08-27
alternative label: rehtori (ammatti)
alternative label: rektor (yrke) @sv
in scheme: Metatietosanasto
preferred label: rektor @sv

valokaiverrusmenetelmä
type: Concept
source: RDA-termi
source: RDA-term @sv
created: 2016-01-08
modified: 2023-05-17
definition: Syväpainomenetelmä, jossa metallinen painolevy valmistetaan bikromaattimenetelmällä, jossa gelatiinipinnoite jää vaihtelevan paksuiseksi. Levy syövytetään, jolloin muodostuu vaihtelevan syvyisiä soluja jotka sitovat eri määrän mustetta.
definition: Fotomekanisk reproduktionsmetod som bygger på djuptrycksteknik. @sv
in scheme: Metatietosanasto
preferred label: photogravure process @en
preferred label: fotogravyr @sv

kääntäjä
type: Concept
source: Kansallinen RDA-termi
source: YSO-termi
source: ALLFO-term @sv
source: Nationell RDA-term @sv
created: 2018-11-01
modified: 2024-08-27
alternative label: kääntäjä (ammatti)
preferred label: translator @en
alternative label: översättare (yrke) @sv
in scheme: Metatietosanasto
preferred label: översättare @sv

antropologi
type: Concept
source: Kansallinen RDA-termi
source: YSO-termi
source: ALLFO-term @sv
source: Nationell RDA-term @sv
created: 2018-11-01
modified: 2024-08-27
alternative label: anthropologists @en
alternative label: antropologit
alternative label: antropologer @sv
in scheme: Metatietosanasto
preferred label: anthropologist @en
preferred label: antropolog @sv

somistaja
type: Concept
source: Kansallinen RDA-termi
source: YSO-termi
source: ALLFO-term @sv
source: Nationell RDA-term @sv
created: 2018-11-01
modified: 2024-08-27
alternative label: window dressers @en
alternative label: somistajat
alternative label: dekoratörer @sv
in scheme: Metatietosanasto
preferred label: window dresser @en
preferred label: dekoratör @sv

laivanvarustaja
type: Concept
source: Kansallinen RDA-termi
source: YSO-termi
source: ALLFO-term @sv
source: Nationell RDA-term @sv
created: 2018-11-01
modified: 2024-08-27
alternative label: shipowners @en
alternative label: laivanvarustajat
alternative label: redare @sv
in scheme: Metatietosanasto
preferred label: shipowner @en
preferred label: skeppsredare @sv

valajamestari
type: Concept
source: Kansallinen RDA-termi
source: YSO-termi
source: ALLFO-term @sv
source: Nationell RDA-term @sv
created: 2018-11-01
modified: 2024-08-27
alternative label: casting technology specialists @en
alternative label: valajamestarit
in scheme: Metatietosanasto
preferred label: casting technology specialist @en
preferred label: avgjutarmästare @sv

emäntä
type: Concept
source: Kansallinen RDA-termi
source: YSO-termi
source: ALLFO-term @sv
source: Nationell RDA-term @sv
created: 2018-11-01
modified: 2024-08-27
alternative label: farm owners @en
alternative label: emännät
alternative label: maatalon emäntä
alternative label: maatilanemännät
alternative label: bondhustrur @sv
alternative label: husmödrar @sv
in scheme: Metatietosanasto
preferred label: farm owner (female) @en
preferred label: husmoder @sv

järjestöaktiivi
type: Concept
source: Kansallinen RDA-termi
source: YSO-termi
source: ALLFO-term @sv
source: Nationell RDA-term @sv
created: 2018-11-01
modified: 2024-08-27
alternative label: organisation activists @en
alternative label: järjestöaktiivit
alternative label: järjestöaktivistit
alternative label: föreningsaktiva @sv
alternative label: föreningsmänniskor @sv
in scheme: Metatietosanasto
preferred label: organisation activist @en
preferred label: föreningsaktiv @sv

kenraalikuvernööri
type: Concept
source: Kansallinen RDA-termi
source: YSO-termi
source: ALLFO-term @sv
source: Nationell RDA-term @sv
created: 2018-11-01
modified: 2024-08-27
alternative label: governors general @en
alternative label: kenraalikuvernöörit
alternative label: generalguvernörer @sv
in scheme: Metatietosanasto
preferred label: governor-general @en
preferred label: generalguvernör @sv

merenkulkija
type: Concept
source: Kansallinen RDA-termi
source: YSO-termi
source: ALLFO-term @sv
source: Nationell RDA-term @sv
created: 2018-11-01
modified: 2024-08-27
alternative label: mariners @en
alternative label: merenkulkijat
alternative label: merenkävijät
alternative label: sjöfarande @sv
in scheme: Metatietosanasto
preferred label: mariner @en
preferred label: sjöfarare @sv

taloudenhoitaja (rahatalous)
type: Concept
source: Kansallinen RDA-termi
source: YSO-termi
source: ALLFO-term @sv
source: Nationell RDA-term @sv
created: 2018-11-01
modified: 2024-08-27
alternative label: treasurers @en
alternative label: rahastonhoitajat
alternative label: taloudenhoitajat
in scheme: Metatietosanasto
preferred label: treasurer @en
preferred label: skattmästare @sv

ohjelmoija
type: Concept
source: Kansallinen RDA-termi
source: YSO-termi
source: ALLFO-term @sv
source: Nationell RDA-term @sv
created: 2018-11-01
modified: 2024-08-27
alternative label: ohjelmoija (ammatti)
alternative label: programmerare (yrke) @sv
in scheme: Metatietosanasto
preferred label: computer programmer @en
preferred label: programmerare @sv

kuvaaja
type: Concept
source: Kansallinen RDA-termi
source: YSO-termi
source: ALLFO-term @sv
source: Nationell RDA-term @sv
created: 2018-11-01
modified: 2024-08-27
alternative label: cameramen @en
alternative label: kuvaajat
alternative label: filmfotografer @sv
in scheme: Metatietosanasto
preferred label: cameraman @en
preferred label: filmfotograf @sv

astronautti
type: Concept
source: Kansallinen RDA-termi
source: YSO-termi
source: ALLFO-term @sv
source: Nationell RDA-term @sv
created: 2018-11-01
modified: 2024-08-27
alternative label: astronauts @en
alternative label: astronautit
alternative label: avaruuslentäjät
alternative label: kosmonautit
alternative label: astronauter @sv
alternative label: kosmonauter @sv
alternative label: rymdflygare @sv
in scheme: Metatietosanasto
preferred label: astronaut @en

tarjoilija
type: Concept
source: Kansallinen RDA-termi
source: YSO-termi
source: ALLFO-term @sv
source: Nationell RDA-term @sv
created: 2018-11-01
modified: 2024-08-27
alternative label: waiters @en
alternative label: waiters and waitresses @en
alternative label: waitresses @en
alternative label: tarjoilijat
alternative label: servitris @sv
alternative label: servitriser @sv
alternative label: servitörer @sv
in scheme: Metatietosanasto
preferred label: waiter/waitress @en
preferred label: servitör @sv

Suku
type: ConceptGroup
type: Collection
source: RDA-termi
source: RDA-term @sv
created: 2016-01-08
modified: 2025-06-07
alternative label: Suku (toimijaryhmä)
alternative label: Familj @sv
alternative label: Familj/släkt @sv
definition: A collective agent who is composed of persons who are related by birth, marriage, adoption, civil union, or similar legal status, or who otherwise present themselves as a family. @en
definition: Yhteistoimija, joka muodostuu henkilöistä, jotka ovat suhteessa toisiinsa syntymän, avioliiton, adoption, rekisteröidyn parisuhteen tai vastaavan oikeudellisen aseman kautta tai jotka muuten esiintyvät perheenä.
definition: Två eller flera personer, som förenas av släktband, äktenskap, adoption, registrerat partnerskap eller annan dylik juridisk ställning, eller som annars uppträder som familj. @sv
member: suvun kategoria
member: muu sukuun liittyvä määrite
preferred label: Family @en
preferred label: Släkt @sv

tiedottaja
type: Concept
source: Kansallinen RDA-termi
source: YSO-termi
source: ALLFO-term @sv
source: Nationell RDA-term @sv
created: 2018-11-01
modified: 2024-08-27
alternative label: publicists @en
alternative label: tiedottajat
alternative label: informatörer @sv
in scheme: Metatietosanasto
preferred label: publicist @en
preferred label: informatör @sv

talonmies
type: Concept
source: Kansallinen RDA-termi
source: YSO-termi
source: ALLFO-term @sv
source: Nationell RDA-term @sv
created: 2018-11-01
modified: 2024-08-27
alternative label: property caretakers @en
alternative label: talonmiehet
alternative label: gårdskarlar @sv
in scheme: Metatietosanasto
preferred label: property caretaker @en
preferred label: gårdskarl @sv

valaja
type: Concept
source: Kansallinen RDA-termi
source: YSO-termi
source: ALLFO-term @sv
source: Nationell RDA-term @sv
created: 2018-11-01
modified: 2024-08-27
alternative label: caster operators @en
alternative label: casting workers @en
alternative label: valajat
in scheme: Metatietosanasto
preferred label: caster operator @en
preferred label: gjutare @sv

tuomari (kilpailut)
type: Concept
source: Kansallinen RDA-termi
source: YSO-termi
source: ALLFO-term @sv
source: Nationell RDA-term @sv
created: 2018-11-01
modified: 2024-08-27
alternative label: referees @en
alternative label: umpires @en
alternative label: umpires and referees @en
alternative label: erotuomarit
alternative label: kilpailutuomarit
alternative label: näyttelytuomarit
alternative label: palkintotuomarit
alternative label: tuomarit
alternative label: urheilutuomarit
alternative label: domare @sv
alternative label: idrottsdomare @sv
alternative label: skiljedomare @sv
alternative label: sportdomare @sv
alternative label: tävlingsdomare @sv
alternative label: utställningsdomare @sv
in scheme: Metatietosanasto
preferred label: umpire/referee @en
preferred label: domare (tävlingar) @sv

missi
type: Concept
source: Kansallinen RDA-termi
source: YSO-termi
source: ALLFO-term @sv
source: Nationell RDA-term @sv
created: 2018-11-01
modified: 2024-08-27
alternative label: beauty contest winners @en
alternative label: missit
alternative label: misser @sv
in scheme: Metatietosanasto
preferred label: beauty contest winner @en
preferred label: miss @sv

sijoittaja
type: Concept
source: Kansallinen RDA-termi
source: YSO-termi
source: ALLFO-term @sv
source: Nationell RDA-term @sv
created: 2018-11-01
modified: 2024-08-27
alternative label: investors @en
alternative label: sijoittajat
in scheme: Metatietosanasto
preferred label: investor @en
preferred label: investerare @sv

tutkimusmatkailija
type: Concept
source: Kansallinen RDA-termi
source: YSO-termi
source: ALLFO-term @sv
source: Nationell RDA-term @sv
created: 2018-11-01
modified: 2024-08-27
alternative label: explorers @en
alternative label: tutkimusmatkailijat
in scheme: Metatietosanasto
preferred label: explorer @en
preferred label: forskningsresande @sv

videotiedosto
type: Concept
source: RDA-termi
source: RDA-term @sv
created: 2016-01-08
modified: 2023-05-17
definition: Tiedostotyyppi elektronisesti taltioidun liikkuvan kuvasisällön taltioimiseksi.
definition: Filtyp för lagring av elektroniskt inspelat rörligt bildinnehåll. @sv
in scheme: Metatietosanasto
preferred label: video file @en
preferred label: videofil @sv

geisha
type: Concept
source: Kansallinen RDA-termi
source: YSO-termi
source: ALLFO-term @sv
source: Nationell RDA-term @sv
created: 2018-11-01
modified: 2024-08-27
alternative label: geishas @en
alternative label: geishat
alternative label: geiša
alternative label: geišat
alternative label: geishor @sv
in scheme: Metatietosanasto

Ekspressio
type: ConceptGroup
type: Collection
source: RDA-termi
source: RDA-term @sv
created: 2016-01-08
modified: 2026-05-26
definition: Teoksen tiedollinen tai taiteellinen toteutus, joka voi olla muodoltaan ääntä, kuvaa, liikettä, kirjaimista koostuva, musiikkinuotinnos jne.
definition: Det intellektuella eller konstnärliga förverkligandet av ett verk i form av ljud, bild, rörelse, bokstäver, musiknotation osv. @sv
member: Liikenotaation tyyppi
member: Kuvasuhdemäärite
member: Nuottikirjoituksen tyyppi
member: Nuottiaineiston muoto
member: Taktiilin merkkijärjestelmän tyyppi
member: Sisältötyyppi
member: Mittakaavan määrite
member: Vuorovaikutteisuuden aste
member: Ekspression sävellaji
member: Palkinnot
member: Ekspression nimeke
member: Version määrite
preferred label: Expression @en
preferred label: Uttryck @sv

koulukuraattori
type: Concept
source: Kansallinen RDA-termi
source: YSO-termi
source: ALLFO-term @sv
source: Nationell RDA-term @sv
created: 2018-11-01
modified: 2024-08-27
alternative label: school welfare officers @en
alternative label: koulukuraattorit
alternative label: koulun sosiaalityöntekijät
alternative label: skolkuratorer @sv
in scheme: Metatietosanasto
preferred label: school welfare officer @en
preferred label: skolkurator @sv

taloustieteilijä
type: Concept
source: Kansallinen RDA-termi
source: YSO-termi
source: ALLFO-term @sv
source: Nationell RDA-term @sv
created: 2018-11-01
modified: 2024-08-27
alternative label: economists @en
alternative label: ekonomistit
alternative label: taloustieteilijät
alternative label: ekonomister @sv
alternative label: nationalekonomer @sv
in scheme: Metatietosanasto
preferred label: economist @en
preferred label: nationalekonom @sv

luottamusmies
type: Concept
source: Kansallinen RDA-termi
source: YSO-termi
source: ALLFO-term @sv
source: Nationell RDA-term @sv
created: 2018-11-01
modified: 2024-08-27
alternative label: shop stewards @en
alternative label: luottamusmiehet
alternative label: förtroendemän @sv
in scheme: Metatietosanasto
preferred label: shop steward @en
preferred label: förtroendeman @sv

korjaaja
type: Concept
source: Kansallinen RDA-termi
source: YSO-termi
source: ALLFO-term @sv
source: Nationell RDA-term @sv
created: 2018-11-01
modified: 2024-08-27
alternative label: repairers @en
alternative label: korjaajat
alternative label: reparatörer @sv
in scheme: Metatietosanasto
preferred label: repairer @en
preferred label: reparatör @sv

kassanhoitaja
type: Concept
source: Kansallinen RDA-termi
source: YSO-termi
source: ALLFO-term @sv
source: Nationell RDA-term @sv
created: 2018-11-01
modified: 2024-08-27
alternative label: cashiers @en
alternative label: kassanhoitajat
alternative label: kassörer @sv
in scheme: Metatietosanasto
preferred label: cashier (service occupation) @en
preferred label: kassör @sv

keittäjä
type: Concept
source: Kansallinen RDA-termi
source: YSO-termi
source: ALLFO-term @sv
source: Nationell RDA-term @sv
created: 2018-11-01
modified: 2024-08-27
alternative label: cooks @en
alternative label: keittäjät
alternative label: kockar @sv
in scheme: Metatietosanasto
preferred label: cooker @en
preferred label: kokare @sv

puvustaja
type: Concept
source: Kansallinen RDA-termi
source: YSO-termi
source: ALLFO-term @sv
source: Nationell RDA-term @sv
created: 2018-11-01
modified: 2024-08-27
alternative label: puvustaja (ammatti)
alternative label: kostymör (yrke) @sv
in scheme: Metatietosanasto
preferred label: wardrobe master @en
preferred label: kostymör @sv

puutarhaneuvoja
type: Concept
source: Kansallinen RDA-termi
source: YSO-termi
source: ALLFO-term @sv
source: Nationell RDA-term @sv
created: 2018-11-01
modified: 2024-08-27
alternative label: horticultural advisers @en
alternative label: puutarhaneuvojat
alternative label: trädgårdskonsulenter @sv
alternative label: trädgårdskonsulter @sv
alternative label: trädgårdsrådgivare @sv
in scheme: Metatietosanasto
preferred label: horticultural adviser @en
preferred label: trädgårdskonsult @sv

metsästäjä-keräilijä
type: Concept
source: Kansallinen RDA-termi
source: YSO-termi
source: ALLFO-term @sv
source: Nationell RDA-term @sv
created: 2018-11-01
modified: 2024-08-27
alternative label: hunter-gatherers @en
alternative label: metsästäjä-keräilijät
in scheme: Metatietosanasto
preferred label: hunter-gatherer @en
preferred label: jägare-samlare @sv

diktaattori
type: Concept
source: Kansallinen RDA-termi
source: YSO-termi
source: ALLFO-term @sv
source: Nationell RDA-term @sv
created: 2018-11-01
modified: 2025-10-30
alternative label: dictators @en
alternative label: diktaattorit
alternative label: diktatorer @sv
in scheme: Metatietosanasto
preferred label: dictator @en
preferred label: diktator @sv

terveydenhoitaja
type: Concept
source: Kansallinen RDA-termi
source: YSO-termi
source: ALLFO-term @sv
source: Nationell RDA-term @sv
created: 2018-11-01
modified: 2024-08-27
alternative label: public health nurses @en
alternative label: terveydenhoitajat
in scheme: Metatietosanasto
preferred label: public health nurse @en
preferred label: hälsovårdare @sv

hovimestari
type: Concept
source: Kansallinen RDA-termi
source: YSO-termi
source: ALLFO-term @sv
source: Nationell RDA-term @sv
created: 2018-11-01
modified: 2024-08-27
alternative label: butlers @en
alternative label: butlerit
alternative label: hovimestarit
in scheme: Metatietosanasto
preferred label: butler @en
preferred label: hovmästare @sv

kirjallisuusagentti
type: Concept
source: Kansallinen RDA-termi
source: YSO-termi
source: ALLFO-term @sv
source: Nationell RDA-term @sv
created: 2018-11-01
modified: 2024-08-27
alternative label: kirjallisuusagentit
alternative label: litteraturagenter @sv
alternative label: litterära agenter @sv
in scheme: Metatietosanasto
preferred label: litterär agent @sv

kotitalousneuvoja
type: Concept
source: Kansallinen RDA-termi
source: YSO-termi
source: ALLFO-term @sv
source: Nationell RDA-term @sv
created: 2018-11-01
modified: 2024-08-27
alternative label: advisers in housekeeping @en
alternative label: kotitalousneuvojat
in scheme: Metatietosanasto
preferred label: adviser in housekeeping @en
preferred label: hushållsrådgivare @sv

oikeustieteilijä
type: Concept
source: Kansallinen RDA-termi
source: YSO-termi
source: ALLFO-term @sv
source: Nationell RDA-term @sv
created: 2018-11-01
modified: 2024-08-27
alternative label: legal scholars @en
alternative label: oikeustieteilijät
in scheme: Metatietosanasto
preferred label: legal scholar @en
preferred label: rättsvetare @sv

raudoittaja
type: Concept
source: Kansallinen RDA-termi
source: YSO-termi
source: ALLFO-term @sv
source: Nationell RDA-term @sv
created: 2018-11-01
modified: 2024-08-27
alternative label: bar placers @en
alternative label: reinforcers @en
alternative label: steel fixers @en
alternative label: raudoittajat
in scheme: Metatietosanasto
preferred label: bar placer @en
preferred label: armerare @sv

euroopanmestari
type: Concept
source: Kansallinen RDA-termi
source: YSO-termi
source: ALLFO-term @sv
source: Nationell RDA-term @sv
created: 2018-11-01
modified: 2024-08-27
alternative label: European champions @en
alternative label: euroopanmestarit
in scheme: Metatietosanasto
preferred label: European champion @en
preferred label: europamästare @sv

kirvesmies
type: Concept
source: Kansallinen RDA-termi
source: YSO-termi
source: ALLFO-term @sv
source: Nationell RDA-term @sv
created: 2018-11-01
modified: 2024-08-27
alternative label: carpenters @en
alternative label: kirvesmiehet
alternative label: timmermän @sv
in scheme: Metatietosanasto
preferred label: carpenter (construction worker) @en
preferred label: timmerman @sv

biologi
type: Concept
source: Kansallinen RDA-termi
source: YSO-termi
source: ALLFO-term @sv
source: Nationell RDA-term @sv
created: 2018-11-01
modified: 2024-08-27
alternative label: biologists @en
alternative label: biologit
alternative label: biologer @sv
in scheme: Metatietosanasto
preferred label: biologist @en
preferred label: biolog @sv

luonnonsuojelualueen vartija
type: Concept
source: Kansallinen RDA-termi
source: YSO-termi
source: ALLFO-term @sv
source: Nationell RDA-term @sv
created: 2018-11-01
modified: 2024-08-27
alternative label: nature reserve wardens @en
alternative label: luonnonsuojelualueen vartijat
alternative label: naturvårdsvakter @sv
alternative label: tillsynsmän för naturskyddsområden @sv
alternative label: vakter för naturskyddsområden @sv
alternative label: väktare @sv
in scheme: Metatietosanasto
preferred label: nature reserve warden @en
preferred label: vakt för naturskyddsområde @sv

keittiömestari
type: Concept
source: Kansallinen RDA-termi
source: YSO-termi
source: ALLFO-term @sv
source: Nationell RDA-term @sv
created: 2018-11-01
modified: 2024-08-27
alternative label: chefs @en
alternative label: keittiömestarit
in scheme: Metatietosanasto
preferred label: chef @en
preferred label: köksmästare @sv

kokki
type: Concept
source: Kansallinen RDA-termi
source: YSO-termi
source: ALLFO-term @sv
source: Nationell RDA-term @sv
created: 2018-11-01
modified: 2024-08-27
alternative label: cooks @en
alternative label: kokit
alternative label: kockar @sv
in scheme: Metatietosanasto
preferred label: cook @en
preferred label: kock @sv

astrologi
type: Concept
source: Kansallinen RDA-termi
source: YSO-termi
source: ALLFO-term @sv
source: Nationell RDA-term @sv
created: 2018-11-01
modified: 2024-08-27
alternative label: astrologers @en
alternative label: astrologit
preferred label: astrologer @en
in scheme: Metatietosanasto
preferred label: astrolog @sv

metsästäjä
type: Concept
source: Kansallinen RDA-termi
source: YSO-termi
source: ALLFO-term @sv
source: Nationell RDA-term @sv
created: 2018-11-01
modified: 2024-08-27
alternative label: hunters @en
alternative label: metsästäjät
alternative label: jägare @sv
in scheme: Metatietosanasto
preferred label: hunter @en
preferred label: jägare (jakt) @sv

polariteettien yhdistelmä
type: Concept
source: RDA-termi
source: RDA-term @sv
created: 2016-01-08
modified: 2023-05-17
definition: Polariteetti, jossa kuvan värit ja valoisuus ovat yhdistelmä ihmissilmin nähtäviä värejä ja valoisuutta sekä ihmissilmin nähtävien värien ja valoisuuden vastakohtia.
definition: Polaritet i vilken bildens färger och ljus är en blandning av dem som kan ses med blotta ögat och motsatserna till vad som kan ses med blotta ögat. @sv
in scheme: Metatietosanasto
preferred label: mixed polarity @en
preferred label: blandad polaritet @sv

rakennustarkastaja
type: Concept
source: Kansallinen RDA-termi
source: YSO-termi
source: ALLFO-term @sv
source: Nationell RDA-term @sv
created: 2018-11-01
modified: 2024-08-27
alternative label: building inspectors @en
alternative label: rakennustarkastajat
alternative label: byggnadsinspektörer @sv
in scheme: Metatietosanasto
preferred label: building inspector @en
preferred label: byggnadsinspektör @sv

luonnonsuojelija
type: Concept
source: Kansallinen RDA-termi
source: YSO-termi
source: ALLFO-term @sv
source: Nationell RDA-term @sv
created: 2018-11-01
modified: 2024-08-27
alternative label: environmentalists @en
alternative label: luonnonsuojelijat
alternative label: naturvårdare @sv
in scheme: Metatietosanasto
preferred label: environmentalist @en
preferred label: naturskyddare @sv

kiinteistönhoitaja
type: Concept
source: Kansallinen RDA-termi
source: YSO-termi
source: ALLFO-term @sv
source: Nationell RDA-term @sv
created: 2018-11-01
modified: 2024-08-27
alternative label: real estate managers @en
alternative label: kiinteistönhoitajat
in scheme: Metatietosanasto
preferred label: real estate manager @en
preferred label: fastighetsskötare @sv

äänitiedosto
type: Concept
source: RDA-termi
source: RDA-term @sv
created: 2016-01-08
modified: 2023-05-17
definition: Tiedostotyyppi elektronisesti taltioidun äänisisällön tallentamiseksi.
definition: Filformat för lagring av ljudinnehåll som är elektroniskt inspelat. @sv
in scheme: Metatietosanasto
preferred label: audio file @en
preferred label: ljudfil @sv

maanmittari
type: Concept
source: Kansallinen RDA-termi
source: YSO-termi
source: ALLFO-term @sv
source: Nationell RDA-term @sv
created: 2018-11-01
modified: 2024-08-27
alternative label: maanmittari (ammatti)
alternative label: lantmätare (yrke) @sv
in scheme: Metatietosanasto
preferred label: land surveyor @en
preferred label: lantmätare @sv

luennoitsija
type: Concept
source: Kansallinen RDA-termi
source: YSO-termi
source: ALLFO-term @sv
source: Nationell RDA-term @sv
created: 2018-11-01
modified: 2024-08-27
alternative label: lecturers @en
alternative label: luennoitsijat
in scheme: Metatietosanasto
preferred label: lecturer @en
preferred label: föreläsare @sv

koneistaja
type: Concept
source: Kansallinen RDA-termi
source: YSO-termi
source: ALLFO-term @sv
source: Nationell RDA-term @sv
created: 2018-11-01
modified: 2024-08-27
alternative label: machinists @en
alternative label: koneistajat
in scheme: Metatietosanasto
preferred label: machinist @en
preferred label: verkstadsmekaniker @sv

maantieteilijä
type: Concept
source: Kansallinen RDA-termi
source: YSO-termi
source: ALLFO-term @sv
source: Nationell RDA-term @sv
created: 2018-11-01
modified: 2024-08-27
alternative label: geographers @en
alternative label: maantieteilijät
alternative label: geografer @sv
in scheme: Metatietosanasto
preferred label: geographer @en
preferred label: geograf @sv

osteopaatti
type: Concept
source: Kansallinen RDA-termi
source: YSO-termi
source: ALLFO-term @sv
source: Nationell RDA-term @sv
created: 2018-11-01
modified: 2024-08-27
alternative label: osteopaths @en
alternative label: osteopaatit
alternative label: osteopater @sv
in scheme: Metatietosanasto
preferred label: osteopath @en
preferred label: osteopat @sv

messihuoltaja
type: Concept
source: Kansallinen RDA-termi
source: YSO-termi
source: ALLFO-term @sv
source: Nationell RDA-term @sv
created: 2018-11-01
modified: 2024-08-27
alternative label: mess stewards @en
alternative label: messihuoltajat
alternative label: mässmän @sv
in scheme: Metatietosanasto
preferred label: mess steward @en
preferred label: mässman @sv

mikrotukihenkilö
type: Concept
source: Kansallinen RDA-termi
source: YSO-termi
source: ALLFO-term @sv
source: Nationell RDA-term @sv
created: 2018-11-01
modified: 2024-08-27
alternative label: PC support advisors @en
alternative label: atk-tukihenkilöt
alternative label: mikrotukihenkilöt
alternative label: datastödpersoner @sv
alternative label: it-stödpersoner @sv
alternative label: mikrostödperson @sv
in scheme: Metatietosanasto
preferred label: PC support specialist @en
preferred label: datastödperson @sv

informaatikko
type: Concept
source: Kansallinen RDA-termi
source: YSO-termi
source: ALLFO-term @sv
source: Nationell RDA-term @sv
created: 2018-11-01
modified: 2024-08-27
alternative label: informaticians @en
alternative label: information officers @en
alternative label: informaatikot
in scheme: Metatietosanasto
preferred label: information officer @en
preferred label: informatiker @sv

puvustonhoitaja
type: Concept
source: Kansallinen RDA-termi
source: YSO-termi
source: ALLFO-term @sv
source: Nationell RDA-term @sv
created: 2018-11-01
modified: 2024-08-27
alternative label: wardrobe supervisors @en
alternative label: puvustonhoitajat
in scheme: Metatietosanasto
preferred label: wardrobe supervisor @en
preferred label: kostymföreståndare @sv

saarnaaja
type: Concept
source: Kansallinen RDA-termi
source: YSO-termi
source: ALLFO-term @sv
source: Nationell RDA-term @sv
created: 2018-11-01
modified: 2024-08-27
alternative label: preachers @en
alternative label: maallikkosaarnaajat
alternative label: saarnaajat
alternative label: lekmannapredikanter @sv
alternative label: predikanter @sv
in scheme: Metatietosanasto
preferred label: preacher @en
preferred label: predikant @sv

juustomestari
type: Concept
source: Kansallinen RDA-termi
source: YSO-termi
source: ALLFO-term @sv
source: Nationell RDA-term @sv
created: 2018-11-01
modified: 2024-08-27
alternative label: master cheesemakers @en
alternative label: juustomestarit
in scheme: Metatietosanasto
preferred label: master cheesemaker @en
preferred label: ostmästare @sv

Tieto-Finlandia-palkinto
type: Concept
source: Kansallinen RDA-termi
source: Nationell RDA-term @sv
created: 2016-01-08
modified: 2023-05-17
alternative label: Tieto-Finlandia
alternative label: Fack-Finlandiapriset @sv
alternative label: Fakta Finlandia @sv
alternative label: Fakta-Finlandiapriset @sv
definition: Suomen Kirjasäätiön jakama tunnustus ansiokkaalle tieto- tai oppikirjalle.
definition: Pris som utdelas av Finlands bokstiftelse för en meriterad fack- eller lärobok. @sv
example: MARC 21 -formaatissa: 586 ## ‡a Tieto-Finlandia-palkinto, 2020
example: I MARC 21-formatet: 586 ## ‡a Fack-Finlandia-priset, 2020 @sv
in scheme: Metatietosanasto
preferred label: Fack-Finlandia-priset @sv

sosiaalihuoltaja
type: Concept
source: Kansallinen RDA-termi
source: YSO-termi
source: ALLFO-term @sv
source: Nationell RDA-term @sv
created: 2018-11-01
modified: 2024-08-27
alternative label: sosiaalihuoltaja (ammatti)
alternative label: socialvårdare (yrke) @sv
in scheme: Metatietosanasto
preferred label: social worker @en
preferred label: socialvårdare @sv

vanginvartija
type: Concept
source: Kansallinen RDA-termi
source: YSO-termi
source: ALLFO-term @sv
source: Nationell RDA-term @sv
created: 2018-11-01
modified: 2024-08-27
alternative label: prison guards @en
alternative label: vanginvartijat
in scheme: Metatietosanasto
preferred label: prison guard @en
preferred label: fångvaktare @sv

nuotti
type: Concept
source: Kansallinen RDA-termi
source: Nationell RDA-term @sv
created: 2016-01-08
modified: 2026-01-09
in scheme: Metatietosanasto
preferred label: note @en
preferred label: not @sv
scope note: Monikossa: nuotteja, xx nuottia
scope note: I plural: noter, xx noter @sv

akrobaatti
type: Concept
source: Kansallinen RDA-termi
source: YSO-termi
source: ALLFO-term @sv
source: Nationell RDA-term @sv
created: 2018-11-01
modified: 2024-08-27
alternative label: acrobats @en
alternative label: akrobaatit
alternative label: akrobater @sv
in scheme: Metatietosanasto
preferred label: acrobat @en
preferred label: akrobat @sv

majakanvartija
type: Concept
source: Kansallinen RDA-termi
source: YSO-termi
source: ALLFO-term @sv
source: Nationell RDA-term @sv
created: 2018-11-01
modified: 2024-08-27
alternative label: lighthouse keepers @en
alternative label: majakanvartijat
in scheme: Metatietosanasto
preferred label: lighthouse keeper @en
preferred label: fyrvaktare @sv

veneenveistäjä
type: Concept
source: Kansallinen RDA-termi
source: YSO-termi
source: ALLFO-term @sv
source: Nationell RDA-term @sv
created: 2018-11-01
modified: 2024-08-27
alternative label: boatwrights @en
alternative label: veneenveistäjät
in scheme: Metatietosanasto
preferred label: boatwright @en
preferred label: båtsnickare @sv

kullankaivaja
type: Concept
source: Kansallinen RDA-termi
source: YSO-termi
source: ALLFO-term @sv
source: Nationell RDA-term @sv
created: 2018-11-01
modified: 2024-08-27
alternative label: gold diggers @en
alternative label: kullankaivajat
in scheme: Metatietosanasto
preferred label: gold digger @en
preferred label: guldgrävare @sv

isiö
type: Concept
source: RDA-termi
source: RDA-term @sv
created: 2016-01-08
modified: 2023-05-17
alternative label: pressmatris @sv
definition: Äänitteen sukupolven määrite originaalilevyn kovametalliselle negatiivikopiolle, joka voidaan asentaa puristimeen ja käyttää urakuvion painamiseen levyjen tuotantoerän valmistuksessa.
definition: Bestämning av generation för en originalskivas negativkopia i hårdmetall, som kan sättas i press och användas för att trycka spårmönster vid tillverkning av ett parti skivor. @sv
in scheme: Metatietosanasto
preferred label: stamper @en
preferred label: patris @sv

metsuri
type: Concept
source: Kansallinen RDA-termi
source: YSO-termi
source: ALLFO-term @sv
source: Nationell RDA-term @sv
created: 2018-11-01
modified: 2024-08-27
alternative label: lumbermen @en
alternative label: metsurit
alternative label: timmerhuggare @sv
in scheme: Metatietosanasto
preferred label: lumberman @en
preferred label: skogshuggare @sv

mylläri
type: Concept
source: Kansallinen RDA-termi
source: YSO-termi
source: ALLFO-term @sv
source: Nationell RDA-term @sv
created: 2018-11-01
modified: 2024-08-27
alternative label: millers @en
alternative label: myllärit
in scheme: Metatietosanasto
preferred label: miller @en
preferred label: mjölnare @sv

geodeetti
type: Concept
source: Kansallinen RDA-termi
source: YSO-termi
source: ALLFO-term @sv
source: Nationell RDA-term @sv
created: 2018-11-01
modified: 2024-08-27
alternative label: geodesists @en
alternative label: geodeetit
alternative label: geodeter @sv
in scheme: Metatietosanasto
preferred label: geodesist @en
preferred label: geodet @sv

raatimies
type: Concept
source: Kansallinen RDA-termi
source: YSO-termi
source: ALLFO-term @sv
source: Nationell RDA-term @sv
created: 2018-11-01
modified: 2024-08-27
alternative label: magistrates @en
alternative label: raatimiehet
alternative label: rådmän @sv
in scheme: Metatietosanasto
preferred label: magistrate @en
preferred label: rådman @sv

panostaja
type: Concept
source: Kansallinen RDA-termi
source: YSO-termi
source: ALLFO-term @sv
source: Nationell RDA-term @sv
created: 2018-11-01
modified: 2024-08-27
alternative label: shotfirers @en
alternative label: panostajat
in scheme: Metatietosanasto
preferred label: shotfirer @en
preferred label: laddare @sv

hammashoitaja
type: Concept
source: Kansallinen RDA-termi
source: YSO-termi
source: ALLFO-term @sv
source: Nationell RDA-term @sv
created: 2018-11-01
modified: 2024-08-27
alternative label: dental assistants @en
alternative label: hammashoitajat
in scheme: Metatietosanasto
preferred label: dental assistant @en
preferred label: tandskötare @sv

šamaani
type: Concept
source: Kansallinen RDA-termi
source: YSO-termi
source: ALLFO-term @sv
source: Nationell RDA-term @sv
created: 2018-11-01
modified: 2024-08-27
alternative label: shamans @en
alternative label: samaanit
alternative label: shamaanit
alternative label: šamaanit
alternative label: schamaner @sv
in scheme: Metatietosanasto
preferred label: shaman @en
preferred label: schaman @sv

europarlamentaarikko
type: Concept
source: Kansallinen RDA-termi
source: YSO-termi
source: ALLFO-term @sv
source: Nationell RDA-term @sv
created: 2018-11-01
modified: 2024-08-27
alternative label: EU parliamentarians @en
alternative label: MEPs @en
alternative label: members of the European Parliament @en
alternative label: EU-parlamentaarikot
alternative label: Euroopan parlamentin jäsenet
alternative label: euroedustajat
alternative label: europarlamentaarikot
alternative label: mepit
alternative label: EU-parlemantariker @sv
alternative label: Europaparlamentets ledamöter @sv
alternative label: europaparlamentariker @sv
alternative label: europarepresentanter @sv
alternative label: europarlamentariker @sv
alternative label: meppar @sv
in scheme: Metatietosanasto
preferred label: member of the European Parliament @en
preferred label: Europaparlamentariker @sv

kielitieteilijä
type: Concept
source: Kansallinen RDA-termi
source: YSO-termi
source: ALLFO-term @sv
source: Nationell RDA-term @sv
created: 2018-11-01
modified: 2024-08-27
alternative label: linguists @en
alternative label: kielentutkija
alternative label: kielitieteilijät
alternative label: lingvistit
alternative label: lingvister @sv
alternative label: språkforskare @sv
alternative label: språkvetare @sv
in scheme: Metatietosanasto
preferred label: linguist @en
preferred label: lingvist @sv

kemisti
type: Concept
source: Kansallinen RDA-termi
source: YSO-termi
source: ALLFO-term @sv
source: Nationell RDA-term @sv
created: 2018-11-01
modified: 2024-08-27
alternative label: chemists @en
alternative label: kemistit
alternative label: kemister @sv
in scheme: Metatietosanasto
preferred label: chemist @en
preferred label: kemist @sv

stylisti
type: Concept
source: Kansallinen RDA-termi
source: YSO-termi
source: ALLFO-term @sv
source: Nationell RDA-term @sv
created: 2018-11-01
modified: 2024-08-27
alternative label: stylists @en
alternative label: stailaajat
alternative label: stailistit
alternative label: stylistit
alternative label: stajlister @sv
alternative label: stylister @sv
in scheme: Metatietosanasto
preferred label: stylist @en

kasvatustieteilijä
type: Concept
source: Kansallinen RDA-termi
source: YSO-termi
source: ALLFO-term @sv
source: Nationell RDA-term @sv
created: 2018-11-01
modified: 2024-08-27
alternative label: educational scientists @en
alternative label: kasvatustieteilijät
alternative label: pedagoger @sv
in scheme: Metatietosanasto
preferred label: educational scientist @en
preferred label: pedagog (forskare) @sv

teloittaja
type: Concept
source: Kansallinen RDA-termi
source: YSO-termi
source: ALLFO-term @sv
source: Nationell RDA-term @sv
created: 2018-11-01
modified: 2024-08-27
alternative label: executioners @en
alternative label: pyövelit
alternative label: teloittajat
alternative label: avrättare @sv
alternative label: bödlar @sv
alternative label: skarprättare @sv
in scheme: Metatietosanasto
preferred label: executioner @en
preferred label: bödel @sv

tehtailija
type: Concept
source: Kansallinen RDA-termi
source: YSO-termi
source: ALLFO-term @sv
source: Nationell RDA-term @sv
created: 2018-11-01
modified: 2024-08-27
alternative label: factory owners @en
alternative label: industrialists @en
alternative label: tehtaanomistajat
alternative label: tehtailijat
alternative label: fabrikörer @sv
in scheme: Metatietosanasto
preferred label: industrialist @en
preferred label: fabrikör @sv

hiili
type: Concept
source: RDA-termi
source: RDA-term @sv
created: 2016-01-08
modified: 2023-05-17
definition: Tummanharmaa jäännösmateriaali, joka muodostuu hiilestä ja jäljelle jääneestä tuhkasta, kun eläin- tai kasviperäisestä aineksesta poistetaan vesi ja muut haihtuvat yhdisteet.
definition: Mörkgrått restmaterial som bildas av kol och den aska som blir kvar när vatten och andra avdunstande föreningar ur animaliskt eller vegetabiliskt material avlägsnas. @sv
in scheme: Metatietosanasto
preferred label: charcoal @en
preferred label: kol @sv

ylihoitaja
type: Concept
source: Kansallinen RDA-termi
source: YSO-termi
source: ALLFO-term @sv
source: Nationell RDA-term @sv
created: 2018-11-01
modified: 2024-08-27
alternative label: senior nursing officers @en
alternative label: ylihoitajat
in scheme: Metatietosanasto
preferred label: senior nursing officer @en
preferred label: överskötare @sv

henkikirjoittaja
type: Concept
source: Kansallinen RDA-termi
source: YSO-termi
source: ALLFO-term @sv
source: Nationell RDA-term @sv
created: 2018-11-01
modified: 2024-08-27
alternative label: district registrar (profession) @en
alternative label: district registrars @en
alternative label: henkikirjoittaja (ammatti)
alternative label: henkikirjoittajat
alternative label: häradsskrivare (yrke) @sv
alternative label: mantalsskrivare @sv
in scheme: Metatietosanasto
preferred label: district registrar @en
preferred label: häradsskrivare @sv

juontaja
type: Concept
source: Kansallinen RDA-termi
source: YSO-termi
source: ALLFO-term @sv
source: Nationell RDA-term @sv
created: 2018-11-01
modified: 2024-08-27
alternative label: juontaja (ammatti)
alternative label: programledare (yrke) @sv
in scheme: Metatietosanasto
preferred label: presenter @en
preferred label: programledare @sv

lastenhoitaja
type: Concept
source: Kansallinen RDA-termi
source: YSO-termi
source: ALLFO-term @sv
source: Nationell RDA-term @sv
created: 2018-11-01
modified: 2024-08-27
alternative label: nannies @en
alternative label: lastenhoitajat
alternative label: barnvårdare @sv
in scheme: Metatietosanasto
preferred label: nanny @en
preferred label: barnskötare @sv

uskontotieteilijä
type: Concept
source: Kansallinen RDA-termi
source: YSO-termi
source: ALLFO-term @sv
source: Nationell RDA-term @sv
created: 2018-11-01
modified: 2024-08-27
alternative label: religious science scholars @en
alternative label: uskontotieteilijät
alternative label: religionsforskare @sv
in scheme: Metatietosanasto
preferred label: religious science scholar @en
preferred label: religionsvetare @sv

kopisti
type: Concept
source: Kansallinen RDA-termi
source: YSO-termi
source: ALLFO-term @sv
source: Nationell RDA-term @sv
created: 2018-11-01
modified: 2024-08-27
alternative label: copyists @en
alternative label: kopistit
alternative label: kopister @sv
in scheme: Metatietosanasto
preferred label: copyist @en
preferred label: kopist @sv

Yhteisö
type: ConceptGroup
type: Collection
source: RDA-termi
source: RDA-term @sv
created: 2016-01-08
modified: 2025-03-28
definition: A collective agent who is composed of persons who are organized for a common purpose or activity. @en
definition: Yhteistoimija, joka muodostuu henkilöistä, jotka ovat järjestäytyneet yhteistä päämäärää tai toimintaa varten.
definition: Organisation eller grupp personer och/eller organisationer, som är känd med ett visst namn, och som fungerar eller kan fungera som en helhet. @sv
member: category of corporate body
member: field of activity of corporate body
member: julkishallinnollisen yhteisön kategoria
member: muu yhteisöön liittyvä määrite
preferred label: Corporate body @en
preferred label: Institution @sv

koulunkäyntiavustaja
type: Concept
source: Kansallinen RDA-termi
source: YSO-termi
source: ALLFO-term @sv
source: Nationell RDA-term @sv
created: 2018-11-01
modified: 2024-08-27
alternative label: special needs teaching assistants @en
alternative label: koulunkäyntiavustajat
alternative label: elevassistenter @sv
alternative label: skolgångsbiträden @sv
in scheme: Metatietosanasto
preferred label: special needs teaching assistant @en
preferred label: skolgångsbiträde @sv

valtiopäivämies
type: Concept
source: Kansallinen RDA-termi
source: YSO-termi
source: ALLFO-term @sv
source: Nationell RDA-term @sv
created: 2018-11-01
modified: 2024-08-27
alternative label: delegates to the diet @en
alternative label: valtiopäivämiehet
alternative label: lantdagsmän @sv
in scheme: Metatietosanasto
preferred label: delegate to the diet @en
preferred label: lantdagsman @sv

kuusi-kahdeksan kertaa vuodessa
type: Concept
source: Kansallinen RDA-termi
source: Nationell RDA-term @sv
created: 2016-01-08
modified: 2025-10-04
in scheme: Metatietosanasto
preferred label: sex-åtta gånger per år @sv

yhteiskuntatieteilijä
type: Concept
source: Kansallinen RDA-termi
source: YSO-termi
source: ALLFO-term @sv
source: Nationell RDA-term @sv
created: 2018-11-01
modified: 2024-08-27
alternative label: social scientists @en
alternative label: yhteiskuntatieteilijät
in scheme: Metatietosanasto
preferred label: social scientist @en
preferred label: samhällsvetare @sv

matemaatikko
type: Concept
source: Kansallinen RDA-termi
source: YSO-termi
source: ALLFO-term @sv
source: Nationell RDA-term @sv
created: 2018-11-01
modified: 2024-08-27
alternative label: mathematicians @en
alternative label: matemaatikot
in scheme: Metatietosanasto
preferred label: mathematician @en
preferred label: matematiker @sv

konsulentti
type: Concept
source: Kansallinen RDA-termi
source: YSO-termi
source: ALLFO-term @sv
source: Nationell RDA-term @sv
created: 2018-11-01
modified: 2024-08-27
alternative label: product demonstrators @en
alternative label: konsulentit
alternative label: konsulenter @sv
in scheme: Metatietosanasto
preferred label: product demonstrator @en
preferred label: konsulent @sv

seikkailija
type: Concept
source: Kansallinen RDA-termi
source: YSO-termi
source: ALLFO-term @sv
source: Nationell RDA-term @sv
created: 2018-11-01
modified: 2024-08-27
alternative label: adventurers @en
alternative label: seikkailijat
in scheme: Metatietosanasto
preferred label: adventurer @en
preferred label: äventyrare @sv

röntgenhoitaja
type: Concept
source: Kansallinen RDA-termi
source: YSO-termi
source: ALLFO-term @sv
source: Nationell RDA-term @sv
created: 2018-11-01
modified: 2024-08-27
alternative label: röntgenhoitajat
alternative label: röntgensköterskor @sv
in scheme: Metatietosanasto
preferred label: röntgenskötare @sv

kykyjenetsijä
type: Concept
source: Kansallinen RDA-termi
source: YSO-termi
source: ALLFO-term @sv
source: Nationell RDA-term @sv
created: 2018-11-01
modified: 2024-08-27
alternative label: headhunters @en
alternative label: talent scouts @en
alternative label: kykyjenetsijät
alternative label: talangletare @sv
alternative label: talangscouter @sv
alternative label: talangsökare @sv
in scheme: Metatietosanasto
preferred label: headhunter (recruiter) @en
preferred label: talangscout @sv

joogi
type: Concept
source: Kansallinen RDA-termi
source: YSO-termi
source: ALLFO-term @sv
source: Nationell RDA-term @sv
created: 2018-11-01
modified: 2024-08-27
alternative label: yogis @en
alternative label: joogit
alternative label: yogier @sv
in scheme: Metatietosanasto
preferred label: yogi @en

ostettu
type: Concept
source: Kansallinen RDA-termi
source: Nationell RDA-term @sv
created: 2016-01-08
modified: 2024-05-24
in scheme: Metatietosanasto
preferred label: köpt @sv

lastenvalvoja
type: Concept
source: Kansallinen RDA-termi
source: YSO-termi
source: ALLFO-term @sv
source: Nationell RDA-term @sv
created: 2018-11-01
modified: 2024-08-27
alternative label: child welfare officers @en
alternative label: lastenvalvojat
alternative label: barnatillsyningsmän @sv
alternative label: barnavårdsmän @sv
in scheme: Metatietosanasto
preferred label: child welfare officer @en
preferred label: barnatillsyningsman @sv

baarimestari
type: Concept
source: Kansallinen RDA-termi
source: YSO-termi
source: ALLFO-term @sv
source: Nationell RDA-term @sv
created: 2018-11-01
modified: 2024-08-27
alternative label: bartenders @en
alternative label: baarimestarit
in scheme: Metatietosanasto
preferred label: bartender @en
preferred label: barmästare @sv

filosofi
type: Concept
source: Kansallinen RDA-termi
source: YSO-termi
source: ALLFO-term @sv
source: Nationell RDA-term @sv
created: 2018-11-01
modified: 2024-08-27
alternative label: philosophers @en
alternative label: filosofit
alternative label: filosofer @sv
in scheme: Metatietosanasto
preferred label: philosopher @en
preferred label: filosof @sv

toimitsija
type: Concept
source: Kansallinen RDA-termi
source: YSO-termi
source: ALLFO-term @sv
source: Nationell RDA-term @sv
created: 2018-11-01
modified: 2024-08-27
alternative label: officials in associations @en
alternative label: toimitsijat
alternative label: funktionärer @sv
in scheme: Metatietosanasto
preferred label: official in association @en
preferred label: funktionär @sv

TeX
type: Concept
source: Kansallinen RDA-termi
source: Nationell RDA-term @sv
created: 2016-01-08
modified: 2024-05-24
in scheme: Metatietosanasto

lennonjohtaja
type: Concept
source: Kansallinen RDA-termi
source: YSO-termi
source: ALLFO-term @sv
source: Nationell RDA-term @sv
created: 2018-11-01
modified: 2024-08-27
alternative label: air traffic controllers @en
alternative label: lennonjohtajat
in scheme: Metatietosanasto
preferred label: air traffic controller @en
preferred label: flygledare @sv

kehitysvammaisten hoitaja
type: Concept
source: Kansallinen RDA-termi
source: YSO-termi
source: ALLFO-term @sv
source: Nationell RDA-term @sv
created: 2018-11-01
modified: 2024-08-27
alternative label: vårdare av utvecklingshämmade @sv
in scheme: Metatietosanasto
preferred label: nurse for persons with developmental disabilities @en
preferred label: vårdare av personer med utvecklingsstörning @sv

bryologi
type: Concept
source: Kansallinen RDA-termi
source: YSO-termi
source: ALLFO-term @sv
source: Nationell RDA-term @sv
created: 2018-11-01
modified: 2024-08-27
alternative label: bryologists @en
alternative label: bryologit
alternative label: sammaltutkijat
alternative label: bryologer @sv
in scheme: Metatietosanasto
preferred label: bryologist @en
preferred label: bryolog @sv

valtiotieteilijä
type: Concept
source: Kansallinen RDA-termi
source: YSO-termi
source: ALLFO-term @sv
source: Nationell RDA-term @sv
created: 2018-11-01
modified: 2024-08-27
alternative label: political scientists @en
alternative label: valtiotieteilijät
in scheme: Metatietosanasto
preferred label: political scientist @en
preferred label: statsvetare @sv

lobbari
type: Concept
source: Kansallinen RDA-termi
source: YSO-termi
source: ALLFO-term @sv
source: Nationell RDA-term @sv
created: 2018-11-01
modified: 2024-08-27
alternative label: lobbyists @en
alternative label: lobbarit
in scheme: Metatietosanasto
preferred label: lobbyist @en
preferred label: lobbare @sv

egyptologi
type: Concept
source: Kansallinen RDA-termi
source: YSO-termi
source: ALLFO-term @sv
source: Nationell RDA-term @sv
created: 2018-11-01
modified: 2024-08-27
alternative label: egyptologists @en
alternative label: egyptologit
alternative label: egyptologer @sv
in scheme: Metatietosanasto
preferred label: egyptologist @en
preferred label: egyptolog @sv

tilintarkastaja
type: Concept
source: Kansallinen RDA-termi
source: YSO-termi
source: ALLFO-term @sv
source: Nationell RDA-term @sv
created: 2018-11-01
modified: 2024-08-27
alternative label: accountants @en
alternative label: auditors @en
alternative label: tilintarkastajat
alternative label: revisorer @sv
alternative label: räkenskapsgranskare @sv
in scheme: Metatietosanasto
preferred label: auditor (accountant) @en
preferred label: revisor @sv

tietokasetti
type: Concept
source: RDA-termi
source: RDA-term @sv
created: 2016-01-08
modified: 2023-05-17
definition: Tietonauhan sisältävä kasetti.
definition: Kassett som innehåller datorband. @sv
in scheme: Metatietosanasto
preferred label: computer tape casette @en
preferred label: datorkassett @sv
scope note: Tietokonetallenne.
scope note: Datorbärare. @sv

laamanni
type: Concept
source: Kansallinen RDA-termi
source: YSO-termi
source: ALLFO-term @sv
source: Nationell RDA-term @sv
created: 2018-11-01
modified: 2024-08-27
alternative label: laamanni (ammatti)
alternative label: lagman (yrke) @sv
in scheme: Metatietosanasto
preferred label: lagman @sv

mielisairaanhoitaja
type: Concept
source: Kansallinen RDA-termi
source: YSO-termi
source: ALLFO-term @sv
source: Nationell RDA-term @sv
created: 2018-11-01
modified: 2024-08-27
alternative label: mental nurses @en
alternative label: mielisairaanhoitajat
in scheme: Metatietosanasto
preferred label: mental nurse @en
preferred label: sinnessjukvårdare @sv

sosiologi
type: Concept
source: Kansallinen RDA-termi
source: YSO-termi
source: ALLFO-term @sv
source: Nationell RDA-term @sv
created: 2018-11-01
modified: 2024-08-27
alternative label: sociologists @en
alternative label: sosiologit
alternative label: sociologer @sv
in scheme: Metatietosanasto
preferred label: sociologist @en
preferred label: sociolog @sv

kerroshoitaja
type: Concept
source: Kansallinen RDA-termi
source: YSO-termi
source: ALLFO-term @sv
source: Nationell RDA-term @sv
created: 2018-11-01
modified: 2024-08-27
alternative label: hotel cleaners @en
alternative label: kerroshoitajat
in scheme: Metatietosanasto
preferred label: hotel cleaner @en
preferred label: våningsstädare @sv

toiminimi
type: Concept
source: Kansallinen RDA-termi
source: Nationell RDA-term @sv
created: 2016-01-08
modified: 2024-05-24
alternative label: yksityinen elinkeinonharjoittaja
alternative label: enskild näringsidkare @sv
alternative label: firma @sv
definition: Elinkeinotoimintaa harjoittava luonnollinen henkilö erotukseksi vastaavaa toimintaa harjoittavasta yhtiöstä.
definition: Fysisk person som utövar näringsverksamhet, till skillnad från bolag som utövar motsvarande verksamhet. @sv
example: Vaasan osoitteet (toiminimi)
example: Vasa adresser (firmanamn) @sv
in scheme: Metatietosanasto
preferred label: firmanamn @sv

työvälinemestari
type: Concept
source: Kansallinen RDA-termi
source: YSO-termi
source: ALLFO-term @sv
source: Nationell RDA-term @sv
created: 2018-11-01
modified: 2024-08-27
alternative label: instrument makers @en
alternative label: työvälinemestarit
in scheme: Metatietosanasto
preferred label: instrument maker @en
preferred label: verktygsmästare @sv

Ilmestymistiheys
type: ConceptGroup
type: Collection
source: RDA-termi
source: RDA-term @sv
created: 2016-01-08
modified: 2025-05-13
alternative label: Note on frequency @en
alternative label: Huomautus ilmestymistiheydestä
alternative label: Anmärkning om utgivningsfrekvens @sv
definition: Liittää manifestaation ilmestymistiheyteen, joka ilmaisee, millaisin aikavälein sarja-aineiston numerot tai osat ilmestyvät tai päivittyvän aineiston päivitykset tapahtuvat.
definition: Sammankopplar manifestation med en utgivningsfrekvens som anger med hurudana intervall nummer eller delar i en seriell resurs utkommer eller uppdateringar i en integrerande resurs sker. @sv
member: kolme kertaa vuodessa
member: kolme kertaa viikossa
member: kuukausittain
member: päivitetään jatkuvasti
member: yksi-kaksi kertaa vuodessa
member: epäsäännöllinen
member: kymmenen numeroa vuodessa
member: viikoittain
member: kuusi-kahdeksan kertaa vuodessa
member: vuosittain
member: kaksi kertaa kuukaudessa
member: kolme kertaa kuukaudessa
member: joka toinen viikko
member: kaksi kertaa viikossa
member: päivittäin
member: kerran kahdessa kuukaudessa
member: neljä kertaa vuodessa
member: kerran kolmessa vuodessa
member: kaksi kertaa vuodessa
member: kerran kahdessa vuodessa
member: ilmestymistiheys vaihtelee
member: ilmestymistiheys ei tiedossa
preferred label: Frequency @en
preferred label: Utgivningsfrekvens @sv

varanotaari
type: Concept
source: Kansallinen RDA-termi
source: YSO-termi
source: ALLFO-term @sv
source: Nationell RDA-term @sv
created: 2018-11-01
modified: 2024-08-27
alternative label: varanotaari (ammatti)
alternative label: vicenotarie (yrke) @sv
in scheme: Metatietosanasto
preferred label: associate in laws @en
preferred label: vicenotarie @sv

politiikantutkija
type: Concept
source: Kansallinen RDA-termi
source: YSO-termi
source: ALLFO-term @sv
source: Nationell RDA-term @sv
created: 2018-11-01
modified: 2024-08-27
alternative label: political science researchers @en
alternative label: politiikantutkijat
alternative label: politologit
alternative label: politologer @sv
in scheme: Metatietosanasto
preferred label: political scientist @en
preferred label: politikforskare @sv

rakennusmestari
type: Concept
source: Kansallinen RDA-termi
source: YSO-termi
source: ALLFO-term @sv
source: Nationell RDA-term @sv
created: 2018-11-01
modified: 2024-08-27
alternative label: master builders @en
alternative label: rakennusmestarit
in scheme: Metatietosanasto
preferred label: master builder @en
preferred label: byggmästare @sv

terveystarkastaja
type: Concept
source: Kansallinen RDA-termi
source: YSO-termi
source: ALLFO-term @sv
source: Nationell RDA-term @sv
created: 2018-11-01
modified: 2024-08-27
alternative label: health inspectors @en
alternative label: terveystarkastajat
alternative label: hälsoinspektörer @sv
in scheme: Metatietosanasto
preferred label: health inspector @en
preferred label: hälsoinspektör @sv

munkki
type: Concept
source: Kansallinen RDA-termi
source: Nationell RDA-term @sv
created: 2016-01-08
modified: 2024-05-24
definition: Munkkikunnan jäsenen nimitys.
definition: Benämning på medlem i munkorden. @sv
in scheme: Metatietosanasto
preferred label: munk @sv

lehdenjakaja
type: Concept
source: Kansallinen RDA-termi
source: YSO-termi
source: ALLFO-term @sv
source: Nationell RDA-term @sv
created: 2018-11-01
modified: 2024-08-27
alternative label: newspaper carriers @en
alternative label: lehdenjakajat
alternative label: sanomalehdenjakajat
alternative label: tidningsbärare @sv
alternative label: tidningsutbärare @sv
alternative label: tidningsutdelare @sv
in scheme: Metatietosanasto
preferred label: newspaper carrier @en
preferred label: tidningsbud @sv

tietojenkäsittelytieteilijä
type: Concept
source: Kansallinen RDA-termi
source: YSO-termi
source: ALLFO-term @sv
source: Nationell RDA-term @sv
created: 2018-11-01
modified: 2024-08-27
alternative label: computer scientists @en
alternative label: tietojenkäsittelytieteilijät
in scheme: Metatietosanasto
preferred label: computer scientist @en
preferred label: IT-vetare @sv

luonnontieteilijä
type: Concept
source: Kansallinen RDA-termi
source: YSO-termi
source: ALLFO-term @sv
source: Nationell RDA-term @sv
created: 2018-11-01
modified: 2024-08-27
alternative label: natural scientists @en
alternative label: luonnontieteilijät
alternative label: naturvetare @sv
alternative label: naturvetenskapsmän @sv
in scheme: Metatietosanasto
preferred label: natural scientist @en
preferred label: naturvetenskapsman @sv

verhoilija
type: Concept
source: Kansallinen RDA-termi
source: YSO-termi
source: ALLFO-term @sv
source: Nationell RDA-term @sv
created: 2018-11-01
modified: 2024-08-27
alternative label: upholsterers @en
alternative label: verhoilijat
in scheme: Metatietosanasto
preferred label: upholsterer @en
preferred label: tapetserare @sv

kuningatar
type: Concept
source: Kansallinen RDA-termi
source: Nationell RDA-term @sv
created: 2016-01-08
modified: 2024-05-24
definition: Kuninkaan puoliso; kuningaskunnan naispuolinen hallitsija.
definition: Gemål till kung; kvinnlig härskare över kungarike. @sv
in scheme: Metatietosanasto
preferred label: drottning @sv

taidehistorioitsija
type: Concept
source: Kansallinen RDA-termi
source: YSO-termi
source: ALLFO-term @sv
source: Nationell RDA-term @sv
created: 2018-11-01
modified: 2024-08-27
alternative label: art historians @en
alternative label: taidehistorian tutkijat
alternative label: taidehistorioitsijat
in scheme: Metatietosanasto
preferred label: art historian @en
preferred label: konsthistoriker @sv

katsastaja
type: Concept
source: Kansallinen RDA-termi
source: YSO-termi
source: ALLFO-term @sv
source: Nationell RDA-term @sv
created: 2018-11-01
modified: 2024-08-27
alternative label: vehicle inspectors @en
alternative label: katsastajat
alternative label: katsastusmiehet
alternative label: besiktare @sv
alternative label: besiktningsmän @sv
in scheme: Metatietosanasto
preferred label: vehicle inspector @en
preferred label: besiktningsman @sv

lentoemäntä
type: Concept
source: Kansallinen RDA-termi
source: YSO-termi
source: ALLFO-term @sv
source: Nationell RDA-term @sv
created: 2018-11-01
modified: 2024-08-27
alternative label: flight attendants @en
alternative label: lentoemännät
alternative label: flygvärdinnor @sv
in scheme: Metatietosanasto
preferred label: flight attendant @en
preferred label: flygvärdinna @sv

asuntolanhoitaja
type: Concept
source: Kansallinen RDA-termi
source: YSO-termi
source: ALLFO-term @sv
source: Nationell RDA-term @sv
created: 2018-11-01
modified: 2024-08-27
alternative label: dorm managers @en
alternative label: asuntolanhoitajat
alternative label: elevhemsföreståndare @sv
in scheme: Metatietosanasto
preferred label: dorm manager @en
preferred label: internatföreståndare @sv

geologi
type: Concept
source: Kansallinen RDA-termi
source: YSO-termi
source: ALLFO-term @sv
source: Nationell RDA-term @sv
created: 2018-11-01
modified: 2024-08-27
alternative label: geologists @en
alternative label: geologit
alternative label: geologer @sv
in scheme: Metatietosanasto
preferred label: geologist @en
preferred label: geolog @sv

kaivertaja
type: Concept
source: Kansallinen RDA-termi
source: YSO-termi
source: ALLFO-term @sv
source: Nationell RDA-term @sv
created: 2018-11-01
modified: 2024-08-27
alternative label: kaivertaja (ammatti)
alternative label: gravör (yrke) @sv
in scheme: Metatietosanasto
preferred label: engraver @en
preferred label: gravör @sv

tilastotieteilijä
type: Concept
source: Kansallinen RDA-termi
source: YSO-termi
source: ALLFO-term @sv
source: Nationell RDA-term @sv
created: 2018-11-01
modified: 2024-08-27
alternative label: statisticians @en
alternative label: tilastotieteilijät
alternative label: statistiker @sv
in scheme: Metatietosanasto
preferred label: statistician @en
preferred label: statistiker (yrke) @sv

käsikirjoittaja
type: Concept
source: Kansallinen RDA-termi
source: YSO-termi
source: ALLFO-term @sv
source: Nationell RDA-term @sv
created: 2018-11-01
modified: 2024-08-27
alternative label: screenwriter @en
alternative label: käsikirjoittaja (ammatti)
alternative label: manusförfattare (yrke) @sv
in scheme: Metatietosanasto
preferred label: scriptwriter @en
preferred label: manusförfattare @sv

konsultti
type: Concept
source: Kansallinen RDA-termi
source: YSO-termi
source: ALLFO-term @sv
source: Nationell RDA-term @sv
created: 2018-11-01
modified: 2024-08-27
alternative label: consultants @en
alternative label: konsultit
alternative label: konsulter @sv
in scheme: Metatietosanasto
preferred label: consultant @en
preferred label: konsult @sv

korkeimman hallinto-oikeuden presidentti
type: Concept
source: Kansallinen RDA-termi
source: YSO-termi
source: ALLFO-term @sv
source: Nationell RDA-term @sv
created: 2018-11-01
modified: 2024-08-27
alternative label: presidents of the Supreme Administrative Court of Finland @en
alternative label: korkeimman hallinto-oikeuden presidentit
alternative label: högsta förvaltningsdomstolens presidenter @sv
in scheme: Metatietosanasto
preferred label: president of the Supreme Administrative Court of Finland @en
preferred label: högsta förvaltningsdomstolens president @sv

hovioikeudenneuvos
type: Concept
source: Kansallinen RDA-termi
source: YSO-termi
source: ALLFO-term @sv
source: Nationell RDA-term @sv
created: 2018-11-01
modified: 2024-08-27
alternative label: justices of Court of Appeal @en
alternative label: hovioikeudenneuvokset
in scheme: Metatietosanasto
preferred label: justice of Court of Appeal @en
preferred label: hovrättsråd @sv

arkeologi
type: Concept
source: Kansallinen RDA-termi
source: YSO-termi
source: ALLFO-term @sv
source: Nationell RDA-term @sv
created: 2018-11-01
modified: 2024-08-27
alternative label: archaeologists @en
alternative label: arkeologit
alternative label: arkeologer @sv
in scheme: Metatietosanasto
preferred label: archaeologist @en
preferred label: arkeolog @sv

kartografi
type: Concept
source: Kansallinen RDA-termi
source: YSO-termi
source: ALLFO-term @sv
source: Nationell RDA-term @sv
created: 2018-11-01
modified: 2024-08-27
alternative label: cartographers @en
alternative label: kartografit
alternative label: kartografer @sv
in scheme: Metatietosanasto
preferred label: cartographer @en
preferred label: kartograf @sv

navigoija
type: Concept
source: Kansallinen RDA-termi
source: YSO-termi
source: ALLFO-term @sv
source: Nationell RDA-term @sv
created: 2018-11-01
modified: 2024-08-27
alternative label: navigators @en
alternative label: navigaattorit -- ammatit
alternative label: navigoijat
alternative label: navigatörer @sv
in scheme: Metatietosanasto
preferred label: navigator @en
preferred label: navigatör @sv

tekninen piirtäjä
type: Concept
source: Kansallinen RDA-termi
source: YSO-termi
source: ALLFO-term @sv
source: Nationell RDA-term @sv
created: 2018-11-01
modified: 2024-08-27
alternative label: technical drawers @en
alternative label: tekniset piirtäjät
alternative label: tekniska ritare @sv
in scheme: Metatietosanasto
preferred label: technical drawer @en
preferred label: teknisk ritare @sv

varapresidentti
type: Concept
source: Kansallinen RDA-termi
source: YSO-termi
source: ALLFO-term @sv
source: Nationell RDA-term @sv
created: 2018-11-01
modified: 2024-08-27
alternative label: vice presidents @en
alternative label: varapresidentit
alternative label: vicepresidenter @sv
in scheme: Metatietosanasto
preferred label: vice president @en
preferred label: vicepresident @sv

kodinhoitaja
type: Concept
source: Kansallinen RDA-termi
source: YSO-termi
source: ALLFO-term @sv
source: Nationell RDA-term @sv
created: 2018-11-01
modified: 2024-08-27
alternative label: domestic aids @en
alternative label: home aids @en
alternative label: kodinhoitajat
in scheme: Metatietosanasto
preferred label: domestic aid @en
preferred label: hemvårdare @sv

modisti
type: Concept
source: Kansallinen RDA-termi
source: YSO-termi
source: ALLFO-term @sv
source: Nationell RDA-term @sv
created: 2018-11-01
modified: 2024-08-27
alternative label: milliners @en
alternative label: modistit
alternative label: modister @sv
in scheme: Metatietosanasto
preferred label: milliner @en
preferred label: modist @sv

sotarikollinen
type: Concept
source: Kansallinen RDA-termi
source: YSO-termi
source: ALLFO-term @sv
source: Nationell RDA-term @sv
created: 2018-11-01
modified: 2024-08-27
alternative label: war criminals @en
alternative label: sotarikolliset
in scheme: Metatietosanasto
preferred label: war criminal @en
preferred label: krigsförbrytare @sv

puhelunvälittäjä
type: Concept
source: Kansallinen RDA-termi
source: YSO-termi
source: ALLFO-term @sv
source: Nationell RDA-term @sv
created: 2018-11-01
modified: 2024-08-27
alternative label: telephone operators @en
alternative label: puhelunvälittäjät
alternative label: telefonister @sv
in scheme: Metatietosanasto
preferred label: telephone operator @en
preferred label: telefonist @sv

pakinoitsija
type: Concept
source: Kansallinen RDA-termi
source: YSO-termi
source: ALLFO-term @sv
source: Nationell RDA-term @sv
created: 2018-11-01
modified: 2024-08-27
alternative label: feuilletonists @en
alternative label: pakinoitsijat
alternative label: kåsörer @sv
in scheme: Metatietosanasto
preferred label: feuilletonist @en
preferred label: kåsör @sv

myyntiedustaja
type: Concept
source: Kansallinen RDA-termi
source: YSO-termi
source: ALLFO-term @sv
source: Nationell RDA-term @sv
created: 2018-11-01
modified: 2024-08-27
alternative label: sales agents @en
alternative label: sales representatives @en
alternative label: agentit
alternative label: kauppa-agentit
alternative label: kauppaedustajat
alternative label: myyntiedustajat
alternative label: myyntimiehet
alternative label: affärsrepresentanter @sv
alternative label: agenter @sv
alternative label: försäljningsagenter @sv
alternative label: handelsrepresentanter @sv
in scheme: Metatietosanasto
preferred label: sales agent @en
preferred label: handelsrepresentant @sv

tekstiilihuoltaja
type: Concept
source: Kansallinen RDA-termi
source: YSO-termi
source: ALLFO-term @sv
source: Nationell RDA-term @sv
created: 2018-11-01
modified: 2024-08-27
alternative label: textile keepers @en
alternative label: textiles care operatives @en
alternative label: tekstiilihuoltajat
in scheme: Metatietosanasto
preferred label: textile care operative @en
preferred label: textilvårdare @sv

levytyömestari
type: Concept
source: Kansallinen RDA-termi
source: YSO-termi
source: ALLFO-term @sv
source: Nationell RDA-term @sv
created: 2018-11-01
modified: 2024-08-27
alternative label: sheet metal foremen @en
alternative label: levytyömestarit
in scheme: Metatietosanasto
preferred label: sheet metal foreman @en
preferred label: plåtarbetsmästare @sv

fysioterapeutti
type: Concept
source: Kansallinen RDA-termi
source: YSO-termi
source: ALLFO-term @sv
source: Nationell RDA-term @sv
created: 2018-11-01
modified: 2024-08-27
alternative label: physical therapists @en
alternative label: physiotherapists @en
alternative label: fysioterapeutit
alternative label: fysioterapeuter @sv
in scheme: Metatietosanasto
preferred label: physical therapist @en
preferred label: fysioterapeut @sv

lämmittäjä
type: Concept
source: Kansallinen RDA-termi
source: YSO-termi
source: ALLFO-term @sv
source: Nationell RDA-term @sv
created: 2018-11-01
modified: 2024-08-27
alternative label: stokers @en
alternative label: lämmittäjät
in scheme: Metatietosanasto
preferred label: stoker @en
preferred label: eldare @sv

äitiö
type: Concept
source: RDA-termi
source: RDA-term @sv
created: 2016-01-08
modified: 2023-05-17
alternative label: pressmatris (modermatrisens negativ) @sv
definition: Äänitteen sukupolven määrite originaalilevyn positiiviselle metallikopiolle, jota on käytetty yhden tai useamman isiön tuottamiseen.
definition: Bestämning av generation för en originalskivas positivkopia i metall, som har använts för att producera en eller flera patriser. @sv
in scheme: Metatietosanasto
preferred label: mother @en
preferred label: matris @sv

3 raitaa
type: Concept
source: Kansallinen RDA-termi
source: Nationell RDA-term @sv
created: 2016-01-08
modified: 2024-05-24
in scheme: Metatietosanasto
preferred label: 3 ljudspår @sv

farmaseutti
type: Concept
source: Kansallinen RDA-termi
source: YSO-termi
source: ALLFO-term @sv
source: Nationell RDA-term @sv
created: 2018-11-01
modified: 2024-08-27
alternative label: pharmacists @en
alternative label: farmaseutit
alternative label: farmaceuter @sv
in scheme: Metatietosanasto
preferred label: pharmacist (occupation) @en
preferred label: farmaceut @sv

manageri
type: Concept
source: Kansallinen RDA-termi
source: YSO-termi
source: ALLFO-term @sv
source: Nationell RDA-term @sv
created: 2018-11-01
modified: 2024-08-27
alternative label: managers @en
alternative label: managerit
in scheme: Metatietosanasto
preferred label: manager @en

laivameklari
type: Concept
source: Kansallinen RDA-termi
source: YSO-termi
source: ALLFO-term @sv
source: Nationell RDA-term @sv
created: 2018-11-01
modified: 2024-08-27
alternative label: ship brokers @en
alternative label: laivameklarit
in scheme: Metatietosanasto
preferred label: ship broker @en
preferred label: skeppsmäklare @sv

kotiapulainen
type: Concept
source: Kansallinen RDA-termi
source: YSO-termi
source: ALLFO-term @sv
source: Nationell RDA-term @sv
created: 2018-11-01
modified: 2024-08-27
alternative label: household servants @en
alternative label: kotiapulaiset
alternative label: hembiträden @sv
in scheme: Metatietosanasto
preferred label: household servant @en
preferred label: hembiträde @sv

kuvernööri
type: Concept
source: Kansallinen RDA-termi
source: YSO-termi
source: ALLFO-term @sv
source: Nationell RDA-term @sv
created: 2018-11-01
modified: 2024-08-27
alternative label: governors @en
alternative label: kuvernöörit
alternative label: guvernörer @sv
in scheme: Metatietosanasto
preferred label: governor @en
preferred label: guvernör @sv

katekeetta
type: Concept
source: Kansallinen RDA-termi
source: YSO-termi
source: ALLFO-term @sv
source: Nationell RDA-term @sv
created: 2018-11-01
modified: 2024-08-27
alternative label: catechists @en
alternative label: katekeetat
alternative label: kateketer @sv
in scheme: Metatietosanasto
preferred label: catechist @en
preferred label: kateket @sv

mikrokortti
type: Concept
source: RDA-termi
source: RDA-term @sv
created: 2016-01-08
modified: 2023-05-17
definition: Filmiarkki, jolla on mikrovalokuvia.
definition: Filmark med mikrobilder. @sv
in scheme: Metatietosanasto
preferred label: microfiche @en
preferred label: mikrofiche @sv
scope note: Mikromuotoinen tallenne.
scope note: Mikroformsbärare. @sv

lintutieteilijä
type: Concept
source: Kansallinen RDA-termi
source: YSO-termi
source: ALLFO-term @sv
source: Nationell RDA-term @sv
created: 2018-11-01
modified: 2024-08-27
alternative label: ornithologists @en
alternative label: lintutieteilijät
alternative label: ornitologit
alternative label: ornitologer @sv
in scheme: Metatietosanasto
preferred label: ornithologist @en
preferred label: ornitolog @sv

savenvalaja
type: Concept
source: Kansallinen RDA-termi
source: YSO-termi
source: ALLFO-term @sv
source: Nationell RDA-term @sv
created: 2018-11-01
modified: 2024-08-27
alternative label: potters @en
alternative label: savenvalajat
in scheme: Metatietosanasto
preferred label: potter @en
preferred label: krukmakare @sv

kiinteistönvälittäjä
type: Concept
source: Kansallinen RDA-termi
source: YSO-termi
source: ALLFO-term @sv
source: Nationell RDA-term @sv
created: 2018-11-01
modified: 2024-08-27
alternative label: kiinteistönvälittäjät
in scheme: Metatietosanasto
preferred label: fastighetsförmedlare @sv

vapaustaistelija
type: Concept
source: Kansallinen RDA-termi
source: YSO-termi
source: ALLFO-term @sv
source: Nationell RDA-term @sv
created: 2018-11-01
modified: 2024-08-27
alternative label: freedom fighters @en
alternative label: vapaustaistelijat
alternative label: frihetskämpar @sv
in scheme: Metatietosanasto
preferred label: freedom fighter @en
preferred label: frihetskämpe @sv

meijeristi
type: Concept
source: Kansallinen RDA-termi
source: YSO-termi
source: ALLFO-term @sv
source: Nationell RDA-term @sv
created: 2018-11-01
modified: 2024-08-27
alternative label: dairyperson @en
alternative label: meijeristit
alternative label: mejerister @sv
in scheme: Metatietosanasto
preferred label: dairy worker @en
preferred label: mejerist @sv

lautamies
type: Concept
source: Kansallinen RDA-termi
source: YSO-termi
source: ALLFO-term @sv
source: Nationell RDA-term @sv
created: 2018-11-01
modified: 2024-08-27
alternative label: lay judges @en
alternative label: lay members of court @en
alternative label: lautamiehet
alternative label: nämndemän @sv
in scheme: Metatietosanasto
preferred label: lay judge @en
preferred label: nämndeman @sv

Pelastusarmeijan upseeri
type: Concept
source: Kansallinen RDA-termi
source: YSO-termi
source: ALLFO-term @sv
source: Nationell RDA-term @sv
created: 2018-11-01
modified: 2025-04-26
alternative label: Salvation Army officers @en
alternative label: Pelastusarmeijan upseerit
alternative label: Frälsningsarméns officer @sv
alternative label: Frälsningsarméns officerare @sv
alternative label: frälsningsofficerare @sv
in scheme: Metatietosanasto
preferred label: Salvation Army officer @en
preferred label: frälsningsofficer @sv

kopiomasternauha
type: Concept
source: RDA-termi
source: RDA-term @sv
created: 2016-01-08
modified: 2023-05-17
definition: Äänitteen sukupolven määrite nauhakopiolle, yleensä originaalin ensimmäisen sukupolven kopiolle, jota käytetään massakopioiden valmistamiseen.
definition: Bestämning av generation för en bandkopia, vanligen originalets kopia i första generation, som används för att tillverka masskopior. @sv
in scheme: Metatietosanasto
preferred label: tape duplication master @en
preferred label: kopia av masterbandet @sv

laivuri
type: Concept
source: Kansallinen RDA-termi
source: YSO-termi
source: ALLFO-term @sv
source: Nationell RDA-term @sv
created: 2018-11-01
modified: 2024-08-27
alternative label: shipmasters @en
alternative label: shippers @en
alternative label: skippers @en
alternative label: laivurit
in scheme: Metatietosanasto
preferred label: skipper @en
preferred label: skeppare @sv

haastattelija
type: Concept
source: Kansallinen RDA-termi
source: YSO-termi
source: ALLFO-term @sv
source: Nationell RDA-term @sv
created: 2018-11-01
modified: 2024-08-27
alternative label: haastattelija (ammatti)
alternative label: intervjuare (yrke) @sv
in scheme: Metatietosanasto
preferred label: interviewer @en
preferred label: intervjuare @sv

elinkeinonharjoittaja
type: Concept
source: Kansallinen RDA-termi
source: YSO-termi
source: ALLFO-term @sv
source: Nationell RDA-term @sv
created: 2018-11-01
modified: 2024-08-27
alternative label: persons carrying on a trade @en
alternative label: elinkeinonharjoittajat
alternative label: näringsutövare @sv
in scheme: Metatietosanasto
preferred label: person carrying on a trade @en
preferred label: näringsidkare @sv

haudankaivaja
type: Concept
source: Kansallinen RDA-termi
source: YSO-termi
source: ALLFO-term @sv
source: Nationell RDA-term @sv
created: 2018-11-01
modified: 2024-08-27
alternative label: gravediggers @en
alternative label: haudankaivajat
in scheme: Metatietosanasto
preferred label: gravedigger @en
preferred label: gravgrävare @sv

radiologi
type: Concept
source: Kansallinen RDA-termi
source: YSO-termi
source: ALLFO-term @sv
source: Nationell RDA-term @sv
created: 2018-11-01
modified: 2024-08-27
alternative label: radiologists @en
alternative label: radiologit
alternative label: radiologer @sv
in scheme: Metatietosanasto
preferred label: radiologist @en
preferred label: radiolog @sv

faktori
type: Concept
source: Kansallinen RDA-termi
source: YSO-termi
source: ALLFO-term @sv
source: Nationell RDA-term @sv
created: 2018-11-01
modified: 2024-08-27
alternative label: print shop foremen @en
alternative label: print shop forepersons @en
alternative label: faktorit
alternative label: faktor (yrke) @sv
alternative label: faktorer @sv
in scheme: Metatietosanasto
preferred label: print shop foreperson @en
preferred label: faktor @sv

šaahitar
type: Concept
source: Kansallinen RDA-termi
source: YSO-termi
source: ALLFO-term @sv
source: Nationell RDA-term @sv
created: 2018-11-01
modified: 2025-10-30
alternative label: shaahittaret
alternative label: šaahittaret
in scheme: Metatietosanasto
preferred label: shahbanu @sv

kansatieteilijä
type: Concept
source: Kansallinen RDA-termi
source: YSO-termi
source: ALLFO-term @sv
source: Nationell RDA-term @sv
created: 2018-11-01
modified: 2024-08-27
alternative label: ethnologists @en
alternative label: etnografit
alternative label: etnologit
alternative label: kansatieteilijät
alternative label: etnografer @sv
alternative label: etnologer @sv
in scheme: Metatietosanasto
preferred label: ethnologist @en
preferred label: etnolog @sv

eläintenhoitaja
type: Concept
source: Kansallinen RDA-termi
source: YSO-termi
source: ALLFO-term @sv
source: Nationell RDA-term @sv
created: 2018-11-01
modified: 2024-08-27
alternative label: animal keepers @en
alternative label: eläintenhoitajat
in scheme: Metatietosanasto
preferred label: animal keeper @en
preferred label: djurskötare @sv

kartanpiirtäjä
type: Concept
source: Kansallinen RDA-termi
source: YSO-termi
source: ALLFO-term @sv
source: Nationell RDA-term @sv
created: 2018-11-01
modified: 2024-08-27
alternative label: map drawers @en
alternative label: kartanpiirtäjät
in scheme: Metatietosanasto
preferred label: map drawer @en
preferred label: kartritare @sv

neuvonantaja
type: Concept
source: Kansallinen RDA-termi
source: YSO-termi
source: ALLFO-term @sv
source: Nationell RDA-term @sv
created: 2018-11-01
modified: 2024-08-27
alternative label: advisers @en
alternative label: neuvonantajat
in scheme: Metatietosanasto
preferred label: adviser @en
preferred label: rådgivare @sv

isännöitsijä
type: Concept
source: Kansallinen RDA-termi
source: YSO-termi
source: ALLFO-term @sv
source: Nationell RDA-term @sv
created: 2018-11-01
modified: 2024-08-27
alternative label: deputy landlords @en
alternative label: property managers @en
alternative label: isännöitsijät
alternative label: disponenter @sv
alternative label: vicevärdar @sv
in scheme: Metatietosanasto
preferred label: property manager @en
preferred label: disponent @sv

lehdistöneuvos
type: Concept
source: Kansallinen RDA-termi
source: YSO-termi
source: ALLFO-term @sv
source: Nationell RDA-term @sv
created: 2018-11-01
modified: 2024-08-27
alternative label: lehdistöneuvos (ammatti)
alternative label: pressråd (yrke) @sv
in scheme: Metatietosanasto
preferred label: pressråd @sv

näyttämömestari
type: Concept
source: Kansallinen RDA-termi
source: YSO-termi
source: ALLFO-term @sv
source: Nationell RDA-term @sv
created: 2018-11-01
modified: 2024-08-27
alternative label: stage managers @en
alternative label: näyttämömestarit
in scheme: Metatietosanasto
preferred label: stage manager @en
preferred label: scenmästare @sv

proviisori
type: Concept
source: Kansallinen RDA-termi
source: YSO-termi
source: ALLFO-term @sv
source: Nationell RDA-term @sv
created: 2018-11-01
modified: 2024-08-27
alternative label: proviisori (ammatti)
alternative label: provisor (yrke) @sv
in scheme: Metatietosanasto
preferred label: qualified chemist @en
preferred label: provisor @sv

turkkuri
type: Concept
source: Kansallinen RDA-termi
source: YSO-termi
source: ALLFO-term @sv
source: Nationell RDA-term @sv
created: 2018-11-01
modified: 2024-08-27
alternative label: fur dealers @en
alternative label: turkkurit
alternative label: körsnärer @sv
in scheme: Metatietosanasto
preferred label: fur dealer @en
preferred label: körsnär @sv

merirosvo
type: Concept
source: Kansallinen RDA-termi
source: YSO-termi
source: ALLFO-term @sv
source: Nationell RDA-term @sv
created: 2018-11-01
modified: 2024-08-27
alternative label: pirates @en
alternative label: merirosvot
alternative label: pirater @sv
in scheme: Metatietosanasto
preferred label: pirate @en
preferred label: sjörövare @sv

turvamies
type: Concept
source: Kansallinen RDA-termi
source: YSO-termi
source: ALLFO-term @sv
source: Nationell RDA-term @sv
created: 2018-11-01
modified: 2024-08-27
alternative label: security guards @en
alternative label: security men @en
alternative label: henkivartijat
alternative label: turvallisuusmiehet
alternative label: turvamiehet
alternative label: säkerhetsmän @sv
in scheme: Metatietosanasto
preferred label: security guard @en
preferred label: säkerhetsman @sv

keittiöapulainen
type: Concept
source: Kansallinen RDA-termi
source: YSO-termi
source: ALLFO-term @sv
source: Nationell RDA-term @sv
created: 2018-11-01
modified: 2024-08-27
alternative label: kitchen assistants @en
alternative label: kitchen help @en
alternative label: keittiöapulaiset
alternative label: köksbiträden @sv
in scheme: Metatietosanasto
preferred label: kitchen assistant @en
preferred label: köksbiträde @sv

faarao
type: Concept
source: Kansallinen RDA-termi
source: YSO-termi
source: ALLFO-term @sv
source: Nationell RDA-term @sv
created: 2018-11-01
modified: 2025-10-30
alternative label: faaraot
alternative label: faraot
alternative label: faraoner @sv
in scheme: Metatietosanasto
preferred label: farao @sv

lähihoitaja
type: Concept
source: Kansallinen RDA-termi
source: YSO-termi
source: ALLFO-term @sv
source: Nationell RDA-term @sv
created: 2018-11-01
modified: 2024-08-27
alternative label: practical nurses for social and health care @en
alternative label: lähihoitajat
in scheme: Metatietosanasto
preferred label: practical nurse for social and health care @en
preferred label: närvårdare @sv

kuolemansyyntutkija
type: Concept
source: Kansallinen RDA-termi
source: YSO-termi
source: ALLFO-term @sv
source: Nationell RDA-term @sv
created: 2018-11-01
modified: 2024-08-27
alternative label: coroners @en
alternative label: kuolemansyyntutkijat
alternative label: kuolinsyyntutkijat
alternative label: dödsorsaksutredare @sv
in scheme: Metatietosanasto
preferred label: coroner @en

kirjansitoja
type: Concept
source: Kansallinen RDA-termi
source: YSO-termi
source: ALLFO-term @sv
source: Nationell RDA-term @sv
created: 2018-11-01
modified: 2024-08-27
alternative label: bookbinders @en
alternative label: kirjansitojat
in scheme: Metatietosanasto
preferred label: bookbinder @en
preferred label: bokbindare @sv

vesiväri
type: Concept
source: RDA-termi
source: RDA-term @sv
created: 2016-01-08
modified: 2023-05-17
definition: Materiaali, joka muodostuu veteen sekoittuneesta väriaineesta muodostaen läpikuultavan maalausaineen.
definition: Material som består av färgämne som blandats med vatten och som således bildat ett skirt färgmaterial. @sv
in scheme: Metatietosanasto
preferred label: watercolour @en
preferred label: vattenfärg @sv

hitsaaja
type: Concept
source: Kansallinen RDA-termi
source: YSO-termi
source: ALLFO-term @sv
source: Nationell RDA-term @sv
created: 2018-11-01
modified: 2024-08-27
alternative label: welders @en
alternative label: hitsaajat
in scheme: Metatietosanasto
preferred label: welder @en
preferred label: svetsare @sv

laitoshuoltaja
type: Concept
source: Kansallinen RDA-termi
source: YSO-termi
source: ALLFO-term @sv
source: Nationell RDA-term @sv
created: 2018-11-01
modified: 2024-08-27
alternative label: institutional cleaners @en
alternative label: laitoshuoltajat
in scheme: Metatietosanasto
preferred label: institutional cleaner @en
preferred label: anstaltsvårdare @sv

bloggaaja
type: Concept
source: Kansallinen RDA-termi
source: YSO-termi
source: ALLFO-term @sv
source: Nationell RDA-term @sv
created: 2018-11-01
modified: 2024-08-27
alternative label: bloggers @en
alternative label: bloggaajat
alternative label: bloggarit
alternative label: bloginkirjoittaja
alternative label: bloginpitäjä
alternative label: blogisti
alternative label: blogistit
in scheme: Metatietosanasto
preferred label: blogger @en
preferred label: bloggare @sv

kirkonrakentaja
type: Concept
source: Kansallinen RDA-termi
source: YSO-termi
source: ALLFO-term @sv
source: Nationell RDA-term @sv
created: 2018-11-01
modified: 2024-08-27
alternative label: church builders @en
alternative label: kirkonrakentajat
in scheme: Metatietosanasto
preferred label: church builder @en
preferred label: kyrkobyggare @sv

esiintyjä
type: Concept
source: Kansallinen RDA-termi
source: YSO-termi
source: ALLFO-term @sv
source: Nationell RDA-term @sv
created: 2018-11-01
modified: 2024-08-27
alternative label: performers @en
alternative label: esiintyjät
alternative label: uppträdanden @sv
alternative label: uppträdare @sv
in scheme: Metatietosanasto
preferred label: performer @en
preferred label: uppträdande @sv

dagerrotypia-menetelmä
type: Concept
source: RDA-termi
source: RDA-term @sv
created: 2016-01-08
modified: 2023-05-17
definition: Valmistusmenetelmä, jossa hopeapäällysteinen kuparilevy valotetaan kamerassa, kehitetään (yleisimmin elohopeahöyryllä) ja kiinnitetään suolalla. Näin saadaan positiivikuva.
definition: Produktionsmetod, i vilken en silverbelagd kopparplatta exponeras i en kamera, framkallas (vanligen med kvicksilverånga) och fixeras med salt. På så vis fås en positivbild. @sv
in scheme: Metatietosanasto
preferred label: daguerreotype process @en
preferred label: dagerrotypi @sv

selostaja
type: Concept
source: Kansallinen RDA-termi
source: YSO-termi
source: ALLFO-term @sv
source: Nationell RDA-term @sv
created: 2018-11-01
modified: 2024-08-27
alternative label: selostaja (ammatti)
alternative label: kommentator (yrke) @sv
in scheme: Metatietosanasto
preferred label: commentator @en
preferred label: kommentator @sv

tonttikirjanhoitaja
type: Concept
source: Kansallinen RDA-termi
source: YSO-termi
source: ALLFO-term @sv
source: Nationell RDA-term @sv
created: 2018-11-01
modified: 2024-08-27
alternative label: registrars of list of titles @en
alternative label: tonttikirjanhoitajat
in scheme: Metatietosanasto
preferred label: registrar of list of titles @en
preferred label: tomtbokförare @sv

mainostaja
type: Concept
source: Kansallinen RDA-termi
source: YSO-termi
source: ALLFO-term @sv
source: Nationell RDA-term @sv
created: 2018-11-01
modified: 2024-08-27
alternative label: advertisers @en
alternative label: mainostajat
alternative label: annonsörer @sv
in scheme: Metatietosanasto
preferred label: advertiser @en
preferred label: annonsör @sv

kuraattori
type: Concept
source: Kansallinen RDA-termi
source: YSO-termi
source: ALLFO-term @sv
source: Nationell RDA-term @sv
created: 2018-11-01
modified: 2024-08-27
alternative label: kuraattori (ammatti)
preferred label: curator @en
alternative label: kurator (yrke) @sv
in scheme: Metatietosanasto
preferred label: kurator @sv

Äänentoiston erityisominaisuudet
type: ConceptGroup
type: Collection
source: RDA-termi
source: RDA-term @sv
created: 2016-01-08
modified: 2023-05-05
alternative label: Ljudåtergivningens specialegenskaper @sv
definition: Liittää manifestaation äänitteen äänityksessä käytettyyn taajuuskorjausjärjestelmään, kohinanvaimennusjärjestelmään tms.
definition: Sammankopplar manifestation med equalizer-, noise reduction- e.d. system som använts i inspelningen. @sv
member: dbx
member: Dolby B
member: CCIR-standardi
member: CX
member: Dolby C
member: LPCM
member: Dolby A
member: NAB-standardi
member: Dolby
preferred label: Special playback characteristic @en
preferred label: Specifika uppspelningskaraktäristika @sv

taloudenhoitaja (kodinhoito)
type: Concept
source: Kansallinen RDA-termi
source: YSO-termi
source: ALLFO-term @sv
source: Nationell RDA-term @sv
created: 2018-11-01
modified: 2024-08-27
alternative label: housekeepers @en
alternative label: taloudenhoitajat
alternative label: husföreståndare @sv
alternative label: husföreståndarinnor @sv
alternative label: hushållerskor @sv
in scheme: Metatietosanasto
preferred label: housekeeper @en
preferred label: hushållerska @sv

kamreeri
type: Concept
source: Kansallinen RDA-termi
source: YSO-termi
source: ALLFO-term @sv
source: Nationell RDA-term @sv
created: 2018-11-01
modified: 2024-08-27
alternative label: kamreeri (ammatti)
alternative label: kamrer (yrke) @sv
in scheme: Metatietosanasto
preferred label: kamrer @sv

animaattori
type: Concept
source: Kansallinen RDA-termi
source: YSO-termi
source: ALLFO-term @sv
source: Nationell RDA-term @sv
created: 2018-11-01
modified: 2024-08-27
alternative label: animaattori (ammatti)
alternative label: animatör (yrke) @sv
in scheme: Metatietosanasto
preferred label: animator @en
preferred label: animatör @sv

julkaisija
type: Concept
source: Kansallinen RDA-termi
source: YSO-termi
source: ALLFO-term @sv
source: Nationell RDA-term @sv
created: 2018-11-01
modified: 2024-08-27
alternative label: julkaisija (ammatti)
alternative label: utgivande instans @sv
alternative label: utgivare (yrke) @sv
in scheme: Metatietosanasto
preferred label: publisher @en
preferred label: utgivare @sv

aktuaari
type: Concept
source: Kansallinen RDA-termi
source: YSO-termi
source: ALLFO-term @sv
source: Nationell RDA-term @sv
created: 2018-11-01
modified: 2024-08-27
alternative label: actuaries @en
alternative label: aktuaarit
alternative label: aktuarier @sv
in scheme: Metatietosanasto
preferred label: actuary @en
preferred label: aktuarie @sv

akateemikko
type: Concept
source: Kansallinen RDA-termi
source: YSO-termi
source: ALLFO-term @sv
source: Nationell RDA-term @sv
created: 2018-11-01
modified: 2024-08-27
alternative label: akateemikko (ammatti)
alternative label: akateemikot
alternative label: akademiker (yrke) @sv
alternative label: akademiledamöter @sv
alternative label: akademister @sv
in scheme: Metatietosanasto
preferred label: akademiker @sv

konduktööri
type: Concept
source: Kansallinen RDA-termi
source: YSO-termi
source: ALLFO-term @sv
source: Nationell RDA-term @sv
created: 2018-11-01
modified: 2024-08-27
alternative label: railway conductors @en
alternative label: railway guards @en
alternative label: konduktöörit
alternative label: konduktörer @sv
in scheme: Metatietosanasto
preferred label: railway guard @en
preferred label: konduktör @sv

mielenterveyshoitaja
type: Concept
source: Kansallinen RDA-termi
source: YSO-termi
source: ALLFO-term @sv
source: Nationell RDA-term @sv
created: 2018-11-01
modified: 2024-08-27
alternative label: practical mental nurses @en
alternative label: mielenterveyshoitajat
in scheme: Metatietosanasto
preferred label: practical mental nurse @en
preferred label: mentalvårdare @sv

paluumuuttaja
type: Concept
source: Kansallinen RDA-termi
source: YSO-termi
source: ALLFO-term @sv
source: Nationell RDA-term @sv
created: 2018-11-01
modified: 2024-08-27
alternative label: returnees @en
alternative label: paluumuuttajat
alternative label: återvändare @sv
in scheme: Metatietosanasto
preferred label: returnee (immigrant) @en
preferred label: återflyttare @sv

maatalouslomittaja
type: Concept
source: Kansallinen RDA-termi
source: YSO-termi
source: ALLFO-term @sv
source: Nationell RDA-term @sv
created: 2018-11-01
modified: 2024-08-27
alternative label: farm relief workers @en
alternative label: maatalouslomittajat
alternative label: avbytare @sv
alternative label: jordbruksavbytare @sv
in scheme: Metatietosanasto
preferred label: farm relief worker @en
preferred label: lantbruksavbytare @sv

varastonhoitaja
type: Concept
source: Kansallinen RDA-termi
source: YSO-termi
source: ALLFO-term @sv
source: Nationell RDA-term @sv
created: 2018-11-01
modified: 2024-08-27
alternative label: stock clerks @en
alternative label: varastonhoitajat
alternative label: förrådsförvaltare @sv
in scheme: Metatietosanasto
preferred label: stock clerk @en
preferred label: lagerförvaltare @sv

sosiaalikasvattaja
type: Concept
source: Kansallinen RDA-termi
source: YSO-termi
source: ALLFO-term @sv
source: Nationell RDA-term @sv
created: 2018-11-01
modified: 2024-08-27
alternative label: educational social workers @en
alternative label: sosiaalikasvattajat
alternative label: socialpedagoger @sv
in scheme: Metatietosanasto
preferred label: educational social worker @en
preferred label: socialpedagog @sv

opetusneuvos
type: Concept
source: Kansallinen RDA-termi
source: YSO-termi
source: ALLFO-term @sv
source: Nationell RDA-term @sv
created: 2018-11-01
modified: 2024-08-27
alternative label: opetusneuvos (ammatti)
alternative label: undervisningsråd (yrke) @sv
in scheme: Metatietosanasto
preferred label: undervisningsråd @sv

meteorologi
type: Concept
source: Kansallinen RDA-termi
source: YSO-termi
source: ALLFO-term @sv
source: Nationell RDA-term @sv
created: 2018-11-01
modified: 2024-08-27
alternative label: meteorologists @en
alternative label: meteorologit
alternative label: meteorologer @sv
in scheme: Metatietosanasto
preferred label: meteorologist @en
preferred label: meteorolog @sv

konemestari
type: Concept
source: Kansallinen RDA-termi
source: YSO-termi
source: ALLFO-term @sv
source: Nationell RDA-term @sv
created: 2018-11-01
modified: 2024-08-27
alternative label: chief engineers @en
alternative label: engineer officers @en
alternative label: first engineers @en
alternative label: konemestarit
in scheme: Metatietosanasto
preferred label: chief engineer @en
preferred label: maskinmästare @sv

kivenhakkaaja
type: Concept
source: Kansallinen RDA-termi
source: YSO-termi
source: ALLFO-term @sv
source: Nationell RDA-term @sv
created: 2018-11-01
modified: 2024-08-27
alternative label: stone-cutters @en
alternative label: kivenhakkaajat
in scheme: Metatietosanasto
preferred label: stone cutter @en
preferred label: stenhuggare @sv

työsuojelutarkastaja
type: Concept
source: Kansallinen RDA-termi
source: YSO-termi
source: ALLFO-term @sv
source: Nationell RDA-term @sv
created: 2018-11-01
modified: 2024-08-27
alternative label: industrial safety inspectors @en
alternative label: occupational safety and health inspectors @en
alternative label: työsuojelutarkastajat
alternative label: arbetarskyddsinspektörer @sv
in scheme: Metatietosanasto
preferred label: occupational safety and health inspector @en
preferred label: arbetarskyddsinspektör @sv

riistanhoitaja
type: Concept
source: Kansallinen RDA-termi
source: YSO-termi
source: ALLFO-term @sv
source: Nationell RDA-term @sv
created: 2018-11-01
modified: 2024-08-27
alternative label: game wardens @en
alternative label: gamekeepers @en
alternative label: riistanhoitajat
alternative label: jaktvårdare @sv
in scheme: Metatietosanasto
preferred label: game warden @en
preferred label: viltvårdare @sv

tähtitieteilijä
type: Concept
source: Kansallinen RDA-termi
source: YSO-termi
source: ALLFO-term @sv
source: Nationell RDA-term @sv
created: 2018-11-01
modified: 2024-08-27
alternative label: astronomers @en
alternative label: astronomit
alternative label: tähtitieteilijät
preferred label: astronomer @en
in scheme: Metatietosanasto
preferred label: astronom @sv

tietosuojavastaava
type: Concept
source: Kansallinen RDA-termi
source: YSO-termi
source: ALLFO-term @sv
source: Nationell RDA-term @sv
created: 2018-11-01
modified: 2024-08-27
alternative label: data protection officers @en
alternative label: tietosuojavastaavat
alternative label: dataskyddsansvariga @sv
alternative label: datasäkerhetsansvariga @sv
in scheme: Metatietosanasto
preferred label: data protection officer @en
preferred label: dataskyddsombud @sv

apotti
type: Concept
source: Kansallinen RDA-termi
source: Nationell RDA-term @sv
created: 2016-01-08
modified: 2024-05-24
definition: Katolilaisen munkkiluostarin esimies.
definition: Föreståndare vid katolskt munkkloster. @sv
in scheme: Metatietosanasto
preferred label: abbot @sv

maaherra
type: Concept
source: Kansallinen RDA-termi
source: YSO-termi
source: ALLFO-term @sv
source: Nationell RDA-term @sv
created: 2018-11-01
modified: 2024-08-27
alternative label: provincial governors @en
alternative label: maaherrat
alternative label: landshövdingar @sv
in scheme: Metatietosanasto
preferred label: provincial governor @en
preferred label: landshövding @sv

sorvaaja
type: Concept
source: Kansallinen RDA-termi
source: YSO-termi
source: ALLFO-term @sv
source: Nationell RDA-term @sv
created: 2018-11-01
modified: 2024-08-27
alternative label: lathe operators @en
alternative label: sorvaajat
alternative label: sorvarit
in scheme: Metatietosanasto
preferred label: lathe operator @en
preferred label: svarvare @sv

maailmanmestari
type: Concept
source: Kansallinen RDA-termi
source: YSO-termi
source: ALLFO-term @sv
source: Nationell RDA-term @sv
created: 2018-11-01
modified: 2024-08-27
alternative label: world champions @en
alternative label: maailmanmestarit
in scheme: Metatietosanasto
preferred label: world champion @en
preferred label: världsmästare @sv

keksijä
type: Concept
source: Kansallinen RDA-termi
source: YSO-termi
source: ALLFO-term @sv
source: Nationell RDA-term @sv
created: 2018-11-01
modified: 2024-08-27
alternative label: keksijä (ammatti)
alternative label: uppfinnare (yrke) @sv
in scheme: Metatietosanasto
preferred label: inventor @en
preferred label: uppfinnare @sv

merikapteeni
type: Concept
source: Kansallinen RDA-termi
source: YSO-termi
source: ALLFO-term @sv
source: Nationell RDA-term @sv
created: 2018-11-01
modified: 2024-08-27
alternative label: sea captains @en
alternative label: merikapteenit
alternative label: sjökaptener @sv
in scheme: Metatietosanasto
preferred label: sea captain @en
preferred label: sjökapten @sv

välinehuoltaja
type: Concept
source: Kansallinen RDA-termi
source: YSO-termi
source: ALLFO-term @sv
source: Nationell RDA-term @sv
created: 2018-11-01
modified: 2024-08-27
alternative label: equipment maintenance assistants @en
alternative label: välinehuoltajat
in scheme: Metatietosanasto
preferred label: equipment maintenance assistant @en
preferred label: instrumentvårdare @sv

galleristi
type: Concept
source: Kansallinen RDA-termi
source: YSO-termi
source: ALLFO-term @sv
source: Nationell RDA-term @sv
created: 2018-11-01
modified: 2024-08-27
alternative label: gallerists @en
alternative label: galleristit
alternative label: taidegalleristit
alternative label: gallerister @sv
alternative label: konstgallerister @sv
in scheme: Metatietosanasto
preferred label: gallerist @en

nahkuri
type: Concept
source: Kansallinen RDA-termi
source: YSO-termi
source: ALLFO-term @sv
source: Nationell RDA-term @sv
created: 2018-11-01
modified: 2024-08-27
alternative label: tanners @en
alternative label: nahkurit
in scheme: Metatietosanasto
preferred label: tanner @en
preferred label: garvare @sv

asessori
type: Concept
source: Kansallinen RDA-termi
source: Nationell RDA-term @sv
created: 2018-11-01
modified: 2025-11-04
alternative label: asessori (ammatti)
alternative label: assessor (yrke) @sv
in scheme: Metatietosanasto
preferred label: assessor @en

kolumnisti
type: Concept
source: Kansallinen RDA-termi
source: YSO-termi
source: ALLFO-term @sv
source: Nationell RDA-term @sv
created: 2018-11-01
modified: 2024-08-27
alternative label: columnists @en
alternative label: kolumnistit
alternative label: kolumnister @sv
in scheme: Metatietosanasto
preferred label: columnist @en
preferred label: kolumnist @sv

LPCM
type: Concept
source: RDA-termi
source: RDA-term @sv
created: 2016-01-08
modified: 2023-05-17
definition: Pulssikoodimodulaatiojärjestelmään perustuva analogisen äänen digitaalinen sämpläys.
definition: Digital sampling av analogt ljud, som grundar sig på ett system för pulskodmodulering. @sv
in scheme: Metatietosanasto

maskeeraaja
type: Concept
source: Kansallinen RDA-termi
source: YSO-termi
source: ALLFO-term @sv
source: Nationell RDA-term @sv
created: 2018-11-01
modified: 2024-08-27
alternative label: make-up artists @en
alternative label: maskeeraajat
alternative label: maskörer @sv
in scheme: Metatietosanasto
preferred label: make-up artist @en
preferred label: maskör @sv

konsuli
type: Concept
source: Kansallinen RDA-termi
source: YSO-termi
source: ALLFO-term @sv
source: Nationell RDA-term @sv
created: 2018-11-01
modified: 2024-08-27
alternative label: konsuli (ammatti)
alternative label: konsul (yrke) @sv
in scheme: Metatietosanasto
preferred label: konsul @sv

maatalousneuvoja
type: Concept
source: Kansallinen RDA-termi
source: YSO-termi
source: ALLFO-term @sv
source: Nationell RDA-term @sv
created: 2018-11-01
modified: 2024-08-27
alternative label: agricultural advisers @en
alternative label: maatalousneuvojat
alternative label: lantbrukskonsulenter @sv
in scheme: Metatietosanasto
preferred label: agricultural adviser @en
preferred label: lantbrukskonsulent @sv

sosiaalihoitaja
type: Concept
source: Kansallinen RDA-termi
source: YSO-termi
source: ALLFO-term @sv
source: Nationell RDA-term @sv
created: 2018-11-01
modified: 2024-08-27
alternative label: medical social workers @en
alternative label: sosiaalihoitajat
in scheme: Metatietosanasto
preferred label: medical social worker @en
preferred label: socialskötare @sv

levyseppähitsaaja
type: Concept
source: Kansallinen RDA-termi
source: YSO-termi
source: ALLFO-term @sv
source: Nationell RDA-term @sv
created: 2018-11-01
modified: 2024-08-27
alternative label: plater welders @en
alternative label: levyseppä-hitsaajat
in scheme: Metatietosanasto
preferred label: plater welder @en
preferred label: plåtslagare-svetsare @sv

intiaanipäällikkö
type: Concept
source: Kansallinen RDA-termi
source: YSO-termi
source: ALLFO-term @sv
source: Nationell RDA-term @sv
created: 2018-11-01
modified: 2024-08-27
alternative label: American Indian chiefs @en
alternative label: intiaanipäälliköt
alternative label: indianhövdingar @sv
in scheme: Metatietosanasto
preferred label: American Indian chief @en
preferred label: indianhövding @sv

metsäneuvoja
type: Concept
source: Kansallinen RDA-termi
source: YSO-termi
source: ALLFO-term @sv
source: Nationell RDA-term @sv
created: 2018-11-01
modified: 2024-08-27
alternative label: forestry advisers @en
alternative label: forestry advisory officers @en
alternative label: metsäneuvojat
alternative label: metsätalousneuvojat
in scheme: Metatietosanasto
preferred label: forestry adviser @en
preferred label: skogsrådgivare @sv

oikeusneuvos
type: Concept
source: Kansallinen RDA-termi
source: YSO-termi
source: ALLFO-term @sv
source: Nationell RDA-term @sv
created: 2018-11-01
modified: 2024-08-27
alternative label: justices of the Supreme Court @en
alternative label: oikeusneuvokset
in scheme: Metatietosanasto
preferred label: justice of the Supreme Court @en
preferred label: justitieråd @sv

kalastaja
type: Concept
source: Kansallinen RDA-termi
source: YSO-termi
source: ALLFO-term @sv
source: Nationell RDA-term @sv
created: 2018-11-01
modified: 2024-08-27
alternative label: fishermen @en
alternative label: kalastajat
in scheme: Metatietosanasto
preferred label: fisherman @en
preferred label: fiskare @sv

ravitsemusterapeutti
type: Concept
source: Kansallinen RDA-termi
source: YSO-termi
source: ALLFO-term @sv
source: Nationell RDA-term @sv
created: 2018-11-01
modified: 2024-08-27
alternative label: dietitians @en
alternative label: nutritionists @en
alternative label: ravitsemusterapeutit
alternative label: dietister @sv
alternative label: nutritionister @sv
alternative label: näringsterapeuter @sv
in scheme: Metatietosanasto
preferred label: dietitian @en
preferred label: näringsterapeut @sv

poromies
type: Concept
source: Kansallinen RDA-termi
source: YSO-termi
source: ALLFO-term @sv
source: Nationell RDA-term @sv
created: 2018-11-01
modified: 2024-08-27
alternative label: reindeer breeders @en
alternative label: poromiehet
alternative label: renkarlar @sv
in scheme: Metatietosanasto
preferred label: reindeer breeder @en
preferred label: renkarl @sv

hevostenhoitaja
type: Concept
source: Kansallinen RDA-termi
source: YSO-termi
source: ALLFO-term @sv
source: Nationell RDA-term @sv
created: 2018-11-01
modified: 2024-08-27
alternative label: horse grooms @en
alternative label: hevostenhoitajat
in scheme: Metatietosanasto
preferred label: horse groom @en
preferred label: hästskötare @sv

bioanalyytikko
type: Concept
source: Kansallinen RDA-termi
source: YSO-termi
source: ALLFO-term @sv
source: Nationell RDA-term @sv
created: 2018-11-01
modified: 2024-08-27
alternative label: bioanalyytikot
alternative label: biomedicinska analytiker @sv
in scheme: Metatietosanasto
preferred label: bioanalytiker @sv

Super-VHS
type: Concept
source: RDA-termi
source: RDA-term @sv
created: 2016-01-08
modified: 2023-05-17
definition: Analogisen nauhan VHS:lle perustuva videoformaatti, joka nostaa horisontaalisen resoluution raitojen määrän 420:een.
definition: Videoformat som grundar sig på VHS med analogt band, som höjer antalet spår med horisontell upplösning till 420. @sv
in scheme: Metatietosanasto

metsämestari
type: Concept
source: Kansallinen RDA-termi
source: YSO-termi
source: ALLFO-term @sv
source: Nationell RDA-term @sv
created: 2018-11-01
modified: 2024-08-27
alternative label: specialists in forestry @en
alternative label: metsämestarit
in scheme: Metatietosanasto
preferred label: specialist in forestry @en
preferred label: skogsmästare @sv

panimomestari
type: Concept
source: Kansallinen RDA-termi
source: YSO-termi
source: ALLFO-term @sv
source: Nationell RDA-term @sv
created: 2018-11-01
modified: 2024-08-27
alternative label: brewmasters @en
alternative label: panimomestarit
in scheme: Metatietosanasto
preferred label: brewmaster @en
preferred label: bryggmästare @sv

doula
type: Concept
source: Kansallinen RDA-termi
source: YSO-termi
source: ALLFO-term @sv
source: Nationell RDA-term @sv
created: 2018-11-01
modified: 2024-08-27
alternative label: doulas @en
alternative label: doulat
alternative label: doulor @sv
in scheme: Metatietosanasto

musiikkipedagogi
type: Concept
source: Kansallinen RDA-termi
source: YSO-termi
source: ALLFO-term @sv
source: Nationell RDA-term @sv
created: 2018-11-01
modified: 2024-08-27
alternative label: music pedagogues @en
alternative label: musiikkipedagogit
alternative label: musikpedagoger @sv
in scheme: Metatietosanasto
preferred label: music pedagogue @en
preferred label: musikpedagog @sv

64:o
type: Concept
source: RDA-termi
source: RDA-term @sv
created: 2016-01-08
modified: 2025-05-13
definition: Bibliografinen koko muodostuu yhdestä tai useammasta lehdestä, jotka ovat kooltaan 1/64 arkista.
definition: Bokens format består av ett eller flera blad som till sin storlek är 1/64 av ett tryckark. @sv
in scheme: Metatietosanasto
preferred label: 64mo @en

nahkavalmistaja
type: Concept
source: Kansallinen RDA-termi
source: YSO-termi
source: ALLFO-term @sv
source: Nationell RDA-term @sv
created: 2018-11-01
modified: 2024-08-27
alternative label: leather manufacturers @en
alternative label: nahanvalmistajat
in scheme: Metatietosanasto
preferred label: leather manufacturer @en
preferred label: lädertillverkare @sv

optometristi
type: Concept
source: Kansallinen RDA-termi
source: YSO-termi
source: ALLFO-term @sv
source: Nationell RDA-term @sv
created: 2018-11-01
modified: 2024-08-27
alternative label: optometrists @en
alternative label: optometristit
alternative label: optometrister @sv
in scheme: Metatietosanasto
preferred label: optometrist @en

suuhygienisti
type: Concept
source: Kansallinen RDA-termi
source: YSO-termi
source: ALLFO-term @sv
source: Nationell RDA-term @sv
created: 2018-11-01
modified: 2024-08-27
alternative label: dental hygienists @en
alternative label: hammashuoltajat
alternative label: suuhygienistit
alternative label: munhygienister @sv
alternative label: tandhygienister @sv
in scheme: Metatietosanasto
preferred label: dental hygienist @en
preferred label: munhygienist @sv

biokemisti
type: Concept
source: Kansallinen RDA-termi
source: YSO-termi
source: ALLFO-term @sv
source: Nationell RDA-term @sv
created: 2018-11-01
modified: 2024-08-27
alternative label: biochemists @en
alternative label: biokemistit
alternative label: biokemister @sv
in scheme: Metatietosanasto
preferred label: biochemist @en
preferred label: biokemist @sv

sovittaja
type: Concept
source: Kansallinen RDA-termi
source: YSO-termi
source: ALLFO-term @sv
source: Nationell RDA-term @sv
created: 2018-11-01
modified: 2024-08-27
alternative label: sovittaja (ammatti)
alternative label: arrangör (yrke) @sv
in scheme: Metatietosanasto
preferred label: arranger (occupation) @en
preferred label: arrangör (musik) @sv

eduskunnan puhemies
type: Concept
source: Kansallinen RDA-termi
source: YSO-termi
source: ALLFO-term @sv
source: Nationell RDA-term @sv
created: 2018-11-01
modified: 2024-08-27
alternative label: speakers of the parliament @en
alternative label: eduskunnan puhemiehet
alternative label: riksdagens talmän @sv
in scheme: Metatietosanasto
preferred label: speaker of the parliament @en
preferred label: riksdagens talman @sv

kosmologi
type: Concept
source: Kansallinen RDA-termi
source: YSO-termi
source: ALLFO-term @sv
source: Nationell RDA-term @sv
created: 2018-11-01
modified: 2024-08-27
alternative label: cosmologists @en
alternative label: kosmologit
alternative label: kosmologer @sv
in scheme: Metatietosanasto
preferred label: cosmologist @en
preferred label: kosmolog @sv

eläinsuojeluvalvoja
type: Concept
source: Kansallinen RDA-termi
source: YSO-termi
source: ALLFO-term @sv
source: Nationell RDA-term @sv
created: 2018-11-01
modified: 2024-08-27
alternative label: animal welfare inspectors @en
alternative label: eläinsuojeluvalvojat
in scheme: Metatietosanasto
preferred label: animal welfare inspector @en
preferred label: djurskyddsövervakare @sv

pankkiiri
type: Concept
source: Kansallinen RDA-termi
source: YSO-termi
source: ALLFO-term @sv
source: Nationell RDA-term @sv
created: 2018-11-01
modified: 2024-08-27
alternative label: bankers @en
alternative label: pankkiirit
alternative label: bankirer @sv
in scheme: Metatietosanasto
preferred label: banker @en
preferred label: bankir @sv

lennonvarmentaja
type: Concept
source: Kansallinen RDA-termi
source: YSO-termi
source: ALLFO-term @sv
source: Nationell RDA-term @sv
created: 2018-11-01
modified: 2024-08-27
alternative label: air navigation service officers @en
alternative label: lennonvarmentajat
in scheme: Metatietosanasto
preferred label: air navigation service officer @en
preferred label: flygtrafikledare @sv

kuntohoitaja
type: Concept
source: Kansallinen RDA-termi
source: YSO-termi
source: ALLFO-term @sv
source: Nationell RDA-term @sv
created: 2018-11-01
modified: 2024-08-27
alternative label: physiotherapy assistants @en
alternative label: kuntohoitajat
alternative label: motionsledare @sv
in scheme: Metatietosanasto
preferred label: physiotherapist's assistant @en
preferred label: konditionsskötare @sv

hakkeri
type: Concept
source: Kansallinen RDA-termi
source: YSO-termi
source: ALLFO-term @sv
source: Nationell RDA-term @sv
created: 2018-11-01
modified: 2024-08-27
alternative label: hackers @en
alternative label: hakkerit
alternative label: knäckare @sv
in scheme: Metatietosanasto
preferred label: hacker @en
preferred label: hackare @sv

pianonvirittäjä
type: Concept
source: Kansallinen RDA-termi
source: YSO-termi
source: ALLFO-term @sv
source: Nationell RDA-term @sv
created: 2018-11-01
modified: 2024-08-27
alternative label: piano tuners @en
alternative label: pianonvirittäjät
in scheme: Metatietosanasto
preferred label: piano tuner @en
preferred label: pianostämmare @sv

siivooja
type: Concept
source: Kansallinen RDA-termi
source: YSO-termi
source: ALLFO-term @sv
source: Nationell RDA-term @sv
created: 2018-11-01
modified: 2024-08-27
alternative label: siivoojat
alternative label: lokalvårdare @sv
alternative label: städerskor @sv
in scheme: Metatietosanasto
preferred label: städare @sv

radiokuuluttaja
type: Concept
source: Kansallinen RDA-termi
source: YSO-termi
source: ALLFO-term @sv
source: Nationell RDA-term @sv
created: 2018-11-01
modified: 2024-08-27
alternative label: radio announcers @en
alternative label: radiokuuluttajat
alternative label: hallåmän @sv
alternative label: hallåor @sv
alternative label: programpresentatörer i radio @sv
in scheme: Metatietosanasto
preferred label: radio announcer @en
preferred label: hallåman @sv

poliittinen johtaja
type: Concept
source: Kansallinen RDA-termi
source: YSO-termi
source: ALLFO-term @sv
source: Nationell RDA-term @sv
created: 2018-11-01
modified: 2024-08-27
alternative label: political leaders @en
alternative label: poliittiset johtajat
alternative label: valtiomiehet
alternative label: politiska ledare @sv
alternative label: statskvinnor @sv
alternative label: statsmän @sv
in scheme: Metatietosanasto
preferred label: political leader @en
preferred label: politisk ledare @sv

norsunluu
type: Concept
source: RDA-termi
source: RDA-term @sv
created: 2016-01-08
modified: 2024-03-13
definition: Norsujen, mursujen, sarvivalaiden tms. hampaista tai syöksyhampaista koostuva materiaali.
definition: Material från elefanters, valrossars, narvalars m.fl. tänder eller betar. @sv
in scheme: Metatietosanasto
preferred label: ivory @en
preferred label: elfenben @sv

laboratorioanalyytikko
type: Concept
source: Kansallinen RDA-termi
source: YSO-termi
source: ALLFO-term @sv
source: Nationell RDA-term @sv
created: 2018-11-01
modified: 2024-08-27
alternative label: bachelors of laboratory sciences @en
alternative label: laboratory analysts @en
alternative label: laboratorioanalyytikot
in scheme: Metatietosanasto
preferred label: laboratory analyst @en
preferred label: laboratorieanalytiker @sv

kulttuuriantropologi
type: Concept
source: Kansallinen RDA-termi
source: YSO-termi
source: ALLFO-term @sv
source: Nationell RDA-term @sv
created: 2018-11-01
modified: 2024-08-27
alternative label: cultural anthropologists @en
alternative label: kulttuuriantropologit
alternative label: kulturantropologer @sv
in scheme: Metatietosanasto
preferred label: cultural anthropologist @en
preferred label: kulturantropolog @sv

veneenrakentaja
type: Concept
source: Kansallinen RDA-termi
source: YSO-termi
source: ALLFO-term @sv
source: Nationell RDA-term @sv
created: 2018-11-01
modified: 2024-08-27
alternative label: boatbuilders @en
alternative label: veneenrakentajat
in scheme: Metatietosanasto
preferred label: boatbuilder @en
preferred label: båtbyggare @sv

puutarhuri
type: Concept
source: Kansallinen RDA-termi
source: YSO-termi
source: ALLFO-term @sv
source: Nationell RDA-term @sv
created: 2018-11-01
modified: 2024-08-27
alternative label: gardeners @en
alternative label: puutarhurit
in scheme: Metatietosanasto
preferred label: gardener @en
preferred label: trädgårdsmästare @sv

Huomautus nimekkeestä
type: ConceptGroup
type: Collection
source: RDA-termi
source: RDA-term @sv
created: 2016-01-08
modified: 2023-05-17
preferred label: Note on title @en
preferred label: Anmärkning om titel @sv

karjanhoitaja
type: Concept
source: Kansallinen RDA-termi
source: YSO-termi
source: ALLFO-term @sv
source: Nationell RDA-term @sv
created: 2018-11-01
modified: 2024-08-27
alternative label: cattle tenders @en
alternative label: cattlemen @en
alternative label: cattlewomen @en
alternative label: karjanhoitajat
in scheme: Metatietosanasto
preferred label: cattle tender @en
preferred label: boskapsskötare @sv

dosentti
type: Concept
source: Kansallinen RDA-termi
source: YSO-termi
source: ALLFO-term @sv
source: Nationell RDA-term @sv
created: 2018-11-01
modified: 2024-08-27
alternative label: dosentti (ammatti)
alternative label: docent (yrke) @sv
in scheme: Metatietosanasto
preferred label: docent @en

perheneuvoja
type: Concept
source: Kansallinen RDA-termi
source: YSO-termi
source: ALLFO-term @sv
source: Nationell RDA-term @sv
created: 2018-11-01
modified: 2024-08-27
alternative label: family counsellors @en
alternative label: perheneuvojat
in scheme: Metatietosanasto
preferred label: family counsellor @en
preferred label: familjerådgivare @sv

eläintieteilijä
type: Concept
source: Kansallinen RDA-termi
source: YSO-termi
source: ALLFO-term @sv
source: Nationell RDA-term @sv
created: 2018-11-01
modified: 2024-08-27
alternative label: zoologists @en
alternative label: eläintieteilijät
alternative label: zoologer @sv
in scheme: Metatietosanasto
preferred label: zoologist @en
preferred label: zoolog @sv

löytöretkeilijä
type: Concept
source: Kansallinen RDA-termi
source: YSO-termi
source: ALLFO-term @sv
source: Nationell RDA-term @sv
created: 2018-11-01
modified: 2024-08-27
alternative label: explorers @en
alternative label: löytöretkeilijät
in scheme: Metatietosanasto
preferred label: explorer (discoverer) @en
preferred label: upptäcktsresande @sv

metsänvartija
type: Concept
source: Kansallinen RDA-termi
source: YSO-termi
source: ALLFO-term @sv
source: Nationell RDA-term @sv
created: 2018-11-01
modified: 2024-08-27
alternative label: forest guards @en
alternative label: forest rangers @en
alternative label: metsänvartijat
alternative label: kronojägare @sv
alternative label: skogsvaktare @sv
in scheme: Metatietosanasto
preferred label: forest guard @en
preferred label: skogvaktare @sv

metsänhoitaja
type: Concept
source: Kansallinen RDA-termi
source: YSO-termi
source: ALLFO-term @sv
source: Nationell RDA-term @sv
created: 2018-11-01
modified: 2024-08-27
alternative label: metsänhoitaja (ammatti)
alternative label: forstmästare (yrke) @sv
in scheme: Metatietosanasto
preferred label: forest officer @en
preferred label: forstmästare @sv

matkailija
type: Concept
source: Kansallinen RDA-termi
source: YSO-termi
source: ALLFO-term @sv
source: Nationell RDA-term @sv
created: 2018-11-01
modified: 2024-08-27
alternative label: tourists and travellers @en
alternative label: matkailijat
alternative label: turistit
alternative label: turister @sv
in scheme: Metatietosanasto
preferred label: tourist/traveller @en
preferred label: turist @sv

satamavalvoja
type: Concept
source: Kansallinen RDA-termi
source: YSO-termi
source: ALLFO-term @sv
source: Nationell RDA-term @sv
created: 2018-11-01
modified: 2024-08-27
alternative label: harbour guards @en
alternative label: port wardens @en
alternative label: satamavalvojat
in scheme: Metatietosanasto
preferred label: port warden @en
preferred label: hamnövervakare @sv

tiilivalaja
type: Concept
source: Kansallinen RDA-termi
source: YSO-termi
source: ALLFO-term @sv
source: Nationell RDA-term @sv
created: 2018-11-01
modified: 2024-08-27
alternative label: brick casters @en
alternative label: tiilenvalajat
in scheme: Metatietosanasto
preferred label: brick caster @en
preferred label: tegelslagare @sv

fysiologi
type: Concept
source: Kansallinen RDA-termi
source: YSO-termi
source: ALLFO-term @sv
source: Nationell RDA-term @sv
created: 2018-11-01
modified: 2024-08-27
alternative label: physiologists @en
alternative label: fysiologit
alternative label: fysiologer @sv
in scheme: Metatietosanasto
preferred label: physiologist @en
preferred label: fysiolog @sv

parfymööri
type: Concept
source: Kansallinen RDA-termi
source: YSO-termi
source: ALLFO-term @sv
source: Nationell RDA-term @sv
created: 2018-11-01
modified: 2024-08-27
alternative label: perfumists @en
alternative label: parfumöörit
alternative label: parfymöörit
alternative label: parfymörer @sv
in scheme: Metatietosanasto
preferred label: perfumist @en
preferred label: parfymör @sv

kätilö
type: Concept
source: Kansallinen RDA-termi
source: YSO-termi
source: ALLFO-term @sv
source: Nationell RDA-term @sv
created: 2018-11-01
modified: 2024-08-27
alternative label: midwives @en
alternative label: kätilöt
alternative label: barnmorskor @sv
in scheme: Metatietosanasto
preferred label: midwife @en
preferred label: barnmorska @sv

agentti
type: Concept
source: Kansallinen RDA-termi
source: YSO-termi
source: ALLFO-term @sv
source: Nationell RDA-term @sv
created: 2018-11-01
modified: 2024-08-27
alternative label: agents @en
alternative label: agentit
alternative label: agenter @sv
in scheme: Metatietosanasto
preferred label: agent (representative) @en
preferred label: agent @sv

semiootikko
type: Concept
source: Kansallinen RDA-termi
source: YSO-termi
source: ALLFO-term @sv
source: Nationell RDA-term @sv
created: 2018-11-01
modified: 2024-08-27
alternative label: semioticians @en
alternative label: semiologit
alternative label: semiootikot
alternative label: semiologer @sv
in scheme: Metatietosanasto
preferred label: semiotician @en
preferred label: semiotiker @sv

kiropraktikko
type: Concept
source: Kansallinen RDA-termi
source: YSO-termi
source: ALLFO-term @sv
source: Nationell RDA-term @sv
created: 2018-11-01
modified: 2024-08-27
alternative label: chiropractors @en
alternative label: kiropraktikot
alternative label: kiropraktiker @sv
alternative label: kiropraktorer @sv
in scheme: Metatietosanasto
preferred label: chiropractor @en
preferred label: kiropraktor @sv

naprapaatti
type: Concept
source: Kansallinen RDA-termi
source: YSO-termi
source: ALLFO-term @sv
source: Nationell RDA-term @sv
created: 2018-11-01
modified: 2024-08-27
alternative label: naprapaths @en
alternative label: naprapaatit
alternative label: naprapater @sv
in scheme: Metatietosanasto
preferred label: naprapath @en
preferred label: naprapat @sv

laivuri-alikonemestari
type: Concept
source: Kansallinen RDA-termi
source: YSO-termi
source: ALLFO-term @sv
source: Nationell RDA-term @sv
created: 2018-11-01
modified: 2024-08-27
alternative label: skipper-engineer officers @en
alternative label: laivuri-alikonemestarit
in scheme: Metatietosanasto
preferred label: skipper-engineer officer @en
preferred label: skeppare-undermaskinmästare @sv

senaattori
type: Concept
source: Kansallinen RDA-termi
source: YSO-termi
source: ALLFO-term @sv
source: Nationell RDA-term @sv
created: 2018-11-01
modified: 2024-08-27
alternative label: senators @en
alternative label: senaattorit
alternative label: senatorer @sv
in scheme: Metatietosanasto
preferred label: senator @en

huoltomies
type: Concept
source: Kansallinen RDA-termi
source: YSO-termi
source: ALLFO-term @sv
source: Nationell RDA-term @sv
created: 2018-11-01
modified: 2024-08-27
alternative label: maintenance men @en
alternative label: maintenance persons @en
alternative label: huoltomiehet
alternative label: fastighetsskötare @sv
alternative label: servicemän @sv
in scheme: Metatietosanasto
preferred label: maintenance person @en
preferred label: serviceman @sv

24:o
type: Concept
source: RDA-termi
source: RDA-term @sv
created: 2016-01-08
modified: 2025-05-13
definition: Bibliografinen koko muodostuu yhdestä tai useammasta lehdestä, jotka ovat kooltaan 1/24 arkista.
definition: Bokens format består av ett eller flera blad som till sin storlek är 1/24 av ett tryckark. @sv
in scheme: Metatietosanasto
preferred label: 24mo @en

kartoittaja
type: Concept
source: Kansallinen RDA-termi
source: YSO-termi
source: ALLFO-term @sv
source: Nationell RDA-term @sv
created: 2018-11-01
modified: 2024-08-27
alternative label: surveyors @en
alternative label: kartoittajat
in scheme: Metatietosanasto
preferred label: surveyor @en
preferred label: kartläggare @sv

hovinainen
type: Concept
source: Kansallinen RDA-termi
source: YSO-termi
source: ALLFO-term @sv
source: Nationell RDA-term @sv
created: 2018-11-01
modified: 2024-08-27
alternative label: ladies-in-waiting @en
alternative label: hovinaiset
alternative label: hovineidot
alternative label: hovdamer @sv
alternative label: hovfröknar @sv
in scheme: Metatietosanasto
preferred label: lady-in-waiting @en
preferred label: hovdam @sv

kirjuri
type: Concept
source: Kansallinen RDA-termi
source: YSO-termi
source: ALLFO-term @sv
source: Nationell RDA-term @sv
created: 2018-11-01
modified: 2025-04-10
alternative label: clerks @en
alternative label: kirjurit
alternative label: skrivare (yrke) @sv
in scheme: Metatietosanasto
preferred label: clerk @en
preferred label: skrivare @sv

järjestyksenvalvoja
type: Concept
source: Kansallinen RDA-termi
source: YSO-termi
source: ALLFO-term @sv
source: Nationell RDA-term @sv
created: 2018-11-01
modified: 2024-08-27
alternative label: patrolmen @en
alternative label: security stewards @en
alternative label: järjestyksenvalvojat
alternative label: järjestysmiehet
alternative label: ordningsmän @sv
alternative label: ordningsvakter @sv
alternative label: ordningsövervakare @sv
in scheme: Metatietosanasto
preferred label: security steward @en
preferred label: ordningsvakt @sv

seminologi
type: Concept
source: Kansallinen RDA-termi
source: YSO-termi
source: ALLFO-term @sv
source: Nationell RDA-term @sv
created: 2018-11-01
modified: 2024-08-27
alternative label: artificial inseminators @en
alternative label: keinosiementäjät
alternative label: seminologit
alternative label: seminörer @sv
in scheme: Metatietosanasto
preferred label: artificial inseminator @en
preferred label: seminör @sv

stuertti
type: Concept
source: Kansallinen RDA-termi
source: YSO-termi
source: ALLFO-term @sv
source: Nationell RDA-term @sv
created: 2018-11-01
modified: 2024-08-27
alternative label: stewards @en
alternative label: stuertit
alternative label: stewardar @sv
alternative label: stewarder @sv
alternative label: stuertar @sv
in scheme: Metatietosanasto
preferred label: steward @en

kosmetologi
type: Concept
source: Kansallinen RDA-termi
source: YSO-termi
source: ALLFO-term @sv
source: Nationell RDA-term @sv
created: 2018-11-01
modified: 2024-08-27
alternative label: cosmetologists @en
alternative label: kosmetologit
alternative label: kosmetologer @sv
in scheme: Metatietosanasto
preferred label: cosmetologist @en
preferred label: kosmetolog @sv

imitaattori
type: Concept
source: Kansallinen RDA-termi
source: YSO-termi
source: ALLFO-term @sv
source: Nationell RDA-term @sv
created: 2018-11-01
modified: 2024-08-27
alternative label: imitators @en
alternative label: imitaattorit
alternative label: imitoijat
alternative label: imitatorer @sv
alternative label: imitatörer @sv
in scheme: Metatietosanasto
preferred label: imitator (performing artist) @en
preferred label: imitatör @sv

koulutustarkastaja
type: Concept
source: Kansallinen RDA-termi
source: YSO-termi
source: ALLFO-term @sv
source: Nationell RDA-term @sv
created: 2018-11-01
modified: 2024-08-27
alternative label: training coordinators @en
alternative label: training coordinators in apprenticeship training @en
alternative label: koulutustarkastajat
alternative label: skolinspektorer @sv
alternative label: utbildningsinspektörer @sv
in scheme: Metatietosanasto
preferred label: training coordinator @en
preferred label: utbildningsinspektör @sv

sukututkija
type: Concept
source: Kansallinen RDA-termi
source: YSO-termi
source: ALLFO-term @sv
source: Nationell RDA-term @sv
created: 2018-11-01
modified: 2024-08-27
alternative label: genealogists @en
alternative label: sukututkija (ammatti)
alternative label: sukututkijat
alternative label: släktforskare (yrke) @sv
in scheme: Metatietosanasto
preferred label: genealogist @en
preferred label: släktforskare @sv

Teoksen suhteet toimijaan
type: ConceptGroup
type: Collection
created: 2016-01-08
modified: 2025-12-19
member: kokoaja
member: teoksen valokuvaaja
member: maisema-arkkitehti
member: televisiotuottaja
member: radiotuottaja
member: tuottaja
member: keksijä
member: televisio-ohjaaja
member: designer
member: kuvaaja
member: omistuksen tekijä
member: kokousten raportoija
member: kirjataiteilija
member: teoksen sponsori
member: uudelleenmiksaaja
member: kalligrafi
member: toimeksiantaja
member: teoksella kunnioitettu toimija
member: koreografi
member: libretisti
member: roolittaja
member: järjestäjä
member: toimituspäällikkö
member: tutkija
member: teoksen perustaja
member: asiantuntija
member: sanoittaja
member: ohjaaja
member: äänituottaja
member: taiteilija
member: julkaisija
member: teoksen tekijä
member: ohjelmoija
member: kuvaus toimijasta
member: aiheena oleva toimija
member: teokseen liittyvä toimija
member: kokoelman muodostaja
member: kirjoittaja
member: kuvanveistäjä
member: koostaja
member: metatietokuvailu toimijasta
member: kokoelman luetteloija
member: teoksen kartantekijä
member: säveltäjä
member: vastaanottaja
member: elokuvaohjaaja
member: arkkitehti
member: teoksen haastateltava
member: teoksen haastattelija
member: käsikirjoittaja
member: elokuvatuottaja
member: radio-ohjaaja
member: elokuvantekijä
member: teoksen omistuksen kohde
preferred label: Verks relationer till aktörer @sv

luotsi
type: Concept
source: Kansallinen RDA-termi
source: YSO-termi
source: ALLFO-term @sv
source: Nationell RDA-term @sv
created: 2018-11-01
modified: 2024-08-27
alternative label: pilots @en
alternative label: luotsit
alternative label: lotsar @sv
in scheme: Metatietosanasto
preferred label: pilot (shipping) @en
preferred label: lots @sv

vahtimestari
type: Concept
source: Kansallinen RDA-termi
source: YSO-termi
source: ALLFO-term @sv
source: Nationell RDA-term @sv
created: 2018-11-01
modified: 2024-08-27
alternative label: attendants @en
alternative label: attendants and caretakers @en
alternative label: caretakers @en
alternative label: door supervisors @en
alternative label: porters @en
alternative label: portsarit
alternative label: vahtimestarit
alternative label: dörrvakter @sv
alternative label: portierer @sv
in scheme: Metatietosanasto
preferred label: caretaker @en
preferred label: vaktmästare @sv

intendentti
type: Concept
source: Kansallinen RDA-termi
source: YSO-termi
source: ALLFO-term @sv
source: Nationell RDA-term @sv
created: 2018-11-01
modified: 2024-08-27
alternative label: intendentti (ammatti)
alternative label: intendent (yrke) @sv
in scheme: Metatietosanasto
preferred label: intendant @en
preferred label: intendent @sv

vloggaaja
type: Concept
source: Kansallinen RDA-termi
source: YSO-termi
source: ALLFO-term @sv
source: Nationell RDA-term @sv
created: 2018-11-01
modified: 2024-08-27
alternative label: video bloggers @en
alternative label: vloggers @en
alternative label: tubettajat
alternative label: videobloggaajat
alternative label: vloggaajat
alternative label: videobloggare @sv
in scheme: Metatietosanasto
preferred label: video blogger @en
preferred label: vloggare @sv

sukeltaja
type: Concept
source: Kansallinen RDA-termi
source: YSO-termi
source: ALLFO-term @sv
source: Nationell RDA-term @sv
created: 2018-11-01
modified: 2024-08-27
alternative label: divers @en
alternative label: sukeltajat
in scheme: Metatietosanasto
preferred label: diver @en
preferred label: dykare @sv

kasvitieteilijä
type: Concept
source: Kansallinen RDA-termi
source: YSO-termi
source: ALLFO-term @sv
source: Nationell RDA-term @sv
created: 2018-11-01
modified: 2024-08-27
alternative label: botanists @en
alternative label: kasvitieteilijät
alternative label: botanister @sv
in scheme: Metatietosanasto
preferred label: botanist @en
preferred label: botaniker @sv

hautausurakoitsija
type: Concept
source: Kansallinen RDA-termi
source: YSO-termi
source: ALLFO-term @sv
source: Nationell RDA-term @sv
created: 2018-11-01
modified: 2024-08-27
alternative label: funeral directors @en
alternative label: undertakers @en
alternative label: hautaustoimistoyrittäjät
alternative label: hautausurakoitsijat
alternative label: begravningsentreprenörer @sv
in scheme: Metatietosanasto
preferred label: undertaker @en
preferred label: begravningsentreprenör @sv

tiedontuottaja
type: Concept
source: Kansallinen RDA-termi
source: YSO-termi
source: ALLFO-term @sv
source: Nationell RDA-term @sv
created: 2018-11-01
modified: 2024-08-27
alternative label: knowledge producers @en
alternative label: tiedontuottajat
alternative label: informationsproducenter @sv
alternative label: kunskapsproducenter @sv
in scheme: Metatietosanasto
preferred label: knowledge producer @en
preferred label: informationsproducent @sv

topografi
type: Concept
source: Kansallinen RDA-termi
source: YSO-termi
source: ALLFO-term @sv
source: Nationell RDA-term @sv
created: 2018-11-01
modified: 2024-08-27
alternative label: topographers @en
alternative label: topografit
alternative label: topografer @sv
in scheme: Metatietosanasto
preferred label: topographer @en
preferred label: topograf @sv

rahastaja
type: Concept
source: Kansallinen RDA-termi
source: YSO-termi
source: ALLFO-term @sv
source: Nationell RDA-term @sv
created: 2018-11-01
modified: 2024-08-27
alternative label: fare collectors @en
alternative label: rahastajat
in scheme: Metatietosanasto
preferred label: fare collector @en
preferred label: inkasserare @sv

vakuutustarkastaja
type: Concept
source: Kansallinen RDA-termi
source: YSO-termi
source: ALLFO-term @sv
source: Nationell RDA-term @sv
created: 2018-11-01
modified: 2024-08-27
alternative label: insurance inspectors @en
alternative label: vakuutustarkastajat
alternative label: försäkringsinspektörer @sv
in scheme: Metatietosanasto
preferred label: insurance inspector @en
preferred label: försäkringsinspektör @sv

radioamatööri
type: Concept
source: Kansallinen RDA-termi
source: YSO-termi
source: ALLFO-term @sv
source: Nationell RDA-term @sv
created: 2018-11-01
modified: 2024-08-27
alternative label: radio amateurs @en
alternative label: radioamatöörit
alternative label: radioamatörer @sv
in scheme: Metatietosanasto
preferred label: radio amateur @en
preferred label: radioamatör @sv

Suhteet
type: ConceptGroup
type: Collection
source: Kansallinen RDA-termi
created: 2018-11-01
modified: 2025-08-27
member: Teoksen suhteet
member: Ekspression suhteet
member: Kappaleen suhteet
member: Manifestaation suhteet
member: Toimijan suhteet
preferred label: Relationer @sv

Toimija
type: ConceptGroup
type: Collection
source: RDA-termi
source: RDA-term @sv
created: 2018-11-01
modified: 2025-04-15
alternative label: Agent @sv
definition: An entity who is capable of deliberate actions, of being granted rights, and of being held accountable for its actions. @en
definition: Entiteetti, joka kykenee tarkoituksellisiin toimintoihin, jolle voidaan myöntää oikeuksia ja joka on vastuussa toimistaan.
definition: Entitet som är kapabel till avsiktliga handlingar, som kan beviljas rättigheter och som kan hållas ansvarig för sina handlingar. @sv
member: Suku
member: Yhteisö
member: Henkilö
preferred label: Aktör @sv

kortti
type: Concept
source: Kansallinen RDA-termi
source: Nationell RDA-term @sv
created: 2018-11-08
modified: 2025-10-04
definition: Laajuuden yksikkönä pieni arkki jäykkää paperia, ohutta pahvia tms. läpinäkymätöntä materiaalia.
definition: Som enhet litet ark styvt papper, tunn papp e.d. ogenomskinligt material. @sv
example: 1 kotelo (30 korttia)
example: 302 sivua : kuvitettu ; 25 cm + 1 korttipakka (78 korttia)
example: 1 fodral (30 kort) @sv
example: 302 sidor : illustrationer ; 25 cm + 1 kortlek (78 kort) @sv
in scheme: Metatietosanasto
preferred label: kort @sv

puuleikkaus
type: Concept
source: RDA-termi
source: RDA-term @sv
created: 2016-01-08
modified: 2023-05-17
alternative label: puukaiverrus
definition: Valmistusmenetelmä, jossa kuvio leikataan puukappaleen pintaan ja painetaan puukappaleen pinnasta.
definition: Produktionsmetod, i vilken en figur skärs in i ett trästyckes yta som används för trycka. @sv
in scheme: Metatietosanasto
preferred label: woodcut making @en
preferred label: träsnitt @sv

dia
type: Concept
source: Kansallinen RDA-termi
source: Nationell RDA-term @sv
created: 2018-11-13
modified: 2025-10-04
definition: Laajuuden yksikkönä kehykseen asetettu, projektorin tai diojen katselulaitteen avulla katseltava kaksiulotteinen, läpinäkyvä kuva pienellä läpinäkyvällä arkilla.
definition: Som enhet tvådimensionell genomskinlig bild på ett litet genomskinligt ark, som är placerat i en ram och som ska beskådas med hjälp av en projektor eller en visningsapparat för diabilder. @sv
example: MARC 21: 300 ## ‡a 19 diaa (9 min) + ‡e 2 CD-äänilevyä, 2 tekstilipuketta (10, 7 sivua)
example: MARC 21: 300 ## ‡a 19 diabilder (9 min) + ‡e 2 CD-ljudskivor, 2 texthäften (10, 7 sidor) @sv
in scheme: Metatietosanasto
preferred label: diabild @sv

Sisältötyyppi
type: ConceptGroup
type: Collection
source: RDA-termi
source: RDA-term @sv
created: 2016-01-08
modified: 2024-03-14
definition: Liittää ekspression jaotteluun, joka ilmaisee sisällön esitysmuodon ja sen, minkä aistin välityksellä sisältö on tarkoitus vastaanottaa. Jos mikään alla olevista RDA:n sisältötyypeistä ei sovellu kuvaamaan aineiston sisältöä, merkitään 'muu'.
definition: Sammankopplar uttryck med en indelning som anger visningsform för innehållet och med vilket sinne innehållet är avsett att mottagas. Om ingen av RDA-innehållstyperna nedan kan användas för att beskriva materialets innehåll anges "annan". @sv
member: taktiili liikenotaatio
member: digitaalinen data
member: taktiili teksti
member: puhe
member: taktiili kolmiulotteinen muoto
member: kartografinen liikkuva kuva
member: kaksiulotteinen liikkuva kuva
member: liikenotaatio
member: teksti
member: tietokoneohjelma
member: kartografinen kuva
member: nuottikirjoitus
member: kartografinen data
member: stillkuva
member: kolmiulotteinen muoto
member: ääni
member: esitetty liike
member: esitetty musiikki
member: taktiili nuottikirjoitus
member: kartografinen taktiili kuva
member: kartografinen kolmiulotteinen muoto
member: kolmiulotteinen liikkuva kuva
member: kartografinen taktiili kolmiulotteinen muoto
member: taktiili kuva
preferred label: Content type @en
preferred label: Innehållstyp @sv

filmirulla
type: Concept
source: RDA-termi
source: RDA-term @sv
created: 2016-01-08
modified: 2023-05-17
definition: Rullattu filmi.
definition: Ihoprullad film @sv
in scheme: Metatietosanasto
preferred label: film roll @en
preferred label: filmrulle @sv
scope note: Heijastettava kuvatallenne.
scope note: Bärare för projicerbara bilder. @sv

piirtoheitinkalvopohja
type: Concept
source: Kansallinen RDA-termi
source: Nationell RDA-term @sv
created: 2016-01-08
modified: 2025-10-04
in scheme: Metatietosanasto
preferred label: underlag för OH-bild @sv

mikroskooppinen
type: Concept
source: RDA-termi
source: RDA-term @sv
created: 2016-01-08
modified: 2023-05-05
definition: Viestin sisältää hyvin pieniä objekteja, ja se on suunniteltu käytettäväksi laitteella kuten mikroskoopilla, joka paljastaa yksityiskohtia joita ei voi nähdä paljaalla silmällä.
definition: Mediet innehåller mycket små objekt och används med hjälp av en apparat såsom ett mikroskop, som visar detaljer som inte går att ses med blotta ögat. @sv
in scheme: Metatietosanasto
preferred label: mikroskopisk @sv

libretto
type: Concept
source: Kansallinen RDA-termi
source: Nationell RDA-term @sv
created: 2019-02-20
modified: 2024-11-14
definition: Oopperan, operetin, musikaalin tai muun laajan laulusävellyksen teksti.
definition: Text till en opera, operett, musikal eller annan omfattande vokal komposition. @sv
in scheme: Metatietosanasto
scope note: Teoksen muoto -termejä käytetään erottamaan toisistaan samannimiset teokset.
scope note: Verkets form-termer används för att åtskilja verk med samma namn. @sv

aikakauslehti
type: Concept
source: Kansallinen RDA-termi
source: Nationell RDA-term @sv
created: 2019-02-20
modified: 2024-11-14
alternative label: tidning @sv
in scheme: Metatietosanasto
preferred label: tidskrift @sv
scope note: Teoksen muoto -termejä käytetään erottamaan toisistaan samannimiset teokset.
scope note: Verkets form-termer används för att åtskilja verk med samma namn. @sv

käsikirjoitus
type: Concept
source: Kansallinen RDA-termi
source: Nationell RDA-term @sv
created: 2019-02-20
modified: 2024-11-14
in scheme: Metatietosanasto
preferred label: handsskrift @sv
scope note: Teoksen muoto -termejä käytetään erottamaan toisistaan samannimiset teokset.
scope note: Verkets form-termer används för att åtskilja verk med samma namn. @sv

sanomalehti
type: Concept
source: Kansallinen RDA-termi
source: Nationell RDA-term @sv
created: 2019-02-20
modified: 2024-11-14
in scheme: Metatietosanasto
preferred label: dagstidning @sv
scope note: Teoksen muoto -termejä käytetään erottamaan toisistaan samannimiset teokset.
scope note: Verkets form-termer används för att åtskilja verk med samma namn. @sv

elokuvakäsikirjoitus
type: Concept
source: Kansallinen RDA-termi
source: Nationell RDA-term @sv
created: 2019-02-20
modified: 2024-11-14
in scheme: Metatietosanasto
preferred label: filmmanuskript @sv
scope note: Teoksen muoto -termejä käytetään erottamaan toisistaan samannimiset teokset.
scope note: Verkets form-termer används för att åtskilja verk med samma namn. @sv

Ammatti/harrastus
type: ConceptGroup
type: Collection
source: Kansallinen RDA-termi
source: Nationell RDA-term @sv
created: 2019-03-02
modified: 2024-10-04
preferred label: Occupation/field of activity @en
preferred label: Yrke/intresse @sv
scope note: Harrastusryhmistä voidaan käyttää YSOn termejä harrastukset; ammateista Metatietosanaston termejä ryhmästä ammatti tai tehtävä.
scope note: Om hobbygrupper kan ALLFO-termerna hobbyer användas; om yrken termer ur gruppen yrke eller uppgift i Metadataordlistan. @sv

koulutus
type: Concept
source: Kansallinen RDA-termi
source: Nationell RDA-term @sv
created: 2019-03-13
modified: 2026-05-06
alternative label: kasvatusala
alternative label: opetusala
alternative label: utbildningsbranschen @sv
definition: Koulutusta oppilaitoksissa eri koulutusasteilla ja eri ammatteja varten sekä aikuiskoulutusta ja erityisopetusta harjoittavat ja koulutukseen liittyviä palveluja tuottavat toimijat. Pääluokkaan kuuluvat myös toimijat, jotka tarjoavat koulutusta muiden pääluokkien edustamien toimialojen viiteryhmille.
definition: Aktörer som bedriver utbildning vid utbildningsanstalter på olika utbildningsnivåer och för olika yrken, vuxenutbildning och specialundervisning samt producerar utbildningsrelaterade tjänster. Till huvudkategorin hör också aktörer som erbjuder utbildning till referensgrupper inom verksamhetsområden som representeras av andra huvudkategorier. @sv
in scheme: Metatietosanasto
preferred label: utbildning @sv

majoitus- ja ravitsemisala
type: Concept
source: Kansallinen RDA-termi
source: Nationell RDA-term @sv
created: 2019-03-13
modified: 2026-05-06
alternative label: majoitusala
alternative label: matkailuala
alternative label: ravitsemisala
alternative label: siivousala
alternative label: förplägnadsbranschen @sv
alternative label: inkvarteringsbranschen @sv
alternative label: kosthållsbranschen @sv
alternative label: städbranschen @sv
alternative label: turistbranschen @sv
definition: Lyhytaikaista majoitusta ja välittömästi nautittavaksi valmistettuja aterioita ja anniskeltuja juomia sekä ateriapalveluja tarjoavat toimijat. Pääluokkaan eivät kuulu elintarvikkeiden teollista valmistamista (ks. elintarviketeollisuus) eikä niiden vähittäiskauppaa (ks. kauppa-ala) harjoittavat toimijat.
definition: Aktörer som erbjuder kortvarig inkvartering, måltider som tillagats och drycker som serverats för att förtäras direkt, samt måltidstjänster. Till huvudkategorin hör inte aktörer som bedriver industriell tillverkning av livsmedel (se livsmedelsindustri) eller detaljhandel med livsmedel (se handelsbranschen). @sv
in scheme: Metatietosanasto
preferred label: inkvarterings- och kosthållsbranschen @sv

rakennusala
type: Concept
source: Kansallinen RDA-termi
source: Nationell RDA-term @sv
created: 2019-03-13
modified: 2026-05-06
alternative label: rakennustoiminta
alternative label: rakentaminen
alternative label: byggnad @sv
alternative label: byggnadsverksamhet @sv
definition: Talonrakennusta, maa- ja vesirakennusta (mm. tiet, rautatiet, vesiväylät, lentokentät, vesi- , viemäri-, tietoliikenne-, kaasu-, lämpö- ja sähköverkostot), ympäristörakentamista, koneiden ja laitteiden rakentamista, LVI- ja sähkö- ja eristystöitä, purkutöitä sekä muita rakentamiseen kiinteästi liittyviä töitä ja rakennussuunnittelua harjoittavat toimijat.
definition: Aktörer som utövar husbyggnad, anläggningsverksamhet (bl.a. vägar, järnvägar, vattenvägar, flygfält, datakommunikationsnät, vatten-, avlopps-, gas-, värme-, och elnätverk), miljötekniskt byggande, maskin- och apparatbyggnad, VVS-, el- och isoleringsarbeten, rivningsarbeten samt andra arbeten som är nära sammanhörande med byggnad och byggnadsplanering. @sv
in scheme: Metatietosanasto
preferred label: byggnadsbranschen @sv

informaatio- ja viestintäala
type: Concept
source: Kansallinen RDA-termi
source: Nationell RDA-term @sv
created: 2019-03-13
modified: 2026-05-06
alternative label: informaatioala
alternative label: julkaisutoiminta
alternative label: kustannusala
alternative label: mainonta
alternative label: media-ala
alternative label: teleala
alternative label: viestintäala
alternative label: förlagsbranschen @sv
alternative label: informationsbranschen @sv
alternative label: mediebranschen @sv
alternative label: publikationsbranschen @sv
alternative label: reklam @sv
alternative label: telebranschen @sv
definition: Kustannustoimintaa, radio- ja televisiotoimintaa, elokuva-, musiikki- ja ohjelmatuotantoa, televiestintää, tiedonvälitystä, mainontaa, tietotekniikka- ja tietojenkäsittelypalveluita harjoittavat toimijat. Pääluokkaan eivät kuulu postitoimintaa (ks. logistiikka-ala), eivätkä painamista, jäljentämistä ja monentamista (ks. graafinen teollisuus) harjoittavat toimijat.
definition: Aktörer som sysslar med förlagsverksamhet, radio- och tv-verksamhet, film-, musik-, och programproduktion, telekommunikation, informationsförmedling, reklam, informationsteknik och databehandling. Till huvudkategorin hör inte postverksamhet (se logistikbranschen) och inte heller aktörer som sysslar med tryckning, kopiering och mångfaldigande (se grafisk industri). @sv
in scheme: Metatietosanasto
preferred label: informations- och kommunikationsbranschen @sv

vesi- ja ympäristönhuolto
type: Concept
source: Kansallinen RDA-termi
source: Nationell RDA-term @sv
created: 2019-03-13
modified: 2026-05-06
alternative label: jätehuolto
alternative label: vesihuolto
alternative label: avfallshantering @sv
alternative label: vattenförsörjning @sv
alternative label: vattentjänster och miljövård @sv
definition: Veden ottoa, puhdistusta ja jakelua, jätteiden keruuta, käsittelyä ja loppusijoitusta, jätevesien keräämistä, kuljetusta ja puhdistusta sekä maaperän ja vesistöjen puhdistusta ja kunnostusta harjoittavat toimijat. Pääluokkaan eivät kuulu maa- ja vesirakennusta tai ympäristörakentamista harjoittavat toimijat (ks. rakennusala).
definition: Aktörer som utövar vattentäkt, vattenrening och -distribution, avfallsinsamling, -hantering och slutförvaring, uppsamling, transport och rening av avfallsvatten samt rening och restaurering av mark och vattendrag. Till huvudkategorin hör inte anläggningsverksamhet eller miljötekniskt byggande (se byggnadsbranschen). @sv
in scheme: Metatietosanasto
preferred label: vattenförsörjning och miljövård @sv

terveys- ja sosiaaliala
type: Concept
source: Kansallinen RDA-termi
source: Nationell RDA-term @sv
created: 2019-03-13
modified: 2026-05-06
alternative label: hyvinvointiala
alternative label: sosiaaliala
alternative label: terveysala
alternative label: hälso- och socialvårdssektorn @sv
alternative label: hälsovårdsbranschen @sv
alternative label: socialvårdsbranschen @sv
definition: Terveydenhuollon laitospalveluita, lääkäripalveluita ja muita terveys- ja hyvinvointipalveluita (esim. fysioterapia, psykoterapia, laboratoriotutkimukset, sairaankuljetus, kauneudenhoito) sekä sosiaalihuollon laitos- ja avopalveluja tuottavat toimijat. Pääluokkaan kuuluvat myös toimijat, jotka tarjoavat terveys- ja sosiaalipalveluja muiden pääluokkien edustamien toimialojen viiteryhmille.
definition: Aktörer som producerar hälsovårdens anstaltsvård, läkartjänster och andra hälsovårds- och välfärdstjänster (t.ex. fysioterapi, psykoterapi, laboratorieundersökningar, sjuktransport, skönhetsvård), samt socialvårdens anstalts- och öppenvårdstjänster. Till huvudkategorin hör även aktörer som erbjuder hälso- och socialvårdstjänster till referensgrupper inom verksamhetsområden som representeras av andra huvudkategorier. @sv
in scheme: Metatietosanasto
preferred label: hälso- och socialvårdsbranschen @sv

kulttuuri- ja viihdeala
type: Concept
source: Kansallinen RDA-termi
source: Nationell RDA-term @sv
created: 2019-03-13
modified: 2026-05-06
alternative label: kulttuuriala
alternative label: kulttuuritoiminta
alternative label: peliala
alternative label: taideala
alternative label: viihde
alternative label: konstbranschen @sv
alternative label: kultur- och underhållningsbranschen @sv
alternative label: kulturbranschen @sv
alternative label: kulturverksamhet @sv
alternative label: spelbranschen @sv
alternative label: underhållning @sv
definition: Kirjastot, arkistot, museot ja muut kulttuurilaitokset, viihdelaitokset sekä muut kulttuuri- ja viihdepalveluja, mukaan lukien rahapeli-, vedonlyönti- ja videopelipalveluja tuottavat toimijat. Pääluokkaan eivät kuulu urheilu- ja virkistyspalveluja tuottavat toimijat (ks. urheilu- ja virkistystoiminta).
definition: Bibliotek, arkiv, muséer och andra kulturinstitutioner, institutioner för underhållning samt aktörer som producerar andra kultur- och underhållningstjänster, inklusive spel om pengar, vadslagnings-, och videospelstjänster. Till huvudkategorin hör inte aktörer som producerar idrotts- och rekreationstjänster (se idrotts- och rekreationsverksamhet). @sv
in scheme: Metatietosanasto
preferred label: kultur- och nöjesbranschen @sv

finanssiala
type: Concept
source: Kansallinen RDA-termi
source: Nationell RDA-term @sv
created: 2019-03-13
modified: 2026-05-06
alternative label: rahoitusala
alternative label: rahoitustoiminta
alternative label: vakuutusala
alternative label: vakuutustoiminta
alternative label: finansieringsbranschen @sv
alternative label: finansverksamhet @sv
alternative label: försäkringsbranschen @sv
alternative label: försäkringsverksamhet @sv
definition: Rahoitus- ja sijoituspalveluita tarjoavat sekä pankki-, vakuutus-, jälleenvakuutus- ja eläkerahastointitoimintaa, varojen hallinnointia (ks. hallintayhtiöt, säätiöt, rahastot), pörssitoimintaa ja arvopapereiden välitystä yms. harjoittavat toimijat. Pääluokkaan eivät kuulu pakollista sosiaalivakuutustoimintaa harjoittavat toimijat (ks. sosiaalivakuutus).
definition: Aktörer som erbjuder finansierings- och placeringstjänster samt utövar bank-, försäkrings-, återförsäkrings-, och pensionsfondsverksamhet, medelsförvaltning (se holdingbolag, stiftelser, fonder), börsverksamhet och värdepappersförmedling etc. Till huvudgruppen hör inte aktörer som utövar obligatorisk socialförsäkringsverksamhet (se socialförsäkring). @sv
in scheme: Metatietosanasto
preferred label: finansbranschen @sv

nuottikirjoitus
type: Concept
source: RDA-termi
source: RDA-term @sv
created: 2016-01-08
modified: 2023-05-05
alternative label: notated music @en
alternative label: musiknotation @sv
alternative label: notskrift @sv
definition: Musiikkinotaationa esitetty sisältö, joka on tarkoitettu katsottavaksi. Sisältää kaikki muut kuin kosketeltavassa muodossa olevat musiikkinotaatiot. Katso myös taktiili nuottikirjoitus.
definition: Innehåll uttryckt med hjälp av musiknotation, avsett att betraktas. Omfattar alla former av musiknotation, med undantag för notation avsedd att vidröras. Se även taktil musiknotation. @sv
in scheme: Metatietosanasto
preferred label: noterad musik @sv

kaivosala
type: Concept
source: Kansallinen RDA-termi
source: Nationell RDA-term @sv
created: 2019-03-13
modified: 2026-05-06
alternative label: kaivosteollisuus
alternative label: kaivostoiminta
alternative label: louhinta
alternative label: gruvindustri @sv
alternative label: gruvverksamhet @sv
definition: Malmien ja muiden kaivannaisten alkutuotantoa eli kaivuuta ja louhintaa, kullanhuuhdontaa sekä raakaöljyn ja maakaasun tuotantoa harjoittavat ja palvelevat toimijat. Pääluokkaan eivät kuulu kaivannaisten kuljetusta (ks. logistiikka) tai raaka-aineiden jatkojalostusta (ks. teollisuus) harjoittavat toimijat.
definition: Aktörer som utövar och betjänar primärproduktion av malm och andra mineral, guldvaskning samt produktion av råolja och naturgas. Till huvudkategorin hör inte aktörer som utövar transport av mineral (se logistik) eller vidareförädling av råmaterial (se industri). @sv
in scheme: Metatietosanasto
preferred label: gruvbranschen @sv

asiantuntijapalvelutoiminta
type: Concept
source: Kansallinen RDA-termi
source: Nationell RDA-term @sv
created: 2019-03-13
modified: 2026-05-06
alternative label: asiantuntijapalvelut
alternative label: kirjanpito
alternative label: lakiasiainpalvelut
alternative label: laskentatoimi
alternative label: tekniset alat
alternative label: tutkimuspalvelut
alternative label: bokföring @sv
alternative label: expertserviceverksamhet @sv
alternative label: experttjänster @sv
alternative label: forskningstjänster @sv
alternative label: redovisning @sv
alternative label: tekniska områden @sv
definition: Muille toimijoille tutkimus-, lakiasiain- ja laskentatoimen palveluja, konsultointia sekä muita tieteellistä tai teknistä erityisosaamista vaativia palveluja tarjoavat toimijat. Pääluokkaan eivät kuulu tutkimuslaitokset, jotka suorittavat julkishallinnollista tehtävää, arkkitehti- ja rakennustoimistot (ks. rakennusala), mainostoimistot (ks. informaatio ja viestinä) eivätkä hallinto- ja tukipalveluja tuottavat toimijat (ks. hallinto- ja tukipalvelutoiminta).
definition: Aktörer som erbjuder forsknings-, advokat-, och redovisningstjänster, konsultation och andra tjänster som kräver vetenskaplig eller teknisk specialkompetens. Till huvudgruppen hör inte forskningsinstitutioner som utför uppgifter inom offentlig förvaltning, arkitekt- och byggnadsbyråer (se byggnadsbranschen), reklambyråer (se information och kommunikation) eller aktörer som producerar förvaltnings- och stödtjänster (se förvaltnings- och stödtjänstverksamhet). @sv
in scheme: Metatietosanasto
preferred label: experttjänstverksamhet @sv

kiinteistöala
type: Concept
source: Kansallinen RDA-termi
source: Nationell RDA-term @sv
created: 2019-03-13
modified: 2026-05-06
alternative label: kiinteistönhoito
alternative label: kiinteistötoiminta
alternative label: fastighetsverksamhet @sv
definition: Kiinteistöjen kauppaa ja vuokrausta, kiinteistönvälitystä sekä kiinteistöjen hallintaa ja isännöintiä harjoittavat toimijat. Pääluokkaan eivät kuulu talonrakennusta (ks. rakennustala) eivätkä kiinteistönhuoltoa (ks. hallinto- ja tukipalvelutoiminta) harjoittavat toimijat.
definition: Aktörer som utövar handel med och uthyrning av fastigheter, fastighetsförmedling samt fastighetsbesittning och -förvaltning. Till huvudkategorin hör inte aktörer som utövar husbyggnad (se byggbranschen) eller fastighetsskötsel (se förvaltnings- och stödtjänstverksamhet). @sv
in scheme: Metatietosanasto
preferred label: fastighetsbranschen @sv

kauppa-ala
type: Concept
source: Kansallinen RDA-termi
source: Nationell RDA-term @sv
created: 2019-03-13
modified: 2026-05-06
alternative label: tukkukauppa
alternative label: vähittäiskauppa
alternative label: detaljhandel @sv
alternative label: partihandel @sv
definition: Tavaroiden tukkukauppaa, välityskauppaa ja vähittäiskauppaa harjoittavat toimijat. Pääluokkaan eivät kuulu luottotoimintaa, vakuutusmyyntiä, arvopaperikauppaa (ks. finanssiala) tai kiinteistökauppaa (ks. kiinteistöala) harjoittavat toimijat.
definition: Aktörer som utövar partihandel med varor, trading och detaljhandel. Till huvudkategorin hör inte aktörer som utövar kreditverksamhet, försäkringsförsäljning, värdepappershandel (se finansbranschen) eller fastighetshandel (se fastighetsbranschen). @sv
in scheme: Metatietosanasto
preferred label: handelsbranschen @sv

hallinto- ja tukipalvelutoiminta
type: Concept
source: Kansallinen RDA-termi
source: Nationell RDA-term @sv
created: 2019-03-13
modified: 2026-05-06
alternative label: hallintopalvelut
alternative label: suojeluala
alternative label: tukipalvelut
alternative label: turvallisuuspalvelut
alternative label: työllistämistoiminta
alternative label: vuokraustoiminta
definition: Muille toimijoille vuokraus-, työllistämis-, turvallisuus-, kiinteistönhuolto-, toimisto- ja muita luonteeltaan rutiininomaisia hallinto- ja tukipalveluita tuottavat toimijat. Pääluokkaan eivät kuulu tieteellistä tai teknistä erityisosaamista vaativia palveluja tuottavat toimijat (ks. asiantuntijapalvelutoiminta).
definition: Aktörer som producerar uthyrnings-, sysselsättnings-, säkerhets-, fastighetsservice-, och kontorstjänster samt andra rutinmässiga förvaltnings- och stödtjänster åt andra aktörer. Till huvudgruppen hör inte aktörer som producerar tjänster som kräver vetenskaplig eller teknisk specialkompetens (se experttjänstverksamhet). @sv
in scheme: Metatietosanasto
preferred label: förvaltnings- och stödtjänstverksamhet @sv

määrittelemätön toimiala
type: Concept
source: Kansallinen RDA-termi
source: Nationell RDA-term @sv
created: 2019-03-13
modified: 2026-05-06
alternative label: muu toimiala
alternative label: tuntematon toimiala
alternative label: annan bransch @sv
alternative label: okänd bransch @sv
definition: Toimijat, joita ei päätoimialansa puolesta voi sijoittaa nimettyihin toimialaluokkiin tai joiden päätoimialaa ei tunneta.
definition: Aktörer, vars huvudsakliga verksamhetsområde inte kan placeras i någon av de namngivna verksamhetsområdesklasserna, eller vars huvudsakliga verksamhetsområde är okänt. @sv
in scheme: Metatietosanasto
preferred label: ospecificerad bransch @sv

logistiikka-ala
type: Concept
source: Kansallinen RDA-termi
source: Nationell RDA-term @sv
created: 2019-03-13
modified: 2026-05-06
alternative label: kuljetusala
alternative label: liikenne-ala
alternative label: pakkausteollisuus
alternative label: posti
alternative label: varastointi
alternative label: förpackningsindustri @sv
alternative label: post @sv
alternative label: trafikbranschen @sv
alternative label: transportbranschen @sv
definition: Henkilö- ja tavaraliikennettä rautateitse, maanteitse, vesiteitse ja ilmateitse harjoittavat toimijat, varastointia ja muuta liikennettä palvelevaa toimintaa sekä postitoimintaa harjoittavat toimijat. Pääluokkaan eivät kuulu tietoliikennettä (ks. informaatio- ja viestintäala), infrastruktuurien ja kuljetusvälineiden rakentamista (ks. rakennusala) ja huoltoa (ks. hallinto- ja tukipalvelutoiminta) eivätkä sairaankuljetusta (ks. terveys- ja sosiaaliala) harjoittavat toimijat.
definition: Aktörer som utövar person- och godstrafik via järnvägar, landsvägar, vattenvägar och flygledes, verksamhet som betjänar lagring och annan trafik, samt postverksamhet. Till huvudkategorin hör inte aktörer som utövar datakommunikation (se informations- och kommunikationsbranschen), byggnad av infrastruktur och transportmedel (se byggnadsbranschen) och service (se förvaltnings- och stödtjänstverksamhet), eller sjuktransport (se hälso- och socialvårdsbranschen). @sv
in scheme: Metatietosanasto
preferred label: logistikbranschen @sv

urheilu- ja virkistystoiminta
type: Concept
source: Kansallinen RDA-termi
source: Nationell RDA-term @sv
created: 2019-03-13
modified: 2026-05-06
alternative label: urheilu
alternative label: virkistystoiminta
alternative label: idrott @sv
alternative label: rekreationsverksamhet @sv
alternative label: sport @sv
alternative label: sport- och rekreationsverksamhet @sv
definition: Urheilu- ja liikuntalaitokset, urheilujoukkueet ja -seurat, kuntokeskukset, hiihtokeskukset, huvi- ja teemapuistot ja muut urheilu- ja virkistyspalveluja tuottavat toimijat. Pääluokkaan eivät kuulu kulttuuri- ja viihdepalveluja (ks. kulttuuri- ja viihdeala) tuottavat toimijat.
definition: Sport- och idrottsanläggningar, idrottslag och -föreningar, motionscenter, skidcentra, nöjes- och temaparker och andra aktörer som producerar idrotts- och rekreationstjänster. Till huvudkategorin hör inte aktörer som producerar kultur- och underhållningstjänster (se kultur- och nöjesbranschen). @sv
in scheme: Metatietosanasto
preferred label: idrotts- och rekreationsverksamhet @sv

energia-ala
type: Concept
source: Kansallinen RDA-termi
source: Nationell RDA-term @sv
created: 2019-03-13
modified: 2026-05-06
alternative label: energiahuolto
alternative label: energiförsörjning @sv
definition: Sähkön, kaasun sekä lämmön ja kylmän tuottamista, siirtoa, jakelua ja kauppaa harjoittavat toimijat. Pääluokkaan eivät kuulu voimalaitosten, koneiden ja verkostojen rakentamista harjoittavat toimijat eivätkä sähköteknisen alan toimijat (ks. rakennusala).
definition: Aktörer som utövar produktion, överföring och distribution av, samt handel med elektricitet, gas, värme och kyla. Till huvudgruppen hör inte aktörer som utövar byggnad av kraftverk, maskiner och nätverk och inte heller aktörer inom den elektrotekniska branschen (se byggnadsbranschen). @sv
in scheme: Metatietosanasto
preferred label: energi-branschen @sv

ritari
type: Concept
source: Kansallinen RDA-termi
source: Nationell RDA-term @sv
created: 2019-04-27
modified: 2024-05-24
definition: Aatelisen sotilassäädyn jäsen keskiajalla. Ritarimerkin saanut henkilö.
definition: Medlem i adligt soldatstånd på medeltiden. Person som tilldelats riddartecken. @sv
in scheme: Metatietosanasto
preferred label: riddare @sv

paroni
type: Concept
source: Kansallinen RDA-termi
source: Nationell RDA-term @sv
created: 2019-04-27
modified: 2024-05-24
definition: Kreiviä lähinnä alempi aatelismies useissa maissa; Suomessa vapaaherran puhuttelunimenä.
definition: Lägre adelsman närmast greve i flera länder; i Finland tilltalsnamn för friherre. @sv
in scheme: Metatietosanasto
preferred label: baron @sv

kirkollinen tai uskonnollinen arvo(nimi)
type: ConceptGroup
type: Collection
source: Kansallinen RDA-termi
source: Nationell RDA-term @sv
created: 2019-04-27
modified: 2025-03-28
alternative label: kyrklig eller religiös hederstitel @sv
member: äiti
member: pappismunkki
member: veli
member: metropoliitta
member: igumeeni
member: sisar
member: arkkimandriitta
member: skeemaigumeeni
member: kardinaali
member: abbedissa
member: pyhä
member: nunna
member: paavi
member: isä
member: munkki
member: apotti
member: kalifi
member: igumenia
member: rabbi
member: patriarkka
member: ruhtinaspiispa
member: ruhtinasarkkipiispa
member: skeemaigumenia
member: skeemapappismunkki
member: dalai-lama
member: panchen-lama
member: skeemanunna
member: skeemamunkki
member: ajatollah
member: vastapaavi
member: katolikos
member: kaniikki
preferred label: kyrklig eller religiös titel @sv

tsaari
type: Concept
source: Kansallinen RDA-termi
source: Nationell RDA-term @sv
created: 2019-04-27
modified: 2024-05-24
definition: Venäjän, Serbian ja Bulgarian miespuolisten hallitsijoiden (keisarien) arvonimi.
definition: Hederstitel för manliga regenter (kejsare) i Ryssland, Serbien och Bulgarien. @sv
in scheme: Metatietosanasto
preferred label: tsar @sv

herttuatar
type: Concept
source: Kansallinen RDA-termi
source: Nationell RDA-term @sv
created: 2019-04-27
modified: 2024-05-24
definition: Herttuan puoliso; nainen jolla on herttuan arvo.
definition: Gemål till hertig; kvinna som innehar hertiginnetitel. @sv
in scheme: Metatietosanasto
preferred label: hertiginna @sv

kuninkaallinen tai aatelisarvo
type: ConceptGroup
type: Collection
source: Kansallinen RDA-termi
source: Nationell RDA-term @sv
created: 2019-04-27
modified: 2025-03-28
member: keisarinna
member: prinsessa
member: kreivitär
member: ruhtinas
member: kuningatar
member: faarao
member: ritari
member: paroni
member: tsaari
member: herttuatar
member: paronitar
member: pajari
member: herttua
member: tsaaritar
member: herra
member: vapaaherratar
member: vapaaherra
member: keisari
member: vaaliruhtinas
member: kruununprinssi
member: arkkiherttuatar
member: suuriruhtinas
member: arkkiherttua
member: suuriruhtinatar
member: jaarli
member: maakreivitär
member: palatsikreivi
member: rajakreivi
member: suurherttua
member: kaani
member: suurherttuatar
member: kruununprinsessa
member: maakreivi
member: vaaliruhtinatar
member: prinssi
member: kreivi
member: kuningas
member: ruhtinatar
preferred label: kunglig eller adelstitel @sv

paronitar
type: Concept
source: Kansallinen RDA-termi
source: Nationell RDA-term @sv
created: 2019-04-27
modified: 2024-05-24
definition: Paronin puoliso tai (naimisissa oleva tai ollut) tytär, vapaaherratar.
definition: Gemål eller dotter (som är eller har varit gift) till baron, friherrinna. @sv
in scheme: Metatietosanasto
preferred label: baronessa @sv

pajari
type: Concept
source: Kansallinen RDA-termi
source: Nationell RDA-term @sv
created: 2019-04-27
modified: 2024-05-24
definition: Pajarit olivat Venäjän ylimmän ruhtinaallisen palvelusluokan jäseniä ennen Pietari Suuren aikaa. Pajari-nimitystä käytettiin myös muun muassa Unkarin ja Romanian alueella.
definition: Bojarerna var den högsta furstliga tjänsteklassens medlemmar i Ryssland före Peter den stores tid. Benämningen användes också bl.a. i Ungern och Rumänien. @sv
in scheme: Metatietosanasto
preferred label: bojar @sv

herttua
type: Concept
source: Kansallinen RDA-termi
source: Nationell RDA-term @sv
created: 2019-04-27
modified: 2024-05-24
definition: Korkein aatelisarvo ja kuninkaallisten prinssien arvonimi eräissä maissa.
definition: Högsta adelstitel och kungliga prinsars titel i vissa länder. @sv
in scheme: Metatietosanasto
preferred label: hertig @sv

tsaaritar
type: Concept
source: Kansallinen RDA-termi
source: Nationell RDA-term @sv
created: 2019-04-27
modified: 2024-05-24
alternative label: tsaritsa @sv
definition: Tsaarin puoliso; tsaaria vastaava naispuolinen hallitsija.
definition: Tsarens gemål; kvinnlig motsvarighet till tsar. @sv
in scheme: Metatietosanasto
preferred label: tsarinna @sv

herra
type: Concept
source: Kansallinen RDA-termi
source: Nationell RDA-term @sv
created: 2019-04-27
modified: 2024-05-24
definition: Keskiajan ritareiden ja pappien arvonimi.
definition: Titel för riddare och präster under medeltiden. @sv
in scheme: Metatietosanasto
preferred label: herre @sv

kalifi
type: Concept
source: Kansallinen RDA-termi
source: Nationell RDA-term @sv
created: 2019-04-27
modified: 2024-05-24
alternative label: kalifi (arvonimi)
alternative label: kalif (hederstitel) @sv
definition: Islamilaisten korkein hengellinen ja maallinen johtaja.
definition: Högsta andliga och världsliga ledaren inom islam. @sv
in scheme: Metatietosanasto
preferred label: kalif @sv

vapaaherratar
type: Concept
source: Kansallinen RDA-termi
source: Nationell RDA-term @sv
created: 2019-04-27
modified: 2024-05-24
definition: Vapaaherran puoliso tai (naimisissa oleva tai ollut) tytär.
definition: Friherres gemål eller dotter (som är eller har varit gift). @sv
in scheme: Metatietosanasto
preferred label: friherrinna @sv

rovasti
type: Concept
source: Kansallinen RDA-termi
source: Nationell RDA-term @sv
created: 2019-04-27
modified: 2024-06-04
alternative label: rovasti (arvonimi)
alternative label: prost (hederstitel) @sv
definition: Piispan ansioituneelle papille myöntämä arvonimi.
definition: Hederstitel som biskop tilldelat en meriterad präst. @sv
in scheme: Metatietosanasto
preferred label: prost @sv

vapaaherra
type: Concept
source: Kansallinen RDA-termi
source: Nationell RDA-term @sv
created: 2019-04-27
modified: 2024-05-24
definition: Arvoltaan kreiviä lähinnä alempi aatelismies.
definition: Lägre adelsman närmast greve i rang. @sv
in scheme: Metatietosanasto
preferred label: friherre @sv

igumenia
type: Concept
source: Kansallinen RDA-termi
source: Nationell RDA-term @sv
created: 2019-04-27
modified: 2024-05-24
definition: Ortodoksisen nunnaluostarin johtajatar.
definition: Ledare av ortodoxt nunnekloster. @sv
in scheme: Metatietosanasto

rabbi
type: Concept
source: Kansallinen RDA-termi
source: Nationell RDA-term @sv
created: 2019-04-27
modified: 2024-05-24
definition: Juutalaisten lainoppineiden ja opettajien arvonimi.
definition: Hederstitel för judiska rättslärda och lärare. @sv
in scheme: Metatietosanasto

muu, mm. kunnioitusta osoittava arvonimi
type: ConceptGroup
type: Collection
source: Kansallinen RDA-termi
source: Nationell RDA-term @sv
created: 2019-04-30
modified: 2025-10-30
member: rovasti
member: erikoislähettiläs
member: kanslianeuvos
member: maakuntaneuvos
member: valtiopäiväneuvos
member: patenttineuvos
member: metsätalousneuvos
member: budjettineuvos
member: taideneuvos
member: kulttuurineuvos
member: lähetystöneuvos
member: sotakamreeri
member: museoneuvos
member: varakonsuli
member: metsäneuvos
member: järjestöneuvos
member: vuorineuvos
member: apteekkineuvos
member: intendentti
member: viestintäneuvos
member: kalatalousneuvos
member: maanviljelysneuvos
member: musiikkineuvos
member: energianeuvos
member: kiinteistöneuvos
member: ylirakennusmestari
member: seurakuntaneuvos
member: matkailuneuvos
member: valtioneuvos
member: ylipormestari
member: liikuntaneuvos
member: kirjastoneuvos
member: kamarineuvos
member: arkkiatri
member: lentokapteeni
member: kauppaneuvos
member: kouluneuvos
member: nuorisoasiainneuvos
member: postimestari
member: herastuomari
member: taloustirehtööri
member: ylimetsänhoitaja
member: lehtori
member: liikenneneuvos
member: käsityöneuvos
member: kotiseutuneuvos
member: yliagronomi
member: maanmittausneuvos
member: merenkulkuneuvos
member: kaupallinen neuvos
member: pitäjänneuvos
member: insinöörineuvos
member: rakennusneuvos
member: talousneuvos
member: kirjapainoneuvos
member: kotiteollisuusneuvos
member: satamaneuvos
member: kalastusneuvos
member: korkeakouluneuvos
member: kunniatohtori
member: balettineuvos
member: elokuvaneuvos
member: luotsineuvos
member: ammattikasvatusneuvos
member: director cantus
member: eläinlääkintöneuvos
member: kihlakunnanneuvos
member: yli-intendentti
member: lääkintöneuvos
member: puutarhaneuvos
member: maaneuvos
member: tullineuvos
member: rahoitusneuvos
member: uittoneuvos

field of activity of corporate body
type: ConceptGroup
type: Collection
source: RDA-termi
source: RDA-term @sv
created: 2019-05-02
modified: 2026-05-06
alternative label: toimiala
alternative label: verksamhetsområde @sv
definition: A field of endeavor, area of competence, or responsibility in which a corporate body is engaged. @en
definition: Ala, jolla yhteisö toimii tai on toiminut, tai jonka asiantuntija tms. se on.
definition: Sektor inom vilken en institution fungerar eller har fungerat, eller inom vilken den är specialist. @sv
member: koulutus
member: majoitus- ja ravitsemisala
member: metalli- ja konepajateollisuus
member: rakennusala
member: informaatio- ja viestintäala
member: teollisuus
member: sosiaali- ja terveyshallinto
member: tekstiili- ja vaatetusteollisuus
member: sisäasiainhallinto
member: maa- ja metsätaloushallinto
member: vesi- ja ympäristönhuolto
member: ulkoasiainhallinto
member: julkinen hallinto
member: liikenne- ja rakennushallinto
member: ympäristö- ja vesihallinto
member: sosiaalivakuutus
member: terveys- ja sosiaaliala
member: opetus- ja kulttuurihallinto
member: järjestötoiminta
member: kulttuuri- ja viihdeala
member: kansanhuolto ja elintarvikehuolto
member: finanssiala
member: puolustushallinto
member: metsäteollisuus
member: työ- ja elinkeinohallinto
member: puolustusvoimat
member: graafinen teollisuus
member: elektroniikka- ja sähköteollisuus
member: kaivosala
member: elintarviketeollisuus
member: asiantuntijapalvelutoiminta
member: kiinteistöala
member: kauppa-ala
member: kemianteollisuus
member: hallinto- ja tukipalvelutoiminta
member: määrittelemätön toimiala
member: oikeushallinto
member: kirkon hallinto
member: lääketeollisuus
member: logistiikka-ala
member: urheilu- ja virkistystoiminta
member: valtiovarainhallinto
member: energia-ala
member: maa-, metsä- ja kalatalous
member: lasi-, kivi- ja saviteollisuus
member: poliittiset järjestöt
member: elinkeinojärjestöt
member: ammattialajärjestöt
member: maanpuolustusjärjestöt
member: kuluttajajärjestöt
member: harrastusjärjestöt
member: sosiaalijärjestöt
member: uskonnolliset järjestöt
member: opiskelijajärjestöt
member: maatalousjärjestöt
member: kulttuurijärjestöt
member: eläkeläisjärjestöt
member: pelastusjärjestöt
member: ympäristöjärjestöt
member: rauhanjärjestöt
member: nuorisojärjestöt
member: liikuntajärjestöt
member: raittiusjärjestöt
member: sotaveteraanijärjestöt
member: matkailualan järjestöt
member: hyväntekeväisyysjärjestöt
member: kotitalousjärjestöt
member: ammattiyhdistykset
member: kannatusyhdistykset

maa-, metsä- ja kalatalous
type: Concept
source: Kansallinen RDA-termi
source: Nationell RDA-term @sv
created: 2019-05-02
modified: 2026-05-06
alternative label: kalatalous
alternative label: maatalous
alternative label: metsätalous
alternative label: fiskeri @sv
alternative label: jordbruk @sv
alternative label: jordbruk, skogsbruk och fiskerinäring @sv
alternative label: skogsbruk @sv
definition: Maatalouden, metsätalouden ja kalatalouden alkutuotantoa eli kasvinviljelyä, kotieläinten kasvatusta, metsänhoitoa, puunkorjuuta, metsästystä, kalastusta ja kalanviljelyä harjoittavat ja palvelevat toimijat. Pääluokkaan eivät kuulu eläinlääkärit (ks. terveys- ja sosiaaliala), maatilamatkailuyritykset (ks. majoitus- ja ravitsemisala) eivätkä puutavaran kuljetusta (ks. logistiikka-ala) tai tuotteiden jatkojalostusta (ks. teollisuus) harjoittavat toimijat.
definition: Aktörer som utövar och betjänar primärproduktion inom jordbruk, skogsbruk och fiskeri, alltså växtodling, husdjursuppfödning, skogvsvård, drivning, jakt, fiske, och fiskodling. Till huvudkategorin hör inte veterinärer (se hälso- och socialvårdsbranschen), företag inom lantgårdsturism (se inkvarterings- och kosthållsbranschen) eller aktörer som bedriver trävarutransport (se logistikbranschen) eller vidareförädling av produkter (se industri). @sv
in scheme: Metatietosanasto
preferred label: jordbruk, skogsbruk och fiskeri @sv

erikoislähettiläs
type: Concept
source: Kansallinen RDA-termi
source: Nationell RDA-term @sv
created: 2019-05-03
modified: 2024-05-24
in scheme: Metatietosanasto
preferred label: utomordentligt sändebud @sv

kanslianeuvos
type: Concept
source: Kansallinen RDA-termi
source: Nationell RDA-term @sv
created: 2019-05-03
modified: 2024-05-24
in scheme: Metatietosanasto
preferred label: kansliråd @sv

maakuntaneuvos
type: Concept
source: Kansallinen RDA-termi
source: Nationell RDA-term @sv
created: 2019-05-03
modified: 2024-05-24
in scheme: Metatietosanasto
preferred label: landskapsråd @sv

valtiopäiväneuvos
type: Concept
source: Kansallinen RDA-termi
source: Nationell RDA-term @sv
created: 2019-05-03
modified: 2024-05-24
in scheme: Metatietosanasto
preferred label: riksdagsråd @sv

patenttineuvos
type: Concept
source: Kansallinen RDA-termi
source: Nationell RDA-term @sv
created: 2019-05-03
modified: 2024-05-24
in scheme: Metatietosanasto
preferred label: patentråd @sv

metsätalousneuvos
type: Concept
source: Kansallinen RDA-termi
source: Nationell RDA-term @sv
created: 2019-05-03
modified: 2024-05-24
in scheme: Metatietosanasto
preferred label: skogsbruksråd @sv

hallitusneuvos
type: Concept
source: Kansallinen RDA-termi
source: Nationell RDA-term @sv
created: 2019-05-03
modified: 2024-11-05
alternative label: hallitusneuvos (ammatti)
alternative label: regeringsråd (yrke) @sv
in scheme: Metatietosanasto
preferred label: regeringsråd @sv
scope note: Arvonimenä käytä: hallitusneuvos.
scope note: Som hederstitel använd regeringsråd. @sv

budjettineuvos
type: Concept
source: Kansallinen RDA-termi
source: Nationell RDA-term @sv
created: 2019-05-03
modified: 2024-05-24
in scheme: Metatietosanasto
preferred label: budgetråd @sv

taideneuvos
type: Concept
source: Kansallinen RDA-termi
source: Nationell RDA-term @sv
created: 2019-05-03
modified: 2024-05-24
in scheme: Metatietosanasto
preferred label: konstråd @sv

kulttuurineuvos
type: Concept
source: Kansallinen RDA-termi
source: Nationell RDA-term @sv
created: 2019-05-03
modified: 2024-05-24
in scheme: Metatietosanasto
preferred label: kulturråd @sv

lähetystöneuvos
type: Concept
source: Kansallinen RDA-termi
source: Nationell RDA-term @sv
created: 2019-05-03
modified: 2024-05-24
in scheme: Metatietosanasto
preferred label: legationsråd @sv

sotakamreeri
type: Concept
source: Kansallinen RDA-termi
source: Nationell RDA-term @sv
created: 2019-05-03
modified: 2024-05-24
in scheme: Metatietosanasto
preferred label: fältkamrer @sv

museoneuvos
type: Concept
source: Kansallinen RDA-termi
source: Nationell RDA-term @sv
created: 2019-05-03
modified: 2024-05-24
in scheme: Metatietosanasto
preferred label: museiråd @sv

varakonsuli
type: Concept
source: Kansallinen RDA-termi
source: Nationell RDA-term @sv
created: 2019-05-03
modified: 2024-05-24
in scheme: Metatietosanasto
preferred label: vicekonsul @sv

metsäneuvos
type: Concept
source: Kansallinen RDA-termi
source: Nationell RDA-term @sv
created: 2019-05-03
modified: 2024-05-24
in scheme: Metatietosanasto
preferred label: forstråd @sv

dioraama
type: Concept
source: RDA-termi
source: RDA-term @sv
created: 2016-01-08
modified: 2023-05-17
definition: Laajuuden yksikkö, kolmiulotteinen maisemamalli tai asetelma, jossa kaksiulotteisen maalatun taustan eteen on aseteltu esineitä, hahmoja tms.
definition: Enhet, tredimensionnell framställning av ett landskap, där föremål och figurer m.m. placerats framför en tvådimensionell bild. @sv
in scheme: Metatietosanasto
preferred label: diorama @en

järjestöneuvos
type: Concept
source: Kansallinen RDA-termi
source: Nationell RDA-term @sv
created: 2019-05-03
modified: 2024-05-24
in scheme: Metatietosanasto
preferred label: organisationsråd @sv

vuorineuvos
type: Concept
source: Kansallinen RDA-termi
source: Nationell RDA-term @sv
created: 2019-05-03
modified: 2024-05-24
in scheme: Metatietosanasto
preferred label: bergsråd @sv

apteekkineuvos
type: Concept
source: Kansallinen RDA-termi
source: Nationell RDA-term @sv
created: 2019-05-03
modified: 2024-05-24
in scheme: Metatietosanasto
preferred label: apoteksråd @sv

intendentti
type: Concept
source: Kansallinen RDA-termi
source: Nationell RDA-term @sv
created: 2019-05-03
modified: 2024-05-24
alternative label: intendentti (arvonimi)
alternative label: intendent (hederstitel) @sv
in scheme: Metatietosanasto
preferred label: intendent @sv

viestintäneuvos
type: Concept
source: Kansallinen RDA-termi
source: Nationell RDA-term @sv
created: 2019-05-03
modified: 2024-05-24
in scheme: Metatietosanasto
preferred label: kommunikationsråd @sv

kalatalousneuvos
type: Concept
source: Kansallinen RDA-termi
source: Nationell RDA-term @sv
created: 2019-05-03
modified: 2024-05-24
in scheme: Metatietosanasto
preferred label: fiskerihushållningsråd @sv

maanviljelysneuvos
type: Concept
source: Kansallinen RDA-termi
source: Nationell RDA-term @sv
created: 2019-05-03
modified: 2024-05-24
in scheme: Metatietosanasto
preferred label: lantbruksråd @sv

musiikkineuvos
type: Concept
source: Kansallinen RDA-termi
source: Nationell RDA-term @sv
created: 2019-05-03
modified: 2024-05-24
in scheme: Metatietosanasto
preferred label: musikråd @sv

energianeuvos
type: Concept
source: Kansallinen RDA-termi
source: Nationell RDA-term @sv
created: 2019-05-03
modified: 2024-05-24
in scheme: Metatietosanasto
preferred label: energiråd @sv

kiinteistöneuvos
type: Concept
source: Kansallinen RDA-termi
source: Nationell RDA-term @sv
created: 2019-05-03
modified: 2024-05-24
in scheme: Metatietosanasto
preferred label: fastighetsråd @sv

Kalevi Jäntin palkinto
type: Concept
source: Kansallinen RDA-termi
source: Nationell RDA-term @sv
created: 2019-05-03
modified: 2023-05-17
definition: Kalevi Jäntin säätiön vuosittain nuorille kirjailijoille myöntämä kirjallisuuspalkinto. Perustettiin vuonna 1942.
definition: Litteraturpris som årligen utdelas av Kalevi Jäntin säätiö till unga författare. Grundades år 1942. @sv
example: MARC 21 -formaatissa: 586 ## ‡a Kalevi Jäntin palkinto, 1942
example: I MARC 21-formatet: 586 ## ‡a Kalevi Jäntti-priset, 1942 @sv
in scheme: Metatietosanasto
preferred label: Kalevi Jäntti-priset @sv

ylirakennusmestari
type: Concept
source: Kansallinen RDA-termi
source: Nationell RDA-term @sv
created: 2019-05-03
modified: 2024-05-24
in scheme: Metatietosanasto
preferred label: överbyggmästare @sv

seurakuntaneuvos
type: Concept
source: Kansallinen RDA-termi
source: Nationell RDA-term @sv
created: 2019-05-03
modified: 2024-05-24
in scheme: Metatietosanasto
preferred label: församlingsråd @sv

matkailuneuvos
type: Concept
source: Kansallinen RDA-termi
source: Nationell RDA-term @sv
created: 2019-05-03
modified: 2024-05-24
in scheme: Metatietosanasto
preferred label: turistråd @sv

valtioneuvos
type: Concept
source: Kansallinen RDA-termi
source: Nationell RDA-term @sv
created: 2019-05-03
modified: 2024-05-24
in scheme: Metatietosanasto
preferred label: statsråd @sv

ylipormestari
type: Concept
source: Kansallinen RDA-termi
source: Nationell RDA-term @sv
created: 2019-05-03
modified: 2024-05-24
in scheme: Metatietosanasto
preferred label: överborgmästare @sv

liikuntaneuvos
type: Concept
source: Kansallinen RDA-termi
source: Nationell RDA-term @sv
created: 2019-05-03
modified: 2024-05-24
in scheme: Metatietosanasto
preferred label: idrottsråd @sv

kirjastoneuvos
type: Concept
source: Kansallinen RDA-termi
source: Nationell RDA-term @sv
created: 2019-05-03
modified: 2024-05-24
in scheme: Metatietosanasto
preferred label: biblioteksråd @sv

kamarineuvos
type: Concept
source: Kansallinen RDA-termi
source: Nationell RDA-term @sv
created: 2019-05-03
modified: 2024-05-24
in scheme: Metatietosanasto
preferred label: kammarråd @sv

arkkiatri
type: Concept
source: Kansallinen RDA-termi
source: Nationell RDA-term @sv
created: 2019-05-03
modified: 2024-05-24
in scheme: Metatietosanasto
preferred label: arkiater @sv

32:o
type: Concept
source: RDA-termi
source: RDA-term @sv
created: 2016-01-08
modified: 2025-05-13
definition: Bibliografinen koko muodostuu yhdestä tai useammasta lehdestä, jotka ovat kooltaan 1/32 arkista.
definition: Bokens format består av ett eller flera blad som till sin storlek är 1/36 av ett tryckark. @sv
in scheme: Metatietosanasto
preferred label: 32mo @en

röntgenkuva
type: Concept
source: RDA-termi
source: RDA-term @sv
created: 2016-01-08
modified: 2024-07-02
alternative label: röntgenbild @sv
definition: Laajuuden yksikkö, stillkuva, joka perustuu säteilyn - esimerkiksi röntgen-, gamma- tai neutronisäteilyn - läpäisyyn läpinäkymättömän kohteen läpi.
definition: Enhet, stillbild som grundar sig på att strålning, t.ex. röntgen-, gamma- eller neutronstrålning, går igenom ett ogenomskinligt objekt. @sv
in scheme: Metatietosanasto
preferred label: radiograph @en
preferred label: röntgenfoto @sv

lentokapteeni
type: Concept
source: Kansallinen RDA-termi
source: Nationell RDA-term @sv
created: 2019-05-03
modified: 2024-05-24
in scheme: Metatietosanasto
preferred label: flygkapten @sv

kauppaneuvos
type: Concept
source: Kansallinen RDA-termi
source: Nationell RDA-term @sv
created: 2019-05-03
modified: 2024-05-24
in scheme: Metatietosanasto
preferred label: kommerseråd @sv

kouluneuvos
type: Concept
source: Kansallinen RDA-termi
source: Nationell RDA-term @sv
created: 2019-05-03
modified: 2024-05-24
in scheme: Metatietosanasto
preferred label: skolråd @sv

nuorisoasiainneuvos
type: Concept
source: Kansallinen RDA-termi
source: Nationell RDA-term @sv
created: 2019-05-03
modified: 2024-05-24
in scheme: Metatietosanasto
preferred label: ungdomsråd @sv

postimestari
type: Concept
source: Kansallinen RDA-termi
source: Nationell RDA-term @sv
created: 2019-05-03
modified: 2024-05-24
in scheme: Metatietosanasto
preferred label: postmästare @sv

herastuomari
type: Concept
source: Kansallinen RDA-termi
source: Nationell RDA-term @sv
created: 2019-05-03
modified: 2024-05-24
in scheme: Metatietosanasto
preferred label: häradsdomare @sv

taloustirehtööri
type: Concept
source: Kansallinen RDA-termi
source: Nationell RDA-term @sv
created: 2019-05-03
modified: 2024-05-24
in scheme: Metatietosanasto
preferred label: ekonomiedirektör @sv

ylimetsänhoitaja
type: Concept
source: Kansallinen RDA-termi
source: Nationell RDA-term @sv
created: 2019-05-03
modified: 2024-05-24
in scheme: Metatietosanasto
preferred label: överforstmästare @sv

lehtori
type: Concept
source: Kansallinen RDA-termi
source: Nationell RDA-term @sv
created: 2019-05-03
modified: 2024-05-24
alternative label: lehtori (arvonimi)
alternative label: lektor (hederstitel) @sv
in scheme: Metatietosanasto
preferred label: lektor @sv

liikenneneuvos
type: Concept
source: Kansallinen RDA-termi
source: Nationell RDA-term @sv
created: 2019-05-03
modified: 2024-05-24
in scheme: Metatietosanasto
preferred label: trafikråd @sv

käsityöneuvos
type: Concept
source: Kansallinen RDA-termi
source: Nationell RDA-term @sv
created: 2019-05-03
modified: 2024-05-24
in scheme: Metatietosanasto
preferred label: handarbetsråd @sv

kotiseutuneuvos
type: Concept
source: Kansallinen RDA-termi
source: Nationell RDA-term @sv
created: 2019-05-03
modified: 2024-05-24
in scheme: Metatietosanasto
preferred label: hembygdsråd @sv

yliagronomi
type: Concept
source: Kansallinen RDA-termi
source: Nationell RDA-term @sv
created: 2019-05-03
modified: 2024-05-24
in scheme: Metatietosanasto
preferred label: överagronom @sv

maanmittausneuvos
type: Concept
source: Kansallinen RDA-termi
source: Nationell RDA-term @sv
created: 2019-05-03
modified: 2024-05-24
in scheme: Metatietosanasto
preferred label: lantmäteriråd @sv

merenkulkuneuvos
type: Concept
source: Kansallinen RDA-termi
source: Nationell RDA-term @sv
created: 2019-05-03
modified: 2024-05-24
in scheme: Metatietosanasto
preferred label: sjöfartsråd @sv

kaupallinen neuvos
type: Concept
source: Kansallinen RDA-termi
source: Nationell RDA-term @sv
created: 2019-05-03
modified: 2024-05-24
in scheme: Metatietosanasto
preferred label: handelsråd @sv

pitäjänneuvos
type: Concept
source: Kansallinen RDA-termi
source: Nationell RDA-term @sv
created: 2019-05-03
modified: 2024-05-24
in scheme: Metatietosanasto
preferred label: sockenråd @sv

insinöörineuvos
type: Concept
source: Kansallinen RDA-termi
source: Nationell RDA-term @sv
created: 2019-05-03
modified: 2024-05-24
in scheme: Metatietosanasto
preferred label: ingenjörsråd @sv

rakennusneuvos
type: Concept
source: Kansallinen RDA-termi
source: Nationell RDA-term @sv
created: 2019-05-03
modified: 2024-05-24
in scheme: Metatietosanasto
preferred label: byggnadsråd @sv

talousneuvos
type: Concept
source: Kansallinen RDA-termi
source: Nationell RDA-term @sv
created: 2019-05-03
modified: 2024-05-24
in scheme: Metatietosanasto
preferred label: ekonomieråd @sv

kirjapainoneuvos
type: Concept
source: Kansallinen RDA-termi
source: Nationell RDA-term @sv
created: 2019-05-03
modified: 2024-05-24
in scheme: Metatietosanasto
preferred label: tryckeriråd @sv

kotiteollisuusneuvos
type: Concept
source: Kansallinen RDA-termi
source: Nationell RDA-term @sv
created: 2019-05-03
modified: 2024-05-24
in scheme: Metatietosanasto
preferred label: hemslöjdsråd @sv

satamaneuvos
type: Concept
source: Kansallinen RDA-termi
source: Nationell RDA-term @sv
created: 2019-05-03
modified: 2024-05-24
in scheme: Metatietosanasto
preferred label: hamnråd @sv

kalastusneuvos
type: Concept
source: Kansallinen RDA-termi
source: Nationell RDA-term @sv
created: 2019-05-03
modified: 2024-05-24
in scheme: Metatietosanasto
preferred label: fiskeriråd @sv

korkeakouluneuvos
type: Concept
source: Kansallinen RDA-termi
source: Nationell RDA-term @sv
created: 2019-05-03
modified: 2024-05-24
in scheme: Metatietosanasto
preferred label: högskoleråd @sv

kunniatohtori
type: Concept
source: Kansallinen RDA-termi
source: Nationell RDA-term @sv
created: 2019-05-03
modified: 2024-05-24
in scheme: Metatietosanasto
preferred label: hedersdoktor @sv

balettineuvos
type: Concept
source: Kansallinen RDA-termi
source: Nationell RDA-term @sv
created: 2019-05-03
modified: 2024-05-24
in scheme: Metatietosanasto
preferred label: balettråd @sv

elokuvaneuvos
type: Concept
source: Kansallinen RDA-termi
source: Nationell RDA-term @sv
created: 2019-05-03
modified: 2024-05-24
in scheme: Metatietosanasto
preferred label: filmråd @sv

luotsineuvos
type: Concept
source: Kansallinen RDA-termi
source: Nationell RDA-term @sv
created: 2019-05-03
modified: 2024-05-24
in scheme: Metatietosanasto
preferred label: lotsråd @sv

ammattikasvatusneuvos
type: Concept
source: Kansallinen RDA-termi
source: Nationell RDA-term @sv
created: 2019-05-03
modified: 2024-05-24
in scheme: Metatietosanasto
preferred label: yrkesutbildningsråd @sv

Manifestaation suhteet manifestaatioon
type: ConceptGroup
type: Collection
created: 2016-01-08
modified: 2025-11-18
member: alkuperäinen
member: aineiston digitoitu jäljenne
member: julkaistu myös eripainoksena
member: julkaistu myös verkkoaineistona
member: linkki
member: uusintapainos aineistosta
member: aineiston osa
member: julkaistu myös CD-ROM-levynä
member: julkaistu myös LP-levynä
member: julkaistu myös e-kirjana
member: julkaistu myös äänikirjana
member: julkaistu myös CD-äänilevynä.
member: julkaistu myös digitoituna
member: julkaistu vain verkkoaineistona vuodesta...
member: julkaistu myös vinyylisinglelevynä
member: Yhteenveto-osa julkaistu myös verkkoaineistona.
member: julkaistu myös tarvepainatteena
member: julkaistu myös C-kasettina.
member: julkaistu myös painettuna
member: julkaistu myös e-lehtenä
member: linkki digitoituun aineistoon
member: julkaistu myös MD-levynä
member: julkaistu joitakin sarjan osia vain verkkoaineistona
member: linkki verkkoaineistoon
member: liite
member: julkaistu aiemmin erillisinä niteinä
member: liitteenä aineistossa
member: painettu
member: digitoitu painetusta
member: näköispainos (manifestaatio)
member: eripainos julkaisusta
member: säilytyskopio (manifestaatio)
member: tallenteella myös
member: muu julkaisumuoto
member: digitoitu aineisto
member: näköispainos sisältyy aineistoon
member: näköispainos manifestaatiosta
member: peilisivusto
member: näköispainososa
member: konvertoinnin tulos
member: aineiston uusintapainos
member: konvertoitu aineisto
member: säilytyskopio manifestaatiosta
member: jäljenne aineistosta
member: samansisältöinen aineisto
member: levyllä myös
member: mukana ilmestynyt aineisto
member: filmillä myös
member: alun perin julkaistu
member: käytettävissä vapaakappalekirjastoissa
member: alakokoelma kokoelmassa
member: alakokoelma
member: aineistoon liittyvä aineisto
member: osa aineistoa
member: aineiston jäljenne
preferred label: Manifestationers relationer till manifestationer @sv

director cantus
type: Concept
source: Kansallinen RDA-termi
source: Nationell RDA-term @sv
created: 2019-05-03
modified: 2024-05-24
in scheme: Metatietosanasto

eläinlääkintöneuvos
type: Concept
source: Kansallinen RDA-termi
source: Nationell RDA-term @sv
created: 2019-05-03
modified: 2024-05-24
in scheme: Metatietosanasto
preferred label: veterinärråd @sv

kihlakunnanneuvos
type: Concept
source: Kansallinen RDA-termi
source: Nationell RDA-term @sv
created: 2019-05-03
modified: 2024-05-24
in scheme: Metatietosanasto
preferred label: häradsråd @sv

yli-intendentti
type: Concept
source: Kansallinen RDA-termi
source: Nationell RDA-term @sv
created: 2019-05-03
modified: 2024-05-24
in scheme: Metatietosanasto
preferred label: överintendent @sv

lääkintöneuvos
type: Concept
source: Kansallinen RDA-termi
source: Nationell RDA-term @sv
created: 2019-05-03
modified: 2024-05-24
in scheme: Metatietosanasto
preferred label: medicinalråd @sv

puutarhaneuvos
type: Concept
source: Kansallinen RDA-termi
source: Nationell RDA-term @sv
created: 2019-05-03
modified: 2024-05-24
in scheme: Metatietosanasto
preferred label: trädgårdsråd @sv

maaneuvos
type: Concept
source: Kansallinen RDA-termi
source: Nationell RDA-term @sv
created: 2019-05-03
modified: 2024-05-24
in scheme: Metatietosanasto
preferred label: lantråd @sv

tullineuvos
type: Concept
source: Kansallinen RDA-termi
source: Nationell RDA-term @sv
created: 2019-05-03
modified: 2024-05-24
in scheme: Metatietosanasto
preferred label: tullråd @sv

rahoitusneuvos
type: Concept
source: Kansallinen RDA-termi
source: Nationell RDA-term @sv
created: 2019-05-03
modified: 2024-05-24
in scheme: Metatietosanasto
preferred label: finansieringsråd @sv

uittoneuvos
type: Concept
source: Kansallinen RDA-termi
source: Nationell RDA-term @sv
created: 2019-05-03
modified: 2024-05-24
in scheme: Metatietosanasto
preferred label: flottningsråd @sv

kaupunkineuvos
type: Concept
source: Kansallinen RDA-termi
source: Nationell RDA-term @sv
created: 2019-05-03
modified: 2024-05-24
in scheme: Metatietosanasto
preferred label: stadsråd @sv

sosiaalineuvos
type: Concept
source: Kansallinen RDA-termi
source: Nationell RDA-term @sv
created: 2019-05-03
modified: 2024-05-24
in scheme: Metatietosanasto
preferred label: socialråd @sv

poliisineuvos
type: Concept
source: Kansallinen RDA-termi
source: Nationell RDA-term @sv
created: 2019-05-03
modified: 2024-05-24
in scheme: Metatietosanasto
preferred label: polisråd @sv

asessori
type: Concept
source: Kansallinen RDA-termi
source: Nationell RDA-term @sv
created: 2019-05-03
modified: 2024-05-24
alternative label: asessori (arvonimi)
alternative label: assessor (hederstitel) @sv
in scheme: Metatietosanasto
preferred label: assessor @sv

revisioneuvos
type: Concept
source: Kansallinen RDA-termi
source: Nationell RDA-term @sv
created: 2019-05-03
modified: 2024-05-24
in scheme: Metatietosanasto
preferred label: revisionsråd @sv

kotitalousneuvos
type: Concept
source: Kansallinen RDA-termi
source: Nationell RDA-term @sv
created: 2019-05-03
modified: 2024-05-24
in scheme: Metatietosanasto
preferred label: hushållsråd @sv

ylisosiaalineuvos
type: Concept
source: Kansallinen RDA-termi
source: Nationell RDA-term @sv
created: 2019-05-03
modified: 2024-05-24
in scheme: Metatietosanasto
preferred label: socialöverråd @sv

varatuomari
type: Concept
source: Kansallinen RDA-termi
source: Nationell RDA-term @sv
created: 2019-05-03
modified: 2025-08-23
alternative label: VT
alternative label: varatuomari (oppiarvo)
alternative label: vicehäradshövding (lärdomsgrad) @sv
in scheme: Metatietosanasto
preferred label: vicehäradshövding @sv
scope note: Arvonimenä käytä: varatuomari.
scope note: Som hederstitel använd: vicehäradshövding. @sv

sairaalaneuvos
type: Concept
source: Kansallinen RDA-termi
source: Nationell RDA-term @sv
created: 2019-05-03
modified: 2024-05-24
in scheme: Metatietosanasto
preferred label: sjukhusråd @sv

yliarkkitehti
type: Concept
source: Kansallinen RDA-termi
source: Nationell RDA-term @sv
created: 2019-05-03
modified: 2024-05-24
in scheme: Metatietosanasto
preferred label: överarkitekt @sv

ylikamreeri
type: Concept
source: Kansallinen RDA-termi
source: Nationell RDA-term @sv
created: 2019-05-03
modified: 2024-05-24
in scheme: Metatietosanasto
preferred label: överkamrer @sv

verotusneuvos
type: Concept
source: Kansallinen RDA-termi
source: Nationell RDA-term @sv
created: 2019-05-03
modified: 2024-05-24
in scheme: Metatietosanasto
preferred label: beskattningsråd @sv

vakuutusneuvos
type: Concept
source: Kansallinen RDA-termi
source: Nationell RDA-term @sv
created: 2019-05-03
modified: 2024-05-24
in scheme: Metatietosanasto
preferred label: försäkringsråd @sv

yli-insinööri
type: Concept
source: Kansallinen RDA-termi
source: Nationell RDA-term @sv
created: 2019-05-03
modified: 2024-05-24
in scheme: Metatietosanasto
preferred label: överingenjör @sv

terveydenhuoltoneuvos
type: Concept
source: Kansallinen RDA-termi
source: Nationell RDA-term @sv
created: 2019-05-03
modified: 2024-05-24
in scheme: Metatietosanasto
preferred label: hälsovårdsråd @sv

ympäristöneuvos
type: Concept
source: Kansallinen RDA-termi
source: Nationell RDA-term @sv
created: 2019-05-03
modified: 2024-05-24
in scheme: Metatietosanasto
preferred label: miljöråd @sv

työsuojeluneuvos
type: Concept
source: Kansallinen RDA-termi
source: Nationell RDA-term @sv
created: 2019-05-03
modified: 2024-05-24
in scheme: Metatietosanasto
preferred label: arbetarskyddsråd @sv

yrittäjäneuvos
type: Concept
source: Kansallinen RDA-termi
source: Nationell RDA-term @sv
created: 2019-05-03
modified: 2024-05-24
in scheme: Metatietosanasto
preferred label: företagarråd @sv

teatterineuvos
type: Concept
source: Kansallinen RDA-termi
source: Nationell RDA-term @sv
created: 2019-05-03
modified: 2024-05-24
in scheme: Metatietosanasto
preferred label: teaterråd @sv

kunnallisneuvos
type: Concept
source: Kansallinen RDA-termi
source: Nationell RDA-term @sv
created: 2019-05-03
modified: 2024-05-24
in scheme: Metatietosanasto
preferred label: kommunalråd @sv

eläinlääkintöasessori
type: Concept
source: Kansallinen RDA-termi
source: Nationell RDA-term @sv
created: 2019-05-03
modified: 2024-05-24
in scheme: Metatietosanasto
preferred label: veterinärassessor @sv

director musices
type: Concept
source: Kansallinen RDA-termi
source: Nationell RDA-term @sv
created: 2019-05-03
modified: 2024-05-24
in scheme: Metatietosanasto

eräneuvos
type: Concept
source: Kansallinen RDA-termi
source: Nationell RDA-term @sv
created: 2019-05-03
modified: 2024-05-24
in scheme: Metatietosanasto
preferred label: ödemarksråd @sv

pääkonsuli
type: Concept
source: Kansallinen RDA-termi
source: Nationell RDA-term @sv
created: 2019-05-03
modified: 2024-05-24
in scheme: Metatietosanasto
preferred label: generalkonsul @sv

oppiarvo
type: ConceptGroup
type: Collection
source: Kansallinen RDA-termi
source: Nationell RDA-term @sv
created: 2019-05-07
modified: 2025-06-13
alternative label: lärd grad @sv
alternative label: lärograd @sv
member: varatuomari
member: medianomi
member: taloustieteiden tohtori
member: tohtori
member: farmasian kandidaatti
member: terveydenhuollon kandidaatti
member: oikeustieteen maisteri
member: diplomiekonomi
member: kuvataiteen tohtori
member: ylempi ammattikorkeakoulututkinto
member: hammaslääketieteen tohtori
member: tanssitaiteen lisensiaatti
member: kauppatieteiden kandidaatti
member: kunnallistutkinto
member: terveystieteiden kandidaatti
member: oikeustieteen lisensiaatti
member: tradenomi
member: luonnontieteiden kandidaatti
member: kasvatustieteen maisteri
member: lisensiaatti
member: lakitieteen lisensiaatti
member: agrologi
member: eläinlääketieteen tohtori
member: oikeusnotaari
member: datanomi
member: teknisten aineiden opettaja
member: teologian lisensiaatti
member: musiikin lisensiaatti
member: kandidaatti
member: tekniikan kandidaatti
member: ylempi oikeustutkinto
member: liikuntatieteiden kandidaatti
member: poliisin päällystötutkinto
member: maisteri
member: teatteritaiteen maisteri
member: terveystieteiden maisteri
member: musiikin maisteri
member: lääketieteen ja kirurgian tohtori
member: farmasian maisteri
member: psykologian tohtori
member: lääketieteen tohtori
member: ekonomi
member: oikeustieteen tohtori
member: terveydenhuollon tohtori
member: taloudellis-hallinnollinen tutkinto
member: Sibelius-Akatemian diplomitutkinto
member: liikuntakasvatuksen kandidaatti
member: yhteiskuntatieteiden kandidaatti
member: yhteiskuntatieteiden maisteri
member: lakitieteen kandidaatti
member: tekniikan tohtori
member: hammaslääketieteen lisensiaatti
member: kasvatustieteen lisensiaatti
member: filosofian tohtori
member: kansalaiskoulunopettaja
member: psykologian lisensiaatti
member: peruskoulunopettaja
member: elintarviketieteiden lisensiaatti
member: humanististen tieteiden kandidaatti
member: filosofian kandidaatti
member: maatalous- ja metsätieteiden lisensiaatti
member: psykologian kandidaatti
member: farmasian lisensiaatti
member: agronomi
member: teologian tohtori
member: farmasian tohtori
member: terveydenhuollon lisensiaatti
member: ammatillinen opettajankoulutus
member: kuvataiteen kandidaatti
member: kirjastotutkinto
member: kuvataiteen lisensiaatti
member: oikeustieteen kandidaatti

medianomi
type: Concept
source: Kansallinen RDA-termi
source: Nationell RDA-term @sv
created: 2019-05-07
modified: 2024-05-24
alternative label: median.
in scheme: Metatietosanasto
preferred label: medianom @sv

1 7/8 tuumaa/s
type: Concept
source: Kansallinen RDA-termi
source: Nationell RDA-term @sv
created: 2016-01-08
modified: 2024-05-24
in scheme: Metatietosanasto
preferred label: 1 7/8 tum/s @sv

diplomiekonomi
type: Concept
source: Kansallinen RDA-termi
source: Nationell RDA-term @sv
created: 2019-05-07
modified: 2024-05-24
alternative label: DE
in scheme: Metatietosanasto
preferred label: diplomekonom @sv

ylempi ammattikorkeakoulututkinto
type: Concept
source: Kansallinen RDA-termi
source: Nationell RDA-term @sv
created: 2019-05-07
modified: 2024-05-24
alternative label: ylempi AMK
in scheme: Metatietosanasto
preferred label: högre yrkeshögskoleexamen @sv

kunnallistutkinto
type: Concept
source: Kansallinen RDA-termi
source: Nationell RDA-term @sv
created: 2019-05-07
modified: 2024-05-24
alternative label: KunnT
in scheme: Metatietosanasto
preferred label: kommunalexamen @sv

karttapallo
type: Concept
source: RDA-termi
source: RDA-term @sv
created: 2016-01-08
modified: 2023-05-17
alternative label: jordglob @sv
definition: Laajuuden yksikkö, kartta-aineisto, joka kuvaa maapalloa tai muita taivaankappaleita (oikeita tai kuvitteellisia) pallon pinnalla.
definition: Enhet, kartresurs som skildrar jorden eller andra himlakroppar (verkliga eller fiktiva) på ytan av ett klot. @sv
in scheme: Metatietosanasto
preferred label: globe @en
preferred label: glob @sv

tradenomi
type: Concept
source: Kansallinen RDA-termi
source: Nationell RDA-term @sv
created: 2019-05-07
modified: 2024-05-24
alternative label: traden.
in scheme: Metatietosanasto
preferred label: tradenom @sv

agrologi
type: Concept
source: Kansallinen RDA-termi
source: Nationell RDA-term @sv
created: 2019-05-07
modified: 2024-05-24
alternative label: agrol.
in scheme: Metatietosanasto
preferred label: agrolog @sv

oikeusnotaari
type: Concept
source: Kansallinen RDA-termi
source: Nationell RDA-term @sv
created: 2019-05-07
modified: 2024-05-24
alternative label: ON
in scheme: Metatietosanasto
preferred label: rättsnotarie @sv

datanomi
type: Concept
source: Kansallinen RDA-termi
source: Nationell RDA-term @sv
created: 2019-05-07
modified: 2024-05-24
alternative label: datan.
in scheme: Metatietosanasto
preferred label: datanom @sv

teknisten aineiden opettaja
type: Concept
source: Kansallinen RDA-termi
source: Nationell RDA-term @sv
created: 2019-05-07
modified: 2024-05-24
alternative label: TAO
in scheme: Metatietosanasto
preferred label: lärare i tekniska ämnen @sv

ylempi oikeustutkinto
type: Concept
source: Kansallinen RDA-termi
source: Nationell RDA-term @sv
created: 2019-05-07
modified: 2024-05-24
alternative label: YO
in scheme: Metatietosanasto
preferred label: högre rättsexamen @sv

poliisin päällystötutkinto
type: Concept
source: Kansallinen RDA-termi
source: Nationell RDA-term @sv
created: 2019-05-07
modified: 2024-05-24
alternative label: Ppt
alternative label: Pbe @sv
in scheme: Metatietosanasto
preferred label: polisens befälexamen @sv

Sarjakuva-Finlandia-palkinto
type: Concept
source: Kansallinen RDA-termi
source: Nationell RDA-term @sv
created: 2016-01-08
modified: 2023-05-17
definition: Myönnetään kotimaiselle tekijälle yksin tai yhdessä toisen osapuolen kanssa tekemästä ansiokkaasta sarjakuva-albumista. Tunnustuspalkinto myönnetään vuosittain keväällä Tampere Kuplii -sarjakuvatapahtumassa.
definition: Utdelas åt en inhemsk författare som ensam eller med en annan part gett ut ett meriterat seriealbum. Hederspriset utdelas varje vår under seriefestivalen Tampere Kuplii. @sv
example: MARC 21 -formaatissa: 586 ## ‡a Sarjakuva-Finlandia-palkinto, 2010
example: I MARC 21-formatet: 586 ## ‡a Serie-Finlandiapriset, 2010 @sv
in scheme: Metatietosanasto
preferred label: Serie-Finlandiapriset @sv

ekonomi
type: Concept
source: Kansallinen RDA-termi
source: Nationell RDA-term @sv
created: 2019-05-07
modified: 2024-05-24
alternative label: ekon.
in scheme: Metatietosanasto
preferred label: ekonom @sv

taloudellis-hallinnollinen tutkinto
type: Concept
source: Kansallinen RDA-termi
source: Nationell RDA-term @sv
created: 2019-05-07
modified: 2024-05-24
alternative label: TahT
in scheme: Metatietosanasto
preferred label: ekonomisk-administrativa examen @sv

Sibelius-Akatemian diplomitutkinto
type: Concept
source: Kansallinen RDA-termi
source: Nationell RDA-term @sv
created: 2019-05-07
modified: 2024-05-24
alternative label: SAD
in scheme: Metatietosanasto
preferred label: diplomexamen vid Sibelius-Akademin @sv

datatiedosto
type: Concept
source: RDA-termi
source: RDA-term @sv
created: 2016-01-08
modified: 2023-05-17
definition: Tiedostotyyppi elektronisesti taltioitujen data-arvojen tallentamiseksi.
definition: Filformat för lagring av elektroniskt upptagna datavärden. @sv
in scheme: Metatietosanasto
preferred label: data file @en
preferred label: datafil @sv

kansalaiskoulunopettaja
type: Concept
source: Kansallinen RDA-termi
source: Nationell RDA-term @sv
created: 2019-05-07
modified: 2024-05-24
alternative label: YAO
alternative label: kansalaiskoulun opettaja
alternative label: kansalaiskoulun yleisaineiden opettaja
alternative label: lärare i allmänna ämen i medborgarskolan @sv
in scheme: Metatietosanasto
preferred label: medborgarskollärare @sv

peruskoulunopettaja
type: Concept
source: Kansallinen RDA-termi
source: Nationell RDA-term @sv
created: 2019-05-07
modified: 2024-05-24
alternative label: PkO
in scheme: Metatietosanasto
preferred label: grundskollärare @sv

agronomi
type: Concept
source: Kansallinen RDA-termi
source: Nationell RDA-term @sv
created: 2019-05-07
modified: 2024-05-24
alternative label: agron.
in scheme: Metatietosanasto
preferred label: agronom @sv

ammatillinen opettajankoulutus
type: Concept
source: Kansallinen RDA-termi
source: Nationell RDA-term @sv
created: 2019-05-07
modified: 2024-05-24
alternative label: AmO
in scheme: Metatietosanasto
preferred label: yrkespedagogisk lärarutbildning @sv

kirjastotutkinto
type: Concept
source: Kansallinen RDA-termi
source: Nationell RDA-term @sv
created: 2019-05-07
modified: 2024-05-24
alternative label: KirjT
in scheme: Metatietosanasto
preferred label: bibliotekexamen @sv

yleisesikuntaupseeri
type: Concept
source: Kansallinen RDA-termi
source: Nationell RDA-term @sv
created: 2019-05-07
modified: 2024-05-24
alternative label: ye.ups.
in scheme: Metatietosanasto
preferred label: generalstabsofficer @sv

vankeinhoitotutkinto
type: Concept
source: Kansallinen RDA-termi
source: Nationell RDA-term @sv
created: 2019-05-07
modified: 2024-05-24
alternative label: VHT
in scheme: Metatietosanasto
preferred label: fångvårdsexamen @sv

diplomikielenkääntäjä
type: Concept
source: Kansallinen RDA-termi
source: Nationell RDA-term @sv
created: 2019-05-07
modified: 2024-05-24
alternative label: DKK
in scheme: Metatietosanasto
preferred label: diplomtranslator @sv

puutarhaopettaja
type: Concept
source: Kansallinen RDA-termi
source: Nationell RDA-term @sv
created: 2019-05-07
modified: 2024-05-24
alternative label: PTO
in scheme: Metatietosanasto
preferred label: trädgårdslärare @sv

hallintonotaari
type: Concept
source: Kansallinen RDA-termi
source: Nationell RDA-term @sv
created: 2019-05-07
modified: 2024-05-24
alternative label: HN
in scheme: Metatietosanasto
preferred label: förvaltningsnotarie @sv

RealVideo
type: Concept
source: Kansallinen RDA-termi
source: Nationell RDA-term @sv
created: 2016-01-08
modified: 2024-05-24
in scheme: Metatietosanasto

poliisipäällystön virkatutkinto
type: Concept
source: Kansallinen RDA-termi
source: Nationell RDA-term @sv
created: 2019-05-07
modified: 2024-05-24
alternative label: Ppvt
alternative label: Pbtv @sv
in scheme: Metatietosanasto
preferred label: polisbefälets tjänsteexamen @sv

valtiotieteellinen virkatutkinto
type: Concept
source: Kansallinen RDA-termi
source: Nationell RDA-term @sv
created: 2019-05-07
modified: 2024-05-24
alternative label: VTV
in scheme: Metatietosanasto
preferred label: statsvetenskaplig ämbetsexamen @sv

ammattikorkeakoulututkinto
type: Concept
source: Kansallinen RDA-termi
source: Nationell RDA-term @sv
created: 2019-05-07
modified: 2024-05-24
alternative label: AMK
alternative label: YH @sv
in scheme: Metatietosanasto
preferred label: yrkeshögskoleexamen @sv

sairaanhoitajajohtaja
type: Concept
source: Kansallinen RDA-termi
source: Nationell RDA-term @sv
created: 2019-05-07
modified: 2024-05-24
alternative label: SHJ
in scheme: Metatietosanasto
preferred label: sjukvårdsledare @sv

sosionomi
type: Concept
source: Kansallinen RDA-termi
source: Nationell RDA-term @sv
created: 2019-05-07
modified: 2024-05-24
alternative label: sosion.
alternative label: sosionomi (oppiarvo)
alternative label: socion. @sv
alternative label: socionom (lärdomsgrad) @sv
in scheme: Metatietosanasto
preferred label: socionom @sv

diplomikirjeenvaihtaja
type: Concept
source: Kansallinen RDA-termi
source: Nationell RDA-term @sv
created: 2019-05-07
modified: 2024-05-24
alternative label: DKV
in scheme: Metatietosanasto
preferred label: diplomkorrespondent @sv

diplomi-insinööri
type: Concept
source: Kansallinen RDA-termi
source: Nationell RDA-term @sv
created: 2019-05-07
modified: 2024-05-24
alternative label: DI
in scheme: Metatietosanasto
preferred label: diplomingenjör @sv

sairaanhoidonopettaja
type: Concept
source: Kansallinen RDA-termi
source: Nationell RDA-term @sv
created: 2019-05-08
modified: 2024-05-24
alternative label: SHO
alternative label: sairaanhoidonopettaja (oppiarvo)
in scheme: Metatietosanasto
preferred label: sjukvårdslärare @sv

voimistelunopettaja
type: Concept
source: Kansallinen RDA-termi
source: Nationell RDA-term @sv
created: 2019-05-08
modified: 2024-05-24
alternative label: VO
alternative label: voimistelunopettaja (oppiarvo)
in scheme: Metatietosanasto
preferred label: gymnastiklärare @sv

kotitalousopettaja
type: Concept
source: Kansallinen RDA-termi
source: Nationell RDA-term @sv
created: 2019-05-08
modified: 2024-05-24
alternative label: KtaO
alternative label: kotitalousopettaja (oppiarvo)
alternative label: lärare i huslig ekonomi @sv
in scheme: Metatietosanasto
preferred label: hushållslärare @sv

sairaanhoitaja
type: Concept
source: Kansallinen RDA-termi
source: Nationell RDA-term @sv
created: 2019-05-08
modified: 2024-05-24
alternative label: sair.hoit.
alternative label: sairaanhoitaja (oppiarvo)
alternative label: sjuksköterska @sv
in scheme: Metatietosanasto
preferred label: sjukskötare @sv

opinto-ohjaaja
type: Concept
source: Kansallinen RDA-termi
source: Nationell RDA-term @sv
created: 2019-05-08
modified: 2024-05-24
alternative label: OpO
alternative label: opinto-ohjaaja (oppiarvo)
alternative label: studierådgivare @sv
in scheme: Metatietosanasto
preferred label: studiehandledare @sv

kuvaamataidonopettaja
type: Concept
source: Kansallinen RDA-termi
source: Nationell RDA-term @sv
created: 2019-05-08
modified: 2024-05-24
alternative label: KuvO
alternative label: kuvaamataidonopettaja (oppiarvo)
alternative label: konstlärare @sv
in scheme: Metatietosanasto
preferred label: teckningslärare @sv

eläinlääkäri
type: Concept
source: Kansallinen RDA-termi
source: Nationell RDA-term @sv
created: 2019-05-08
modified: 2024-05-24
alternative label: EL
alternative label: eläinlääkäri (oppiarvo)
in scheme: Metatietosanasto
preferred label: veterinär @sv

metsänhoitaja
type: Concept
source: Kansallinen RDA-termi
source: Nationell RDA-term @sv
created: 2019-05-08
modified: 2024-05-24
alternative label: MH
alternative label: metsänhoitaja (oppiarvo)
in scheme: Metatietosanasto
preferred label: forstmästare @sv

varanotaari
type: Concept
source: Kansallinen RDA-termi
source: Nationell RDA-term @sv
created: 2019-05-08
modified: 2024-05-24
alternative label: VN
alternative label: varanotaari (oppiarvo)
in scheme: Metatietosanasto
preferred label: vicenotarie @sv

musiikinopettaja
type: Concept
source: Kansallinen RDA-termi
source: Nationell RDA-term @sv
created: 2019-05-08
modified: 2024-05-24
alternative label: MO
alternative label: musiikinopettaja (oppiarvo)
in scheme: Metatietosanasto
preferred label: musiklärare @sv

insinööri
type: Concept
source: Kansallinen RDA-termi
source: Nationell RDA-term @sv
created: 2019-05-08
modified: 2024-05-24
alternative label: ins.
alternative label: insinööri (oppiarvo)
in scheme: Metatietosanasto
preferred label: ingenjör @sv

erityislastentarhanopettaja
type: Concept
source: Kansallinen RDA-termi
source: Nationell RDA-term @sv
created: 2019-05-08
modified: 2024-05-24
alternative label: ELTO
alternative label: erityislastentarhanopettaja (oppiarvo)
in scheme: Metatietosanasto
preferred label: specialbarnträdgårdslärare @sv

sosiaalihuoltaja
type: Concept
source: Kansallinen RDA-termi
source: Nationell RDA-term @sv
created: 2019-05-08
modified: 2024-05-24
alternative label: SH
alternative label: sosiaalihuoltaja (oppiarvo)
in scheme: Metatietosanasto
preferred label: socialvårdare @sv

kipsi
type: Concept
source: RDA-termi
source: RDA-term @sv
created: 2016-01-08
modified: 2024-03-13
definition: Materiaali, joka koostuu veteen ja mahdolliseen täyteaineeseen sekoitetusta kalsiumsulfaattidihydraatista tai kalsiumkarbonaatista muodostaen massan, josta vapautuu lämpöä, minkä jälkeen massa kovettuu.
definition: Material som består av kalciumsulfathydrat eller kalciumkarbonat blandat i vatten och med ett eventuellt fyllnadsmaterial, vilket bildar en massa som frigör värme och därefter hårdnar. @sv
in scheme: Metatietosanasto
preferred label: plaster @en
preferred label: gips @sv

kotiteollisuusopettaja
type: Concept
source: Kansallinen RDA-termi
source: Nationell RDA-term @sv
created: 2019-05-08
modified: 2024-05-24
alternative label: KteO
alternative label: kotiteollisuusopettaja (oppiarvo)
in scheme: Metatietosanasto
preferred label: hemslöjdslärare @sv

lastentarhanopettaja
type: Concept
source: Kansallinen RDA-termi
source: Nationell RDA-term @sv
created: 2019-05-08
modified: 2024-05-24
alternative label: LTO
alternative label: lastentarhanopettaja (oppiarvo)
in scheme: Metatietosanasto
preferred label: barnträdgårdslärare @sv

käsityönopettaja
type: Concept
source: Kansallinen RDA-termi
source: Nationell RDA-term @sv
created: 2019-05-08
modified: 2024-05-24
alternative label: KtyO
alternative label: käsityönopettaja (oppiarvo)
in scheme: Metatietosanasto
preferred label: handarbetslärare @sv

luokanopettaja
type: Concept
source: Kansallinen RDA-termi
source: Nationell RDA-term @sv
created: 2019-05-08
modified: 2024-05-24
alternative label: LO
alternative label: luokanopettaja (oppiarvo)
in scheme: Metatietosanasto
preferred label: klasslärare @sv

kansakoulunopettaja
type: Concept
source: Kansallinen RDA-termi
source: Nationell RDA-term @sv
created: 2019-05-08
modified: 2024-05-24
alternative label: KkO
alternative label: kansakoulun opettaja
alternative label: kansakoulunopettaja (oppiarvo)
alternative label: folkskollärarinna @sv
in scheme: Metatietosanasto
preferred label: folkskollärare @sv

dosentti
type: Concept
source: Kansallinen RDA-termi
source: Nationell RDA-term @sv
created: 2019-05-08
modified: 2024-05-24
alternative label: dos.
alternative label: dosentti (oppiarvo)
in scheme: Metatietosanasto
preferred label: docent @sv

proviisori
type: Concept
source: Kansallinen RDA-termi
source: Nationell RDA-term @sv
created: 2019-05-08
modified: 2024-05-24
alternative label: prov.
alternative label: proviisori (oppiarvo)
in scheme: Metatietosanasto
preferred label: provisor @sv

konsuli
type: Concept
source: Kansallinen RDA-termi
source: Nationell RDA-term @sv
created: 2019-05-28
modified: 2024-06-04
alternative label: konsuli (arvonimi)
alternative label: konsul (hederstitel) @sv
in scheme: Metatietosanasto
preferred label: konsul @sv

professori
type: Concept
source: Kansallinen RDA-termi
source: Nationell RDA-term @sv
created: 2019-05-28
modified: 2024-06-04
alternative label: professori (arvonimi)
alternative label: professor (hederstitel) @sv
in scheme: Metatietosanasto
preferred label: professor @sv

rehtori
type: Concept
source: Kansallinen RDA-termi
source: Nationell RDA-term @sv
created: 2019-05-28
modified: 2024-06-04
alternative label: rehtori (arvonimi)
alternative label: rektor (hederstitel) @sv
in scheme: Metatietosanasto
preferred label: rektor @sv

pormestari
type: Concept
source: Kansallinen RDA-termi
source: Nationell RDA-term @sv
created: 2019-05-28
modified: 2024-06-04
alternative label: pormestari (arvonimi)
alternative label: borgmästare (hederstitel) @sv
in scheme: Metatietosanasto
preferred label: borgmästare @sv

kamreeri
type: Concept
source: Kansallinen RDA-termi
source: Nationell RDA-term @sv
created: 2019-05-28
modified: 2024-06-04
alternative label: kamreeri (arvonimi)
alternative label: kamrer (hederstitel) @sv
in scheme: Metatietosanasto
preferred label: kamrer @sv

teollisuusneuvos
type: Concept
source: Kansallinen RDA-termi
source: Nationell RDA-term @sv
created: 2019-05-28
modified: 2024-06-04
alternative label: teollisuusneuvos (arvonimi)
in scheme: Metatietosanasto
preferred label: industriråd @sv

ministeri
type: Concept
source: Kansallinen RDA-termi
source: Nationell RDA-term @sv
created: 2019-05-28
modified: 2024-06-04
alternative label: ministeri (arvonimi)
alternative label: minister (hederstitel) @sv
in scheme: Metatietosanasto
preferred label: minister @sv

kaupunginjohtaja
type: Concept
source: Kansallinen RDA-termi
source: Nationell RDA-term @sv
created: 2019-05-28
modified: 2024-06-04
alternative label: kaupunginjohtaja (arvonimi)
alternative label: stadsdirektör (hederstitel) @sv
in scheme: Metatietosanasto
preferred label: stadsdirektör @sv

lehdistöneuvos
type: Concept
source: Kansallinen RDA-termi
source: Nationell RDA-term @sv
created: 2019-05-28
modified: 2024-06-04
alternative label: lehdistöneuvos (arvonimi)
alternative label: pressråd (hederstitel) @sv
in scheme: Metatietosanasto
preferred label: pressråd @sv

laamanni
type: Concept
source: Kansallinen RDA-termi
source: Nationell RDA-term @sv
created: 2019-05-28
modified: 2024-05-24
alternative label: laamanni (oppiarvo)
in scheme: Metatietosanasto
preferred label: lagman @sv

akateemikko
type: Concept
source: Kansallinen RDA-termi
source: YSO-termi
source: ALLFO-term @sv
source: Nationell RDA-term @sv
created: 2019-05-28
modified: 2024-06-04
alternative label: akateemikko (arvonimi)
alternative label: akateemikot
alternative label: akademiledamöter @sv
alternative label: akademister @sv
in scheme: Metatietosanasto
preferred label: akademiker @sv

kunnanjohtaja
type: Concept
source: Kansallinen RDA-termi
source: Nationell RDA-term @sv
created: 2019-05-28
modified: 2024-06-04
alternative label: kunnanjohtaja (arvonimi)
alternative label: kommundirektör (hederstitel) @sv
in scheme: Metatietosanasto
preferred label: kommundirektör @sv

opetusneuvos
type: Concept
source: Kansallinen RDA-termi
source: Nationell RDA-term @sv
created: 2019-05-28
modified: 2024-06-04
alternative label: opetusneuvos (arvonimi)
alternative label: undervisningsråd (hederstitel) @sv
in scheme: Metatietosanasto
preferred label: undervisningsråd @sv

kenttäpiispa
type: Concept
source: Kansallinen RDA-termi
source: Nationell RDA-term @sv
created: 2019-05-28
modified: 2024-06-04
alternative label: kenttäpiispa (arvonimi)
alternative label: fältbiskop (hederstitel) @sv
in scheme: Metatietosanasto
preferred label: fältbiskop @sv

logonomi
type: Concept
source: Kansallinen RDA-termi
source: YSO-termi
source: ALLFO-term @sv
source: Nationell RDA-term @sv
created: 2019-06-29
modified: 2024-06-04
in scheme: Metatietosanasto
preferred label: logonom @sv

emännöitsijä
type: Concept
source: Kansallinen RDA-termi
source: Nationell RDA-term @sv
created: 2019-06-29
modified: 2023-05-17
definition: Vanh. Ennen emännöitsijä kuuluu arvostettuun palvelusväkeen, jolla oli alaisia. Nykyisin käytettävä termi on kodinhoitaja.
definition: Tidigare hörde husföreståndarinnor till det ansedda tjänstefolket som hade underordnade. Numera används termen hemvårdare. @sv
in scheme: Metatietosanasto
preferred label: matron @en
preferred label: husföreståndarinna @sv

viilari
type: Concept
source: Kansallinen RDA-termi
source: Nationell RDA-term @sv
created: 2019-06-29
modified: 2025-11-04
alternative label: viilaaja
in scheme: Metatietosanasto
preferred label: filer @en
preferred label: filare @sv

stereo
type: Concept
source: RDA-termi
source: RDA-term @sv
created: 2016-01-08
modified: 2023-05-17
definition: Kahdesta kanavasta koostuva stereofonisen äänen äänikanava.
definition: Ljudkanal för stereofoniskt ljud, som består av två kanaler. @sv
in scheme: Metatietosanasto

farmanomi
type: Concept
source: Kansallinen RDA-termi
source: Nationell RDA-term @sv
created: 2019-06-29
modified: 2024-06-04
in scheme: Metatietosanasto
preferred label: farmanom @sv

merkonomi
type: Concept
source: Kansallinen RDA-termi
source: YSO-termi
source: ALLFO-term @sv
source: Nationell RDA-term @sv
created: 2019-06-29
modified: 2024-05-24
in scheme: Metatietosanasto
preferred label: merkonom @sv

pesijä
type: Concept
source: Kansallinen RDA-termi
source: Nationell RDA-term @sv
created: 2019-07-11
modified: 2025-11-04
alternative label: tvätterska @sv
definition: Esim. pyykinpesijä, ravintolan astianpesijä.
definition: T.ex. tvättare av byk, diskare vid restaurang. @sv
in scheme: Metatietosanasto
preferred label: tvättare @sv

asioitsija
type: Concept
source: Kansallinen RDA-termi
source: Nationell RDA-term @sv
created: 2019-07-11
modified: 2025-11-04
definition: Asioitsija tarkoittaa lakimiestä, jolla ei ole lainopillista koulutusta. Asioitsijat hoitavat siviilioikeudellisia asioita eli toimittavat perunkirjoituksia, laativat kauppakirjoja, testamentteja, avioehtosopimuksia ja verovalituksia. Aiemmin asioitsijoiksi luettiin myös muun muassa vakuutusasiamiehet ja kauppaedustajat. (Lähde: Wikipedia.)
definition: Personer som inte har juridisk utbildning, men som sköter civilrättsliga ärenden, alltså förrättar bouppteckningar, skriver köpebrev, testamenten, äktenskapsförord och skattebesvär. Tidigare räknades också bl.a. skatteombud och handelsrepresentanter till sakförare. @sv
in scheme: Metatietosanasto
preferred label: sakförare @sv

hovioikeudenlaamanni
type: Concept
source: Kansallinen RDA-termi
source: Nationell RDA-term @sv
created: 2019-07-11
modified: 2025-11-04
definition: Hovioikeudenlaamanni on hovioikeuden osastoa johtava tuomari tai päällikkö (Lähde: Wikipedia).
definition: Ledande domare eller chef för avdelning vid hovrätt. @sv
in scheme: Metatietosanasto
preferred label: hovrättslagman @sv

kämppäemäntä
type: Concept
source: Kansallinen RDA-termi
source: Nationell RDA-term @sv
created: 2019-07-11
modified: 2025-11-04
in scheme: Metatietosanasto
preferred label: kocka @sv

liikennöitsijä
type: Concept
source: Kansallinen RDA-termi
source: Nationell RDA-term @sv
created: 2019-07-11
modified: 2025-11-04
alternative label: trafikföretag @sv
alternative label: åkeri @sv
in scheme: Metatietosanasto
preferred label: trafikidkare @sv

apumies
type: Concept
source: Kansallinen RDA-termi
source: Nationell RDA-term @sv
created: 2019-07-11
modified: 2025-11-04
alternative label: auton apumies
alternative label: repsikka
alternative label: hantlangare @sv
in scheme: Metatietosanasto
preferred label: hjälpkarl @sv

sekatyömies
type: Concept
source: Kansallinen RDA-termi
source: Nationell RDA-term @sv
created: 2019-07-11
modified: 2025-11-04
in scheme: Metatietosanasto
preferred label: diversearbetare @sv

kanslisti
type: Concept
source: Kansallinen RDA-termi
source: Nationell RDA-term @sv
created: 2019-07-11
modified: 2025-11-04
definition: Kansliassa, virastossa tms. toimistotöitä tekevä (toimi)henkilö (Lähde: Kielitoimiston sanakirja).
definition: Person som utför kontorsarbete vid kansli, byrå e.d. @sv
in scheme: Metatietosanasto
preferred label: office employee @en
preferred label: kanslist @sv

tarkastaja
type: Concept
source: Kansallinen RDA-termi
source: Nationell RDA-term @sv
created: 2019-07-11
modified: 2025-11-04
in scheme: Metatietosanasto
preferred label: inspector @en
preferred label: inspektör @sv

teollisuustarkastaja
type: Concept
source: Kansallinen RDA-termi
source: Nationell RDA-term @sv
created: 2019-07-11
modified: 2025-11-04
in scheme: Metatietosanasto
preferred label: industriinspektör @sv

museonhoitaja
type: Concept
source: Kansallinen RDA-termi
source: Nationell RDA-term @sv
created: 2019-07-11
modified: 2025-11-04
alternative label: museiföreståndare @sv
alternative label: museivärd @sv
alternative label: museivårdare @sv
in scheme: Metatietosanasto
preferred label: museiintendent @sv

ruukinomistaja
type: Concept
source: Kansallinen RDA-termi
source: Nationell RDA-term @sv
created: 2019-07-11
modified: 2025-11-04
alternative label: brukspatron @sv
in scheme: Metatietosanasto
preferred label: bruksägare @sv

Äänen toistonopeus
type: ConceptGroup
type: Collection
source: RDA-termi
source: RDA-term @sv
created: 2016-01-08
modified: 2023-05-05
alternative label: Ljudets återgivningshastighet @sv
member: 120 kierr./min
member: 15/16 tuumaa/s
member: 160 kierr./min
member: 1,4 m/s
member: 15 tuumaa/s
member: 33 1/3 kierr./min
member: 1 7/8 tuumaa/s
member: 45 kierr./min
member: 8 kierr./min
member: 3 3/4 tuumaa/s
member: 78 kierr./min
member: xx kierr./min
member: 16 kierr./min
member: 7 1/2 tuumaa/s
member: 30 tuumaa/s
preferred label: Playing speed @en
preferred label: Ljudets uppspelningshastighet @sv

ratatyömies
type: Concept
source: Kansallinen RDA-termi
source: Nationell RDA-term @sv
created: 2019-07-11
modified: 2025-11-04
definition: Ratatyömies hoitaa erilaisia raideliikenteen kunnossapitotehtäviä.
definition: Banarbetare sköter olika underhållsuppgifter för spårtrafik. @sv
in scheme: Metatietosanasto
preferred label: banarbetare @sv

kylvettäjä
type: Concept
source: Kansallinen RDA-termi
source: Nationell RDA-term @sv
created: 2019-07-11
modified: 2025-11-04
alternative label: saunottaja
alternative label: badare @sv
alternative label: baderska @sv
definition: Henkilö, joka kylvettää. Esim. edustussaunan kylvettäjä
definition: Person som tvättar andra, t.ex. badbiträde vid representationsbastu. @sv
in scheme: Metatietosanasto
preferred label: badbiträde @sv

kansanparantaja
type: Concept
source: Kansallinen RDA-termi
source: Nationell RDA-term @sv
created: 2019-07-11
modified: 2025-11-04
definition: Kansanparantaja nojaa paikalliseen uskomusperinteeseen ja luonnonlääkintään.
definition: Folkbotare grundar sig på lokal trostradition och naturläkedom. @sv
in scheme: Metatietosanasto
preferred label: folkbotare @sv

renki
type: Concept
source: Kansallinen RDA-termi
source: Nationell RDA-term @sv
created: 2019-07-11
modified: 2025-11-04
definition: Maalaistalon työmies (Lähde: Kielitoimiston sanakirja).
definition: Arbetskarl vid lantgård @sv
in scheme: Metatietosanasto
preferred label: farmhand @en
preferred label: dräng @sv

markkinointiassistentti
type: Concept
source: Kansallinen RDA-termi
source: Nationell RDA-term @sv
created: 2019-07-11
modified: 2025-11-04
alternative label: marknadsassistent @sv
in scheme: Metatietosanasto
preferred label: marknadsföringsassistent @sv

myymäläapulainen
type: Concept
source: Kansallinen RDA-termi
source: Nationell RDA-term @sv
created: 2019-07-11
modified: 2025-11-04
alternative label: affärsbiträde @sv
in scheme: Metatietosanasto
preferred label: butiksbiträde @sv

käyttökopio
type: Concept
source: RDA-termi
source: RDA-term @sv
created: 2016-01-08
modified: 2023-05-17
definition: Sukupolven määrite aineistolle, joka on pääasiallisesti tarkoitettu käyttöön.
definition: Bestämning av generation för material som i huvudsak är avsett för användning. @sv
in scheme: Metatietosanasto
preferred label: service copy @en
preferred label: brukskopia @sv

liikennevalvoja
type: Concept
source: Kansallinen RDA-termi
source: Nationell RDA-term @sv
created: 2019-07-11
modified: 2025-11-04
alternative label: trafikvakt @sv
in scheme: Metatietosanasto
preferred label: trafikövervakare @sv

veroesittelijä
type: Concept
source: Kansallinen RDA-termi
source: Nationell RDA-term @sv
created: 2019-07-11
modified: 2025-11-04
in scheme: Metatietosanasto
preferred label: skatteföredragande @sv

museolehtori
type: Concept
source: Kansallinen RDA-termi
source: Nationell RDA-term @sv
created: 2019-07-11
modified: 2025-11-04
definition: Yliopistotutkinnon suorittanut asiantuntija, joka vastaa museon opastus- ja oheistoiminnasta sekä yhteistyöstä oppilaitosten kanssa (Lähde: Kielitoimiston sanakirja).
definition: Specialist med universitetsexamen som ansvarar för ett museums guide- och övrig verksamhet samt samarbete med läroanstalter. @sv
in scheme: Metatietosanasto
preferred label: museilektor @sv

konekirjoittaja
type: Concept
source: Kansallinen RDA-termi
source: Nationell RDA-term @sv
created: 2019-07-11
modified: 2025-11-04
in scheme: Metatietosanasto
preferred label: maskinskrivare @sv

käämijä
type: Concept
source: Kansallinen RDA-termi
source: Nationell RDA-term @sv
created: 2019-07-11
modified: 2025-11-04
definition: Henkilö, joka kiertää johdin käämiksi.
definition: Person som tvinnar ledningar till spolar. @sv
in scheme: Metatietosanasto
preferred label: lindare @sv

huolitsija
type: Concept
source: Kansallinen RDA-termi
source: Nationell RDA-term @sv
created: 2019-07-11
modified: 2025-11-04
alternative label: speditööri
definition: Huolitsija työskentelee huolintaliikkeessä tuonti- ja vientikuljetusten järjestelytehtävissä. Työhön kuuluu suunnitella tavarankuljetuksen kokonaisuus, hoitaa tarvittava paperityö ja pitää asiakkaat ajan tasalla kuljetuksen vaiheista. (Lähde: Ammattinetti.)
definition: En speditör arbetar med att ordna import- och exporttransporter i speditionsföretag. Till arbetet hör att planera helheten för varutransport, sköta det pappersarbete som krävs och hålla kunderna uppdaterade om transportens skeden. @sv
in scheme: Metatietosanasto
preferred label: speditör @sv

vaakamestari
type: Concept
source: Kansallinen RDA-termi
source: Nationell RDA-term @sv
created: 2019-07-11
modified: 2025-11-04
in scheme: Metatietosanasto
preferred label: weight-master @en
preferred label: vågmästare @sv

pakkaaja
type: Concept
source: Kansallinen RDA-termi
source: Nationell RDA-term @sv
created: 2019-07-11
modified: 2025-11-04
in scheme: Metatietosanasto
preferred label: packer @en
preferred label: packare @sv

sähköttäjä
type: Concept
source: Kansallinen RDA-termi
source: Nationell RDA-term @sv
created: 2019-07-11
modified: 2025-11-04
alternative label: lennätinvirkailija
definition: Sähköttäjä lähettää ja vastaanottaa morsettamalla sähkömagneettisia viestejä käyttäen kiinteitä kaapeleita. Käytetty ammattinimikkeenä mm. lennätinkonttoreissa.
definition: En telefgrafist skickar ut och tar emot elektromagnetiska meddelanden med hjälp av fasta kablar. Använts som yrkesbenämning vid bl.a. telegrafkontor. @sv
in scheme: Metatietosanasto
preferred label: telegrafist @sv

vaihdemies
type: Concept
source: Kansallinen RDA-termi
source: Nationell RDA-term @sv
created: 2019-07-11
modified: 2025-11-04
alternative label: växlare @sv
in scheme: Metatietosanasto
preferred label: växelkarl @sv

liikennetarkastaja
type: Concept
source: Kansallinen RDA-termi
source: Nationell RDA-term @sv
created: 2019-07-11
modified: 2025-11-04
in scheme: Metatietosanasto
preferred label: trafikinspektör @sv

nahka
type: Concept
source: RDA-termi
source: RDA-term @sv
created: 2016-01-08
modified: 2024-03-13
definition: Eläimen nahasta tai vuodasta muodostuva materiaali, joka on hajoamisen estämiseksi parkittu ja kuivana suhteellisen pehmeä ja joustava.
definition: Material bestående av skinn eller hud från djur, som har garvats för att förhindra nedbrytning och som i torrt tillstånd är relativt mjukt och spänstigt. @sv
in scheme: Metatietosanasto
preferred label: leather @en
preferred label: läder @sv

nimismies
type: Concept
source: Kansallinen RDA-termi
source: Nationell RDA-term @sv
created: 2019-07-11
modified: 2025-11-04
definition: Aik. mm. poliisipäällikkönä ja virallisena syyttäjänä toiminut hallintoviranomainen (Lähde: Kielitoimiston sanakirja).
definition: Tidigare förvaltningsmyndighet som fungerade som polischef och allmän åklagare. @sv
in scheme: Metatietosanasto
preferred label: länsman @sv

kosketinsoittaja
type: Concept
source: Kansallinen RDA-termi
source: Nationell RDA-term @sv
created: 2019-07-11
modified: 2025-11-04
in scheme: Metatietosanasto
preferred label: keyboardist @sv

valssaaja
type: Concept
source: Kansallinen RDA-termi
source: Nationell RDA-term @sv
created: 2019-07-11
modified: 2025-11-04
definition: Valssaimen hoitaja (Lähde: Kielitoimiston sanakirja).
definition: Skötare av valsmaskin. @sv
in scheme: Metatietosanasto
preferred label: valsare @sv

Blu-ray-äänilevy
type: Concept
source: Kansallinen RDA-termi
source: Nationell RDA-term @sv
created: 2016-01-08
modified: 2025-10-31
in scheme: Metatietosanasto
preferred label: Blu-ray-ljudskiva @sv

myymälänhoitaja
type: Concept
source: Kansallinen RDA-termi
source: Nationell RDA-term @sv
created: 2019-07-11
modified: 2025-11-04
alternative label: affärsföreståndare @sv
in scheme: Metatietosanasto
preferred label: butiksföreståndare @sv

tilanhoitaja
type: Concept
source: Kansallinen RDA-termi
source: Nationell RDA-term @sv
created: 2019-07-11
modified: 2025-11-04
alternative label: förvaltare @sv
alternative label: godsförvaltare @sv
in scheme: Metatietosanasto
preferred label: gårdsförvaltare @sv

arkistoapulainen
type: Concept
source: Kansallinen RDA-termi
source: Nationell RDA-term @sv
created: 2019-07-11
modified: 2025-11-04
alternative label: arkivassistent @sv
in scheme: Metatietosanasto
preferred label: arkivbiträde @sv

äänilevy
type: Concept
source: RDA-termi
source: RDA-term @sv
created: 2016-01-08
modified: 2025-10-31
definition: Levy, jolle on kaiverrettu tai uurrettu modulaatioiksi tai pulsseiksi tallennettuja äänisignaaleja yhtenäiseksi spiraalimaiseksi uraksi.
definition: Skiva på vilken ljudsignaler, upptagna som modulationer och pulser e.d., har ristats eller skurits in så att de bildar ett enhetligt spiralformat spår. @sv
in scheme: Metatietosanasto
preferred label: audio disc @en
preferred label: ljudskiva @sv
scope note: Äänitallenne.
scope note: Ljudbärare. @sv

ylitarkastaja
type: Concept
source: Kansallinen RDA-termi
source: Nationell RDA-term @sv
created: 2019-07-12
modified: 2025-11-04
alternative label: överkontrollör @sv
in scheme: Metatietosanasto
preferred label: överinspektör @sv

liikenteenohjaaja
type: Concept
source: Kansallinen RDA-termi
source: Nationell RDA-term @sv
created: 2019-07-12
modified: 2025-11-04
alternative label: junanlähettäjä
alternative label: junasuorittaja
alternative label: trafikdirigerare @sv
alternative label: tågklarerare @sv
definition: Liikenteenohjaaja vastaa rautatieliikenteen ohjaamisesta ja turvaamisesta. Ennen käytettiin ammattitermejä junanlähettäjä ja junasuorittaja.
definition: En trafikledare ansvarar för dirigering och tryggande av järnvägstrafik. Tidigare användes facktermen tågklarerare. @sv
in scheme: Metatietosanasto
preferred label: trafikledare @sv

kylmäkkö
type: Concept
source: Kansallinen RDA-termi
source: Nationell RDA-term @sv
created: 2019-07-12
modified: 2025-11-04
definition: Kylmien ruokien valmistaja ravintolassa tms. (Lähde: Kielitoimiston sanakirja).
definition: Tillverkare av kalla rätter i restaurang e.d. @sv
in scheme: Metatietosanasto
preferred label: kallskänka @sv

konttoristi
type: Concept
source: Kansallinen RDA-termi
source: Nationell RDA-term @sv
created: 2019-07-12
modified: 2025-11-04
in scheme: Metatietosanasto
preferred label: kontorist @sv

polttomenetelmä
type: Concept
source: RDA-termi
source: RDA-term @sv
created: 2016-01-08
modified: 2023-05-17
alternative label: bränning @sv
definition: Valmistusmenetelmä, jossa lämmön avulla tuotetaan jälkiä materiaalin pintaan.
definition: Produktionsmetod, i vilken ett avtryck framställs i ett materials yta med hjälp av värme. @sv
in scheme: Metatietosanasto
preferred label: burning @en
preferred label: brännmetod @sv

koulutarkastaja
type: Concept
source: Kansallinen RDA-termi
source: Nationell RDA-term @sv
created: 2019-07-12
modified: 2025-11-04
alternative label: skolinspektor @sv
in scheme: Metatietosanasto
preferred label: skolinspektör @sv

kenraalibasso
type: Concept
source: RDA-termi
source: RDA-term @sv
created: 2019-09-18
modified: 2025-07-01
definition: Nuottikirjoituksen tyyppi, jossa käytetään pystysuuntaisesti järjestettyjä numeroita ja symboleja, jotka ilmaisevat harmoniat bassolinjan yläpuolisina intervalleina.
definition: Typ av notskrift, med siffror och symboler ordnade vertikalt, som uttrycker harmonier som intervall över en baslinje. @sv
in scheme: Metatietosanasto
preferred label: figured bas @en
preferred label: generalbas @sv

posliini
type: Concept
source: RDA-termi
source: RDA-term @sv
created: 2016-01-08
modified: 2024-03-13
definition: Tulenkestävästä valkoisesta savesta (kaoliinista) ja maasälvästä polttamalla valmistettu keraaminen materiaali.
definition: Keramiskt material som tillverkats genom bränning av eldfast vit lera (kaolin) och fältspat. @sv
in scheme: Metatietosanasto
preferred label: porcelain @en
preferred label: porslin @sv

Jarl Hellemann -palkinto
type: Concept
source: Kansallinen RDA-termi
source: Nationell RDA-term @sv
created: 2020-01-09
modified: 2024-07-02
alternative label: Jarl Hellemann -käännöskirjapalkinto
alternative label: Jarl Hellemanns översättningspris @sv
definition: Jarl Hellemann -käännöskirjapalkinto on Tammen perustama kirjallisuuspalkinto, joka jaetaan vuosittain korkeatasoisen kaunokirjallisen teoksen laadukkaasta suomennoksesta. Palkinto on nimetty Tammen aiemman toimitusjohtajan ja Keltaisen kirjaston perustajan Jarl Hellemannin mukaan. Palkinto jaettiin ensimmäisen kerran 2015.
definition: Litteraturpris som grundats av förlaget Tammi och som utdelas årligen till en kvalitativ finskspråkig översättning av ett högklassigt skönlitterärt verk. Priset är namngivet efter den tidigare direktören och grundaren av Keltainen kirjasto - Jarl Hellemann. Priset utdelades första gången 2015. @sv
example: MARC 21 -formaatissa: 586 ## ‡a Jarl Hellemann -palkinto, 2015
example: I MARC 21-formatet: 586 ## ‡a Jarl Hellemann-priset, 2015 @sv
in scheme: Metatietosanasto
preferred label: Jarl Hellemann-priset @sv

Vuoden luontokirja
type: Concept
source: Kansallinen RDA-termi
source: Nationell RDA-term @sv
created: 2020-01-11
modified: 2023-05-17
alternative label: Vuoden luontokirja -palkinto
alternative label: Årets naturbok-priset @sv
definition: WWF Suomen vuosittain valitsema teos, joka sopii suurelle yleisölle, edistää luonnonsuojelun viestiä ja on korkealaatuinen. Palkinto myönnettiin ensimmäisen kerran 1978.
definition: Verk utvalt årligen av WWF Finland som passar för en bred publik och främjar budskapet om naturskydd, samt är högklassigt. Priset utdelades första gången 1978. @sv
example: MARC 21 -formaatissa: 586 ## ‡a Vuoden luontokirja, 2020
example: I MARC 21-formatet: 586 ## ‡a Årets naturbok, 2020 @sv
in scheme: Metatietosanasto
preferred label: Årets naturbok @sv

Tähtivaeltaja-palkinto
type: Concept
source: Kansallinen RDA-termi
source: Nationell RDA-term @sv
created: 2020-01-11
modified: 2023-05-17
definition: Helsingin Science Fiction -seuran jakama palkinto vuoden parhaasta suomeksi ilmestyneestä tieteiskirjasta. Jaettu vuodesta 1986 alkaen.
definition: Pris utdelat av Helsingfors science fiction-förening för årets bästa science fiction-bok som utkommit på finska. Priset har utdelats sedan år 1986. @sv
example: MARC 21 -formaatissa: 586 ## ‡a Tähtivaeltaja-palkinto, 2020
example: I MARC 21-formatet: 586 ## ‡a Tähtivaeltaja-priset, 2020 @sv
in scheme: Metatietosanasto
preferred label: Tähtivaeltaja-priset @sv

musiikkialbumi
type: Concept
source: Kansallinen RDA-termi
source: Nationell RDA-term @sv
created: 2020-01-24
modified: 2024-11-14
alternative label: albumi (musiikki)
alternative label: album (musik) @sv
definition: Useita sävellyksiä sisältävä tai kestoltaan pitkä (vähintään n. 30 min) äänitejulkaisu.
definition: Utgiven ljudupptagning som innehåller flera kompositioner eller vars speltid är lång (minst ca 30 min.) @sv
in scheme: Metatietosanasto
preferred label: musikalbum @sv
scope note: Teoksen muoto -termejä käytetään erottamaan toisistaan samannimiset teokset.
scope note: Verkets form-termer används för att åtskilja verk med samma namn. @sv

ooppera
type: Concept
source: Kansallinen RDA-termi
source: Nationell RDA-term @sv
created: 2020-01-24
modified: 2024-11-14
alternative label: ooppera (teoksen muoto)
alternative label: opera (verkets form) @sv
in scheme: Metatietosanasto
preferred label: opera @sv
scope note: Teoksen muoto -terminä käytetään erottamaan toisistaan samannimiset teokset.
scope note: Verkets form-termer används för att åtskilja verk med samma namn. @sv

virsi
type: Concept
source: Kansallinen RDA-termi
source: Nationell RDA-term @sv
created: 2020-01-24
modified: 2024-11-14
definition: Kristillisten kirkkojen jumalanpalveluksissa ja muissa tilaisuuksissa laulettava yhteislaulu.
definition: Gemensamt sjungen sång vid kristna kyrkors gudstjänster och andra tillfällen. @sv
in scheme: Metatietosanasto
preferred label: psalm @sv
scope note: Teoksen muoto -termejä käytetään erottamaan toisistaan samannimiset teokset.
scope note: Verkets form-termer används för att åtskilja verk med samma namn. @sv

musikaali
type: Concept
source: Kansallinen RDA-termi
source: Nationell RDA-term @sv
created: 2020-01-24
modified: 2024-11-14
in scheme: Metatietosanasto
preferred label: musikal @sv
scope note: Teoksen muoto -termejä käytetään erottamaan toisistaan samannimiset teokset.
scope note: Verkets form-termer används för att åtskilja verk med samma namn. @sv

opettaja
type: Concept
source: Kansallinen RDA-termi
source: Nationell RDA-term @sv
created: 2020-02-14
modified: 2024-06-04
alternative label: opettaja (oppiarvo)
alternative label: lärare (lärdomsgrad) @sv
in scheme: Metatietosanasto
preferred label: lärare @sv

patriarkka
type: Concept
source: Kansallinen RDA-termi
source: Nationell RDA-term @sv
created: 2016-01-08
modified: 2024-05-24
definition: Eräiden johtavien ortodoksisten piispojen nimitys tai eräiden katolisen kirkon arkkipiispojen kunnianimi.
definition: Hederstitel för vissa ledande ortodoxa biskopar eller katolska ärkebiskopar. @sv
in scheme: Metatietosanasto
preferred label: patriark @sv

Valmistusmenetelmä
type: ConceptGroup
type: Collection
source: RDA-termi
source: RDA-term @sv
created: 2016-01-08
modified: 2023-05-05
alternative label: Framställningsmetod @sv
alternative label: Tillverkningsmetod @sv
definition: Liittää manifestaation manifestaation tuottamiseksi käytettyyn menetelmään.
definition: Sammankopplar manifestation med en metod som använts för att framställa manifestationen. @sv
member: tuloste
member: valokemigrafia
member: kohopaino
member: valopaino
member: white print -menetelmä
member: litografia
member: kaiverrus
member: syväpainomenetelmä
member: koneella kirjoitettu
member: valokopio
member: käsikirjoitus
member: omakätinen käsikirjoitus
member: valokaiverrusmenetelmä
member: dagerrotypia-menetelmä
member: puuleikkaus
member: polttomenetelmä
member: inscribing
member: lämpömuovaus
member: leimaus
member: kollotypia
member: painaminen
member: blueline-menetelmä
member: solid dot -painatus
member: sinikopiomenetelmä
member: kuohupaperi
member: etsaus
preferred label: Production method @en
preferred label: Produktionsmetod @sv

sukupuoli
type: ConceptGroup
type: Collection
source: RDA-termi
source: RDA-term @sv
created: 2020-04-17
modified: 2025-03-28
definition: A gender with which a person identifies. @en
definition: Sukupuoli, jota henkilö kokee edustavansa.
definition: Personers könsidentitet. @sv
member: nainen
member: ei tiedossa
member: mies
preferred label: gender @en
preferred label: kön @sv
scope note: Käytetään määrittämään ryhmän jäsenten sukupuolta kuvaavia termejä (esim. miehet, naiset, transihmiset). Yksittäisten termien valinnassa käytetään YSO-termejä ryhmästä sukupuoleen liittyvä rooli.
scope note: Används för att bestämma termer som beskriver kön hos medlemmar av en grupp (t.ex. män, kvinnor, transpersoner). Vid val av enskilda termer används ALLFO-termer ur gruppen roll relaterad till kön. @sv

Mikrofilmin ja mikrokortin emulsio
type: ConceptGroup
type: Collection
source: RDA-termi
source: RDA-term @sv
created: 2016-01-08
modified: 2024-04-13
alternative label: Mikrofilm- och mikrokortemulsion @sv
definition: Mikrofilmin tai mikrokortin valoherkkiä kemikaaleja sisältävä pinnoite.
definition: Ytbeläggning som innehåller ljuskänsliga kemikalier på mikrofilm eller mikrofiche. @sv
preferred label: Emulsion on microfilm and microfiche @en
preferred label: Emulsion på mikrofilm och mikrofiche @sv
scope note: Kuvailussa käytetään käsiteryhmässä Materiaali olevia käsitteitä.
scope note: Vid beskrivning används begrepp ur begreppsgruppen Material. @sv

diatso
type: Concept
source: RDA-termi
source: RDA-term @sv
created: 2016-01-08
modified: 2024-03-13
definition: Emulsio, joka koostuu yhdestä tai useammasta valoherkästä diazonium-suolakerroksesta polyesteri- tai asetaattipohjalla ja josta saadaan dye-coupling-menetelmällä atsovärikuva. Materiaali, jota tavallisesti käytetään mikrofilmin tai mikrokortin pohjamateriaalina.
definition: Emulsion som består av en eller flera lager av ljuskänsligt diazoniumsalt på polyester- eller acetatbotten och från vilket man får azofärgbild med dye-coupling-metoden. Material som vanligtvis används som bottenmaterial för mikrofilm eller mikrofiche. @sv
in scheme: Metatietosanasto
preferred label: diazo emulsion @en
preferred label: diazo @sv

nainen
type: Concept
source: Kansallinen RDA-termi
source: Nationell RDA-term @sv
created: 2020-04-17
modified: 2024-03-19
definition: Sukupuolen nimitys naiselle tai tytölle.
definition: Benämning på kön för kvinna eller flicka. @sv
in scheme: Metatietosanasto
preferred label: female @en
preferred label: kvinna @sv

Access
type: Concept
source: Kansallinen RDA-termi
source: Nationell RDA-term @sv
created: 2016-01-08
modified: 2024-05-24
in scheme: Metatietosanasto

ei tiedossa
type: Concept
source: Kansallinen RDA-termi
source: Nationell RDA-term @sv
created: 2020-05-03
modified: 2024-03-19
alternative label: sukupuoli ei tiedossa
alternative label: kön okänt @sv
definition: Sukupuolen merkintä kun tarkempi tieto sukupuolesta puuttuu.
definition: Angivelse av kön när uppgift om detta saknas. @sv
in scheme: Metatietosanasto
preferred label: not known @en
preferred label: okänt @sv

mies
type: Concept
source: Kansallinen RDA-termi
source: Nationell RDA-term @sv
created: 2020-04-17
modified: 2024-03-19
definition: Sukupuolen nimitys miehelle tai pojalle.
definition: Benämning på kön för man eller pojke. @sv
in scheme: Metatietosanasto
preferred label: male @en
preferred label: man @sv

Betamax
type: Concept
source: RDA-termi
source: RDA-term @sv
created: 2016-01-08
modified: 2023-05-17
alternative label: Beta @sv
definition: Analogisen nauhan videoformaatti, jonka Sony kehitti kuluttajakäyttöön vuonna 1975.
definition: Videoformat för analogt band, som Sony utvecklade för konsumentbruk år 1975. @sv
in scheme: Metatietosanasto

mikrofilmisilmukkakasetti
type: Concept
source: RDA-termi
source: RDA-term @sv
created: 2016-01-08
modified: 2023-05-17
definition: Kasetti, joka sisältää silmukkamaisen mikrofilminauhan.
definition: Kassett som innehåller mikrofilmsband. @sv
in scheme: Metatietosanasto
preferred label: microfilm cartridge @en
preferred label: mikrofilmsmagasin @sv
scope note: Mikromuotoinen tallenne.
scope note: Mikroformsbärare. @sv

Kappaleen suhteet kappaleeseen
type: ConceptGroup
type: Collection
created: 2020-04-17
modified: 2026-02-18
member: vastaava kappale
member: yhteensidottu
member: mikrofilmillä myös
member: levyllä myös
member: saman kokoelman kappale
member: sisältää kappaleen
member: sisältyy kappaleeseen
member: kappaleeseen liittyvä kappale
member: aineistossa toisen kappaleen kanssa
preferred label: Exemplars relationer till exemplar @sv

mikroura
type: Concept
source: RDA-termi
source: RDA-term @sv
created: 2016-01-08
modified: 2025-09-10
definition: Uran ominaisuus analogiselle levylle, jonka uranleveys on tyypillisesti 120–160 uraa/cm tai enemmän (300 tai 400 uraa/tuuma tai enemmän), tavallisesti puristettuna vinyyliin, käytössä vuoden 1945 jälkeen.
definition: Spåregenskap för analog skiva, vars spårbredd typiskt är 120-160 spår/cm eller mer (300 eller 400 spår/tum eller mer). Vanligen pressad i vinyl och i användning efter år 1945. @sv
in scheme: Metatietosanasto
preferred label: microgroove @en
preferred label: mikrospår @sv

vuosittain
type: Concept
source: RDA-termi
source: RDA-term @sv
created: 2016-01-08
modified: 2023-05-17
alternative label: kerran vuodessa
alternative label: en gång i året @sv
alternative label: årligen @sv
definition: Ilmestymis- tai päivittymistiheys aineistolle, joka ilmestyy tai päivittyy kerran vuodessa.
definition: Utgivnings- eller uppdateringsfrekvens för material som utkommer eller uppdateras en gång i året. @sv
in scheme: Metatietosanasto
preferred label: annual @en
preferred label: en gång per år @sv

kartasto
type: Concept
source: RDA-termi
source: RDA-term @sv
created: 2016-01-08
modified: 2023-05-17
preferred label: atlas
alternative label: karttakirja
alternative label: kartbok @sv
definition: Laajuuden yksikkö, karttakirja tai muu karttakokonaisuus, selittävän tekstin kanssa tai ilman.
definition: Enhet, kartbok eller annan karthelhet, med eller utan förklarande text. @sv
in scheme: Metatietosanasto
preferred label: kartverk @sv

18:o
type: Concept
source: RDA-termi
source: RDA-term @sv
created: 2020-04-19
modified: 2025-05-13
definition: Bibliografinen koko muodostuu yhdestä tai useammasta lehdestä, jotka ovat kooltaan 1/18 arkista.
definition: Bokens format består av ett eller flera blad som till sin storlek är 1/18 av ett tryckark. @sv
in scheme: Metatietosanasto
preferred label: 18mo @en

128:o
type: Concept
source: RDA-termi
source: RDA-term @sv
created: 2020-04-19
modified: 2025-05-13
definition: Bibliografinen koko muodostuu yhdestä tai useammasta lehdestä, jotka ovat kooltaan 1/128 arkista.
definition: Bokens format består av ett eller flera blad som till sin storlek är 1/128 av ett tryckark. @sv
in scheme: Metatietosanasto
preferred label: 128mo @en

96:o
type: Concept
source: RDA-termi
source: RDA-term @sv
created: 2020-04-19
modified: 2025-05-13
definition: Bibliografinen koko muodostuu yhdestä tai useammasta lehdestä, jotka ovat kooltaan 1/96 arkista.
definition: Bokens format består av ett eller flera blad som till sin storlek är 1/96 av ett tryckark. @sv
in scheme: Metatietosanasto
preferred label: 96mo @en

36:o
type: Concept
source: RDA-termi
source: RDA-term @sv
created: 2020-04-19
modified: 2025-05-13
definition: Bibliografinen koko muodostuu yhdestä tai useammasta lehdestä, jotka ovat kooltaan 1/36 arkista.
definition: Bokens format består av ett eller flera blad som till sin storlek är 1/36 av ett tryckark. @sv
in scheme: Metatietosanasto
preferred label: 36mo @en

kokoarkki
type: Concept
source: RDA-termi
source: RDA-term @sv
created: 2020-04-19
modified: 2025-05-13
definition: Bibliografinen koko muodostuu yhdestä tai useammasta lehdestä, joita ei ole leikattu tai taitettu.
definition: Bokens format utgörs av ett eller flera blad som inte är skurna eller vikta. @sv
in scheme: Metatietosanasto
preferred label: full-sheet @en
preferred label: helark @sv

72:o
type: Concept
source: RDA-termi
source: RDA-term @sv
created: 2020-04-19
modified: 2025-05-13
definition: Bibliografinen koko muodostuu yhdestä tai useammasta lehdestä, jotka ovat kooltaan 1/72 arkista.
definition: Bokens format består av ett eller flera blad som till sin storlek är 1/72 av ett tryckark. @sv
in scheme: Metatietosanasto
preferred label: 72mo @en

taitettu arkki
type: Concept
source: RDA-termi
source: RDA-term @sv
created: 2020-04-20
modified: 2024-04-12
definition: Laajuuden yksikkö on arkki, jota on tarkoitus lukea sivuiksi taiteltuna.
definition: Enhet som är ett ark, avsett att läsas vikt till sidor. @sv
in scheme: Metatietosanasto
preferred label: vikt ark @sv
scope note: Monikossa: taitettua lehteä.
scope note: I plural: xx vikta ark. @sv

rasteri
type: Concept
source: RDA-termi
source: RDA-term @sv
created: 2020-04-20
modified: 2024-01-04
definition: Kartografinen tietotyyppi, joka käyttää pistematriisin tietorakennetta esittämään tavallisesti suorakulmaisessa pikseleiden verkossa esiintyviä geospatiaalisia ominaisuuksia.
definition: Kartografisk datatyp som använder punktmatrisformat för att representera geospatiala egenskaper, vanligen i ett fyrkantigt rutnät av pixlar. @sv
in scheme: Metatietosanasto
preferred label: raster @en

vektori
type: Concept
source: RDA-termi
source: RDA-term @sv
created: 2020-04-20
modified: 2023-12-08
definition: Kartografinen tietotyyppi, joka käyttää vektoreiden määrittämiä polygoneja esittämään geospatiaalisia ominaisuuksia.
definition: Kartografisk datatyp, som använder polygoner bestämda av vektorer för att visa geospatiala egenskaper. @sv
in scheme: Metatietosanasto
preferred label: vector @en
preferred label: vektor @sv

suunnitelma
type: Concept
source: RDA-termi
source: RDA-term @sv
created: 2020-04-22
modified: 2023-05-17
definition: Kuvasisältö, joka koostuu yksityiskohtaisesta piirroksesta tai kaaviosta.
definition: Illustrativt innehåll som består av en detaljerad ritning eller ett schema. @sv
in scheme: Metatietosanasto
preferred label: plan @en
scope note: Monikossa: suunnitelmia, xx suunnitelmaa
scope note: I plural: planer, xx planer @sv

kartografinen data
type: Concept
source: RDA-termi
source: RDA-term @sv
created: 2020-04-23
modified: 2023-05-05
definition: Digitaalisesti koodattuna datana esitetty kartografinen sisältö, joka on tarkoitettu tietokoneen käsiteltäväksi.
definition: Kartografiskt innehåll presenterad som digitalt kodad data, vilken är avsedd att behandlas av dator. @sv
in scheme: Metatietosanasto
preferred label: cartographic dataset @en
preferred label: kartografisk data @sv

otos
type: Concept
source: RDA-termi
source: RDA-term @sv
created: 2020-04-23
modified: 2023-05-17
definition: Kuvasisältö, joka koostuu suuremman kokonaisuuden yksittäisestä osasta tai pienestä määrästä, otos havainnollistaa kokonaisuuden laatua tai luonnetta.
definition: Illustrativt innehåll som består av en enskild del eller ett litet antal av en större helhet. Samplet åskådliggör helhetens kvalitet eller karaktär. @sv
in scheme: Metatietosanasto
preferred label: sample @en
preferred label: sampel @sv
scope note: Monikossa: otoksia, xx otosta
scope note: I plural: sampel, xx sampel @sv

kaksi kertaa kuukaudessa
type: Concept
source: RDA-termi
source: RDA-term @sv
created: 2020-04-25
modified: 2023-05-17
alternative label: två gånger i månaden @sv
definition: Ilmestymis- tai päivittymistiheys aineistolle, joka ilmestyy tai päivittyy kaksi kertaa kuukaudessa.
definition: Utgivnings- eller uppdateringsfrekvens för matieral som utkommer eller uppdateras två gånger i månaden. @sv
in scheme: Metatietosanasto
preferred label: semimonthly @en
preferred label: två gånger per månad @sv

kolme kertaa kuukaudessa
type: Concept
source: RDA-termi
source: RDA-term @sv
created: 2020-04-25
modified: 2023-05-17
alternative label: tre gånger i månaden @sv
definition: Ilmestymis- tai päivittymistiheys aineistolle, joka ilmestyy tai päivittyy kolme kertaa kuussa.
definition: Utgivnings- eller uppdateringsfrekvens för material som utkommer eller uppdateras tre gånger i månaden. @sv
in scheme: Metatietosanasto
preferred label: three times a month @en
preferred label: tre gånger per månad @sv

joka toinen viikko
type: Concept
source: RDA-termi
source: RDA-term @sv
created: 2020-04-25
modified: 2024-03-19
alternative label: kerran kahdessa viikossa
definition: Ilmestymis- tai päivittymistiheys aineistolle, joka ilmestyy tai päivittyy kerran kahdessa viikossa.
definition: Utgivnings- eller uppdateringsfrekvens för material som utkommer eller uppdateras varannan vecka. @sv
in scheme: Metatietosanasto
preferred label: biweekly @en
preferred label: varannan vecka @sv

kaksi kertaa viikossa
type: Concept
source: RDA-termi
source: RDA-term @sv
created: 2020-04-25
modified: 2023-05-17
alternative label: två gånger i veckan @sv
definition: Ilmestymis- tai päivittymistiheys aineistolle, joka ilmestyy tai päivittyy kaksi kertaa viikossa.
definition: Utgivnings- eller uppdateringsfrekvens för material som utkommer eller uppdateras två gånger i veckan. @sv
in scheme: Metatietosanasto
preferred label: semiweekly @en
preferred label: två gånger per vecka @sv

päivittäin
type: Concept
source: RDA-termi
source: RDA-term @sv
created: 2020-04-25
modified: 2023-05-17
alternative label: en gång per dag @sv
definition: Ilmestymis- tai päivittymistiheys aineistolle, joka ilmestyy tai päivittyy kerran päivässä, yleensä arkipäivisin.
definition: Utgivnings- eller uppdateringsfrekvens för material som utkommer eller uppdateras en gång per dag, vanligen vardagar. @sv
in scheme: Metatietosanasto
preferred label: daily @en
preferred label: dagligen @sv

kerran kahdessa kuukaudessa
type: Concept
source: RDA-termi
source: RDA-term @sv
created: 2020-04-25
modified: 2023-05-17
definition: Ilmestymis- tai päivittymistiheys aineistolle, joka ilmestyy tai päivittyy kerran kahdessa kuukaudessa.
definition: Utgivnings- eller uppdateringsfrekvens för material som utkommer eller uppdateras varannan månad. @sv
in scheme: Metatietosanasto
preferred label: bimonthly @en
preferred label: varannan månad @sv

neljä kertaa vuodessa
type: Concept
source: RDA-termi
source: RDA-term @sv
created: 2020-04-25
modified: 2023-05-17
alternative label: neljännesvuosittain
alternative label: fyra gånger i året @sv
definition: Ilmestymis- tai päivittymistiheys aineistolle, joka ilmestyy tai päivittyy neljä kertaa vuodessa.
definition: Utgivnings- eller uppdateringsfrekvens för material som utkommer eller uppdateras fyra gånger per år. @sv
in scheme: Metatietosanasto
preferred label: quarterly @en
preferred label: fyra gånger per år @sv

kerran kolmessa vuodessa
type: Concept
source: RDA-termi
source: RDA-term @sv
created: 2020-04-26
modified: 2023-05-17
definition: Ilmestymis- tai päivittymistiheys aineistolle, joka ilmestyy tai päivittyy kerran kolmessa vuodessa.
definition: Utgivnings- eller uppdateringsfrekvens för material som utkommer eller uppdateras vart tredje år. @sv
in scheme: Metatietosanasto
preferred label: triennial @en
preferred label: vart tredje år @sv

alkuperäinen negatiivi
type: Concept
source: RDA-termi
source: RDA-term @sv
created: 2020-04-26
modified: 2023-05-17
definition: Negatiivisen polariteetin filmi, joka on valotettu kamerassa ja joka siksi yleensä on parempilaatuinen kuin seuraava sukupolvi tai johdannainen.
definition: Film med negativ polaritet som har exponerats i kameran, och som därför vanligen är av bättre kvalitet än nästa generation eller härledning. @sv
in scheme: Metatietosanasto
preferred label: original negative @en
preferred label: originalnegativ @sv

kaksi kertaa vuodessa
type: Concept
source: RDA-termi
source: RDA-term @sv
created: 2020-04-26
modified: 2023-05-17
definition: Ilmestymis- tai päivittymistiheys aineistolle, joka ilmestyy tai päivittyy kaksi kertaa vuodessa.
definition: Utgivnings- eller uppdateringsfrekvens för material som utkommer eller uppdateras två gånger i året. @sv
in scheme: Metatietosanasto
preferred label: semiannual @en
preferred label: två gånger per år @sv

koevedos
type: Concept
source: RDA-termi
source: RDA-term @sv
created: 2020-04-26
modified: 2023-05-17
alternative label: vertailukopio
definition: Sukupolven määrite, joka on elokuvan tuottajan ja ohjaajan hyväksymä koevedos.
definition: Bestämning av generation, som är en referenskopia godkänd av filmproducent och -regissör. @sv
in scheme: Metatietosanasto
preferred label: reference print @en
preferred label: referenskopia @sv

master-positiivi
type: Concept
source: RDA-termi
source: RDA-term @sv
created: 2020-04-26
modified: 2023-05-17
definition: Sukupolven määrite, joka on aikaisemman sukupolven negatiivifilmistä valmistettu positiivivedos, ja jota käytetään negatiivikopioiden valmistamiseksi kuvien sijaan.
definition: Bestämning av generation, som är en positivkopia tillverkad av en tidigare generations negativfilm, och som används för att tillverka negativkopior i stället för bilder. @sv
in scheme: Metatietosanasto
preferred label: master positive @en
preferred label: master positiv @sv

duplikaatti
type: Concept
source: RDA-termi
source: RDA-term @sv
created: 2020-04-26
modified: 2023-05-17
definition: Sukupolven määrite, joka on alkuperäisen kuvan tai ääniraidan jäljitelmä, tavallisesti negatiivisella polariteetilla, jossa negatiivinen duplikaatti on valmistettu master-positiivista, joka vuorostaan on valmistettu aiemmasta negatiivista.
definition: Bestämning av generation, som är en efterbildning av en originalbild eller ett originalljudspår, vanligen med negativ polaritet, i vilken ett negativt duplikat har tillverkats från ett masterpositiv, som i sin tur är tillverkad från ett tidigare negativ. @sv
in scheme: Metatietosanasto
preferred label: duplicate @en
preferred label: duplikat @sv

kerran kahdessa vuodessa
type: Concept
source: RDA-termi
source: RDA-term @sv
created: 2020-04-26
modified: 2023-05-17
definition: Ilmestymis- tai päivittymistiheys aineistolle, joka ilmestyy tai päivittyy kerran kahdessa vuodessa.
definition: Utgivnings- eller uppdateringsfrekvens för material som utkommer eller uppdateras vartannat år. @sv
in scheme: Metatietosanasto
preferred label: biennial @en
preferred label: vartannat år @sv

alumiini
type: Concept
source: RDA-termi
source: RDA-term @sv
created: 2020-04-27
modified: 2023-05-17
definition: Ei-magneettinen metallinen alkuaine, joka on taipuisa ja muokattava, väriltään harmaan tai hopean sävyinen.
definition: Icke-magnetiskt metalliskt grundämne som är böjligt och formbart, till sin färg grått eller silverskiftande. @sv
in scheme: Metatietosanasto
preferred label: aluminium @en

kumi
type: Concept
source: RDA-termi
source: RDA-term @sv
created: 2020-04-28
modified: 2023-05-17
definition: Materiaali, joka koostuu synteettisistä tai orgaanisista polymeereistä ja jolla on suuri joustavuus ja kimmoisuus.
definition: Material som består av syntetiska eller organiska polymerer och har stor elasticitet och spänst. @sv
in scheme: Metatietosanasto
preferred label: rubber @en
preferred label: gummi @sv

Teoksen varianttinimeke
type: ConceptGroup
type: Collection
source: RDA-termi
source: RDA-term @sv
created: 2016-01-08
modified: 2025-10-21
definition: Teoksen nimeke, jota ei ole valittu ensisijaiseksi tietyssä sovelluksessa tai kontekstissa.
definition: Titel för verk, som inte har valts till primär i en viss tillämpning eller kontext. @sv
preferred label: Variant title for work @en
preferred label: Varianttitel för verket @sv

sarja-aineisto
type: Concept
source: RDA-termi
source: RDA-term @sv
created: 2020-04-28
modified: 2023-05-05
definition: Julkaisutapa, jossa manifestaatio ilmestyy toisiaan seuraavina ja yleensä numeroituina osina ja jonka ilmestyminen on periaatteessa päättymätöntä.
definition: Utgivningssätt, i vilket en manifestation utkommer i delar som följer på varandra och som vanligen är numrerade, samt utkommer i princip oändligen. @sv
in scheme: Metatietosanasto
preferred label: serial @en
preferred label: seriell resurs @sv

yhtenä yksikkönä ilmestyvä aineisto
type: Concept
source: RDA-termi
source: RDA-term @sv
created: 2020-04-28
modified: 2024-04-13
alternative label: en enhet @sv
definition: Julkaisutapa, jossa manifestaatio ilmestyy yhtenä fyysisenä yksikkönä tai yhtenä loogisena aineettomana kokonaisuutena.
definition: Utgivningssätt, i vilket en manifestation utkommer som en fysisk enhet eller som en logisk immateriell helhet. @sv
in scheme: Metatietosanasto
preferred label: single unit @en
preferred label: resurs utkommen som en enhet @sv

Julkaisutapa
type: ConceptGroup
type: Collection
source: RDA-termi
source: RDA-term @sv
created: 2020-04-28
modified: 2024-03-13
member: sarja-aineisto
member: yhtenä yksikkönä ilmestyvä aineisto
member: moniosainen monografia
member: päivittyvä aineisto
member: useampana yksikkönä ilmestyvä aineisto
preferred label: Mode of issuance @en
preferred label: Utgivningssätt @sv

moniosainen monografia
type: Concept
source: RDA-termi
source: RDA-term @sv
created: 2020-04-28
modified: 2023-05-05
definition: Julkaisutapa, jossa manifestaatio ilmestyy kahtena tai useampana joko samanaikaisesti tai peräkkäin ilmestyvänä osana ja jonka ilmestyminen on päättynyt tai on tarkoitettu päättymään rajalliseen määrään osia.
definition: Utgivningssätt som innebär att en manifestation utkommer i två eller flera delar, antingen samtidigt eller efter varandra, och på så vis att utgivningen är avslutad eller avsedd att upphöra efter ett begränsat antal delar. @sv
in scheme: Metatietosanasto
preferred label: multipart monography @en
preferred label: monografi i flera delar @sv

päivittyvä aineisto
type: Concept
source: RDA-termi
source: RDA-term @sv
created: 2020-04-28
modified: 2023-05-05
definition: Julkaisutapa, jossa manifestaatiota kartutetaan ja muokataan päivityksillä, jotka eivät jää erillisiksi vaan integroituvat kokonaisuuteen.
definition: Utgivningssätt, i vilket en manifestation berikas och redigeras med uppdateringar som inte lämnas skilda utan integreras i helheten. @sv
in scheme: Metatietosanasto
preferred label: integrating resource @en
preferred label: integrerande resurs @sv

inscribing
type: Concept
source: RDA-termi
source: RDA-term @sv
created: 2020-04-29
modified: 2023-05-17
definition: Valmistusmenetelmä, jossa tehdään merkkejä ja symboleja pohjamateriaaliin sen pintaa leikkaamalla.
definition: Produktionsmetod, i vilken tecken och symboler i ett bottenmaterial görs genom att skära i dess yta. @sv
in scheme: Metatietosanasto

lämpömuovaus
type: Concept
source: RDA-termi
source: RDA-term @sv
created: 2020-04-29
modified: 2023-05-17
definition: Valmistusmenetelmä tuntoaistiin perustuville aineistoille, joissa kuva on painettu erikoispaperille. Paperissa on alkoholia sisältäviä mikrokapseleita, jotka reagoivat lämpöön laajenemalla.
definition: Produktionsmetod för material som grundar sig på känselsinnet och i vilka en bild är tryckt på specialpapper. I pappret finns mikrokapslar som innehåller alkohol och som reagerar på värme genom att utvidga sig. @sv
in scheme: Metatietosanasto
preferred label: thermoform @en
preferred label: termoform @sv

leimaus
type: Concept
source: RDA-termi
source: RDA-term @sv
created: 2020-04-29
modified: 2023-05-17
definition: Valmistusmenetelmä, jossa paineen avulla painetaan jälki materiaalin pintaan
definition: Produktionsmetod, i vilken tryck påförs för att lämna ett avtryck i ett materials yta. @sv
in scheme: Metatietosanasto
preferred label: stamping @en
preferred label: stämpling @sv

kollotypia
type: Concept
source: RDA-termi
source: RDA-term @sv
created: 2020-04-29
modified: 2023-05-17
alternative label: kollotypi @sv
definition: Valmistusmenetelmä, jossa painatus perustuu dikromaattiluoksen kemialliseen reaktioon, joka kovettaa gelatiinin sen altistuessa ultraviolettivalolle ja tuottaa positiivisen alkuperäislaatan, jota käytetään myöhemmin litografiaprosessissa.
definition: Produktionsmetod, i vilken tryckningen grundar sig på en dikromatlösnings kemiska reaktion, som härdar gelatinet när det utsätts för ultaviolettljus och producerar en positiv originalplatta, som används senare i litografiprocessen. @sv
in scheme: Metatietosanasto
preferred label: collotype @en
preferred label: ljustryck @sv

painaminen
type: Concept
source: RDA-termi
source: RDA-term @sv
created: 2020-04-29
modified: 2023-05-17
definition: Valmistusmenetelmä, jossa kuva tai teksti siirretään tallenteelta toisen aineiston pinnalle, usein siirrettävällä materiaalilla katetun laatan, kiven tai kuvapinnan avulla. Sisältää valokuvavedosten sekä tallennetun tietokoneaineiston paperitulosteiden valmistamisen.
definition: Produktionsmetod, i vilken bild eller text överförs från en upptagning till ett annat materials yta, ofta med hjälp av överförbart material, platta, sten eller bildyta. Inkluderar tillverkningen av fotokopior och pappersutskrifter av lagrat datormaterial. @sv
in scheme: Metatietosanasto
preferred label: printing @en
preferred label: tryckning @sv

blueline-menetelmä
type: Concept
source: RDA-termi
source: RDA-term @sv
created: 2020-04-29
modified: 2023-05-17
definition: Valmistusmenetelmä, jossa painatus perustuu diatsoniumsuolan ja atsovärin kemialliseen reaktioon, joka muuttaa läpikuultamattomat sävyt tai värit siniseksi neutraalilla taustalla.
definition: Produktionsmetod, i vilken tryckning grundar sig på en kemisk reaktion mellan diazoniumsalt och azofärg, som ändrar opaka nyanser eller färger till blått på en neutral bakgrund. @sv
in scheme: Metatietosanasto
preferred label: blueline process @en
preferred label: blueline-metod @sv

alue 2
type: Concept
source: RDA-termi
source: RDA-term @sv
created: 2020-04-30
modified: 2023-05-17
definition: Aluekoodi DVD-levylle, joka on koodattu toistettavaksi Japanissa, Euroopassa, Etelä-Afrikassa sekä Lähi-idässä, mukaan lukien Egypti.
definition: Regionkod för dvd-skivor som är kodade för uppspelning i Japan, Europa, Sydafrika samt Mellanöstern, inklusive Egypten. @sv
in scheme: Metatietosanasto
preferred label: region 2 @en

mittakaava vaihtelee
type: Concept
source: RDA-termi
source: RDA-term @sv
created: 2020-04-30
modified: 2023-05-17
definition: Aineiston mittakaava vaihtelee, eikä arvojen laajuutta pystytä määrittelemään.
definition: Materialets skala varierar och omfånget på värdena kan inte fastställas. @sv
in scheme: Metatietosanasto
preferred label: scale varies @en
preferred label: varierande skala @sv

alue U/C
type: Concept
source: RDA-termi
source: RDA-term @sv
created: 2020-04-30
modified: 2023-05-17
definition: Aluekoodi videopelitallenteelle, joka on koodattu toistettavaksi Yhdysvalloissa, Kanadassa, Meksikossa ja Etelä-Amerikassa.
definition: Regionkod för videospel som är kodade för uppspelning i Förenta staterna, Kanada, Mexiko och Sydamerika. @sv
in scheme: Metatietosanasto
preferred label: region U/C @en

eri mittakaavoja
type: Concept
source: RDA-termi
source: RDA-term @sv
created: 2020-04-30
modified: 2023-05-17
definition: Aineisto koostuu useammasta eri mittakaavassa olevasta kuvasta, kartasta jne.
definition: Material som består av bild, karta e.d. i flera olika skalor. @sv
in scheme: Metatietosanasto
preferred label: scales differ @en
preferred label: olika skalor @sv

alue J
type: Concept
source: RDA-termi
source: RDA-term @sv
created: 2020-04-30
modified: 2023-05-17
definition: Aluekoodi videopelitallenteelle, joka on koodattu toistettavaksi Japanissa, Etelä-Koreassa, Taiwanissa, Hong Kongissa, Macaolla ja Kaakkois-Aasiassa.
definition: Regionkod för videospel som är kodade för uppspelning i Japan, Sydkorea, Taiwan, Hong Kong, Macao och Sydöstasien. @sv
in scheme: Metatietosanasto
preferred label: region J @en

alue A
type: Concept
source: RDA-termi
source: RDA-term @sv
created: 2020-04-30
modified: 2023-05-17
definition: Aluekoodi Blu-ray -levylle, joka on koodattu toistettavaksi Pohjois-Amerikassa, Keski-Amerikassa, Etelä-Amerikassa, Japanissa, Pohjois-Koreassa, Etelä-Koreassa, Taiwanissa, Hong Kongissa sekä Kaakkois-Aasiassa.
definition: Regionkod för Blu-ray-skivor, som är kodade för uppspelning i Nordamerika, Centralamerika, Sydamerika, Japan, Nordkorea, Sydkorea, Taiwan, Hong Kong och Sydöstasien. @sv
in scheme: Metatietosanasto
preferred label: region A @en

alue C (Blu-ray)
type: Concept
source: RDA-termi
source: RDA-term @sv
created: 2020-04-30
modified: 2023-05-17
definition: Aluekoodi Blu-ray -levylle, joka on koodattu toistettavaksi Intiassa, Nepalissa, Manner-Kiinassa, Venäjällä, Keski-Aasiassa ja Etelä-Aasiassa.
definition: Regionkod för Blu-ray-skivor som är kodade för uppspelning i Indien, Nepal, Fastlandskina, Ryssland, Centralasien och Sydasien. @sv
in scheme: Metatietosanasto
preferred label: region C (Blu-ray) @en

alue C (videopeli)
type: Concept
source: RDA-termi
source: RDA-term @sv
created: 2020-04-30
modified: 2023-05-17
definition: Aluekoodi videopelille, joka on koodattu toistettavaksi Kiinassa.
definition: Regionkod för videospel som är kodade för uppspelning i Kina. @sv
in scheme: Metatietosanasto
preferred label: region C (video game) @en
preferred label: region C (videospel) @sv

alue 4
type: Concept
source: RDA-termi
source: RDA-term @sv
created: 2020-04-30
modified: 2023-05-17
definition: Aluekoodi DVD-levylle, joka on koodattu toistettavaksi Australiassa, Uudessa-Seelannissa, Tyynenmeren saarilla, Keski-Amerikassa, Etelä-Amerikassa ja Karibialla.
definition: Regionkod för dvd-skivor som är kodade för uppspelning i Australien, Nya Zeeland, Stillahavsöarna, Centralamerika, Sydamerika och Karibien. @sv
in scheme: Metatietosanasto
preferred label: region 4 @en

Kuvasisältö
type: ConceptGroup
type: Collection
source: RDA-termi
source: RDA-term @sv
created: 2016-01-08
modified: 2025-09-05
alternative label: Kuvitus (kuvasisältö)
alternative label: Illustration (illustrativt innehåll) @sv
definition: Liittää manifestaation ilmaukseen niistä kuvasisällön ekspressioista, jotka täydentävät laajennusaggregaatin sisältämiä pääekspressioita.
definition: Sammankopplar manifestation med en uppgift om uttryck för illustrativt innehåll, som kompletterar de huvuduttryck som ett utvidgat aggregat innehåller. @sv
member: kartta
member: kaavio
member: valokuva
member: muotokuva
member: faksimile
member: illuminointi
member: lomake
member: kuva
member: nuotti
member: suunnitelma
member: otos
member: vaakuna
member: sukutaulu
member: kuvitettu
preferred label: Illustrative content @en
preferred label: Illustrativt innehåll @sv

alue 8
type: Concept
source: RDA-termi
source: RDA-term @sv
created: 2020-04-30
modified: 2023-05-17
definition: Aluekoodi DVD-levylle, joka on koodattu toistettavaksi kansainvälisillä alueilla, kuten lentokoneissa, risteilyaluksilla, avaruusaluksilla jne.
definition: Regionkod för dvd-skivor som är kodade för uppspelning på internationella områden, såsom i flygplan, kryssningsfartyg, rymdfarkoster etc. @sv
in scheme: Metatietosanasto
preferred label: region 8 @en

alue 5
type: Concept
source: RDA-termi
source: RDA-term @sv
created: 2020-04-30
modified: 2023-05-17
definition: Aluekoodi DVD-levylle, joka on koodattu toistettavaksi Itä-Euroopassa, Baltian maissa, Venäjällä, Keski- ja Etelä-Aasiassa, Intian niemimaalla, Afrikassa, Pohjois-Koreassa ja Mongoliassa.
definition: Regionkod för dvd-skivor som är kodade för uppspelning i Östeuropa, Baltikum, Ryssland, Central- och Sydasien, Indiska halvön, Nordkorea och Mongoliet. @sv
in scheme: Metatietosanasto
preferred label: region 5 @en

alue 6
type: Concept
source: RDA-termi
source: RDA-term @sv
created: 2020-04-30
modified: 2023-05-17
definition: Aluekoodi DVD-levylle, joka on koodattu toistettavaksi Kiinassa.
definition: Regionkod för dvd-skivor som är kodade för uppspelning i Kina. @sv
in scheme: Metatietosanasto
preferred label: region 6 @en

alue 7
type: Concept
source: RDA-termi
source: RDA-term @sv
created: 2020-04-30
modified: 2023-05-17
definition: Aluekoodi DVD-levylle, joka on koodattu toistettavaksi erityistarkoituksissa, kuten elokuva-alan ammattilaisille tai medialle lähetetyt suojatut kopiot
definition: Regionkod för dvd-skivor som är kodade för uppspelning i specialsyften, såsom för professionella inom filmbranschen eller skyddade kopior skickade till media. @sv
in scheme: Metatietosanasto
preferred label: region 7 @en

kaikki alueet
type: Concept
source: RDA-termi
source: RDA-term @sv
created: 2020-04-30
modified: 2023-05-17
definition: Aluekoodi videolevylle tai videopelitallenteelle, joka sallii toiston maailmanlaajuisesti.
definition: Regionkod för videoskiva eller videospel som tillåter uppspelning över hela världen. @sv
in scheme: Metatietosanasto
preferred label: all regions @en
preferred label: alla regioner @sv

ei mittakaavatietoa
type: Concept
source: RDA-termi
source: RDA-term @sv
created: 2020-04-30
modified: 2023-05-17
definition: Aineiston mittakaavaa ei pystytä määrittelemään.
definition: Materialets skala kan inte fastställas. @sv
in scheme: Metatietosanasto
preferred label: scale not given @en
preferred label: skala ej angiven @sv

Mittakaavan määrite
type: ConceptGroup
type: Collection
source: RDA-termi
source: RDA-term @sv
created: 2020-04-30
modified: 2025-11-26
definition: Liittää ekspression yleiseen määritteeseen kuvan tai kolmiulotteisen muodon ja niiden esittämän asian mittojen välisten mittasuhteiden puuttumisesta.
definition: Sammankopplar uttryck med en allmän beteckning för saknaden av proportioner mellan måtten på en bild eller ett tredimensionellt föremål och det verkliga objekt den/det föreställer. @sv
member: mittakaava vaihtelee
member: eri mittakaavoja
member: ei mittakaavatietoa
member: ei mittakaavassa
preferred label: Scale designation @en
preferred label: Attribut till skala @sv

ei mittakaavassa
type: Concept
source: RDA-termi
source: RDA-term @sv
created: 2020-04-30
modified: 2023-05-17
alternative label: ej skalenligt @sv
definition: Stillkuvan tai kolmiulotteisen muodon mitat, jotka eivät ole mittakaavassa.
definition: Mått på stillbild eller tredimensionell form, som inte är skalenliga. @sv
in scheme: Metatietosanasto
preferred label: not drawn to scale @en
preferred label: ej skalriktigt @sv

alue 3
type: Concept
source: RDA-termi
source: RDA-term @sv
created: 2020-04-30
modified: 2023-05-17
definition: Aluekoodi DVD-levylle, joka on koodattu toistettavaksi Kaakkois-Aasiassa ja Itä-Aasiassa, mukaan lukien Hong Kong.
definition: Regionkod för dvd-skivor som är kodade för uppspelning i Sydöstasien och Östasien, inklusive Hong Kong. @sv
in scheme: Metatietosanasto
preferred label: region 3 @en

alue 1
type: Concept
source: RDA-termi
source: RDA-term @sv
created: 2020-04-30
modified: 2023-05-17
definition: Aluekoodi DVD-videolevylle, joka on koodattu toistettavaksi laitteilla Yhdysvalloissa, Kanadassa, Bermudalla sekä Yhdysvaltain territorioissa.
definition: Regionkod för dvd-skivor som är kodade för uppspelning med apparater i Förenta staterna och dess territorier, Kanada och Bermuda. @sv
in scheme: Metatietosanasto
preferred label: region 1 @en

vaakuna
type: Concept
source: RDA-termi
source: RDA-term @sv
created: 2016-01-08
modified: 2023-05-17
definition: Kuvasisältö, joka sisältää koko näkymän kilvestä ja lisäkkeistä koostuvasta vaakunasta.
definition: Illustrativt innehåll som visar en hel heraldisk vapensköld och dess tillbehör. @sv
in scheme: Metatietosanasto
preferred label: coat of arms @en
preferred label: vapen (heraldik) @sv
scope note: Monikossa: vaakunoita, xx vaakunaa.
scope note: I plural: vapen, xx vapen. @sv

Aluekoodi
type: ConceptGroup
type: Collection
source: RDA-termi
source: RDA-term @sv
created: 2020-04-30
modified: 2023-05-05
definition: Liittää manifestaation koodiin, jolla tunnistetaan videolevyn käyttöalue ja estetään sen käyttäminen eri alueella myydyllä soittimella.
definition: Sammankopplar manifestation med en kod, med vilken användningsområdet för en videoskiva fastställs och användningen av den i en spelare som säljs på ett annat område förhindras. @sv
member: alue 2
member: alue U/C
member: alue J
member: alue A
member: alue C (Blu-ray)
member: alue C (videopeli)
member: alue 4
member: alue 8
member: alue 5
member: alue 6
member: alue 7
member: kaikki alueet
member: alue 3
member: alue 1
member: alue B
preferred label: Regional encoding @en
preferred label: Regionkod @sv

alue B
type: Concept
source: RDA-termi
source: RDA-term @sv
created: 2020-04-30
modified: 2023-05-17
definition: Aluekoodi Blu-ray -levylle, joka on koodattu toistettavaksi Euroopassa, Grönlannissa, Ranskan merentakaisilla alueilla, Lähi-idässä, Afrikassa, Australiassa ja Uudessa-Seelannissa.
definition: Regionkod för Blu-ray-skivor som är kodade för uppspelning i Europa, Grönland, Frankrikes utomeuropeiska områden, Mellanöstern, Afrika, Australien och Nya Zeeland. @sv
in scheme: Metatietosanasto
preferred label: region B @en

Sidostyyppi
type: ConceptGroup
type: Collection
source: RDA-termi
source: RDA-term @sv
created: 2020-05-01
modified: 2024-05-23
alternative label: Bindningstyp @sv
definition: Liittää manifestaation menetelmään, jota käytetään sitomaan julkaistu tai julkaisematon manifestaatio.
definition: Sammankopplar manifestation med en metod som används för att binda en publicerad eller opublicerad manifestation. @sv
member: liimasidonta
member: ommeltu liimasidonta
member: pahvikirjan sidos
member: jousiselkäinen sidos
member: kampasidos
member: liukuva sidos
member: satulaommelsidos
member: avoin rengasnidonta
member: kierrenidonta
member: suljettu rengasnidonta
preferred label: Type of binding @en
preferred label: Bandtyp @sv

paragrafi
type: Concept
source: RDA-termi
source: RDA-term @sv
created: 2020-05-01
modified: 2023-05-17
definition: Pistekirjoituslayout, joka koostuu kappaleittain esitetystä nuottikirjoituksesta, yksi stemma kappaletta kohden.
definition: Punktskriftslayout som består av notation som visas i stycken, en stämma per stycke. @sv
in scheme: Metatietosanasto
preferred label: paragraph @en
preferred label: avsnitt @sv

Paikka
type: ConceptGroup
type: Collection
source: RDA-termi
source: RDA-term @sv
created: 2020-05-03
modified: 2025-06-07
definition: Sijainti, joka tunnetaan nimellä.
definition: Namngivet läge. @sv
member: muu paikkaan liittyvä määrite
preferred label: Place @en
preferred label: Plats @sv

henkilön toinen identiteetti
type: Concept
source: Kansallinen RDA-termi
source: Nationell RDA-term @sv
created: 2020-05-04
modified: 2025-06-14
alternative label: alternativ identitet @sv
definition: Henkilön omaksuma toinen identiteetti. (RDA Registry)
definition: Annan identitet som en person antagit. @sv
in scheme: Metatietosanasto
preferred label: annan identitet @sv

henkilön todellinen identiteetti
type: Concept
source: Kansallinen RDA-termi
source: Nationell RDA-term @sv
created: 2020-05-04
modified: 2025-06-14
definition: Toisen identiteetin omaksuneen henkilön todellinen identiteetti. (RDA Registry)
definition: Verklig identitet för en person som antagit en annan identitet. @sv
in scheme: Metatietosanasto
preferred label: verklig identitet @sv

Teokset
type: Concept
source: Kansallinen RDA-termi
source: Nationell RDA-term @sv
created: 2020-05-14
modified: 2024-05-24
definition: Vakiintunut kokoava nimeke Teokset merkitään ensisijaiseksi nimekkeeksi sellaiselle teosten koosteelle, joka sisältää tai jonka on tarkoitus sisältää toimijan kootut teokset. Jos kokoelmassa ei ole kaikkia teoksia, tietoon lisätään termi Valikoima.
definition: Grupptiteln Verk anges som föredragen titel för en sådan sammanställning av verk som innehåller, eller är avsedd att innehålla, en aktörs samlade verk. Om sammanställningen inte innehåller alla verk anges också termen Urval. @sv
example: MARC 21 -esimerkki 100 1# ‡a Snellman, Johan Vilhelm, ‡d 1806-1881, ‡e kirjoittaja. ‡0 (FI-ASTERI-N)000059409 240 10 ‡a Teokset
example: MARC 21 -esimerkki 240 10 ‡a Teokset. ‡k Valikoima, ‡l suomi
example: MARC 21-exempel 100 1# ‡a Snellman, Johan Vilhelm, ‡d 1806-1881, ‡e författare. ‡0 (FI-ASTERI-N)000059409 240 10 ‡a Verk @sv
example: MARC 21-exempel 240 10 ‡a Verk. ‡k Urval, ‡l svenska @sv
in scheme: Metatietosanasto
preferred label: Verk @sv

stillkuva
type: Concept
source: RDA-termi
source: RDA-term @sv
created: 2016-01-08
modified: 2023-05-05
definition: Viivoina, muotoina, varjostuksina jne. esitetty sisältö, joka on tarkoitettu katsottavaksi kaksiulotteisena stillkuvana tai -kuvina. Esimerkiksi piirrokset, maalaukset, diagrammit, valokuvat jne. Katso myös kartografinen kuva, taktiili kuva.
definition: Innehåll presenterat som streck, former, skuggningar etc. som är avsett att betraktas som en eller flera tvådimensionella stillbilder. Till exempel ritningar, målningar, diagram, fotografier etc. Se även kartografisk bild, taktil bild. @sv
in scheme: Metatietosanasto
preferred label: still image @en
preferred label: stillbild @sv

yhteisöpedagogi
type: Concept
source: Kansallinen RDA-termi
source: YSO-termi
source: ALLFO-term @sv
source: Nationell RDA-term @sv
created: 2020-05-16
modified: 2024-05-24
definition: Yhteisöpedagogit ovat järjestö- ja nuorisotyön ammattilaisia ja asiantuntijoita, jotka työskentelevät kunnissa, järjestöissä, laitoksissa ja yrityksissä ohjaajina, kouluttajina, suunnittelijoina ja koordinaattoreina. (https://www.humak.fi/opiskelijaksi/yhteisopedagogi/)
definition: Professionella specialister inom organisations- och ungdomsarbete, som kan arbeta i kommuner, organisationer, anstalter och företag som handledare, utbildare, planerare och koordinatorer. @sv
in scheme: Metatietosanasto
preferred label: samhällspedagog @sv

kolmiulotteinen muoto
type: Concept
source: RDA-termi
source: RDA-term @sv
created: 2016-01-08
modified: 2023-05-05
definition: Muotona tai muotoina esitetty sisältö, joka on tarkoitettu katsottavaksi kolmiulotteisena. Esimerkiksi veistokset, mallit, luonnonesineet, hologrammit jne. Katso myös kartografinen kolmiulotteinen muoto, taktiili kolmiulotteinen muoto.
definition: Innehåll uttryckt som form eller former avsedda att betraktas som tredimensionella. T.ex. skulpturer, modeller, naturliga föremål, hologram. Se även kartografisk tredimensionell form, taktil tredimensionell form. @sv
in scheme: Metatietosanasto
preferred label: three-dimensional form @en
preferred label: tredimensionell form @sv

sukutaulu
type: Concept
source: RDA-termi
source: RDA-term @sv
created: 2016-01-08
modified: 2023-05-17
definition: Kuvasisältö, joka esittää taulukon tai kaavion muodossa henkilön tai suvun sukujuuret.
definition: Illustrativt innehåll som visar en persons eller släkts härkomst i form av en tabell eller schematisk bild. @sv
in scheme: Metatietosanasto
preferred label: genealogical table @en
preferred label: släkttavla @sv
scope note: Monikossa: sukutauluja, xx sukutaulua
scope note: I plural: släkttavlor, xx släkttavlor @sv

Toistokanavien määrä
type: ConceptGroup
type: Collection
source: RDA-termi
source: RDA-term @sv
created: 2020-06-04
modified: 2023-05-05
definition: Liittää manifestaation äänityksessä käytettyjen äänikanavien määrään.
definition: Sammankopplar manifestation med det antal ljudkanaler som använts vid inspelning. @sv
member: mono
member: surround
member: stereo
member: kvadrofoninen
preferred label: Configuration of playback channels @en
preferred label: Antal ljudkanaler @sv

Seksuaalinen suuntautuneisuus
type: ConceptGroup
type: Collection
source: Kansallinen RDA-termi
source: Nationell RDA-term @sv
created: 2020-06-06
modified: 2024-10-04
preferred label: Sexual orientation @en
preferred label: Sexuell läggning @sv
scope note: Käytetään määrittämään ryhmän jäsenten seksuaalista suuntautumista kuvaavia termejä (esim. biseksuaalit, heteroseksuaalit, homot, lesbot). Yksittäisten termien valinnassa käytetään YSO-termejä ryhmästä väestöryhmään liittyvä rooli.
scope note: Används för att bestämma termer som beskriver sexuell läggning hos medlemmar i en grupp (t.ex. bisexuella, heterosexuella, homosexuella män, lesbiska). Vid val av enskilda termer används ALLFO-termer ur gruppen roll relaterad till befolkningsgrupp. @sv

Terveys/toimintakyky
type: ConceptGroup
type: Collection
source: Kansallinen RDA-termi
source: Nationell RDA-term @sv
created: 2020-06-06
modified: 2024-05-24
preferred label: Medical, psychological, and disability @en
preferred label: Hälsa/funktionsförmåga @sv
scope note: Käytetään määrittämään ryhmän jäsenten terveydellistä tilaa tai toimintakykyä kuvaavia termejä (esim. kuulovammaiset, psyykkisesti sairaat, päihdekuntoutujat, sokeat).
scope note: Används för att bestämma termer som anger hälsotillstånd eller funktionsförmåga hos medlemmar av en grupp (t.ex. personer med hörselskada, psykiskt sjuka, klienter i missbrukarrehabilitering, blinda). @sv

Kansallisuus/asuinalue
type: ConceptGroup
type: Collection
source: Kansallinen RDA-termi
source: Nationell RDA-term @sv
created: 2020-06-06
modified: 2024-10-04
preferred label: National/regional @en
preferred label: Nationalitet/bosättningsområde @sv
scope note: Käytetään määrittämään ryhmän jäsenten kansallisuutta tai maantieteellistä asuinaluetta kuvaavia termejä (esim. keskisuomalaiset, neuvostoliittolaiset, romanialaiset, suomalaiset, yhdysvaltalaiset). Mikäli ryhmän etnisyyttä kuvaava termi ei ole samalla maantieteellinen termi, valitaan kokoavaksi yleistermiksi Etnisyys [eth]. Yksittäisten termien valinnassa käytetään YSO-termejä ryhmästä väestöryhmään liittyvä rooli.
scope note: Används för att bestämma termer som beskriver nationalitet eller geografiskt bosättningsområde för medlemmar i en grupp (t.ex. invånare i Mellersta Finland, sovjetmedborgare, rumäner, finländare, amerikanska medborgare). Om termen som beskriver gruppens etnicitet inte samtidigt är en geografisk term, väljs Etnicitet [eth] som samlande allmänterm. Vid val av enskilda termer används ALLFO-termer ur gruppen roll relaterad till befolkningsgrupp. @sv

Uskonto
type: ConceptGroup
type: Collection
source: Kansallinen RDA-termi
source: Nationell RDA-term @sv
created: 2020-06-06
modified: 2024-10-04
preferred label: Religion @en
scope note: Käytetään määrittämään ryhmän jäsenten uskonnolliseen ryhmään kuulumista kuvaavia termejä (esim. buddhalaiset, katoliset, luterilaiset, sikhit). Yksittäisten termien valinnassa käytetään YSO-termejä ryhmästä uskontoon liittyvä rooli.
scope note: Används för att bestämma termer som beskriver tillhörighet till en religiös grupp hos medlemmar i en grupp (t.ex. buddhister, katoliker, lutheraner, sikher). Vid val av enskilda termer används ALLFO-termer ur gruppen roll relaterad till religion. @sv

Etnisyys
type: ConceptGroup
type: Collection
source: Kansallinen RDA-termi
source: Nationell RDA-term @sv
created: 2020-06-06
modified: 2024-10-04
preferred label: Ethnic/cultural @en
preferred label: Etnicitet @sv
scope note: Käytetään määrittämään ryhmän jäsenten etnistä identiteettiä kuvaavia termejä (esim. baskit, kanadansuomalaiset, romanit, sorbit, suomenruotsalaiset, tuaregit, vironruotsalaiset). Mikäli ryhmän etnisyyttä kuvaava termi on myös maantieteellinen termi, valitaan kokoavaksi yleistermiksi Kansallisuus/asuinalue [nat]. Yksittäisten termien valinnassa käytetään YSO-termejä ryhmästä väestöryhmään liittyvä rooli.
scope note: Används för att bestämma termer som beskriver etnisk identitet hos medlemmar av en grupp (t.ex. basker, finländare i Kanada, romer, sorber, finlandssvenskar, tuareger, estlandssvenskar). Om termen som beskriver en grupps etnicitet också är en geografisk term, väljs Nationalitet/bosättningsområde [nat] som samlande allmänterm. Vid val av enskilda termer används ALLFO-termer ur gruppen roll relaterad till befolkningsgrupp. @sv

Saarnat
type: Concept
source: Kansallinen RDA-termi
source: Nationell RDA-term @sv
created: 2020-06-15
modified: 2024-05-24
alternative label: Predikosamlingar @sv
definition: Vakiintunut kokoava nimeke kokoelmalle, joka käsittää kaikki toimijan pitämät saarnat. Jos kokoelmassa ei ole kaikkia puheita. tietoon lisätään termi Valikoima.
definition: Grupptitel för en samling som omfattar alla predikningar en aktör har hållit. Om samlingen inte innehåller alla predikningar anges också termen Urval. @sv
example: MARC 21 -formaatissa 240 10 ‡a Saarnat. ‡k Valikoima
example: I MARC 21 -formatet 240 10 ‡a Predikningar. ‡k Urval @sv
in scheme: Metatietosanasto
preferred label: Sermons @en
preferred label: Predikningar @sv

Sarjakuvat
type: Concept
source: Kansallinen RDA-termi
source: Nationell RDA-term @sv
created: 2020-08-13
modified: 2024-05-24
definition: Vakiintunut kokoava nimeke kokoelmalle, joka käsittää kaikki toimijan kirjoittamat sarjakuvat. Jos kokoelmassa ei ole kaikkia sarjakuvia, tietoon lisätään termi Valikoima.
definition: Grupptitel för en samling som innehåller alla tecknade serier som en aktör gjort. Om samlingen inte innehåller alla serier anges också termen Urval. @sv
in scheme: Metatietosanasto
preferred label: Tecknade serier @sv

Sadut
type: Concept
source: Kansallinen RDA-termi
source: Nationell RDA-term @sv
created: 2020-08-26
modified: 2024-05-24
definition: Vakiintunut kokoava nimeke kokoelmalle, joka käsittää kaikki toimijan kertomat sadut. Jos kokoelmassa ei ole kaikkia satuja, tietoon lisätään termi Valikoima.
definition: Grupptitel för en samling som innehåller alla sagor som en aktör skrivit. Om samlingen inte omfattar alla sagor anges också termen Urval. @sv
example: MARC 21 -formaatissa 240 10 ‡a Sadut. ‡k Valikoima
example: I MARC 21-formatet 240 10 ‡a Sagor. ‡k Urval @sv
in scheme: Metatietosanasto
preferred label: Sagor @sv

nettiohjelma
type: Concept
source: Kansallinen RDA-termi
source: Nationell RDA-term @sv
created: 2020-11-02
modified: 2024-11-14
in scheme: Metatietosanasto
preferred label: nätprogram @sv
scope note: Teoksen muoto -termejä käytetään erottamaan toisistaan samannimiset teokset.
scope note: Voidaan käyttää kun ohjelman tai ohjelmasarjan alkuperäinen levityskanava on ollut internet.
scope note: Kan användas när den ursprungliga distributionskanalen för ett program eller en programserie är internet. @sv
scope note: Verkets form-termer används för att åtskilja verk med samma namn. @sv

Suomen Ekonomien kirjallisuuspalkinto
type: Concept
source: Kansallinen RDA-termi
source: Nationell RDA-term @sv
created: 2020-11-21
modified: 2023-05-17
alternative label: Pro Oeconomia
definition: Suomen Ekonomien kirjallisuuspalkinto jaetaan noin kahden vuoden välein parhaalle suomalaiselle yrityskirjalle. Vuoteen 2008 asti palkinnon nimi oli Pro Oeconomia.
definition: Finlands Ekonomers litteraturpris utdelas ungefär vartannat år till den bästa finländska företagsboken. Fram till år 2008 var prisets namn Pro Oeconomia. @sv
example: MARC 21 -formaatissa: 586 ## ‡a Suomen Ekonomien kirjallisuuspalkinto, 2008
example: I MARC 21-formatet: 586 ## ‡a Finlands Ekonomers litteraturpris, 2008 @sv
in scheme: Metatietosanasto
preferred label: Finlands Ekonomers litteraturpris @sv

videoitu esitys
type: Concept
source: Kansallinen RDA-termi
source: Nationell RDA-term @sv
created: 2020-11-27
modified: 2024-11-14
alternative label: filmat framförande @sv
in scheme: Metatietosanasto
preferred label: filmat framträdande @sv
scope note: Teoksen muoto -termejä käytetään erottamaan toisistaan samannimiset teokset.
scope note: Verkets form-termer används för att åtskilja verk med samma namn. @sv

musiikkivideo
type: Concept
source: Kansallinen RDA-termi
source: Nationell RDA-term @sv
created: 2020-11-27
modified: 2024-11-14
in scheme: Metatietosanasto
preferred label: musikvideo @sv
scope note: Teoksen muoto -termejä käytetään erottamaan toisistaan samannimiset teokset.
scope note: Verkets form-termer används för att åtskilja verk med samma namn. @sv

ilmestymistiheys vaihtelee
type: Concept
source: Kansallinen RDA-termi
source: Nationell RDA-term @sv
created: 2021-03-04
modified: 2025-10-04
definition: Korvaa aikaisemman ilmestymistiheyden merkinnät, jos aikaisempia merkintöjä on enemmän kuin kolme.
definition: Ersätter uppgifter om tidigare utgivningsfrekvens, om tidigare angivelser är fler än tre. @sv
in scheme: Metatietosanasto
preferred label: varierande utgivningsfrekvens @sv

tutkimusryhmä
type: Concept
source: Kansallinen RDA-termi
source: Nationell RDA-term @sv
created: 2021-04-20
modified: 2024-05-24
alternative label: tutkijakoulu
alternative label: tutkijaryhmä
alternative label: tutkijayhteisö
alternative label: tutkimusyhteisö
alternative label: tutkimusyksikkö
alternative label: forskarskola @sv
alternative label: forskarteam @sv
alternative label: forskningsenhet @sv
alternative label: forskningsgrupp @sv
in scheme: Metatietosanasto
preferred label: forskargrupp @sv

valtionpäämies
type: Concept
source: Kansallinen RDA-termi
source: Nationell RDA-term @sv
created: 2021-04-20
modified: 2024-05-24
alternative label: hallitsija (yhteisötyyppi)
alternative label: monarkki
alternative label: presidentti (yhteisötyyppi)
alternative label: valtion päämies (yhteisötyyppi)
alternative label: valtionpäämies (yhteisötyyppi)
alternative label: monark @sv
alternative label: president (institutionstyp) @sv
alternative label: regent (institutionstyp) @sv
alternative label: statschef @sv
alternative label: statsöverhuvud (institutionstyp) @sv
definition: Valtion muodollisesti ylin poliittinen vallankäyttäjä.
definition: En stats formellt högsta politiska makthavare. @sv
in scheme: Metatietosanasto
preferred label: statsöverhuvud @sv
scope note: Käytetään viranomaisasemassa toimivasta henkilöstä, jonka tulkitaan toimivan yhteisönä.
scope note: Används om en person som fungerar i myndighetsställning och som institution. @sv

satama
type: Concept
source: Kansallinen RDA-termi
source: Nationell RDA-term @sv
created: 2021-04-20
modified: 2024-05-24
definition: Sataman toiminnasta vastaava viranomainen, joka on nimetty sataman mukaan.
definition: Myndighet som ansvarar för en hamns verksamhet, och som är namngiven enligt hamnen. @sv
in scheme: Metatietosanasto
preferred label: hamn @sv

stereografinen kortti
type: Concept
source: RDA-termi
source: RDA-term @sv
created: 2016-01-08
modified: 2023-05-17
definition: Kortti, jolla on stereografisia kuvia.
definition: Kort med stereografiska bilder. @sv
in scheme: Metatietosanasto
preferred label: stereograph card @en
preferred label: stereografiskt kort @sv
scope note: Stereografinen tallenne.
scope note: Stereografisk bärare. @sv

alayksikkö
type: Concept
source: Kansallinen RDA-termi
source: Nationell RDA-term @sv
created: 2021-04-20
modified: 2024-05-24
alternative label: jaosto
alternative label: osasto
alternative label: toimipiste
alternative label: toimisto
alternative label: yksikkö
alternative label: avdelning @sv
alternative label: enhet @sv
alternative label: filial @sv
alternative label: kontor @sv
alternative label: underavdelning @sv
alternative label: underenhet @sv
definition: Yhteisön epäitsenäinen hallinnollinen tai toiminnallinen osa.
definition: Icke-självständig administrativ eller operativ del av en instititution. @sv
in scheme: Metatietosanasto
preferred label: underordnad enhet @sv

kansanedustuslaitos
type: Concept
source: Kansallinen RDA-termi
source: Nationell RDA-term @sv
created: 2021-04-20
modified: 2024-05-24
example: Ison-Britannian parlamentti
example: Yhdysvaltain kongressi
example: eduskunta
example: saamelaiskäräjät
example: säätyvaltiopäivät
example: Storbritanniens parlament @sv
example: USA:s kongress @sv
example: riksdagen @sv
example: sametinget @sv
example: ståndslantdag @sv
example: ståndsriksdag @sv
in scheme: Metatietosanasto
preferred label: folkrepresentation @sv

alus
type: Concept
source: Kansallinen RDA-termi
source: Nationell RDA-term @sv
created: 2021-04-20
modified: 2024-05-24
alternative label: alus (yhteisötyyppi)
alternative label: laiva (yhteisötyyppi)
alternative label: lautta (yhteisötyyppi)
alternative label: vene (yhteisötyyppi)
alternative label: vesikulkuneuvo (yhteisötyyppi)
alternative label: båt (institutionstyp) @sv
alternative label: fartyg (institutionstyp) @sv
alternative label: färja (institutionstyp) @sv
alternative label: vattenfarkost @sv
in scheme: Metatietosanasto
preferred label: farkost @sv

piispainkokous
type: Concept
source: Kansallinen RDA-termi
source: Nationell RDA-term @sv
created: 2021-04-20
modified: 2024-05-24
alternative label: laajennettu piispainkokous
definition: Piispojen muodostama kirkollinen hallintoelin.
definition: Kyrkligt förvaltningsorgan bestående av biskopar. @sv
in scheme: Metatietosanasto
preferred label: biskopsmöte @sv

seurakunta
type: Concept
source: Kansallinen RDA-termi
source: Nationell RDA-term @sv
created: 2021-04-20
modified: 2024-05-24
alternative label: siirtoseurakunta
definition: Itsehallinnollinen kirkollinen yhdyskunta, jolla on julkisoikeudellinen asema.
definition: Självstyrt kyrkligt samfund, som har en offentligrättslig ställning. @sv
in scheme: Metatietosanasto
preferred label: församling @sv
scope note: Käytetään Suomen evankelis-luterilaisen ja ortodoksisen kirkon seurakunnista.
scope note: Används om församlingar inom evangelisk-lutherska kyrkan och ortodoxa kyrkan i Finland. @sv

vankila
type: Concept
source: Kansallinen RDA-termi
source: Nationell RDA-term @sv
created: 2021-04-20
modified: 2024-05-24
alternative label: avovankila
alternative label: kaupunginvankila
alternative label: kehruuhuone
alternative label: keskusvankila
alternative label: kruununvankila
alternative label: kuritushuone
alternative label: linnavankila
alternative label: lääninvankila
alternative label: nuorisovankila
alternative label: poliisivankila
alternative label: rangaistusvankila
alternative label: tunnustusvankila
alternative label: työsiirtola
alternative label: vankisiirtola
alternative label: varavankila
alternative label: arbetskoloni @sv
alternative label: centralfängelse @sv
alternative label: fångkoloni @sv
alternative label: kronofängelse @sv
alternative label: länsfängelse @sv
alternative label: polisfängelse @sv
alternative label: reservfängelse @sv
alternative label: slottsfängelse @sv
alternative label: spinnhus @sv
alternative label: stadsfängelse @sv
alternative label: straffängelse @sv
alternative label: tukthus @sv
alternative label: ungdomsfängelse @sv
alternative label: öppet fängelse @sv
definition: Laitos, jossa pannaan täytäntöön vankeusrangaistuksia ja jossa säilytetään vangittuja henkilöitä (Kielitoimiston sanakirja).
definition: Inrättning vid vilken fängelsestraff verkställs och personer som dömts till frihets­berövande förvaras. @sv
in scheme: Metatietosanasto
preferred label: fängelse @sv

arkisto
type: Concept
source: Kansallinen RDA-termi
source: Nationell RDA-term @sv
created: 2021-04-20
modified: 2024-05-24
in scheme: Metatietosanasto
preferred label: arkiv @sv

senaatti
type: Concept
source: Kansallinen RDA-termi
source: Nationell RDA-term @sv
created: 2021-04-20
modified: 2024-05-24
definition: Historiallinen termi. Suomen suuriruhtinaskunnan ylin hallitusvaltaa käyttävä ja oikeutta jakava elin, sen osastot ja toimikunnat sekä niiden seuraajat vuoden 1918 sodan aikana.
definition: Historisk term. Högsta styrande organ i Storfurstendömet Finland, även dess avdelningar och kommittéer, samt efterträdare till dessa under kriget 1918. @sv
example: Keisarillinen Suomen senaatti
example: Suomen senaatin kulkulaitostoimituskunta
example: Suomen senaatin oikeusosasto
example: Vaasan senaatin talousosasto
example: Vaasan senaatti
example: Kejserliga senaten för Finland @sv
example: Senatens ekonomiedepartement @sv
example: Senatens justitiedepartement @sv
example: Vasasenaten @sv
in scheme: Metatietosanasto
preferred label: senat @sv

kirjasto
type: Concept
source: Kansallinen RDA-termi
source: Nationell RDA-term @sv
created: 2021-04-20
modified: 2024-05-24
in scheme: Metatietosanasto
preferred label: bibliotek @sv

ammattikunta
type: Concept
source: Kansallinen RDA-termi
source: Nationell RDA-term @sv
created: 2021-04-20
modified: 2024-05-24
alternative label: kilta (ammattikuntalaitos)
alternative label: gille (skråväsen) @sv
definition: Keskiajalta lähtien varsinkin kaupunkien käsityöläisammattien harjoittajia ammattikohtaisesti edustava yhdistys, joka mm. avusti käsityöläisiä, valvoi työn laatua ja ratkaisi keskinäisiä riita-asioita. Ammattikuntalaitos toimi osassa Suomen kaupunkeja vuoteen 1868, jolloin asetus elinkeinonvapaudesta lakkautti ammattikunnat. (Arkistojen portti.)
definition: Från och med medeltiden, särskilt i städerna fungerande organisation för utövare av hantverkaryrken. Skråväsendet fungerade i en del av de finländska städerna fram till år 1868, då en förordning om näringsfrihet avskaffade skråna. @sv
in scheme: Metatietosanasto
preferred label: skrå @sv

ministeriö
type: Concept
source: Kansallinen RDA-termi
source: Nationell RDA-term @sv
created: 2021-04-20
modified: 2024-05-24
in scheme: Metatietosanasto
preferred label: ministerium @sv

keisari
type: Concept
source: Kansallinen RDA-termi
source: Nationell RDA-term @sv
created: 2016-01-08
modified: 2024-05-24
definition: Eräiden miespuolisten monarkkien arvonimi.
definition: Vissa manliga monarkers titel. @sv
in scheme: Metatietosanasto
preferred label: kejsare @sv

lääninhallitus
type: Concept
source: Kansallinen RDA-termi
source: Nationell RDA-term @sv
created: 2021-04-20
modified: 2024-05-24
definition: Historiallinen termi. Ennen vuotta 2010 Suomessa toiminut aluehallintoviranomainen, jota johti maaherra ja jonka hallintoalueena oli lääni.
definition: Historisk term. Regionförvaltningsmyndighet i Finland före år 2010. @sv
in scheme: Metatietosanasto
preferred label: länsstyrelse @sv

kuolinpesä
type: Concept
source: Kansallinen RDA-termi
source: Nationell RDA-term @sv
created: 2021-04-20
modified: 2024-05-24
alternative label: perikunta
alternative label: dödsbodelägare @sv
definition: Kuolinpesällä tarkoitetaan kuolleen henkilön varojen ja velkojen muodostamaa taloudellista kokonaisuutta. Tällainen pesä ei ole oikeushenkilö vaan osakkaidensa väliaikainen henkilöyhteenliittymä. (Wikipedia.)
definition: Ekonomisk helhet som utgörs av en avliden persons tillgångar och skulder. @sv
in scheme: Metatietosanasto
preferred label: dödsbo @sv

työlaitos
type: Concept
source: Kansallinen RDA-termi
source: Nationell RDA-term @sv
created: 2021-04-20
modified: 2024-05-24
alternative label: ojennuslaitos
alternative label: työ- ja ojennuslaitos
alternative label: työleiri
alternative label: arbets- och korrektionsinrättning @sv
alternative label: arbetsanstalt @sv
alternative label: arbetsläger @sv
alternative label: korrektionsinrättning @sv
definition: Historiallinen termi. Huoltolaitos, johon voitiin määrätä työhön sijoitettavaksi irtolaislainsäädännön nojalla ja myöhemmin kunnan myöntämän huoltoavun korvaamiseksi. Myös työleiri, johon vuodesta 1934 sijoitettiin ehdonalaiseen vapauteen päässeitä henkilöitä.
definition: Historisk term. Anstalt på vilken personer kunde placeras utgående från lösdriverilagstiftningen, och senare för att ersätta försörjningsbidrag beviljat av kommuner. Även om arbetsläger i vilka personer som blivit villkorligt frigivna placerades fr.o.m. år 1934. @sv
in scheme: Metatietosanasto
preferred label: arbetsinrättning @sv

kauppahuone
type: Concept
source: Kansallinen RDA-termi
source: Nationell RDA-term @sv
created: 2021-04-20
modified: 2024-05-24
definition: Historiallinen termi. Suurisuuntainen tuonti- ja vientiliike, jonka toiminimi oli yleensä yhden suvun hallussa.
definition: Historisk term. Import- och exportrörelse, vars verksamhetsnamn vanligen var i en släkts besittning. @sv
in scheme: Metatietosanasto
preferred label: handelshus @sv

kauppakomppania
type: Concept
source: Kansallinen RDA-termi
source: Nationell RDA-term @sv
created: 2021-04-20
modified: 2024-05-24
definition: Historiallinen termi. Etuoikeutettu suurkaupan yhtymä.
definition: Historisk term. Priviligerad sammanslutning för omfattande handel. @sv
in scheme: Metatietosanasto
preferred label: handelskompani @sv

kirkolliskokous
type: Concept
source: Kansallinen RDA-termi
source: Nationell RDA-term @sv
created: 2021-04-20
modified: 2024-05-24
definition: Kirkolliskokous on kirkon ylin päättävä elin, joka päättää kirkon opista (Wikipedia).
definition: Kyrkans högsta beslutande organ som besluter om kyrkans läror. @sv
in scheme: Metatietosanasto
preferred label: kyrkomöte @sv

luostari
type: Concept
source: Kansallinen RDA-termi
source: Nationell RDA-term @sv
created: 2021-04-20
modified: 2024-05-24
alternative label: konventti (luostari)
alternative label: konvent (kloster) @sv
in scheme: Metatietosanasto
preferred label: kloster @sv

esittäjäryhmä
type: Concept
source: Kansallinen RDA-termi
source: Nationell RDA-term @sv
created: 2021-04-20
modified: 2024-05-24
in scheme: Metatietosanasto
preferred label: framförande grupp @sv

majakka
type: Concept
source: Kansallinen RDA-termi
source: Nationell RDA-term @sv
created: 2021-04-20
modified: 2024-05-24
definition: Majakan toiminnasta vastaava viranomainen, joka on nimetty majakan nimen mukaan.
definition: Myndighet som ansvarar för en fyrs verksamhet, och som är namngiven enligt fyrens namn. @sv
in scheme: Metatietosanasto
preferred label: fyr @sv

etujärjestö
type: Concept
source: Kansallinen RDA-termi
source: Nationell RDA-term @sv
created: 2021-04-20
modified: 2024-05-24
definition: Etujärjestö on taloudellinen järjestö, joka pyrkii ajamaan oman jäsenistönsä tai viiteryhmänsä etuja (Wikipedia).
definition: Ekonomisk organisation som driver sina medlemmars eller sin referensgrupps intressen. @sv
in scheme: Metatietosanasto
preferred label: intresseorganisation @sv

palokunta
type: Concept
source: Kansallinen RDA-termi
source: Nationell RDA-term @sv
created: 2021-04-20
modified: 2024-05-24
alternative label: kunnallinen palokunta
alternative label: palolaitos
alternative label: brandverk @sv
alternative label: kommunal brandkår @sv
in scheme: Metatietosanasto
preferred label: brandkår @sv

kruununvouti (viranomainen)
type: Concept
source: Kansallinen RDA-termi
source: Nationell RDA-term @sv
created: 2021-04-20
modified: 2024-05-24
alternative label: kruununvouti (yhteisötyyppi)
alternative label: kronofogde (institutionstyp) @sv
definition: Historiallinen termi. Kruununvouti oli Suomessa valtion virkamies, joka toimi kihlakunnan ylimpänä poliisiviranomaisena. Hän oli myös kihlakuntansa ylin virallinen syyttäjä, veronkantomies ja ulosottomies. Lisäksi hän toimi täytäntöönpanoviranomaisena. Kruununvoutien virat lakkautettiin vuoden 1945 alussa. (Wikipedia.)
definition: Historisk term. Kronofogden var i Finland en statlig tjänsteman, som fungerade som högsta polismyndighet i en härad. Kronofogden var också häradens högsta officiella åklagare, skatteuppbördsman och utmätningsman, samt fungerade därtill som verkställande myndighet. Kronofogdeämbetena upphävdes år 1945. @sv
in scheme: Metatietosanasto
preferred label: kronofogde (myndighet) @sv
scope note: Käytetään viranomaisasemassa toimivasta henkilöstä, jonka tulkitaan toimivan yhteisönä.
scope note: Används om person som fungerar i myndighetsställning och som institution. @sv

nimismies (viranomainen)
type: Concept
source: Kansallinen RDA-termi
source: Nationell RDA-term @sv
created: 2021-04-20
modified: 2024-05-24
alternative label: nimismies (yhteisötyyppi)
alternative label: nimismiespiiri
alternative label: länsmansdistrikt @sv
definition: Historiallinen termi. Mm. poliisi-, syyttäjä- ja ulosottotoimesta maaseudulla vastannut yleishallintoviranomainen.
definition: Historisk term. Allmän förvaltningsmyndighet som ansvarade för bl.a. polis-, åklagar- och utsökningsväsendet på landsbygden. @sv
in scheme: Metatietosanasto
preferred label: länsman (myndighet) @sv
scope note: Käytetään viranomaisasemassa toimivasta henkilöstä, jonka tulkitaan toimivan yhteisönä. Ei käytetä vuoden 1996 kihlakuntauudistuksen jälkeisistä nimismiehistä.
scope note: Används om en person som fungerar i myndighetsställning och som institution. Används inte om länsmän efter häradsreformen år 1996. @sv

vankileiri
type: Concept
source: Kansallinen RDA-termi
source: Nationell RDA-term @sv
created: 2021-04-20
modified: 2024-05-24
alternative label: pakkotyöleiri
alternative label: sotavankileiri
alternative label: arbetsläger @sv
alternative label: krigsfångeläger @sv
alternative label: krigsfångläger @sv
in scheme: Metatietosanasto
preferred label: fångläger @sv

viljavarasto
type: Concept
source: Kansallinen RDA-termi
source: Nationell RDA-term @sv
created: 2021-04-20
modified: 2024-05-24
alternative label: kruuunmakasiini
alternative label: lainajyvästö
alternative label: lainamakasiini
alternative label: lääninmakasiini
alternative label: pitäjänmakasiini
alternative label: viljamakasiini
alternative label: viljavarasto (yhteisötyyppi)
alternative label: kronomagasin @sv
alternative label: länsmagasin @sv
alternative label: lånemagasin @sv
alternative label: sockenmagasin @sv
alternative label: spannmålslager @sv
alternative label: spannmålsmagasin (institutionstyp) @sv
definition: Katovuosien varalta alueellisesti tai paikallisesti syömä- ja siemenviljan tallettamisesta huolehtinut laitos.
definition: Inrättning som regionalt eller lokalt hade hand om att förvara spannmål och utsäde, för eventuella nödår. @sv
in scheme: Metatietosanasto
preferred label: spannmålsmagasin @sv

SACD-äänilevy
type: Concept
source: Kansallinen RDA-termi
source: Nationell RDA-term @sv
created: 2016-01-08
modified: 2025-10-31
in scheme: Metatietosanasto
preferred label: SACD-ljudskiva @sv

asuinyhteisö
type: Concept
source: Kansallinen RDA-termi
source: Nationell RDA-term @sv
created: 2021-04-20
modified: 2024-05-24
alternative label: ekokylä
alternative label: ekoyhteisö
alternative label: kibbutsi
alternative label: kollektiivi (asuinyhteisö)
alternative label: kommuuni
alternative label: kylä (yhteisötyyppi)
alternative label: kyläyhteisö
alternative label: bogemenskap @sv
alternative label: by (institutionstyp) @sv
alternative label: bygemenskap @sv
alternative label: ekoby @sv
alternative label: kibbutz @sv
alternative label: kollektiv (boendegemenskap) @sv
in scheme: Metatietosanasto
preferred label: boendegemenskap @sv

uskonnollinen yhteisö
type: Concept
source: Kansallinen RDA-termi
source: Nationell RDA-term @sv
created: 2021-04-20
modified: 2024-05-24
alternative label: kirkkokunta
alternative label: uskonnollinen liike
alternative label: uskonnollinen yhdyskunta
alternative label: kyrkosamfund @sv
alternative label: religiös rörelse @sv
definition: Rekisteröidyt uskonnolliset yhdyskunnat, Suomen kansankirkot, rekisteröidyt ja rekisteröimättömät uskonnolliset yhteisöt ja kansainväliset uskonnolliset yhteisöt (esim. katolinen kirkko).
definition: Registrerade religiösa samfund, Finlands folkkyrkor, registrerade och oregistrerade religiösa sammanslutningar och internationella religiösa gemenskaper (t.ex. katolska kyrkan). @sv
example: Katolinen kirkko Suomessa
example: Länsi-Suomen Rukoilevaisten Yhdistys
example: Suomen ortodoksinen kirkko
example: Katolska kyrkan i Finland @sv
example: Ortodoxa kyrkan i Finland @sv
in scheme: Metatietosanasto
preferred label: religiöst samfund @sv
scope note: Ei koske Suomen kansankirkkojen hallinnollisia yksiköitä (esim. seurakuntia). Rekisteröidyistä uskonnollisista yhdistyksistä termiä voi käyttää termin yhdistys (rekisteröity) ohessa.
scope note: Gäller inte finländska folkkyrkors förvaltningsenheter (t.ex. församlingar). Om registrerade religiösa föreningar kan termen användas vid sidan av termen förening (registrerad). @sv

talo (yhteisö)
type: Concept
source: Kansallinen RDA-termi
source: Nationell RDA-term @sv
created: 2021-04-20
modified: 2024-05-24
alternative label: kartano
alternative label: keskikievari
alternative label: linna
alternative label: maatila
alternative label: virkatalo
alternative label: boställe @sv
alternative label: herrgård @sv
alternative label: lantgård @sv
alternative label: slott @sv
in scheme: Metatietosanasto
preferred label: hus (institution) @sv

asiamies (viranomainen)
type: Concept
source: Kansallinen RDA-termi
source: Nationell RDA-term @sv
created: 2021-04-20
modified: 2024-05-24
alternative label: asiamies (yhteisötyyppi)
alternative label: edustaja
alternative label: valtuutettu
alternative label: ombudsman @sv
definition: Hallituksen poliittinen, sotilaallinen tai kaupallinen edustaja tai jotakin viranomaista edustava virkailija, jota kutsutaan asiamieheksi.
definition: Politiskt, militärt eller kommersiellt ombud, eller tjänsteman som representerar någon myndighet och som benämns ombud. @sv
in scheme: Metatietosanasto
preferred label: ombud (myndighet) @sv
scope note: Käytetään viranomaisasemassa toimivasta henkilöstä, jonka tulkitaan toimivan yhteisönä.
scope note: Används om en person som handlar i myndighetsställning och som fungerar som institution. @sv

poliisi (organisaatio)
type: Concept
source: Kansallinen RDA-termi
source: Nationell RDA-term @sv
created: 2021-04-20
modified: 2024-05-24
alternative label: keskusrikospoliisi
alternative label: poliisi (yhteisötyyppi)
alternative label: poliisilaitos
alternative label: suojelupoliisi
alternative label: turvallisuuspoliisi
alternative label: centralkriminalpolis @sv
alternative label: polis (institutionstyp) @sv
alternative label: polisinrättning @sv
alternative label: skyddspolis @sv
alternative label: säkerhetspolis @sv
definition: Valtiollinen organisaatio, jonka tehtävänä on huolehtia valtio- ja yhteiskuntajärjestyksen sekä yleisen järjestyksen ja turvallisuuden säilymisestä (Arkistojen portti).
definition: Statlig organisation som ansvarar för upprätthållandet av ordning och säkerhet. @sv
in scheme: Metatietosanasto
preferred label: polis (organisation) @sv
scope note: Käytetään myös kaupungeissa järjestyksenpidosta vastanneista poliisilaitoksista. Ei käytetä maaseudulla poliisitoimesta ennen vuoden 1996 kihlakuntauudistusta vastanneista nimismiehistä.
scope note: Används även om polisinrättningar ansvariga för upprätthållandet av ordning i städerna. Används inte om länsmän som svarade för polisväsendet på landsbygden före häradsreformen 1996. @sv

konkurssipesä
type: Concept
source: Kansallinen RDA-termi
source: Nationell RDA-term @sv
created: 2021-04-20
modified: 2024-05-24
definition: Konkurssipesällä tarkoitetaan konkurssivelkojien ja pesänhoitajan kesken jaettua varallisuuden luonteeltaan väliaikaista hallintoa.
definition: Avser tillfällig förvaltning av tillgångar, delad mellan konkursborgenärer och boförvaltare. @sv
in scheme: Metatietosanasto
preferred label: konkursbo @sv

rautatieasema
type: Concept
source: Kansallinen RDA-termi
source: Nationell RDA-term @sv
created: 2021-04-20
modified: 2024-05-24
alternative label: tågstation @sv
definition: Rautatieaseman toiminnasta vastaava viranomainen, joka on nimetty rautatieaseman nimen mukaan.
definition: Myndighet som ansvarar för en järnvägsstations verksamhet, och som är namngiven enligt järnvägsstationens namn. @sv
in scheme: Metatietosanasto
preferred label: järnvägsstation @sv

henkikirjoittaja (viranomainen)
type: Concept
source: Kansallinen RDA-termi
source: Nationell RDA-term @sv
created: 2021-04-20
modified: 2024-05-24
alternative label: henkikirjoittaja (yhteisötyyppi)
alternative label: kihlakunnankirjuri (viranomainen)
alternative label: kihlakunnankirjuri (yhteisötyyppi)
alternative label: rekisteritoimisto
alternative label: häradsskrivare (institutionstyp) @sv
alternative label: mantalsskrivare @sv
alternative label: registerbyrå @sv
definition: Historiallinen termi. Kihlakuntahallinnossa kruununvoutien apuna toiminut virkamies, jonka tehtäviin kuului mm. vero- ja maksuluetteloiden laatiminen, verokannon tarkastaminen ja vuodesta 1779 henkikirjojen laatiminen. Myöhemmin henkikirjoittaja on vastannut myös siviili-, yritys- ja kaupparekisterin pidosta. Henkikirjoittajan kansliat muutettiin vuonna 1970 rekisteritoimistoiksi, joista osa yhdistettiin vuonna 1996 kihlakunnanvirastoihin, osasta tuli uusia maistraatteja. (Arkistojen portti.)
definition: Historisk term. Tjänsteman som fungerade som stöd för kronofogdar i häradsförvaltning och till vars uppgifter hörde bl.a. upprättande av skattelängder och tariffer, kontroll av skatteuppbörd och fr.o.m. år 1779 sammanställande av mantalslängder. Senare har häradsskrivare också svarat för upprätthållande av civil-, företags- och handelsregister. @sv
in scheme: Metatietosanasto
preferred label: häradsskrivare (myndighet) @sv
scope note: Käytetään viranomaisasemassa toimivasta henkilöstä, jonka tulkitaan toimivan yhteisönä.
scope note: Används om person som fungerar i myndighetsställning och som institution. @sv

seurakuntayhtymä
type: Concept
source: Kansallinen RDA-termi
source: Nationell RDA-term @sv
created: 2021-04-20
modified: 2024-05-24
definition: Suomen evankelis-luterilaisen kirkon tai Suomen ortodoksisen kirkon seurakuntien muodostama yhteistyöorganisaatio, joka hoitaa sen perussäännössä määritellyt tehtävät seurakuntien puolesta (Wikipedia).
definition: Samarbetsorganisation bildad av församlingar i Evangelisk-lutherska kyrkan i Finland eller Ortodoxa kyrkan i Finland, som sköter bestämda uppgifter för församlingarnas del. @sv
in scheme: Metatietosanasto
preferred label: kyrklig samfällighet @sv

ritarikunta
type: Concept
source: Kansallinen RDA-termi
source: Nationell RDA-term @sv
created: 2021-04-20
modified: 2024-05-24
alternative label: ritaristo
alternative label: ridderskap @sv
definition: Historiallinen termi. Hengellinen ritarikunta on uskonnollinen ja kirkon tai uskonnollisen yhteisön hallinnoima, ristiretkien aikana syntynyt järjestö, jonka jäsenet noudattivat ritarikunnan sääntöjä (Wikipedia).
definition: Historisk term. En andlig riddarorden var en organisation styrd av kyrkan eller ett annnat religiöst samfund, som uppstod under korstågstiden. @sv
in scheme: Metatietosanasto
preferred label: riddarorden @sv

tiedekunta
type: Concept
source: Kansallinen RDA-termi
source: Nationell RDA-term @sv
created: 2021-04-20
modified: 2024-05-24
definition: Yliopiston tai muun korkeakoulun hallinnollinen perusyksikkö (Kielitoimiston sanakirja).
definition: Administrativ enhet vid universitet eller annan höskola. @sv
in scheme: Metatietosanasto
preferred label: fakultet @sv

merimieshuone
type: Concept
source: Kansallinen RDA-termi
source: Nationell RDA-term @sv
created: 2021-04-20
modified: 2024-05-24
alternative label: merimieshuonelaitos
definition: Merimieshuoneet välittivät työtä laivoille, varmistivat oikean suuruisen palkan maksamisen sekä maksoivat eläkettä ja avustuksia työkyvyttömille ja vanhoille merimiehille ja heidän perheilleen. Suomessa merimieshuoneita toimi 1752-1937. (Arkistojen portti.)
definition: Sjömanshus förmedlade arbete till sjöfarten, kontrollerade att rätt löner betalades, och betalade ut pensioner och stöd till arbetsoförmögna och gamla sjömän och deras familjer. I Finland verkade sjömanshus åren 1752-1937. @sv
in scheme: Metatietosanasto
preferred label: sjömanshus @sv

big band
type: Concept
source: Kansallinen RDA-termi
source: Nationell RDA-term @sv
created: 2021-04-20
modified: 2024-05-24
in scheme: Metatietosanasto
preferred label: storband @sv

edustusto
type: Concept
source: Kansallinen RDA-termi
source: Nationell RDA-term @sv
created: 2021-04-20
modified: 2024-05-24
alternative label: kaupallinen edustusto
alternative label: lähetystö
alternative label: suurlähetystö: konsulaatti
alternative label: yhteystoimisto
alternative label: ambassad @sv
alternative label: beskickning @sv
alternative label: kommersiell representation @sv
definition: Valtion edustuksesta ulkomailla ja kansainvälisissä yhteistyöelimissä vastaavat toimielimet.
definition: Om staters representation utomlands och motsvarande organ i internationella samarbetsorgan. @sv
in scheme: Metatietosanasto
preferred label: representation @sv

äänitysstudio
type: Concept
source: Kansallinen RDA-termi
source: Nationell RDA-term @sv
created: 2021-04-20
modified: 2024-05-24
alternative label: ljudinspelningsstudio @sv
in scheme: Metatietosanasto
preferred label: inspelningsstudio @sv

osakaskunta
type: Concept
source: Kansallinen RDA-termi
source: Nationell RDA-term @sv
created: 2021-04-20
modified: 2024-05-24
alternative label: jakokunta
alternative label: kalastuskunta
alternative label: fiskelag @sv
alternative label: skifteslag @sv
definition: Kiinteistön omistajat, jotka omistavat yhteisen vesi- tms. alueen.
definition: Ägare till en fastighet, som tillsammans äger ett gemensamt vatten- eller annat dylikt område. @sv
in scheme: Metatietosanasto
preferred label: delägarlag @sv

hallitus (valtion hallitus)
type: Concept
source: Kansallinen RDA-termi
source: Nationell RDA-term @sv
created: 2021-04-20
modified: 2024-05-24
definition: Kulloinkin istuva ylintä toimeenpanovaltaa valtiossa käyttävä elin, joka Suomessa nimetään pääministerin mukaan. Voidaan käyttää myös itsehallintoalueen ja osavaltion hallituksesta.
definition: Organ med högsta verkställande makt i en stat, som i Finlands namnges efter statsministern. Kan även användas om regering för autonomt område eller delstat. @sv
example: Kekkosen III hallitus
example: Sanna Marinin hallitus
example: Kekkonens tredje regering @sv
example: Sanna Marins regering @sv
in scheme: Metatietosanasto
preferred label: regering @sv

kanava
type: Concept
source: Kansallinen RDA-termi
source: Nationell RDA-term @sv
created: 2021-04-20
modified: 2024-05-24
definition: Kanavan toiminnasta vastaava viranomainen, joka on nimetty kanavan mukaan.
definition: Myndighet som ansvarar för en kanals verksamhet, och som är namngiven enligt kanalen. @sv
in scheme: Metatietosanasto
preferred label: kanal @sv

kaupanvahvistaja (viranomainen)
type: Concept
source: Kansallinen RDA-termi
source: Nationell RDA-term @sv
created: 2021-04-20
modified: 2024-05-24
alternative label: kaupanvahvistaja (yhteisötyyppi)
alternative label: köpvittne (institutionstyp) @sv
definition: Julkinen kaupanvahvistaja. Viranomainen, joka kutsumansa todistajan kanssa todistaa oikeaksi kiinteistön luovutuskirjan (Kielitoimiston sanakirja).
definition: Offentligt köpvittne. Myndighet som med kallat vittne bestyrker en fastighets överlåtelsebrev. @sv
in scheme: Metatietosanasto
preferred label: köpvittne (myndighet) @sv
scope note: Käytetään viranomaisasemassa toimivasta henkilöstä, jonka tulkitaan toimivan yhteisönä.
scope note: Används om en person som fungerar i myndighetsställning och som institution. @sv

ääni
type: Concept
source: RDA-termi
source: RDA-term @sv
created: 2016-01-08
modified: 2023-05-05
definition: Kuunneltavaksi tarkoitettu muu äänisisältö kuin puhe tai musiikki. Sisältää esim. luonnonäänet, keinotekoisesti tuotetut äänet jne.
definition: Används för ljud avsedda att lyssna på, t.ex. naturljud och ljud framställda på konstgjort sätt. Används inte för tal och musik. @sv
in scheme: Metatietosanasto
preferred label: sounds @en
preferred label: ljud @sv

valtionyhtiö
type: Concept
source: Kansallinen RDA-termi
source: Nationell RDA-term @sv
created: 2021-04-20
modified: 2024-05-24
definition: Valtionyhtiö on joko osakeyhtiö (oy) tai julkinen osakeyhtiö (oyj), jossa valtiolla on määräysvalta (Wikipedia).
definition: Statsbolag är antingen aktiebolag (ab) eller publika aktiebolag (abp), i vilka staten har bestämmanderätt. @sv
in scheme: Metatietosanasto
preferred label: statsbolag @sv
scope note: Termiä valtionyhtiö käytetään termin osakeyhtiö ohella valtion enemmistöomistuksissa olevista yhtiöistä.
scope note: Om bolag i vilka staten är majoritetsägare används förutom termen aktiebolag även termen statsbolag. @sv

luontokeskus
type: Concept
source: Kansallinen RDA-termi
source: Nationell RDA-term @sv
created: 2021-04-20
modified: 2024-05-24
alternative label: naturcentrum @sv
definition: Metsähallituksen hallinnoima suojelu- tai retkeilyalueen läheisyydessä sijaitseva luonnon esittely- ja opastuskeskus.
definition: Informations- och guidningscentrum om naturen som finns i närheten av skydds- eller friluftsområden, förvaltade av Forststyrelsen. @sv
in scheme: Metatietosanasto
preferred label: naturum @sv

lentoasema
type: Concept
source: Kansallinen RDA-termi
source: Nationell RDA-term @sv
created: 2021-04-20
modified: 2024-05-24
alternative label: flygstation @sv
definition: Lentoaseman toiminnasta vastaava viranomainen, joka on nimetty lentoaseman nimen mukaan.
definition: Myndighet som ansvarar för en flygplats verksamhet, och som är namngiven enligt flygplatsens namn. @sv
in scheme: Metatietosanasto
preferred label: flygplats @sv

MOBI
type: Concept
source: Kansallinen RDA-termi
source: Nationell RDA-term @sv
created: 2016-01-08
modified: 2024-05-24
in scheme: Metatietosanasto

digitaalinen
type: Concept
source: RDA-termi
source: RDA-term @sv
created: 2016-01-08
modified: 2023-05-17
definition: Tallentamisen tapa, jossa aineiston sisältö tallennetaan binääristen arvojen jaksoina.
definition: Lagringssätt, i vilket ett materials innehåll lagras som sekvenser med binära värden. @sv
in scheme: Metatietosanasto
preferred label: digital @en

Toimijan suhteet yhteisöön
type: ConceptGroup
type: Collection
created: 2021-09-23
modified: 2024-12-18
member: toimijaan liittyvä yhteisö
preferred label: Aktörers relationer till institutioner @sv

Toimijan suhteet sukuun
type: ConceptGroup
type: Collection
created: 2021-09-23
modified: 2024-12-18
member: toimijaan liittyvä suku
preferred label: Aktörers relationer till släkter @sv

Toimijan suhteet henkilöön
type: ConceptGroup
type: Collection
created: 2021-09-23
modified: 2024-12-18
member: toimijaan liittyvä henkilö
preferred label: Aktörers relationer till personer @sv

Teoksen suhteet
type: ConceptGroup
type: Collection
created: 2021-09-23
modified: 2024-12-18
member: Teoksen suhteet teokseen
member: Teoksen suhteet toimijaan
member: Teoksen suhteet henkilöön
member: Teoksen suhteet yhteisöön
member: Teoksen suhteet ekspressioon
member: Teoksen suhteet manifestaatioon
member: Teoksen suhteet kappaleeseen
preferred label: Verks relationer @sv

Ekspression suhteet
type: ConceptGroup
type: Collection
created: 2021-09-23
modified: 2024-12-18
member: Ekspression suhteet toimijaan
member: Ekspression suhteet henkilöön
member: Ekspression suhteet yhteisöön
member: Ekspression suhteet kappaleeseen
member: Ekspression suhteet teokseen
member: Ekspression suhteet manifestaatioon
member: Ekspression suhteet ekspressioon
preferred label: Uttrycks relationer @sv

Kappaleen suhteet
type: ConceptGroup
type: Collection
created: 2021-09-23
modified: 2024-12-18
member: Kappaleen suhteet toimijaan
member: Kappaleen suhteet kappaleeseen
member: Kappaleen suhteet henkilöön
member: Kappaleen suhteet yhteisöön
member: Kappaleen suhteet manifestaatioon
member: Kappaleen suhteet ekspressioon
member: Kappaleen suhteet teokseen
preferred label: Exemplars relationer @sv

Manifestaation suhteet
type: ConceptGroup
type: Collection
created: 2021-09-23
modified: 2024-12-18
member: Manifestaation suhteet manifestaatioon
member: Manifestaation suhteet toimijaan
member: Manifestaation suhteet yhteisöön
member: Manifestaation suhteet henkilöön
member: Manifestaation suhteet teokseen
member: Manifestaation suhteet kappaleeseen
member: Manifestaation suhteet ekspressioon
preferred label: Manifestationers relationer @sv

Vuoden historiateos
type: Concept
source: Kansallinen RDA-termi
source: Nationell RDA-term @sv
created: 2016-01-08
modified: 2023-05-17
alternative label: Vuoden historiateos -palkinto
alternative label: Årets historieverk-priset @sv
definition: Historian Ystäväin Liiton vuodesta 1973 palkitsema teos, joka on ”erittäin ansiokkaasti edistänyt historiallisen tietämyksen laajenemista ja syvenemistä suomalaisen yleisön keskuudessa”. Vuoden historiateos julkistetaan helmikuisilla Historiapäivillä.
definition: Sedan 1973 har Historievännernas förbund premierat verk som förtjänstfullt bidragit till en ökad och fördjupad historisk insikt hos den finska publiken. Årets historieverk tillkännages i februari under Historiedagarna. @sv
example: MARC 21 -formaatissa: 586 ## ‡a Vuoden historiateos, 2019
example: I MARC 21-formatet: 586 ## ‡a Årets historieverk, 2019 @sv
in scheme: Metatietosanasto
preferred label: Årets historieverk @sv

pehmeäkantinen
type: Concept
source: Kansallinen RDA-termi
source: Nationell RDA-term @sv
created: 2021-10-16
modified: 2024-07-06
alternative label: paperback @en
alternative label: flexikantinen
alternative label: sidottu, pehmeäkantinen
alternative label: flexband @sv
alternative label: inbunden, mjuka pärmar @sv
definition: Taipuisa, usein nidottu. Pehmeät kannet. Pehmeäkantisen kirjan kannet ovat esim. pintakäsiteltyä paperia tai kartonkia. Sisältää myös kangaskirjat, kylpykirjat ja pehmokirjat.
definition: Böjlig, ofta häftad. Mjuka pärmar, gjorda av t.ex. ytbehandlat papper eller kartong. Inkluderar också tyg-, bad- och mjukisböcker. @sv
in scheme: Metatietosanasto
preferred label: softcover @en
preferred label: mjuka pärmar @sv

kovakantinen
type: Concept
source: Kansallinen RDA-termi
source: Nationell RDA-term @sv
created: 2021-10-16
modified: 2024-07-06
alternative label: hardback @en
definition: Taipumaton, usein sidottu. Kovat kannet. Kovakantisen kirjan kannet ovat päällystettyä pahvia. Sisältää myös pahvisivuiset kirjat.
definition: Oböjlig, ofta inbunden. Hårda pärmar, gjorda av överdragen papp. Inkluderar också böcker med pappsidor. @sv
in scheme: Metatietosanasto
preferred label: hardcover @en
preferred label: hårda pärmar @sv

teknistä tietoa musiikista
type: Concept
source: ID.LOC.GOV: Supplementary Content
source: Kansallinen RDA-termi
source: Nationell RDA-term @sv
created: 2021-11-06
modified: 2024-05-24
in scheme: Metatietosanasto
preferred label: teknisk information om musiken @sv

esittäjän tai esittäjäryhmän historia
type: Concept
source: ID.LOC.GOV: Supplementary Content
source: Kansallinen RDA-termi
source: Nationell RDA-term @sv
created: 2021-11-06
modified: 2024-05-24
in scheme: Metatietosanasto
preferred label: biografi över exekutör(er) @sv

Lisätty sisältö
type: ConceptGroup
type: Collection
source: RDA-termi
source: RDA-term @sv
created: 2021-11-06
modified: 2025-04-12
alternative label: Tillagt innehåll @sv
member: teknistä tietoa musiikista
member: esittäjän tai esittäjäryhmän historia
member: julkaisuhistoria
member: tekijän elämäkerta
member: diskografia
member: libretto tai teksti
member: bibliografia
member: aakkosellinen hakemisto
member: nuottiaineisto
member: filmografia
member: kansatieteellistä lisätietoa
member: teknistä/historiallista tietoa soittimista
member: temaattinen teosluettelo
member: oppimateriaali
preferred label: Kompletterande innehåll @sv

julkaisuhistoria
type: Concept
source: ID.LOC.GOV: Supplementary Content
source: Kansallinen RDA-termi
source: Nationell RDA-term @sv
created: 2021-11-06
modified: 2024-05-24
alternative label: utgivningshistoria @sv
in scheme: Metatietosanasto
preferred label: historisk information @sv

tekijän elämäkerta
type: Concept
source: ID.LOC.GOV: Supplementary Content
source: Kansallinen RDA-termi
source: Nationell RDA-term @sv
created: 2021-11-06
modified: 2025-04-10
alternative label: biografi över upphovsman @sv
alternative label: upphovspersonens biografi @sv
in scheme: Metatietosanasto
preferred label: biografi över upphovsperson @sv

diskografia
type: Concept
source: ID.LOC.GOV: Supplementary Content
source: Kansallinen RDA-termi
source: Nationell RDA-term @sv
created: 2021-11-06
modified: 2024-05-24
in scheme: Metatietosanasto
preferred label: diskografi @sv

libretto tai teksti
type: Concept
source: ID.LOC.GOV: Supplementary Content
source: Kansallinen RDA-termi
source: Nationell RDA-term @sv
created: 2021-11-06
modified: 2024-05-24
in scheme: Metatietosanasto
preferred label: libretto eller texthäfte @sv

bibliografia
type: Concept
source: ID.LOC.GOV: Supplementary Content
source: Kansallinen RDA-termi
source: Nationell RDA-term @sv
created: 2021-11-06
modified: 2024-05-24
in scheme: Metatietosanasto
preferred label: bibliografi @sv

aakkosellinen hakemisto
type: Concept
source: ID.LOC.GOV: Supplementary Content
source: Kansallinen RDA-termi
source: Nationell RDA-term @sv
created: 2021-11-06
modified: 2024-05-24
alternative label: alfabetiskt index @sv
in scheme: Metatietosanasto
preferred label: alfabetiskt register @sv

nuottiaineisto
type: Concept
source: ID.LOC.GOV: Supplementary Content
source: Kansallinen RDA-termi
source: Nationell RDA-term @sv
created: 2021-11-06
modified: 2024-05-24
alternative label: musiktryck @sv
in scheme: Metatietosanasto
preferred label: notmaterial @sv

filmografia
type: Concept
source: ID.LOC.GOV: Supplementary Content
source: Kansallinen RDA-termi
source: Nationell RDA-term @sv
created: 2021-11-06
modified: 2024-05-24
in scheme: Metatietosanasto
preferred label: filmografi @sv

kansatieteellistä lisätietoa
type: Concept
source: ID.LOC.GOV: Supplementary Content
source: Kansallinen RDA-termi
source: Nationell RDA-term @sv
created: 2021-11-06
modified: 2024-05-24
in scheme: Metatietosanasto
preferred label: etnologisk information @sv

filmikela
type: Concept
source: RDA-termi
source: RDA-term @sv
created: 2016-01-08
modified: 2023-05-17
definition: Elokuvafilmin sisältävä avoin kela, jota käytetään elokuvaprojektorissa.
definition: Öppen spole som innehåller film och som används i filmprojektor. @sv
in scheme: Metatietosanasto
preferred label: film reel @en
preferred label: filmspole @sv
scope note: Heijastettava kuvatallenne.
scope note: Bärare för projicerbara bilder. @sv

teknistä/historiallista tietoa soittimista
type: Concept
source: ID.LOC.GOV: Supplementary Content
source: Kansallinen RDA-termi
source: Nationell RDA-term @sv
created: 2021-11-06
modified: 2024-05-24
in scheme: Metatietosanasto
preferred label: teknisk eller historisk information om instrument @sv

temaattinen teosluettelo
type: Concept
source: ID.LOC.GOV: Supplementary Content
source: Kansallinen RDA-termi
source: Nationell RDA-term @sv
created: 2021-11-06
modified: 2024-05-24
in scheme: Metatietosanasto
preferred label: tematisk verkförteckning @sv

oppimateriaali
type: Concept
source: ID.LOC.GOV: Supplementary Content
source: Kansallinen RDA-termi
source: Nationell RDA-term @sv
created: 2021-11-06
modified: 2024-05-24
alternative label: läromedel @sv
in scheme: Metatietosanasto
preferred label: pedagogiskt instruktionsmaterial @sv

koordinaattori
type: Concept
source: Kansallinen RDA-termi
source: Nationell RDA-term @sv
created: 2021-11-13
modified: 2025-11-04
in scheme: Metatietosanasto
preferred label: koordinator @sv

suvun kategoria
type: ConceptGroup
type: Collection
source: RDA-termi
source: RDA-term @sv
created: 2021-11-26
modified: 2025-08-21
alternative label: typ av familj/släkt @sv
definition: A type to which a family belongs. @en
definition: Sukuun liittyvä tyyppi tai jaottelu.
definition: Typ eller indelning relaterad till släkt. @sv
member: suku
member: klaani
member: dynastia
member: kuningashuone
preferred label: category of family @en
preferred label: kategori av släkt @sv

suku
type: Concept
source: Kansallinen RDA-termi
source: Nationell RDA-term @sv
created: 2021-11-26
modified: 2024-05-24
alternative label: aatelisperhe
alternative label: aatelissuku
alternative label: pappissuku
alternative label: perhe
alternative label: perhekunta
alternative label: porvarisperhe
alternative label: porvarissuku
alternative label: ruhtinassuku
alternative label: sisarukset (suku)
alternative label: suku (suvun kategoria)
alternative label: sukulaiset
alternative label: talonpoikaissuku
alternative label: adelssläkt @sv
alternative label: adelsätt @sv
alternative label: allmogesläkt @sv
alternative label: bondesläkt @sv
alternative label: borgarsläkt @sv
alternative label: familj @sv
alternative label: furstesläkt @sv
alternative label: prästsläkt @sv
alternative label: släktingar @sv
alternative label: syskon (släkt) @sv
definition: Samasta esivanhemmasta polveutuvat henkilöt (ja joissakin yhteyksissä myös heidän puolisonsa) (Kielitoimiston sanakirja).
definition: Personer som härstammar från samma förfäder (och i vissa sammanhang även makar till personerna) @sv
example: Gummerus (suku); Romanov (suku); Sinebrychoff (suku); Sursill (suku)
example: Gummerus (släkt); Romanov (släkt); Sinebrychoff (släkt); Sursill (släkt) @sv
in scheme: Metatietosanasto
preferred label: family @en
preferred label: släkt @sv

klaani
type: Concept
source: Kansallinen RDA-termi
source: Nationell RDA-term @sv
created: 2021-11-26
modified: 2024-05-24
alternative label: sukuyhteisö (klaani)
definition: Sukuyhteisö, jota kutsutaan klaaniksi ja joka polveutuu tai katsoo polveutuvansa yhteisestä kantaisästä (Kielitoimiston sanakirja).
definition: Släktgemenskap som benämns klan och som härstammar, eller anser sig härstamma, från en gemensam stamfader. @sv
example: Donald (klaani); Ramsay (klaani)
example: Donald (klan); Ramsay (klan) @sv
in scheme: Metatietosanasto
preferred label: clan @en
preferred label: klan @sv

dynastia
type: Concept
source: Kansallinen RDA-termi
source: Nationell RDA-term @sv
created: 2021-11-26
modified: 2024-05-24
alternative label: kuningasperhe
alternative label: kungafamilj @sv
definition: Hallitsijasuku, jota kutsutaan dynastiaksi. Laajemmin hallitsevasta, määräävässä asemassa olevasta ryhmästä (Kielitoimiston sanakirja).
definition: Regentsläkt som benämns dynasti. Vidare om härskande grupp i dominerande ställning. @sv
example: Pahlavi (dynastia : 1925-1979); Romanov (dynastia : 1613-1917)
example: Pahlavi (dynasti : 1925-1979); Romanov (dynasti : 1613-1917) @sv
in scheme: Metatietosanasto
preferred label: dynasty @en
preferred label: dynasti @sv

kuningashuone
type: Concept
source: Kansallinen RDA-termi
source: Nationell RDA-term @sv
created: 2021-11-26
modified: 2024-05-24
alternative label: kuningasperhe
alternative label: kuningassuku
alternative label: kungafamilj @sv
alternative label: kungasläkt @sv
definition: Kuningasperhe tai -suku (Kielitoimiston sanakirja). Termiä käytetään, kun viitataan hallitsevassa asemassa olevaan kuningasperheeseen tai -sukuun. Kuningashuoneen mahdollisesti muodostamasta dynastiasta käytetään termiä dynastia.
definition: Kungafamilj eller -släkt. Termen används när man hänvisar till en regerande kungafamilj eller -släkt. Om dynasti som ett kungahus eventuellt bildar används termen dynasti. @sv
example: Bernadotte (kuningashuone : 1818- : Ruotsi); Bourbon (kuningashuone); Windsor (kuningashuone : 1917- : Iso-Britannia)
example: Bernadotte (kungahus : 1818- : Sverige); Bourbon (kungahus); Windsor (kungahus : 1917- : Storbritannien) @sv
in scheme: Metatietosanasto
preferred label: royal house @en
preferred label: kungahus @sv

Dolby A
type: Concept
source: RDA-termi
source: RDA-term @sv
created: 2016-01-08
modified: 2023-05-17
definition: Dolby Laboratoriesin kehittämä melunvaimennusjärjestelmä ammattimaiseen käyttöön analogisessa magneettinauhassa.
definition: Brusreduceringssystem för analogt magnetband och för professionellt bruk, utvecklat av Dolby Laboratories. @sv
in scheme: Metatietosanasto
preferred label: Dolby-A encoded @en

julkishallinnollisen yhteisön kategoria
type: ConceptGroup
type: Collection
source: RDA-termi
source: RDA-term @sv
created: 2021-12-04
modified: 2025-08-27
alternative label: type of jurisdiction @en
alternative label: hallintoalueen tyyppi
alternative label: Typ av förvaltningsområde @sv
alternative label: kategori för offentligrättslig institution @sv
alternative label: typ av administrativ enhet @sv
definition: A type to which a government belongs. @en
definition: Tyyppi, johon julkishallinnollinen yhteisö kuuluu.
definition: Typ till vilken en offentligrättslig institution hör. @sv
member: piiri (hallintoalue)
member: kunta (hallintoalue)
member: voutikunta
member: hiippakunta
member: osavaltio
member: alusmaa
member: rovastikunta
member: kihlakunta
member: itsehallintoalue
member: vapaaherrakunta
member: maakunta
member: alue (hallintoalue)
member: valtio (hallintoalue)
member: piirikunta
member: lääni
member: kreivikunta
member: seutukunta
preferred label: category of government @en
preferred label: kategori av offentligrättslig institution @sv

voutikunta
type: Concept
source: Kansallinen RDA-termi
source: Nationell RDA-term @sv
created: 2021-12-04
modified: 2025-08-23
definition: Voudin toimialue Ruotsin hallinnossa 1500-luvun alkupuolelta 1630-luvulle, jolloin siirryttiin läänin- ja kihlakuntahallintoon ja voutikunnat lakkasivat olemasta.
definition: Verksamhetsområde för fogde, inom Sveriges administration från början av 1500-talet till 1630-talet. Efter det övergick man till läns- och häradsförvaltning och fögderierna avskaffades. @sv
example: Pohjanmaan eteläinen voutikunta
example: Österbottens södra fögderi @sv
in scheme: Metatietosanasto
preferred label: fögderi @sv

45 kierr./min
type: Concept
source: Kansallinen RDA-termi
source: Nationell RDA-term @sv
created: 2016-01-08
modified: 2024-05-24
in scheme: Metatietosanasto
preferred label: 45 varv./min @sv

Manifestaation suhteet toimijaan
type: ConceptGroup
type: Collection
created: 2016-01-08
modified: 2024-12-18
member: valmistaja
member: kaivertaja
member: paperinvalmistaja
member: litografi
member: valaja
member: etsaaja
member: kuvalaatan valmistaja
member: pistekirjoituksen tekijä
member: lähetyksestä vastaava toimija
member: painolaatan valmistaja
member: graafinen suunnittelija
member: kollotypian valmistaja
member: painaja
member: elokuvan jakelija
member: digitaaliseen sisältöön osallinen toimija
member: tekstiin osallinen toimija
member: maanmittari
member: kartantekijä
member: julkaisemattoman aineiston tuottaja
member: puheeseen osallinen toimija
member: aggregaattiin osallinen toimija
member: koreografiaan osallinen toimija
member: aineiston tekijä
member: stillkuvaan osallinen toimija
member: aineistoon liittyvä toimija
member: liikkuvaan kuvaan osallinen toimija
member: musiikkiin osallinen toimija
member: esineeseen osallinen toimija
member: kustantaja
member: jakelija
preferred label: Manifestationers relationer till aktörer @sv

Lauri Jäntin tietokirjapalkinto
type: Concept
source: Kansallinen RDA-termi
source: Nationell RDA-term @sv
created: 2022-03-15
modified: 2023-05-17
alternative label: Lauri Jänttis pris för facklitteratur @sv
definition: Lauri Jäntin säätiön vuodesta 1985 vuosittain jakama kirjallisuuspalkinto, joka myönnetään edellisenä vuonna ilmestyneelle merkittävälle suomenkieliselle tietokirjalle.
definition: Litteraturpris som sedan år 1985 utdelas årligen av Lauri Jäntti-stiftelsen, åt en betydande finskspråkig bok som utkommit det föregående året. @sv
example: MARC 21 -formaatissa: 586 ## ‡a Lauri Jäntin tietokirjapalkinto, 2006
example: I MARC 21-fältet: 586 ## ‡a Lauri Jäntti-priset för facklitteratur, 2006 @sv
in scheme: Metatietosanasto
preferred label: Lauri Jäntti-priset för facklitteratur @sv

väriaine
type: Concept
source: RDA-termi
source: RDA-term @sv
created: 2016-01-08
modified: 2023-05-17
alternative label: värijauhe
alternative label: färgpulver @sv
definition: Nesteeseen liuenneesta tai sekoittuneesta väristä muodostuva materiaali, joka imeytyy pohjamateriaalin.
definition: Material bestående av färg som lösts upp eller blandats i vätska. @sv
in scheme: Metatietosanasto
preferred label: dye @en
preferred label: färgämne @sv

masternauha
type: Concept
source: RDA-termi
source: RDA-term @sv
created: 2016-01-08
modified: 2023-05-17
definition: Äänitteen sukupolven määrite nauhan alkuperäiselle äänitysversiolle, josta voidaan tehdä kopioita.
definition: Bestämning av generation för ett bands originala inspelningsversion, från vilken kopior kan göras. @sv
in scheme: Metatietosanasto
preferred label: master tape @en
preferred label: masterband @sv

Alkuperäinen taltiointi- ja tallennustekniikka
type: ConceptGroup
type: Collection
source: Kansallinen RDA-termi
source: MARC 21
created: 2022-06-09
modified: 2025-08-27
definition: Miten ääni alun perin taltioitiin ja tallennettiin. Uudelleenjulkaistu äänite koodataan sen mukaan, miten ääni alun perin taltioitiin ja tallennettiin.
definition: Hur ljudet ursprungligen spelades in och lagrades. Återutgivna ljudupptagningar kodas enligt hur ljudet ursprungligen spelades in och lagrades. @sv
member: Sähköinen taltiointi, analoginen suora tallennus
member: Sähköinen taltiointi, digitaalinen tallennus
member: Akustinen taltiointi, analoginen suora tallennus
member: Sähköinen taltiointi, analoginen sähköinen tallennus
member: Tuntematon taltiointi ja tallennus
preferred label: Original capture and storage technique @en
preferred label: Ursprunglig inspelnings- och lagringsteknik @sv

Sähköinen taltiointi, analoginen suora tallennus
type: Concept
source: Kansallinen RDA-termi
source: MARC 21
source: Nationell RDA-term @sv
created: 2022-06-09
modified: 2024-05-24
definition: Mikrofonilla tai vastaavalla laitteella tehty taltiointi suoraan masterlevylle. Tätä tekniikkaa käytettiin kaikilla äänitteillä, jotka taltioitiin mikrofoneilla tai vastaavilla laitteilla vuodesta 1925 aina 1940-luvun lopulle asti. Tätä tekniikkaa on käytetty myös uudemmissa äänitteissä, joissa on "direct to disc" tai vastaava merkintä. Tunnetaan myös nimellä sähkömekaaninen äänitys.
definition: Inspelning med mikrofon eller liknande apparat direkt till en masterskiva. Denna teknik användes för alla ljudinspelningar som spelades in med mikrofon eller liknande apparater från 1925 till slutet av 1940-talet. Tekniken har också använts i nyare ljudupptagningar, som är märkta med ”direct to disc” eller liknande. Även kallad elektromekanisk inspelning. @sv
in scheme: Metatietosanasto
preferred label: Electrical capture, analog direct storage @en
preferred label: Elektrisk inspelning, analog direkt lagring @sv

Sähköinen taltiointi, digitaalinen tallennus
type: Concept
source: Kansallinen RDA-termi
source: MARC 21
source: Nationell RDA-term @sv
created: 2022-06-09
modified: 2024-05-24
definition: Äänitteiden digitaalinen tallennus tuli käyttöön 1980-luvulla. Näissä äänitteissä voi olla "digitally recorded" tai vastaava merkintä. Merkinnät "digital remastering" tai "digital mixing" koskevat taltioinnin ja tallennuksen jälkeisiä prosesseja. Tällaiset merkinnät eivät osoita, että alkuperäinen taltiointi tai tallennus olisivat olleet digitaalisia.
definition: Digital lagring för ljudupptagningar togs i bruk på 1980-talet. Dessa ljudupptagningar kan ha märkningen ”digitally recorded” eller motsvarande. Märkningarna ”digital remastering” eller ”digital mixing” berör processer efter inspelning och lagring, och betyder inte att den ursprungliga inspelningen eller lagringen är digital. @sv
in scheme: Metatietosanasto
preferred label: Electrical capture, digital storage @en
preferred label: Elektrisk inspelning, digital lagring @sv

Akustinen taltiointi, analoginen suora tallennus
type: Concept
source: Kansallinen RDA-termi
source: MARC 21
source: Nationell RDA-term @sv
created: 2022-06-09
modified: 2024-05-24
definition: Levy- tai lieriöäänite, joka on taltioitu käyttäen kuulotorvea ja välikalvoa sekä tallennettu suoraan masterin pinnalle. Ensimmäiset kaupalliset akustiset äänityslaitteet tulivat käyttöön 1877 alkaen ja niitä hyödynnettiin 1920-luvun loppupuolelle. 1925 alkaen niitä käytettiin rinnan sähköisten äänityslaitteiden kanssa.
definition: Skiv- eller cylinderljudupptagning som spelats in med akustiskt horn och membran, och som lagrats direkt på en masters yta. De första kommersiella akustiska inspelningsapparaterna togs i bruk fr.om. 1877 och de användes till slutet av 1920-talet. Efter 1925 användes de parallellt med elektriska inspelningsapparater. @sv
in scheme: Metatietosanasto
preferred label: Acoustical capture, analog direct storage @en
preferred label: Akustisk inspelning, analog direkt lagring @sv

Sähköinen taltiointi, analoginen sähköinen tallennus
type: Concept
source: Kansallinen RDA-termi
source: MARC 21
source: Nationell RDA-term @sv
created: 2022-06-09
modified: 2024-05-24
definition: Sähköisesti taltioitu äänite, joka on tallennettu magneettinauhalle tai vastaavalle medialle. Tähän ryhmään kuuluu suurin osa äänitteistä, jotka on tehty 1940-luvun lopulta siirtymävaiheeseen asti. Siirtymä digitaaliseen tallennukseen kesti noin kymmenen vuotta, 1980-luvun alusta 1990-luvun alkuun.
definition: Elektriskt inspelad ljudupptagning som lagrats på magnetband eller motsvarande media. Till denna grupp hör största delen av ljudinspelningarna från slutet av 1940-talet fram till övergångsskedet till digital lagring som räckte ca 10 år, från början av 1980-talet till början av 1990-talet. @sv
in scheme: Metatietosanasto
preferred label: Electrical capture, analog electrical storage @en
preferred label: Elektrisk inspelning, analog elektrisk lagring @sv

Tuntematon taltiointi ja tallennus
type: Concept
source: Kansallinen RDA-termi
source: MARC 21
source: Nationell RDA-term @sv
created: 2022-06-09
modified: 2024-05-24
definition: Alkuperäistä taltiointi- ja tallennustekniikkaa ei tunneta.
definition: Den ursprungliga inspelnings- och lagringstekniken är inte känd. @sv
in scheme: Metatietosanasto
preferred label: Unknown capture and storage @en
preferred label: Okänd inspelning och lagring @sv

korjauslehti
type: Concept
source: Kansallinen RDA-termi
source: Nationell RDA-term @sv
created: 2022-06-11
modified: 2025-10-04
alternative label: erratablad @sv
alternative label: erratalista @sv
alternative label: korrigeringsblad @sv
definition: Laajuuden yksikkö joka koostuu arkista, johon on koottu julkaisussa havaittujen virheiden luettelo oikaisuineen.
definition: Enhet som består av ett ark, med en förteckning över fel som observerats i publikationen, jämte rättelser av dessa. @sv
in scheme: Metatietosanasto
preferred label: rättelseblad @sv

urheiluseura
type: Concept
source: Kansallinen RDA-termi
source: Nationell RDA-term @sv
created: 2022-08-16
modified: 2024-05-24
alternative label: idrottssällskap @sv
alternative label: sportförening @sv
definition: Yhteisö, joka on perustettu jäsentensä yhteisellä sopimuksella urheilun harjoittamiseksi. Urheiluseura voi olla rekisteröity tai rekisteröimätön yhdistys tai yhtiö.
definition: Institution som grundats genom medlemmarnas gemensamma överenskommelse, för att utöva idrott eller sport. Sammanslutningen kan vara en registrerad eller oregistrerad förening eller ett bolag. @sv
in scheme: Metatietosanasto
preferred label: idrottsförening @sv

jumalolento
type: Concept
source: Kansallinen RDA-termi
source: Nationell RDA-term @sv
created: 2022-11-15
modified: 2024-10-12
alternative label: gud @sv
alternative label: gudaväsen @sv
alternative label: gudom @sv
in scheme: Metatietosanasto
preferred label: gudomligt väsen @sv
scope note: Ei ole RDA:n mukainen toimija.
scope note: Är inte en aktör i enlighet med RDA. @sv

henki
type: Concept
source: Kansallinen RDA-termi
source: Nationell RDA-term @sv
created: 2022-11-15
modified: 2024-05-24
in scheme: Metatietosanasto
preferred label: ande @sv

myyttinen hahmo
type: Concept
source: Kansallinen RDA-termi
source: Nationell RDA-term @sv
created: 2022-11-15
modified: 2025-05-29
alternative label: taruhahmo
alternative label: legendarisk gestalt @sv
alternative label: mytologisk figur @sv
alternative label: mytologisk karaktär @sv
alternative label: mytologiskt väsen @sv
in scheme: Metatietosanasto
preferred label: mytologisk gestalt @sv
scope note: Ei ole RDA:n mukainen toimija.
scope note: Är inte en aktör i enlighet med RDA. @sv

eläin
type: Concept
source: Kansallinen RDA-termi
source: Nationell RDA-term @sv
created: 2022-11-15
modified: 2024-05-24
in scheme: Metatietosanasto
preferred label: djur @sv
scope note: Ei ole RDA:n mukainen toimija.
scope note: Är inte en aktör i enlighet med RDA. @sv

marsalkka
type: Concept
source: Kansallinen RDA-termi
source: Nationell RDA-term @sv
created: 2022-11-15
modified: 2024-05-24
alternative label: Suomen marsalkka
alternative label: Finlands marskalk @sv
alternative label: Marskalken av Finland @sv
in scheme: Metatietosanasto
preferred label: marskalk @sv

muu henkilöön liittyvä määrite
type: ConceptGroup
type: Collection
source: Kansallinen RDA-termi
source: Nationell RDA-term @sv
created: 2022-11-15
modified: 2025-08-14
alternative label: annan bestämning relaterad till person @sv
alternative label: annat epitet relaterat till person @sv
definition: A term other than a term of rank, honour, or office that is associated with a person. @en
definition: Henkilöön liitetty muu määrite kuin arvonimi.
definition: Annat attribut än hederstitel, som relaterar till en person. @sv
member: fiktiivinen hahmo
member: jumalolento
member: henki
member: myyttinen hahmo
member: eläin
member: Raamatun henkilö
preferred label: other designation associated with person @en
preferred label: annat attribut relaterat till person @sv

Raamatun henkilö
type: Concept
source: Kansallinen RDA-termi
source: Nationell RDA-term @sv
created: 2022-11-15
modified: 2024-05-24
in scheme: Metatietosanasto
preferred label: biblisk person @sv

MARC 21 -bibliografiset
type: ConceptGroup
type: Collection
created: 2022-11-16
modified: 2023-05-05
preferred label: MARC 21-bibliografiska @sv

Aineistotyyppi
type: ConceptGroup
type: Collection
created: 2022-11-16
modified: 2023-05-05
alternative label: Resurstyp @sv
definition: Käsiteryhmä koostuu KAM-sektorin (kirjastot, arkistot ja museot) aineistotyypeistä.
definition: Begreppsgruppen består av materialtyper inom biblioteks-, arkiv- och museisektorn. @sv
member: nuottijulkaisu
member: lehtileikkeet
member: nuotti
member: päiväkirja
member: kartta
member: ympäristötaide
member: taideteos
member: käsikirjoitus
member: teksti
member: puhe
member: biotaide
member: kuva
member: piirustus
member: valokuva
member: nuottikäsikirjoitus
member: asiakirja
member: pienpainate
member: rakennus
member: paikka
member: kirja
member: tapahtumatallenne
member: lehti
member: esine
member: tv-ohjelma
member: keruuvastaus
member: grafiikka
member: tietokoneohjelma
member: liikkuva kuva
member: malli
member: muu
member: taideteollisuusesine
member: maalaus
member: taiteilijan työvälineet
member: data
member: ääni
member: painokuva
member: kirje
member: haastattelu
member: esineteos
member: veistos
member: kulttuuriympäristö
member: radio-ohjelma
member: mediataide
member: rakennettu ympäristö
member: elokuva
member: installaatio
member: musiikki
member: muinaisjäännös
member: näyte
preferred label: Materialtyp @sv
scope note: KAM-kuvailuryhmän ohjesivu Aineistotyyppi-termien käyttötavoista

Entiteetin tyyppi
type: ConceptGroup
type: Collection
created: 2022-11-16
modified: 2023-05-05
member: teos
member: ekspressio
member: toimija
member: ei-RDA-entiteetti
preferred label: Entitetstyp @sv

MARC 21 -auktoriteetit
type: ConceptGroup
type: Collection
created: 2022-11-16
modified: 2023-05-05
member: Entiteetin tyyppi
preferred label: MARC 21-auktoriteter @sv

MARC 21
type: ConceptGroup
type: Collection
created: 2022-11-16
modified: 2023-05-05
member: MARC 21 -bibliografiset
member: MARC 21 -auktoriteetit

teos
type: ConceptGroup
type: Collection
created: 2022-11-17
modified: 2023-05-05
preferred label: verk @sv

ekspressio
type: ConceptGroup
type: Collection
created: 2022-11-17
modified: 2023-05-05
preferred label: uttryck @sv

toimija
type: ConceptGroup
type: Collection
created: 2022-11-17
modified: 2023-05-05
alternative label: agent @sv
member: yhteisö
member: henkilö
member: suku
preferred label: aktör @sv

yhteisö
type: Concept
created: 2022-11-17
modified: 2023-05-05
in scheme: Metatietosanasto
preferred label: institution @sv

henkilö
type: Concept
created: 2022-11-17
modified: 2023-05-05
in scheme: Metatietosanasto
preferred label: person @sv

ei-RDA-entiteetti
type: ConceptGroup
type: Collection
created: 2022-11-17
modified: 2023-05-05
preferred label: icke-RDA-entitet @sv

suku
type: Concept
created: 2022-11-17
modified: 2023-05-05
in scheme: Metatietosanasto
preferred label: släkt @sv

Tiedonjulkistamisen valtionpalkinto
type: Concept
source: Kansallinen RDA-termi
source: Nationell RDA-term @sv
created: 2022-12-17
modified: 2023-05-17
definition: Suomen opetus- ja kulttuuriministeriön vuodesta 1968 lähtien myöntämä palkinto ansioista tiedonjulkistamisessa. Palkinto myönnetään ajankohtaisesta tiedonjulkistamistyöstä, jonka tuote voi olla korkeatasoinen tietoteos tai muu tietotuote, kuten kirja, radio- tai TV-esitys, sanoma- tai aikakauslehti tai muu tietotuote.
definition: Pris för förtjänster inom informationsspridning, utdelat av Finlands undervisnings- och kulturministerium sedan år 1968. Priset beviljas för ett aktuellt informationsspridningsarbete, av vilket produkten kan vara ett högklassigt vetenskapligt verk eller någon annan informationsprodukt, såsom en bok, ett radio- eller tv-framförande, en dagstidning, tidskrift eller dylikt. @sv
example: MARC 21 -formaatissa: 586 ## ‡a Tiedonjulkistamisen valtionpalkinto, 2022
example: I MARC 21-formatet: 586 ## ‡a Statens pris för informationsspridning, 2022 @sv
in scheme: Metatietosanasto
preferred label: Statens pris för informationsspridning @sv

myymälä
type: Concept
source: Kansallinen RDA-termi
source: Nationell RDA-term @sv
created: 2023-01-10
modified: 2024-05-24
alternative label: elintarvikekauppa
alternative label: kioski
alternative label: sekatavarakauppa
alternative label: butik @sv
alternative label: diversehandel @sv
alternative label: kiosk @sv
alternative label: livsmedelsaffär @sv
alternative label: livsmedelsbutik @sv
alternative label: matvaruaffär @sv
in scheme: Metatietosanasto
preferred label: affär @sv

Vuoden kristillinen kirja
type: Concept
source: Kansallinen RDA-termi
source: Nationell RDA-term @sv
created: 2016-01-08
modified: 2023-05-17
alternative label: Vuoden kristillinen kirja -palkinto
alternative label: Priset Årets kristna bok @sv
definition: Kristilliset kustantajat ry:n järjestämä kilpailu, jonka voittaja on viime vuosina valittu Helsingin kirjamessujen yhteydessä.
definition: Tävling ordnad av Kristilliset kustantajat ry, vars vinnare under de senaste åren utsetts i samband med Helsingfors bokmässa. @sv
example: MARC 21 -formaatissa: 586 ## ‡a Vuoden kristillinen kirja, 1994
example: I MARC 21-formatet: 586 ## ‡a Årets kristna bok, 1994 @sv
in scheme: Metatietosanasto
preferred label: Årets kristna bok @sv

tuotantolaitos
type: Concept
source: Kansallinen RDA-termi
source: Nationell RDA-term @sv
created: 2023-01-10
modified: 2024-05-24
alternative label: kaivos
alternative label: mylly
alternative label: ruukki
alternative label: sahalaitos
alternative label: tehdas
alternative label: voimala
alternative label: bruk @sv
alternative label: fabrik @sv
alternative label: gruva @sv
alternative label: kraftverk @sv
alternative label: kvarn @sv
alternative label: produktionsinrättning @sv
alternative label: sågverk @sv
in scheme: Metatietosanasto
preferred label: produktionsanläggning @sv
scope note: Käytetään yhteisöstä, kun siinä harjoitettu liiketoiminta on paikallista eivätkä termit yhtiö tai toiminimi kuvaa esim. historiallisista syistä riittävän hyvin yhteisön toimintamuotoa.
scope note: Används om en institution, vars affärsverksamhet är lokal och för vilken termerna bolag eller firmanamn inte är tillräckligt beskrivande, t.ex. av historiska skäl. @sv

paja
type: Concept
source: Kansallinen RDA-termi
source: Nationell RDA-term @sv
created: 2023-01-10
modified: 2024-05-24
alternative label: työpaja
alternative label: verstas
alternative label: smedja @sv
definition: Käsityötä tai pienteollisuutta harjoittava yhteisö.
definition: Institution som bedriver hantverk eller småindustri. @sv
in scheme: Metatietosanasto
preferred label: verkstad @sv

ravitsemisliike
type: Concept
source: Kansallinen RDA-termi
source: Nationell RDA-term @sv
created: 2023-01-10
modified: 2025-05-08
alternative label: baari
alternative label: kahvila
alternative label: krouvi
alternative label: ravintola
alternative label: teehuone
alternative label: bar @sv
alternative label: café @sv
alternative label: förplägningsrörelse @sv
alternative label: kafé @sv
alternative label: krog @sv
alternative label: matservering @sv
alternative label: näringsställe @sv
alternative label: restaurang @sv
alternative label: restaurangrörelse @sv
alternative label: tehus @sv
alternative label: trakteringsställe @sv
in scheme: Metatietosanasto
preferred label: förplägnadsrörelse @sv

majoitusliike
type: Concept
source: Kansallinen RDA-termi
source: Nationell RDA-term @sv
created: 2023-01-10
modified: 2024-05-24
alternative label: hotelli
alternative label: kestikievari
alternative label: lomakylä
alternative label: majatalo
alternative label: matkustajakoti
alternative label: motelli
alternative label: retkeilymaja
alternative label: gästgiveri @sv
alternative label: hotell @sv
alternative label: härbärgeringsrörelse @sv
alternative label: inrättning för kollektiv inkvartering @sv
alternative label: motell @sv
alternative label: resandehem @sv
alternative label: semesterby @sv
alternative label: vandrarhem @sv
alternative label: värdshus @sv
in scheme: Metatietosanasto
preferred label: inkvarteringsrörelse @sv

tanssiryhmä
type: Concept
source: Kansallinen RDA-termi
source: Nationell RDA-term @sv
created: 2023-01-10
modified: 2024-05-24
alternative label: danstrupp @sv
in scheme: Metatietosanasto
preferred label: dansgrupp @sv

yhtymä
type: Concept
source: Kansallinen RDA-termi
source: Nationell RDA-term @sv
created: 2023-01-10
modified: 2024-05-24
alternative label: konserni
alternative label: bolagsgrupp @sv
alternative label: sammanslutning @sv
definition: Useita yrityksiä (yhtiöitä) käsittävä yrityskokonaisuus.
definition: Företagshelhet som omfattar flera företag (bolag). @sv
in scheme: Metatietosanasto
preferred label: koncern @sv

kirjoittajaryhmä
type: Concept
source: Kansallinen RDA-termi
source: Nationell RDA-term @sv
created: 2023-01-10
modified: 2024-05-24
in scheme: Metatietosanasto
preferred label: skrivargrupp @sv

taiteilijaryhmä
type: Concept
source: Kansallinen RDA-termi
source: Nationell RDA-term @sv
created: 2023-01-10
modified: 2024-05-24
in scheme: Metatietosanasto
preferred label: konstnärsgrupp @sv

kirjailijaryhmä
type: Concept
source: Kansallinen RDA-termi
source: Nationell RDA-term @sv
created: 2023-01-10
modified: 2024-05-24
in scheme: Metatietosanasto
preferred label: författargrupp @sv

8 kierr./min
type: Concept
source: Kansallinen RDA-termi
source: Nationell RDA-term @sv
created: 2016-01-08
modified: 2024-05-24
in scheme: Metatietosanasto
preferred label: 8 varv/min @sv

Bibliografinen koko
type: ConceptGroup
type: Collection
source: RDA-termi
source: RDA-term @sv
created: 2016-01-08
modified: 2025-05-13
definition: Liittää manifestaation painetussa tai käsikirjoitusaineistossa kokonaisen arkin ja erillisten lehtien väliseen kokosuhteeseen, joka riippuu siitä, onko arkki kokonainen, leikattu tai taitettu.
definition: Sammankopplar manifestation med ett storleksförhållande mellan hela ark och skilda blad i tryckt eller handskrivet material, som beror på om arket är helt, skuret eller vikt. @sv
member: 48:o
member: 2:o
member: 12:o
member: 8:o
member: 64:o
member: 24:o
member: 32:o
member: 18:o
member: 128:o
member: 96:o
member: 36:o
member: kokoarkki
member: 72:o
member: 4:o
member: 16:o
preferred label: Bibliographic format @en
preferred label: Bokens bibliografiska storlek @sv
scope note: Vanhojen painettujen aineistojen bibliografinen koko merkitään käyttämällä soveltuvaa termiä.
scope note: Den bibliografiska storleken på gamla tryckta resurser anges genom att använda en lämplig term. @sv

heijastettava
type: Concept
source: RDA-termi
source: RDA-term @sv
created: 2016-01-08
modified: 2023-05-05
definition: Viestin sisältää liikkuvaa kuvaa tai stillkuvia ja on tarkoitettu käytettäväksi projektorilla kuten filmiprojektorilla, diaprojektorilla tai piirtoheittimellä. Käsittää viestimet, jotka on tarkoitettu heijastamaan sekä kaksiulotteisia että kolmiulotteisia kuvia.
definition: Mediet innehåller rörliga bilder eller stillbilder och används med hjälp av projektor, såsom filmprojektor, diaprojektor eller overheadprojektor. Omfattar medier som används för att projicera både två- och tredimensionella bilder. @sv
in scheme: Metatietosanasto
preferred label: projected @en
preferred label: projicerad @sv

esine
type: Concept
created: 2023-01-21
modified: 2023-05-05
in scheme: Metatietosanasto
preferred label: föremål @sv

kohtalainen pienennys
type: Concept
source: RDA-termi
source: RDA-term @sv
created: 2016-01-08
modified: 2023-05-17
definition: Pienennyssuhde mikromuotoiselle aineistolle, kun suhde on 31x–60x.
definition: Förminskningsgrad för material i mikroform, då förhållandet är 31x-60x. @sv
in scheme: Metatietosanasto
preferred label: high reduction @en
preferred label: stark förminskning @sv

Blu-ray
type: Concept
source: Kansallinen RDA-termi
source: Nationell RDA-term @sv
created: 2016-01-08
modified: 2024-05-24
in scheme: Metatietosanasto

näyte
type: Concept
created: 2023-01-21
modified: 2023-05-05
in scheme: Metatietosanasto
preferred label: prov @sv

sosionomi
type: Concept
source: Kansallinen RDA-termi
source: Nationell RDA-term @sv
created: 2023-02-24
modified: 2025-11-04
alternative label: sosionomi (ammatti)
alternative label: socionom (yrke) @sv
in scheme: Metatietosanasto
preferred label: socionom @sv

fiktiivinen tapahtuma
type: Concept
source: Kansallinen RDA-termi
source: Nationell RDA-term @sv
created: 2023-06-30
modified: 2025-10-21
in scheme: Metatietosanasto
preferred label: fiktiv händelse @sv
scope note: Ei ole RDA:n mukainen toimija.
scope note: Är inte en aktör i enlighet med RDA. @sv

fiktiivinen rakennus
type: Concept
source: Kansallinen RDA-termi
source: Nationell RDA-term @sv
created: 2023-06-30
modified: 2025-10-21
in scheme: Metatietosanasto
preferred label: fiktiv byggnad @sv
scope note: Ei ole RDA:n mukainen toimija.
scope note: Är inte en aktör i enlighet med RDA. @sv

variantti
type: Concept
source: Kansallinen RDA-termi
source: Nationell RDA-term @sv
created: 2016-01-08
modified: 2025-04-09
example: De cetis: variantti jossa tarkastuspäivämäärä kokonaan painettuna.
example: Variantti, jossa takakanteen on painettu hinta ja palautusviikko-merkintö.
example: variantti: 1858
example: Variant med pris och returvecka på bakpärmen. @sv
example: variant: 1858 @sv
in scheme: Metatietosanasto
preferred label: variant @sv

piika
type: Concept
source: Kansallinen RDA-termi
source: YSO-termi
source: ALLFO-term @sv
source: Nationell RDA-term @sv
created: 2023-06-30
modified: 2024-08-27
in scheme: Metatietosanasto
preferred label: piga @sv

palvelija
type: Concept
source: Kansallinen RDA-termi
source: YSO-termi
source: ALLFO-term @sv
source: Nationell RDA-term @sv
created: 2023-06-30
modified: 2024-08-27
in scheme: Metatietosanasto
preferred label: tjänare @sv

fiktiivinen paikka
type: Concept
source: Kansallinen RDA-termi
source: Nationell RDA-term @sv
created: 2023-06-30
modified: 2025-06-07
alternative label: fiktiv ort @sv
in scheme: Metatietosanasto
preferred label: fiktiv plats @sv

muu yhteisöön liittyvä määrite
type: ConceptGroup
type: Collection
source: Kansallinen RDA-termi
source: Nationell RDA-term @sv
created: 2023-08-29
modified: 2025-08-14
alternative label: annan bestämning relaterat till institution @sv
definition: A characteristic other than place that is associated with corporate body, date associated with corporate body, associated institution, type of corporate body, or type of jurisdiction. @en
definition: Yhteisöön liittyvä määrite, joka on muu kuin paikka, yhteisöön liittyvä ajanjakso, liittyvä yhteisö, yhteisön tyyppi tai hallintoalueen tyyppi.
definition: Attribut relaterat till en institution, som är något annat än en plats, ett tidsavsnitt relaterat till en institution, en relaterad institution, en typ av institution eller en typ av förvaltningsområde. @sv
member: fiktiivinen yhteisö
member: fiktiivinen tapahtuma
member: fiktiivinen rakennus
preferred label: other designation associated with corporate body @en
preferred label: annat attribut relaterat till institution @sv

artikkelikokoelma
type: Concept
source: Kansallinen RDA-termi
source: Nationell RDA-term @sv
created: 2023-12-02
modified: 2024-11-14
in scheme: Metatietosanasto
preferred label: artikelsamling @sv
scope note: Teoksen muoto -termejä käytetään erottamaan toisistaan samannimiset teokset.
scope note: Verkets form-termer används för att åtskilja verk med samma namn. @sv

piste
type: Concept
source: RDA-termi
source: RDA-term @sv
created: 2023-12-08
modified: 2024-01-13
definition: Kartografinen tietotyyppi, joka käyttää pisteitä esittämään geospatiaalisia ominaisuuksia.
definition: Kartografisk datatyp, som använder punkter för att representera geospatiala egenskaper. @sv
in scheme: Metatietosanasto
preferred label: point @en
preferred label: punkt @sv

sinfonia
type: Concept
source: Kansallinen RDA-termi
source: Nationell RDA-term @sv
created: 2023-12-19
modified: 2024-11-14
in scheme: Metatietosanasto
preferred label: symfoni @sv
scope note: Teoksen muoto -termejä käytetään erottamaan toisistaan samannimiset teokset.
scope note: Verkets form-termer används för att åtskilja verk med samma namn. @sv

motetti
type: Concept
source: Kansallinen RDA-termi
source: Nationell RDA-term @sv
created: 2023-12-19
modified: 2024-11-14
in scheme: Metatietosanasto
preferred label: motett @sv
scope note: Teoksen muoto -termejä käytetään erottamaan toisistaan samannimiset teokset.
scope note: Verkets form-termer används för att åtskilja verk med samma namn. @sv

sarja
type: Concept
source: Kansallinen RDA-termi
source: Nationell RDA-term @sv
created: 2023-12-19
modified: 2024-11-14
in scheme: Metatietosanasto
preferred label: serie @sv
scope note: Teoksen muoto -termejä käytetään erottamaan toisistaan samannimiset teokset.
scope note: Verkets form-termer används för att åtskilja verk med samma namn. @sv

kantaatti
type: Concept
source: Kansallinen RDA-termi
source: Nationell RDA-term @sv
created: 2023-12-19
modified: 2024-11-14
in scheme: Metatietosanasto
preferred label: kantat @sv
scope note: Teoksen muoto -termejä käytetään erottamaan toisistaan samannimiset teokset.
scope note: Verkets form-termer används för att åtskilja verk med samma namn. @sv

Manifestaation kategoria
type: ConceptGroup
type: Collection
source: RDA-termi
source: RDA-term @sv
created: 2024-01-27
modified: 2025-04-12
alternative label: Kategori för manifestation @sv
definition: Relates a manifestation to a type to which a manifestation belongs. @en
definition: Liittää manifestaation tyyppiin, johon manifestaatio kuuluu.
definition: Sammankopplar manifestation med typ, till vilken den hör. @sv
member: aggregaatti
preferred label: Category of manifestation @en
preferred label: Kategori av manifestation @sv

aggregaatti
type: Concept
source: Kansallinen RDA-termi
source: Nationell RDA-term @sv
created: 2024-01-27
modified: 2024-02-09
in scheme: Metatietosanasto
preferred label: aggregat @sv

Teoksen suhteet henkilöön
type: ConceptGroup
type: Collection
created: 2024-02-17
modified: 2026-03-03
member: opinnäytteen tarkastaja
member: respondentti
member: tuomari
member: sarjakuvantekijä
member: soitonoppaan tekijä
member: laulunoppaan tekijä
member: suunnittelija
member: muotoilija
member: gratulaation kohde
member: graafikko
member: preeses
member: dramaturgi
member: henkilö muutoksenhakijana
member: henkilö muutoksenhakijan vastapuolena
member: keskustelija
member: henkilökantaja
member: henkilövastaaja
member: sisustusarkkitehti
member: taiteilija
member: arkkitehti
member: vastaanottaja
member: tekstiteoksen kirjoittaja
member: uudelleenmiksaaja
member: kirjoittaja
member: elokuvatuottaja
member: roolittaja
member: julkaisija
member: kuvaaja
member: televisiotuottaja
member: videon musiikin säveltäjä
member: säveltäjä
member: asiantuntija
member: teoksella kunnioitettu henkilö
member: maisema-arkkitehti
member: teoksen tekijä
member: musiikkiteoksen tekstin kirjoittaja
member: televisio-ohjaaja
member: kalligrafi
member: tutkija
member: teoksen haastattelija
member: radio-ohjaaja
member: libretisti
member: metatietokuvailu henkilöstä
member: televisio-ohjelman musiikin säveltäjä
member: toimituspäällikkö
member: kuvaus henkilöstä
member: radiotuottaja
member: kirjataiteilija
member: henkilövastaaja siviilioikeudessa
member: elokuvan musiikin säveltäjä
member: kokousten raportoija
member: kokoaja
member: elokuvaohjaaja
member: akateeminen ohjaaja
member: ohjaaja
member: järjestäjä
member: teoksen kartantekijä
member: toimeksiantaja
member: opinnäytteen ohjaaja
member: aiheena oleva henkilö
member: henkilövastaaja rikosoikeudessa
member: designer
member: ohjelmoija
member: projektin ohjaaja
member: elokuvantekijä
member: tuottaja
member: kokoelman luetteloija
member: koostaja
member: koreografi
member: teoksen omistuksen tekijä
member: äänituottaja
member: sanoittaja
member: kuvanveistäjä
member: kadenssin säveltäjä
member: kokoelman muodostaja
member: teokseen liittyvä henkilö

Ekspression suhteet henkilöön
type: ConceptGroup
type: Collection
created: 2024-02-17
modified: 2026-03-10
member: sormituksen tekijä
member: päätoimittaja
member: sanoittaja (ekspressio)
member: äänitaiteilija (ekspressio)
member: selostaja
member: dramaturgi (ekspressio)
member: kuvatoimittaja
member: kielentarkastaja
member: videoteknikko
member: keskustelija (ekspressio)
member: sukututkija
member: tehtävien tekijä
member: kertoja
member: esittäjä
member: sensori
member: äänisuunnittelija
member: esitykseen osallinen henkilö
member: kääntäjä
member: ääninäyttelijä
member: värittäjä
member: yhdistymään osallinen henkilö
member: DJ
member: moderoija
member: haastattelija (ekspressio)
member: teoksen version tekijä
member: leikkaaja
member: liikkuvaan kuvaan osallistuja
member: musiikkiohjelmoija
member: haastateltava (ekspressio)
member: opettaja
member: ohjelmistokehittäjä
member: esittelijä
member: ääniteknikko
member: kuoronjohtaja
member: johtaja
member: juontaja
member: tarkistaja
member: puvustaja
member: transkriboija
member: erikoistehosteiden tekijä
member: entisöijä (ekspressio)
member: toimittaja
member: esittämisestä vastaava henkilö
member: tuotantosuunnittelija
member: näyttelijä
member: puhuja
member: animaattori
member: sovittaja
member: panelisti
member: laulaja
member: lyhentäjä
member: lavastaja
member: taltioija
member: nukettaja
member: visuaalisten tehosteiden tekijä
member: näyttämöohjaaja
member: valosuunnittelija
member: tanssija
member: tuomioistuimen kirjuri
member: tarinankertoja
member: miksaaja
member: äänittäjä
member: pöytäkirjan laatija
member: musiikillinen johtaja
member: kapellimestari
member: soittaja
member: kommentaattori
member: versioon liittyvä henkilö
member: tekstaaja
member: maskeeraaja
member: dubbausohjaaja
member: piirtäjä
member: selkomukauttaja
member: lausuja
member: tuottaja (ekspressio)
member: lukija

Kappaleen suhteet henkilöön
type: ConceptGroup
type: Collection
created: 2024-02-17
modified: 2024-12-18
member: omistuskirjoituksen kirjoittaja
member: lisähuomautusten kirjoittaja
member: nimikirjoituksen kirjoittaja
member: gratulaation kirjoittaja
member: kappaleen entisöijä
member: muokkaaja
member: kappaleen omistuksen kohde
member: nykyinen omistaja
member: omistaja
member: sitoja
member: säilyttäjä
member: kappaleeseen liittyvä henkilö
member: kappaleella kunnioitettu henkilö
member: myyjä
member: illuminoinnin tekijä
member: lahjoittaja
member: tallettaja
member: aiempi omistaja
preferred label: Exemplars relationer till personer @sv

Kappaleen suhteet yhteisöön
type: ConceptGroup
type: Collection
created: 2024-02-17
modified: 2024-12-18
member: kappaleella kunnioitettu yhteisö
member: omistaja
member: lahjoittaja
member: kappaleen entisöijä
member: aiempi omistaja
member: tallettaja
member: sitoja
member: säilyttäjä
member: muokkaaja
member: illuminoinnin tekijä
member: kappaleen omistuksen kohde
member: kappaleeseen liittyvä yhteisö
member: nykyinen omistaja
member: myyjä
preferred label: Exemplars relationer till institutioner @sv

ArcInfo
type: Concept
source: Kansallinen RDA-termi
source: Nationell RDA-term @sv
created: 2016-01-08
modified: 2024-05-24
in scheme: Metatietosanasto

Manifestaation suhteet yhteisöön
type: ConceptGroup
type: Collection
created: 2024-02-17
modified: 2026-03-24
member: aggregaattiin osallinen yhteisö
member: laulaja
member: elokuvaohjaaja
member: haastattelija
member: kartantekijä
member: moderoija
member: digitaaliseen sisältöön osallinen yhteisö
member: televisio-ohjaaja
member: kuvittaja
member: ääniteknikko
member: aineiston tekijä
member: pöytäkirjan laatija
member: leikkaaja
member: esineeseen osallinen yhteisö
member: julkaisemattoman aineiston tuottaja
member: visuaalisten tehosteiden tekijä
member: paperinvalmistaja
member: esittelijä
member: kuvaaja
member: painaja
member: tuomioistuimen kirjuri
member: tekstiin osallinen yhteisö
member: kääntäjä
member: dubbausohjaaja
member: liikkuvan kuvan puhuja
member: näyttämöohjaaja
member: sarjakuvantekijä
member: näyttelijä
member: maanmittari
member: nukettaja
member: liikkuvaan kuvaan osallinen yhteisö
member: sanoittaja
member: sensori
member: kuvalaatan valmistaja
member: DJ
member: taiteilija
member: designer
member: televisiotuottaja
member: raportoija
member: taltioija
member: johtaja
member: valaja
member: arkkitehti
member: puheen puhuja
member: sovittaja
member: transkriboija
member: haastateltava
member: puvustaja
member: opinnäytteen tarkastaja
member: elokuvan jakelija
member: esittäjä
member: juontaja
member: valmistaja
member: aineistoon liittyvä yhteisö
member: valokuvaaja
member: kollotypian valmistaja
member: painolaatan valmistaja
member: opettaja
member: ohjelmoija
member: litografi
member: kommentaattori
member: erikoistehosteiden tekijä
member: jakelija
member: kertoja
member: maskeeraaja
member: lukija
member: lähetyksestä vastaava yhteisö
member: kuvanveistäjä
member: koreografi (manifestaatio)
member: liikkuvan kuvan värittäjä
member: käsikirjoittaja
member: miksaaja

Teoksen suhteet yhteisöön
type: ConceptGroup
type: Collection
created: 2024-02-17
modified: 2026-03-03
member: sääntöjen ohjaama tuomioistuin
member: tuotantoyhtiö
member: oppiarvon myöntävä yhteisö
member: yhteisö muutoksenhakijana
member: yhteisö muutoksenhakijan vastapuolena
member: yhteisökantaja
member: yhteisövastaaja
member: isäntäorganisaatio
member: valtiosopimuksen allekirjoittaja
member: säätävä hallintoelin
member: teos omistettu
member: tekstiteoksen kirjoittaja
member: televisio-ohjaaja
member: vastaanottaja
member: kokoelman muodostaja
member: tuottaja
member: kokousten raportoija
member: säveltäjä
member: kokoaja
member: koostaja
member: televisiotuottaja
member: yhteisövastaaja siviilioikeudessa
member: aiheena oleva yhteisö
member: teoksen valokuvaaja
member: teoksen omistuksen kohde
member: toimituspäällikkö
member: roolittaja
member: uudelleenmiksaaja
member: toimeksiantaja
member: sanoittaja
member: kirjoittaja
member: koreografi
member: teoksen kartantekijä
member: teokseen liittyvä yhteisö
member: yhteisövastaaja rikosoikeudessa
member: teoksen perustaja
member: teoksen tekijä
member: elokuvan musiikin säveltäjä
member: libretisti
member: videon musiikin säveltäjä
member: äänituottaja
member: kuvaus yhteisöstä
member: tutkija
member: kirjataiteilija
member: taiteilija
member: radio-ohjaaja
member: asiantuntija
member: teoksen haastattelija
member: teoksen sponsori
member: elokuvatuottaja
member: kuvaaja
member: ohjelmoija
member: järjestäjä
member: arkkitehti
member: radiotuottaja
member: käsikirjoittaja
member: elokuvaohjaaja
member: teoksella kunnioitettu yhteisö
member: televisio-ohjelman musiikin säveltäjä
member: teoksen haastateltava
member: maisema-arkkitehti
member: ohjaaja
member: elokuvantekijä
member: kalligrafi
member: musiikkiteoksen tekstin kirjoittaja
member: kadenssin säveltäjä
member: kuvanveistäjä
member: designer
member: metatietokuvailu yhteisöstä
member: julkaisija
member: teoksen omistuksen tekijä
member: keksijä
member: kokoelman luetteloija
member: sävellyksen täydentäjä
member: lisätyn sanoituksen kirjoittaja

Ekspression suhteet yhteisöön
type: ConceptGroup
type: Collection
created: 2024-02-17
modified: 2026-03-10
member: soittaja
member: esittäjä
member: musiikkiohjelmoija
member: värittäjä
member: haastattelija (ekspressio)
member: sovittaja
member: esittelijä
member: lyhentäjä
member: DJ
member: toimittaja
member: transkriboija
member: liikkuvaan kuvaan osallistuja
member: kuoronjohtaja
member: musiikillinen johtaja
member: esitykseen osallinen yhteisö
member: laulaja
member: valosuunnittelija
member: erikoistehosteiden tekijä
member: äänisuunnittelija
member: tekstaaja
member: haastateltava (ekspressio)
member: entisöijä (ekspressio)
member: piirtäjä
member: panelisti
member: tuotantosuunnittelija
member: leikkaaja
member: ääninäyttelijä
member: tarinankertoja
member: kääntäjä
member: näyttämöohjaaja
member: puhuja
member: johtaja
member: lavastaja
member: animaattori
member: teoksen version tekijä
member: pöytäkirjan laatija
member: maskeeraaja
member: tanssija
member: tarkistaja
member: moderoija
member: juontaja
member: kertoja
member: näyttelijä
member: nukettaja
member: yhdistymään osallinen yhteisö
member: ääniteknikko
member: kommentaattori
member: opettaja
member: kapellimestari
member: miksaaja
member: puvustaja
member: ohjelmistokehittäjä
member: versioon liittyvä yhteisö
member: sensori
member: dubbausohjaaja
member: tuomioistuimen kirjuri
member: taltioija
member: äänittäjä
member: visuaalisten tehosteiden tekijä
member: esittämisestä vastaava yhteisö
member: selkomukauttaja
preferred label: Uttrycks relationer till institutioner @sv

Manifestaation suhteet henkilöön
type: ConceptGroup
type: Collection
created: 2024-02-17
modified: 2026-03-10
member: esittäjä
member: aggregaattiin osallinen henkilö
member: erikoistehosteiden tekijä
member: jakelija
member: koreografi (manifestaatio)
member: elokuvan jakelija
member: dubbausohjaaja
member: liikkuvan kuvan tanssija
member: liikkuvaan kuvaan osallinen henkilö
member: liikkuvan kuvan äänisuunnittelija
member: lavastaja
member: ääniteknikko
member: näyttämöohjaaja
member: ohjelmistokehittäjä
member: laulaja
member: puvustaja
member: kartantekijä
member: taltioija
member: tutkija
member: tekstaaja
member: keksijä
member: esineeseen osallinen henkilö
member: piirtäjä
member: musiikin äänittäjä
member: musiikkiin osallinen henkilö
member: elokuvatuottaja
member: valokuvaaja
member: puheeseen osallinen henkilö
member: aineiston tekijä
member: stillkuvan arkkitehti
member: elokuvantekijä
member: sensori
member: elokuvaohjaaja
member: sovittaja
member: kuvalaatan valmistaja
member: arkkitehti
member: kaivertaja
member: lähetyksestä vastaava henkilö
member: liikkuvan kuvan puhuja
member: soittaja
member: moderoija
member: televisiotuottaja
member: transkriboija
member: esittelijä
member: panelisti
member: kuvaaja
member: stillkuvaan osallinen henkilö
member: paperinvalmistaja
member: litografi
member: kertoja
member: maanmittari
member: miksaaja
member: liikkuvan kuvan esittäjä
member: kirjoittaja
member: puheen äänisuunnittelija
member: kuvanveistäjä
member: tuotantosuunnittelija
member: musiikkiohjelmoija
member: valosuunnittelija
member: kuvittaja
member: nukettaja
member: kirjataiteilija
member: sarjakuvantekijä
member: painolaatan valmistaja
member: designer
member: julkaisemattoman aineiston tuottaja
member: maskeeraaja
member: DJ
member: lukija
member: tekstiin osallinen henkilö
member: painaja
member: graafinen suunnittelija
member: kollotypian valmistaja

filologi
type: Concept
source: Kansallinen RDA-termi
source: Nationell RDA-term @sv
created: 2024-02-29
modified: 2025-11-04
in scheme: Metatietosanasto
preferred label: filolog @sv

4:o
type: Concept
source: RDA-termi
source: RDA-term @sv
created: 2016-01-08
modified: 2025-05-13
definition: Bibliografinen koko muodostuu yhdestä tai useammasta lehdestä, jotka ovat kooltaan 1/4 arkista.
definition: Bokens format består av ett eller flera blad som till sin storlek är 1/4 av ett tryckark. @sv
in scheme: Metatietosanasto
preferred label: 4to @en

useampana yksikkönä ilmestyvä aineisto
type: Concept
source: RDA-termi
source: RDA-term @sv
created: 2024-03-13
modified: 2024-05-14
definition: Julkaisutapa, jossa manifestaatio ilmestyy moniosaisena fyysisenä yksikkönä tai moniosaisena loogisena aineettomana kokonaisuutena.
definition: Utgivningssätt som innebär att en manifestation utkommer som en fysisk enhet i flera delar eller som en logisk immateriell helhet i flera delar. @sv
in scheme: Metatietosanasto
preferred label: multiple unit @en
preferred label: resurs utkommen som flera enheter @sv

tavunuottikirjoitus
type: Concept
source: RDA-termi
source: RDA-term @sv
created: 2024-03-14
modified: 2026-03-03
alternative label: solmisaatio
alternative label: tonic sol-fa
alternative label: stavelsenotation @sv
definition: Nuottikirjoituksen tyyppi, jossa sävelkorkeus merkitään määrätyillä tavuilla.
definition: Typ av notskrift, i vilken tonhöjd anges med konventionella stavelser. @sv
in scheme: Metatietosanasto
preferred label: syllabic notation @en
preferred label: syllabisk notation @sv

esitetty liike
type: Concept
source: RDA-termi
source: RDA-term @sv
created: 2024-03-14
modified: 2024-05-14
definition: Sisältötyyppi, joka koostuu visuaalisessa muodossa olevan koreografian kautta ilmaistusta sisällöstä.
definition: Innehållstyp som består av innehåll uttryckt genom koreografi i visuell form. @sv
in scheme: Metatietosanasto
preferred label: performed movement @en
preferred label: framförd rörelse @sv

negatiivikopio
type: Concept
source: RDA-termi
source: RDA-term @sv
created: 2024-03-14
modified: 2024-05-14
alternative label: negativkopia @sv
definition: Sukupolvi, joka on master-positiivista, muusta positiivista tai alkuperäisestä negatiivista valmistettu negatiivi. Negatiivikopiota käytetään positiivivedosten valmistamiseen.
definition: Generation som är ett negativ gjort av ett master positiv, något annat positiv eller ett originalnegativ. Duplikatnegativ används för tillverkning av positivkopior. @sv
in scheme: Metatietosanasto
preferred label: duplicate negative @en
preferred label: duplikatnegativ @sv

kuvitettu
type: Concept
source: Kansallinen RDA-termi
source: Nationell RDA-term @sv
created: 2024-03-16
modified: 2025-11-04
in scheme: Metatietosanasto
preferred label: illustrationer @sv
scope note: MARC 21 300 ‡b-kentässä: kuvitettu
scope note: MARC 21 i 300 ‡b-fältet: illustrationer @sv

yksirivinen
type: Concept
source: RDA-termi
source: RDA-term @sv
created: 2024-03-19
modified: 2024-06-07
preferred label: single line @en
definition: Layout, jossa yksittäisten musiikki-instrumenttien stemmat tai soolot on esitetty nuottikirjoituksessa kahden-viiden rivin lohkoissa. Ensimmäinen rivi osoittaa tahdin numeron tai harjoitusnumeron.
definition: Layout i vilken enskilda musikinstruments stämmor eller solon presenteras i segment med två till fem rader i notskriften. Den första raden anger taktnummer eller övningsnummer. @sv
in scheme: Metatietosanasto
preferred label: enkelradig @sv

passiivinen
type: Concept
source: RDA-termi
source: RDA-term @sv
created: 2024-03-20
modified: 2024-05-09
definition: Kokoelman kartuttamisen linja, jossa lisätään kappaleita kokoelmaan, kun kappaleet kuuluvat kokoelman soveltamisalaan mutta on hankittu muista syistä.
definition: Metod för utökning av samling, som innebär att exemplar läggs till samlingen då exemplaren hör till samlingens tillämpningsområde, men är inskaffade av andra skäl. @sv
in scheme: Metatietosanasto
preferred label: passive @en
preferred label: passiv @sv

Kokoelman kartuttamisen linja
type: ConceptGroup
type: Collection
source: RDA-termi
source: RDA-term @sv
created: 2024-03-20
modified: 2024-05-09
definition: Liittää teoksen kokoelmateoksen manifestaatioon lisättävien kappaleiden valitsemisen linjaan.
definition: Sammankopplar verk med policy för val av exemplar som ska läggas till en manifestation av ett samlingsverk. @sv
member: passiivinen
member: suljettu
member: aktiivinen
member: valikoiva
preferred label: Collection accrual policy @en
preferred label: Accessionspolicy för samlingen @sv

laina
type: Concept
source: RDA-termi
source: RDA-term @sv
created: 2024-03-20
modified: 2024-05-09
definition: Kokoelman kartuttamisen menetelmä, jossa lisätään kappaleita kokoelmaan määrätyksi tai avoimeksi ajanjaksoksi ilman omistusoikeuden siirtoa tai maksutapahtumaa.
definition: Metod för utökning av samling, som innebär att exemplar läggs till samlingen för en bestämd eller öppen tid, utan överföring av äganderätt eller betalningstransaktion. @sv
in scheme: Metatietosanasto
preferred label: loan @en
preferred label: lån @sv

Kokoelman kartuntamenetelmä
type: ConceptGroup
type: Collection
source: RDA-termi
source: RDA-term @sv
created: 2024-03-20
modified: 2024-05-09
definition: Liittää teoksen kokoelmateoksen manifestaatioon lisättävien kappaleiden haltijuuden siirron menetelmään.
definition: Sammankopplar verk med metod för byte av innehavare av exemplar som läggs till en manifestation av ett samlingsverk. @sv
member: laina
member: osto
member: lisenssi
member: talletus
member: lahjoitus
preferred label: Collection accrual method @en
preferred label: Accessionsmetod för samlingen @sv

osto
type: Concept
source: RDA-termi
source: RDA-term @sv
created: 2024-03-20
modified: 2024-05-09
alternative label: inköp @sv
definition: Kokoelman kartuttamisen menetelmä, jossa lisätään kappaleita kokoelmaan pysyvästi omistusoikeuden siirrolla ja maksutapahtumalla.
definition: Metod för utökning av samling, som innebär att exemplar läggs till samlingen permanent med överföring av äganderätt och betalningstransaktion. @sv
in scheme: Metatietosanasto
preferred label: purchase @en
preferred label: köp @sv

lisenssi
type: Concept
source: RDA-termi
source: RDA-term @sv
created: 2024-03-20
modified: 2024-05-09
definition: Kokoelman kartuttamisen menetelmä, jossa lisätään kappaleita kokoelmaan määrätyksi tai avoimeksi ajanjaksoksi ilman omistusoikeuden siirtoa mutta maksutapahtumalla.
definition: Metod för utökning av samling, som innebär att exemplar läggs till samlingen för en bestämd eller öppen tid, utan överföring av äganderätt men med betalningstransaktion. @sv
in scheme: Metatietosanasto
preferred label: license @en
preferred label: licens @sv

talletus
type: Concept
source: RDA-termi
source: RDA-term @sv
created: 2024-03-20
modified: 2024-05-09
definition: Kokoelman kartuttamisen menetelmä, jossa lisätään kappaleita kokoelmaan pysyvästi ilman omistusoikeuden siirtoa tai maksutapahtumaa.
definition: Metod för utökning av samling, som innebär att exemplar läggs till samlingen perament utan överföring av äganderätt eller betalningstransaktion. @sv
in scheme: Metatietosanasto
preferred label: deposit @en
preferred label: deposition @sv

suljettu
type: Concept
source: RDA-termi
source: RDA-term @sv
created: 2024-03-20
modified: 2024-05-09
definition: Kokoelman kartuttamisen linja, jossa ei lisätä kappaleita kokoelmaan.
definition: Policy för utökning av samling, som innebär att exemplar inte läggs till samlingen. @sv
in scheme: Metatietosanasto
preferred label: closed @en
preferred label: stängd @sv

lahjoitus
type: Concept
source: RDA-termi
source: RDA-term @sv
created: 2024-03-20
modified: 2024-05-09
definition: Kokoelman kartuttamisen menetelmä, jossa lisätään kappaleita kokoelmaan pysyvästi omistusoikeuden siirrolla mutta ilman maksutapahtumaa.
definition: Metod för utökning av samling, som innebär att exemplar läggs till en samling permanent genom överföring av äganderätt, men utan betalningstransaktion. @sv
in scheme: Metatietosanasto
preferred label: donation @en

aktiivinen
type: Concept
source: RDA-termi
source: RDA-term @sv
created: 2024-03-20
modified: 2024-05-09
definition: Kokoelman kartuttamisen linja, jossa etsitään, hankitaan ja lisätään kappaleita kokoelmaan.
definition: Policy för utökning av samling, som innebär att man söker, förvärvar och lägger till exemplar till samlingen. @sv
in scheme: Metatietosanasto
preferred label: active @en
preferred label: aktiv @sv

valikoiva
type: Concept
source: RDA-termi
source: RDA-term @sv
created: 2024-03-20
modified: 2024-05-09
definition: Kokoelman kartuttamisen linja, jossa lisätään kappaleita kokoelman yhteen tai useampaan alakokoelmaan.
definition: Policy för utökning av samling, som innebär att exemplar läggs till en eller flera av samlingens delsamlingar. @sv
in scheme: Metatietosanasto
preferred label: selective @en
preferred label: selektiv @sv

Laajennussuunnitelma
type: ConceptGroup
type: Collection
source: RDA-termi
source: RDA-term @sv
created: 2024-03-22
modified: 2024-05-09
alternative label: Utökningsplan @sv
definition: Liittää teoksen luokitukseen, joka kuvastaa aikomusta laajentaa teoksen sisältöä.
definition: Sammankopplar verk med en kategorisering som beskriver en intention om att utvidga verkets innehåll. @sv
member: peräkkäinen määrätty suunnitelma
member: päivittyvä määrittämätön suunnitelma
member: staattinen suunnitelma
member: päivittyvä määrätty suunnitelma
member: peräkkäinen määrittämätön suunnitelma
preferred label: Extension plan @en
preferred label: Utvidgningsplan @sv

DVD-videolevy
type: Concept
source: Kansallinen RDA-termi
source: Nationell RDA-term @sv
created: 2016-01-08
modified: 2025-10-31
in scheme: Metatietosanasto
preferred label: DVD-videoskiva @sv

pahvikirjan sidos
type: Concept
source: RDA-termi
source: RDA-term @sv
created: 2024-03-22
modified: 2024-05-16
definition: Sidonnan tyyppi paksusta pahvista tehdyille arkeille ja kansille, jotka on taitettu ja sidottu selkämykseksi.
definition: Typ av bindning, med ark och pärmar av tjock kartong, som är vikta och bundna som en rygg. @sv
in scheme: Metatietosanasto
preferred label: board book binding @en
preferred label: kartongbokbindning @sv

peräkkäinen määrätty suunnitelma
type: Concept
source: RDA-termi
source: RDA-term @sv
created: 2024-03-22
modified: 2024-05-14
definition: Laajennussuunnitelma teokselle, joka on tarkoitettu toteutettavaksi useissa erillisissä ekspressiossa, jotka toteutuvat rajatun ajanjakson sisällä.
definition: Utvidgningsplan för ett verk som är avsett att förverkligas i flera skilda uttryck inom en begränsad tidsperiod. @sv
in scheme: Metatietosanasto
preferred label: successive determinate plan @en
preferred label: successiv bestämd plan @sv

päivittyvä määrittämätön suunnitelma
type: Concept
source: RDA-termi
source: RDA-term @sv
created: 2024-03-22
modified: 2024-05-14
definition: Laajennussuunnitelma teokselle, joka on tarkoitettu toteutettavaksi yhdessä erillisessä ekspressiossa, joka toteutuu avoimen ajanjakson sisällä.
definition: Utvidgningsplan för ett verk som är avsett att förverkligas i ett skilt uttryck inom en öppen tidsperiod. @sv
in scheme: Metatietosanasto
preferred label: integrating indeterminate plan @en
preferred label: integrerande obestämd plan @sv

jousiselkäinen sidos
type: Concept
source: RDA-termi
source: RDA-term @sv
created: 2024-03-22
modified: 2024-05-11
alternative label: klämrygg @sv
definition: Sidonnan tyyppi, joka puristaa jokaisen arkin reunan selkämykseen ja päällykseen kiinnitettyyn jouseen. Jousi voidaan aukaista arkin poistamiseksi tai lisäämiseksi.
definition: Typ av bindning, som klämmer åt varje arks kant med en fjäder som fästs i ryggen och omslaget. Fjädern kan öppnas för att ta bort eller lägga till ark. @sv
in scheme: Metatietosanasto
preferred label: springback binding @en
preferred label: klämbindning @sv

kampasidos
type: Concept
source: RDA-termi
source: RDA-term @sv
created: 2024-03-22
modified: 2024-05-11
definition: Sidonnan tyyppi, jossa useat lähekkäin sijoitetut ja taivutetut metalli- tai muoviliuskat on pujotettu läpi arkkien reunassa olevista reijistä.
definition: Typ av bindning, i vilken flera tätt placerade och böjda metall- eller plastremsor är trädda genom hål i arkens kanter. @sv
in scheme: Metatietosanasto
preferred label: comb binding @en
preferred label: kambindning @sv

staattinen suunnitelma
type: Concept
source: RDA-termi
source: RDA-term @sv
created: 2024-03-22
modified: 2024-05-14
definition: Laajennussuunnitelma teokselle, joka on tarkoitettu toteutettavaksi yhdessä tai useammassa erillisessä ekspressiossa, jotka kaikki toteutuvat yhtäaikaisesti.
definition: Utvidgningsplan för ett verk som är avsett att förverkligas i ett eller flera uttryck, som alla förverkligas samtidigt. @sv
in scheme: Metatietosanasto
preferred label: static plan @en
preferred label: statisk plan @sv

Vuorovaikutteisuuden aste
type: ConceptGroup
type: Collection
source: RDA-termi
source: RDA-term @sv
created: 2024-03-22
modified: 2024-05-09
definition: Liittää ekspression sisällön kykyyn vastata käyttäjän suorittamiin toimintoihin.
definition: Sammankopplar uttryck med förmåga hos innehåll att svara på aktiviteter som användaren utför. @sv
member: interaktiivinen
member: ei-interaktiivinen
preferred label: Interactivity mode @en
preferred label: Interaktivitetsgrad @sv

liukuva sidos
type: Concept
source: RDA-termi
source: RDA-term @sv
created: 2024-03-22
modified: 2024-06-07
definition: Sidonnan tyyppi, joka käyttää metallisia tai muovisia C-muotoon taivutettuja pätkiä, jotka liukuvat yli arkkien reunan kiinnittäen ne paikoilleen.
definition: Typ av bindning, med metall- eller plastbitar böjda i C-form, som glider över arkens kanter och fäster dem. @sv
in scheme: Metatietosanasto
preferred label: slide binding @en
preferred label: glidande bindning @sv

satulaommelsidos
type: Concept
source: RDA-termi
source: RDA-term @sv
created: 2024-03-22
modified: 2024-05-11
alternative label: sadelhäftning @sv
alternative label: sadelhäftningsbindning @sv
definition: Sidonnan tyyppi, joka taittaa ja nitoo arkit taitokseksi, joka muodostaa selkämyksen.
definition: Typ av bindning, som viker och häftar arken till en vikning som bildar en rygg. @sv
in scheme: Metatietosanasto
preferred label: saddle stitch binding @en
preferred label: sadelbindning @sv

päivittyvä määrätty suunnitelma
type: Concept
source: RDA-termi
source: RDA-term @sv
created: 2024-03-22
modified: 2024-05-14
definition: Laajennussuunnitelma teokselle, joka on tarkoitettu toteutettavaksi yhdessä erillisessä ekspressiossa, joka toteutuu rajatun ajanjakson sisällä.
definition: Utvidgningsplan för ett verk som är avsett att förverkligas i ett skilt uttryck inom en bestämd tidsperiod. @sv
in scheme: Metatietosanasto
preferred label: integrating determinate plan @en
preferred label: integrerande bestämd plan @sv

interaktiivinen
type: Concept
source: RDA-termi
source: RDA-term @sv
created: 2024-03-22
modified: 2024-05-09
definition: Interaktiivisuuden tila, joka osoittaa, että ekspression sisältö vastaa käyttäjän toimintaan.
definition: Status för interaktivitet, som anger att uttryckets innehåll svarar på användarens aktivitet. @sv
in scheme: Metatietosanasto
preferred label: interactive @en
preferred label: interaktiv @sv

avoin rengasnidonta
type: Concept
source: RDA-termi
source: RDA-term @sv
created: 2024-03-22
modified: 2024-05-11
definition: Sidonnan tyyppi, joka käyttää useampaa kuin yhtä metallista tai muovista rengasta, jotka pujotetaan arkkien reunassa olevien reikien läpi. Sidos voidaan avata arkkien poistamiseksi tai lisäämiseksi.
definition: Typ av bindning, med fler än en ring i metall eller plast, som förs genom hål i arkens kanter. Bindningen kan öppnas för att ta bort eller lägga till ark. @sv
in scheme: Metatietosanasto
preferred label: open ring binding @en
preferred label: öppen ringbindning @sv

peräkkäinen määrittämätön suunnitelma
type: Concept
source: RDA-termi
source: RDA-term @sv
created: 2024-03-22
modified: 2024-06-07
definition: Laajennussuunnitelma teokselle, joka on tarkoitettu toteutettavaksi useissa erillisissä ekspressiossa, jotka toteutuvat avoimen ajanjakson sisällä.
definition: Utvidgningsplan för ett verk som är avsett att förverkligas i flera skilda uttryck inom en öppen tidsperiod. @sv
in scheme: Metatietosanasto
preferred label: successive indeterminate plan @en
preferred label: successiv obestämd plan @sv

kierrenidonta
type: Concept
source: RDA-termi
source: RDA-term @sv
created: 2024-03-22
modified: 2024-06-07
alternative label: kierresidonta
definition: Sidonnan tyyppi, joka käyttää yhtenäistä metalli- ja muovikierrettä, joka pujotetaan arkkien reunassa olevien reikien läpi.
definition: Typ av bindning, med en sammanhängande metall- eller plastspiral som är trädd genom hål i arkens kanter. @sv
in scheme: Metatietosanasto
preferred label: spiral binding @en
preferred label: spiralbindning @sv

suljettu rengasnidonta
type: Concept
source: RDA-termi
source: RDA-term @sv
created: 2024-03-22
modified: 2024-05-11
definition: Sidonnan tyyppi, joka käyttää useampaa kuin yhtä metallista tai muovista rengasta, jotka pujotetaan arkkien reunassa olevien reikien läpi.
definition: Typ av bindning, med fler än en metall- eller plastringar, som är trädda genom hål i arkens kanter. @sv
in scheme: Metatietosanasto
preferred label: closed ring binding @en
preferred label: sluten ringbindning @sv

ei-interaktiivinen
type: Concept
source: RDA-termi
source: RDA-term @sv
created: 2024-03-22
modified: 2024-05-09
alternative label: ej interaktiv @sv
definition: Interaktiivisuuden tila, joka osoittaa, että ekspression sisältö ei vastaa käyttäjän toimintaan.
definition: Status för interaktivitet, som anger att uttryckets innehåll inte svarar på användarens aktivitet. @sv
in scheme: Metatietosanasto
preferred label: non-interactive @en
preferred label: icke-interaktiv @sv

metallurgi
type: Concept
source: Kansallinen RDA-termi
source: Nationell RDA-term @sv
created: 2024-04-04
modified: 2025-11-04
in scheme: Metatietosanasto
preferred label: metallurg @sv

Merkintälähde
type: ConceptGroup
type: Collection
source: RDA-termi
source: RDA-term @sv
created: 2024-04-04
modified: 2024-05-14
definition: Liittää teoksen metatietoteoksen tiedonlähteeseen, joka on rakenteistamaton kuvailu jäljennettynä manifestaatiosta, joka on kuvailtavana.
definition: Sammankopplar verk med informationskälla för ett metadataverk, som är en ostrukturerad beskrivning återgiven från manifestationen som beskrivs. @sv
member: irtopäällys
member: seliteteksti
member: kotelo
member: toimitustiedot
member: upotetut metatiedot
member: nimiöruutu
member: nimiöarkki
member: kansi
member: nimiösivu
member: sarjan nimiösivu
member: tallenteen etiketti
member: nimiökortti
member: nimiönäyttö
preferred label: Recording source @en
preferred label: Uppgiftskälla @sv

irtopäällys
type: Concept
source: RDA-termi
source: RDA-term @sv
created: 2024-04-04
modified: 2024-05-14
definition: Manifestaatioon sisältyvänä tiedonlähteenä niteen irrotettava suojakääre.
definition: Informationskälla som ingår i en manifestation och utgörs av ett skyddande omslag som kan lösgöras från volymen. @sv
in scheme: Metatietosanasto
preferred label: jacket @en
preferred label: skyddsomslag @sv

seliteteksti
type: Concept
source: RDA-termi
source: RDA-term @sv
created: 2024-04-04
modified: 2024-05-14
definition: Manifestaatioon sisältyvänä tiedonlähteenä stillkuvan tekstilisä, joka sisältää tietoa nimekkeestä, lyhyen kuvauksen tai muuta tietoa manifestaatiosta.
definition: Informationskälla som ingår i en manifestation och som utgörs av ett texttillägg till en stillbild, som innehåller information om titeln, en kort beskrivning eller annan information om manifestationen. @sv
in scheme: Metatietosanasto
preferred label: caption @en
preferred label: förklaringstext @sv

kotelo
type: Concept
source: RDA-termi
source: RDA-term @sv
created: 2024-04-04
modified: 2024-05-14
definition: Manifestaatioon sisältyvänä tiedonlähteenä kotelo, joka on fyysisesti erotettavissa manifestaatiosta.
definition: Informationskälla som ingår i en manifestation och utgörs av en behållare, som fysiskt kan avskiljas från manifestationen. @sv
in scheme: Metatietosanasto
preferred label: container @en
preferred label: behållare @sv

toimitustiedot
type: Concept
source: RDA-termi
source: RDA-term @sv
created: 2024-04-04
modified: 2025-10-18
alternative label: toimitustietolaatikko
alternative label: redaktionell ruta @sv
alternative label: redaktionsruta @sv
definition: Manifestaatioon sisältyvänä tiedonlähteenä osa pääkirjoitussivua tai ensimmäistä sivua, joka ilmestyy manifestaation joka numerossa, ja joka sisältää tietoa päänimekkeestä, vastuullisuudesta, julkaisusta tai muusta manifestaatioon liittyvästä.
definition: Informationskälla som ingår i en manifestation och som utgörs av en del av ledarsidan eller första sidan som utkommer i varje nummer av manifestionen, och som innehåller information om huvudtitel, upphov, utgivning eller annat gällande manifestationen. @sv
in scheme: Metatietosanasto
preferred label: masthead @en
preferred label: redaktionsuppgifter @sv

upotetut metatiedot
type: Concept
source: RDA-termi
source: RDA-term @sv
created: 2024-04-04
modified: 2024-05-14
alternative label: inbyggda metadata @sv
alternative label: inbäddade metadata @sv
definition: Manifestaatioon sisältyvänä tiedonlähteenä verkkomanifestaatioon upotettuja metatietoja.
definition: Informationskälla som ingår i en manifestation och som utgörs av metadata som integrerats i en onlinemanifestation. @sv
in scheme: Metatietosanasto
preferred label: embedded metadata @en
preferred label: inbäddad metadata @sv

nimiöruutu
type: Concept
source: RDA-termi
source: RDA-term @sv
created: 2024-04-04
modified: 2025-06-04
definition: Manifestaatioon sisältyvänä tiedonlähteenä filmiruutu, joka sisältää tietoa päänimekkeestä, vastuullisuudesta, julkaisusta tai muusta manifestaatioon liittyvästä.
definition: Informationskälla i form av en filmruta som ingår i en manifestation, och som ger information om huvudtitel, upphov, utgivning eller annat som gäller manifestationen. @sv
in scheme: Metatietosanasto
preferred label: title frame @en
preferred label: titelruta @sv

nimiöarkki
type: Concept
source: RDA-termi
source: RDA-term @sv
created: 2024-04-04
modified: 2024-05-14
definition: Manifestaatioon sisältyvänä tiedonlähteenä arkki arkkikokoelmassa, joka sisältää tietoa päänimekkeestä, vastuullisuudesta, julkaisusta tai muusta manifestaatioon liittyvästä.
definition: Informationskälla som ingår i en manifestation och utgörs av ett ark i en arksamling, som innehåller information om en huvudtitel, upphov, utgivning eller annat gällande manifestationen. @sv
in scheme: Metatietosanasto
preferred label: title sheet @en
preferred label: titelark @sv

kansi
type: Concept
source: RDA-termi
source: RDA-term @sv
created: 2024-04-04
modified: 2025-08-28
alternative label: pärm (omslag) @sv
definition: Manifestaatioon sisältyvänä tiedonlähteenä niteen suojaava sidos.
definition: Informationskälla som ingår i en manifestation och utgörs av volymens skyddande bindning. @sv
in scheme: Metatietosanasto
preferred label: cover @en
preferred label: omslag @sv
scope note: Kansi kattaa myös selän.
scope note: Till omslag hör också en rygg. @sv

nimiösivu
type: Concept
source: RDA-termi
source: RDA-term @sv
created: 2024-04-04
modified: 2024-05-14
definition: Manifestaatioon sisältyvänä tiedonlähteenä niteeseen sisältyvä sivu, joka sisältää tietoa päänimekkeestä, vastuullisuudesta, julkaisusta tai muusta manifestaatioon liittyvästä.
definition: Informationskälla som ingår i en manifestation och utgörs av en sida i en volym, som innehåller information om huvudtitel, upphov, utgivning eller annat gällande manifestationen. @sv
in scheme: Metatietosanasto
preferred label: title page @en
preferred label: titelsida @sv

sarjan nimiösivu
type: Concept
source: RDA-termi
source: RDA-term @sv
created: 2024-04-04
modified: 2024-05-14
definition: Manifestaatioon sisältyvä tiedonlähde, joka on täydentävä nimiösivu, joka sisältää sarjan päänimekkeen ja muita tietoja perättäisesti ilmestyvästä teoksesta sekä manifestaatioon sisältyvän teoksen numeroon liittyviä tietoja.
definition: Informationskälla som ingår i en manifestation och som utgörs av en kompletterande titelsida, som innehåller seriens huvudtitel och andra uppgifter om ett verk som utkommer successivt, samt uppgifter gällande det verks nummer som ingår i manifestationen. @sv
in scheme: Metatietosanasto
preferred label: series title page @en
preferred label: titelsida för serie @sv

tallenteen etiketti
type: Concept
source: RDA-termi
source: RDA-term @sv
created: 2024-04-04
modified: 2024-05-14
definition: Manifestaatioon sisältyvä tiedonlähde, joka on manifestaatioon pysyvästi kiinnitetty ihmisluettava etiketti.
definition: Informationskälla som ingår i en manifestation och som utgörs av en människoläsbar etikett som är beständigt fäst vid manifestationen. @sv
in scheme: Metatietosanasto
preferred label: carrier label @en
preferred label: etikett på bärare @sv

nimiökortti
type: Concept
source: RDA-termi
source: RDA-term @sv
created: 2024-04-04
modified: 2024-05-14
definition: Manifestaatioon sisältyvänä tiedonlähteenä kortti korttikokoelmassa, joka sisältää tietoa päänimekkeestä, vastuullisuudesta, julkaisusta tai muusta manifestaatioon liittyvästä.
definition: Informationskälla som ingår i en manifestation och utgörs av ett kort i en kortsamling, som innehåller information om huvudtitel, upphov, utgivning eller annat gällande manifestationen. @sv
in scheme: Metatietosanasto
preferred label: title card @en
preferred label: titelkort @sv

televisioasema
type: Concept
source: Kansallinen RDA-termi
source: Nationell RDA-term @sv
created: 2016-01-08
modified: 2024-05-24
alternative label: televisiokanava
alternative label: tv-kanal @sv
definition: Laitos jossa on televisiolähetin; myös televisiokanavasta.
definition: Anläggning med tv-sändare; även om tv-kanal. @sv
in scheme: Metatietosanasto
preferred label: tv-station @sv

nimiönäyttö
type: Concept
source: RDA-termi
source: RDA-term @sv
created: 2024-04-04
modified: 2024-05-14
definition: Manifestaatioon sisältyvänä tiedonlähteenä digitaalisen manifestaation näkymä, joka sisältää tietoa päänimekkeestä, vastuullisuudesta, julkaisusta tai muusta manifestaatioon liittyvästä.
definition: Informationskälla som ingår i en manifestation och utgörs av en digital manifestations skärmvy, som innehåller information om huvudtitel, upphov, utgivning eller annat gällande manifestationen. @sv
in scheme: Metatietosanasto
preferred label: title screen @en
preferred label: titelskärm @sv

Nomen
type: ConceptGroup
type: Collection
source: RDA-termi
source: RDA-term @sv
created: 2024-04-11
modified: 2024-05-14
definition: Nimike mille tahansa RDA-entiteetille nomenia lukuun ottamatta.
definition: Beteckning för vilken som helst RDA-entitet, förutom nomen. @sv
member: Tunnistamistaso

Tunnistamistaso
type: ConceptGroup
type: Collection
source: RDA-termi
source: RDA-term @sv
created: 2024-04-11
modified: 2024-05-16
alternative label: Identifiktationsstatus @sv
alternative label: Status för identifikation @sv
definition: Liittää nomenin ilmaukseen entiteetin nomenin oikeaksi todistamisen tasosta.
definition: Sammankopplar nomen med en uppgift om identifikationsnivå för nomenet. @sv
member: täydellinen taso
member: alustava taso
member: puutteellinen taso
preferred label: Status of identification @en
preferred label: Identifikationsnivå @sv

täydellinen taso
type: Concept
source: RDA-termi
source: RDA-term @sv
created: 2024-04-12
modified: 2024-05-16
alternative label: helt fastställd @sv
definition: Tunnistamistaso, kun auktorisoidun hakutiedon muodostavat tiedot ovat viimeistellyt.
definition: Identifikationsnivå som innebär att uppgifterna som bildar en auktoriserad sökingång är kompletta. @sv
in scheme: Metatietosanasto
preferred label: fully established @en
preferred label: fullständig nivå @sv

alustava taso
type: Concept
source: RDA-termi
source: RDA-term @sv
created: 2024-04-12
modified: 2024-05-16
alternative label: ej kontrollerad @sv
definition: Tunnistamistaso, kun auktorisoidun hakutiedon muodostavat tiedot on otettu toisesta kuvailusta eikä käytettävissä ole kuvailtavaa aineistoa.
definition: Identifikationsnivå som innebär att uppgifterna som bildar en auktoriserad sökingång har erhållits från en annan beskrivning, utan tillgång till resursen som beskrivs. @sv
in scheme: Metatietosanasto
preferred label: preliminary @en
preferred label: preliminär nivå @sv

puutteellinen taso
type: Concept
source: RDA-termi
source: RDA-term @sv
created: 2024-04-12
modified: 2024-05-16
alternative label: ofullständig nivå @sv
alternative label: provisorisk nivå @sv
definition: Tunnistamistaso, kun auktorisoidun hakutiedon muodostavat tiedot eivät riitä entiteetin tyydyttävään tunnistamiseen.
definition: Identifikationsnivå som innebär att uppgifterna som bildar en auktoriserad sökingång inte är tillräckliga för tillfredsställande identifikation. @sv
in scheme: Metatietosanasto
preferred label: provisional @en
preferred label: bristfällig nivå @sv

fis-molli
type: Concept
source: Kansallinen RDA-termi
source: Nationell RDA-term @sv
created: 2024-07-06
modified: 2024-07-06
preferred label: F♯ minor
preferred label: fa dièse mineur
preferred label: fis-Moll
in scheme: Metatietosanasto
preferred label: fiss-moll @sv

vaaliruhtinas
type: Concept
source: Kansallinen RDA-termi
source: Nationell RDA-term @sv
created: 2024-07-06
modified: 2024-07-06
in scheme: Metatietosanasto
preferred label: kurfurste @sv

Cis-duuri
type: Concept
source: Kansallinen RDA-termi
source: Nationell RDA-term @sv
created: 2024-07-06
modified: 2024-07-06
preferred label: Cis-Dur
preferred label: C♯ major
preferred label: do dièse majeur
alternative label: ut dièse majeur
in scheme: Metatietosanasto
preferred label: Ciss-dur @sv

ais-molli
type: Concept
source: Kansallinen RDA-termi
source: Nationell RDA-term @sv
created: 2024-07-06
modified: 2024-07-06
preferred label: A♯ minor
preferred label: ais-Moll
preferred label: la dièse mineur
in scheme: Metatietosanasto
preferred label: aiss-moll @sv

es-molli
type: Concept
source: Kansallinen RDA-termi
source: Nationell RDA-term @sv
created: 2024-07-06
modified: 2024-07-06
preferred label: E♭ minor
preferred label: es-Moll
preferred label: mi bémol mineur
in scheme: Metatietosanasto
preferred label: ess-moll @sv

gis-molli
type: Concept
source: Kansallinen RDA-termi
source: Nationell RDA-term @sv
created: 2024-07-06
modified: 2024-07-06
preferred label: G♯ minor
preferred label: gis-Moll
preferred label: sol dièse mineur
in scheme: Metatietosanasto
preferred label: giss-moll @sv

ruhtinaspiispa
type: Concept
source: Kansallinen RDA-termi
source: Nationell RDA-term @sv
created: 2024-07-06
modified: 2024-07-06
in scheme: Metatietosanasto
preferred label: furstbiskop @sv

D-duuri
type: Concept
source: Kansallinen RDA-termi
source: Nationell RDA-term @sv
created: 2024-07-06
modified: 2024-07-06
preferred label: D major
preferred label: D-Dur
preferred label: ré majeur
in scheme: Metatietosanasto
preferred label: D-dur @sv

Kansityyppi
type: ConceptGroup
type: Collection
source: Kansallinen RDA-termi
source: Nationell RDA-term @sv
created: 2024-07-06
modified: 2024-07-06
alternative label: Pärmtyp @sv
member: irtolehtiä
member: kansio
member: pehmeäkantinen
member: kovakantinen
member: kotelo
member: kierreselkä
preferred label: Omslagstyp @sv

as-molli
type: Concept
source: Kansallinen RDA-termi
source: Nationell RDA-term @sv
created: 2024-07-06
modified: 2024-07-06
preferred label: A♭ minor
preferred label: as-Moll
preferred label: la bémol mineur
in scheme: Metatietosanasto
preferred label: ass-moll @sv

Ekspression sävellaji
type: ConceptGroup
type: Collection
source: RDA-termi
source: RDA-term @sv
created: 2024-07-06
modified: 2024-07-06
alternative label: Uttrycks tonart @sv
definition: Sävelsuhteiden joukko, johon ekspression musiikillisen sisällön esityksessä käytetty tai käytettäväksi tarkoitettu tonaalinen keskus tai pääasiallinen tonaalinen keskus perustuu.
definition: Uppsättning tonintervaller som fastställer den tonart som har använts eller som är avsedd att användas som tonalt centrum eller huvudsakligt tonalt centrum vid framförande av det musikaliska innehållet i ett uttryck. @sv
member: fis-molli
member: Cis-duuri
member: ais-molli
member: es-molli
member: gis-molli
member: D-duuri
member: as-molli
member: As-duuri
member: C-duuri
member: d-molli
member: Ges-duuri
member: E-duuri
member: e-molli
member: g-molli
member: Es-duuri
member: cis-molli
member: H-duuri
member: c-molli
member: a-molli
member: F-duuri
member: Fis-duuri
member: f-molli
member: B-duuri
member: dis-molli
member: h-molli
member: Ces-duuri
member: G-duuri
member: A-duuri
member: b-molli
member: Des-duuri
preferred label: Key of expression @en
preferred label: Tonart för uttryck @sv

As-duuri
type: Concept
source: Kansallinen RDA-termi
source: Nationell RDA-term @sv
created: 2024-07-06
modified: 2024-07-06
preferred label: As-Dur
preferred label: A♭ major
preferred label: la bémol majeur
in scheme: Metatietosanasto
preferred label: Ass-dur @sv

C-duuri
type: Concept
source: Kansallinen RDA-termi
source: Nationell RDA-term @sv
created: 2024-07-06
modified: 2024-07-06
preferred label: C major
preferred label: C-Dur
preferred label: do majeur
alternative label: ut majeur
in scheme: Metatietosanasto
preferred label: C-dur @sv

d-molli
type: Concept
source: Kansallinen RDA-termi
source: Nationell RDA-term @sv
created: 2024-07-06
modified: 2024-07-06
preferred label: D minor
preferred label: d-Moll
preferred label: ré mineur
in scheme: Metatietosanasto
preferred label: d-moll @sv

Ges-duuri
type: Concept
source: Kansallinen RDA-termi
source: Nationell RDA-term @sv
created: 2024-07-06
modified: 2024-07-06
preferred label: Ges-Dur
preferred label: G♭ major
preferred label: sol bémol majeur
in scheme: Metatietosanasto
preferred label: Gess-dur @sv

E-duuri
type: Concept
source: Kansallinen RDA-termi
source: Nationell RDA-term @sv
created: 2024-07-06
modified: 2024-07-06
preferred label: E major
preferred label: E-Dur
preferred label: mi majeur
in scheme: Metatietosanasto
preferred label: E-dur @sv

e-molli
type: Concept
source: Kansallinen RDA-termi
source: Nationell RDA-term @sv
created: 2024-07-06
modified: 2024-07-06
preferred label: E minor
preferred label: e-Moll
preferred label: mi mineur
in scheme: Metatietosanasto
preferred label: e-moll @sv

g-molli
type: Concept
source: Kansallinen RDA-termi
source: Nationell RDA-term @sv
created: 2024-07-06
modified: 2024-07-06
preferred label: G minor
preferred label: g-Moll
preferred label: sol mineur
in scheme: Metatietosanasto
preferred label: g-moll @sv

kruununprinssi
type: Concept
source: Kansallinen RDA-termi
source: Nationell RDA-term @sv
created: 2024-07-06
modified: 2024-07-06
in scheme: Metatietosanasto
preferred label: kronprins @sv

arkkiherttuatar
type: Concept
source: Kansallinen RDA-termi
source: Nationell RDA-term @sv
created: 2024-07-06
modified: 2024-07-06
in scheme: Metatietosanasto
preferred label: ärkehertiginna @sv

suuriruhtinas
type: Concept
source: Kansallinen RDA-termi
source: Nationell RDA-term @sv
created: 2024-07-06
modified: 2024-07-06
in scheme: Metatietosanasto
preferred label: storfurste @sv

ruhtinasarkkipiispa
type: Concept
source: Kansallinen RDA-termi
source: Nationell RDA-term @sv
created: 2024-07-06
modified: 2024-07-06
in scheme: Metatietosanasto
preferred label: furstärkebiskop @sv

Es-duuri
type: Concept
source: Kansallinen RDA-termi
source: Nationell RDA-term @sv
created: 2024-07-06
modified: 2024-07-06
preferred label: Es-Dur
preferred label: E♭ major
preferred label: mi bémol majeur
in scheme: Metatietosanasto
preferred label: Ess-dur @sv

cis-molli
type: Concept
source: Kansallinen RDA-termi
source: Nationell RDA-term @sv
created: 2024-07-06
modified: 2024-07-06
preferred label: C♯ minor
preferred label: cis-Moll
preferred label: do dièse mineur
alternative label: ut dièse mineur
in scheme: Metatietosanasto
preferred label: ciss-moll @sv

skeemaigumenia
type: Concept
source: Kansallinen RDA-termi
source: Nationell RDA-term @sv
created: 2024-07-06
modified: 2024-07-06
alternative label: skemaigumenia @sv
in scheme: Metatietosanasto
preferred label: schemaigumenia @sv

arkkiherttua
type: Concept
source: Kansallinen RDA-termi
source: Nationell RDA-term @sv
created: 2024-07-06
modified: 2024-07-06
in scheme: Metatietosanasto
preferred label: ärkehertig @sv

H-duuri
type: Concept
source: Kansallinen RDA-termi
source: Nationell RDA-term @sv
created: 2024-07-06
modified: 2024-07-06
preferred label: B major
preferred label: H-Dur
preferred label: si majeur
alternative label: B-dur @sv
in scheme: Metatietosanasto
preferred label: H-dur @sv

skeemapappismunkki
type: Concept
source: Kansallinen RDA-termi
source: Nationell RDA-term @sv
created: 2024-07-06
modified: 2024-07-06
alternative label: skemaprästmunk @sv
in scheme: Metatietosanasto
preferred label: schemaprästmunk @sv

c-molli
type: Concept
source: Kansallinen RDA-termi
source: Nationell RDA-term @sv
created: 2024-07-06
modified: 2024-07-06
preferred label: C minor
preferred label: c-Moll
preferred label: do mineur
alternative label: ut mineur
in scheme: Metatietosanasto
preferred label: c-moll @sv

a-molli
type: Concept
source: Kansallinen RDA-termi
source: Nationell RDA-term @sv
created: 2024-07-06
modified: 2024-07-06
preferred label: A minor
preferred label: a-Moll
preferred label: la mineur
in scheme: Metatietosanasto
preferred label: a-moll @sv

F-duuri
type: Concept
source: Kansallinen RDA-termi
source: Nationell RDA-term @sv
created: 2024-07-06
modified: 2024-07-06
preferred label: F major
preferred label: F-Dur
preferred label: fa majeur
in scheme: Metatietosanasto
preferred label: F-dur @sv

dalai-lama
type: Concept
source: Kansallinen RDA-termi
source: Nationell RDA-term @sv
created: 2024-07-06
modified: 2024-07-06
in scheme: Metatietosanasto
preferred label: dalai lama @sv

panchen-lama
type: Concept
source: Kansallinen RDA-termi
source: Nationell RDA-term @sv
created: 2024-07-06
modified: 2024-07-06
in scheme: Metatietosanasto
preferred label: panchen lama @sv

lyhennetty nimeke
type: Concept
source: RDA-termi
source: RDA-term @sv
created: 2016-01-08
modified: 2023-08-15
in scheme: Metatietosanasto
preferred label: abbreviated title @en
preferred label: förkortad titel @sv
scope note: Indeksointia tai tunnistamista varten lyhennetty nimeke.
scope note: Titel som förkortats för indexering eller identifiering. @sv

Fis-duuri
type: Concept
source: Kansallinen RDA-termi
source: Nationell RDA-term @sv
created: 2024-07-06
modified: 2024-07-06
preferred label: Fis-Dur
preferred label: F♯ major
preferred label: fa dièse majeur
in scheme: Metatietosanasto
preferred label: Fiss-dur @sv

suuriruhtinatar
type: Concept
source: Kansallinen RDA-termi
source: Nationell RDA-term @sv
created: 2024-07-06
modified: 2024-07-06
in scheme: Metatietosanasto
preferred label: storfurstinna @sv

f-molli
type: Concept
source: Kansallinen RDA-termi
source: Nationell RDA-term @sv
created: 2024-07-06
modified: 2024-07-06
preferred label: F minor
preferred label: f-Moll
preferred label: fa mineur
in scheme: Metatietosanasto
preferred label: f-moll @sv

jaarli
type: Concept
source: Kansallinen RDA-termi
source: Nationell RDA-term @sv
created: 2024-07-06
modified: 2024-07-06
definition: Skandinaavinen hallitsija.
definition: Skandinavisk makthavare. @sv
in scheme: Metatietosanasto
preferred label: jarl @sv

B-duuri
type: Concept
source: Kansallinen RDA-termi
source: Nationell RDA-term @sv
created: 2024-07-06
modified: 2024-08-27
preferred label: B-Dur
preferred label: B♭ major
preferred label: si bémol majeur
in scheme: Metatietosanasto
preferred label: B-dur @sv

skeemanunna
type: Concept
source: Kansallinen RDA-termi
source: Nationell RDA-term @sv
created: 2024-07-06
modified: 2024-07-06
alternative label: skemanunna @sv
in scheme: Metatietosanasto
preferred label: schemanunna @sv

dis-molli
type: Concept
source: Kansallinen RDA-termi
source: Nationell RDA-term @sv
created: 2024-07-06
modified: 2024-07-06
preferred label: D♯ minor
preferred label: dis-Moll
preferred label: ré dièse mineur
in scheme: Metatietosanasto
preferred label: diss-moll @sv

h-molli
type: Concept
source: Kansallinen RDA-termi
source: Nationell RDA-term @sv
created: 2024-07-06
modified: 2024-07-06
preferred label: B minor
preferred label: h-Moll
preferred label: si mineur
alternative label: b-moll @sv
in scheme: Metatietosanasto
preferred label: h-moll @sv

maakreivitär
type: Concept
source: Kansallinen RDA-termi
source: Nationell RDA-term @sv
created: 2024-07-06
modified: 2024-07-06
in scheme: Metatietosanasto
preferred label: lantgrevinna @sv

palatsikreivi
type: Concept
source: Kansallinen RDA-termi
source: Nationell RDA-term @sv
created: 2024-07-06
modified: 2024-07-06
alternative label: pfalzkreivi
in scheme: Metatietosanasto
preferred label: pfalzgreve @sv

kulttuurikeskus
type: Concept
source: Kansallinen RDA-termi
source: Nationell RDA-term @sv
created: 2016-01-08
modified: 2024-05-24
example: G18 (kulttuurikeskus)
example: G18 (kulturcenter) @sv
in scheme: Metatietosanasto
preferred label: kulturcenter @sv

rajakreivi
type: Concept
source: Kansallinen RDA-termi
source: Nationell RDA-term @sv
created: 2024-07-06
modified: 2024-07-06
alternative label: markkreivi
in scheme: Metatietosanasto
preferred label: markgreve @sv

suurherttua
type: Concept
source: Kansallinen RDA-termi
source: Nationell RDA-term @sv
created: 2024-07-06
modified: 2024-07-06
in scheme: Metatietosanasto
preferred label: storhertig @sv

kaani
type: Concept
source: Kansallinen RDA-termi
source: Nationell RDA-term @sv
created: 2024-07-06
modified: 2024-07-06
in scheme: Metatietosanasto
preferred label: khan @sv

skeemamunkki
type: Concept
source: Kansallinen RDA-termi
source: Nationell RDA-term @sv
created: 2024-07-06
modified: 2024-07-06
alternative label: skemamunk @sv
in scheme: Metatietosanasto
preferred label: schemamunk @sv

Ces-duuri
type: Concept
source: Kansallinen RDA-termi
source: Nationell RDA-term @sv
created: 2024-07-06
modified: 2024-07-06
preferred label: Ces-Dur
preferred label: C♭ major
preferred label: do bémol majeur
alternative label: ut bémol majeur
in scheme: Metatietosanasto
preferred label: Cess-dur @sv

Sävellykset
type: Concept
source: Kansallinen RDA-termi
source: Nationell RDA-term @sv
created: 2024-07-06
modified: 2024-07-06
definition: Vakiintunut kokoava nimeke kokoelmalle, joka käsittää kaikki säveltäjän tietylle yleisluonteiselle tai täsmälliselle kokoonpanolle sävelletyt teokset, jotka eivät edusta yksittäistä sävellystyyppiä. Jos kokoelmassa ei ole kaikkia tällaisia sävellyksiä, tietoon lisätään termi Valikoima.
definition: Grupptitel för en samling som innefattar alla verk som en kompositör komponerat för en viss allmän eller exakt musikalisk besättning, och som inte representerar en enskild kompositionstyp. Om samlingen inte innehåller alla sådana kompositioner anges också termen Urval. @sv
in scheme: Metatietosanasto
preferred label: Kompositioner @sv
scope note: Musiikkiteosten koosteen auktorisoidussa hakutiedossa teoksen ensisijaisen nimekkeen jälkeen lisätään alkuperäiseen esityskokoonpanoon perustuva edustavan ekspression musiikin esityskokoonpanon arvo. Epätäydellisessä koosteessa esityskokoonpano merkitään ennen termiä Valikoima.
scope note: I den auktoriserade sökingången för sammanställningar av musikverk anges efter den föredragna titeln ett värde för musikalisk besättning i det representativa uttryckets musik, som grundar sig på den ursprungliga musikaliska besättningen. Vid en ofullständig sammanställning anges den musikaliska besättningen före termen Urval. @sv

ajatollah
type: Concept
source: Kansallinen RDA-termi
source: Nationell RDA-term @sv
created: 2024-07-06
modified: 2024-07-06
alternative label: ayatollah @sv
alternative label: ayatullah @sv
in scheme: Metatietosanasto
preferred label: ayatolla @sv

vastapaavi
type: Concept
source: Kansallinen RDA-termi
source: Nationell RDA-term @sv
created: 2024-07-06
modified: 2024-07-06
alternative label: antipåve @sv
in scheme: Metatietosanasto
preferred label: motpåve @sv

G-duuri
type: Concept
source: Kansallinen RDA-termi
source: Nationell RDA-term @sv
created: 2024-07-06
modified: 2024-07-06
preferred label: G major
preferred label: G-Dur
preferred label: sol majeur
in scheme: Metatietosanasto
preferred label: G-dur @sv

katolikos
type: Concept
source: Kansallinen RDA-termi
source: Nationell RDA-term @sv
created: 2024-07-06
modified: 2024-07-06
in scheme: Metatietosanasto
preferred label: katholikos @sv

A-duuri
type: Concept
source: Kansallinen RDA-termi
source: Nationell RDA-term @sv
created: 2024-07-06
modified: 2024-07-06
preferred label: A major
preferred label: A-Dur
preferred label: la majeur
in scheme: Metatietosanasto
preferred label: A-dur @sv

suurherttuatar
type: Concept
source: Kansallinen RDA-termi
source: Nationell RDA-term @sv
created: 2024-07-06
modified: 2024-07-06
in scheme: Metatietosanasto
preferred label: storhertiginna @sv

kruununprinsessa
type: Concept
source: Kansallinen RDA-termi
source: Nationell RDA-term @sv
created: 2024-07-06
modified: 2024-07-06
in scheme: Metatietosanasto
preferred label: kronprinsessa @sv

kaniikki
type: Concept
source: Kansallinen RDA-termi
source: Nationell RDA-term @sv
created: 2024-07-06
modified: 2024-07-06
alternative label: kanunki
in scheme: Metatietosanasto
preferred label: kanik @sv

maakreivi
type: Concept
source: Kansallinen RDA-termi
source: Nationell RDA-term @sv
created: 2024-07-06
modified: 2024-07-06
in scheme: Metatietosanasto
preferred label: lantgreve @sv

b-molli
type: Concept
source: Kansallinen RDA-termi
source: Nationell RDA-term @sv
created: 2024-07-06
modified: 2024-08-27
preferred label: B♭ minor
preferred label: b-Moll
preferred label: si bémol mineur
in scheme: Metatietosanasto
preferred label: b-moll @sv

Des-duuri
type: Concept
source: Kansallinen RDA-termi
source: Nationell RDA-term @sv
created: 2024-07-06
modified: 2024-07-06
preferred label: Des-Dur
preferred label: D♭ major
preferred label: ré bémol majeur
in scheme: Metatietosanasto
preferred label: Dess-dur @sv

vaaliruhtinatar
type: Concept
source: Kansallinen RDA-termi
source: Nationell RDA-term @sv
created: 2024-07-06
modified: 2024-07-06
in scheme: Metatietosanasto
preferred label: kurfurstinna @sv

liite
type: Concept
source: Kansallinen RDA-termi
source: Nationell RDA-term @sv
created: 2024-09-07
modified: 2024-09-07
in scheme: Metatietosanasto
preferred label: bilaga @sv

Sukupuoli
type: ConceptGroup
type: Collection
source: Kansallinen RDA-termi
source: Nationell RDA-term @sv
created: 2024-10-01
modified: 2024-10-04
preferred label: Gender @en
preferred label: Kön @sv
scope note: Käytetään määrittämään ryhmän jäsenten sukupuolta kuvaavia termejä (esim. miehet, naiset, transihmiset). Yksittäisten termien valinnassa käytetään YSO-termejä ryhmästä sukupuoleen liittyvä rooli.
scope note: Används för att bestämma termer som beskriver kön hos medlemmar av en grupp (t.ex. män, kvinnor, transpersoner). Vid val av enskilda termer används ALLFO-termer ur gruppen roll relaterad till kön. @sv

partituuri
type: Concept
source: Kansallinen RDA-termi
source: Nationell RDA-term @sv
created: 2024-10-02
modified: 2024-10-03
alternative label: score @en
definition: Sellaisen nuottiaineiston muoto, joka koostuu graafisesta, symbolisesta tai sanallisesta nuottikirjoituksesta, ja johon sisältyy kokoonpanon kaikkien stemmojen sisältö. Nuottiaineistosta, joka edustaa teosta yhdelle soittimelle tai yhdelle soittajalle, käytetään termiä soolonuotti.
definition: Nottryck som består av grafisk, symbolisk eller verbal notskrift, och i vilken hela orkesterbesättningens stämmor ingår. För notskrift för ett instrument eller för en musiker används termen solonot. @sv
in scheme: Metatietosanasto
preferred label: (full) score @en
preferred label: partitur @sv

kuorokirja
type: Concept
source: Kansallinen RDA-termi
source: Nationell RDA-term @sv
created: 2024-10-02
modified: 2024-10-02
alternative label: korbok @sv
definition: Suuri, kuoron eteen telineelle asetettava nuottikirja. Jokainen ääni on nuotinnettu erikseen yleensä noudattaen asetelmaa, jossa avoinna olevassa kirjassa lehden kääntöpuolella ovat sopraano- ja tenoriäänet ja seuraavan lehden etupuolella altto- ja bassoäänet.
definition: Stor bok med notskrift som placeras på notställ framför kör. Varje stämma är separat noterad. Vanligtvis är sopran- och tenorstämmorna uppställda på uppslagets vänstra sida, alt- och basstämmorna på uppslagets högra sida. @sv
in scheme: Metatietosanasto
preferred label: choir book @en
preferred label: körbok @sv

pianopartituuri
type: Concept
source: Kansallinen RDA-termi
source: Nationell RDA-term @sv
created: 2024-10-02
modified: 2024-10-03
alternative label: vokaalipartituuri (pianopartituuri)
alternative label: klaverutdrag @sv
alternative label: vokalpartitur (pianopartitur) @sv
definition: Ensisijaisesti harjoituskäyttöön tarkoitettu, soololauluäänille/kuorolle ja/tai solistisille soittimille ja orkesterille sävelletyn teoksen pelkistys versioksi, jossa laulu- ja soolosoitinäänet ovat partituurimuodossa ja koko teoksen orkesterisäestys on sovitettu kosketinsoittimelle. Kuoron harjoituskäyttöön tarkoitetusta partituurista käytetään termiä kuoropartituuri. Termiä vokaalipartituuri ei käytetä nuottiaineiston muodon merkitsemisessä
definition: I första hand ämnad för övning, en förenklad version av ett verk komponerat för soloröst/kör och/eller soloinstrument/orkester i vilket sång- och soloinstrumentstämman är i partiturformat och hela verkets orkesterackompanjemang är anpassat till tangentinstrument. För partitur avsett för körövning används termen körpartitur. @sv
in scheme: Metatietosanasto
preferred label: pianopartitur @sv

soolonuotti
type: Concept
source: Kansallinen RDA-termi
source: Nationell RDA-term @sv
created: 2024-10-02
modified: 2024-10-02
alternative label: soolonuotinnos
alternative label: solonoter @sv
alternative label: solostämma @sv
definition: Nuottiaineisto, joka sisältää yhdelle soittimelle tai yhdelle esittäjälle tarkoitetun musiikkiteoksen nuotinnoksen (esimerkiksi Beethovenin Für Elise (pianolle), Messiaenin Le banquet céleste (uruille), Xenakiksen Pléïades (lyömäsoittimille) ja Debussyn Syrinx (huilulle))
definition: Nottryck som består av notskrift för ett instrument eller en framförare, t.ex. Beethovens Für Elise (för piano), Messiaens Le banquet céleste (för orgel), Xenakis Pléïades (för slaginstrument) och Debussys Syrinx (för flöjt). @sv
in scheme: Metatietosanasto
preferred label: solonot @sv

partituurin tiivistelmä
type: Concept
source: Kansallinen RDA-termi
source: Nationell RDA-term @sv
created: 2024-10-02
modified: 2024-10-02
definition: Partituuri, jossa nuottiviivastojen määrä on rajattu kahteen tai muutamaan, yleensä soitinryhmittäin järjestettynä ja usein sisältäen viittauksia yksittäisiin ääniin.
definition: Partitur i vilket notlinjernas mängd har begränsats till två eller några, vanligen ordnade i instrumentgrupper och ofta innehållande hävisningar till enskilda stämmor. @sv
in scheme: Metatietosanasto
preferred label: condensed score @en
preferred label: reducerat partitur @sv

stemma
type: Concept
source: Kansallinen RDA-termi
source: Nationell RDA-term @sv
created: 2024-10-02
modified: 2024-10-02
alternative label: ääni
definition: Sellaisen nuottiaineiston muoto, joka sisältää nuotit yhdelle tai useammalle, mutta ei kaikille esittäjille (esimerkiksi viulukonserton viulustemma tai orkesteriteoksen harppustemma).
definition: Notmaterial bestående av noter för en eller flera, men inte alla, framförare (t.ex. violinstämmorna i en violinkonsert eller harpstämman i ett orkesterverk.) @sv
in scheme: Metatietosanasto
preferred label: part @en
preferred label: stämma @sv

table book
type: Concept
source: Kansallinen RDA-termi
source: Nationell RDA-term @sv
created: 2024-10-02
modified: 2024-10-02
definition: Nuottikirja, joka on tehty asetettavaksi pöydälle ja näytettäväksi siten, että esittäjät voivat lukea stemmansa istuessaan tai seistessään pöydän ympärillä. Jokainen stemma nuotinnetaan erikseen ja asetellaan yleensä siten, että kirjan ollessa auki eri stemmat esitetään käännetyssä ja/tai kohtisuorassa asennossa.
definition: Bok med notskrift, avsedd att läggas fram på ett bord på ett sådant sätt att framförarna kan avläsa sin stämma sittande eller stående runt bordet. Varje stämma noteras skilt och arrangeras vanligtvis så, att när boken ligger öppen står olika stämmor upp och nedvänt och/eller vinkelrätt mot varandra. @sv
in scheme: Metatietosanasto

pianojohtostemma
type: Concept
source: Kansallinen RDA-termi
source: Nationell RDA-term @sv
created: 2024-10-02
modified: 2024-10-03
definition: Yhtyeen tai orkesterin pianistin esitysstemma, jossa on viitteitä muihin soittimiin, jotta stemman soittaja voi myös johtaa yhtyettä. Katso myös johtostemma ja viulujohtostemma.
definition: Framförandestämma för ensemblens eller orkesterns pianist, i vilken hänvisningar till övriga instrument framkommer så att pianisten kan leda ensemblen. Se även dirigentstämma och violindirektion. @sv
in scheme: Metatietosanasto
preferred label: piano conductor part @en
preferred label: pianodirektion @sv

johtostemma
type: Concept
source: Kansallinen RDA-termi
source: Nationell RDA-term @sv
created: 2024-10-02
modified: 2024-10-03
alternative label: johtoääni
definition: Pienehköissä orkestereissa yleisesti käytetty tärkeimpien äänien tiivistelmä, jota myös instrumenttia soittava orkesterin johtaja voi käyttää parituurin sijasta. Katso myös pianojohtostemma ja viulujohtostemma.
definition: Ett sammandrag av de viktigaste stämmorna i en mindre orkester. Kan också användas av orkesterledaren i stället för partitur. Se även pianodirektion och violindirektion. @sv
in scheme: Metatietosanasto
preferred label: conductor score @en
preferred label: dirigentstämma @sv

partiselli
type: Concept
source: Kansallinen RDA-termi
source: Nationell RDA-term @sv
created: 2024-10-02
modified: 2024-10-02
alternative label: compressed score @en
alternative label: short score @en
definition: Muutamalle (2–5) viivastolle pelkistetty yhtye- tai orkesteriteoksen partituuri, jota käytetään esimerkiksi sävellys- ja sovitustyössä ennen varsinaisen partituurin kirjoittamista. Termiä on syytä käyttää vain silloin, kun se esiintyy itse julkaisussa.
definition: Förenklad ensemble- eller orkesterpartitur på 2-5 linjer som används i t.ex. tonsättning eller arrangemang innan skrivandet av det egentliga partituret. Används endast ifall termen anges i själva publikationen. @sv
in scheme: Metatietosanasto
preferred label: close score @en
preferred label: particell @sv

kuoropartituuri
type: Concept
source: Kansallinen RDA-termi
source: Nationell RDA-term @sv
created: 2024-10-02
modified: 2024-10-03
alternative label: vokaalipartituuri (kuoropartituuri)
alternative label: vokalpartitur (körpartitur) @sv
definition: Kuoron harjoituskäyttöön tarkoitettu, kuorolle ja soittimille, mahdollisesti myös solistisille lauluäänille sävelletyn teoksen partituuri, jossa kuoroäänet on merkitty omille viivastoilleen, ja josta soitinsäestys on joko jätetty kokonaan pois tai sisällytetty osittain ja pelkistetysti kosketinsoittimelle tai muille sointusoittimille sovitettuna. Jos soitinsäestys on merkitty täydellisenä, käytetään termiä partituuri. Jos teos on alun perin sävelletty säestyksettömälle kuorolle, käytetään termiä partituuri.
definition: Partitur avsett för körövning, innehållande körens, instrumentens och möjligtvis även solistens stämmor. Körens stämmor är noterade i separata notsystem och ackompanjemanget är bortlämnat helt eller ingår delvis i arrangemang för tangent- eller andra instrument. Om ackompanjemanget är noterat i sin helhet, används termen partitur. Ifall verket ursprungligen är komponerat för kör utan ackompanjemang, används termen partitur. @sv
in scheme: Metatietosanasto
preferred label: chorus score @en
preferred label: körpartitur @sv

pienoispartituuri
type: Concept
source: Kansallinen RDA-termi
source: Nationell RDA-term @sv
created: 2024-10-02
modified: 2024-10-02
alternative label: miniature score @en
alternative label: fickpartitur @sv
definition: Pienennetyssä muodossa julkaistu partituuri, ei tarkoitettu ensisijaisesti esityskäyttöön. Aineistossa esiintyy tavallisesti kuvaileva ilmaus, kuten "pienoispartituuri", "Miniature score", "Taschenpartitur", "Partition de poche" tms.
definition: Partitur som publicerats i förminskat format, inte avsett i första hand för användning vid framförande. I materialet förekommer vanligen någon beskrivande fras, såsom "studiepartitur", "Miniature score", "Taschenpartitur", "Partition de poche" e.d. @sv
in scheme: Metatietosanasto
preferred label: study score @en
preferred label: Partition de poche @fr
preferred label: studiepartitur @sv

viulujohtostemma
type: Concept
source: Kansallinen RDA-termi
source: Nationell RDA-term @sv
created: 2024-10-02
modified: 2024-10-03
definition: Yhtyeen tai orkesterin viulistin esitysstemma, jossa on viitteitä muihin soittimiin, jotta stemman soittaja voi myös johtaa yhtyettä. Katso myös johtostemma ja pianojohtostemma.
definition: Framförandestämma för en ensembles eller orkesters violinist, i vilken hänvisningar till övriga instrument framkommer så att violinisten kan leda ensemblen. Se även dirigentstämma och pianodirektion. @sv
in scheme: Metatietosanasto
preferred label: violin conductor part @en
preferred label: violindirektion @sv

sävelmänuotti
type: Concept
source: Kansallinen RDA-termi
source: Nationell RDA-term @sv
created: 2024-10-02
modified: 2024-10-02
alternative label: sävelmänuotinnos
definition: Populaari- tai kansanmusiikin nuottiaineisto, joka sisältää vokaali- ja/tai soitinteoksen yksinkertaistetun nuotinnoksen (sisältää yleensä pelkästään melodian ja sointumerkit tai melodian yksinkertaistetulla pianosäestyksellä).
definition: Notmaterial för populär- eller folkmusik, som innehåller förenklad notation för ett vokalt och/eller instrumentalt verk (innehåller vanligen endast melodi och ackordbeteckningar eller melodi med förenklat pianoackompanjemang). @sv
in scheme: Metatietosanasto
preferred label: melodinoter @sv

myyjä
type: Concept
source: Kansallinen RDA-termi
source: Nationell RDA-term @sv
created: 2024-10-03
modified: 2025-03-18
alternative label: försäljare @sv
definition: Kappaleen aikaisempi omistaja, joka on myynyt sen toiselle omistajalle.
definition: Exemplarets tidigare ägare, som har sålt det åt en annan ägare. @sv
in scheme: Metatietosanasto
preferred label: seller @en
preferred label: säljare @sv

radio-ohjelma
type: Concept
source: Kansallinen RDA-termi
source: Nationell RDA-term @sv
created: 2024-10-03
modified: 2024-11-08
in scheme: Metatietosanasto
preferred label: radioprogram @sv
scope note: Teoksen muoto -termejä käytetään erottamaan toisistaan samannimiset teokset.
scope note: Verkets form-termer används för att åtskilja verk med samma namn. @sv

varatuomari
type: Concept
source: Kansallinen RDA-termi
source: Nationell RDA-term @sv
created: 2024-10-03
modified: 2024-11-05
alternative label: VT
alternative label: varatuomari (arvonimi)
alternative label: vicehäradshövding (hederstitel) @sv
in scheme: Metatietosanasto
preferred label: vicehäradshövding @sv
scope note: Oppiarvona käytä varatuomari.
scope note: Som lärdomsgrad använd vicehäradshövding. @sv

sävellys
type: Concept
source: Kansallinen RDA-termi
source: Nationell RDA-term @sv
created: 2024-10-03
modified: 2024-11-08
in scheme: Metatietosanasto
preferred label: komposition @sv
scope note: Teoksen muoto -termejä käytetään erottamaan toisistaan samannimiset teokset.
scope note: Verkets form-termer används för att åtskilja verk med samma namn. @sv

elokuva
type: Concept
source: Kansallinen RDA-termi
source: Nationell RDA-term @sv
created: 2024-10-03
modified: 2025-01-08
alternative label: animaatioelokuva
alternative label: lyhytelokuva
in scheme: Metatietosanasto
preferred label: film @sv
scope note: Teoksen muoto -terminä käytetään erottamaan toisistaan samannimiset teokset.
scope note: Verkets form-termer används för att åtskilja verk med samma namn. @sv

televisio-ohjelma
type: Concept
source: Kansallinen RDA-termi
source: Nationell RDA-term @sv
created: 2024-10-03
modified: 2024-11-08
in scheme: Metatietosanasto
preferred label: tv-program @sv
scope note: Teoksen muoto -termejä käytetään erottamaan toisistaan samannimiset teokset.
scope note: Verkets form-termer används för att åtskilja verk med samma namn. @sv

laulu
type: Concept
source: Kansallinen RDA-termi
source: Nationell RDA-term @sv
created: 2024-10-03
modified: 2024-11-08
in scheme: Metatietosanasto
preferred label: sång @sv
scope note: Teoksen muoto -termejä käytetään erottamaan toisistaan samannimiset teokset.
scope note: Verkets form-termer används för att åtskilja verk med samma namn. @sv

hallitusneuvos
type: Concept
source: Kansallinen RDA-termi
source: Nationell RDA-term @sv
created: 2024-10-03
modified: 2024-11-05
alternative label: hallitusneuvos (arvonimi)
alternative label: regeringsråd (hederstitel) @sv
in scheme: Metatietosanasto
preferred label: regeringsråd @sv
scope note: Ammattina käytä: hallitusneuvos.
scope note: Som yrke använd: regeringsråd. @sv

aikaisempi omistaja
type: Concept
source: Kansallinen RDA-termi
source: Nationell RDA-term @sv
created: 2024-10-03
modified: 2024-10-03
definition: Toimija, joka on aikaisemmin laillisesti omistanut kappaleen.
definition: En aktör som tidigare varit den lagliga ägaren till exemplaret. @sv
in scheme: Metatietosanasto
preferred label: former owner @en
preferred label: tidigare ägare @sv

lahjoittaja
type: Concept
source: Kansallinen RDA-termi
source: Nationell RDA-term @sv
created: 2024-10-03
modified: 2024-10-03
definition: Kappaleen aikaisempi omistaja, joka on lahjoittanut sen toiselle omistajalle.
definition: Exemplarets tidigare ägare, som har donerat det till en annan ägare. @sv
in scheme: Metatietosanasto
preferred label: donor @en
preferred label: donator @sv

perustuslaki
type: Concept
source: Kansallinen RDA-termi
source: Nationell RDA-term @sv
created: 2024-11-08
modified: 2025-01-25
in scheme: Metatietosanasto
preferred label: grundlag @sv
scope note: Teoksen muoto -termejä käytetään erottamaan toisistaan samannimiset teokset.
scope note: Verkets form-termer används för att åtskilja verk med samma namn. @sv

laki
type: Concept
source: Kansallinen RDA-termi
source: Nationell RDA-term @sv
created: 2024-11-08
modified: 2025-01-18
in scheme: Metatietosanasto
preferred label: lag @sv
scope note: Teoksen muoto -termejä käytetään erottamaan toisistaan samannimiset teokset.
scope note: Verkets form-termer används för att åtskilja verk med samma namn. @sv

arboristi
type: Concept
source: Kansallinen RDA-termi
source: Nationell RDA-term @sv
created: 2024-11-08
modified: 2025-01-08
in scheme: Metatietosanasto
preferred label: arborist @sv

apulaisrehtori
type: Concept
source: Kansallinen RDA-termi
source: Nationell RDA-term @sv
created: 2024-11-08
modified: 2025-01-08
in scheme: Metatietosanasto
preferred label: biträdande rektor @sv

kirjastosihteeri
type: Concept
source: Kansallinen RDA-termi
source: Nationell RDA-term @sv
created: 2024-11-08
modified: 2025-01-17
in scheme: Metatietosanasto
preferred label: bibliotekssekreterare @sv

muste
type: Concept
source: RDA-termi
source: RDA-term @sv
created: 2016-01-08
modified: 2023-05-17
definition: Väriaineita sisältävästä nesteestä tai tahnasta muodostuva materiaali.
definition: Material som består av vätska eller kräm som innehåller färgämnen. @sv
in scheme: Metatietosanasto
preferred label: ink @en
preferred label: bläck @sv

originaali
type: Concept
source: RDA-termi
source: RDA-term @sv
created: 2016-01-08
modified: 2023-05-17
definition: Sukupolven määrite digitaaliselle aineistolle, joka on digitaalisesti luodun aineiston ensimmäinen versio.
definition: Bestämning av generation för digitalt material som är den första versionen av digitalt skapat material. @sv
in scheme: Metatietosanasto
preferred label: original @en

kielletty alle 18-vuotiailta
type: Concept
source: Kansallinen RDA-termi
source: Nationell RDA-term @sv
created: 2016-01-08
modified: 2025-03-04
in scheme: Metatietosanasto
preferred label: förbjuden under 18 år @sv

säkeet peräkkäin
type: Concept
source: RDA-termi
source: RDA-term @sv
created: 2016-01-08
modified: 2023-05-17
preferred label: line by line @en
alternative label: linje för linje @sv
definition: Layout, joka koostuu tekstisäkeistä, jotka vuorottelevat edeltävään tekstiin liittyvien nuottisäkeiden kanssa.
definition: Layout som består av textrader som varvas med notrader sammanhörande med föregående text. @sv
in scheme: Metatietosanasto
preferred label: rad för rad @sv

Teoksen suhteet ekspressioon
type: ConceptGroup
type: Collection
created: 2024-12-18
modified: 2025-01-31
member: aiheena oleva versio
member: konkordanssihakemisto versiolle
member: kritiikki versiosta
member: teoksen versio
member: arviointi versiosta
member: metatietokuvailu versiosta
member: arvostelu versiosta
member: kuvaus versiosta
member: analyysi versiosta
member: edustava versio
member: kommentaari versiosta
member: teokseen liittyvä versio
preferred label: Verks relationer till uttryck @sv

Tiedostotyyppi
type: ConceptGroup
type: Collection
source: RDA-termi
source: RDA-term @sv
created: 2016-01-08
modified: 2023-05-05
definition: Liittää manifestaation tiedostoon koodatun datasisällön yleiseen tyyppiin.
definition: Sammankopplar manifestation med en allmän typ för datainnehåll som kodats i fil. @sv
member: kuvatiedosto
member: ohjelmatiedosto
member: videotiedosto
member: äänitiedosto
member: datatiedosto
member: tekstitiedosto
preferred label: File type @en
preferred label: Filtyp @sv

Yhteisön suhteet yhteisöön
type: ConceptGroup
type: Collection
created: 2024-12-18
modified: 2025-02-01
member: sulautunut yhteisö
member: yhdistynyt yhteisö
member: yhdistymisestä muodostunut yhteisö
member: jakautunut yhteisö
member: jakautumisesta muodostunut yhteisö
member: sulautunut yhteisöön
member: alayhteisö
member: kattoyhteisö
member: yhteisöjäsen yhteisössä
member: yhteisön perustanut yhteisö
member: yhteisön perustama yhteisö
member: yhteisöä sponsoroiva yhteisö
member: laajempi emoyhtiö
member: yhteisön sponsoroima yhteisö
member: yhteisön seuraaja
member: yhteisön edeltäjä
member: paikallinen tytäryhtiö
member: kanssayhdistyjä
member: yhteisön yhteisöjäsen
member: yhteiskonferenssi
member: vaikuttaja
member: vaikuttajana
member: yhteisöön liittyvä yhteisö
member: mesenaatti
member: mesenaattina
preferred label: Institutioners relationer till institutioner @sv

kuvakortti
type: Concept
source: Kansallinen RDA-termi
source: Nationell RDA-term @sv
created: 2016-01-08
modified: 2025-10-04
in scheme: Metatietosanasto
preferred label: bildkort @sv

Manifestaation suhteet teokseen
type: ConceptGroup
type: Collection
created: 2024-12-18
modified: 2025-01-21
member: aineiston sidos
member: aineistoon liittyvä teos
member: sisältää (teos)
member: hierarkkinen luettelo
member: aineistoa metatiedoilla kuvaileva teos
member: aineiston analyysi
member: luettelo
member: aineistoa kuvaava teos
member: aineiston arviointi
member: aineisto aiheena teoksessa
member: aineiston arvostelu
member: hakemisto
member: käytetty lähde metatietoteoksessa
member: aineiston kritiikki
member: aineiston kommentaari
member: kokoelmaluettelo
preferred label: Manifestationers relationer till verk @sv

Yhteisön suhteet henkilöön
type: ConceptGroup
type: Collection
created: 2024-12-18
modified: 2025-02-01
member: opiskelija
member: yhteisöä sponsoroiva henkilö
member: toimihenkilö
member: pääjohtaja
member: loppututkinnon suorittanut
member: edunvalvoja
member: työntekijä
member: liittyy ryhmään
member: johtaja
member: muusa
member: yhteisöön liittyvä henkilö
member: mesenaatti
member: vaikuttaja
member: vaikuttajana
member: mesenaattina
member: murhattu
member: yhteisön henkilöjäsen
member: yhteisön perustanut henkilö
preferred label: Institutioners relationer till personer @sv

tietokonekäyttöinen
type: Concept
source: RDA-termi
source: RDA-term @sv
created: 2016-01-08
modified: 2023-05-05
definition: Viestin sisältää elektronisia tiedostoja ja on tarkoitettu käytettäväksi tietokoneella. Käsittää sekä tiedostopalvelimien kautta käytettävät etäkäyttöiset viestimet että suorakäyttöiset viestimet kuten tietokonenauhat ja -levyt.
definition: Mediet består av elektroniska filer och är avsett för att användas med dator. Omfattar både fjärranvändbara medier som används via filservrar och direktanvändbara medier såsom datorband och -skivor. @sv
in scheme: Metatietosanasto
preferred label: computer @en
preferred label: dator @sv

vinyyli
type: Concept
source: RDA-termi
source: RDA-term @sv
created: 2016-01-08
modified: 2024-03-13
definition: Materiaali, joka muodostuu vinyyliryhmästä, tyypillisesti vinyylikloridista, johdetusta polymeeristä tai kopolymeeristä.
definition: Material som består av polymer eller sampolymer som härletts från en vinylgrupp, typiskt vinylklorid. @sv
in scheme: Metatietosanasto
preferred label: vinyl @en

Kappaleen suhteet manifestaatioon
type: ConceptGroup
type: Collection
created: 2024-12-18
modified: 2025-01-16
member: kappaleen näköispainos
member: konvertoinnin tulos
member: kappaleen digitoitu jäljenne
member: kappaleen säilytyskopio
member: kappaleen jäljenne
member: kappaleen edustama aineisto
member: kappaleeseen liittyvä aineisto
member: kappale kokoelmassa
member: kappaleen uusintapainos
preferred label: Exemplars relationer till manifestationer @sv

esitetty musiikki
type: Concept
source: RDA-termi
source: RDA-term @sv
created: 2016-01-08
modified: 2023-05-05
definition: Kuunneltavaksi tarkoitettu musiikki. Sisältää esim. musiikkiesitysten tallennukset, tietokoneella tuotetun musiikin jne.
definition: Musik avsedd att lyssnas på. Inbegriper upptagningar av musikframföranden, datorproducerad musik m.m. @sv
in scheme: Metatietosanasto
preferred label: performed music @en
preferred label: framförd musik @sv

kuvataulu
type: Concept
source: Kansallinen RDA-termi
source: Nationell RDA-term @sv
created: 2016-01-08
modified: 2025-10-04
in scheme: Metatietosanasto
preferred label: bildtavla @sv

Henkilö
type: ConceptGroup
type: Collection
source: RDA-termi
source: RDA-term @sv
created: 2016-01-08
modified: 2025-03-28
definition: An agent who is an individual human being who lives or is assumed to have lived. @en
definition: Toimija, joka on ihmisyksilö, joka on elossa tai jonka oletetaan olleen elossa.
definition: Person eller identitet skapad av person (ensam eller tillsammans med en eller flera andra individer). @sv
member: henkilön arvonimi tai asema
member: profession or occupation
member: oppiarvo
member: sukupuoli
member: muu henkilöön liittyvä määrite
preferred label: Person @en

lehtiötaulu
type: Concept
source: RDA-termi
source: RDA-term @sv
created: 2016-01-08
modified: 2023-05-17
definition: Ripustettava yhden tai useamman sivun sisältävä paperilehtiö, jota käytetään jalustalla.
definition: En upphängningsmekanism för ett block på en eller flera sidor, utformad för användning på staffli. @sv
in scheme: Metatietosanasto
preferred label: flipchart @en
preferred label: blädderblock @sv
scope note: Ilman laitetta käytettävä tallennetyyppi.
scope note: Omedierad bärartyp. @sv

Henkilön suhteet henkilöön
type: ConceptGroup
type: Collection
created: 2024-12-18
modified: 2025-01-11
member: kollega
member: opettaja
member: assistentti
member: kumppani
member: työtoveri
member: oppilas
member: assistentti henkilölle
member: ystävä
member: henkilön toinen identiteetti
member: henkilön todellinen identiteetti
member: opiskelutoveri
member: setä
member: monikkosisarus
member: täti
member: mesenaattina
member: tuttava
member: kihlattu
member: biologinen vanhempi
member: ottosisarus
member: adoptiosisarus
member: vaikuttaja
member: lapsipuoli
member: biologinen lapsi
member: puoliso
member: lapsi
member: meediona
member: avioton lapsi
member: lapsen puoliso
member: rakastaja
member: kummi
member: sisaruksen lapsi
member: naimaton vanhempi
member: murhaaja
member: avopuoliso
member: äitipuoli
member: puolisisarus
member: meedio
member: biologinen sisarus
member: adoptiovanhempi
member: kummilapsi
member: vanhempi
member: kasvattilapsi
member: eno
member: kasvattivanhempi
member: sisarus
member: appivanhempi
member: sukulainen
member: puolison sisarus
member: isovanhempi
member: vanhemman sisarus
member: serkku
member: vaikuttajana
member: muusana
member: muusa
member: isäpuoli
member: lapsenlapsi
member: kasvattisisarus
member: adoptiolapsi
member: hengellinen kontakti
member: murhattu
member: mesenaatti
member: henkilöön liittyvä henkilö
preferred label: Personers relationer till personer @sv

Manifestaation suhteet kappaleeseen
type: ConceptGroup
type: Collection
created: 2024-12-18
modified: 2025-01-21
member: kokoelman kappale
member: digitoitu kappaleesta
member: näköispainos kappaleesta
member: jäljenne kappaleesta
member: aineistoon liittyvä kappale
member: konvertoitu kappale
member: aineiston kappale
member: säilytyskopio kappaleesta
member: uusintapainos kappaleesta
preferred label: Manifestationers relationer till exemplar @sv

DVD-Audio
type: Concept
source: Kansallinen RDA-termi
source: Nationell RDA-term @sv
created: 2016-01-08
modified: 2024-05-24
alternative label: DVD-A
in scheme: Metatietosanasto
scope note: DVD-levyjen yleisin digitaalinen formaatti.
scope note: Äänen koodausmuoto.
scope note: Det vanligaste digitala formatet för DVD-skivor. @sv
scope note: Kodningsformat för ljud. @sv

toimijaan liittyvä suku
type: Concept
source: RDA-termi
source: RDA-term @sv
created: 2024-12-18
modified: 2025-08-23
definition: Suku, johon identifioitavana oleva toimija liittyy. (RDA Registry)
definition: Släkt som en aktör relaterar till. @sv
in scheme: Metatietosanasto
preferred label: related family of agent @en
preferred label: släkt relaterad till aktören @sv

Polariteetti
type: ConceptGroup
type: Collection
source: RDA-termi
source: RDA-term @sv
created: 2016-01-08
modified: 2023-05-05
member: positiivi
member: negatiivi
member: polariteettien yhdistelmä
preferred label: Polarity @en
preferred label: Polaritet @sv
scope note: Liittää manifestaation suhteeseen, joka kuvan väreillä ja valoisuudella on kuvan kohteen väreihin ja valoisuuteen.
scope note: Sammankopplar manifestation med det förhållande som färger och ljushet i en bild har till bildobjektets färger och ljushet. @sv

Henkilön suhteet sukuun
type: ConceptGroup
type: Collection
created: 2024-12-18
modified: 2025-01-11
member: henkilöstä polveutuva suku
member: henkilöjäsen suvussa
member: tunnettu jäsen suvussa
member: henkilöön liittyvä suku
preferred label: Personers relationer till släkter @sv

Ekspression suhteet kappaleeseen
type: ConceptGroup
type: Collection
created: 2024-12-18
modified: 2025-01-10
member: versioon liittyvä kappale
preferred label: Uttrycks relationer till exemplar @sv

Teoksen suhteet manifestaatioon
type: ConceptGroup
type: Collection
created: 2024-12-18
modified: 2025-01-31
member: aineiston sidos aineistosta
member: arviointi aineistosta
member: kommentaari aineistosta
member: luettelo aineistolle
member: hierarkkinen luettelo aineistolle
member: arvostelu aineistosta
member: käytetty lähde
member: kuvaus aineistosta
member: hakemisto aineistolle
member: teokseen liittyvä aineisto
member: sisältyy aineistoon
member: aiheena oleva aineisto
member: analyysi aineistosta
member: kokoelmaluettelo aineistolle
member: kritiikki aineistosta
member: metatietokuvailu aineistosta
preferred label: Verks relationer till manifestationer @sv

Teoksen suhteet kappaleeseen
type: ConceptGroup
type: Collection
created: 2024-12-18
modified: 2025-01-31
member: teokseen liittyvä kappale
member: kappaleen sidos kappaleesta
member: analyysi kappaleesta
member: metatietokuvailu kappaleesta
member: aiheena oleva kappale
member: kuvaus kappaleesta
member: kommentaari kappaleesta
preferred label: Verks relationer till exemplar @sv

Yhteisön suhteet sukuun
type: ConceptGroup
type: Collection
created: 2024-12-18
modified: 2025-02-01
member: yhteisöä sponsoroiva suku
member: yhteisön perustanut suku
member: yhteisöjäsen suvussa
member: yhteisön sukujäsen
member: yhteisöön liittyvä suku
preferred label: Institutioners relationer till släkter @sv

tekijän signeeraus
type: Concept
source: Kansallinen RDA-termi
source: Nationell RDA-term @sv
created: 2016-01-08
modified: 2025-04-12
alternative label: författarens signatur @sv
alternative label: skaparens signatur @sv
alternative label: upphovsmannens signatur @sv
in scheme: Metatietosanasto
preferred label: upphovspersonens signatur @sv

keramiikka
type: Concept
source: RDA-termi
source: RDA-term @sv
created: 2016-01-08
modified: 2024-03-13
definition: Epämetallisista mineraaleista kuten savesta muodostuva pohjamateriaali, joka on poltettu korkeassa lämpötilassa, tuloksena kova, hauras, kuumuuden ja kulutuksenkestävä materiaali.
definition: Basmaterial bildat av icke-metalliska mineraler såsom lera, som bränts i hög temperatur med ett hårt och skört, värmetåligt och slitstarkt material som resultat. @sv
in scheme: Metatietosanasto
preferred label: ceramic @en
preferred label: keramik @sv

poikkileikkaus
type: Concept
source: RDA-termi
source: RDA-term @sv
created: 2016-01-08
modified: 2024-05-09
alternative label: tvärsektion @sv
definition: Laajuuden yksikkö on mittakaavassa ja tavallisesti tasossa esitetty pystysuora pinta, joka kuvaa sekä taivaankappaleen pinnan tai käsitteellisen mallin poikkileikkaavan profiilin että poikkaleikatun tason alla olevat kerrokset.
definition: Enhet som är en skalenlig framställning av en vertikal yta, vanligen ett plan, och som visar både profilen där den genomskär en himlakropps yta, eller en konceptuell modell, och de underliggande strukturerna längs det genomskurna planet. @sv
in scheme: Metatietosanasto
preferred label: section @en
preferred label: tvärsnitt @sv

maalaus
type: Concept
source: RDA-termi
source: RDA-term @sv
created: 2016-01-08
modified: 2023-05-17
definition: Laajuuden yksikkö, liikkumaton kuva, joka on tehty useimmiten maalaamalla väriaineita suoraan alustalle, yleensä kaksiulotteiselle pinnalle.
definition: Enhet, stillbild, oftast framställd genom att måla färg direkt på ett underlag, vanligtvis på en tvådimensionell yta. @sv
in scheme: Metatietosanasto
preferred label: painting @en
preferred label: målning @sv

sukuun liittyvä toimija
type: Concept
source: RDA-termi
source: RDA-term @sv
created: 2024-12-18
modified: 2025-08-21
definition: Toimija, joka liittyy sukuun. (RDA Registry)
definition: Aktör som relaterar till en släkt. @sv
in scheme: Metatietosanasto
preferred label: related agent of family @en
preferred label: aktör relaterad till släkten @sv

Pienennyssuhteen määrite
type: ConceptGroup
type: Collection
source: RDA-termi
source: RDA-term @sv
created: 2016-01-08
modified: 2025-11-26
definition: Yleinen määrite, joka ilmaisee mikrokokoiseksi pienennetyn kuvan suhteen alkuperäiseen kuvaan, josta pienennetty kuva on tuotettu.
definition: Allmän bestämning som anger storleksförhållandet mellan en bild som förminskats till mikrostorlek och en ursprunglig bild, ur vilken den förminskade bilden producerats. @sv
member: vähäinen pienennys
member: hyvin voimakas pienennys
member: voimakas pienennys
member: kohtalainen pienennys
member: normaali pienennys
preferred label: Reduction ratio designation @en
preferred label: Attribut till förminskningsgrad @sv

normaali pienennys
type: Concept
source: RDA-termi
source: RDA-term @sv
created: 2016-01-08
modified: 2023-05-17
definition: Pienennyssuhde mikromuotoiselle aineistolle, kun suhde alkuperäiseen kuvaan on 16x–30x.
definition: Förminskningsgrad för material i mikroform, då förhållandet till den ursprungliga bilden är 16x-30x. @sv
in scheme: Metatietosanasto
preferred label: normal reduction @en
preferred label: normal förminskning @sv

Ekspression suhteet teokseen
type: ConceptGroup
type: Collection
created: 2024-12-18
modified: 2025-01-10
member: versiota metatiedoilla kuvaileva teos
member: teos
member: version kritiikki
member: versio aiheena teoksessa
member: versioon liittyvä teos
member: edustava versio teokselle
member: version arvostelu
member: version kommentaari
member: version arviointi
member: konkordanssihakemisto
member: versiota kuvaava teos
member: version analyysi
preferred label: Uttrycks relationer till verk @sv

Layout
type: ConceptGroup
type: Collection
source: RDA-termi
source: RDA-term @sv
created: 2016-01-08
modified: 2024-03-19
member: harvennettu riviväli
member: outline
member: tahdit peräkkäin
member: vertikaalinen partituuri
member: avoin partituuri
member: melody chord system
member: yksipuolinen
member: osat peräkkäin
member: kaksipuolinen
member: paragrafi
member: yksirivinen
member: säkeet peräkkäin
member: molemmilla puolilla
member: tahdit allekkain
member: short form scoring
member: kääntöpuolilla
member: yksittäinen nuottiviiva
member: säkeet allekkain
scope note: Liittää manifestaation manifestaatioon sisältyvän tekstin, kuvien, taktiilin musiikkinotaation tms. sommitteluun.
scope note: Sammankopplar manifestation med layout för text, illustrationer, taktil musiknotation etc. som ingår i manifestationen. @sv

Palkinnot
type: ConceptGroup
type: Collection
source: RDA-termi
source: RDA-term @sv
created: 2016-01-08
modified: 2023-05-05
alternative label: Kirjallisuuspalkinnot
alternative label: Litteraturpris @sv
alternative label: Litteraturpriser @sv
alternative label: Pris @sv
alternative label: Priser @sv
definition: Liittää ekspression jonkin palkintoja jakavan yhteisön antamaan muodolliseen tunnustukseen aineiston sisällöllisistä ansioista.
definition: Sammankopplar uttryck med ett formellt erkännande för materialets innehållsliga förtjänster, gett av någon organisation som utdelar priser. @sv
example: MARC 21 -formaatissa: 586 ## ‡a Vuoden tiedekirja, 2020
example: I MARC 21-formatet: 586 ## ‡a Årets vetenskapsbok, 2020 @sv
member: Mikael Agricola -palkinto
member: Kiitos kirjasta -mitali
member: Finlandia-palkinto
member: Tieto-Lauri-palkinto
member: Runeberg-palkinto
member: Vuoden johtolanka
member: Anni Swan -mitali
member: Helsingin Sanomien kirjallisuuspalkinto
member: Tanssiva karhu -runopalkinto
member: Vuoden tiedekirja
member: Topelius-palkinto
member: Pohjoismaiden neuvoston kirjallisuuspalkinto
member: Runeberg Junior -palkinto
member: Tieto-Finlandia-palkinto
member: Kalevi Jäntin palkinto
member: Sarjakuva-Finlandia-palkinto
member: Jarl Hellemann -palkinto
member: Vuoden luontokirja
member: Tähtivaeltaja-palkinto
member: Suomen Ekonomien kirjallisuuspalkinto
member: Vuoden historiateos
member: Lauri Jäntin tietokirjapalkinto
member: Tiedonjulkistamisen valtionpalkinto
member: Vuoden kristillinen kirja
member: Kääntäjäkarhu-palkinto
member: Rudolf Koivu -palkinto
member: Finlandia Junior -palkinto
member: Lasiavain-palkinto
preferred label: Awards @en
preferred label: Utmärkelser @sv

Henkilön suhteet yhteisöön
type: ConceptGroup
type: Collection
created: 2024-12-18
modified: 2025-01-11
member: toimihenkilönä yhteisössä
member: oppilaitos
member: työnantaja
member: pääjohtajana yhteisössä
member: edunvalvojana yhteisössä
member: tutkinnon myöntänyt oppilaitos
member: henkilöjäsen yhteisössä
member: johtajana
member: liittyy ryhmään
member: muusana
member: mesenaattina
member: mesenaatti
member: henkilön perustama yhteisö
member: henkilöön liittyvä yhteisö
member: vaikuttajana
member: vaikuttaja
member: murhaaja
member: henkilön sponsoroima yhteisö
preferred label: Personers relationer till institutioner @sv

Kääntäjäkarhu-palkinto
type: Concept
source: Kansallinen RDA-termi
source: Nationell RDA-term @sv
created: 2016-01-08
modified: 2023-05-17
alternative label: Tanssivan karhun kääntäjä -palkinto
alternative label: Översättarbjörnen-priset @sv
definition: Vuoden paras käännöskokoelma. Jaettu vuodesta 1994 alkaen.
definition: Pris för årets bästa översättning. Utdelat sedan år 1994. @sv
example: MARC 21 -formaatissa: 586 ## ‡a Kääntäjäkarhu-palkinto, 2018
example: I MARC 21-formatet: 586 ## ‡a Översättarbjörnen, 2018 @sv
in scheme: Metatietosanasto
preferred label: Översättarbjörnen @sv

molemmilla puolilla
type: Concept
source: RDA-termi
source: RDA-term @sv
created: 2016-01-08
modified: 2023-05-17
definition: Layout, joka jatkuu samassa mittakaavassa arkin tai arkkien molemmilla puolilla.
definition: Layout som fortsätter i samma skala på båda sidorna av ett ark. @sv
in scheme: Metatietosanasto
preferred label: both sides @en
preferred label: på båda sidorna @sv

henkilöön liittyvä toimija
type: Concept
source: RDA-termi
source: RDA-term @sv
created: 2024-12-18
modified: 2025-06-14
definition: Toimija, joka liittyy henkilöön. (RDA Registry)
definition: Aktör som är relaterad till en person. @sv
in scheme: Metatietosanasto
preferred label: related agent of person @en
preferred label: aktör relaterad till personen @sv

Manifestaation suhteet ekspressioon
type: ConceptGroup
type: Collection
created: 2024-12-18
modified: 2025-01-21
member: sisältää (ekspressio)
member: aineistoon liittyvä versio
preferred label: Manifestationers relationer till uttryck @sv

taktiili nuottikirjoitus
type: Concept
source: RDA-termi
source: RDA-term @sv
created: 2016-01-08
modified: 2023-05-05
alternative label: kosketeltava nuottikirjoitus
definition: Musiikkinotaationa esitetty sisältö, joka on tarkoitettu kosketeltavaksi. Esimerkiksi pistenuottikirjoitus ja muut taktiilit nuottikirjoitukset.
definition: Noterad musik avsedd att vidröras, t.ex. punktskriftsnoter. @sv
in scheme: Metatietosanasto
preferred label: tactile notated music @en
preferred label: taktil musiknotation @sv

painokuva
type: Concept
source: RDA-termi
source: RDA-term @sv
created: 2016-01-08
modified: 2023-05-17
definition: Laajuuden yksikkö, liikkumaton kuva, joka on valmistettu siirtämällä kuva esimerkiksi painolevyn, kuvaruudun tai muun matriisin kautta käyttäen mitä tahansa monista painomenetelmistä.
definition: Enhet, stillbild som är framställd genom överföring från t.ex. tryckplåt, bildskärm eller någon annan matris genom att använda en av många möjliga tryckmetoder. @sv
in scheme: Metatietosanasto
preferred label: print @en
preferred label: tryckt bild @sv

D-2
type: Concept
source: RDA-termi
source: RDA-term @sv
created: 2016-01-08
modified: 2023-05-17
definition: Analogisen nauhan videoformaatti, jonka Ampex kehitti ammattilaiskäyttöön vuonna 1988.
definition: Videoformat för analogt band, som Ampex utvecklade för professionellt bruk år 1988. @sv
in scheme: Metatietosanasto

Suvun suhteet toimijaan
type: ConceptGroup
type: Collection
created: 2024-12-18
modified: 2025-01-29
member: sukuun liittyvä toimija
preferred label: Släkters relationer till aktörer @sv

näyte
type: Concept
source: RDA-termi
source: RDA-term @sv
created: 2016-01-08
modified: 2023-05-17
definition: Laajuuden yksikkö, joka muodostuu yksittäisestä yksiköstä tai mallikappaleesta, joka on valittu edustamaan suurempaa kokonaismäärää.
definition: Enhet som utgörs av en enskild enhet eller ett modellexemplar som har valts ut för att representera en större totalmängd. @sv
in scheme: Metatietosanasto
preferred label: specimen @en
preferred label: prov @sv

Suvun suhteet sukuun
type: ConceptGroup
type: Collection
created: 2024-12-18
modified: 2025-01-29
member: suvusta polveutuva suku
member: sukuhaara suvussa
member: suvun kantasuku
member: suvun sukuhaara
member: sukuun liittyvä suku
member: suvun edeltäjä
member: suvun seuraaja
preferred label: Släkters relationer till släkter @sv

CED
type: Concept
source: RDA-termi
source: RDA-term @sv
created: 2016-01-08
modified: 2023-05-17
definition: Analogisen levyn videoformaatti.
definition: Videoformat för analog skiva. @sv
in scheme: Metatietosanasto

Yhteisön suhteet toimijaan
type: ConceptGroup
type: Collection
created: 2024-12-18
modified: 2025-02-01
member: yhteisöä sponsoroiva toimija
member: yhteisöön liittyvä toimija
member: yhteisön perustanut toimija
preferred label: Institutioners relationer till aktörer @sv

Ekspression suhteet manifestaatioon
type: ConceptGroup
type: Collection
created: 2024-12-18
modified: 2025-01-10
member: sisältyy aineistoon
member: versioon liittyvä manifestaatio
preferred label: Uttrycks relationer till manifestationer @sv

Omistushistoria
type: ConceptGroup
type: Collection
source: RDA-termi
source: RDA-term @sv
created: 2016-01-08
modified: 2024-10-03
member: myyjä
member: aikaisempi omistaja
member: lahjoittaja
preferred label: Custodial history of item @en
preferred label: Ägarhistorik @sv

Suvun suhteet yhteisöön
type: ConceptGroup
type: Collection
created: 2024-12-18
modified: 2025-01-29
member: suvun sponsoroima yhteisö
member: suvun perustama yhteisö
member: sukuun liittyvä yhteisö
member: sukujäsen yhteisössä
member: suvun yhteisöjäsen
preferred label: Släkters relationer till institutioner @sv

toimijaan liittyvä henkilö
type: Concept
source: RDA-termi
source: RDA-term @sv
created: 2024-12-18
modified: 2025-08-23
definition: Henkilö, johon identifioitavana oleva toimija liittyy. (RDA Registry)
definition: Person som en aktör relaterar till. @sv
in scheme: Metatietosanasto
preferred label: related person of agent @en
preferred label: person relaterad till aktören @sv

Kappaleen suhteet ekspressioon
type: ConceptGroup
type: Collection
created: 2024-12-18
modified: 2025-01-16
member: kappaleeseen liittyvä versio
preferred label: Exemplars relationer till uttryck @sv

Kappaleen suhteet teokseen
type: ConceptGroup
type: Collection
created: 2024-12-18
modified: 2025-01-16
member: kappaleeseen liittyvä teos
member: kappaleen kommentaari
member: kappaleen analyysi
member: kappaletta kuvaava teos
member: kappale aiheena teoksessa
member: kappaletta metatiedoilla kuvaileva teos
member: kappaleen sidos
preferred label: Exemplars relationer till verk @sv

opetuskuva
type: Concept
source: RDA-termi
source: RDA-term @sv
created: 2016-01-08
modified: 2023-05-17
definition: Laajuuden yksikkö, kuva jonka ohessa voi olla tekstiä ja jota käytetään opetustarkoitukseen.
definition: Enhet, bild som kan ha tillhörande text och som används i undervisningssyfte. @sv
in scheme: Metatietosanasto
preferred label: study print @en
preferred label: undervisningsbild @sv

Suvun suhteet henkilöön
type: ConceptGroup
type: Collection
created: 2024-12-18
modified: 2025-01-29
member: suvun kantahenkilö
member: suvun henkilöjäsen
member: sukuun liittyvä henkilö
member: suvun tunnettu jäsen
preferred label: Släkters relationer till personer @sv

toimijaan liittyvä yhteisö
type: Concept
source: RDA-termi
source: RDA-term @sv
created: 2024-12-18
modified: 2025-08-23
definition: Yhteisö, johon identifioitavana oleva toimija liittyy. (RDA Registry)
definition: Institution som en aktör relaterar till. @sv
in scheme: Metatietosanasto
preferred label: related corporate body of agent @en
preferred label: institution relaterad till aktören @sv

Henkilön suhteet toimijaan
type: ConceptGroup
type: Collection
created: 2024-12-18
modified: 2025-01-11
member: henkilöön liittyvä toimija
preferred label: Personers relationer till aktörer @sv

Ikärajat
type: ConceptGroup
type: Collection
source: Kansallinen RDA-termi
source: Nationell RDA-term @sv
created: 2025-03-04
modified: 2025-04-12
member: kielletty alle 12-vuotiailta
member: kielletty alle 7-vuotiailta
member: sallittu kaikenikäisille
member: kielletty alle 16-vuotiailta
member: kielletty alle 18-vuotiailta
preferred label: Åldersgränser @sv

fiktiivinen suku
type: Concept
source: Kansallinen RDA-termi
source: Nationell RDA-term @sv
created: 2025-06-03
modified: 2025-10-21
in scheme: Metatietosanasto
preferred label: fiktiv släkt @sv
scope note: Ei ole RDA:n mukainen toimija.
scope note: Är inte en aktör i enlighet med RDA. @sv

muu sukuun liittyvä määrite
type: ConceptGroup
type: Collection
source: Kansallinen RDA-termi
source: Nationell RDA-term @sv
created: 2025-06-07
modified: 2025-06-07
alternative label: annan bestämning relaterad till släkt @sv
alternative label: annat epitet relaterat till släkt @sv
member: fiktiivinen suku
preferred label: other designation associated with family @en
preferred label: annat attribut relaterat till släkt @sv

muu paikkaan liittyvä määrite
type: ConceptGroup
type: Collection
source: Kansallinen RDA-termi
source: Nationell RDA-term @sv
created: 2025-06-07
modified: 2025-06-07
alternative label: annan bestämning relaterad till plats @sv
alternative label: annat epitet relaterat till plats @sv
member: fiktiivinen paikka
preferred label: other designation associated with place @en
preferred label: annat attribut relaterat till plats @sv

estenomi
type: Concept
source: Kansallinen RDA-termi
source: Nationell RDA-term @sv
created: 2025-06-13
modified: 2025-08-13
in scheme: Metatietosanasto
preferred label: estenom @sv

sointuotteet
type: Concept
source: RDA-termi
source: RDA-term @sv
created: 2025-06-26
modified: 2025-11-01
alternative label: sointukaaviot
alternative label: ackordgrepp @sv
definition: Nuottikirjoituksen tyyppi, jossa käytetään ruudukolle järjestettyjä pisteitä tai muita symboleja edustamaan sormituksia, joita käytetään tietyn soinnun tuottamiseen otenauhallisella kielisoittimella.
definition: Typ av notskrift, i vilken punkter och andra symboler ordnade i rutfält används för att representera fingersättningar, som används för att producera ett visst ackord på stränginstrument med band. @sv
in scheme: Metatietosanasto
preferred label: chord diagrams @en
preferred label: ackorddiagram @sv

sointumerkit
type: Concept
source: RDA-termi
source: RDA-term @sv
created: 2025-06-26
modified: 2025-10-10
alternative label: ackordsymboler @sv
definition: Nuottikirjoituksen tyyppi, jossa käytetään kirjaimia, numeroita ja symboleja ilmaisemaan musiikkikappaleen harmonista etenemistä nimeämällä sointuja niiden perussävelten, laadun (duurit, mollit, ylinousevat tai vähennetyt) ja lisättyjen tai muunnettujen sävelkorkeuksien osalta.
definition: Typ av notskrift, i vilken bokstäver, siffror och symboler används för att uttrycka ett musikstyckes harmoniska framskridande, genom att benämna ackord enligt deras grundton, kvalitet (dur, moll, överstigande eller förminskade) och tillagda eller varierade tonhöjder. @sv
in scheme: Metatietosanasto
preferred label: chord symbols @en
preferred label: ackordbeteckningar @sv

äänikirjan lukija
type: Concept
source: Kansallinen RDA-termi
source: Nationell RDA-term @sv
created: 2025-08-16
modified: 2025-11-04
in scheme: Metatietosanasto
preferred label: ljudboksuppläsare @sv
scope note: Käytetään vain ammattimaisista äänikirjojen lukijoista. Ei käytetä, jos henkilö lukee satunnaisesti äänikirjan, esimerkiksi kun kirjailija lukee oman kirjansa äänikirjaksi.
scope note: Används endast om professionella uppläsare av ljudböcker. Används inte om en person som tillfälligt läser upp en ljudbok, till exempel då en författare själv läser upp sin egen bok. @sv

kuvionuottikirjoitus
type: Concept
source: Kansallinen RDA-termi
source: Nationell RDA-term @sv
created: 2025-09-05
modified: 2025-10-18
definition: Nuottikirjoituksen tyyppi, joka on yleensä luettavissa myös viivastonuottikirjoituksena, jossa sävelkorkeudet merkitään käyttämällä nuottien päissä esimerkiksi erilaisia geometrisia muotoja ja värejä.
definition: Typ av notskrift, som vanligen även kan läsas som traditionell västerländsk notskrift och i vilken tonhöjderna anges genom att använda olika geometriska former och färger. @sv
in scheme: Metatietosanasto
preferred label: figurnotation @sv

Urajako
type: ConceptGroup
type: Collection
source: RDA-termi
source: RDA-term @sv
created: 2025-09-10
modified: 2025-10-18
definition: Analogisen äänilieriön urajako.
definition: Spårdelning för en analog ljudcylinder. @sv
member: standardi
member: hieno
preferred label: Groove pitch @en
preferred label: Spårdelning @sv

Uran leveys
type: ConceptGroup
type: Collection
source: RDA-termi
source: RDA-term @sv
created: 2025-09-10
modified: 2025-10-18
definition: Analogisen levyn uran leveys.
definition: Spårbredd för en analog skiva. @sv
member: mikroura
member: leveä ura
preferred label: Groove width @en
preferred label: Spårbredd @sv

Kappaleen nimeke
type: ConceptGroup
type: Collection
source: RDA-termi
source: RDA-term @sv
created: 2025-09-24
modified: 2025-10-18
definition: Kappaleen nimitys, joka on luonnollisen kielen ja yleisen kielen sanamuodon mukainen.
definition: Titel för ett exemplar, som är på ett naturligt språk och med en ordalydelse som används i allmänt språk. @sv
member: kappaleen ensisijainen nimeke
member: kappaleen varianttinimeke
preferred label: Title of item @en
preferred label: Exemplarstitel @sv

ekspression ensisijainen nimeke
type: Concept
source: RDA-termi
source: RDA-term @sv
created: 2025-09-24
modified: 2025-10-18
definition: Ekspression nimeke, joka on valittu ensisijaiseksi tietyssä sovelluksessa tai kontekstissa.
definition: Titel för uttryck, som har valts till primär i en viss tillämpning eller kontext. @sv
in scheme: Metatietosanasto
preferred label: preferred title of expression @en
preferred label: föredragen titel för uttrycket @sv

Ekspression nimeke
type: ConceptGroup
type: Collection
source: RDA-termi
source: RDA-term @sv
created: 2025-09-24
modified: 2025-10-18
definition: Luonnollisella kielellä ja sanamuodolla oleva, yleisessä kielessä käytetty ekspression nimitys.
definition: Titel för ett uttryck, som är i enlighet med naturligt språk och ordalydelse i allmänt språkbruk. @sv
member: ekspression ensisijainen nimeke
member: ekspression varianttinimeke
preferred label: Title of expression @en
preferred label: Uttryckstitel @sv

Avainnimeke
type: ConceptGroup
type: Collection
source: RDA-termi
source: RDA-term @sv
created: 2025-09-24
modified: 2025-10-18
definition: Teoksen nimeke, jonka on antanut ISSN-rekisteröintitoimisto.
definition: Titel för verk, som en ISSN-registreringsbyrå gett. @sv
preferred label: Key title @en
preferred label: Nyckeltitel @sv

sarjan rinnakkainen nimeke
type: Concept
source: RDA-termi
source: RDA-term @sv
created: 2025-09-24
modified: 2025-11-11
alternative label: parallell titel för serie @sv
definition: Sarjan nimeke toisella kielellä tai kirjoitusjärjestelmällä.
definition: Titel för serie, på ett annat språk eller skriftsystem. @sv
in scheme: Metatietosanasto
preferred label: parallel title of series @en
preferred label: parallell serietitel @sv

kappaleen ensisijainen nimeke
type: Concept
source: RDA-termi
source: RDA-term @sv
created: 2025-09-24
modified: 2025-10-18
definition: Kappaleen nimeke, joka on valittu ensisijaiseksi tietyssä sovelluksessa tai kontekstissa.
definition: Titel för exemplar, som har valts till primär i en viss tillämpning eller kontext. @sv
in scheme: Metatietosanasto
preferred label: preferred title of item @en
preferred label: föredragen titel för exemplaret @sv

kappaleen varianttinimeke
type: Concept
source: RDA-termi
source: RDA-term @sv
created: 2025-09-24
modified: 2025-10-18
definition: Kappaleen nimeke, jota ei ole valittu ensisijaiseksi tietyssä sovelluksessa tai kontekstissa.
definition: Titel för exemplar, som inte har valts till primär i en viss tillämpning eller kontext. @sv
in scheme: Metatietosanasto
preferred label: variant title of item @en
preferred label: varianttitel för exemplaret @sv

ekspression varianttinimeke
type: Concept
source: RDA-termi
source: RDA-term @sv
created: 2025-09-24
modified: 2025-10-18
definition: Ekspression nimeke, jota ei ole valittu ensisijaiseksi tietyssä sovelluksessa tai kontekstissa.
definition: Titel för uttryck, som inte har valts till primär i en viss tillämpning eller kontext. @sv
in scheme: Metatietosanasto
preferred label: variant title of expression @en
preferred label: varianttitel för uttrycket @sv

kokoelma
type: Concept
source: Kansallinen RDA-termi
source: Nationell RDA-term @sv
created: 2025-09-25
modified: 2025-10-18
in scheme: Metatietosanasto
preferred label: samling @sv
scope note: Teoksen muoto -termejä käytetään erottamaan toisistaan samannimiset teokset.
scope note: Verkets form-termer används för att åtskilja verk med samma namn. @sv

kokoomateos
type: Concept
source: Kansallinen RDA-termi
source: Nationell RDA-term @sv
created: 2025-12-13
modified: 2026-01-09
in scheme: Metatietosanasto
preferred label: samlingsverk @sv
scope note: Teoksen muoto -termejä käytetään erottamaan toisistaan samannimiset teokset.
scope note: Verkets form-termer används för att åtskilja verk med samma namn. @sv

roolittaja
type: Concept
source: Kansallinen RDA-termi
source: Nationell RDA-term @sv
created: 2026-05-06
modified: 2026-05-06
in scheme: Metatietosanasto
preferred label: casting director @en
preferred label: rollsättare @sv

yksinkertaistettu
type: Concept
source: Kansallinen RDA-termi
source: Nationell RDA-term @sv
created: 2026-05-26
modified: 2026-06-06
definition: Version määrite ekspressiolle, joka on musiikkiteoksen alkuperäiselle esityskokoonpanolle tehty yksinkertaistettu sovitus.
definition: Attribut till version för ett uttryck som är en förenklad bearbetning av ett musikverk, gjord för den ursprungliga musikaliska besättningen. @sv
in scheme: Metatietosanasto
preferred label: förenklad @sv

Version määrite
type: ConceptGroup
type: Collection
source: RDA-termi
source: RDA-term @sv
created: 2026-05-26
modified: 2026-06-06
definition: Sana tai ilmaus, merkki tai sana- tai merkkiryhmä, joka erottaa ekspression toisesta saman teoksen ekspressiosta.
definition: Ord eller uttryck, tecken eller ord- eller teckengrupp, som särskiljer ett uttryck från ett annat uttryck av samma verk. @sv
member: yksinkertaistettu
member: sovitettu
member: luonnoksia
preferred label: Designation of version @en
preferred label: Attribut till version @sv

sovitettu
type: Concept
source: Kansallinen RDA-termi
source: Nationell RDA-term @sv
created: 2026-05-26
modified: 2026-06-06
definition: Version määrite ekspressiolle, joka on musiikkiteoksen sovitus.
definition: Attribut till version för ett uttryck som är en bearbetning av ett musikverk. @sv
in scheme: Metatietosanasto
preferred label: bearbetad @sv

luonnoksia
type: Concept
source: Kansallinen RDA-termi
source: Nationell RDA-term @sv
created: 2026-05-26
modified: 2026-06-11
definition: Version määrite ekspressiolle, joka koostuu säveltäjän yhden tai useamman musiikkiteoksen luonnoksista.
definition: Attribut till version för ett uttryck som består av utkast till ett eller flera musikverk av en kompositör. @sv
in scheme: Metatietosanasto
preferred label: utkast @sv

Kappale
type: ConceptGroup
type: Collection
source: RDA-termi
source: RDA-term @sv
created: 2016-01-08
modified: 2025-09-24
definition: Yksittäinen manifestaation toteutuma (esim. yksittäinen CD-äänilevy, kirja kirjaston kokoelmissa).
definition: Ett enskilt förverkligande av en manifestation (t.ex. enskild CD-ljudksiva, en bok i ett biblioteks samlingar) @sv
member: Hankintalähde
member: Aineiston käsittelyyn liittyvät termit ja fraasit
member: Omistushistoria
member: Kappaleen nimeke
member: Huomautus kappalekohtaisen tallenteen ominaisuudesta
preferred label: Item @en
preferred label: Exemplar @sv

tekninen piirustus
type: Concept
source: RDA-termi
source: RDA-term @sv
created: 2016-01-08
modified: 2023-05-17
definition: Laajuuden yksikkö, liikkumaton kuva, joka muodostuu poikkileikkauksesta, yksityiskohdista, kaavioista, julkisivupiirustuksesta, perspektiivistä, pohjapiirroksesta, työpiirustuksesta tms. Käytetään rakentamisessa ja muissa teknisissä yhteyksissä.
definition: Enhet, stillbild bestående av tvärprojektion, detalj, diagram, vertikalprojektion, perspektiv, planritning, arbetsritning o.s.v. Används inom byggbranschen och andra tekniska sammanhang. @sv
in scheme: Metatietosanasto
preferred label: technical drawing @en
preferred label: teknisk ritning @sv

paperi
type: Concept
source: RDA-termi
source: RDA-term @sv
created: 2016-01-08
modified: 2024-03-13
definition: Ohut ja litteä kasvikuidusta sekä eläinperäisistä, mineraalipohjaisista tai synteettisistä täyteaineista tehdystä massasta puristamalla valmistettu materiaali.
definition: Tunt och platt material, som tillverkats genom att pressa massa bestående av växtfibrer och animaliska, mineralbaserade eller syntetiska fyllnadsmedel. @sv
in scheme: Metatietosanasto
preferred label: paper @en
preferred label: papper @sv

kollaasi
type: Concept
source: RDA-termi
source: RDA-term @sv
created: 2016-01-08
modified: 2023-05-17
definition: Laajuuden yksikkö, koostuu kaksiulotteisesta tai hyvin matalasta kohokuvasta, joka on tehty liimaamalla yhteen paperia, kangasta, valokuvia tai muita materiaaleja tasaiselle pinnalle.
definition: Enhet bestående av tvådimensionell bild eller mycket låg relief. Framställs genom att limma samman papper, tyg, fotografier eller andra material på en jämn yta. @sv
in scheme: Metatietosanasto
preferred label: collage @en

monikangas
type: Concept
source: RDA-termi
source: RDA-term @sv
created: 2016-01-08
modified: 2023-05-17
alternative label: multiduk @sv
definition: Elokuvafilmin esitysformaatti, joka käyttää useampia kankaita.
definition: Visningsformat för film, som använder flera filmdukar. @sv
in scheme: Metatietosanasto
preferred label: multiscreen @en

3 3/4 tuumaa/s
type: Concept
source: Kansallinen RDA-termi
source: Nationell RDA-term @sv
created: 2016-01-08
modified: 2024-05-24
in scheme: Metatietosanasto
preferred label: 3 3/4 tum/s @sv

veistos
type: Concept
source: RDA-termi
source: RDA-term @sv
created: 2016-01-08
modified: 2023-05-17
definition: Laajuuden yksikkö, kolmiulotteinen fyysinen yleensä taiteen ilmaisumuoto jossa kuva ja muoto on tehty kohokuvana (pintareliefi tai upotettu reliefi) tai joka puolelta katsottavana muotona.
definition: Enhet, tredimensionell fysisk uttrycksform, vanligen för konst, i vilken bild och form är gjorda som reliefbild (ytrelief eller infälld relief) eller som en form som kan betraktas från alla håll. @sv
in scheme: Metatietosanasto
preferred label: skulptur @sv

äänisilmukkakasetti
type: Concept
source: RDA-termi
source: RDA-term @sv
created: 2016-01-08
modified: 2023-05-17
definition: Kasetti, joka sisältää silmukkamaisen ääninauhan.
definition: Magasin som innehåller ljudband. @sv
in scheme: Metatietosanasto
preferred label: audio cartridge @en
preferred label: ljudmagasin @sv
scope note: Äänitallenne.
scope note: Ljudbärare. @sv

yhteisö
type: Concept
source: Kansallinen RDA-termi
source: Nationell RDA-term @sv
created: 2016-01-08
modified: 2024-12-18
definition: Elämänmuodon, taloudellisten tai aatteellisten päämäärien tms. perusteella kokonaisuuden muodostava ihmisryhmä tai yhteenliittymä. Perhe, suku, kansa, ammattikunta, urheiluseura ym. yhteisöt. Taloudellinen, aatteellinen yhteisö. Kansainvälinen yhteisö. Euroopan yhteisö, yhteisöt (lyhenne: EY). Perhe-, kaupunki-, kyläyhteisö. Pienyhteisö. Kieli-, tiede-, työyhteisö (Kielitoimiston sanakirja). Eroaa yhdistyksestä parhaiten uskonnollisten yhteisöjen kohdalla. Termiä käytetään, kun tarkempaa soveltuvaa termiä ei löydy.
definition: Grupp av människor eller sammanslutning som bildar en helhet utgående från levnadssätt, ekonomiska eller ideella mål e.d. Familj, släkt, folk, yrkeskår, idrottsförening m.fl. samfund. Ekonomiskt, ideellt samfund. Internationellt samfund. Europeiska gemenskapen, gemenskaperna (förkortning: EG). Familje-, stads-, bysamfund. Småsamfund. Språk-, vetenskaps-, arbetssamfund. Termen används då ingen mer specifik lämplig term finns. @sv
example: Concordia (yhteisö)
example: Concordia (institution) @sv
in scheme: Metatietosanasto
preferred label: institution @sv

lasi
type: Concept
source: RDA-termi
source: RDA-term @sv
created: 2016-01-08
modified: 2024-03-13
definition: Piidioksidista (silikaatista) ja emäksisistä oksideista muodostuva materiaali.
definition: Material som består av kiseldioxid (silikat) och basiska oxider. @sv
in scheme: Metatietosanasto
preferred label: glass @en
preferred label: glas @sv

solid dot -painatus
type: Concept
source: RDA-termi
source: RDA-term @sv
created: 2016-01-08
modified: 2023-05-17
definition: Valmistusmenetelmä tuntoaistiin perustuvalle aineistolle, jossa ohuen ja kestävän paperin pintaan lämpöliimataan kiinteitä muovisia pisteitä.
definition: Produktionsmetod för material som grundar sig på känselsinnet, i vilken fasta punkter i plast värmelimmas på ett tunt och hållbart pappers yta. @sv
in scheme: Metatietosanasto
preferred label: solid dot @en
preferred label: solid dot-tryckning @sv

16:o
type: Concept
source: RDA-termi
source: RDA-term @sv
created: 2016-01-08
modified: 2025-05-13
definition: Bibliografinen koko muodostuu yhdestä tai useammasta lehdestä, jotka ovat kooltaan 1/16 arkista.
definition: Bokens format består av ett eller flera blad som till sin storlek är 1/16 av ett tryckark. @sv
in scheme: Metatietosanasto
preferred label: 16mo @en

multiprojektori
type: Concept
source: RDA-termi
source: RDA-term @sv
created: 2016-01-08
modified: 2023-05-17
definition: Elokuvafilmin esitysformaatti, joka käyttää useampia synkronoituja projektoreita.
definition: Visningsformat för film, som använder flera synkroniserade projektorer. @sv
in scheme: Metatietosanasto
preferred label: multiprojector @en
preferred label: multiprojektor @sv

Äänen tallennustapa
type: ConceptGroup
type: Collection
source: RDA-termi
source: RDA-term @sv
created: 2016-01-08
modified: 2024-09-17
alternative label: Äänen tallentamisen tapa
alternative label: Inspelningsteknik @sv
definition: Liittää manifestaation menetelmään, jota on käytetty äänen tallentamiseksi äänentoistoa varten.
definition: Sammankopplar manifestation med en metod som använts för att lagra ljud avsett för ljuduppspelning. @sv
member: digitaalinen
member: analoginen
preferred label: Type of recording @en
preferred label: Inspelningstyp @sv

päänimeke
type: Concept
source: RDA-termi
source: RDA-term @sv
created: 2016-01-08
modified: 2025-10-21
definition: Manifestaation nimeke, joka on valittu ensisijaiseksi tietyssä sovelluksessa tai kontekstissa.
definition: Titel för manifestation, som har valts till primär i en viss tillämpning eller kontext. @sv
in scheme: Metatietosanasto
preferred label: title proper @en
preferred label: huvudtitel @sv

DAT-kasetti
type: Concept
source: Kansallinen RDA-termi
source: Nationell RDA-term @sv
created: 2016-01-08
modified: 2025-10-31
in scheme: Metatietosanasto
preferred label: DAT-kassett @sv

äänikasetti
type: Concept
source: RDA-termi
source: RDA-term @sv
created: 2016-01-08
modified: 2025-10-31
definition: Kasetti, joka sisältää ääninauhan.
definition: Kassett som innehåller ljudband. @sv
in scheme: Metatietosanasto
preferred label: audiocasette @en
preferred label: ljudkassett @sv
scope note: Äänitallenne.
scope note: Ljudbärare. @sv

diplomityö
type: Concept
source: Kansallinen RDA-termi
source: Nationell RDA-term @sv
created: 2016-01-08
modified: 2024-05-24
definition: Diplomi-insinöörin, arkkitehdin tai maisema-arkkitehdin tutkinnon päätteeksi tehtävä opinnäyte.
definition: Lärdomsprov som görs som avslutning på en diplomingenjörs-, arkitekt- eller landskapsarkitektexamen. @sv
in scheme: Metatietosanasto
preferred label: diplomarbete @sv

äänirulla
type: Concept
source: RDA-termi
source: RDA-term @sv
created: 2016-01-08
modified: 2023-05-17
alternative label: pianorulla
alternative label: pianorulle @sv
definition: Paperirulla, jossa olevat rei’itykset edustavat toistettavia säveliä. Suunniteltu toistamaan musiikkia mekaanisesti automaattipianon, automaattiurkujen yms. avulla.
definition: Pappersrulle på vilken musiktoner representeras av hål. Utformad för att mekaniskt återskapa musik i självspelande piano, orgel e.d. @sv
in scheme: Metatietosanasto
preferred label: audio roll @en
preferred label: ljudrulle @sv
scope note: Äänitallenne.
scope note: Ljudbärare. @sv

Huomautus kappalekohtaisen tallenteen ominaisuudesta
type: ConceptGroup
type: Collection
source: RDA-termi
source: RDA-term @sv
created: 2016-01-08
modified: 2023-05-05
alternative label: Särskilda kännetecken för exemplar @sv
member: exlibris
member: nimiösivu puuttuu
member: nimiösivu puutteellinen
member: variantti
member: tekijän signeeraus
member: reunahuomautuksia
member: omistajamerkintö
preferred label: Modification of item @en
preferred label: Anmärkning om exemplarspecifik bäraregenskap @sv
scope note: Liittää kappaleen huomautukseen, joka antaa lisätietoa kuvailun kohteena olevan kappaleen tallenteen erityispiirteistä. Erityispiirteiden ei oleteta koskevan samaa manifestaatiota edustavia muita kappaleita.
scope note: Sammankopplar exemplar med en anmärkning som ger tilläggsinformation om särdragen i ett exemplars bärare. Särdragen förmodas inte gälla andra exemplar som representerar samma manifestation. @sv

Materiaali
type: ConceptGroup
type: Collection
source: RDA-termi
source: RDA-term @sv
created: 2016-01-08
modified: 2024-03-13
definition: Liittää manifestaation aineeseen tai materiaaliin, jota on laitettu manifestaation pohjamateriaalin päälle.
definition: Sammankopplar manifestation med ett ämne eller ett material som applicerats på en manifestations bottenmaterial. @sv
member: pergamentti
member: magneettijauhe
member: synteettinen
member: Bristol-paperi
member: guassi
member: metalli
member: pahvi
member: tekstiili
member: öljyväri
member: polyesteri
member: veliini
member: vuota
member: väriliitu
member: kangas
member: kivi
member: puu
member: pastelli
member: hopeahalidi
member: triasetaatti
member: lakka
member: hiili
member: vesiväri
member: norsunluu
member: kipsi
member: nahka
member: posliini
member: diatso
member: alumiini
member: kumi
member: väriaine
member: muste
member: vinyyli
member: keramiikka
member: paperi
member: lasi
member: kuvituskartonki
member: tempera
member: asetaatti
member: diasetaatti
member: akryyliväri
member: liitu
member: vaha
member: muovi
member: vesikulaari
member: grafiitti
member: nitraatti
member: sellakka
member: varmuusfilmi
member: kovalevy
preferred label: Applied material @en
preferred label: Material @sv
scope note: Merkitään jos sitä pidetään tärkeänä tunnistamisen tai valinnan kannalta. Käytetään yhtä tai useampaa soveltuvaa termiä seuraavasta luettelosta:
scope note: Anges ifall det anses viktigt för identifikation eller urval. En eller flera lämpliga termer från följande lista används: @sv

sinikopiomenetelmä
type: Concept
source: RDA-termi
source: RDA-term @sv
created: 2016-01-08
modified: 2023-05-17
alternative label: blueprint @sv
definition: Valmistusmenetelmä, jossa painatus perustuu rautasuolan kemialliseen reaktioon, joka muuttaa läpikuultamattomat sävyt tai värit valkoisiksi sinisellä pohjalla.
definition: Produktionsmetod, i vilken tryckning grundar sig på en kemisk reaktion i järnsalt, som ändrar opaka toner eller färger till vita på blå botten. @sv
in scheme: Metatietosanasto
preferred label: blueprint process @en
preferred label: blåkopia-metod @sv

kuvituskartonki
type: Concept
source: RDA-termi
source: RDA-term @sv
created: 2016-01-08
modified: 2024-03-13
alternative label: illustrationskartong @sv
definition: Laminoidusta pahvista koostuva materiaali, jonka pintaan on liimattu paperikerroksia.
definition: Material bestående av laminerad papp, på vars yta papperslager har limmats. @sv
in scheme: Metatietosanasto
preferred label: illustration board @en

tempera
type: Concept
source: RDA-termi
source: RDA-term @sv
created: 2016-01-08
modified: 2023-05-17
alternative label: temperafärg @sv
definition: Materiaali, jossa on sekoitettuna väriainetta ja vesiliukoista yleensä tahmeaa sideainetta, kuten munankeltuaista, pysyväksi ja nopeasti kuivuvaksi maalausaineeksi.
definition: Material som innehåller en blandning av färgämne med ett vattenlösligt, ofta trögflytande bindeämne, såsom äggula, och som fungerar som en beständig och snabbtorkande målningsfärg. @sv
in scheme: Metatietosanasto

NAB-standardi
type: Concept
source: RDA-termi
source: RDA-term @sv
created: 2016-01-08
modified: 2023-05-17
definition: Äänentoiston erityisominaisuus, joka noudattaa National Association of Broadcastersin standardeja.
definition: Specialegenskap för ljudåtergivning som följer National Association of Broadcasters standarder. @sv
in scheme: Metatietosanasto
preferred label: NAB-standard @en
preferred label: NAB standard @sv

8 raitaa
type: Concept
source: Kansallinen RDA-termi
source: Nationell RDA-term @sv
created: 2016-01-08
modified: 2024-05-24
in scheme: Metatietosanasto
preferred label: 8 ljudspår @sv

mikrofilmirulla
type: Concept
source: RDA-termi
source: RDA-term @sv
created: 2016-01-08
modified: 2023-05-17
definition: Rullalla oleva mikrofilmi.
definition: Mikrofilm på rulle. @sv
in scheme: Metatietosanasto
preferred label: microfilm roll @en
preferred label: mikrofilmsrulle @sv
scope note: Mikromuotoinen tallenne.
scope note: Mikroformsbärare. @sv

asetaatti
type: Concept
source: RDA-termi
source: RDA-term @sv
created: 2016-01-08
modified: 2024-03-13
definition: Materiaali, joka koostuu selluloosan asetaattiesteristä.
definition: Material som består av cellulosas acetatester. @sv
in scheme: Metatietosanasto
preferred label: acetate @en
preferred label: acetat @sv

tahdit allekkain
type: Concept
source: RDA-termi
source: RDA-term @sv
created: 2016-01-08
modified: 2024-06-07
alternative label: tahdit päällekkäin
alternative label: takt under takt @sv
alternative label: takter på varandra @sv
definition: Layout, joka koostuu rinnakkaisissa yksiköissä esitetyistä tahdeista siten, että kunkin stemman tahdin alku on pystysuuntaisesti tasattu toisen stemman tai stemmojen saman tahdin alun kanssa.
definition: Layout som består av takter som visas i parallella enheter, på så vis att början av varje stämmas takt är i vertikal linje med början av en annan stämma för samma takt. @sv
in scheme: Metatietosanasto
preferred label: bar over bar @en
preferred label: takt över takt @sv

Lähetysstandardi
type: ConceptGroup
type: Collection
source: RDA-termi
source: RDA-term @sv
created: 2016-01-08
modified: 2023-05-05
definition: Liittää manifestaation järjestelmään, jonka mukaan videoaineisto muunnetaan televisiolähetystä varten.
definition: Sammankopplar manifestation med ett system, enligt vilket videomaterial konverteras för tv-sändning. @sv
member: SECAM
member: NTSC
member: HDTV
member: PAL
preferred label: Broadcast standard @en
preferred label: Sändningsstandard @sv

XHTML
type: Concept
source: Kansallinen RDA-termi
source: Nationell RDA-term @sv
created: 2016-01-08
modified: 2024-05-24
in scheme: Metatietosanasto

diasetaatti
type: Concept
source: RDA-termi
source: RDA-term @sv
created: 2016-01-08
modified: 2024-03-13
definition: Materiaali, joka on valmistettu käsittelemällä selluloosaa etikkahapolla.
definition: Material som har tillverkats genom att behandla cellulosa med ättiksyra. @sv
in scheme: Metatietosanasto
preferred label: diacetate @en
preferred label: diacetat @sv

Blu-ray-videolevy
type: Concept
source: Kansallinen RDA-termi
source: Nationell RDA-term @sv
created: 2016-01-08
modified: 2025-10-31
in scheme: Metatietosanasto
preferred label: Blu-ray-videoskiva @sv

CD-DVD-levy
type: Concept
source: Kansallinen RDA-termi
source: Nationell RDA-term @sv
created: 2016-01-08
modified: 2025-10-31
in scheme: Metatietosanasto
preferred label: cd-dvd-skiva @sv
scope note: Tiedontallennukseen käytettävä optisesti luettava levy, jonka toisella puolella käytetään CD-levyn ja toisella puolella DVD-levyn tallennustekniikkaa. CD-DVD-levyn CD-puoli on tarkoitettu ensisijaisesti äänen ja DVD-puoli kuvan tallennukseen. Esimerkiksi DualDisc-levyt ovat CD-DVD-levyjä. (Tietotekniikan termitalkoot, 15.1.2013)
scope note: Optiskt lagringsmedium. Ena sidan av skivan använder en cd-skivas lagringsteknik och den andra sidan en dvd:s. Cd-dvd-skivans cd-sida är främst avsedd för lagring av ljud och dvd-sidan för lagring av bild. DualDisc-skivor är exempel på cd-dvd-skivor. @sv

short form scoring
type: Concept
source: RDA-termi
source: RDA-term @sv
created: 2016-01-08
modified: 2024-04-04
in scheme: Metatietosanasto

analoginen
type: Concept
source: RDA-termi
source: RDA-term @sv
created: 2016-01-08
modified: 2023-05-17
definition: Tallentamisen tapa, jossa sisältö on taltioitu tallenteeseen jatkuvina muuttuvina suureina.
definition: Lagringsmetod, i vilken innehåll lagrats på ett medium som löpande variabla storheter. @sv
in scheme: Metatietosanasto
preferred label: analog @en

masterkopio
type: Concept
source: RDA-termi
source: RDA-term @sv
created: 2016-01-08
modified: 2023-05-17
definition: Sukupolven määrite digitaaliselle aineistolle, joka on luotu digitoimalla suurimmalla mahdollisella resoluutiolla ja jota usein käytetään kopioiden valmistamiseen.
definition: Bestämning av generation för digitalt material som har skapats genom att digitera med största möjliga resolution, och som ofta används för att tillverka kopior. @sv
in scheme: Metatietosanasto
preferred label: master @en
preferred label: masterkopia @sv

rahasto
type: Concept
source: Kansallinen RDA-termi
source: Nationell RDA-term @sv
created: 2016-01-08
modified: 2024-05-24
alternative label: henkilörahasto
alternative label: muistorahasto
alternative label: tukirahasto
alternative label: minnesfond @sv
alternative label: personfond @sv
alternative label: stödfond @sv
definition: Julkisoikeudellinen rahasto tai sellainen yksityinen rahasto, joka ei ole säätiörekisterissä (henkilöstörahasto, tukirahasto, muistorahasto).
definition: Offentligrättslig fond eller sådan privat fond som inte finns i Stiftelseregistret. @sv
example: Huoltovarmuusrahasto
example: Suomen itsenäisyyden juhlarahasto
example: Työllisyysrahasto
example: Valtion asuntorahasto
example: Vastauksemme lapualaisille (rahasto)
example: Försörjningsberedskapsfonden @sv
example: Jubileumsfonden för Finlands självständighet @sv
example: Statens bostadsfond @sv
example: Svenska kulturfonden @sv
example: Sysselsättningsfonden @sv
in scheme: Metatietosanasto
preferred label: fond @sv

techniscope
type: Concept
source: RDA-termi
source: RDA-term @sv
created: 2016-01-08
modified: 2023-05-17
definition: Elokuvafilmin esitysformaatti, jonka kuvasuhde on 2.33:1 käyttäen 35 mm:n filmiä.
definition: Visningsformat för film, vars bildförhållande är 2.33:1 och med 35 mm:s film. @sv
in scheme: Metatietosanasto

dia
type: Concept
source: RDA-termi
source: RDA-term @sv
created: 2016-01-08
modified: 2023-05-17
definition: Kehykseen asetettu, projektorin tai diojen katselulaitteen avulla katseltava kaksiulotteinen, läpinäkyvä kuva filmillä.
definition: Tvådimensionell och genomskinlig bild på film i ram, avsedd för användning i projektor eller betraktningsapparat. @sv
in scheme: Metatietosanasto
preferred label: slide @en
preferred label: diabild @sv
scope note: Heijastettava kuvatallenne.
scope note: Bärare för projicerbara bilder. @sv

kartografinen taktiili kuva
type: Concept
source: RDA-termi
source: RDA-term @sv
created: 2016-01-08
modified: 2023-05-05
definition: Viivoina, muotoina tms. esitetty kartografinen sisältö, joka on tarkoitettu kosketeltavaksi kaksiulotteisena stillkuvana tai -kuvina.
definition: Kartografiskt innehåll uttryckt som linjer, former e.d., avsett att användas genom beröring som en tvådimensionell stillbild eller -bilder. @sv
in scheme: Metatietosanasto
preferred label: cartographic tactile image @en
preferred label: kartografisk taktil bild @sv

opetuskortti
type: Concept
source: RDA-termi
source: RDA-term @sv
created: 2016-01-08
modified: 2023-05-17
definition: Laajuuden yksikkö, kuvakortti (fyysinen tai digitaalinen), joka sisältää sanoja, numeroita, kuvia jne., suunniteltu näytettäväksi nopeasti opetuksen apuvälineinä.
definition: Enhet, bildkort (fysiskt eller digitalt) som innehåller ord, siffror, bilder o.s.v. och som är utformat för att snabbt visas som hjälpmedel i undervisningen. @sv
in scheme: Metatietosanasto
preferred label: flash card @en
preferred label: undervisningskort @sv

akryyliväri
type: Concept
source: RDA-termi
source: RDA-term @sv
created: 2016-01-08
modified: 2023-05-17
definition: Materiaali, joka koostuu väristä tai väriaineista jotka on sidottu akryylihartsia sisältäväksi emulsioksi.
definition: Material som består av färg eller färgämnen, som är bundna till en emulsion med akrylharts. @sv
in scheme: Metatietosanasto
preferred label: acrylic paint @en
preferred label: akrylfärg @sv

nide
type: Concept
source: RDA-termi
source: RDA-term @sv
created: 2016-01-08
modified: 2023-05-17
definition: Yksi tai useampia toisiinsa sidottuja tai kiinnitettyjä lehtiä, joista muodostuu erillinen yksikkö.
definition: Ett eller flera inbundna eller häftade blad, som tillsammans utgör en separat enhet. @sv
in scheme: Metatietosanasto
preferred label: volume @en
preferred label: volym @sv
scope note: Ilman laitetta käytettävä tallenne.
scope note: Omedierad bärare. @sv

liitu
type: Concept
source: RDA-termi
source: RDA-term @sv
created: 2016-01-08
modified: 2023-05-17
definition: Hienojakoisesta kalkkikivestä tai muusta pehmeästä kalsiumkarbonaatista muodostuva materiaali.
definition: Material som består av finfördelad kalksten eller annat mjukt kalciumkarbonat. @sv
in scheme: Metatietosanasto
preferred label: chalk @en
preferred label: krita @sv

stereografinen levy
type: Concept
source: RDA-termi
source: RDA-term @sv
created: 2016-01-08
modified: 2023-05-17
definition: Levy, jonka ulkoreunalla on aukkoja, joissa on stereografisia stillkuvia. Käytetään stereografisella katselulaitteella (stereoskoopilla).
definition: Skiva, i vars yttre kant finns öppningar med stereografiska stillbilder. Används med en stereografisk visningsapparat (stereoskop). @sv
in scheme: Metatietosanasto
preferred label: stereograph disc @en
preferred label: stereografisk skiva @sv
scope note: Stereografinen tallenne.
scope note: Stereografisk bärare. @sv

RTF
type: Concept
source: Kansallinen RDA-termi
source: Nationell RDA-term @sv
created: 2016-01-08
modified: 2024-05-24
in scheme: Metatietosanasto

Rudolf Koivu -palkinto
type: Concept
source: Kansallinen RDA-termi
source: Nationell RDA-term @sv
created: 2016-01-08
modified: 2023-05-17
definition: Jaetaan lasten- ja nuortenkirjan kuvittajalle. Palkinto jaetaan joka toinen vuosi. Vuodesta 1997 palkinnon myöntäjä on ollut Grafia ry.
definition: Utdelas åt en barn- och ungdomsboksillustratör. Priset utdelas vartannat år. Sedan 1997 har priset utdelats av Grafia rf. @sv
example: MARC 21 -formaatissa: 586 ## ‡a Rudolf Koivu -palkinto, 2020
example: I MARC 21-formatet: 586 ## ‡a Rudolf Koivu-priset, 2020 @sv
in scheme: Metatietosanasto
preferred label: Rudolf Koivu-priset @sv

vaha
type: Concept
source: RDA-termi
source: RDA-term @sv
created: 2016-01-08
modified: 2024-03-13
definition: Materiaali, joka on kemiallinen yhdistelmä eläin-, kasvi- ja mineraalipohjaisia tai synteettisiä aineita. Vaha on muokattavissa ympäristön lämpötilassa, se tuntuu liukkaalta, sillä on alhainen sulamispiste ja yleensä läpikuultava, vettä hylkivä pinta ja se liukenee orgaanisiin liuottimiin.
definition: Material som är en kemisk förening av djur-, växt-, mineralbaserade eller syntetiska ämnen. Vax kan bearbetas i omgivningens temperatur, det känns glatt, har en låg smältpunkt och vanligen en genomskinlig, vattenavstötande yta, samt upplöses i organiska lösningsmedel. @sv
in scheme: Metatietosanasto
preferred label: vax @en

Excel
type: Concept
source: Kansallinen RDA-termi
source: Nationell RDA-term @sv
created: 2016-01-08
modified: 2024-05-24
in scheme: Metatietosanasto

muovi
type: Concept
source: RDA-termi
source: RDA-term @sv
created: 2016-01-08
modified: 2024-03-13
definition: Materiaali, joka koostuu synteettisistä tai puolisynteettisistä orgaanisista polymeereistä, joilla on suuri molekyylipaino ja jotka ovat muovattavia.
definition: Material som består av syntetiska eller halvsyntetiska organiska polymerer, som har en hög molekylvikt och är formbara. @sv
in scheme: Metatietosanasto
preferred label: plastic @en
preferred label: plast @sv

RealAudio
type: Concept
source: Kansallinen RDA-termi
source: Nationell RDA-term @sv
created: 2016-01-08
modified: 2024-05-24
in scheme: Metatietosanasto
scope note: Äänen koodausmuoto, tiedostopääte .ra, .rm
scope note: Kodningsformat för ljud, filändelse .ra, .rm @sv

reunahuomautuksia
type: Concept
source: Kansallinen RDA-termi
source: Nationell RDA-term @sv
created: 2016-01-08
modified: 2024-05-24
example: Reunahuomautuksia Pirjo Karvosen kirjoitukseen.
example: Marginalanmärkningar till Pirjo Karvonens text. @sv
in scheme: Metatietosanasto
preferred label: marginalanmärkningar @sv

Mediatyyppi
type: ConceptGroup
type: Collection
source: RDA-termi
source: RDA-term @sv
created: 2016-01-08
modified: 2023-05-17
definition: Jaottelu, joka ilmaisee aineiston sisällön katsomiseen, toistamiseen, suorittamiseen ym. tarvittavan laitteen tyyppiä. Jos mikään mediatyypin termeistä ei sovellu kuvailun kohteen tallenteeseen, merkitään 'muu'.
definition: Indelning som uttrycker vilken typ av apparat som behövs för att titta på, spela upp eller utföra ett materials innehåll. Då ingen medietyp passar in på den inspelning som beskrivs, anges termen 'annan'. @sv
member: mikromuoto
member: video
member: määrittelemätön
member: audio
member: mikroskooppinen
member: heijastettava
member: tietokonekäyttöinen
member: käytettävissä ilman laitetta
member: stereografinen
preferred label: Media type @en
preferred label: Medietyp @sv

kartta
type: Concept
source: RDA-termi
source: RDA-term @sv
created: 2016-01-08
modified: 2023-05-17
definition: Laajuuden yksikkö, yleensä mittakaavassa ja kaksiulotteisena esitetty kartta, joka on maan tai muun tähtitaivaan kappaleen tai kuvitteellisen paikan pinnan kuvaus kokonaisuudessaan tai osittain.
definition: Enhet, vanligen tvådimensionell karta i skala, som i sin helhet eller delvis skildrar ett avsnitt av jordens, någon annan himlakropps eller en fiktiv plats yta. @sv
in scheme: Metatietosanasto
preferred label: map @en
preferred label: karta @sv
scope note: Monikossa: xx karttaa, karttoja
scope note: I plural: xx kartor, kartor @sv

E00
type: Concept
source: Kansallinen RDA-termi
source: Nationell RDA-term @sv
created: 2016-01-08
modified: 2024-05-24
in scheme: Metatietosanasto

ikoni
type: Concept
source: RDA-termi
source: RDA-term @sv
created: 2016-01-08
modified: 2023-05-17
definition: Laajuuden yksikkö, kuva joka esittää pyhää entiteettiä ja jota itseään pidetään pyhänä.
definition: Enhet, bild som föreställer en helig entitet eller som i sig själv anses vara helig. @sv
in scheme: Metatietosanasto
preferred label: icon @en
preferred label: ikon @sv

kääntöpuolilla
type: Concept
source: RDA-termi
source: RDA-term @sv
created: 2016-01-08
modified: 2025-04-12
definition: Layout, jossa sama kuva esitetään useammalla kuin yhdellä kielellä arkin molemmin puolin.
definition: Layout, i vilken samma bild visas på mer än ett språk på bägge sidorna av ett ark. @sv
in scheme: Metatietosanasto
preferred label: back to back @en

DVD-R
type: Concept
source: Kansallinen RDA-termi
source: Nationell RDA-term @sv
created: 2016-01-08
modified: 2024-05-24
in scheme: Metatietosanasto

rainakasetti
type: Concept
source: RDA-termi
source: RDA-term @sv
created: 2016-01-08
modified: 2023-05-17
definition: Rainan sisältävä kasetti.
definition: Kasett som innehåller bildband. @sv
in scheme: Metatietosanasto
preferred label: filmstrip cartridge @en
preferred label: bildbandsmagasin @sv
scope note: Heijastettava kuvatallenne.
scope note: Bärare för projicerbara bilder. @sv

Extent
type: ConceptGroup
type: Collection
source: RDA-termi
source: RDA-term @sv
created: 2016-01-08
modified: 2025-12-19
alternative label: Laajuuden yksikkö
alternative label: Enhet @sv
definition: Liittää manifestaation manifestaation yksiköiden ja/tai osayksiköiden määrään ja tyyppiin.
definition: Sammankopplar manifestation med mängden och typen av en manifestations enheter och/eller delenheter. @sv
member: malli
member: lautapeli
member: metalliraha
member: USB-muisti
member: Blu-ray-levy
member: kysymyskortti
member: DVD-äänilevy
member: toimintakortti
member: diagrammi
member: kuva
member: karttalehti
member: kuvasalkku
member: DVD-levy
member: CD-äänilevy
member: postikortti
member: C-kasetti
member: karttaliite
member: piirustus
member: näyttelyesine
member: valokuva
member: CD-levy
member: pienoismalli
member: palapeli
member: kaukokartoituskuva
member: levy
member: lelu
member: soitonopas
member: teorianopas
member: sävelmäkokoelma
member: laulunopas
member: kuvaliite
member: pelikortti
member: laatikko
member: kotelo
member: korttipakka
member: profiili
member: palsta
member: kuntoiluväline
member: kansio
member: työväline
member: lehti
member: sivu
member: kaava-arkki
member: kortti
member: dia
member: piirtoheitinkalvopohja
member: dioraama
member: röntgenkuva
member: karttapallo
member: Blu-ray-äänilevy
member: kartasto
member: peli
member: taitettu arkki
member: SACD-äänilevy
member: korjauslehti
member: DVD-videolevy
member: liite
member: partituuri
member: kuorokirja
member: pianopartituuri
member: soolonuotti
member: partituurin tiivistelmä
member: stemma
member: table book
member: pianojohtostemma
member: johtostemma
member: partiselli
member: kuoropartituuri
member: pienoispartituuri
member: viulujohtostemma

muistikortti
type: Concept
source: RDA-termi
source: RDA-term @sv
created: 2016-01-08
modified: 2023-05-17
alternative label: minneskort @sv
definition: Tietokoneella käytettäväksi tarkoitettu kortti, joka sisältää digitaalisesti koodattua dataa.
definition: Kort som innehåller digitalt kodade data, ämnat för användning i dator. @sv
in scheme: Metatietosanasto
preferred label: computer card @en
preferred label: datorkort @sv
scope note: Tietokonetallenne.
scope note: Datorbärare. @sv

opetustaulu
type: Concept
source: RDA-termi
source: RDA-term @sv
created: 2016-01-08
modified: 2023-05-17
alternative label: undervisningstavla @sv
definition: Laajuuden yksikkö, liikkumaton kuva joka koostuu taulukkona tai muuna grafiikkana esitetystä datasta ja joka voidaan ripustaa seinälle.
definition: Enhet, stillbild som kan hängas på väggen och som består av data representerade i tabell eller annan grafisk form. @sv
in scheme: Metatietosanasto
preferred label: wall chart @en
preferred label: väggplansch @sv

leveä ura
type: Concept
source: RDA-termi
source: RDA-term @sv
created: 2016-01-08
modified: 2025-09-10
alternative label: brett spår @sv
definition: Uran ominaisuus analogiselle levylle, jonka uranleveys on tyypillisesti noin 40 uraa/cm (100 uraa/tuuma).
definition: Spåregenskap för analog skiva, vars spårbredd typiskt är ungefär 40 spår/cm (100 spår/tum). @sv
in scheme: Metatietosanasto
preferred label: coarse groove @en
preferred label: grovspår @sv

prinssi
type: Concept
source: Kansallinen RDA-termi
source: Nationell RDA-term @sv
created: 2016-01-08
modified: 2024-05-24
definition: Hallitsijahuoneen miespuolinen ei-hallitseva jäsen.
definition: Manlig icke-regerande medlem i furstehus. @sv
in scheme: Metatietosanasto
preferred label: prins @sv

mallikappale
type: Concept
source: RDA-termi
source: RDA-term @sv
created: 2016-01-08
modified: 2023-05-17
definition: Laajuuden yksikkö, laitetta tai prosessia kuvaava kappale, jota voidaan muokata koulutus- tai analyysitarkoituksessa tietyn osan tai toiminnon korostamiseksi.
definition: Enhet, exemplar som beskriver en apparat eller process och som kan bearbetas i utbildnings- eller analyssyfte för att framhäva en viss del eller funktion. @sv
in scheme: Metatietosanasto
preferred label: mock-up @en
preferred label: provexemplar @sv

Finlandia Junior -palkinto
type: Concept
source: Kansallinen RDA-termi
source: Nationell RDA-term @sv
created: 2016-01-08
modified: 2023-05-17
alternative label: Lasten- ja nuortenkirjallisuuden Finlandia-palkinto
definition: Myönnetään ansiokkaalle lasten- tai nuortenkirjalle. Palkinnon myöntää Suomen Kirjasäätiö. Palkinto perustettiin 1997.
definition: Utdelas åt en meriterad barn- eller ungdomsbok. Priset utdelas av Finlands bokstiftelse. Priset grundades år 1997. @sv
example: MARC 21 -formaatissa: 586 ## ‡a Finlandia Junior -palkinto, 2020
example: I MARC 21-formatet: 586 ## ‡a Finlandia Junior-priset, 2020 @sv
in scheme: Metatietosanasto
preferred label: Finlandia Junior-priset @sv

kreivi
type: Concept
source: Kansallinen RDA-termi
source: Nationell RDA-term @sv
created: 2016-01-08
modified: 2024-05-24
definition: Arvoltaan ruhtinaan (markiisin) ja vapaaherran välinen aatelismies.
definition: Adelsman som till sin rang står mellan furste (markis) och friherre. @sv
in scheme: Metatietosanasto
preferred label: greve @sv

WordPerfect
type: Concept
source: Kansallinen RDA-termi
source: Nationell RDA-term @sv
created: 2016-01-08
modified: 2024-05-24
in scheme: Metatietosanasto

radioasema
type: Concept
source: Kansallinen RDA-termi
source: Nationell RDA-term @sv
created: 2016-01-08
modified: 2024-05-24
alternative label: radiokanava
alternative label: radiokanal @sv
definition: Laitos jossa on radiolähetin; myös radiokanavasta.
definition: Anläggning med radiosändare; även om radiokanal. @sv
example: Amerikan ääni (radioasema)
example: Yle Vega (radiostation) @sv
in scheme: Metatietosanasto
preferred label: radiostation @sv

ainejärjestö
type: Concept
source: Kansallinen RDA-termi
source: Nationell RDA-term @sv
created: 2016-01-08
modified: 2024-05-24
alternative label: ainejärjestöt (yhteisön tyyppi)
alternative label: ämnesföreningar (typ av institution) @sv
definition: Samaa pääainetta tai alaa opiskelevien opiskelijoiden järjestö korkeakoulussa (Kielitoimiston sanakirja).
definition: Organisation för högskolestuderande som studerar samma huvudämne eller bransch. @sv
example: Preemio (ainejärjestö)
example: Politivas (ämnesförening) @sv
in scheme: Metatietosanasto
preferred label: ämnesförening @sv

tietonauhakela
type: Concept
source: RDA-termi
source: RDA-term @sv
created: 2016-01-08
modified: 2023-05-17
definition: Tietokoneen nauha-asemassa käytettävä avoin kela, joka sisältää tietonauhan.
definition: Spole för datorband, ämnad för användning i datorns bandenhet. @sv
in scheme: Metatietosanasto
preferred label: computer tape reel @en
preferred label: datorbandspole @sv
scope note: Tietokonetallenne.
scope note: Datorbärare. @sv

yksittäinen nuottiviiva
type: Concept
source: Kansallinen RDA-termi
source: Nationell RDA-term @sv
created: 2016-01-08
modified: 2024-08-27
in scheme: Metatietosanasto
preferred label: enkel notlinje @sv

Teos
type: ConceptGroup
type: Collection
source: RDA-termi
source: RDA-term @sv
created: 2016-01-08
modified: 2025-06-03
definition: Itsenäinen tiedollinen tai taiteellinen sisältö.
definition: Ett självständigt intellektuellt eller konstnärligt innehåll. @sv
member: Teoksen nimeke
member: Kohderyhmä
member: Ilmestymistiheys
member: Kokoelman kartuttamisen linja
member: Kokoelman kartuntamenetelmä
member: Laajennussuunnitelma
member: Merkintälähde
member: Väitöskirja tai muu akateeminen opinnäyte
member: Teoksen kategoria
preferred label: Work @en
preferred label: Verk @sv

2 raitaa
type: Concept
source: Kansallinen RDA-termi
source: Nationell RDA-term @sv
created: 2016-01-08
modified: 2024-05-24
in scheme: Metatietosanasto
preferred label: 2 ljudspår @sv

näkymä
type: Concept
source: RDA-termi
source: RDA-term @sv
created: 2016-01-08
modified: 2024-05-09
alternative label: näkymäkartta
alternative label: perspektivbild @sv
alternative label: vy @sv
definition: Laajuuden yksikkö on perspektiivissä esitetty maisemanäkymä, jossa yksityiskohdat näytetään kuin heijastuksina vinolle tasolle.
definition: Enhet, perspektivisk framställning av landskapsvy i vilken detaljerna framställs som reflekterade på ett lutande plan. @sv
in scheme: Metatietosanasto
preferred label: view @en
preferred label: perspektiv @sv

videosilmukkakasetti
type: Concept
source: RDA-termi
source: RDA-term @sv
created: 2016-01-08
modified: 2023-05-17
definition: Kasetti, joka sisältää silmukkamaisen videonauhan.
definition: Magasin som innehåller videoband. @sv
in scheme: Metatietosanasto
preferred label: video cartridge @en
preferred label: videomagasin @sv
scope note: Videotallenne.
scope note: Videobärare. @sv

ensimmäinen sukupolvi
type: Concept
source: RDA-termi
source: RDA-term @sv
created: 2016-01-08
modified: 2023-05-17
definition: Sukupolven määrite alkuperäiselle kamerafilmille tai videonauhalle, jolle aineisto on kuvattu.
definition: Bestämning av generation för en ursprunglig kamerafilm eller ett videoband, på vilket ett material är avbildat. @sv
in scheme: Metatietosanasto
preferred label: first generation @en
preferred label: första generation @sv

vesikulaari
type: Concept
source: RDA-termi
source: RDA-term @sv
created: 2016-01-08
modified: 2024-03-13
definition: Emulsio, joka muodostuu polyesterisessä termoplastisessa pohjassa olevista yhdestä tai useammasta valoherkästä diatsoniumsuolakerroksesta. Kerrokset hajoavat valotettaessa ja tuottavat typpikuplia muodostaen latentin kuvan, joka saadaan näkyväksi ja kiinnitettyä kuumentamalla ja jäähdyttämällä. Vesikulaarifilmit eli lämpöfilmit ovat tyypillisesti sinisiä tai beigejä. Materiaali, jota tavallisesti käytetään mikrofilmin tai mikrokortin pohjamateriaalina.
definition: Emulsion som består av ett eller flera lager diazoniumsalt i ett termoplastiskt botten av polyester. Lagren sönderfaller vid ljusexponering och producerar kvävebubblor som utgör en latent bild, vilken blir synlig och fixerad efter uppvärmning och därpåföljande nedkylning. Vesikulärfilm är i regel blå eller beige. Materialet används vanligtvis som bottenmaterial för mikrofilm eller mikrofiche. @sv
in scheme: Metatietosanasto
preferred label: vesicular emulsion @en
preferred label: vesikulär @sv

säkeet allekkain
type: Concept
source: RDA-termi
source: RDA-term @sv
created: 2016-01-08
modified: 2023-05-17
preferred label: line over line @en
definition: Layout, joka koostuu rinnakkaisina esitetyistä tahdeista, mutta tahteja ei ole välttämättä tasattu.
definition: Layout som består av parallellt visade takter, dock inte nödvändigtvis på linje. @sv
in scheme: Metatietosanasto
preferred label: rad över rad @sv

hieno
type: Concept
source: RDA-termi
source: RDA-term @sv
created: 2016-01-08
modified: 2025-09-10
definition: Uran ominaisuus analogiselle äänilieriölle, jonka urajako on 60-64 kierrosta/cm (150 tai 160 kierrosta/tuuma) 6 1/8 tuuman sanelusylintereillä tai 200 kierrosta/tuuma neljän minuutin sylintereillä.
definition: Spåregenskap för analog ljudcylinder, vars spårfördelning är 60-64 varv/cm (150 eller 160 varv/tum) på 6 1/8 tums diktafoncylindrar eller 200 varv/tum på fyra minuters cylindrar. @sv
in scheme: Metatietosanasto
preferred label: fine @en
preferred label: fin @sv

preparaattilasi
type: Concept
source: RDA-termi
source: RDA-term @sv
created: 2016-01-08
modified: 2023-05-17
definition: Pieni läpikuultavasta materiaalista tehty liuska (jossa voi olla suojaava aluslasi), jolla on hyvin pieniä objekteja ja joka on suunniteltu käytettäväksi laitteella kuten mikroskoopilla.
definition: Liten skiva av genomskinligt material som bär minimala föremål och är avsedd att användas i en apparat, t.ex. mikroskop. @sv
in scheme: Metatietosanasto
preferred label: microscope slide @en
preferred label: mikroskoperingspreparat @sv
scope note: Mikroskooppinen tallenne.
scope note: Mikroskopisk bärare. @sv

projekti
type: Concept
source: Kansallinen RDA-termi
source: Nationell RDA-term @sv
created: 2016-01-08
modified: 2024-05-24
alternative label: hanke
definition: Projekti eli hanke on tarkkaan suunniteltu työ tietyn päämäärän saavuttamiseksi (Wikipedia).
definition: Noggrant planerat arbete för att uppnå ett visst syfte. @sv
example: Metsätalous tuotanto- ja palvelusuuntana (projekti)
example: Alkohol- och narkotikaundersökningen (projekt) @sv
in scheme: Metatietosanasto
preferred label: projekt @sv

12 raitaa
type: Concept
source: Kansallinen RDA-termi
source: Nationell RDA-term @sv
created: 2016-01-08
modified: 2024-05-24
in scheme: Metatietosanasto
preferred label: 12 ljudspår @sv

PNG
type: Concept
source: Kansallinen RDA-termi
source: Nationell RDA-term @sv
created: 2016-01-08
modified: 2024-05-24
in scheme: Metatietosanasto

DVD-Video
type: Concept
source: Kansallinen RDA-termi
source: Nationell RDA-term @sv
created: 2016-01-08
modified: 2024-05-24
in scheme: Metatietosanasto
scope note: Äänen koodausmuoto.
scope note: Kodningsformat för ljud @sv

78 kierr./min
type: Concept
source: Kansallinen RDA-termi
source: Nationell RDA-term @sv
created: 2016-01-08
modified: 2024-05-24
in scheme: Metatietosanasto
preferred label: 78 varv/min @sv

grafiitti
type: Concept
source: RDA-termi
source: RDA-term @sv
created: 2016-01-08
modified: 2023-05-17
definition: Hiilen yhdestä luontaisesta ilmenemismuodosta eli allotroopista muodostuva materiaali, joka on läpinäkymätöntä, pehmeää, kosketettaessa rasvaista, väriltään tummanharmaata.
definition: Material som består av en naturlig allotrop av kol, som är ogenomskinligt, mjukt, fett vid beröring, till sin färg mörkgrått. @sv
in scheme: Metatietosanasto
preferred label: graphite @en
preferred label: grafit @sv

käytettävissä ilman laitetta
type: Concept
source: RDA-termi
source: RDA-term @sv
created: 2016-01-08
modified: 2023-05-05
definition: Viestimen sisältö havaitaan ihmisaistein ilman välittävää laitetta. Käsittää viestimet, jotka sisältävät visuaalista ja/tai pistekirjoitukseen perustuvaa sisältöä ja jotka on tuotettu menetelmillä kuten painamalla, kaivertamalla, kivipainolla jne., kohotyönä, kutomalla jne., tai käsin kirjoittamalla, piirtämällä, maalamalla jne. Käsittää myös kolmiulotteisia muotoja ilmaisevat viestimet, kuten veistokset, pienoismallit jne.
definition: Mediets innehåll kan urskiljas utan förmedlande apparatur. Används för medier som har visuellt och/eller taktilt innehåll och som är producerat med metoder såsom tryck, gravyr, litografiskt tryck m.m., reliefarbete, textilarbete m.m., eller handskrift, teckning, målning m.m. Används också för medier som uttrycks genom tredimensionella former, såsom skulpturer, miniatyrmodeller m.m. @sv
in scheme: Metatietosanasto
preferred label: unmediated @en
preferred label: omedierad @sv

xx kierr./min
type: Concept
source: Kansallinen RDA-termi
source: Nationell RDA-term @sv
created: 2016-01-08
modified: 2024-05-24
in scheme: Metatietosanasto
preferred label: xx varv/min @sv

Toimijan suhteet
type: ConceptGroup
type: Collection
created: 2016-01-08
modified: 2024-12-18
member: Toimijan suhteet yhteisöön
member: Toimijan suhteet sukuun
member: Toimijan suhteet henkilöön
member: Yhteisön suhteet yhteisöön
member: Yhteisön suhteet henkilöön
member: Henkilön suhteet henkilöön
member: Henkilön suhteet sukuun
member: Yhteisön suhteet sukuun
member: Henkilön suhteet yhteisöön
member: Suvun suhteet toimijaan
member: Suvun suhteet sukuun
member: Yhteisön suhteet toimijaan
member: Suvun suhteet yhteisöön
member: Suvun suhteet henkilöön
member: Henkilön suhteet toimijaan
preferred label: Aktörers relationer @sv

kuohupaperi
type: Concept
source: RDA-termi
source: RDA-term @sv
created: 2016-01-08
modified: 2023-05-17
definition: Valmistusmenetelmä tuntoaistiin perustuville aineistoille, joissa kuva on painettu erikoispaperille. Paperissa on alkoholia sisältäviä mikrokapseleita, jotka reagoivat lämpöön laajenemalla.
definition: Produktionsmetod för material som grundar sig på känselsinnet, i vilken en bild har tryckts på specialpapper. I pappret finns mikrokapslar som innehåller alkohol och som reagerar på värme genom att utvidga sig. @sv
in scheme: Metatietosanasto
preferred label: swell paper @en
preferred label: svällpapper @sv

SVCD
type: Concept
source: Kansallinen RDA-termi
source: Nationell RDA-term @sv
created: 2016-01-08
modified: 2024-05-24
in scheme: Metatietosanasto

Koodausmuoto
type: ConceptGroup
type: Collection
source: RDA-termi
source: RDA-term @sv
created: 2016-01-08
modified: 2024-10-02
alternative label: Tiedostomuoto
alternative label: Tiedoston muoto
alternative label: Filformat @sv
member: MID/MIF
member: XML
member: HTML
member: ASCII
member: DEM
member: EPUB
member: GIF
member: QuickTime
member: BIL
member: SGML
member: JPEG
member: TIFF
member: Lotus
member: PDF
member: JPEG2000
member: HD-DVD
member: iBooks
member: VCD
member: CD-DA
member: SACD
member: BMP
member: oBook
member: CAD
member: DCP
member: WAV
member: MPEG-4
member: AIFF
member: ACC
member: TeX
member: RealVideo
member: Access
member: MOBI
member: Blu-ray
member: ArcInfo
member: DVD-Audio
member: XHTML
member: RTF
member: Excel
member: RealAudio
member: E00
member: DVD-R
member: WordPerfect
member: PNG
member: DVD-Video
member: SVCD
member: BSQ
member: MP3
member: Windows Media
member: MS Word
member: Megadots
preferred label: Encoding format @en
preferred label: Kodningsformat @sv

16 kierr./min
type: Concept
source: Kansallinen RDA-termi
source: Nationell RDA-term @sv
created: 2016-01-08
modified: 2024-05-24
in scheme: Metatietosanasto
preferred label: 16 varv/min @sv

centre track
type: Concept
source: RDA-termi
source: RDA-term @sv
created: 2016-01-08
modified: 2023-05-17
definition: Ääniraita, joka on sijoitettu filmirullan keskelle.
definition: Ljudspår som har placerats mitt på filmrullen. @sv
in scheme: Metatietosanasto
preferred label: centralspår @sv

Circarama
type: Concept
source: RDA-termi
source: RDA-term @sv
created: 2016-01-08
modified: 2023-05-17
definition: Elokuvafilmin esitysformaatti, joka käyttää yhdeksää projektoria ympyrään asetelluille kankaille.
definition: Visningsformat för film, som använder nio projektorer på filmdukar som placerats i en ring. @sv
in scheme: Metatietosanasto

MD-äänilevy
type: Concept
source: Kansallinen RDA-termi
source: Nationell RDA-term @sv
created: 2016-01-08
modified: 2025-10-31
in scheme: Metatietosanasto
preferred label: MD-ljudskiva @sv
scope note: MiniDisc

BSQ
type: Concept
source: Kansallinen RDA-termi
source: Nationell RDA-term @sv
created: 2016-01-08
modified: 2024-05-24
in scheme: Metatietosanasto

teatteri
type: Concept
source: Kansallinen RDA-termi
source: Nationell RDA-term @sv
created: 2016-01-08
modified: 2024-05-24
example: Pieni Suomi (teatteri)
example: Viirus (teater) @sv
in scheme: Metatietosanasto
preferred label: theatre @en
preferred label: teater @sv

nitraatti
type: Concept
source: RDA-termi
source: RDA-term @sv
created: 2016-01-08
modified: 2024-03-13
definition: Kamferilla pehmitetty selluloosanitraatti.
definition: Cellulosanitrat uppmjukad med kamfer. @sv
in scheme: Metatietosanasto
preferred label: nitrate @en
preferred label: nitrat @sv

taulukko
type: Concept
source: RDA-termi
source: RDA-term @sv
created: 2016-01-08
modified: 2023-05-17
definition: Kaksiulotteinen tiedon esitystapa joko graafisessa muodossa tai taulukkona.
definition: Tvådimensionellt framställningssätt för data, i antingen grafisk form eller som tabell. @sv
in scheme: Metatietosanasto
preferred label: chart @en
preferred label: tabell @sv

juliste
type: Concept
source: RDA-termi
source: RDA-term @sv
created: 2016-01-08
modified: 2023-05-17
definition: Laajuuden yksikkö, liikkumaton kuva, joka sisältää ilmoituksen, yleensä koristeellinen tai kuvitettu, tarkoituksenaan mainostaa, edistää tai tiedottaa jostakin toiminnasta, tapahtumasta, tuotteesta tai palvelusta. (engl. poster)
definition: Enhet, stillbild som består av ett meddelande, vanligtvis utsmyckat eller illustrerat, som avser att göra reklam för, främja eller informera om en verksamhet, händelse, produkt eller tjänst. (eng. poster) @sv
in scheme: Metatietosanasto
preferred label: poster @en
preferred label: affisch @sv

kartografinen kolmiulotteinen muoto
type: Concept
source: RDA-termi
source: RDA-term @sv
created: 2016-01-08
modified: 2023-05-05
definition: Muotona tai muotoina esitetty kartografinen sisältö, joka on tarkoitettu katsottavaksi kolmiulotteisena. Esimerkiksi karttapallot, pienoismallit jne.
definition: Kartografiskt innehåll uttryckt som form eller former och avsett att ses på tredimensionellt. T.ex. glober och miniatyrmodeller. @sv
in scheme: Metatietosanasto
preferred label: cartographic three-dimensional form @en
preferred label: kartografisk tredimensionell form @sv

kortti
type: Concept
source: RDA-termi
source: RDA-term @sv
created: 2016-01-08
modified: 2023-05-05
definition: Pieni arkki jäykkää paperia, ohutta pahvia tms. läpinäkymätöntä materiaalia.
definition: Litet ark styvt papper, tunn kartong e.d. av ogenomskinligt material. @sv
in scheme: Metatietosanasto
preferred label: card @en
preferred label: kort @sv
scope note: Ilman laitetta käytettävä tallennetyyppi.
scope note: Omedierad bärartyp. @sv

Väitöskirja tai muu akateeminen opinnäyte
type: ConceptGroup
type: Collection
source: RDA-termi
source: RDA-term @sv
created: 2016-01-08
modified: 2025-12-13
member: ylempi AMK-opinnäytetyö
member: lisensiaatintyö
member: pro gradu -tutkielma
member: kandidaatintutkielma
member: opinnäytetyö
member: AMK-opinnäytetyö
member: diplomityö
member: väitöskirja
preferred label: Dissertation or thesis information @en
preferred label: Doktorsavhandling eller annat akademiskt lärdomsprov @sv

kolmiulotteinen liikkuva kuva
type: Concept
source: RDA-termi
source: RDA-term @sv
created: 2016-01-08
modified: 2023-05-05
definition: Kolmiulotteisena liikkuvana kuvana esitetty sisältö. Esimerkiksi 3D-elokuvat (näytellyt, animaatiot, 3D-videopelit jne. Kolmiulotteiseen liikkuvaan kuvaan voi liittyä ääntä.
definition: Innehåll uttryckt som tredimensionell rörlig bild. T.ex. 3D-filmer, utställningar, animationer, 3D-videospel). Till tredimensionell rörlig bild kan höra ljud. @sv
in scheme: Metatietosanasto
preferred label: three-dimensional moving image @en
preferred label: tredimensionell rörlig bild @sv

ilmestymistiheys ei tiedossa
type: Concept
source: Kansallinen RDA-termi
source: Nationell RDA-term @sv
created: 2016-01-08
modified: 2025-10-04
in scheme: Metatietosanasto
preferred label: utgivningsfrekvens okänd @sv

7 1/2 tuumaa/s
type: Concept
source: Kansallinen RDA-termi
source: Nationell RDA-term @sv
created: 2016-01-08
modified: 2024-05-24
in scheme: Metatietosanasto
preferred label: 7 1/2 tum/s @sv

väitöskirja
type: Concept
source: Kansallinen RDA-termi
source: Nationell RDA-term @sv
created: 2016-01-08
modified: 2025-05-03
alternative label: diss.
alternative label: väitösk.
alternative label: akademisk avhandling @sv
alternative label: dissertation @sv
in scheme: Metatietosanasto
preferred label: doktorsavhandling @sv

kvadrofoninen
type: Concept
source: RDA-termi
source: RDA-term @sv
created: 2016-01-08
modified: 2023-05-17
alternative label: fyrkanalsljud @sv
definition: Neljästä kanavasta koostuva kvadrofonisen äänen äänikanava.
definition: Ljudkanal bestående av fyra kanaler, för kvadrofoniskt ljud. @sv
in scheme: Metatietosanasto
preferred label: quadraphonic @en
preferred label: kvadrofonisk @sv

kotelo
type: Concept
source: Kansallinen RDA-termi
source: Nationell RDA-term @sv
created: 2016-01-08
modified: 2025-11-01
definition: Aineiston säilyttämiseen tarkoitettu kotelo, josta säilytettävä tallenne on fyysisesti erotettavissa.
definition: Fodral avsett för förvaring av material. @sv
in scheme: Metatietosanasto
preferred label: fodral @sv

sukupolvien yhdistelmä
type: Concept
source: RDA-termi
source: RDA-term @sv
created: 2016-01-08
modified: 2023-05-17
definition: Sukupolven määrite aineistolle, joka on eri sukupolvien yhdistelmä ja jota ei tästä syystä voida kuvata täsmällisemmällä termillä.
definition: Bestämning av generation för material som är en kombination av olika generationer och som därför inte kan beskrivas med en exaktare term. @sv
in scheme: Metatietosanasto
preferred label: mixed generation @en
preferred label: blandad generation @sv

stereografinen
type: Concept
source: RDA-termi
source: RDA-term @sv
created: 2016-01-08
modified: 2023-05-05
definition: Viestin sisältää stillkuvapareja ja on tarkoitettu käytettäväksi stereoskooppisella tai stereografisella laitteella kolmiulotteisen vaikutelman saamiseksi.
definition: Mediet innehåller stillbildspar och används med hjälp av en stereoskopisk eller -grafisk apparat för att uppnå en tredimensionell effekt. @sv
in scheme: Metatietosanasto
preferred label: stereographic @en
preferred label: stereografisk @sv

MP3
type: Concept
source: Kansallinen RDA-termi
source: Nationell RDA-term @sv
created: 2016-01-08
modified: 2024-05-24
alternative label: MPEG-1
alternative label: MPEG-2 Audio Layer III
in scheme: Metatietosanasto
scope note: Äänen koodausmuoto, tiedostopääte .mp3
scope note: Kodningsformat för ljud, filändelse .mp3 @sv

sellakka
type: Concept
source: RDA-termi
source: RDA-term @sv
created: 2016-01-08
modified: 2024-03-13
definition: Materiaali, joka muodostuu Kerria Lacca -hyönteisnaaraan erittämästä hartsista, jota voidaan liuottaa etyylialkoholiin pensselillä levitettäväksi liuokseksi.
definition: Material som innehåller harts utsöndrat av lacksköldlusen (Kerria Lacca). Ämnet kan lösas i etylalkohol till en lösning som kan strykas ut med pensel. @sv
in scheme: Metatietosanasto
preferred label: shellac @en
preferred label: schellack @sv

katselukopio
type: Concept
source: RDA-termi
source: RDA-term @sv
created: 2016-01-08
modified: 2023-05-17
definition: Sukupolven määrite aineistolle, joka on tutkimuskäyttöön tehty kopio.
definition: Bestämning av generation för ett material som är en kopia avsedd för forskningsändamål. @sv
in scheme: Metatietosanasto
preferred label: viewing copy @en
preferred label: visningskopia @sv

filmiliuska
type: Concept
source: RDA-termi
source: RDA-term @sv
created: 2016-01-08
modified: 2023-05-17
definition: Lyhyt filmiliuska, yleensä jäykkä, ei rullattu.
definition: Kort filmremsa, oftast oböjlig istället för rullad. @sv
in scheme: Metatietosanasto
preferred label: filmslip @en
preferred label: filmremsa @sv
scope note: Heijastettava kuvatallenne.
scope note: Bärare för projicerbara bilder. @sv

kartografinen taktiili kolmiulotteinen muoto
type: Concept
source: RDA-termi
source: RDA-term @sv
created: 2016-01-08
modified: 2023-05-05
definition: Muotona tai muotoina esitetty kartografinen sisältö, joka on tarkoitettu kosketeltavaksi kolmiulotteiseksi muodoksi.
definition: Kartografiskt innehåll uttryckt som form eller former och avsett att användas genom beröring som en tredimensionell form eller former. @sv
in scheme: Metatietosanasto
preferred label: cartographic tactile three-dimensional form @en
preferred label: kartografisk taktil tredimensionell form @sv

kuningas
type: Concept
source: Kansallinen RDA-termi
source: Nationell RDA-term @sv
created: 2016-01-08
modified: 2024-05-24
definition: Monarkkisen valtion (kuningaskunnan) miespuolinen hallitsija.
definition: Manlig härskare i monarkisk stat (kungadöme). @sv
in scheme: Metatietosanasto
preferred label: kung @sv

ikkunakortti
type: Concept
source: RDA-termi
source: RDA-term @sv
created: 2016-01-08
modified: 2023-05-17
definition: Kortti, jossa on yksi tai useampi aukko mikrofilmikuvaa varten.
definition: Kort med en eller flera öppningar för mikrofilmsbilder. @sv
in scheme: Metatietosanasto
preferred label: aperture card @en
preferred label: fönsterkort @sv
scope note: Mikromuotoinen tallenne.
scope note: Mikroformsbärare. @sv

ryhmä
type: Concept
source: Kansallinen RDA-termi
source: Nationell RDA-term @sv
created: 2016-01-08
modified: 2024-05-24
alternative label: elokuvakerho
alternative label: harrastusryhmä
alternative label: henkilöstö
alternative label: jengi
alternative label: joukkue
alternative label: kerho (ryhmä)
alternative label: keskusteluryhmä
alternative label: kirjallisuuspiiri (ryhmä)
alternative label: kollektiivi (ryhmä)
alternative label: konsortio
alternative label: miehistö
alternative label: opetusryhmä
alternative label: postimerkkikerho
alternative label: seurue
alternative label: sosiaalisen median palvelun käyttäjäryhmä
alternative label: taiteilijakollektiivi
alternative label: tiimi
alternative label: työyhteenliittymä
alternative label: verkosto
alternative label: besättning @sv
alternative label: diskussionsgrupp @sv
alternative label: filmklubb @sv
alternative label: frimärksklubb @sv
alternative label: grupp i sociala medier @sv
alternative label: gäng @sv
alternative label: hobbygrupp @sv
alternative label: klubb (grupp) @sv
alternative label: kollektiv (grupp) @sv
alternative label: konsortium @sv
alternative label: konstnärskollektiv @sv
alternative label: lag @sv
alternative label: nätverk @sv
alternative label: personal @sv
alternative label: sällskap @sv
alternative label: team @sv
alternative label: undervisningsgrupp @sv
definition: Pienimuotoinen jotain yhteistä tavoitetta tai tarkoitusta varten perustettu, yleensä tilapäisluonteinen yhteisö.
definition: Småskalig, vanligen tillfällig sammanslutning grundad för något gemensamt mål eller syfte. @sv
example: Duudsonit (ryhmä)
example: KAJ (grupp) @sv
in scheme: Metatietosanasto
preferred label: grupp @sv
scope note: Käytetään kun määritelmän mukaiselle yhteisölle ei löydy tarkempaa tyyppiä tai sen käyttöä ei nähdä tarpeelliseksi. Rekisteröidyistä yhdistyksistä käytetään ensisijaisesti termiä yhdistys (rekisteröity).
scope note: Används när det inte finns eller behövs någon mer exakt typ för gruppen. Om registrerade föreningar används främst termen förening (registrerad). @sv

etsaus
type: Concept
source: RDA-termi
source: RDA-term @sv
created: 2016-01-08
modified: 2023-05-17
alternative label: linjeetsning @sv
definition: Syväpainomenetelmä, jossa kuvio tehdään haponkestävällä aineella peitetylle metalliselle painolaatalle.
definition: Djuptrycksmetod, i vilken mönstret görs på en tryckplåt i metall som täckts med ett syrabeständigt ämne. @sv
in scheme: Metatietosanasto
preferred label: etching @en
preferred label: etsning @sv

taktiili kuva
type: Concept
source: RDA-termi
source: RDA-term @sv
created: 2016-01-08
modified: 2023-05-05
definition: Viivoina, muotoina jne. esitetty sisältö, joka on tarkoitettu kosketeltavaksi kaksiulotteiseksi stillkuvaksi tai -kuviksi.
definition: Innehåll uttryckt med streck, former o.s.v., avsett att vidröras som tvådimensionell bild eller bilder. @sv
in scheme: Metatietosanasto
preferred label: tactile image @en
preferred label: taktil bild @sv

Dolby
type: Concept
source: RDA-termi
source: RDA-term @sv
created: 2016-01-08
modified: 2023-05-17
definition: Dolby Laboratoriesin kehittämä sarja melunvaimennusjärjestelmiä käytettäväksi analogisessa magneettinauhassa.
definition: Serie brusreduceringssystem för analogt magnetband, utvecklad av Dolby Laboratories. @sv
in scheme: Metatietosanasto

mikrokortti (läpinäkymätön)
type: Concept
source: RDA-termi
source: RDA-term @sv
created: 2016-01-08
modified: 2023-05-17
alternative label: mikrokort (ogenomskinlig) @sv
definition: Läpinäkymätöntä materiaali oleva kortti, jolla on mikrovalokuvia.
definition: Kort av ogenomskinligt material med mikrobilder. @sv
in scheme: Metatietosanasto
preferred label: microopaque @en
preferred label: mikrofiche (ogenomskinlig) @sv
scope note: Mikromuotoinen tallenne.
scope note: Mikroformsbärare. @sv

optinen
type: Concept
source: RDA-termi
source: RDA-term @sv
created: 2016-01-08
modified: 2023-05-17
definition: Tallennusmedia binäärisesti koodatun datan tallentamiseksi läpinäkyvälle välineelle, jolla on heijastava tausta. Heijastuksen muutokset tulkitaan binäärisenä datavirtana laserin avulla.
definition: Inspelningsmedium för att lagra binärt kodad data på ett transparent medium med reflekterande bakgrund. Ändringar i reflektion avläses som en binär dataström, med laser. @sv
in scheme: Metatietosanasto
preferred label: optical @en
preferred label: optisk @sv

erittäin suuri teksti
type: Concept
source: RDA-termi
source: RDA-term @sv
created: 2016-01-08
modified: 2024-08-27
definition: Erittäin suuri kirjasinkoko, joka on tarkoitettu auttamaan lukijoita, joilla on vaikeuksia lukea isotekstistä tekstiä.
definition: Fontstorlek avsedd för personer med synskada. @sv
in scheme: Metatietosanasto
preferred label: giant print @en
preferred label: mycket stor stil @sv

kierreselkä
type: Concept
source: Kansallinen RDA-termi
source: Nationell RDA-term @sv
created: 2016-01-08
modified: 2024-07-06
alternative label: coil bound @en
alternative label: comb-bound @en
alternative label: rengaskirja
alternative label: ringpärm @sv
definition: Sivut liitetty yhteen kierreselällä. Kierteet voivat olla näkyvillä tai peitettynä. Kierteiden materiaalina voi olla esim. muovi tai metalli. Kansi voi olla kova-tai pehmeäkantinen. Sivuja ei saa irrotettua kierreselästä.
definition: Sidorna är sammanbundna med en spiralrygg. Spiralryggen kan vara synlig eller övertäckt och gjord av t.ex. plast eller metall. Pärmarna kan vara hårda eller mjuka. Sidorna kan inte lösgöras från sprialryggen. @sv
in scheme: Metatietosanasto
preferred label: spiral-bound @en
preferred label: spiralrygg @sv

Lasiavain-palkinto
type: Concept
source: Kansallinen RDA-termi
source: Nationell RDA-term @sv
created: 2016-01-08
modified: 2023-05-17
definition: Vuosittain myönettävä palkinto parhaalle pohjoismaiselle rikosromaanille. Palkinto on myönetty vuoden 1992 alkaen. Kirja hyväksytään ehdokkaaksi vain, mikäli se on luettavissa joko alkuperäisenä tai käännöksenä ruotsiksi, norjaksi tai tanskaksi. Palkinnon myöntää Skandinaviska Kriminalsällskapet.
definition: Glasnyckeln-priset delas årligen ut till den bästa nordiska kriminalromanen. Priset har delats ut sedan 1992. För att nomineras bör en bok vara tillgänglig på svenska, norska eller danska i originalspråk eller som översättning. Priset delas ut av Skandinaviska Kriminalsällskapet. @sv
example: MARC 21 -formaatissa: 586 ## ‡a Lasiavain-palkinto, 2020
example: I MARC 21-formatet: 586 ## ‡a Glasnyckeln, 2020 @sv
in scheme: Metatietosanasto
preferred label: Glasnyckeln @sv

kunniamerkki
type: Concept
source: RDA-termi
source: RDA-term @sv
created: 2016-01-08
modified: 2023-05-17
alternative label: mitali
alternative label: hederstecken @sv
definition: Laajuuden yksikkö, pienestä metallinpalasta muodostuva kolmiulotteinen esine, jossa on kohokuvio toisella tai molemmilla puolilla ja jolla on muistotarkoitus.
definition: Enhet, tredimensionellt föremål av metall på vilket det finns reliefmönster på ena eller båda sidorna, och som är ämnat som minnessak. @sv
in scheme: Metatietosanasto
preferred label: medal @en
preferred label: medalj @sv

tekstitiedosto
type: Concept
source: RDA-termi
source: RDA-term @sv
created: 2016-01-08
modified: 2023-05-17
definition: Tiedostotyyppi elektronisesti taltioidun tekstisisällön tallentamiseksi.
definition: Filformat för lagring av elektroniskt textinnehåll. @sv
in scheme: Metatietosanasto
preferred label: text file @en
preferred label: textfil @sv

Windows Media
type: Concept
source: Kansallinen RDA-termi
source: Nationell RDA-term @sv
created: 2016-01-08
modified: 2024-05-24
in scheme: Metatietosanasto

Pohjamateriaali
type: ConceptGroup
type: Collection
source: RDA-termi
source: RDA-term @sv
created: 2016-01-08
modified: 2024-04-13
definition: Liittää manifestaation manifestaation fyysiseen pohjamateriaaliin.
definition: Sammankopplar manifestation med manifestationens fysiska bottenmaterial. @sv
preferred label: Base material @en
preferred label: Bottenmaterial @sv
scope note: Kuvailussa käytetään käsiteryhmässä Materiaali olevia käsitteitä.
scope note: Vid beskrivning används begrepp ur begreppsgruppen Material. @sv

MS Word
type: Concept
source: Kansallinen RDA-termi
source: Nationell RDA-term @sv
created: 2016-01-08
modified: 2024-05-24
in scheme: Metatietosanasto

omistajamerkintö
type: Concept
source: Kansallinen RDA-termi
source: Nationell RDA-term @sv
created: 2016-01-08
modified: 2024-05-24
example: Nimiösivulla omistajamerkintö: bror Tolpo.
example: Nimiösivulla: Helsingin Yliopiston Kirjastolle, tervehdys Myrskylän seurakunnalta. Kunnioittaen W. Hagfors.
example: På titelsidan ägaranteckning: bror Tolpo. @sv
example: På titelsidan: Helsingin Yliopiston Kirjastolle, tervehdys Myrskylän seurakunnalta. Kunnioittaen W. Hagfors. @sv
in scheme: Metatietosanasto
preferred label: ägaranteckning @sv

30 tuumaa/s
type: Concept
source: Kansallinen RDA-termi
source: Nationell RDA-term @sv
created: 2016-01-08
modified: 2024-05-24
in scheme: Metatietosanasto
preferred label: 30 tum/s @sv

Ekspression suhteet ekspressioon
type: ConceptGroup
type: Collection
created: 2016-01-08
modified: 2025-12-13
member: ekspression perustana
member: uudistettu versio
member: jatkoa versiolle
member: seuraaja
member: myöhempi teoksen versio
member: teoksen edeltävä versio
member: abstraktit ekspressiosta
member: vapaa käännös versiosta
member: mukautettu lyhennelmä versiosta
member: parafraasi versiosta
member: musiikkiteoksen teksti
member: uusintaproduktio versiosta
member: sovituksen perusta
member: jäljitelmä versiosta
member: uudistetun version perusta
member: parodia versiosta
member: variaation perustana oleva versio
member: käännöksen perusta
member: laajennettu versio versiosta
member: lyhennelmä versiosta
member: mukaelma versiosta
member: version osa
member: osa teoksen versiosta
member: dramatisointi versiosta
member: runomukaelma versiosta
member: sarjakuvaversio versiosta
member: käsikirjoituksen perustana oleva versio
member: oratoriosovitus versiosta
member: elokuvaversio versiosta
member: elokuvakäsikirjoituksen perustana oleva versio
member: käännös
member: radiosovitus versiosta
member: jäljitelmä
member: romaanimukaelma versiosta
member: videosovitus versiosta
member: radiokäsikirjoituksen perustana oleva versio
member: dubattu versio
member: oopperasovitus versiosta
member: parodia
member: videokäsikirjoituksen perustana oleva versio
member: abstraktit (ekspressio)
member: dubatun version perusta
member: televisiosovitus versiosta
member: televisiokäsikirjoituksen perustana oleva versio
member: libreton perustana oleva versio
member: musikaaliversio versiosta
member: koreografinen sovitus versiosta
member: laajennelma
member: mukaelma
member: dramatisointi
member: sovitettu televisiokäsikirjoitukseksi
member: teoksen versio sovitettu käsikirjoitukseksi
member: sovitettu elokuvakäsikirjoitukseksi
member: teoksen versio sovitettu libretoksi
member: teoksen versio sovitettu koreografiaksi
member: sovitettu videokäsikirjoitukseksi
member: elokuvaversio
member: romaanimukaelma
member: oopperasovitus
member: runomukaelma
member: radiosovitus
member: sovitus
member: videosovitus
member: variaatio
member: täydentävä teoksen versio
member: sovitettu radiokäsikirjoitukseksi
member: musikaaliversio
member: tekstiin perustuva musiikki
member: vapaamuotoinen käännös
member: sarjakuvaversio
member: mukautettu lyhennelmä
member: televisiosovitus
member: yhteenveto
member: oratoriosovitus
member: koreografia
member: lyhennelmä

varmuusfilmi
type: Concept
source: RDA-termi
source: RDA-term @sv
created: 2016-01-08
modified: 2024-03-13
definition: Materiaali, joka koostuu palamattomasta selluloosa-asetaatista tai polyesterista.
definition: Material som består av eldfast cellulosa-acetat eller polyester. @sv
in scheme: Metatietosanasto
preferred label: safety base @en
preferred label: säkerhetsfilm @sv

isotekstinen
type: Concept
source: ONIX-termi
source: RDA-termi
source: ONIX-term @sv
source: RDA-term @sv
created: 2016-01-08
modified: 2024-08-27
definition: Kirjasinkoko, joka on tarkoitettu auttamaan lukijoita, joilla on vaikeuksia lukea tavallisen kokoista tekstiä.
definition: Teckengrad som är avsedd att hjälpa läsare som har svårigheter att läsa text i normal storlek. @sv
in scheme: Metatietosanasto
preferred label: large print @en
preferred label: stor stil @sv

kovalevy
type: Concept
source: RDA-termi
source: RDA-term @sv
created: 2016-01-08
modified: 2024-03-13
preferred label: hardboard @en
definition: Tukeva, tiivis ja jäykkä, usein kuidusta kuumapuristamalla valmistettu materiaali.
definition: Stabilt, kompakt och styvt material, ofta tillverkat genom varmpressning av fiber. @sv
in scheme: Metatietosanasto
preferred label: hårdpapp @sv

ruhtinatar
type: Concept
source: Kansallinen RDA-termi
source: Nationell RDA-term @sv
created: 2016-01-08
modified: 2024-05-24
definition: Eräistä naispuolisista hallitsijoista; ruhtinassuvun naispuolinen jäsen, varsinkin ruhtinaan puoliso.
definition: Om vissa kvinnliga regenter; kvinnlig medlem av furstesläkt, särsk. gemål till furste. @sv
in scheme: Metatietosanasto
preferred label: furstinna @sv

Teoksen kategoria
type: ConceptGroup
type: Collection
source: RDA-termi
source: RDA-term @sv
created: 2016-01-08
modified: 2025-12-13
alternative label: Form of work @en
alternative label: Teoksen muoto
alternative label: Kategori för verk @sv
alternative label: Verkets form @sv
alternative label: Verkets kategori @sv
definition: Liittää teoksen tyyppiin, johon teos kuuluu.
definition: Sammankopplar verk med typ, till vilken det hör. @sv
member: romaani
member: kuunnelma
member: näytelmä
member: satu
member: kansansatu
member: koreografia
member: runo
member: novelli
member: tiedosto
member: videopeli
member: peli
member: seinätekstiili
member: sarjakuva
member: libretto
member: aikakauslehti
member: käsikirjoitus
member: sanomalehti
member: elokuvakäsikirjoitus
member: musiikkialbumi
member: ooppera
member: virsi
member: musikaali
member: nettiohjelma
member: videoitu esitys
member: musiikkivideo
member: artikkelikokoelma
member: sinfonia
member: motetti
member: sarja
member: kantaatti
member: radio-ohjelma
member: sävellys
member: elokuva
member: televisio-ohjelma
member: laulu
member: perustuslaki
member: laki
member: kokoelma
member: kokoomateos
preferred label: Category of work @en
preferred label: Kategori av verk @sv
scope note: Teoksen muoto -termejä käytetään erottamaan toisistaan samannimiset teokset. Kun tarvitset tarkempaa genrejaottelua käytä Suomalaista lajityyppi- ja muotosanastoa (SLM).
scope note: Kategori av verk-termer används för att åtskilja olika verk med samma namn. För att ange en mer detaljerad genreindelning används Finländsk genre- och formlista (FGF). @sv

Megadots
type: Concept
source: Kansallinen RDA-termi
source: Nationell RDA-term @sv
created: 2016-01-08
modified: 2024-05-24
in scheme: Metatietosanasto

alkuperäisidean luoja
type: Concept
source: Kansallinen RDA-termi
source: Nationell RDA-term @sv
created: 2016-01-08
modified: 2025-01-08
alternative label: idé, koncept av @sv
broad match: teoksen tekijä
definition: Teoksen hahmot yms. perustuvat henkilön aikaisempaan luontiin.
definition: Verkets karaktärer etc. grundar sig på en persons tidigare skapelse. @sv
in scheme: Metatietosanasto
preferred label: skapare av originalidé @sv
scope note: Teoksen tekijä
scope note: Verkets skapare @sv

lautapeli
type: Concept
source: Kansallinen RDA-termi
source: Nationell RDA-term @sv
created: 2016-01-08
modified: 2025-10-04
broader: peli
in scheme: Metatietosanasto
preferred label: brädspel @sv

opinnäytteen tarkastaja
type: Concept
source: RDA-termi
source: RDA-term @sv
created: 2016-01-08
modified: 2025-05-29
alternative label: medlem i betygskommitté @sv
broader: teoksen tekijä
definition: Henkilö, joka osallistuu akateemisen opinnäytteen tai väitöskirjan tarkastuksen suorittavaan ryhmään. (RDA Registry)
definition: Person som deltar i en grupp som utför granskning av ett akademiskt lärdomsprov eller en doktorsavhandling. @sv
in scheme: Metatietosanasto
preferred label: degree committee member @en
preferred label: granskare av lärdomsprov @sv

teoksen valokuvaaja
type: Concept
source: RDA-termi
source: RDA-term @sv
created: 2016-01-08
modified: 2026-02-18
alternative label: teoksen valokuvaaja (toimija)
alternative label: fotograf (aktör) till verk @sv
broader: teoksen tekijä
definition: Toimija, joka on vastuussa valokuvateoksen luomisesta. (RDA Registry)
definition: Aktör som svarar för skapandet av ett fotografiskt verk. @sv
in scheme: Metatietosanasto
preferred label: photographer agent of work @en
preferred label: fotograf till verk @sv

näyttämöohjaaja
type: Concept
source: RDA-termi
source: RDA-term @sv
created: 2016-01-08
modified: 2025-08-15
alternative label: stage director @en
alternative label: näyttämöohjaaja (toimija)
alternative label: scenregissör (aktör) @sv
broader: esitykseen osallinen toimija
definition: Toimija, joka osallistuu näyttämöteoksen ekspression tekemiseen johtamalla tai valvomalla esitystä. (RDA Registry)
definition: Aktör som deltar i utförandet av ett sceniskt verk, genom att leda eller övervaka ett framförande. @sv
in scheme: Metatietosanasto
preferred label: stage director agent @en
preferred label: scenregissör @sv

maisema-arkkitehti
type: Concept
source: RDA-termi
source: RDA-term @sv
created: 2016-01-08
modified: 2025-08-14
alternative label: landscape architect @en
alternative label: maisema-arkkitehti (suhde)
alternative label: maisema-arkkitehti (toimija)
alternative label: landskapsarkitekt (aktör) @sv
alternative label: landskapsarkitekt (relation) @sv
broader: arkkitehti
definition: Toimija, joka on arkkitehti, joka on vastuussa maisemateosten luomisesta. (RDA Registry)
definition: Aktör som är en arkitekt och svarar för skapandet av landskapsverk. @sv
in scheme: Metatietosanasto
preferred label: landscape architect agent @en
preferred label: landskapsarkitekt @sv

transkriboija
type: Concept
source: RDA-termi
source: RDA-term @sv
created: 2016-01-08
modified: 2025-08-23
alternative label: transcriber @en
alternative label: transkr. (transkriboija)
alternative label: transkriboija (toimija)
alternative label: transkr. (transkriberare) @sv
alternative label: transkriberare (aktör) @sv
broader: tarkistaja
definition: Toimija, joka osallistuu ekspression tekemiseen kirjoittamalla muistiin tai nuotintamalla kirjoittamattoman tai nuotintamattoman sisällön tai muuttamalla sen merkintäjärjestelmästä toiseen. (RDA Registry)
definition: Aktör som deltar i utförandet av ett uttryck, genom att uppteckna eller skriva ner noter för ett oskrivet eller onoterat innehåll eller ändra dess notationssystem till ett annat. @sv
in scheme: Metatietosanasto
preferred label: transcriber agent @en
preferred label: transkriberare @sv
scope note: Tähän ei kuulu musiikkiteoksen transkribointi eri soittimelle tai esitysryhmälle. (RDA Registry)
scope note: Hit hör inte transkribering av ett musikverk för ett annat instrument eller en annan framförande grupp. @sv

panelisti
type: Concept
source: RDA-termi
source: RDA-term @sv
created: 2016-01-08
modified: 2025-08-16
alternative label: panelist @en
alternative label: panelisti (toimija)
alternative label: deltagare i paneldiskussion (aktör) @sv
alternative label: paneldeltagare @sv
broader: esittäjä
definition: Toimija, joka on esittäjä, joka osallistuu ekspression tekemiseen osallistumalla (usein lähetettyyn) ohjelmaan, jossa keskustellaan eri aiheista tavallisesti keskusteluun liittyvien aiheiden asiantuntijoiden kanssa. (RDA Registry)
definition: Aktör som är en framförare som deltar i utförandet av ett uttryck, genom att delta i ett (ofta utsänt) program, i vilket olika ämnen diskuteras, vanligen tillsammans med experter inom ämnen som relaterar till diskussionen. @sv
in scheme: Metatietosanasto
preferred label: panelist agent @en
preferred label: deltagare i paneldiskussion @sv

ylempi AMK-opinnäytetyö
type: Concept
source: Kansallinen RDA-termi
source: Nationell RDA-term @sv
created: 2016-01-08
modified: 2024-05-24
broader: AMK-opinnäytetyö
in scheme: Metatietosanasto
preferred label: högre YH-examensarbete @sv

tanssija
type: Concept
source: RDA-termi
source: RDA-term @sv
created: 2016-01-08
modified: 2025-08-21
alternative label: dancer @en
alternative label: tanssija (toimija)
alternative label: dansare (aktör) @sv
broader: esittäjä
definition: Toimija, joka on esittäjä, joka osallistuu ekspression tekemiseen tanssimalla musiikki- tai näytelmäesityksessä. (RDA Registry)
definition: Aktör som är en framförare, som deltar i utförandet av ett uttryck genom att dansa i ett musikaliskt eller dramatiskt framförande. @sv
in scheme: Metatietosanasto
preferred label: dancer agent @en
preferred label: dansare @sv

respondentti
type: Concept
source: RDA-termi
source: RDA-term @sv
created: 2016-01-08
modified: 2025-08-19
broader: teoksen tekijä
definition: Henkilö, joka on oppiarvoa tavoiteleva kandidaatti, joka akateemisessa väitöstilaisuudessa puolustaa tai opponoi preeseksen esittelemää väitöskirjaa. (RDA Registry)
definition: Person som eftersträvar en lärdomsgrad och som försvarar eller opponerar en doktorsavhandling presenterad av en preses. @sv
in scheme: Metatietosanasto
preferred label: respondent @en

alkuperäinen
type: Concept
source: Kansallinen RDA-termi
source: Nationell RDA-term @sv
created: 2016-01-08
modified: 2025-01-08
broader: aineistoon liittyvä aineisto
in scheme: Metatietosanasto
preferred label: original @sv

televisiotuottaja
type: Concept
source: RDA-termi
source: RDA-term @sv
created: 2016-01-08
modified: 2025-08-22
alternative label: television producer @en
alternative label: televisiotuottaja (toimija)
alternative label: producent av tv-program @sv
broader: tuottaja
definition: Toimija, joka on tuottaja, joka on vastuussa suurimmasta osasta televisio-ohjelman liiketoiminnasta. (RDA Registry)
definition: Aktör som är en producent, som svarar för största delen av affärsverksamheten kring ett tv-program. @sv
in scheme: Metatietosanasto
preferred label: television producer agent @en
preferred label: tv-producent @sv

animaattori
type: Concept
source: RDA-termi
source: RDA-term @sv
created: 2016-01-08
modified: 2025-08-13
alternative label: animator @en
alternative label: anim. (animaattori)
alternative label: animaattori (suhde)
alternative label: animaattori (toimija)
alternative label: animatör (aktör) @sv
alternative label: animatör (relation) @sv
broader: esitykseen osallinen toimija
definition: Toimija, joka osallistuu ekspression tekemiseen tuottamalla näennäistä liikettä elottomiin esineisiin tai piirroksiin. (RDA Registry)
definition: Aktör som deltar i skapandet av ett uttryck genom att ge skenbar rörelse åt livlösa objekt eller teckningar. @sv
in scheme: Metatietosanasto
preferred label: animator agent @en
preferred label: animatör @sv
scope note: Ei koske animaatiopiirrosten tekijää. (RDA Registry)
scope note: Gäller inte skapare av animationsteckningar. @sv

valosuunnittelija
type: Concept
source: RDA-termi
source: RDA-term @sv
created: 2016-01-08
modified: 2025-08-23
alternative label: lighting designer @en
alternative label: valosuunnittelija (toimija)
alternative label: ljusdesigner (aktör) @sv
broader: esitykseen osallinen toimija
definition: Toimija, joka osallistuu ekspression tekemiseen suunnittelemalla ja luomalla valokomponentteja. (RDA Registry)
definition: Aktör som deltar i utförandet av ett uttryck, genom att planera och skapa ljuskomponenter. @sv
in scheme: Metatietosanasto
preferred label: lighting designer agent @en
preferred label: ljusdesigner @sv

puhuja
type: Concept
source: RDA-termi
source: RDA-term @sv
created: 2016-01-08
modified: 2025-08-16
alternative label: speaker @en
alternative label: puhuja (toimija)
alternative label: talare (aktör) @sv
broader: esittäjä
definition: Toimija, joka on esittäjä, joka osallistuu teoksen ekspression tekemiseen puhumalla sanoja. (RDA Registry)
definition: Aktör som är en framförare som deltar i utförandet av ett verks uttryck genom att tala ord. @sv
in scheme: Metatietosanasto
preferred label: speaker agent @en
preferred label: talare @sv
scope note: Sisältää luennon tai puheen. (RDA Registry)
scope note: Inbegriper en föreläsning eller ett tal. @sv

rykmentti
type: Concept
source: Kansallinen RDA-termi
source: Nationell RDA-term @sv
created: 2016-01-08
modified: 2024-05-24
broader: sotilasyksikkö
example: F19 (rykmentti)
example: IR 61:an (regemente) @sv
in scheme: Metatietosanasto
preferred label: regemente @sv

sovittaja
type: Concept
source: RDA-termi
source: RDA-term @sv
created: 2016-01-08
modified: 2025-08-19
alternative label: arranger of music @en
alternative label: musiikin sovittaja
alternative label: sov. (sovittaja)
alternative label: sovittaja (suhde)
alternative label: sovittaja (toimija)
alternative label: arr. (arrangör av musikalisk komposition) @sv
alternative label: arrangör av musikalisk komposition (aktör) @sv
alternative label: arrangör av musikalisk komposition (relation) @sv
broader: tarkistaja
definition: Toimija, joka osallistuu teoksen ekspression tekemiseen muokkaamalla sävellyksen alkuperäisteoksesta poikkeavalle esityskokoonpanolle. (RDA Registry)
definition: Aktör som deltar i utförandet av ett verks uttryck, genom att omarbeta kompositionen för en musikalisk besättning som avviker från originalverket. @sv
in scheme: Metatietosanasto
preferred label: arranger agent of music @en
preferred label: arrangör av musikalisk komposition @sv
scope note: Sovittaja voi myös muokata teosta samalle esityskokoonpanolle tms. säilyttäen alkuperäisen sävellyksen musiikillisen sisällön olennaisilta osin muuttumattomana. Tähän ei sisälly laaja muokkaaminen, joka johtaa uuden musiikkiteoksen luomiseen. (RDA Registry)
scope note: En arrangör kan också bearbeta verket för samma musikaliska besättning eller dylikt och bevara originalkompositionens musikaliska innehåll till sina väsentliga delar oförändrade. I detta ingår inte omfattande ändringar som leder till skapandet av ett nytt musikverk. @sv

leikkaaja
type: Concept
source: RDA-termi
source: RDA-term @sv
created: 2016-01-08
modified: 2025-07-04
alternative label: editor of moving image work @en
alternative label: leikk. (leikkaaja)
alternative label: leikkaaja (toimija)
alternative label: klippare (aktör) @sv
alternative label: redigerare @sv
broader: esitykseen osallinen toimija
definition: Toimija, joka vastaa filmin, videon tai muiden liikkuvan kuvan formaattien kokoamisesta, järjestämisestä ja leikkauksesta sekä kuvan että äänen osalta. (RDA Registry)
definition: Aktör som svarar för samling, ordnande och klippning av film, video eller andra format för rörlig bild, både beträffande bild och ljud. @sv
in scheme: Metatietosanasto
preferred label: editor agent of moving image work @en
preferred label: klippare @sv

radiotuottaja
type: Concept
source: RDA-termi
source: RDA-term @sv
created: 2016-01-08
modified: 2025-08-19
alternative label: radio producer @en
alternative label: radiotuottaja (toimija)
alternative label: producent av radioprogram @sv
alternative label: radioproducent (aktör) @sv
broader: tuottaja
definition: Toimija, joka on tuottaja, joka on vastuussa suurimmasta osasta radio-ohjelman liiketoiminnasta. (RDA Registry)
definition: Aktör som är en producent, som svarar för största delen av affärsverksamheten kring ett radioprogram. @sv
in scheme: Metatietosanasto
preferred label: radio producer agent @en
preferred label: radioproducent @sv

osuuskunta
type: Concept
source: Kansallinen RDA-termi
source: Nationell RDA-term @sv
created: 2016-01-08
modified: 2024-05-24
alternative label: asunto-osuuskunta
alternative label: osuuskassa
alternative label: osuuskauppa
alternative label: osuusliike
alternative label: osuusmeijeri
alternative label: työosuuskunta
alternative label: vesiosuuskunta
alternative label: andelsaffär @sv
alternative label: andelsförening @sv
alternative label: andelshandel @sv
alternative label: andelskassa @sv
alternative label: andelsmejeri @sv
alternative label: arbetsandelslag @sv
alternative label: bostadsrättsförening @sv
alternative label: kooperativ @sv
alternative label: kooperativ förening @sv
alternative label: vattenandelslag @sv
broader: yhtiö
definition: Yhtiömuoto, joka määritellään osuuskuntalaissa. Osuuskunta on yhteisö, jonka jäsenmäärää ja osuuspääomaa ei ole ennalta määrätty. Osuuskunnan tarkoituksena on jäsenten taloudenpidon tai elinkeinon tukemiseksi harjoittaa taloudellista toimintaa siten, että jäsenet käyttävät hyväkseen osuuskunnan tarjoamia palveluita taikka palveluita, jotka osuuskunta järjestää tytäryhteisönsä avulla tai muulla tavalla (Liiketoimintaontologia).
definition: Bolagsform som definieras i lagen om andelslag, och vars medlemsantal och kapital är på förhand obestämda. Syftet med ett andelslags verksamhet är att i avsikt att stödja medlemmarnas ekonomi eller näringsutövning driva ekonomisk verksamhet så att medlemmarna nyttjar andelslagets tjänster eller tjänster som andelslaget tillhandahåller med hjälp av en dottersammanslutning eller på annat sätt. @sv
example: Forum Box (osuuskunta)
example: Forum Box (andelslag) @sv
in scheme: Metatietosanasto
preferred label: andelslag @sv

tuomari
type: Concept
source: RDA-termi
source: RDA-term @sv
created: 2016-01-08
modified: 2025-08-23
broader: teoksen tekijä
definition: Henkilö, joka kuulee ja päättää oikeusasioista tuomioistuimessa. (RDA Registry)
definition: Person som hör och fattar beslut om juridiska saker i en domstol. @sv
in scheme: Metatietosanasto
preferred label: judge @en
preferred label: domare @sv

pöytäkirjan laatija
type: Concept
source: RDA-termi
source: RDA-term @sv
created: 2016-01-08
modified: 2025-08-16
alternative label: minute taker @en
alternative label: pöytäkirjan laatija (toimija)
alternative label: protokollförare (aktör) @sv
broader: yhdistymään osallinen toimija
definition: Toimija, joka vastaa kokouksen pöytäkirjan laatimisesta. (RDA Registry)
definition: Aktör som svarar för sammanställandet av ett protokoll för ett möte. @sv
in scheme: Metatietosanasto
preferred label: minute taker agent @en
preferred label: protokollförare @sv

DVD-levy
type: Concept
source: Kansallinen RDA-termi
source: Nationell RDA-term @sv
created: 2016-01-08
modified: 2025-10-31
in scheme: Metatietosanasto
narrower: DVD-ROM-levy
preferred label: DVD-skiva @sv
scope note: (DVD Digital Versatile Disc tai Digital Video Disc) tiedontallennukseen käytettävä optisesti luettava levy, DVD:n yleisimmät käyttötavat ovat videokuvan ja tiedon tallennus (Tietotekniikan termitalkoot, Wikipedia 15.1.2013)
scope note: DVD (Digital Versatile Disc eller Digital Video Disc) är en optiskt läsbar skiva för lagring av data. De vanligaste användningsområden för DVD är video- och datalagring. @sv

äänisuunnittelija
type: Concept
source: RDA-termi
source: RDA-term @sv
created: 2016-01-08
modified: 2025-08-27
alternative label: sound designer @en
alternative label: äänisuunnittelija (toimija)
alternative label: ljuddesigner (aktör) @sv
broader: esitykseen osallinen toimija
definition: Toimija, joka osallistuu ekspression tekemiseen suunnittelemalla ja luomalla äänikomponentteja. (RDA Registry)
definition: Aktör som deltar i utförandet av ett uttryck, genom att planera och skapa ljudkomponenter. @sv
in scheme: Metatietosanasto
preferred label: sound designer agent @en
preferred label: ljuddesigner @sv

keksijä
type: Concept
source: RDA-termi
source: RDA-term @sv
created: 2016-01-08
modified: 2025-07-03
alternative label: inventor @en
alternative label: keksijä (suhde)
alternative label: keksijä (toimija)
alternative label: uppfinnare (aktör) @sv
alternative label: uppfinnare (relation) @sv
broader: teoksen tekijä
definition: Toimija, joka on vastuussa uuden välineen tai menetelmän luomisesta. (RDA Registry)
definition: Aktör som svarar för skapandet av ett nytt redskap eller en ny metod. @sv
in scheme: Metatietosanasto
preferred label: inventor agent @en
preferred label: uppfinnare @sv

sulautunut yhteisö
type: Concept
source: RDA-termi
source: RDA-term @sv
created: 2016-01-08
modified: 2025-08-21
broader: yhteisöön liittyvä yhteisö
definition: Yhteisö, joka on sulautunut toiseen yhteisöön. (RDA Registry)
definition: Institution som har uppgått i en annan institution. @sv
in scheme: Metatietosanasto
preferred label: absorbed corporate body @en
preferred label: institution som uppgått @sv

sääntöjen ohjaama tuomioistuin
type: Concept
source: RDA-termi
source: RDA-term @sv
created: 2016-01-08
modified: 2025-08-21
alternative label: voimassaoleva tuomioistuin
alternative label: domstols regelverk @sv
broader: teoksen tekijä
definition: Tuomioistuin, jota tuomioistuimen säännöt ohjaavat riippumatta niiden virallisesta luonteesta. (RDA Registry)
definition: Domstol som styrs av en domstols regler, oberoende av deras officiella karaktär. @sv
in scheme: Metatietosanasto
preferred label: court governed @en
preferred label: behörig domstol @sv

itsenäinen jatko-osa teokselle
type: Concept
source: Kansallinen RDA-termi
source: Nationell RDA-term @sv
created: 2016-01-08
modified: 2023-05-17
broader: edeltävä teos
in scheme: Metatietosanasto
preferred label: fristående fortsättning på verket @sv

miksaaja
type: Concept
source: RDA-termi
source: RDA-term @sv
created: 2016-01-08
modified: 2025-08-15
alternative label: mixing engineer @en
alternative label: miks. (miksaaja)
alternative label: miksaaja (suhde)
alternative label: miksaaja (toimija)
alternative label: mix. (mixer) @sv
alternative label: mixer (aktör) @sv
alternative label: mixer (relation) @sv
broader: ääniteknikko
definition: Toimija, joka osallistuu ekspression äänisisällön tekemiseen käsittelemällä, miksaamalla ja yhdistelemällä useampia äänitteen raitoja. (RDA Registry)
definition: Aktör som deltar i skapandet av ett uttrycks ljudinnehåll, genom att behandla, mixa och kombinera flera spår i en ljudinspelning. @sv
in scheme: Metatietosanasto
preferred label: mixing engineer agent @en
preferred label: mixer @sv
scope note: Ei koske uudelleenmiksauksia, jotka olennaisesti muuttavat alkuperäisen teoksen luonnetta ja sisältöä, mikä johtaa uuteen teokseen. (RDA Registry)
scope note: Gäller inte remixer som väsentligen ändrar det ursprungliga verkets karaktär och innehåll, vilket leder till ett nytt verk. @sv

julkaistu myös eripainoksena
type: Concept
source: Kansallinen RDA-termi
source: Nationell RDA-term @sv
created: 2016-01-08
modified: 2024-10-10
broader: muu julkaisumuoto
in scheme: Metatietosanasto
preferred label: utgiven även som särtryck @sv

juontaja
type: Concept
source: RDA-termi
source: RDA-term @sv
created: 2016-01-08
modified: 2025-07-01
alternative label: host @en
alternative label: juont. (juontaja)
alternative label: juontaja (suhde)
alternative label: juontaja (toimija)
alternative label: programledare (aktör) @sv
alternative label: programledare (relation) @sv
broader: esittäjä
definition: Toimija, joka on esittäjä, joka osallistuu ekspression tekemiseen juontamalla (usein lähetettyä) ohjelmaa, johon osallistuu muita esiintyjiä. (RDA Registry)
definition: Aktör som är en framförare som deltar i utförandet av ett uttryck, genom att leda ett (ofta utsänt) program, i vilket andra uppträdande deltar. @sv
in scheme: Metatietosanasto
preferred label: host agent @en
preferred label: programledare @sv

julkaistu myös verkkoaineistona
type: Concept
source: Kansallinen RDA-termi
source: Nationell RDA-term @sv
created: 2016-01-08
modified: 2024-10-10
alternative label: saatavana myös verkkoaineistona
alternative label: tillgänglig även som onlineresurs @sv
broader: muu julkaisumuoto
in scheme: Metatietosanasto
preferred label: utgiven även som onlineresurs @sv

televisio-ohjaaja
type: Concept
source: RDA-termi
source: RDA-term @sv
created: 2016-01-08
modified: 2025-08-22
alternative label: television director @en
alternative label: televisio-ohjaaja (toimija)
alternative label: televisio-ohjelman ohjaaja
alternative label: tv-regissör (aktör) @sv
broader: ohjaaja
definition: Toimija, joka on ohjaaja, joka on vastuussa televisio-ohjelman yleisestä johtamisesta ja valvonnasta. (RDA Registry)
definition: Aktör som är en regissör, som svarar för allmän ledning och övervakning av ett tv-program. @sv
in scheme: Metatietosanasto
preferred label: television director agent @en
preferred label: tv-regissör @sv

toimintakeskus
type: Concept
source: Kansallinen RDA-termi
source: Nationell RDA-term @sv
created: 2016-01-08
modified: 2024-05-24
alternative label: työkeskus
alternative label: arbetscentral @sv
alternative label: verksamhetscentral @sv
broader: sosiaalihuoltolaitos
definition: Vammaisille ja vajaakuntoisille päivätoimintaa tarjoava sosiaalihuollon yksikkö.
definition: Enhet inom socialvård, som erbjuder dagverksamhet för personer med funktionsnedsättning eller nedsatt arbetsförmåga. @sv
example: Auraamo (toimintakeskus)
example: Vägskäl (verksamhetscenter) @sv
in scheme: Metatietosanasto
preferred label: verksamhetscenter @sv

sormituksen tekijä
type: Concept
source: Kansallinen RDA-termi
source: Nationell RDA-term @sv
created: 2016-01-08
modified: 2025-01-08
alternative label: sorm. (sormutuksen tekijä)
alternative label: fingers. (fingersättning av) @sv
broader: esitykseen osallinen henkilö
definition: Henkilö, joka osallistuu ekspression tekemiseen lisäämällä sormitukset notatoituun musiikkiin.
definition: Person som deltar i utförandet av ett uttryck genom att lägga till fingersättningar för noterad musik. @sv
in scheme: Metatietosanasto
preferred label: fingersättning av @sv

nukettaja
type: Concept
source: RDA-termi
source: RDA-term @sv
created: 2016-01-08
modified: 2025-08-15
alternative label: puppeteer @en
alternative label: nukettaja (toimija)
alternative label: dockspelare (aktör) @sv
broader: esittäjä
definition: Toimija, joka on esittäjä, joka osallistuu ekspression tekemiseen käsittelemällä, kontrolloimalla tai ohjaamalla nukkeja tai marionetteja elokuvatuotannossa tai musiikki- tai näytelmäesityksessä. (RDA Registry)
definition: Aktör som är en framförare som deltar i utförandet av ett uttryck genom att hantera, kontrollera eller styra dockor eller marionetter i en filmproduktion eller ett musikaliskt eller sceniskt uppförande. @sv
in scheme: Metatietosanasto
preferred label: puppeteer agent @en
preferred label: dockspelare @sv

linkki
type: Concept
source: Kansallinen RDA-termi
source: Nationell RDA-term @sv
created: 2016-01-08
modified: 2024-10-10
broader: muu julkaisumuoto
in scheme: Metatietosanasto
preferred label: länk @sv

designer
type: Concept
source: RDA-termi
source: RDA-term @sv
created: 2016-01-08
modified: 2025-05-27
alternative label: designer (toimija)
alternative label: designer (aktör) @sv
broader: teoksen tekijä
definition: Toimija, joka on vastuussa kohteen suunnittelusta tai muotoilusta. (RDA Registry)
definition: Aktör som svarar för design eller formgivning av ett objekt. @sv
in scheme: Metatietosanasto
preferred label: designer agent @en

CD-levy
type: Concept
source: Kansallinen RDA-termi
source: Nationell RDA-term @sv
created: 2016-01-08
modified: 2025-10-31
in scheme: Metatietosanasto
narrower: CD-ROM-levy
preferred label: CD-skiva @sv
scope note: (CD compact disc) tiedontallennukseen käytettävä optisesti luettava levy. CD-levylle tietoa (ääntä, kuvaa ja tekstiä) voidaan tallentaa yhdelle puolelle yhteen kerrokseen. CD-levytyyppeihin, joiden käyttötavat poikkeavat toisistaan, voidaan viitata kuhunkin eri termillä. CD-äänilevyä ja CD-ROM-levyä (CD-tietolevyä) voidaan ainoastaan toistaa, CD-R-levylle voidaan tallentaa yhden kerran ja CD-RW-levylle useita kertoja. (Tietotekniikan termitalkoot, 15.1.2013)
scope note: CD (compact disc) optiskt lagringsmedium. Information (ljud, bild och text) lagras på en sida i ett lager. Olika typer av CD-skivor, vars användningssätt avviker från varandra, har varsin term. CD-ljudskivor och CD-ROM-skivor (CD-datorskivor) kan endast återges, CD-R-skivor kan spelas in en gång och CD-RW-skivor flera gånger. @sv

tuomioistuimen kirjuri
type: Concept
source: RDA-termi
source: RDA-term @sv
created: 2016-01-08
modified: 2025-08-23
alternative label: court reporter @en
alternative label: tuomioistuimen kirjuri (toimija)
alternative label: domstolssekreterare (aktör) @sv
broader: yhdistymään osallinen toimija
definition: Toimija, joka osallistuu teoksen ekspression tekemiseen valmistelemalla tuomioistuimen lausunnon julkaistavaksi. (RDA Registry)
definition: Aktör som deltar i utförandet av ett verks uttryck, genom att förbereda en domstols utlåtande för publicering. @sv
in scheme: Metatietosanasto
preferred label: court reporter agent @en
preferred label: domstolssekreterare @sv

palapeli
type: Concept
source: RDA-termi
source: RDA-term @sv
created: 2016-01-08
modified: 2023-05-17
broader: peli
definition: Laajuuden yksikkö, yleensä pahvista tai puusta erimuotoisiksi paloiksi leikattuja kolmiulotteisia muotoja, joista muodostuu koottava kuva.
definition: Enhet, tredimensionella former skurna till olikformade bitar, vanligen av papp eller trä, som bilda en hopsättbar bild. @sv
in scheme: Metatietosanasto
preferred label: jigsaw puzzle @en
preferred label: pussel @sv

tekstaaja
type: Concept
source: RDA-termi
source: RDA-term @sv
created: 2016-01-08
modified: 2025-08-22
alternative label: letterer @en
alternative label: tekstaaja (toimija)
alternative label: textare (aktör) @sv
broader: yhdistymään osallinen toimija
definition: Toimija, joka osallistuu sarjakuvan, sarjakuvaromaanin tms. ekspression tekemiseen piirtämällä tekstin ja graafiset äänitehosteet. (RDA Registry)
definition: Institution som deltar i utförandet av ett uttryck av en tecknad serie, grafisk roman eller dylikt, genom att rita texten och grafiska ljudeffekter. @sv
in scheme: Metatietosanasto
preferred label: letterer agent @en
preferred label: textare @sv

piirtäjä
type: Concept
source: RDA-termi
source: RDA-term @sv
created: 2016-01-08
modified: 2025-08-16
alternative label: draftsman @en
alternative label: piirt. (piirtäjä)
alternative label: piirtäjä (toimija)
alternative label: ritare (aktör) @sv
broader: yhdistymään osallinen toimija
definition: Toimija, joka osallistuu arkkitehdin, suunnittelijan tai muun toimijan luoman ekspression tekemiseen tuottamalla tarkkoja suunnitelmia tai piirroksia rakennuksista, laivoista, lentokoneista, laitteista, esineistä tai muista luomuksista. (RDA Registry)
definition: Aktör som deltar i utförandet av ett uttryck skapat av en arkitekt, designer eller annan dylik aktör, genom att skapa precisa planer eller ritningar av byggnader, fartyg, flygplan, apparater, föremål eller andra kreationer. @sv
in scheme: Metatietosanasto
preferred label: draftsman agent @en
preferred label: ritare @sv

kuvaaja
type: Concept
source: RDA-termi
source: RDA-term @sv
created: 2016-01-08
modified: 2025-07-04
alternative label: director of photography @en
alternative label: kuvaaja (suhde)
alternative label: kuvaaja (toimija)
alternative label: videokuvaaja
alternative label: filmfotograf (aktör) @sv
alternative label: filmfotograf (relation) @sv
alternative label: videofilmare @sv
alternative label: videofotograf @sv
broader: teoksen tekijä
definition: Toimija, joka tallentaa kuvia joko sähköisesti tai filmille tai videolle ja usein valitsee ja järjestää valaistuksen. (RDA Registry)
definition: Aktör som spelar in bilder antingen elektroniskt, eller på film eller video, och ofta väljer och arrangerar belysningen. @sv
in scheme: Metatietosanasto
preferred label: director agent of photography @en
preferred label: filmfotograf @sv
scope note: Elokuvan kuvaajaa kutsutaan myös elokuvaajaksi. (RDA Registry)

yhdistynyt yhteisö
type: Concept
source: RDA-termi
source: RDA-term @sv
created: 2016-01-08
modified: 2025-08-27
alternative label: yhdistynyt yhteisöön
alternative label: sammanslagits med institutionen @sv
broader: yhteisön edeltäjä
definition: Yhteisö, joka muodostaa uuden yhteisön yhdistymällä yhden tai useamman muun yhteisön kanssa. (RDA Registry)
definition: Institution som bildar en ny institution, genom att gå samman med en eller flera andra institutioner. @sv
in scheme: Metatietosanasto
preferred label: component of merger @en
preferred label: sammanslagen institution @sv

esittämisestä vastaava toimija
type: Concept
source: RDA-termi
source: RDA-term @sv
created: 2016-01-08
modified: 2025-06-11
alternative label: presenter @en
alternative label: esittämisestä vastaava
alternative label: ansvarig för framförande @sv
broader: esittäjä
definition: Toimija, joka sisältyy merkintään "X esittää:" ekspression sisältävän manifestaation alku- tai lopputeksteissä ja joka liittyy todennäköisesti liikkuvan kuvan teoksen ekspression tuotantoon, rahoitukseen tai jakeluun jollakin tavoin. (RDA Registry)
definition: Aktör som ingår i texten "X presenterar:" i för- och eftertexter i en manifestation som innehåller ett uttryck, och som troligtvis på något vis relaterar till produktion, finansiering eller distribution av ett uttryck för rörlig bild. @sv
in scheme: Metatietosanasto
preferred label: presenter agent @en
preferred label: ansvarig aktör för framförande @sv

soitonoppaan tekijä
type: Concept
source: Kansallinen RDA-termi
source: Nationell RDA-term @sv
created: 2016-02-12
modified: 2025-12-06
broader: teoksen tekijä
definition: Henkilö, joka on vastuussa pääosin nuottiaineistoa sisältävän soitonoppaan laatimisesta.
definition: Person som svarar för sammanställandet av en instrumentskola som i huvudsak innehåller notmaterial. @sv
in scheme: Metatietosanasto
preferred label: författare till instrumentskola @sv
scope note: Teoksen tekijä.
scope note: Verkets skapare. @sv

laulunoppaan tekijä
type: Concept
source: Kansallinen RDA-termi
source: Nationell RDA-term @sv
created: 2016-02-24
modified: 2025-12-06
broader: teoksen tekijä
definition: Henkilö, joka on vastuussa pääosin nuottiaineistoa sisältävän laulunoppaan laatimisesta.
definition: Person som svarar för sammanställandet av en sångskola som i huvudsak innehåller notmaterial. @sv
in scheme: Metatietosanasto
preferred label: författare till sångskola @sv
scope note: Teoksen tekijä.
scope note: Verkets skapare. @sv

mustavalkoinen
type: Concept
source: Kansallinen RDA-termi
source: Nationell RDA-term @sv
created: 2016-04-15
modified: 2024-03-14
broader: yksivärinen
in scheme: Metatietosanasto
preferred label: svartvit @sv

värillinen
type: Concept
source: Kansallinen RDA-termi
source: Nationell RDA-term @sv
created: 2016-04-15
modified: 2024-03-14
broader: monivärinen
in scheme: Metatietosanasto
preferred label: i färg @sv
scope note: Esimerkiksi kartan värillisyys.
scope note: T.ex. en karta i färg. @sv

värittäjä
type: Concept
source: RDA-termi
source: RDA-term @sv
created: 2016-08-16
modified: 2025-08-23
alternative label: colorist @en
alternative label: colorist agent @en
alternative label: colourist @en
alternative label: värittäjä (toimija)
alternative label: färgläggare (aktör) @sv
broader: yhdistymään osallinen toimija
definition: Toimija, joka osallistuu ekspression tekemiseen värittämällä piirustuksia, vedoksia, valokuvia, karttoja, liikkuvia kuvia tai muuta sisältöä. (RDA Registry)
definition: Aktör som deltar i utförandet av ett uttryck, genom att färglägga ritningar, råkopior, fotografier, kartor, rörliga bilder eller annat innehåll. @sv
in scheme: Metatietosanasto
preferred label: colourist agent @en
preferred label: färgläggare @sv

päätoimittaja
type: Concept
source: Kansallinen RDA-termi
source: Nationell RDA-term @sv
created: 2016-08-17
modified: 2024-12-18
alternative label: päätoimittaja (suhde)
alternative label: huvudredaktör (relation) @sv
broader: toimittaja
definition: Henkilö, joka osallistuu ekspression tekemiseen vastaavana toimittajana.
definition: Person som deltar i utförandet av ett uttryck som ansvarig redaktör. @sv
in scheme: Metatietosanasto
preferred label: huvudredaktör @sv

ääninäyttelijä
type: Concept
source: RDA-termi
source: RDA-term @sv
created: 2016-01-08
modified: 2025-08-27
alternative label: voice actor @en
alternative label: ääninäyttelijä (toimija)
alternative label: röstskådespelare (aktör) @sv
broader: näyttelijä
definition: Toimija, joka on näyttelijä, joka osallistuu ekspression tekemiseen antamalla äänen hahmoille radio- ja äänituotannoissa ja animoiduille hahmoille elokuvateoksissa sekä esiintymällä radio- ja TV-mainoksissa, dubatuissa ekspressioissa tms. (RDA Registry)
definition: Aktör som är en skådespelare, som deltar i utförandet av ett uttryck, genom att ge röst åt karaktärer i radio- och ljudproduktioner och animerade karaktärer i filmverk, samt genom att framträda i radio- och tv-reklarm, i dubbade uttryck etc. @sv
in scheme: Metatietosanasto
preferred label: voice actor agent @en
preferred label: röstskådespelare @sv

visuaalisten tehosteiden tekijä
type: Concept
source: RDA-termi
source: RDA-term @sv
created: 2016-01-08
modified: 2025-08-23
alternative label: visual effects provider @en
alternative label: visuaalisten tehosteiden tekijä (toimija)
alternative label: skapare (aktör) av visuella effekter @sv
broader: esitykseen osallinen toimija
definition: Toimija, joka osallistuu liikkuvan kuvan teoksen ekspression tekemiseen suunnittelemalla ja luomalla visuaaliset tehosteet jälkituotantovaiheessa. (RDA Registry)
definition: Aktör som deltar i utförandet av ett uttryck av ett verk med rörlig bild, genom att planera och skapa visuella effekter i postproduktionsfasen. @sv
in scheme: Metatietosanasto
preferred label: visual effects provider agent @en
preferred label: skapare av visuella effekter @sv

maskeeraaja
type: Concept
source: RDA-termi
source: RDA-term @sv
created: 2016-08-23
modified: 2025-08-14
alternative label: make-up artist @en
alternative label: maskeeraaja (toimija)
alternative label: meikkitaiteilija
alternative label: meikkitaiteilija (suhde)
alternative label: makeupartist @sv
alternative label: makeupartist (relation) @sv
alternative label: maskör (aktör) @sv
broader: esitykseen osallinen toimija
definition: Toimija, joka osallistuu ekspression tekemiseen vastaamalla elokuvan, musikaalin tai näyttämöteoksen maskeerauksesta. (RDA Registry)
definition: Aktör som deltar i utförandet av ett uttryck, genom att svara för maskering i en film, en musikal eller ett sceniskt verk. @sv
in scheme: Metatietosanasto
preferred label: makeup artist agent @en
preferred label: maskör @sv

yksivärinen
type: Concept
source: RDA-termi
source: RDA-term @sv
created: 2016-08-23
modified: 2024-03-14
definition: Aineiston sisältöön liittyvä värillisyys, joka koostuu yhden värin sävyistä, tai mustasta ja valkoisesta, tai mustasta tai valkoisesta ja muusta väristä.
definition: Kulörthet i samband med ett materials innehåll, som kan vara enfärgat, svart och vitt eller någon annan färg. @sv
in scheme: Metatietosanasto
narrower: mustavalkoinen
preferred label: monochrome @en
preferred label: enfärgad @sv

monivärinen
type: Concept
source: RDA-termi
source: RDA-term @sv
created: 2016-08-23
modified: 2024-03-14
alternative label: flera färger @sv
alternative label: flerfärgad @sv
definition: Aineiston sisältöön liittyvä värillisyys, joka koostuu kahdesta väristä, joista kumpikaan ei ole musta tai valkoinen, tai useammasta kuin kahdesta väristä.
definition: Färginnehåll samhörande med ett materials innehåll, som består av två färger, av vilka ingendera är svart eller vit, eller av fler än två färger. @sv
in scheme: Metatietosanasto
narrower: värillinen
preferred label: polychrome @en
preferred label: polykrom @sv

sanoittaja (ekspressio)
type: Concept
source: Kansallinen RDA-termi
source: Nationell RDA-term @sv
created: 2016-11-03
modified: 2025-04-10
alternative label: författare till sångtext (uttryck) @sv
broader: esitykseen osallinen henkilö
definition: Liittää ekspression henkilöön, joka osallistuu musiikkiteoksen ekspression tekemiseen kirjoittamalla sanoituksen teokseen, johon ei aikaisemmin sisältynyt tekstiä tai kirjoittamalla uuden sanoituksen korvaamaan teoksen aikaisemman tekstin tai täydentämään olemassa olevaa tekstiä. Sanoituksesta, joka on tehty yhteistyössä säveltäjän kanssa alkuperäiseen teokseen, katso sanoittaja.
definition: Sammankopplar uttryck med en person som deltar i utförandet av ett musikverks uttryck genom att skriva sångtext till ett verk, i vilket tidigare inte ingått text, eller genom att skriva en ny sångtext som ersätter ett verks tidigare text, eller som kompletterar redan existerande text. För sångtext som har skapats för det originala verket i samarbete med kompositören, se sångtextförfattare. @sv
in scheme: Metatietosanasto
preferred label: sångtextförfattare (uttryck) @sv

kaivertaja
type: Concept
source: RDA-termi
source: RDA-term @sv
created: 2016-12-02
modified: 2025-07-02
alternative label: engraver @en
alternative label: kaivert. (kaivertaja)
alternative label: kaivertaja (suhde)
alternative label: kaivertaja (toimija)
alternative label: gravör (aktör) @sv
alternative label: gravör (relation) @sv
broader: kuvalaatan valmistaja
definition: Toimija, joka on vastuussa manifestaation valmistamisesta kaivertamalla kirjaimia, kuvioita tai muita merkkejä painamisessa käytettävälle pinnalle, kuten puu- tai metallipinnalle. (RDA Registry)
definition: Aktör som svarar för tillverkningen av en manifestation, genom att gravera bokstäver, mönster eller andra tecken på en yta som används vid tryck, såsom en trä- eller metallyta. @sv
in scheme: Metatietosanasto
preferred label: engraver agent @en
preferred label: gravör @sv

paperinvalmistaja
type: Concept
source: RDA-termi
source: RDA-term @sv
created: 2016-12-02
modified: 2025-08-16
alternative label: papermaker @en
alternative label: paperin valmistaja
alternative label: paperinvalmistaja (toimija)
alternative label: papperstillverkare (aktör) @sv
broader: aineistoon liittyvä toimija
definition: Toimija, joka on vastuussa manifestaatioon käytettävän paperin valmistamisesta. (RDA Registry)
definition: Aktör som svarar för tillverkningen av papper som använts i en manifestation. @sv
in scheme: Metatietosanasto
preferred label: papermaker agent @en
preferred label: papperstillverkare @sv

litografi
type: Concept
source: RDA-termi
source: RDA-term @sv
created: 2016-12-02
modified: 2025-07-05
alternative label: lithographer @en
alternative label: litografi (toimija)
alternative label: litograf (aktör) @sv
broader: kuvalaatan valmistaja
definition: Toimija, joka on vastuussa manifestaation valmistamisesta valmistamalla litografiassa käytetyn kivilaatan tai muun painolaatan. (RDA Registry)
definition: Aktör som svarar för tillverkning av en manifestation, genom att tillverka en stenplatta eller någon annan tryckplåt som används i litografi. @sv
in scheme: Metatietosanasto
preferred label: lithographer agent @en
preferred label: litograf @sv
scope note: Litografi tarkoittaa myös graafikkoa, joka tekee piirroksen suoraan painamiseen käytettävälle pinnalle. (RDA Registry)
scope note: Avser också grafiker som gör en teckning direkt på en yta som används för tryckning. @sv

valaja
type: Concept
source: RDA-termi
source: RDA-term @sv
created: 2016-12-02
modified: 2025-08-23
alternative label: caster @en
alternative label: valaja (toimija)
alternative label: gjutare (aktör) @sv
broader: aineiston tekijä
definition: Toimija, joka on vastuussa manifestaation valmistamisesta muovaamalla sulatettua tai nestemäistä ainetta muotin avulla. (RDA Registry)
definition: Aktör som svarar för tillverkningen av en manifestation, genom att forma smält eller flytande ämne med hjälp av en form. @sv
in scheme: Metatietosanasto
preferred label: caster agent @en
preferred label: gjutare @sv

etsaaja
type: Concept
source: RDA-termi
source: RDA-term @sv
created: 2016-12-02
modified: 2025-06-11
alternative label: etcher @en
alternative label: etsaaja (toimija)
broader: kuvalaatan valmistaja
definition: Toimija, joka on vastuussa manifestaation valmistamisesta etsaamalla metallia, lasia tai muuta pintaa hapon tai muun syövyttävän aineen avulla. (RDA Registry)
definition: Aktör som svarar för tillverkningen av en manifestation genom att etsa metall, glas eller någon annan yta med hjälp av syra eller något annat frätande ämne. @sv
in scheme: Metatietosanasto
preferred label: etcher agent @en
preferred label: etsare @sv

pistekirjoituksen tekijä
type: Concept
source: RDA-termi
source: RDA-term @sv
created: 2016-12-02
modified: 2025-08-16
alternative label: braille embosser @en
alternative label: braillekirjoituksen valmistaja
alternative label: pistekirjoituksen tekijä (toimija)
alternative label: pistekirjoituksen valmistaja
alternative label: brailleskriftspräglare @sv
alternative label: punktskriftspräglare (aktör) @sv
alternative label: punktskriftstillverkare @sv
broader: valmistaja
definition: Toimijaan, joka on vastuussa manifestaation valmistamisesta tuottamalla pistekirjoitusmerkkejä piirtimen, erityistulostimen tai muun laitteen avulla. (RDA Registry)
definition: Aktör som svarar för tillverkningen av en manifestation, genom att producera punktskriftstecken med hjälp av en penna, en speciell präglingsskrivare eller någon annan apparat. @sv
in scheme: Metatietosanasto
preferred label: braille embosser agent @en
preferred label: punktskriftspräglare @sv

lähetyksestä vastaava toimija
type: Concept
source: RDA-termi
source: RDA-term @sv
created: 2016-12-02
modified: 2025-07-05
alternative label: broadcaster @en
alternative label: lähetyksestä vastaava
alternative label: sändningsansvarig @sv
broader: kustantaja
definition: Toimija, joka on vastuussa manifestaation lähettämisestä yleisölle radiossa, televisiossa, suoratoistolähetyksenä tai muuna lähetysmediana. (RDA Registry)
definition: Aktör som svarar för sändning av en manifestation för en publik i radio, television, som direktsändning eller i något annat sändningsmedium. @sv
in scheme: Metatietosanasto
preferred label: broadcaster agent @en
preferred label: sändningsansvarig aktör @sv

graafinen suunnittelija
type: Concept
source: RDA-termi
source: RDA-term @sv
created: 2016-12-02
modified: 2025-06-11
alternative label: book designer @en
alternative label: graafinen suunnittelija (toimija)
alternative label: bokformgivare @sv
alternative label: grafisk formgivare (aktör) @sv
broader: aineiston tekijä
definition: Toimija, joka on vastuussa manifestaation valmistamisesta vastaamalla kirjan graafisesta suunnittelusta, taitosta, materiaalien valinnasta ja käytettävistä valmistusmenetelmistä. (RDA Registry)
definition: Aktör som svarar för tillverkningen av en manifestation, genom att ansvara för grafisk formgivning, layout, val av material och tillverkningsmetoder för en bok. @sv
in scheme: Metatietosanasto
preferred label: book designer agent @en
preferred label: grafisk formgivare @sv

kollotypian valmistaja
type: Concept
source: RDA-termi
source: RDA-term @sv
created: 2016-12-02
modified: 2025-07-03
alternative label: collotyper @en
alternative label: collotypist agent @en
alternative label: kollotypian valmistaja (toimija)
alternative label: framställare av ljustryck (aktör) @sv
broader: painolaatan valmistaja
definition: Toimija, joka on vastuussa manifestaation valmistamisesta tekemällä vedoksia suoraan kovettuneelta gelatiinifilmiltä tai muulta materiaalilta, jossa on mustetta imeviä ja hylkiviä pintoja. (RDA Registry)
definition: Aktör som svarar för tillverkning av en manifestation, genom att göra fotografiska avtryck direkt från härdad gelatinfilm eller annat material med bläckmottagande och bläckavvisande ytor. @sv
in scheme: Metatietosanasto
preferred label: collotyper agent @en
preferred label: framställare av ljustryck @sv

painaja
type: Concept
source: RDA-termi
source: RDA-term @sv
created: 2016-12-02
modified: 2025-08-15
alternative label: printer @en
alternative label: kirjanpainaja
alternative label: kirjanpainaja (suhde)
alternative label: painaja (toimija)
alternative label: boktryckare @sv
alternative label: boktryckare (relation) @sv
alternative label: tryckare (aktör) @sv
broader: valmistaja
definition: Toimija, joka osallistuu painetun tekstin, nuottiaineiston tai muun manifestaation valmistamiseen painolaatalta tai -levyltä. (RDA Registry)
definition: Aktör som deltar i tillverkningen av tryckt text, notmaterial eller någon annan manifestation, med tryckplåt eller dylikt. @sv
in scheme: Metatietosanasto
preferred label: printer agent @en
preferred label: tryckare @sv
scope note: Sisältää kirjan, sanomalehden, aikakauslehden, julisteen tai partituurin valmistamisen. (RDA Registry)
scope note: Omfattar tillverkning av böcker, dagstidningar, tidskrifter, planscher eller partitur. @sv

elokuvan jakelija
type: Concept
source: RDA-termi
source: RDA-term @sv
created: 2016-12-02
modified: 2025-05-27
alternative label: film distributor @en
alternative label: elokuvan jakelija (toimija)
alternative label: filmdistributör (aktör) @sv
broader: jakelija
definition: Toimija, joka on vastuussa elokuvan tms. manifestaation jakamisesta elokuvateattereille tai muille jakelukanaville. (RDA Registry)
definition: Aktör som svarar för distributionen av en film eller annan dylik manifestation till biografer eller andra distributionskanaler. @sv
in scheme: Metatietosanasto
preferred label: film distributor agent @en
preferred label: filmdistributör @sv

omistuskirjoituksen kirjoittaja
type: Concept
source: RDA-termi
source: RDA-term @sv
created: 2016-12-14
modified: 2025-04-05
alternative label: dedikationsförfattare (i exemplar) @sv
broader: muokkaaja
definition: Henkilö, joka kirjoittaa kappaleeseen omistuskirjoituksen tai merkinnön lahjoituksesta. (RDA Registry)
definition: Person som i ett exemplar skriver in en dedikation eller gåvoanteckning. @sv
in scheme: Metatietosanasto
preferred label: inscriber @en
preferred label: dedikationsskrift av @sv

lisähuomautusten kirjoittaja
type: Concept
source: RDA-termi
source: RDA-term @sv
created: 2016-12-14
modified: 2025-07-05
alternative label: huomautuksen kirjoittaja
alternative label: huomautuksen tekijä
alternative label: huomautusten kirjoittaja
alternative label: huomautusten tekijä
preferred label: annotator @en
alternative label: författare till anmärkning @sv
broader: muokkaaja
definition: Henkilö, joka kirjoittaa käsin lisähuomautuksia tai muita selityksiä kappaleeseen. (RDA Registry)
definition: Person som skriver tilläggsanmärkningar eller andra förklaringar för hand i ett exemplar. @sv
in scheme: Metatietosanasto
preferred label: författare till annotation @sv

kappaleen entisöijä
type: Concept
source: RDA-termi
source: RDA-term @sv
created: 2016-12-14
modified: 2026-03-10
alternative label: restorationist (item) @en
alternative label: entisöijä (kappale)
alternative label: kappaleen entisöijä (toimija)
alternative label: konservator (aktör) av exemplar @sv
alternative label: konservator (exemplar) @sv
alternative label: restauratör av exemplar @sv
broader: muokkaaja
definition: Toimija, joka vastaa teknisistä, toimituksellisista ja tiedollisista toimenpiteistä, joiden tarkoitus on palauttaa huonokuntoinen kappale mahdollisimman lähelle sen alkuperäistä kuntoa. (RDA Registry)
definition: Aktör som svarar för tekniska, redaktionella och kunskapsmässiga åtgärder, vilkas syfte är att återställa ett exemplar i dåligt skick så nära som möjligt dess ursprungliga skick. @sv
in scheme: Metatietosanasto
preferred label: restorationist agent of item @en
preferred label: konservator av exemplar @sv

omistuksen tekijä
type: Concept
source: RDA-termi
source: RDA-term @sv
created: 2016-12-14
modified: 2025-04-05
alternative label: dedicator @en
alternative label: omistuksen tekijä (toimija)
alternative label: teoksen omistanut
alternative label: teoksen omistuskirjoituksen tekijä
alternative label: dedikationsförfattare (aktör) @sv
alternative label: författare till dedikation @sv
alternative label: verket dedicerat av @sv
broader: teoksen tekijä
definition: Toimija, joka nimittää teoksen sitä innoittaineen tai tukeneen toimijan tunnustukseksi. (RDA Registry)
definition: Aktör som tillägnar ett verk till en aktör som utgjort inspiration eller stöd. @sv
in scheme: Metatietosanasto
preferred label: dedicator agent @en
preferred label: dedikationsförfattare @sv

entisöijä (ekspressio)
type: Concept
source: RDA-termi
source: RDA-term @sv
created: 2016-12-14
modified: 2026-03-10
alternative label: restorationist (expression) @en
alternative label: ekspression entisöijä
alternative label: ekspression entisöijä (toimija)
alternative label: version entisöijä
alternative label: konservator av uttryck @sv
alternative label: konservator av uttryck (aktör) @sv
alternative label: konservator av version @sv
alternative label: restauratör av version @sv
broader: tarkistaja
definition: Toimija, joka osallistuu ekspression tekemiseen restauroimalla tai yhdistelemällä aikaisempia ekspressioita, jotka voivat olla vaurioituneita tai fragmentaarisia, uuden ekspression luomiseksi. (RDA Registry)
definition: Aktör som deltar i utförandet av ett uttryck, genom att restaurera eller förena tidigare uttryck som kan vara skadade eller fragmentariska, för att skapa ett nytt uttryck. @sv
in scheme: Metatietosanasto
preferred label: restorationist agent of expression @en
preferred label: konservator (uttryck) @sv

kokousten raportoija
type: Concept
source: RDA-termi
source: RDA-term @sv
created: 2016-12-14
modified: 2025-07-03
alternative label: rapporteur @en
alternative label: kokouksen raportoija
alternative label: kokousten raportoija (toimija)
alternative label: mötesrapportör (aktör) @sv
broader: kirjoittaja
definition: Toimija, joka on kirjoittaja, joka on saanut organisaatiolta tehtäväkseen raportoida kokousmenettelyistä. (RDA Registry)
definition: Aktör som är en författare, som fått i uppgift av en organisation att rapportera om mötesförfaranden. @sv
in scheme: Metatietosanasto
preferred label: rapporteur agent @en
preferred label: mötesrapportör @sv
scope note: Ei kata pöytäkirjan laatimiseen rajoittuvaa vastuuta. (RDA Registry)
scope note: Omfattar inte ansvar som är begränsat till protokollföring. @sv

kappaleen omistuksen kohde
type: Concept
source: RDA-termi
source: RDA-term @sv
created: 2016-12-14
modified: 2025-07-03
alternative label: dedicatee (item) @en
alternative label: kappale omistettu
alternative label: kappaleen omistuksen kohde (toimija)
alternative label: dedikationsmottagare @sv
alternative label: exemplaret dedicerat till (aktör) @sv
broader: kappaleeseen liittyvä toimija
definition: Toimija, jolle kappale on omistettu. (RDA Registry)
definition: Aktör som ett exemplar är tillägnat. @sv
in scheme: Metatietosanasto
preferred label: dedicatee agent of item @en
preferred label: exemplaret dedicerat till @sv

illuminoinnin tekijä
type: Concept
source: RDA-termi
source: RDA-term @sv
created: 2016-12-14
modified: 2025-06-14
preferred label: illuminator @sv
alternative label: illuminoinnin tekijä (toimija)
alternative label: illuminatör @sv
broader: muokkaaja
definition: Toimija, joka koristelee yksittäisen kappaleen käyttäen jalometalleja tai värejä, usein yksityiskohtaisissa kuvioissa tai motiiveissa. (RDA Registry)
definition: Aktör som dekorerar ett enskilt exemplar genom att använda ädelmetaller eller färger, ofta i detaljerade mönster eller motiv. @sv
in scheme: Metatietosanasto
preferred label: illuminator agent @en

lahjoittaja
type: Concept
source: RDA-termi
source: RDA-term @sv
created: 2016-12-14
modified: 2025-07-04
alternative label: donor @en
alternative label: lahjoittaja (toimija)
alternative label: donator (aktör) @sv
broader: aiempi omistaja
definition: Kappaleen aiempi omistaja, joka lahjoittaa kappaleen toiselle omistajalle. (RDA Registry)
definition: Tidigare ägare till ett exemplar, som donerar ett exemplar till en annan ägare. @sv
in scheme: Metatietosanasto
preferred label: donor agent @en
preferred label: donator @sv

sitoja
type: Concept
source: RDA-termi
source: RDA-term @sv
created: 2016-12-14
modified: 2025-08-19
alternative label: binder @en
alternative label: sitoja (toimija)
alternative label: bokbindare (aktör) @sv
broader: muokkaaja
definition: Toimija, joka sitoo kappaleen. (RDA Registry)
definition: Aktör som binder ett exemplar. @sv
in scheme: Metatietosanasto
preferred label: binder agent @en
preferred label: bokbindare @sv

myyjä
type: Concept
source: RDA-termi
source: RDA-term @sv
created: 2016-12-14
modified: 2025-08-15
alternative label: seller @en
alternative label: myyjä (suhde)
alternative label: myyjä (toimija)
alternative label: försäljare @sv
alternative label: säljare (aktör) @sv
alternative label: säljare (relation) @sv
broader: aiempi omistaja
definition: Kappaleen aiempi omistaja, joka myy kappaleen toiselle omistajalle. (RDA Registry)
definition: Tidigare ägare till ett exemplar, som säljer ett exemplar till ett en annan ägare. @sv
in scheme: Metatietosanasto
preferred label: seller agent @en
preferred label: säljare @sv

nimikirjoituksen kirjoittaja
type: Concept
source: RDA-termi
source: RDA-term @sv
created: 2016-12-14
modified: 2025-08-15
broader: muokkaaja
definition: Henkilö, jonka käsin kirjoitettu nimikirjoitus on kappaleessa. (RDA Registry)
definition: Person vars handskrivna signatur finns i ett exemplar. @sv
in scheme: Metatietosanasto
preferred label: autographer @en
preferred label: signatur @sv

kirjataiteilija
type: Concept
source: RDA-termi
source: RDA-term @sv
created: 2016-12-14
modified: 2026-03-24
alternative label: book artist @en
alternative label: kirjataiteilija (toimija)
alternative label: bokkonstnär (aktör) @sv
broader: taiteilija
definition: Toimija, joka on taiteilija, joka on vastuussa kirjan muodon hyödyntämisestä tai sen fyysisen rakenteen muuttamisesta. (RDA Registry)
definition: Aktör som är en konstnär, som svarar för utnyttjande av bokens form eller ändring av dess fysiska struktur. @sv
in scheme: Metatietosanasto
preferred label: book artist agent @en
preferred label: bokkonstnär @sv

yhdistymisestä muodostunut yhteisö
type: Concept
source: RDA-termi
source: RDA-term @sv
created: 2016-12-24
modified: 2025-08-23
alternative label: yhdistymisestä muodostunut
alternative label: bildats genom sammanslagning @sv
broader: yhteisön seuraaja
definition: Kahden tai useamman yhteisön yhdistymisestä muodostunut yhteisö. (RDA Registry)
definition: Institution som bildats ur en sammanslagning av två eller flera institutioner. @sv
in scheme: Metatietosanasto
preferred label: product of merger @en
preferred label: institution bildad genom sammanslagning @sv

julkaistu myös CD-ROM-levynä
type: Concept
source: Kansallinen RDA-termi
source: Nationell RDA-term @sv
created: 2017-01-05
modified: 2024-10-10
alternative label: även utkommit som CD-ROM-skiva @sv
broader: muu julkaisumuoto
in scheme: Metatietosanasto
preferred label: utgiven även som CD-ROM-skiva @sv

julkaistu myös LP-levynä
type: Concept
source: Kansallinen RDA-termi
source: Nationell RDA-term @sv
created: 2017-01-05
modified: 2024-10-10
broader: muu julkaisumuoto
in scheme: Metatietosanasto
preferred label: utgiven även som LP-skiva @sv

julkaistu myös e-kirjana
type: Concept
source: Kansallinen RDA-termi
source: Nationell RDA-term @sv
created: 2017-01-05
modified: 2024-10-10
broader: muu julkaisumuoto
definition: E-kirjalla tarkoitetaan painetun kirjan kaltaista verkossa ilmestynyttä julkaisua.
definition: Med e-bok avses en publikation utgiven på webben, som motsvarar en tryckt bok. @sv
in scheme: Metatietosanasto
preferred label: utgiven även som e-bok @sv
scope note: Voidaan käyttää vain silloin kun molempien manifestaatioiden mediatyyppi ja tallennetyyppi ovat samoja. Esimerkiksi verkkoäänikirjassa, kun olemassa myös e-kirja: julkaistu myös e-kirjana.
scope note: Kan användas endast då medietyp och bärartyp är samma för bägge manifestationer. Till exempel för en ljudbok på webben, då det också finns en e-bok: utgiven även som e-bok. @sv

julkaistu myös äänikirjana
type: Concept
source: Kansallinen RDA-termi
source: Nationell RDA-term @sv
created: 2017-01-05
modified: 2024-10-10
broader: muu julkaisumuoto
in scheme: Metatietosanasto
preferred label: utgiven även som ljudbok @sv

julkaistu myös CD-äänilevynä.
type: Concept
source: Kansallinen RDA-termi
source: Nationell RDA-term @sv
created: 2017-01-05
modified: 2024-10-10
alternative label: även utkommit som CD-ljudskiva. @sv
broader: muu julkaisumuoto
in scheme: Metatietosanasto
preferred label: utgiven även som CD-ljudskiva. @sv

julkaistu myös digitoituna
type: Concept
source: Kansallinen RDA-termi
source: Nationell RDA-term @sv
created: 2017-01-05
modified: 2024-10-10
broader: muu julkaisumuoto
in scheme: Metatietosanasto
preferred label: utgiven även som digitaliserad @sv

julkaistu vain verkkoaineistona vuodesta...
type: Concept
source: Kansallinen RDA-termi
source: Nationell RDA-term @sv
created: 2017-01-05
modified: 2024-10-10
broader: muu julkaisumuoto
example: Julkaistu vain verkkoaineistona vuodesta 2004-
example: Utgiven enbart som onlineresurs från år 2004- @sv
in scheme: Metatietosanasto
preferred label: utgiven enbart som onlineresurs från år... @sv
scope note: Esimerkiksi lehden ilmestyminen siirtyy verkkoon.
scope note: Till exempel utgivningen av en tidning flyttas till webben. @sv

julkaistu myös vinyylisinglelevynä
type: Concept
source: Kansallinen RDA-termi
source: Nationell RDA-term @sv
created: 2017-01-05
modified: 2024-10-10
broader: muu julkaisumuoto
in scheme: Metatietosanasto
preferred label: utgiven även som vinylsingelskiva @sv

Yhteenveto-osa julkaistu myös verkkoaineistona.
type: Concept
source: Kansallinen RDA-termi
source: Nationell RDA-term @sv
created: 2017-01-05
modified: 2024-10-10
broader: muu julkaisumuoto
in scheme: Metatietosanasto
preferred label: Sammanfattningsdelen utgiven även som onlineresurs. @sv

julkaistu myös tarvepainatteena
type: Concept
source: Kansallinen RDA-termi
source: Nationell RDA-term @sv
created: 2017-01-05
modified: 2024-10-10
broader: muu julkaisumuoto
in scheme: Metatietosanasto
preferred label: utgiven även som beställtryck @sv

julkaistu myös C-kasettina.
type: Concept
source: Kansallinen RDA-termi
source: Nationell RDA-term @sv
created: 2017-01-05
modified: 2024-10-10
broader: muu julkaisumuoto
in scheme: Metatietosanasto
preferred label: utgiven även som kassettband @sv

julkaistu myös painettuna
type: Concept
source: Kansallinen RDA-termi
source: Nationell RDA-term @sv
created: 2017-01-05
modified: 2024-10-10
broader: muu julkaisumuoto
in scheme: Metatietosanasto
preferred label: utgiven även som tryckt @sv

julkaistu myös e-lehtenä
type: Concept
source: Kansallinen RDA-termi
source: Nationell RDA-term @sv
created: 2017-01-05
modified: 2024-10-10
broader: muu julkaisumuoto
definition: E-lehdellä tarkoitetaan painetun sanoma- tai aikakauslehden kaltaista verkossa ilmestyvää julkaisua.
definition: Med e-tidning avses en publikation utgiven på webben, som motsvarar en tryckt tidning eller tidskrift. @sv
in scheme: Metatietosanasto
preferred label: utigven även som e-tidning @sv
scope note: Voidaan käyttää vain silloin kun molempien manifestaatioiden mediatyyppi ja tallennetyyppi ovat samoja. Esimerkiksi verkkoäänilehdessä, kun olemassa myös verkkolehti: julkaistu myös e-lehtenä.
scope note: Kan användas endast då medietyp och bärartyp är samma för bägge manifestationer. Till exempel för en ljudtidning på webben, då det också finns en e-tidning: utgiven även som e-tidning. @sv

linkki digitoituun aineistoon
type: Concept
source: Kansallinen RDA-termi
source: Nationell RDA-term @sv
created: 2017-01-05
modified: 2024-10-10
broader: muu julkaisumuoto
in scheme: Metatietosanasto
preferred label: länk till digitaliserat material @sv

julkaistu myös MD-levynä
type: Concept
source: Kansallinen RDA-termi
source: Nationell RDA-term @sv
created: 2017-01-05
modified: 2024-10-10
broader: muu julkaisumuoto
in scheme: Metatietosanasto
preferred label: utgiven även som MD-skiva @sv

julkaistu joitakin sarjan osia vain verkkoaineistona
type: Concept
source: Kansallinen RDA-termi
source: Nationell RDA-term @sv
created: 2017-01-05
modified: 2024-10-10
broader: muu julkaisumuoto
in scheme: Metatietosanasto
preferred label: delar i serien utgivna enbart som onlineresurser @sv

linkki verkkoaineistoon
type: Concept
source: Kansallinen RDA-termi
source: Nationell RDA-term @sv
created: 2017-01-05
modified: 2024-10-10
broader: muu julkaisumuoto
in scheme: Metatietosanasto
preferred label: länk till onlineresurs @sv

opettaja
type: Concept
source: RDA-termi
source: RDA-term @sv
created: 2017-01-13
modified: 2025-08-15
alternative label: opettaja (henkilöön liittyvä henkilö)
alternative label: lärare (person relaterad till person) @sv
broader: henkilöön liittyvä henkilö
definition: Henkilö, joka opettaa toista henkilöä. (RDA Registry)
definition: Person som undervisar en annan person. @sv
in scheme: Metatietosanasto
preferred label: teacher @en
preferred label: lärare @sv

teoksen sponsori
type: Concept
source: RDA-termi
source: RDA-term @sv
created: 2016-01-08
modified: 2025-08-23
alternative label: sponsoring body @en
alternative label: sponsori
alternative label: sponsori (suhde)
alternative label: teoksen sponsori (toimija)
alternative label: sponsor @sv
alternative label: sponsor (aktör) av verk @sv
alternative label: sponsor (relation) @sv
broader: teokseen liittyvä toimija
definition: Toimija, joka sponsoroi teosta. (RDA Registry)
definition: Aktör som sponsrar ett verk. @sv
in scheme: Metatietosanasto
preferred label: sponsoring agent of work @en
preferred label: sponsor av verk @sv
scope note: Kattaa tutkimuksen rahoituksen ja teoksen perustana olevan tapahtuman sponsoroinnin. (RDA Registry)
scope note: Täcker finansiering av forskning och sponsring av evenemang som är grund för ett verk. @sv

musiikkikustantamo
type: Concept
source: Kansallinen RDA-termi
source: Nationell RDA-term @sv
created: 2017-02-17
modified: 2024-05-24
broader: kustantamo
in scheme: Metatietosanasto
preferred label: musikförlag @sv

uudelleenmiksaaja
type: Concept
source: RDA-termi
source: RDA-term @sv
created: 2017-02-24
modified: 2025-11-25
alternative label: remix artist @en
alternative label: remiksaaja (toimija)
alternative label: uudelleenmiksaaja (toimija)
alternative label: äänitaiteilija
alternative label: ljudkonstnär @sv
alternative label: remixer (aktör) @sv
broader: teoksen tekijä
definition: Toimija, joka on vastuussa ääniteoksen luomisesta manipuloimalla, yhdistelemällä, sekoittamalla ja uudelleen tuottamalla aiemmin äänitettyjä ääniä. (RDA Registry)
definition: Aktör som svarar för skapandet av ett ljudverk, genom att manipulera, kombinera, blanda och återproducera tidigare inspelade ljud. @sv
in scheme: Metatietosanasto
preferred label: remix artist agent @en
preferred label: remixer @sv
scope note: Ei kata uudelleenmiksaamista, joka ei oleellisesti muuta alkuperäisen teoksen luonnetta ja sisältöä eikä aiemmin äänitettyjen musiikkikappaleiden yhdistämistä yhdeksi musiikkikappaleeksi. (RDA Registry)
scope note: Gäller inte remixande som inte väsentligen ändrar det ursprungliga verkets karaktär och innehåll, och inte sammanfogande av tidigare inspelade musikstycken till ett musikstycke. @sv

äänitaiteilija (ekspressio)
type: Concept
source: Kansallinen RDA-termi
source: Nationell RDA-term @sv
created: 2017-02-24
modified: 2025-01-08
broader: esitykseen osallinen henkilö
definition: Liittää ekspression henkilöön, joka osallistuu ekspression tekemiseen, tekemällä taidetta äänestä, käyttäen ääntä sekä sen mediumina että aiheena.
definition: Sammankopplar uttryck med en person som deltar i utförandet av ett uttryck genom att skapa konst av ljud och använda ljudet både som medium och som ämne. @sv
in scheme: Metatietosanasto
preferred label: ljudkonstnär (uttryck) @sv

kalligrafi
type: Concept
source: RDA-termi
source: RDA-term @sv
created: 2017-02-24
modified: 2025-07-02
alternative label: calligrapher @en
alternative label: kalligrafi (toimija)
alternative label: kalligraf (aktör) @sv
broader: taiteilija
definition: Toimija, joka on taiteilija, joka on vastuussa kalligrafiasta, jossa pääpaino on käsin kirjoittamisen tai graafisen taiteen esteettisissä arvoissa, riippumatta siitä, onko sama toimija myös vastuussa kirjoitetusta tekstistä. (RDA Registry)
definition: Aktör som är en konstnär som svarar för kalligrafi, i vilken huvudvikten ligger vid de estetiska värdena i handskrift eller grafisk konst, oberoende av om samma aktör också svarar för den skrivna texten. @sv
in scheme: Metatietosanasto
preferred label: calligrapher agent @en
preferred label: kalligraf @sv

selostaja
type: Concept
source: Kansallinen RDA-termi
source: Nationell RDA-term @sv
created: 2016-01-08
modified: 2024-12-18
alternative label: selostaja (suhde)
alternative label: referent (relation) @sv
broader: esittäjä
definition: Esittäjä, joka osallistuu ekspression tekemiseen selostamalla, esim. urheiluselostaja.
definition: Framförande person som deltar i utförandet av ett uttryck genom att referera, t.ex. sportkommentator. @sv
in scheme: Metatietosanasto
preferred label: referent @sv

dramaturgi (ekspressio)
type: Concept
source: Kansallinen RDA-termi
source: Nationell RDA-term @sv
created: 2017-03-01
modified: 2025-01-08
broader: esitykseen osallinen henkilö
definition: Henkilö, joka osallistuu ekspression tekemiseen sovittamalla draamallisen teoksen esitykseksi.
definition: Person som deltar i utförandet av ett uttryck genom att bearbeta ett dramatiskt verk till en föreställning. @sv
in scheme: Metatietosanasto
preferred label: dramaturg (uttryck) @sv

kuvatoimittaja
type: Concept
source: Kansallinen RDA-termi
source: Nationell RDA-term @sv
created: 2017-03-01
modified: 2025-01-08
alternative label: kuvatoimittaja (suhde)
alternative label: bildredaktör (relation) @sv
broader: yhdistymään osallinen henkilö
definition: Lehtien toimituksissa tai kustantamoissa työskentelevä kuvituksesta ja kuvien hankinnasta vastaava toimittaja; kuvatoimistossa työskentelevä kuvien hankkija. (Lähde: Kielitoimiston sanakirja).
definition: Redaktör som arbetar vid tidningars redaktioner eller förlag och ansvarar för illustrationer eller förvärv av bilder; person som arbetar vid bildbyrå och ansvarar för förvärv av bilder. @sv
in scheme: Metatietosanasto
preferred label: bildredaktör @sv

kielentarkastaja
type: Concept
source: Kansallinen RDA-termi
source: Nationell RDA-term @sv
created: 2017-03-01
modified: 2025-01-08
broader: teoksen version tekijä
in scheme: Metatietosanasto
preferred label: språkgranskare @sv

toimeksiantaja
type: Concept
source: RDA-termi
source: RDA-term @sv
created: 2017-07-06
modified: 2025-08-23
alternative label: commissioning body @en
alternative label: teettäjä
alternative label: tilaaja
alternative label: toimeksiantaja (toimija)
alternative label: beställare @sv
alternative label: uppdragsgivare (aktör) @sv
broader: teokseen liittyvä toimija
definition: Toimija, joka on vastuussa teoksen teettämisestä. (RDA Registry)
definition: Aktör som svarar för beställandet av ett verk. @sv
in scheme: Metatietosanasto
preferred label: commissioning agent @en
preferred label: uppdragsgivare @sv

sekakuoro
type: Concept
source: Kansallinen RDA-termi
source: Nationell RDA-term @sv
created: 2017-10-06
modified: 2024-05-24
broader: kuoro
definition: Kuoron esityskokoonpano, jossa on sopraano-, altto-, tenori- ja bassoääniä tai ainakin sekä nais- että miesääniä.
definition: Körsammansättning som utgörs av stämmorna sopran, alt, tenor och bas, eller åtminstone både kvinno- och mansstämmor. @sv
in scheme: Metatietosanasto
preferred label: blandad kör @sv

puhallinkvintetti
type: Concept
source: Kansallinen RDA-termi
source: Nationell RDA-term @sv
created: 2017-11-10
modified: 2024-05-24
broader: soitinyhtye
definition: Esityskokoonpano: huilu, oboe, klarinetti, käyrätorvi, fagotti.
definition: Ensemble bestående av flöjt, oboe, klarinett, valthorn och fagott. @sv
in scheme: Metatietosanasto
preferred label: blåskvintett @sv

jousikvartetti
type: Concept
source: Kansallinen RDA-termi
source: Nationell RDA-term @sv
created: 2017-11-10
modified: 2024-05-24
broader: soitinyhtye
definition: Esityskokoonpano: 2 viulua, alttoviulu, sello.
definition: Ensemble bestående av 2 violiner, viola och violoncell. @sv
in scheme: Metatietosanasto
preferred label: stråkkvartett @sv

pianokvartetti
type: Concept
source: Kansallinen RDA-termi
source: Nationell RDA-term @sv
created: 2017-11-10
modified: 2024-05-24
broader: soitinyhtye
definition: Esityskokoonpano: piano, viulu, alttoviulu, sello.
definition: Ensemble bestående av piano, violin, viola och violoncell. @sv
in scheme: Metatietosanasto
preferred label: pianokvartett @sv

kamariorkesteri
type: Concept
source: Kansallinen RDA-termi
source: Nationell RDA-term @sv
created: 2017-11-10
modified: 2024-05-24
broader: orkesteri
definition: Esityskokoonpano, joka koostuu vähintään kahden soitinperheen jäsenistä ja jossa on korkeintaan 25 soittajaa.
definition: Ensemble som består av instrument från minst två instrumentfamiljer och i vilken det finns högst 25 instrumentalister. @sv
in scheme: Metatietosanasto
preferred label: kammarorkester @sv

pianotrio
type: Concept
source: Kansallinen RDA-termi
source: Nationell RDA-term @sv
created: 2017-11-10
modified: 2024-05-24
broader: soitinyhtye
definition: Esityskokoonpano: piano, viulu, sello.
definition: Ensemble bestående av piano, violin och violoncell. @sv
in scheme: Metatietosanasto

jousikvintetti
type: Concept
source: Kansallinen RDA-termi
source: Nationell RDA-term @sv
created: 2017-11-10
modified: 2024-05-24
broader: soitinyhtye
definition: Esityskokoonpano: 2 viulu, 2 alttoviulu, sello.
definition: Ensemble bestående av 2 violiner, 2 violor och violoncell. @sv
in scheme: Metatietosanasto
preferred label: stråkkvintett @sv

pianokvintetti
type: Concept
source: Kansallinen RDA-termi
source: Nationell RDA-term @sv
created: 2017-11-10
modified: 2024-05-24
broader: soitinyhtye
definition: Esityskokoonpano: piano, 2 viulua, alttoviulu, sello.
definition: Ensemble bestående av piano, 2 violiner, viola och violoncell. @sv
in scheme: Metatietosanasto
preferred label: pianokvintett @sv

jousitrio
type: Concept
source: Kansallinen RDA-termi
source: Nationell RDA-term @sv
created: 2017-11-10
modified: 2024-05-24
broader: soitinyhtye
definition: Esityskokoonpano: viulu, alttoviulu, sello.
definition: Ensemble bestående av violin, viola och violoncell. @sv
in scheme: Metatietosanasto
preferred label: stråktrio @sv

jousiorkesteri
type: Concept
source: Kansallinen RDA-termi
source: Nationell RDA-term @sv
created: 2017-11-10
modified: 2024-05-24
broader: orkesteri
definition: Länsimaisen taidemusiikin esittämiseen alun perin tarkoitettu yli yhdeksän hengen esityskokoonpano, jonka soittimisto koostuu jousisoittimista (voi sisältää continuon ja muutamia lyömäsoittimia). 1900-luvulta alkaen kokoonpanoa on käytetty runsaasti myös populaarimusiikissa.
definition: Ensemble bestående av fler än nio personer, ursprungligen avsedd för framförande av västerländsk konstmusik och vars instrumentuppsättning består av stråkinstrument (kan innehålla continuo och några slaginstrument). Fr.o.m. 1900-talet har besättningen använts rikligt också i populärmusik. @sv
in scheme: Metatietosanasto
preferred label: stråkorkester @sv
scope note: Jos orkesterissa on mukana myös muihin soitinryhmiin kuuluvia soittimia, mutta kyseessä ei ole täysimittainen sinfoniaorkesteri, katso kamariorkesteri.
scope note: Om det i orkestern också är med instrument som hör till andra instrumentgrupper, men det inte är frågan om en fullskalig sinfoniorkester, se kammarorkester. @sv

puupuhallinkvartetti
type: Concept
source: Kansallinen RDA-termi
source: Nationell RDA-term @sv
created: 2017-11-10
modified: 2024-05-24
broader: soitinyhtye
definition: Esityskokoonpano: huilu, oboe, klarinetti, fagotti.
definition: Ensemble bestående av flöjt, oboe, klarinett och fagott. @sv
in scheme: Metatietosanasto
preferred label: träblåskvartett @sv

lauluyhtye
type: Concept
source: Kansallinen RDA-termi
source: Nationell RDA-term @sv
created: 2017-11-10
modified: 2024-05-24
alternative label: sånggrupp @sv
broader: yhtye
definition: 2-9 laulajan muodostaman esityskokoonpano. Suuremmasta kokoonpanosta katso kuoro.
definition: Ensemble bestående av 2-9 sångare. För större besättning se kör. @sv
in scheme: Metatietosanasto
preferred label: sångensemble @sv

naiskuoro
type: Concept
source: Kansallinen RDA-termi
source: Nationell RDA-term @sv
created: 2017-11-11
modified: 2024-05-24
broader: kuoro
definition: Esityskokoonpano, jossa on vain naisäänisiä laulajia (sopraanoja, mezzosopraanoja ja alttoja).
definition: Ensemble som består av endast kvinnliga sångstämmor (sopraner, mezzosopraner och altar). @sv
in scheme: Metatietosanasto
preferred label: damkör @sv

unisonokuoro
type: Concept
source: Kansallinen RDA-termi
source: Nationell RDA-term @sv
created: 2017-11-11
modified: 2024-05-24
broader: kuoro
definition: Kuoro, jonka kaikki jäsenet laulavat samaa stemmaa.
definition: Kör, i vilken alla medlemmar sjunger samma stämma. @sv
in scheme: Metatietosanasto
preferred label: unison kör @sv

nuorisokuoro
type: Concept
source: Kansallinen RDA-termi
source: Nationell RDA-term @sv
created: 2017-11-11
modified: 2024-05-24
broader: kuoro
definition: Kuoro, joka koostuu nuorista, mutta ei enää lapsi-ikäisistä laulajista.
definition: Kör som består av ungdomar. @sv
in scheme: Metatietosanasto
preferred label: ungdomskör @sv

mieskuoro
type: Concept
source: Kansallinen RDA-termi
source: Nationell RDA-term @sv
created: 2017-11-11
modified: 2024-05-24
broader: kuoro
definition: Kuoro, jossa on vain miesäänisiä laulajia (tenoreita, baritoneja ja bassoja).
definition: Kör som består av bara manliga sångstämmor (tenorer, barytoner och basar). @sv
in scheme: Metatietosanasto
preferred label: manskör @sv

lapsikuoro
type: Concept
source: Kansallinen RDA-termi
source: Nationell RDA-term @sv
created: 2017-11-11
modified: 2024-05-24
broader: kuoro
definition: Kuorokokoonpano, jossa on vain lapsiäänisiä laulajia (sopraanoja ja alttoja).
definition: Kör som består av bara barns sångstämmor (sopraner och altar). @sv
in scheme: Metatietosanasto
preferred label: barnkör @sv

julkaistu aiemmin erillisinä niteinä
type: Concept
source: Kansallinen RDA-termi
source: Nationell RDA-term @sv
created: 2018-02-20
modified: 2024-10-10
broader: muu julkaisumuoto
in scheme: Metatietosanasto
preferred label: tidigare utgiven i separata volymer @sv

suunnittelija
type: Concept
source: Kansallinen RDA-termi
source: Nationell RDA-term @sv
created: 2018-02-22
modified: 2025-05-27
alternative label: suunnittelija (suhde)
alternative label: planerare (relation) @sv
broader: designer
definition: Liittää teoksen henkilöön, joka on vastuussa kuvailun kohteena olevan teoksen suunnittelusta.
definition: Sammankopplar verk med en person som svarar för planeringen av verket som beskrivs. @sv
in scheme: Metatietosanasto
preferred label: planerare @sv
scope note: Teoksen tekijä.
scope note: Verkets skapare. @sv

muotoilija
type: Concept
source: Kansallinen RDA-termi
source: Nationell RDA-term @sv
created: 2018-02-22
modified: 2025-05-27
alternative label: muotoilija (suhde)
alternative label: designare @sv
alternative label: designer @sv
alternative label: formgivare (relation) @sv
alternative label: industriell formgivare @sv
broader: designer
definition: Liittää teoksen henkilöön, joka on vastuussa kuvailun kohteena olevan teoksen muotoilusta.
definition: Sammankopplar verk med en person som svarar för formgivningen av verket som är föremål för beskrivning. @sv
in scheme: Metatietosanasto
preferred label: formgivare @sv
scope note: Teoksen tekijä.
scope note: Verkets skapare. @sv

haastateltava (ekspressio)
type: Concept
source: RDA-termi
source: RDA-term @sv
created: 2016-01-08
modified: 2026-03-10
alternative label: interviewee (expression) @en
alternative label: ekspression haastateltava
alternative label: ekspression haastateltava (toimija)
alternative label: version haastateltava
alternative label: intervjuobjekt i uttryck @sv
alternative label: intervjuobjekt i uttryck (aktör) @sv
alternative label: intervjuobjekt i version @sv
broader: esitykseen osallinen toimija
definition: Toimija, joka osallistuu teoksen ekspression tekemiseen vastaamalla haastattelijalle, tavallisesti toimittajalle, mielipidetutkijalle tai jollekin muulle toimijalle, joka kerää tietoja. (RDA Registry)
definition: Aktör som deltar i utförandet av ett verks uttryck, genom att svara en intervjuare, vanligen en journalist, opinionsmätare eller någon annan aktör, som samlar information. @sv
in scheme: Metatietosanasto
preferred label: interviewee agent of expression @en
preferred label: intervjuobjekt (uttryck) @sv

liitteenä aineistossa
type: Concept
source: Kansallinen RDA-termi
source: Nationell RDA-term @sv
created: 2018-04-04
modified: 2024-10-10
broader: liitteenä aineistossa
in scheme: Metatietosanasto
preferred label: bilaga till @sv
scope note: RDA-kuvailussa käytettävä termi.
scope note: Termen används i RDA-beskrivning. @sv

painettu
type: Concept
source: Kansallinen RDA-termi
source: Nationell RDA-term @sv
created: 2018-04-04
modified: 2025-01-08
broader: muu julkaisumuoto
in scheme: Metatietosanasto
preferred label: tryckt @sv
scope note: RDA-kuvailussa käytettävä termi.
scope note: Termen används i RDA-beskrivning. @sv

digitoitu painetusta
type: Concept
source: Kansallinen RDA-termi
source: Nationell RDA-term @sv
created: 2018-04-04
modified: 2025-02-21
alternative label: digital reproduktion av tryck @sv
broader: jäljenne aineistosta
in scheme: Metatietosanasto
preferred label: digitalisering av tryck @sv
scope note: RDA-kuvailussa käytettävä termi.
scope note: Termen används i RDA-beskrivning. @sv

kappaleella kunnioitettu toimija
type: Concept
source: RDA-termi
source: RDA-term @sv
created: 2018-04-14
modified: 2025-04-10
alternative label: honoree of item @en
alternative label: honouree (item) @en
alternative label: kappaleella kunnioitettu
alternative label: exemplar tillägnat @sv
alternative label: festskriftsföremål @sv
broader: kappaleeseen liittyvä toimija
definition: Toimija, jota kappaleella kunnioitetaan. (RDA Registry)
definition: Aktör som är tillägnad ett exemplar. @sv
in scheme: Metatietosanasto
preferred label: honouree agent of item @en
preferred label: exemplar tillägnat aktören @sv

teoksella kunnioitettu toimija
type: Concept
source: RDA-termi
source: RDA-term @sv
created: 2018-04-14
modified: 2025-08-22
alternative label: honoree agent of work @en
alternative label: honouree @en
alternative label: kunnianosoituksen kohde
alternative label: teoksella kunnioitettu
alternative label: festskriftsföremål @sv
alternative label: verk tillägnat @sv
broader: teokseen liittyvä toimija
definition: Toimija, jonka kunniaksi teos on tehty. (RDA Registry)
definition: Aktör till vilkens ära ett verk har gjorts. @sv
in scheme: Metatietosanasto
preferred label: honouree agent of work @en
preferred label: verk tillägnat aktören @sv

puupuhallinyhtye
type: Concept
source: Kansallinen RDA-termi
source: Nationell RDA-term @sv
created: 2018-08-08
modified: 2024-05-24
alternative label: träblåsarensemble @sv
broader: soitinyhtye
definition: Puupuhaltimista koostuva yhtye.
definition: Ensemble bestående av träblåsinstrument. @sv
in scheme: Metatietosanasto
preferred label: träblåsensemble @sv

jousiyhtye
type: Concept
source: Kansallinen RDA-termi
source: Nationell RDA-term @sv
created: 2018-08-08
modified: 2024-05-24
broader: soitinyhtye
definition: Jousisoittimista koostuva yhtye.
definition: Ensemble bestående av stråkinstrument. @sv
in scheme: Metatietosanasto
preferred label: stråkensemble @sv

puhallinorkesteri
type: Concept
source: Kansallinen RDA-termi
source: Nationell RDA-term @sv
created: 2018-08-08
modified: 2024-05-24
broader: orkesteri
definition: Pääosin vaskipuhaltimista koostuva orkesteri.
definition: Orkester som i huvudsak består av bleckblåsinstrument. @sv
in scheme: Metatietosanasto
preferred label: blåsorkester @sv
scope note: Jos orkesteri koostuu pääosin puupuhaltimista, käytetään ensisijaisesti käsitettä kamariorkesteri.
scope note: Om orkestern i huvudsak består av träblåsinstrument används i första hand begreppet kammarorkester. @sv

vaskipuhallinyhtye
type: Concept
source: Kansallinen RDA-termi
source: Nationell RDA-term @sv
created: 2018-08-08
modified: 2024-05-24
broader: soitinyhtye
definition: Vaskipuhaltimista koostuva yhtye.
definition: Ensemble bestående av bleckblåsinstrument. @sv
in scheme: Metatietosanasto
preferred label: bleckblåsensemble @sv

puhallinyhtye
type: Concept
source: Kansallinen RDA-termi
source: Nationell RDA-term @sv
created: 2018-08-08
modified: 2024-05-24
alternative label: blåsarensemble @sv
broader: soitinyhtye
in scheme: Metatietosanasto
preferred label: blåsensemble @sv

näppäilysoitinyhtye
type: Concept
source: Kansallinen RDA-termi
source: Nationell RDA-term @sv
created: 2018-08-08
modified: 2024-05-24
broader: soitinyhtye
definition: Näppäilysoittimista koostuva yhtye.
definition: Ensemble bestående av knäppinstrument. @sv
in scheme: Metatietosanasto
preferred label: ensemble med knäppinstrument @sv

lyömäsoitinyhtye
type: Concept
source: Kansallinen RDA-termi
source: Nationell RDA-term @sv
created: 2018-08-08
modified: 2024-05-24
broader: soitinyhtye
definition: Lyömäsoittimista koostuva yhtye.
definition: Ensemble bestående av slagverksinstrument. @sv
in scheme: Metatietosanasto
preferred label: slagverksensemble @sv

kosketinsoitinyhtye
type: Concept
source: Kansallinen RDA-termi
source: Nationell RDA-term @sv
created: 2018-08-08
modified: 2024-05-24
broader: soitinyhtye
definition: Kosketinsoittimista koostuva yhtye.
definition: Ensemble bestående av tangentinstrument. @sv
in scheme: Metatietosanasto
preferred label: tangentensemble @sv

kääntäjä
type: Concept
source: RDA-termi
source: RDA-term @sv
created: 2016-01-08
modified: 2025-07-04
alternative label: translator @en
alternative label: käänt. (kääntäjä)
alternative label: kääntäjä (suhde)
alternative label: kääntäjä (toimija)
alternative label: övers. (översättare) @sv
alternative label: översättare (aktör) @sv
alternative label: översättare (relation) @sv
broader: version tekijä
definition: Toimija, joka osallistuu ekspression tekemiseen ilmaisemalla teoksen kielellisen sisällön alkuperäisen teoksen aiemmista ekspressioista poikkeavalla kielellä. (RDA Registry)
definition: Aktör som deltar i skapandet av ett uttryck, genom att uttrycka ett verks språkliga innehåll på ett språk som avviker från ett originalverks tidigare uttryck. @sv
in scheme: Metatietosanasto
preferred label: translator agent @en
preferred label: översättare @sv
scope note: Kääntäjä voi myös kääntää kielisisältöä saman kielen eri aikakausien muotojen välillä. (RDA Registry)
scope note: En översättare kan också översätta språkligt innehåll mellan olika former av samma språk från olika tidsperioder. @sv

gratulaation kirjoittaja
type: Concept
source: Kansallinen RDA-termi
source: Nationell RDA-term @sv
created: 2018-09-15
modified: 2025-01-08
alternative label: onnittelun kirjoittaja
alternative label: författare till lyckönskan @sv
broader: muokkaaja
definition: Liittää kappaleen henkilöön, joka toimii gratulaation kirjoittajana.
definition: Sammankopplar exemplar med en person som fungerar som författare till gratulation. @sv
in scheme: Metatietosanasto
preferred label: författare till gratulation @sv

gratulaation kohde
type: Concept
source: Kansallinen RDA-termi
source: Nationell RDA-term @sv
created: 2018-09-15
modified: 2025-01-08
broader: teokseen liittyvä henkilö
definition: Gratulaation kohdehenkilö, jos se on osoitettu jollekin muulle kuin teoksen kirjoittajalle.
definition: Föremål för gratulation, om den är riktad till någon annan än verkets författare. @sv
in scheme: Metatietosanasto
preferred label: föremål för gratulation @sv
scope note: Teokseen liittyvä muu toimija.
scope note: Annan aktör relaterad till verk. @sv

fagotisti
type: Concept
source: Kansallinen RDA-termi
source: YSO-termi
source: ALLFO-term @sv
source: Nationell RDA-term @sv
created: 2018-11-01
modified: 2024-08-27
alternative label: bassoonists @en
alternative label: fagottists @en
alternative label: fagotistit
alternative label: fagottister @sv
broader: soittaja
in scheme: Metatietosanasto
preferred label: bassoonist @en
preferred label: fagottist @sv

urheiluohjaaja
type: Concept
source: Kansallinen RDA-termi
source: YSO-termi
source: ALLFO-term @sv
source: Nationell RDA-term @sv
created: 2018-11-01
modified: 2024-08-27
alternative label: sports instructors @en
alternative label: urheiluohjaajat
broader: ohjaaja (kasvatus ja opastus)
in scheme: Metatietosanasto
preferred label: sport instructor @en
preferred label: idrottsledare @sv

mediataiteilija
type: Concept
source: Kansallinen RDA-termi
source: YSO-termi
source: ALLFO-term @sv
source: Nationell RDA-term @sv
created: 2018-11-01
modified: 2024-08-27
alternative label: media artists @en
alternative label: mediataiteilijat
alternative label: mediekonstnärer @sv
broader: taiteilija
in scheme: Metatietosanasto
preferred label: media artist @en
preferred label: mediekonstnär @sv

poliittinen avustaja
type: Concept
source: Kansallinen RDA-termi
source: YSO-termi
source: ALLFO-term @sv
source: Nationell RDA-term @sv
created: 2018-11-01
modified: 2024-08-27
alternative label: political assistants @en
alternative label: poliittiset avustajat
alternative label: politiska assistenter @sv
broader: avustaja
in scheme: Metatietosanasto
preferred label: political assistant @en
preferred label: politisk assistent @sv

ajoneuvoasentaja
type: Concept
source: Kansallinen RDA-termi
source: YSO-termi
source: ALLFO-term @sv
source: Nationell RDA-term @sv
created: 2018-11-01
modified: 2024-08-27
alternative label: vehicle mechanics @en
alternative label: ajoneuvoasentajat
broader: asentaja
in scheme: Metatietosanasto
preferred label: vehicle mechanic @en
preferred label: fordonsmekaniker @sv

uittopäällikkö
type: Concept
source: Kansallinen RDA-termi
source: YSO-termi
source: ALLFO-term @sv
source: Nationell RDA-term @sv
created: 2018-11-01
modified: 2024-08-27
alternative label: log floating foremen @en
alternative label: uittopäälliköt
alternative label: flottningschefer @sv
broader: päällikkö
in scheme: Metatietosanasto
preferred label: log floating foreman @en
preferred label: flottningschef @sv

suksiseppä
type: Concept
source: Kansallinen RDA-termi
source: YSO-termi
source: ALLFO-term @sv
source: Nationell RDA-term @sv
created: 2018-11-01
modified: 2024-08-27
alternative label: wooden ski makers @en
alternative label: suksisepät
broader: seppä
in scheme: Metatietosanasto
preferred label: wooden ski maker @en
preferred label: skidmakare @sv

erikoislääkäri
type: Concept
source: Kansallinen RDA-termi
source: YSO-termi
source: ALLFO-term @sv
source: Nationell RDA-term @sv
created: 2018-11-01
modified: 2024-08-27
alternative label: specialists @en
alternative label: erikoislääkärit
alternative label: specialistläkare @sv
broader: lääkäri
in scheme: Metatietosanasto
preferred label: specialist doctor @en
preferred label: specialläkare @sv

kymmenottelija
type: Concept
source: Kansallinen RDA-termi
source: YSO-termi
source: ALLFO-term @sv
source: Nationell RDA-term @sv
created: 2018-11-01
modified: 2024-08-27
alternative label: decathletes @en
alternative label: kymmenottelijat
broader: yleisurheilija
in scheme: Metatietosanasto
preferred label: decathlonist @en
preferred label: tiokampare @sv

museojohtaja
type: Concept
source: Kansallinen RDA-termi
source: YSO-termi
source: ALLFO-term @sv
source: Nationell RDA-term @sv
created: 2018-11-01
modified: 2024-08-27
alternative label: museum directors @en
alternative label: museonjohtajat
alternative label: museichefer @sv
alternative label: museidirektörer @sv
broader: johtaja
in scheme: Metatietosanasto
preferred label: museum director @en
preferred label: museichef @sv

lumilautailija
type: Concept
source: Kansallinen RDA-termi
source: YSO-termi
source: ALLFO-term @sv
source: Nationell RDA-term @sv
created: 2018-11-01
modified: 2024-08-27
alternative label: snowboarders @en
alternative label: lumilautailijat
broader: urheilija
in scheme: Metatietosanasto
preferred label: snowboarder @en
preferred label: snowboardåkare @sv

lehtori (kirkon työntekijä)
type: Concept
source: Kansallinen RDA-termi
source: YSO-termi
source: ALLFO-term @sv
source: Nationell RDA-term @sv
created: 2018-11-01
modified: 2024-08-27
alternative label: parish lectors @en
alternative label: lehtorit
alternative label: församlingslektorer @sv
alternative label: lektorer @sv
broader: kirkon työntekijä
in scheme: Metatietosanasto
preferred label: parish lector @en
preferred label: lektor (kyrkans arbetstagare) @sv

kansantaiteilija
type: Concept
source: Kansallinen RDA-termi
source: YSO-termi
source: ALLFO-term @sv
source: Nationell RDA-term @sv
created: 2018-11-01
modified: 2024-08-27
alternative label: folk artists @en
alternative label: kansantaiteilijat
alternative label: folkliga konstnärer @sv
broader: taiteilija
in scheme: Metatietosanasto
preferred label: folk artist @en
preferred label: folklig konstnär @sv

sosiaaliterapeutti
type: Concept
source: Kansallinen RDA-termi
source: YSO-termi
source: ALLFO-term @sv
source: Nationell RDA-term @sv
created: 2018-11-01
modified: 2024-08-27
alternative label: social therapists @en
alternative label: sosiaaliterapeutit
alternative label: socialterapeuter @sv
broader: sosiaalityöntekijä
in scheme: Metatietosanasto
preferred label: social therapist @en
preferred label: socialterapeut @sv

ampuja
type: Concept
source: Kansallinen RDA-termi
source: YSO-termi
source: ALLFO-term @sv
source: Nationell RDA-term @sv
created: 2018-11-01
modified: 2024-08-27
alternative label: shooters @en
alternative label: ampujat
alternative label: skyttar @sv
broader: urheilija
in scheme: Metatietosanasto
preferred label: shooter (athlete) @en
preferred label: skytt @sv

kuntoutusohjaaja
type: Concept
source: Kansallinen RDA-termi
source: YSO-termi
source: ALLFO-term @sv
source: Nationell RDA-term @sv
created: 2018-11-01
modified: 2024-08-27
alternative label: rehabilitation counsellors @en
alternative label: rehabilitation instructors @en
alternative label: kuntoutusohjaajat
alternative label: rehabiliteringsinstruktörer @sv
broader: ohjaaja (kasvatus ja opastus)
in scheme: Metatietosanasto
preferred label: rehabilitation counsellor @en
preferred label: rehabiliteringsinstruktör @sv

meklari
type: Concept
source: Kansallinen RDA-termi
source: YSO-termi
source: ALLFO-term @sv
source: Nationell RDA-term @sv
created: 2018-11-01
modified: 2024-08-27
alternative label: brokers @en
alternative label: meklarit
in scheme: Metatietosanasto
narrower: vakuutusmeklari
preferred label: broker @en
preferred label: mäklare @sv

liikunnanohjaaja
type: Concept
source: Kansallinen RDA-termi
source: YSO-termi
source: ALLFO-term @sv
source: Nationell RDA-term @sv
created: 2018-11-01
modified: 2024-08-27
alternative label: physical training instructors @en
alternative label: liikunnanohjaajat
alternative label: idrottsinstruktörer @sv
broader: ohjaaja (kasvatus ja opastus)
in scheme: Metatietosanasto
preferred label: physical exercise instructor @en
preferred label: idrottsinstruktör @sv

teologi
type: Concept
source: Kansallinen RDA-termi
source: YSO-termi
source: ALLFO-term @sv
source: Nationell RDA-term @sv
created: 2018-11-01
modified: 2024-08-27
alternative label: theologians @en
alternative label: teologit
alternative label: teologer @sv
in scheme: Metatietosanasto
narrower: sairaalateologi
preferred label: theologian @en
preferred label: teolog @sv

karjatalousteknikko
type: Concept
source: Kansallinen RDA-termi
source: YSO-termi
source: ALLFO-term @sv
source: Nationell RDA-term @sv
created: 2018-11-01
modified: 2024-08-27
alternative label: animal husbandry technician engineers @en
alternative label: karjatalousteknikot
broader: teknikko
in scheme: Metatietosanasto
preferred label: animal husbandry technician @en
preferred label: kreaturstekniker @sv

koripalloilija
type: Concept
source: Kansallinen RDA-termi
source: YSO-termi
source: ALLFO-term @sv
source: Nationell RDA-term @sv
created: 2018-11-01
modified: 2024-08-27
alternative label: basketball players @en
alternative label: koripalloilijat
alternative label: basketspelare @sv
alternative label: korgbollsspelare @sv
broader: urheilija
in scheme: Metatietosanasto
preferred label: basketball player @en
preferred label: basketbollspelare @sv

kenttäpiispa
type: Concept
source: Kansallinen RDA-termi
source: YSO-termi
source: ALLFO-term @sv
source: Nationell RDA-term @sv
created: 2018-11-01
modified: 2024-08-27
alternative label: kenttäpiispa (ammatti)
alternative label: fältbiskop (yrke) @sv
broader: sotilashenkilö
in scheme: Metatietosanasto
preferred label: fältbiskop @sv

turkistarhaaja
type: Concept
source: Kansallinen RDA-termi
source: YSO-termi
source: ALLFO-term @sv
source: Nationell RDA-term @sv
created: 2018-11-01
modified: 2024-08-27
alternative label: fur breeders @en
alternative label: fur farmers @en
alternative label: turkistarhaajat
alternative label: pälsfarmare @sv
broader: maatalousyrittäjä
in scheme: Metatietosanasto
preferred label: fur farmer @en
preferred label: pälsdjursuppfödare @sv

perheterapeutti
type: Concept
source: Kansallinen RDA-termi
source: YSO-termi
source: ALLFO-term @sv
source: Nationell RDA-term @sv
created: 2018-11-01
modified: 2024-08-27
alternative label: family therapists @en
alternative label: perheterapeutit
alternative label: familjeterapeuter @sv
broader: psykoterapeutti
in scheme: Metatietosanasto
preferred label: family therapist @en
preferred label: familjeterapeut @sv

elokuvatutkija
type: Concept
source: Kansallinen RDA-termi
source: YSO-termi
source: ALLFO-term @sv
source: Nationell RDA-term @sv
created: 2018-11-01
modified: 2024-08-27
alternative label: film researchers @en
alternative label: elokuvatutkijat
broader: tutkija
in scheme: Metatietosanasto
preferred label: film researcher @en
preferred label: filmforskare @sv

kampaajamestari
type: Concept
source: Kansallinen RDA-termi
source: YSO-termi
source: ALLFO-term @sv
source: Nationell RDA-term @sv
created: 2018-11-01
modified: 2024-08-27
alternative label: master hairdressers @en
alternative label: kampaajamestarit
broader: kampaaja
in scheme: Metatietosanasto
preferred label: master hairdresser @en
preferred label: frisörmästare @sv

eversti
type: Concept
source: Kansallinen RDA-termi
source: YSO-termi
source: ALLFO-term @sv
source: Nationell RDA-term @sv
created: 2018-11-01
modified: 2024-08-27
alternative label: colonels @en
alternative label: everstit
alternative label: överstar @sv
broader: upseeri
in scheme: Metatietosanasto
preferred label: colonel @en
preferred label: överste @sv

kauppalanjohtaja
type: Concept
source: Kansallinen RDA-termi
source: YSO-termi
source: ALLFO-term @sv
source: Nationell RDA-term @sv
created: 2018-11-01
modified: 2024-08-27
alternative label: market town managers @en
alternative label: kauppalanjohtajat
alternative label: köpingsdirektörer @sv
broader: kuntajohtaja
in scheme: Metatietosanasto
preferred label: market town manager @en
preferred label: köpingsdirektör @sv

satamatyöntekijä
type: Concept
source: Kansallinen RDA-termi
source: YSO-termi
source: ALLFO-term @sv
source: Nationell RDA-term @sv
created: 2018-11-01
modified: 2024-08-27
alternative label: dockworkers @en
alternative label: satamatyöntekijät
broader: työntekijä
in scheme: Metatietosanasto
preferred label: dockworker @en
preferred label: hamnarbetare @sv

kansakoulunopettaja
type: Concept
source: Kansallinen RDA-termi
source: YSO-termi
source: ALLFO-term @sv
source: Nationell RDA-term @sv
created: 2018-11-01
modified: 2024-08-27
alternative label: kansakoulunopettaja (ammatti)
alternative label: folkskollärare (yrke) @sv
broader: opettaja
in scheme: Metatietosanasto
preferred label: primary school teacher (folk school) @en
preferred label: folkskollärare @sv

linja-autonkuljettaja
type: Concept
source: Kansallinen RDA-termi
source: YSO-termi
source: ALLFO-term @sv
source: Nationell RDA-term @sv
created: 2018-11-01
modified: 2024-08-27
alternative label: bus drivers @en
alternative label: linja-autonkuljettajat
alternative label: busschaufförer @sv
alternative label: bussförare @sv
broader: autonkuljettaja
in scheme: Metatietosanasto
preferred label: bus driver @en
preferred label: busschaufför @sv

ratsastaja
type: Concept
source: Kansallinen RDA-termi
source: YSO-termi
source: ALLFO-term @sv
source: Nationell RDA-term @sv
created: 2018-11-01
modified: 2024-08-27
alternative label: riders @en
alternative label: ratsastajat
broader: urheilija
in scheme: Metatietosanasto
preferred label: rider @en
preferred label: ryttare @sv

automaatioasentaja
type: Concept
source: Kansallinen RDA-termi
source: YSO-termi
source: ALLFO-term @sv
source: Nationell RDA-term @sv
created: 2018-11-01
modified: 2024-08-27
alternative label: automation mechanics @en
alternative label: automaatioasentajat
alternative label: automationsmontörer @sv
broader: asentaja
in scheme: Metatietosanasto
preferred label: automation assembler @en
preferred label: automationsmontör @sv

instituutti
type: Concept
source: Kansallinen RDA-termi
source: Nationell RDA-term @sv
created: 2016-01-08
modified: 2024-05-24
alternative label: kulttuuri-instituutti
alternative label: tiedeinstituutti
alternative label: kulturinstitut @sv
alternative label: vetenskapsinstitut @sv
definition: Ulkomailla toimiva suomalaisen tieteen kansainvälistä näkyvyttä ja yhteistyötä edistävä instituutti.
definition: Institut som främjar synlighet och samarbete för finländsk vetenskap utomlands. @sv
example: Suomen Japanin instituutti
example: Suomen Rooman instituutti
example: Finlands Rominstitut @sv
example: Finlands institut i Japan @sv
in scheme: Metatietosanasto
preferred label: institut @sv
related: tutkimuslaitos

ensihoitaja
type: Concept
source: Kansallinen RDA-termi
source: YSO-termi
source: ALLFO-term @sv
source: Nationell RDA-term @sv
created: 2018-11-01
modified: 2024-08-27
alternative label: emergency medical technicians @en
alternative label: emergency nurses @en
alternative label: paramedics @en
alternative label: ensihoitajat
alternative label: ambulanssjukvårdare @sv
broader: sairaanhoitaja
in scheme: Metatietosanasto
preferred label: emergency medical technician @en
preferred label: förstavårdare @sv

opintopsykologi
type: Concept
source: Kansallinen RDA-termi
source: YSO-termi
source: ALLFO-term @sv
source: Nationell RDA-term @sv
created: 2018-11-01
modified: 2024-08-27
alternative label: educational counselling psychologists @en
alternative label: opintopsykologit
alternative label: studiepsykologer @sv
broader: psykologi
in scheme: Metatietosanasto
preferred label: educational counselling psychologist @en
preferred label: studiepsykolog @sv

uimaopettaja
type: Concept
source: Kansallinen RDA-termi
source: YSO-termi
source: ALLFO-term @sv
source: Nationell RDA-term @sv
created: 2018-11-01
modified: 2024-08-27
alternative label: swimming instructors @en
alternative label: swimming teachers @en
alternative label: uimaopettajat
broader: opettaja
in scheme: Metatietosanasto
preferred label: swimming teacher @en
preferred label: simlärare @sv

rakennuspeltiseppä
type: Concept
source: Kansallinen RDA-termi
source: YSO-termi
source: ALLFO-term @sv
source: Nationell RDA-term @sv
created: 2018-11-01
modified: 2024-08-27
alternative label: construction sheet metal workers @en
alternative label: rakennuspeltisepät
broader: peltiseppä
in scheme: Metatietosanasto
preferred label: construction sheet metal worker @en
preferred label: byggnadsplåtslagare @sv

LVI-asentaja
type: Concept
source: Kansallinen RDA-termi
source: YSO-termi
source: ALLFO-term @sv
source: Nationell RDA-term @sv
created: 2018-11-01
modified: 2024-08-27
alternative label: HPAC fitters @en
alternative label: heating, plumbing and ventilation fitters @en
alternative label: LVI-asentajat
alternative label: VVS-montörer @sv
broader: asentaja
in scheme: Metatietosanasto
preferred label: HPAC fitter @en
preferred label: VVS-montör @sv

yleislääkäri
type: Concept
source: Kansallinen RDA-termi
source: YSO-termi
source: ALLFO-term @sv
source: Nationell RDA-term @sv
created: 2018-11-01
modified: 2024-08-27
alternative label: general practitioners @en
alternative label: yleislääkärit
alternative label: allmänpraktiserande läkare @sv
broader: lääkäri
in scheme: Metatietosanasto
preferred label: general practitioner @en
preferred label: allmänläkare @sv

pukuompelija
type: Concept
source: Kansallinen RDA-termi
source: YSO-termi
source: ALLFO-term @sv
source: Nationell RDA-term @sv
created: 2018-11-01
modified: 2024-08-27
alternative label: dressmakers @en
alternative label: pukuompelijat
broader: ompelija
in scheme: Metatietosanasto
preferred label: dressmaker @en
preferred label: klädsömmare @sv

rekka-autonkuljettaja
type: Concept
source: Kansallinen RDA-termi
source: YSO-termi
source: ALLFO-term @sv
source: Nationell RDA-term @sv
created: 2018-11-01
modified: 2024-08-27
alternative label: trailer lorry drivers @en
alternative label: trailer truck drivers @en
alternative label: rekka-auton kuljettajat
alternative label: rekka-autonkuljettajat
alternative label: rekkakuskit
alternative label: långtradarchaufförer @sv
alternative label: långtradarförare @sv
broader: autonkuljettaja
in scheme: Metatietosanasto
preferred label: trailer lorry driver @en
preferred label: långtradarchaufför @sv

sahatyöntekijä
type: Concept
source: Kansallinen RDA-termi
source: YSO-termi
source: ALLFO-term @sv
source: Nationell RDA-term @sv
created: 2018-11-01
modified: 2024-08-27
alternative label: sahatyöntekijät
broader: työntekijä
in scheme: Metatietosanasto
preferred label: sågverksarbetare @sv

työnohjaaja
type: Concept
source: Kansallinen RDA-termi
source: YSO-termi
source: ALLFO-term @sv
source: Nationell RDA-term @sv
created: 2018-11-01
modified: 2024-08-27
alternative label: work advisors @en
alternative label: työnohjaajat
broader: ohjaaja (kasvatus ja opastus)
in scheme: Metatietosanasto
preferred label: work advisor @en
preferred label: arbetshandledare @sv

koristemaalari
type: Concept
source: Kansallinen RDA-termi
source: YSO-termi
source: ALLFO-term @sv
source: Nationell RDA-term @sv
created: 2018-11-01
modified: 2024-08-27
alternative label: decorative painters @en
alternative label: koristemaalarit
broader: kuvataiteilija
in scheme: Metatietosanasto
preferred label: decorative painter @en
preferred label: dekorationsmålare @sv

drag-artisti
type: Concept
source: Kansallinen RDA-termi
source: YSO-termi
source: ALLFO-term @sv
source: Nationell RDA-term @sv
created: 2018-11-01
modified: 2024-08-27
alternative label: drag-artistit
alternative label: drag-kingit
alternative label: drag-queenit
alternative label: drag-taiteilijat
alternative label: dragartister @sv
alternative label: dragdrottningar @sv
alternative label: dragkings @sv
alternative label: dragkungar @sv
alternative label: dragqueens @sv
alternative label: dragshowartister @sv
broader: viihdetaiteilija
in scheme: Metatietosanasto
preferred label: dragshowartist @sv

puolustusministeri
type: Concept
source: Kansallinen RDA-termi
source: YSO-termi
source: ALLFO-term @sv
source: Nationell RDA-term @sv
created: 2018-11-01
modified: 2024-08-27
alternative label: ministers of defence @en
alternative label: puolustusministerit
alternative label: försvarsministrar @sv
broader: ministeri
in scheme: Metatietosanasto
preferred label: minister of defence @en
preferred label: försvarsminister @sv

parturi
type: Concept
source: Kansallinen RDA-termi
source: YSO-termi
source: ALLFO-term @sv
source: Nationell RDA-term @sv
created: 2018-11-01
modified: 2024-08-27
alternative label: barbers @en
alternative label: hiusmuotoilijat
alternative label: parturit
alternative label: barberare @sv
alternative label: frisörer @sv
alternative label: herrfrisörer @sv
alternative label: hårfrisörer @sv
in scheme: Metatietosanasto
narrower: parturimestari
preferred label: barber @en
preferred label: herrfrisör @sv

ilmastointiasentaja
type: Concept
source: Kansallinen RDA-termi
source: YSO-termi
source: ALLFO-term @sv
source: Nationell RDA-term @sv
created: 2018-11-01
modified: 2024-08-27
alternative label: air conditioning mechanics @en
alternative label: ventilation pipefitters @en
alternative label: ilmastointiasentajat
alternative label: ventilationsmontörer @sv
broader: asentaja
in scheme: Metatietosanasto
preferred label: air conditioning mechanic @en
preferred label: ventilationsmontör @sv

seiväshyppääjä
type: Concept
source: Kansallinen RDA-termi
source: YSO-termi
source: ALLFO-term @sv
source: Nationell RDA-term @sv
created: 2018-11-01
modified: 2024-08-27
alternative label: pole vaulters @en
alternative label: seiväshyppääjät
broader: yleisurheilija
in scheme: Metatietosanasto
preferred label: pole vaulter @en
preferred label: stavhoppare @sv

harrastajataiteilija
type: Concept
source: Kansallinen RDA-termi
source: YSO-termi
source: ALLFO-term @sv
source: Nationell RDA-term @sv
created: 2018-11-01
modified: 2024-08-27
alternative label: amateur artists @en
alternative label: harrastajataiteilijat
alternative label: amatörkonstnärer @sv
broader: taiteilija
in scheme: Metatietosanasto
preferred label: amateur artist @en
preferred label: amatörkonstnär @sv

äänittäjä
type: Concept
source: RDA-termi
source: RDA-term @sv
created: 2016-01-08
modified: 2025-08-27
alternative label: recording engineer @en
alternative label: äänitt. (äänittäjä)
alternative label: äänittäjä (toimija)
alternative label: inspelningstekniker (aktör) @sv
alternative label: ljudtekn. (ljudtekniker) @sv
alternative label: ljudtekniker @sv
broader: ääniteknikko
definition: Toimija, joka on ääniteknikko, joka osallistuu ekspression äänisisällön tekemiseen valvomalla äänityksen teknistä toteutusta. (RDA Registry)
definition: Aktör som är en ljudtekniker, som deltar i utförandet av ljudinnehållet i ett uttryck, genom att övervaka det tekniska utförandet av en ljudinspelning. @sv
in scheme: Metatietosanasto
preferred label: recording engineer agent @en
preferred label: inspelningstekniker @sv

trumpetisti
type: Concept
source: Kansallinen RDA-termi
source: YSO-termi
source: ALLFO-term @sv
source: Nationell RDA-term @sv
created: 2018-11-01
modified: 2024-08-27
alternative label: trumpet players @en
alternative label: trumpetistit
alternative label: trumpetare @sv
alternative label: trumpetister @sv
broader: soittaja
in scheme: Metatietosanasto
preferred label: trumpet player @en
preferred label: trumpetist @sv

fysiatri
type: Concept
source: Kansallinen RDA-termi
source: YSO-termi
source: ALLFO-term @sv
source: Nationell RDA-term @sv
created: 2018-11-01
modified: 2024-08-27
alternative label: physiatrists @en
alternative label: fysiatrit
alternative label: fysiatrar @sv
alternative label: fysiatrer @sv
broader: lääkäri
in scheme: Metatietosanasto
preferred label: physiatrist @en
preferred label: fysiater @sv

tukkukauppias
type: Concept
source: Kansallinen RDA-termi
source: YSO-termi
source: ALLFO-term @sv
source: Nationell RDA-term @sv
created: 2018-11-01
modified: 2024-08-27
alternative label: wholesalers @en
alternative label: tukkukauppiaat
alternative label: grosshandlare @sv
broader: kauppias
in scheme: Metatietosanasto
preferred label: wholesaler @en
preferred label: partihandlare @sv

poliisi
type: Concept
source: Kansallinen RDA-termi
source: YSO-termi
source: ALLFO-term @sv
source: Nationell RDA-term @sv
created: 2018-11-01
modified: 2024-08-27
alternative label: police (profession) @en
alternative label: poliisi (ammatti)
alternative label: poliisit
alternative label: polis (yrke) @sv
alternative label: poliser @sv
in scheme: Metatietosanasto
narrower: rikosetsivä
preferred label: police @en
preferred label: polis @sv

autonasentaja
type: Concept
source: Kansallinen RDA-termi
source: YSO-termi
source: ALLFO-term @sv
source: Nationell RDA-term @sv
created: 2018-11-01
modified: 2024-08-27
alternative label: car mechanics @en
alternative label: autonasentajat
alternative label: bilmontörer @sv
broader: asentaja
in scheme: Metatietosanasto
preferred label: car mechanic @en
preferred label: bilmontör @sv

luutnantti
type: Concept
source: Kansallinen RDA-termi
source: YSO-termi
source: ALLFO-term @sv
source: Nationell RDA-term @sv
created: 2018-11-01
modified: 2024-08-27
alternative label: lieutenants @en
alternative label: luutnantit
alternative label: löjtnanter @sv
broader: upseeri
in scheme: Metatietosanasto
preferred label: lieutenant @en
preferred label: löjtnant @sv

rumpali
type: Concept
source: Kansallinen RDA-termi
source: YSO-termi
source: ALLFO-term @sv
source: Nationell RDA-term @sv
created: 2018-11-01
modified: 2024-08-27
alternative label: drummers @en
alternative label: rumpalit
alternative label: batterister @sv
alternative label: trummisar @sv
broader: lyömäsoittaja
in scheme: Metatietosanasto
preferred label: drummer @en
preferred label: trumslagare @sv

pankinjohtaja
type: Concept
source: Kansallinen RDA-termi
source: YSO-termi
source: ALLFO-term @sv
source: Nationell RDA-term @sv
created: 2018-11-01
modified: 2024-08-27
alternative label: bank managers @en
alternative label: pankinjohtajat
alternative label: bankdirektörer @sv
broader: johtaja
in scheme: Metatietosanasto
preferred label: bank manager @en
preferred label: bankdirektör @sv

fysiikanopettaja
type: Concept
source: Kansallinen RDA-termi
source: YSO-termi
source: ALLFO-term @sv
source: Nationell RDA-term @sv
created: 2018-11-01
modified: 2024-08-27
alternative label: physics teachers @en
alternative label: fysiikanopettajat
broader: aineenopettaja
in scheme: Metatietosanasto
preferred label: physics teacher @en
preferred label: fysiklärare @sv

maalarimestari
type: Concept
source: Kansallinen RDA-termi
source: YSO-termi
source: ALLFO-term @sv
source: Nationell RDA-term @sv
created: 2018-11-01
modified: 2024-08-27
alternative label: master painters @en
alternative label: maalarimestarit
broader: maalari
in scheme: Metatietosanasto
preferred label: master painter @en
preferred label: målarmästare @sv

aseseppä
type: Concept
source: Kansallinen RDA-termi
source: YSO-termi
source: ALLFO-term @sv
source: Nationell RDA-term @sv
created: 2018-11-01
modified: 2024-08-27
alternative label: gunsmiths @en
alternative label: asesepät
alternative label: vapensmeder @sv
broader: seppä
in scheme: Metatietosanasto
preferred label: gunsmith @en
preferred label: vapensmed @sv

koristeveistäjä
type: Concept
source: Kansallinen RDA-termi
source: YSO-termi
source: ALLFO-term @sv
source: Nationell RDA-term @sv
created: 2018-11-01
modified: 2024-08-27
alternative label: ornamental woodcarvers @en
alternative label: koristeveistäjät
broader: käsityöläinen
in scheme: Metatietosanasto
preferred label: ornamental woodcarver @en
preferred label: konstsnickare @sv

metsäntutkija
type: Concept
source: Kansallinen RDA-termi
source: YSO-termi
source: ALLFO-term @sv
source: Nationell RDA-term @sv
created: 2018-11-01
modified: 2024-08-27
alternative label: forest researchers @en
alternative label: metsäntutkijat
broader: tutkija
in scheme: Metatietosanasto
preferred label: forest researcher @en
preferred label: skogsforskare @sv

neuropsykologi
type: Concept
source: Kansallinen RDA-termi
source: YSO-termi
source: ALLFO-term @sv
source: Nationell RDA-term @sv
created: 2018-11-01
modified: 2024-08-27
alternative label: neuropsychologists @en
alternative label: neuropsykologit
alternative label: neuropsykologer @sv
broader: psykologi
in scheme: Metatietosanasto
preferred label: neuropsychologist @en
preferred label: neuropsykolog @sv

hammaslääkäri
type: Concept
source: Kansallinen RDA-termi
source: YSO-termi
source: ALLFO-term @sv
source: Nationell RDA-term @sv
created: 2018-11-01
modified: 2024-08-27
alternative label: dentists @en
alternative label: hammaslääkärit
in scheme: Metatietosanasto
narrower: erikoishammaslääkäri
preferred label: dentist @en
preferred label: tandläkare @sv

performanssitaiteilija
type: Concept
source: Kansallinen RDA-termi
source: YSO-termi
source: ALLFO-term @sv
source: Nationell RDA-term @sv
created: 2018-11-01
modified: 2024-08-27
alternative label: performance artists @en
alternative label: performanssitaiteilijat
alternative label: performancekonstnärer @sv
broader: taiteilija
in scheme: Metatietosanasto
preferred label: performance artist @en
preferred label: performancekonstnär @sv

kastraattilaulaja
type: Concept
source: Kansallinen RDA-termi
source: YSO-termi
source: ALLFO-term @sv
source: Nationell RDA-term @sv
created: 2018-11-01
modified: 2024-08-27
alternative label: castrati @en
alternative label: kastraattilaulajat
broader: laulaja
in scheme: Metatietosanasto
preferred label: castrato @en
preferred label: kastratsångare @sv

pilapiirtäjä
type: Concept
source: Kansallinen RDA-termi
source: YSO-termi
source: ALLFO-term @sv
source: Nationell RDA-term @sv
created: 2018-11-01
modified: 2024-08-27
alternative label: caricaturists @en
alternative label: karikatyristit
alternative label: pilapiirtäjät
alternative label: karikatyrister @sv
broader: piirtäjä
in scheme: Metatietosanasto
preferred label: caricaturist @en
preferred label: skämttecknare @sv

talouspäällikkö
type: Concept
source: Kansallinen RDA-termi
source: YSO-termi
source: ALLFO-term @sv
source: Nationell RDA-term @sv
created: 2018-11-01
modified: 2024-08-27
alternative label: financial managers @en
alternative label: talouspäälliköt
alternative label: ekonomichefer @sv
broader: päällikkö
in scheme: Metatietosanasto
preferred label: financial manager @en
preferred label: ekonomichef @sv

pianisti
type: Concept
source: Kansallinen RDA-termi
source: YSO-termi
source: ALLFO-term @sv
source: Nationell RDA-term @sv
created: 2018-11-01
modified: 2024-08-27
alternative label: pianists @en
alternative label: pianistit
alternative label: pianister @sv
broader: soittaja
in scheme: Metatietosanasto
preferred label: pianist @en

kirjakauppias
type: Concept
source: Kansallinen RDA-termi
source: YSO-termi
source: ALLFO-term @sv
source: Nationell RDA-term @sv
created: 2018-11-01
modified: 2024-08-27
alternative label: booksellers @en
alternative label: kirjakauppiaat
broader: kauppias
in scheme: Metatietosanasto
preferred label: bookseller @en
preferred label: bokhandlare @sv

luokanopettaja
type: Concept
source: Kansallinen RDA-termi
source: YSO-termi
source: ALLFO-term @sv
source: Nationell RDA-term @sv
created: 2018-11-01
modified: 2024-08-27
alternative label: luokanopettaja (ammatti)
alternative label: klasslärare (yrke) @sv
broader: opettaja
in scheme: Metatietosanasto
preferred label: class teacher @en
preferred label: klasslärare @sv

klarinetisti
type: Concept
source: Kansallinen RDA-termi
source: YSO-termi
source: ALLFO-term @sv
source: Nationell RDA-term @sv
created: 2018-11-01
modified: 2024-08-27
alternative label: clarinetists @en
alternative label: klarinetistit
alternative label: klarinettister @sv
broader: soittaja
in scheme: Metatietosanasto
preferred label: clarinetist @en
preferred label: klarinettist @sv

valtionarkistonhoitaja
type: Concept
source: Kansallinen RDA-termi
source: YSO-termi
source: ALLFO-term @sv
source: Nationell RDA-term @sv
created: 2018-11-01
modified: 2024-08-27
alternative label: state archivists @en
alternative label: valtionarkistonhoitajat
alternative label: riksarkivarien @sv
alternative label: riksarkivarier @sv
broader: arkistonhoitaja
in scheme: Metatietosanasto
preferred label: state archivist @en
preferred label: riksarkivarie @sv

vähittäiskauppias
type: Concept
source: Kansallinen RDA-termi
source: YSO-termi
source: ALLFO-term @sv
source: Nationell RDA-term @sv
created: 2018-11-01
modified: 2024-08-27
alternative label: retailer dealers @en
alternative label: retailers @en
alternative label: vähittäiskauppiaat
broader: kauppias
in scheme: Metatietosanasto
preferred label: retailer @en
preferred label: detaljhandlare @sv

eräopas
type: Concept
source: Kansallinen RDA-termi
source: YSO-termi
source: ALLFO-term @sv
source: Nationell RDA-term @sv
created: 2018-11-01
modified: 2024-08-27
alternative label: wilderness guides @en
alternative label: eräoppaat
alternative label: vildmarksguider @sv
broader: opas
in scheme: Metatietosanasto
preferred label: wilderness guide (occupation) @en
preferred label: vildmarksguide (yrke) @sv

kaupunkisuunnittelija
type: Concept
source: Kansallinen RDA-termi
source: YSO-termi
source: ALLFO-term @sv
source: Nationell RDA-term @sv
created: 2018-11-01
modified: 2024-08-27
alternative label: town planners @en
alternative label: kaupunkisuunnittelijat
broader: suunnittelija
in scheme: Metatietosanasto
preferred label: town planner @en
preferred label: stadsplanerare @sv

matematiikanopettaja
type: Concept
source: Kansallinen RDA-termi
source: YSO-termi
source: ALLFO-term @sv
source: Nationell RDA-term @sv
created: 2018-11-01
modified: 2024-08-27
alternative label: mathematics teachers @en
alternative label: matematiikanopettajat
broader: aineenopettaja
in scheme: Metatietosanasto
preferred label: mathematics teacher @en
preferred label: matematiklärare @sv

alppihiihtäjä
type: Concept
source: Kansallinen RDA-termi
source: YSO-termi
source: ALLFO-term @sv
source: Nationell RDA-term @sv
created: 2018-11-01
modified: 2024-08-27
alternative label: alpine skiers @en
alternative label: alppihiihtäjät
alternative label: pujottelijat
alternative label: syöksylaskijat
alternative label: alpina skidåkare @sv
broader: urheilija
in scheme: Metatietosanasto
preferred label: alpine skier @en
preferred label: alpin skidåkare @sv

kontrabasisti
type: Concept
source: Kansallinen RDA-termi
source: YSO-termi
source: ALLFO-term @sv
source: Nationell RDA-term @sv
created: 2018-11-01
modified: 2024-08-27
alternative label: double bassists @en
alternative label: kontrabasistit
alternative label: muusikko (kontrabasso)
alternative label: kontrabasister @sv
broader: soittaja
in scheme: Metatietosanasto
preferred label: double bassist @en
preferred label: kontrabasist @sv

pikajuoksija
type: Concept
source: Kansallinen RDA-termi
source: YSO-termi
source: ALLFO-term @sv
source: Nationell RDA-term @sv
created: 2018-11-01
modified: 2024-08-27
alternative label: sprinters @en
alternative label: pikajuoksijat
alternative label: kortdistanslöpare @sv
broader: juoksija
in scheme: Metatietosanasto
preferred label: sprinter @en
preferred label: sprinterlöpare @sv

vaatetusteknikko
type: Concept
source: Kansallinen RDA-termi
source: YSO-termi
source: ALLFO-term @sv
source: Nationell RDA-term @sv
created: 2018-11-01
modified: 2024-08-27
alternative label: clothing technicians @en
alternative label: clothing technologists @en
alternative label: vaatetusteknikot
broader: teknikko
in scheme: Metatietosanasto
preferred label: clothing technologist @en
preferred label: beklädnadstekniker @sv

taidekauppias
type: Concept
source: Kansallinen RDA-termi
source: YSO-termi
source: ALLFO-term @sv
source: Nationell RDA-term @sv
created: 2018-11-01
modified: 2024-08-27
alternative label: art dealers @en
alternative label: taidekauppiaat
broader: kauppias
in scheme: Metatietosanasto
preferred label: art dealer @en
preferred label: konsthandlare @sv

sotakirjeenvaihtaja
type: Concept
source: Kansallinen RDA-termi
source: YSO-termi
source: ALLFO-term @sv
source: Nationell RDA-term @sv
created: 2018-11-01
modified: 2024-08-27
alternative label: war correspondents @en
alternative label: sotakirjeenvaihtajat
alternative label: krigskorrespondenter @sv
broader: kirjeenvaihtaja
in scheme: Metatietosanasto
preferred label: war correspondent @en
preferred label: krigskorrespondent @sv

äänitetuottaja
type: Concept
source: Kansallinen RDA-termi
source: YSO-termi
source: ALLFO-term @sv
source: Nationell RDA-term @sv
created: 2018-11-01
modified: 2024-08-27
alternative label: record producers @en
alternative label: levytuottajat
alternative label: äänitetuottajat
alternative label: ljudinspelningsproducenter @sv
alternative label: skivproducenter @sv
broader: tuottaja
in scheme: Metatietosanasto
preferred label: record producer @en
preferred label: ljudinspelningsproducent @sv

oikeuskansleri
type: Concept
source: Kansallinen RDA-termi
source: YSO-termi
source: ALLFO-term @sv
source: Nationell RDA-term @sv
created: 2018-11-01
modified: 2024-08-27
alternative label: chancellors of justice @en
alternative label: oikeuskanslerit
alternative label: justitiekanslerer @sv
broader: virkamies
in scheme: Metatietosanasto
preferred label: chancellor of justice @en
preferred label: justitiekansler @sv

sotapäällikkö
type: Concept
source: Kansallinen RDA-termi
source: YSO-termi
source: ALLFO-term @sv
source: Nationell RDA-term @sv
created: 2018-11-01
modified: 2024-08-27
alternative label: military commanders @en
alternative label: warlords @en
alternative label: sotapäälliköt
alternative label: fältherrar @sv
broader: päällikkö
in scheme: Metatietosanasto
preferred label: military commander @en
preferred label: fältherre @sv

filatelisti
type: Concept
source: Kansallinen RDA-termi
source: YSO-termi
source: ALLFO-term @sv
source: Nationell RDA-term @sv
created: 2018-11-01
modified: 2024-08-27
alternative label: philatelists @en
alternative label: stamp collectors @en
alternative label: filatelistit
alternative label: postimerkkeilijä
alternative label: filatelister @sv
alternative label: frimärkssamlare @sv
broader: keräilijä
in scheme: Metatietosanasto
preferred label: philatelist @en
preferred label: filatelist @sv

lennonopettaja
type: Concept
source: Kansallinen RDA-termi
source: YSO-termi
source: ALLFO-term @sv
source: Nationell RDA-term @sv
created: 2018-11-01
modified: 2024-08-27
alternative label: flight instructors @en
alternative label: lennonopettajat
broader: opettaja
in scheme: Metatietosanasto
preferred label: flight instructor @en
preferred label: flyglärare @sv

tasa-arvovaltuutettu
type: Concept
source: Kansallinen RDA-termi
source: YSO-termi
source: ALLFO-term @sv
source: Nationell RDA-term @sv
created: 2018-11-01
modified: 2024-08-27
alternative label: equal opportunities ombudsmen @en
alternative label: equality ombudsmen @en
alternative label: ombudsmen for equality @en
alternative label: tasa-arvovaltuutetut
alternative label: jämställdhetsombudsmän @sv
broader: valtuutettu
in scheme: Metatietosanasto
preferred label: ombudsman for equality @en
preferred label: jämställdhetsombudsman @sv

pappismunkki
type: Concept
source: Kansallinen RDA-termi
source: YSO-termi
source: ALLFO-term @sv
source: Nationell RDA-term @sv
created: 2018-11-01
modified: 2024-08-27
alternative label: pappismunkki (ammatti)
alternative label: prästmunk (yrke) @sv
broader: pappi
in scheme: Metatietosanasto
preferred label: prästmunk @sv

pukusuunnittelija
type: Concept
source: Kansallinen RDA-termi
source: YSO-termi
source: ALLFO-term @sv
source: Nationell RDA-term @sv
created: 2018-11-01
modified: 2024-08-27
alternative label: costume designers @en
alternative label: pukusuunnittelijat
broader: näyttämötaiteilija
in scheme: Metatietosanasto
preferred label: costume designer @en
preferred label: kostymdesigner @sv

luokanvalvoja
type: Concept
source: Kansallinen RDA-termi
source: YSO-termi
source: ALLFO-term @sv
source: Nationell RDA-term @sv
created: 2018-11-01
modified: 2024-08-27
alternative label: tutors @en
alternative label: luokanvalvojat
broader: opettaja
in scheme: Metatietosanasto
preferred label: tutor (class teacher) @en
preferred label: klassföreståndare @sv

henkilökohtainen avustaja
type: Concept
source: Kansallinen RDA-termi
source: YSO-termi
source: ALLFO-term @sv
source: Nationell RDA-term @sv
created: 2018-11-01
modified: 2024-08-27
alternative label: personal assistants @en
alternative label: henkilökohtaiset avustajat
alternative label: individuella assistenter @sv
alternative label: personliga assistenter @sv
broader: avustaja
in scheme: Metatietosanasto
preferred label: personal assistant @en
preferred label: personlig assistent @sv

freelancetyöntekijä
type: Concept
source: Kansallinen RDA-termi
source: YSO-termi
source: ALLFO-term @sv
source: Nationell RDA-term @sv
created: 2018-11-01
modified: 2024-08-27
alternative label: freelance workers @en
alternative label: freelance-työntekijät
alternative label: freelancearbetare @sv
broader: työntekijä
in scheme: Metatietosanasto
preferred label: freelance worker @en
preferred label: frilansarbetare @sv

silmälääkäri
type: Concept
source: Kansallinen RDA-termi
source: YSO-termi
source: ALLFO-term @sv
source: Nationell RDA-term @sv
created: 2018-11-01
modified: 2024-08-27
alternative label: ophthalmologists @en
alternative label: silmälääkärit
broader: lääkäri
in scheme: Metatietosanasto
preferred label: ophthalmologist @en
preferred label: ögonläkare @sv

postiautonkuljettaja
type: Concept
source: Kansallinen RDA-termi
source: YSO-termi
source: ALLFO-term @sv
source: Nationell RDA-term @sv
created: 2018-11-01
modified: 2024-08-27
alternative label: post car drivers @en
alternative label: post van drivers @en
alternative label: postiautonkuljettajat
alternative label: postbilsförare @sv
alternative label: postbusschaufförer @sv
alternative label: postchaufförer @sv
broader: autonkuljettaja
in scheme: Metatietosanasto
preferred label: post car driver @en
preferred label: postchaufför @sv

fyysikko
type: Concept
source: Kansallinen RDA-termi
source: YSO-termi
source: ALLFO-term @sv
source: Nationell RDA-term @sv
created: 2018-11-01
modified: 2024-08-27
alternative label: physicists @en
alternative label: fyysikot
in scheme: Metatietosanasto
narrower: sairaalafyysikko
preferred label: physicist @en
preferred label: fysiker @sv

aluearkkitehti
type: Concept
source: Kansallinen RDA-termi
source: YSO-termi
source: ALLFO-term @sv
source: Nationell RDA-term @sv
created: 2018-11-01
modified: 2024-08-27
alternative label: area planning architects @en
alternative label: regional architects @en
alternative label: aluearkkitehdit
alternative label: regionarkitekter @sv
broader: arkkitehti
in scheme: Metatietosanasto
preferred label: area architect @en
preferred label: regionarkitekt @sv

purjehtija
type: Concept
source: Kansallinen RDA-termi
source: YSO-termi
source: ALLFO-term @sv
source: Nationell RDA-term @sv
created: 2018-11-01
modified: 2024-08-27
alternative label: sailors @en
alternative label: purjehtijat
broader: urheilija
in scheme: Metatietosanasto
preferred label: sailor @en
preferred label: seglare @sv

mainospäällikkö
type: Concept
source: Kansallinen RDA-termi
source: YSO-termi
source: ALLFO-term @sv
source: Nationell RDA-term @sv
created: 2018-11-01
modified: 2024-08-27
alternative label: advertising directors @en
alternative label: advertising executives @en
alternative label: advertising managers @en
alternative label: mainospäälliköt
alternative label: reklamchefer @sv
broader: päällikkö
in scheme: Metatietosanasto
preferred label: advertising manager @en
preferred label: reklamchef @sv

sähkölaitosasentaja
type: Concept
source: Kansallinen RDA-termi
source: YSO-termi
source: ALLFO-term @sv
source: Nationell RDA-term @sv
created: 2018-11-01
modified: 2024-08-27
alternative label: power plant fitters @en
alternative label: power plant mechanics @en
alternative label: sähkölaitosasentajat
alternative label: elverksmontörer @sv
broader: asentaja
in scheme: Metatietosanasto
preferred label: power plant fitter @en
preferred label: elverksmontör @sv

lastenkirurgi
type: Concept
source: Kansallinen RDA-termi
source: YSO-termi
source: ALLFO-term @sv
source: Nationell RDA-term @sv
created: 2018-11-01
modified: 2024-08-27
alternative label: pediatric surgeons @en
alternative label: lastenkirurgit
alternative label: barnkirurger @sv
broader: kirurgi
in scheme: Metatietosanasto
preferred label: pediatric surgeon @en
preferred label: barnkirurg @sv

graafinen suunnittelija
type: Concept
source: Kansallinen RDA-termi
source: YSO-termi
source: ALLFO-term @sv
source: Nationell RDA-term @sv
created: 2018-11-01
modified: 2024-08-27
alternative label: graphic designers @en
alternative label: graafiset suunnittelijat
alternative label: grafiska formgivare @sv
broader: suunnittelija
in scheme: Metatietosanasto
preferred label: graphic designer @en
preferred label: grafisk formgivare @sv

koreografi
type: Concept
source: RDA-termi
source: RDA-term @sv
created: 2016-01-08
modified: 2026-02-18
alternative label: choreographer @en
alternative label: koreografi (toimija)
alternative label: koreograf (aktör) @sv
broader: teoksen tekijä
definition: Toimija, joka on vastuussa koreografisen teoksen luomisesta. (RDA Registry)
definition: Aktör som svarar för skapandet av ett koreografiskt verk. @sv
in scheme: Metatietosanasto
preferred label: choreographer agent @en
preferred label: koreograf @sv

kuluttaja-asiamies
type: Concept
source: Kansallinen RDA-termi
source: YSO-termi
source: ALLFO-term @sv
source: Nationell RDA-term @sv
created: 2018-11-01
modified: 2024-08-27
alternative label: consumer ombudsmen @en
alternative label: consumer ombudspersons @en
alternative label: kuluttaja-asiamiehet
alternative label: konsumentombud @sv
alternative label: konsumentombudsmän @sv
broader: asiamies
in scheme: Metatietosanasto
preferred label: consumer ombudsman @en
preferred label: konsumentombudsman @sv

kengitysseppä
type: Concept
source: Kansallinen RDA-termi
source: YSO-termi
source: ALLFO-term @sv
source: Nationell RDA-term @sv
created: 2018-11-01
modified: 2024-08-27
alternative label: farriers @en
alternative label: horseshoers @en
alternative label: kengityssepät
alternative label: hovsmeder @sv
broader: seppä
in scheme: Metatietosanasto
preferred label: farrier @en
preferred label: hovsmed @sv

kunto-ohjaaja
type: Concept
source: Kansallinen RDA-termi
source: YSO-termi
source: ALLFO-term @sv
source: Nationell RDA-term @sv
created: 2018-11-01
modified: 2024-08-27
alternative label: fitness instructors @en
alternative label: kunto-ohjaajat
broader: ohjaaja (kasvatus ja opastus)
in scheme: Metatietosanasto
preferred label: fitness trainer @en
preferred label: konditionstränare @sv

judoka
type: Concept
source: Kansallinen RDA-termi
source: YSO-termi
source: ALLFO-term @sv
source: Nationell RDA-term @sv
created: 2018-11-01
modified: 2024-08-27
alternative label: judokas @en
alternative label: judokat
broader: urheilija
in scheme: Metatietosanasto

lapsiohjaaja
type: Concept
source: Kansallinen RDA-termi
source: YSO-termi
source: ALLFO-term @sv
source: Nationell RDA-term @sv
created: 2018-11-01
modified: 2024-08-27
alternative label: children's instructors @en
alternative label: lastenohjaajat
alternative label: barnhandledare @sv
broader: ohjaaja (kasvatus ja opastus)
in scheme: Metatietosanasto
preferred label: children's instructor @en
preferred label: barnledare @sv

sotilasvirkamies
type: Concept
source: Kansallinen RDA-termi
source: YSO-termi
source: ALLFO-term @sv
source: Nationell RDA-term @sv
created: 2018-11-01
modified: 2024-08-27
alternative label: military officials @en
alternative label: sotilasvirkamiehet
alternative label: militärtjänstemän @sv
broader: sotilashenkilö
in scheme: Metatietosanasto
preferred label: military official @en
preferred label: militärtjänsteman @sv

psykoanalyytikko
type: Concept
source: Kansallinen RDA-termi
source: YSO-termi
source: ALLFO-term @sv
source: Nationell RDA-term @sv
created: 2018-11-01
modified: 2024-08-27
alternative label: psychoanalysts @en
alternative label: psykoanalyytikot
broader: psykoterapeutti
in scheme: Metatietosanasto
preferred label: psychoanalyst @en
preferred label: psykoanalytiker @sv

sarjakuvataiteilija
type: Concept
source: Kansallinen RDA-termi
source: YSO-termi
source: ALLFO-term @sv
source: Nationell RDA-term @sv
created: 2018-11-01
modified: 2024-08-27
alternative label: cartoonists @en
alternative label: comics artists @en
alternative label: sarjakuvapiirtäjät
alternative label: sarjakuvataiteilijat
alternative label: seriekonstnärer @sv
alternative label: serietecknare @sv
broader: piirtäjä
in scheme: Metatietosanasto
preferred label: comics artist @en
preferred label: serieskapare @sv

oikeusministeri
type: Concept
source: Kansallinen RDA-termi
source: YSO-termi
source: ALLFO-term @sv
source: Nationell RDA-term @sv
created: 2018-11-01
modified: 2024-08-27
alternative label: ministers of justice @en
alternative label: oikeusministerit
alternative label: justitieministrar @sv
broader: ministeri
in scheme: Metatietosanasto
preferred label: minister of justice @en
preferred label: justitieminister @sv

lukkari
type: Concept
source: Kansallinen RDA-termi
source: YSO-termi
source: ALLFO-term @sv
source: Nationell RDA-term @sv
created: 2018-11-01
modified: 2024-08-27
alternative label: parish clerks @en
alternative label: lukkarit
broader: kirkon työntekijä
in scheme: Metatietosanasto
preferred label: parish clerk @en
preferred label: klockare @sv

onkologi
type: Concept
source: Kansallinen RDA-termi
source: YSO-termi
source: ALLFO-term @sv
source: Nationell RDA-term @sv
created: 2018-11-01
modified: 2024-08-27
alternative label: oncologists @en
alternative label: onkologit
alternative label: onkologer @sv
broader: lääkäri
in scheme: Metatietosanasto
preferred label: oncologist @en
preferred label: onkolog @sv

kirkkoneuvos
type: Concept
source: Kansallinen RDA-termi
source: YSO-termi
source: ALLFO-term @sv
source: Nationell RDA-term @sv
created: 2018-11-01
modified: 2024-08-27
alternative label: chief administrative officers in church @en
alternative label: kirkkoneuvokset
broader: virkamies
in scheme: Metatietosanasto
preferred label: chief administrative officer in church @en
preferred label: ecklesiastikråd @sv

hovioikeuden presidentti
type: Concept
source: Kansallinen RDA-termi
source: YSO-termi
source: ALLFO-term @sv
source: Nationell RDA-term @sv
created: 2018-11-01
modified: 2024-08-27
alternative label: chief justices of Courts of Appeal @en
alternative label: hovioikeuden presidentit
alternative label: hovrättspresidenter @sv
broader: virkamies
in scheme: Metatietosanasto
preferred label: Chief Justice of Court of Appeal @en
preferred label: hovrättspresident @sv

vakuutusmeklari
type: Concept
source: Kansallinen RDA-termi
source: YSO-termi
source: ALLFO-term @sv
source: Nationell RDA-term @sv
created: 2018-11-01
modified: 2024-08-27
alternative label: vakuutusmeklarit
broader: meklari
in scheme: Metatietosanasto
preferred label: försäkringsmäklare @sv

kondiittori
type: Concept
source: Kansallinen RDA-termi
source: YSO-termi
source: ALLFO-term @sv
source: Nationell RDA-term @sv
created: 2018-11-01
modified: 2024-08-27
alternative label: confectioners @en
alternative label: kondiittorit
alternative label: konditorer @sv
broader: leipuri
in scheme: Metatietosanasto
preferred label: confectioner @en
preferred label: konditor @sv

tuotantoyhtiö
type: Concept
source: RDA-termi
source: RDA-term @sv
created: 2016-01-08
modified: 2025-08-23
broader: teoksen tekijä
definition: Yhteisö, joka vastaa näyttämö-, elokuva-, äänite-, televisio-, suoratoistolähetys- tms. tuotannon taloudellisesta, teknisestä ja organisatorisesta johtamisesta. (RDA Registry)
definition: Institution som svarar för den ekonomiska, tekniska och organisatoriska ledningen av en scen-, film-, ljudupptagnings-, tv-, streaming- eller dylik produktion. @sv
in scheme: Metatietosanasto
preferred label: production company @en
preferred label: produktionsbolag @sv

diakonissa
type: Concept
source: Kansallinen RDA-termi
source: YSO-termi
source: ALLFO-term @sv
source: Nationell RDA-term @sv
created: 2018-11-01
modified: 2024-08-27
alternative label: deaconesses @en
alternative label: diakonissat
alternative label: diakonissor @sv
broader: kirkon työntekijä
in scheme: Metatietosanasto
preferred label: deaconess @en

pääministeri
type: Concept
source: Kansallinen RDA-termi
source: YSO-termi
source: ALLFO-term @sv
source: Nationell RDA-term @sv
created: 2018-11-01
modified: 2024-08-27
alternative label: prime ministers @en
alternative label: pääministerit
alternative label: premiärministrar @sv
alternative label: statsministrar @sv
broader: ministeri
in scheme: Metatietosanasto
preferred label: prime minister @en
preferred label: statsminister @sv

työterveyslääkäri
type: Concept
source: Kansallinen RDA-termi
source: YSO-termi
source: ALLFO-term @sv
source: Nationell RDA-term @sv
created: 2018-11-01
modified: 2024-08-27
alternative label: occupational health physicians @en
alternative label: työterveyslääkärit
alternative label: företagshälsovårdsläkare @sv
broader: lääkäri
in scheme: Metatietosanasto
preferred label: occupational health physician @en
preferred label: företagsläkare @sv

vapaa-ajanohjaaja
type: Concept
source: Kansallinen RDA-termi
source: YSO-termi
source: ALLFO-term @sv
source: Nationell RDA-term @sv
created: 2018-11-01
modified: 2024-08-27
alternative label: leisure instructors @en
alternative label: vapaa-ajanohjaajat
alternative label: fritidspedagoger @sv
broader: ohjaaja (kasvatus ja opastus)
in scheme: Metatietosanasto
preferred label: leisure instructor @en
preferred label: fritidsledare @sv

kartanlukija
type: Concept
source: Kansallinen RDA-termi
source: YSO-termi
source: ALLFO-term @sv
source: Nationell RDA-term @sv
created: 2018-11-01
modified: 2024-08-27
alternative label: co-drivers @en
alternative label: kakkosajajat
alternative label: kakkoskuljettajat
alternative label: kartanlukijat
broader: kilpa-autoilija
in scheme: Metatietosanasto
preferred label: co-driver @en
preferred label: kartläsare @sv

taksinkuljettaja
type: Concept
source: Kansallinen RDA-termi
source: YSO-termi
source: ALLFO-term @sv
source: Nationell RDA-term @sv
created: 2018-11-01
modified: 2024-08-27
alternative label: taxi drivers @en
alternative label: taksiautoilijat
alternative label: taksikuskit
alternative label: taksinkuljettajat
alternative label: taxichaufförer @sv
broader: autonkuljettaja
in scheme: Metatietosanasto
preferred label: taxi driver @en
preferred label: taxichaufför @sv

yritysjohtaja
type: Concept
source: Kansallinen RDA-termi
source: YSO-termi
source: ALLFO-term @sv
source: Nationell RDA-term @sv
created: 2018-11-01
modified: 2024-08-27
alternative label: business leaders @en
alternative label: business managers @en
alternative label: corporate executives @en
alternative label: yritysjohtajat
alternative label: företagschefer @sv
broader: johtaja
in scheme: Metatietosanasto
preferred label: business leader @en
preferred label: företagsledare @sv

keittiöpäällikkö
type: Concept
source: Kansallinen RDA-termi
source: YSO-termi
source: ALLFO-term @sv
source: Nationell RDA-term @sv
created: 2018-11-01
modified: 2024-08-27
alternative label: kitchen supervisors @en
alternative label: keittiöpäälliköt
alternative label: kökschefer @sv
broader: päällikkö
in scheme: Metatietosanasto
preferred label: kitchen supervisor @en
preferred label: kökschef @sv

kansankertoja
type: Concept
source: Kansallinen RDA-termi
source: YSO-termi
source: ALLFO-term @sv
source: Nationell RDA-term @sv
created: 2018-11-01
modified: 2024-08-27
alternative label: tellers of folktales @en
alternative label: kansankertojat
alternative label: folkliga berättare @sv
broader: perinteentaitaja
in scheme: Metatietosanasto
preferred label: teller of folktales @en
preferred label: folklig berättare @sv

kelloseppä
type: Concept
source: Kansallinen RDA-termi
source: YSO-termi
source: ALLFO-term @sv
source: Nationell RDA-term @sv
created: 2018-11-01
modified: 2024-08-27
alternative label: watchmakers and clockmakers @en
alternative label: kellosepät
broader: seppä
in scheme: Metatietosanasto
preferred label: watchmaker/clockmaker @en
preferred label: urmakare @sv

virtuoosi
type: Concept
source: Kansallinen RDA-termi
source: YSO-termi
source: ALLFO-term @sv
source: Nationell RDA-term @sv
created: 2018-11-01
modified: 2024-08-27
alternative label: virtuosos @en
alternative label: virtuoosit
alternative label: virtuoser @sv
broader: esittäjä
in scheme: Metatietosanasto
preferred label: virtuoso @en
preferred label: virtuos @sv

rauhanturvaaja
type: Concept
source: Kansallinen RDA-termi
source: YSO-termi
source: ALLFO-term @sv
source: Nationell RDA-term @sv
created: 2018-11-01
modified: 2024-08-27
alternative label: peacekeepers @en
alternative label: rauhanturvaajat
broader: sotilas
in scheme: Metatietosanasto
preferred label: peacekeeper @en
preferred label: fredsbevarare @sv

elektroniikka-asentaja
type: Concept
source: Kansallinen RDA-termi
source: YSO-termi
source: ALLFO-term @sv
source: Nationell RDA-term @sv
created: 2018-11-01
modified: 2024-08-27
alternative label: electronics assemblers @en
alternative label: elektroniikka-asentajat
alternative label: elektronikmontörer @sv
broader: asentaja
in scheme: Metatietosanasto
preferred label: electronics assembler @en
preferred label: elektronikmontör @sv

potilasasiamies
type: Concept
source: Kansallinen RDA-termi
source: YSO-termi
source: ALLFO-term @sv
source: Nationell RDA-term @sv
created: 2018-11-01
modified: 2024-08-27
alternative label: patient ombudsmen @en
alternative label: patient ombudspersons @en
alternative label: potilasasiamiehet
alternative label: patientombud @sv
alternative label: patientombudsmän @sv
broader: asiamies
in scheme: Metatietosanasto
preferred label: patient ombudsman @en
preferred label: patientombudsman @sv

vakoilija
type: Concept
source: Kansallinen RDA-termi
source: YSO-termi
source: ALLFO-term @sv
source: Nationell RDA-term @sv
created: 2018-11-01
modified: 2024-08-27
alternative label: spies @en
alternative label: agentit
alternative label: salaiset agentit
alternative label: vakoilijat
alternative label: vakoojat
alternative label: agenter @sv
alternative label: spioner @sv
in scheme: Metatietosanasto
narrower: kaksoisagentti
preferred label: spy @en
preferred label: spion @sv

tekstiilisuunnittelija
type: Concept
source: Kansallinen RDA-termi
source: YSO-termi
source: ALLFO-term @sv
source: Nationell RDA-term @sv
created: 2018-11-01
modified: 2024-08-27
alternative label: textile designers @en
alternative label: tekstiilisuunnittelijat
alternative label: textildesigner @sv
alternative label: textilformgivare @sv
broader: suunnittelija
in scheme: Metatietosanasto
preferred label: textile designer @en
preferred label: textildesigner (yrke) @sv

vankilapappi
type: Concept
source: Kansallinen RDA-termi
source: YSO-termi
source: ALLFO-term @sv
source: Nationell RDA-term @sv
created: 2018-11-01
modified: 2024-08-27
alternative label: prison chaplains @en
alternative label: vankilapapit
alternative label: fängelsepräster @sv
broader: pappi
in scheme: Metatietosanasto
preferred label: prison chaplain @en
preferred label: fängelsepräst @sv

harrastajamuusikko
type: Concept
source: Kansallinen RDA-termi
source: YSO-termi
source: ALLFO-term @sv
source: Nationell RDA-term @sv
created: 2018-11-01
modified: 2024-08-27
alternative label: amateur musicians @en
alternative label: amatöörimuusikot
alternative label: harrastajamuusikot
broader: muusikko
in scheme: Metatietosanasto
preferred label: amateur musician @en
preferred label: amatörmusiker @sv

oikeuslääkäri
type: Concept
source: Kansallinen RDA-termi
source: YSO-termi
source: ALLFO-term @sv
source: Nationell RDA-term @sv
created: 2018-11-01
modified: 2024-08-27
alternative label: forensic pathologists @en
alternative label: oikeuslääkärit
alternative label: oikeuspatologit
alternative label: rättspatologer @sv
broader: lääkäri
in scheme: Metatietosanasto
preferred label: forensic pathologist @en
preferred label: rättsläkare @sv

perinteentutkija
type: Concept
source: Kansallinen RDA-termi
source: YSO-termi
source: ALLFO-term @sv
source: Nationell RDA-term @sv
created: 2018-11-01
modified: 2024-08-27
alternative label: folklorists @en
alternative label: folkloristi
alternative label: perinteentutkijat
broader: tutkija
in scheme: Metatietosanasto
preferred label: folklorist @en
preferred label: traditionsforskare @sv

ruokatoimittaja
type: Concept
source: Kansallinen RDA-termi
source: YSO-termi
source: ALLFO-term @sv
source: Nationell RDA-term @sv
created: 2018-11-01
modified: 2024-08-27
alternative label: food editors @en
alternative label: ruokatoimittajat
alternative label: matjournalister @sv
alternative label: matredaktörer @sv
alternative label: matreportrar @sv
broader: toimittaja
in scheme: Metatietosanasto
preferred label: food editor @en
preferred label: matjournalist @sv

säätiö
type: Concept
source: Kansallinen RDA-termi
source: Nationell RDA-term @sv
created: 2016-01-08
modified: 2024-05-24
alternative label: apurahasäätiö
alternative label: huoltosäätiö
alternative label: kulttuurisäätiö
alternative label: tukisäätiö
alternative label: kulturstiftelse @sv
alternative label: stipendiestiftelse @sv
alternative label: stödstiftelse @sv
definition: Rekisteröity säätiö eli itsenäinen säätiö (myös pelkkä säätiö) on Suomen lain mukaan oikeushenkilö, joka muodostuu tiettyyn tarkoitukseen käytettäväksi luovutetusta omaisuudesta. Säätiöitä koskee säätiölaki.
definition: En registrerad stiftelse är enligt finländsk lag en självständig juridisk person som bildas av överlåten egendom avsedd att användas för ett visst syfte. Stiftelser regleras av stiftelselagen. @sv
example: Juho ja Maria Lallukan taiteilijakoti (säätiö)
example: Konstsamfundet (stiftelse) @sv
in scheme: Metatietosanasto
preferred label: stiftelse @sv
related: järjestö

hallintojohtaja
type: Concept
source: Kansallinen RDA-termi
source: YSO-termi
source: ALLFO-term @sv
source: Nationell RDA-term @sv
created: 2018-11-01
modified: 2024-08-27
alternative label: administrative directors @en
alternative label: directors of administration @en
alternative label: hallintojohtajat
alternative label: förvaltningsdirektörer @sv
broader: johtaja
in scheme: Metatietosanasto
preferred label: director of administration @en
preferred label: förvaltningsdirektör @sv

miksaaja
type: Concept
source: Kansallinen RDA-termi
source: YSO-termi
source: ALLFO-term @sv
source: Nationell RDA-term @sv
created: 2018-11-01
modified: 2024-08-27
alternative label: miksaaja (ammatti)
alternative label: mixer (yrke) @sv
broader: ääniteknikko
in scheme: Metatietosanasto
preferred label: mixing engineer @en
preferred label: mixer @sv

tietotekniikka-asentaja
type: Concept
source: Kansallinen RDA-termi
source: YSO-termi
source: ALLFO-term @sv
source: Nationell RDA-term @sv
created: 2018-11-01
modified: 2024-08-27
alternative label: information technology installers @en
alternative label: information technology technicians @en
alternative label: tietotekniikka-asentajat
alternative label: ICT-montörer @sv
alternative label: datateknikinstallatörer @sv
broader: asentaja
in scheme: Metatietosanasto
preferred label: information technology technician @en
preferred label: ICT-montör @sv

psykiatrian sairaanhoitaja
type: Concept
source: Kansallinen RDA-termi
source: YSO-termi
source: ALLFO-term @sv
source: Nationell RDA-term @sv
created: 2018-11-01
modified: 2024-08-27
alternative label: psychiatric nurses @en
alternative label: psykiatrian sairaanhoitajat
alternative label: psykiatriska sjukvårdare @sv
broader: sairaanhoitaja
in scheme: Metatietosanasto
preferred label: psychiatric nurse @en
preferred label: psykiatrisk sjukvårdare @sv

saksofonisti
type: Concept
source: Kansallinen RDA-termi
source: YSO-termi
source: ALLFO-term @sv
source: Nationell RDA-term @sv
created: 2018-11-01
modified: 2024-08-27
alternative label: saxophonists @en
alternative label: saksofonistit
alternative label: saxofonister @sv
broader: soittaja
in scheme: Metatietosanasto
preferred label: saxophonist @en
preferred label: saxofonist @sv

lentopalloilija
type: Concept
source: Kansallinen RDA-termi
source: YSO-termi
source: ALLFO-term @sv
source: Nationell RDA-term @sv
created: 2018-11-01
modified: 2024-08-27
alternative label: volleyball players @en
alternative label: lentopalloilijat
broader: urheilija
in scheme: Metatietosanasto
preferred label: volleyball player @en
preferred label: volleybollspelare @sv

rauhantutkija
type: Concept
source: Kansallinen RDA-termi
source: YSO-termi
source: ALLFO-term @sv
source: Nationell RDA-term @sv
created: 2018-11-01
modified: 2024-08-27
alternative label: peace researchers @en
alternative label: rauhantutkijat
broader: tutkija
in scheme: Metatietosanasto
preferred label: peace researcher @en
preferred label: fredsforskare @sv

polkupyörälähetti
type: Concept
source: Kansallinen RDA-termi
source: YSO-termi
source: ALLFO-term @sv
source: Nationell RDA-term @sv
created: 2018-11-01
modified: 2024-08-27
alternative label: bicycle couriers @en
alternative label: bicycle messengers @en
alternative label: polkupyörälähetit
alternative label: cykelkurirer @sv
broader: lähetti
in scheme: Metatietosanasto
preferred label: bicycle messenger @en
preferred label: cykelbud @sv

keihäänheittäjä
type: Concept
source: Kansallinen RDA-termi
source: YSO-termi
source: ALLFO-term @sv
source: Nationell RDA-term @sv
created: 2018-11-01
modified: 2024-08-27
alternative label: javelin throwers @en
alternative label: keihäänheittäjät
broader: yleisurheilija
in scheme: Metatietosanasto
preferred label: javelin thrower @en
preferred label: spjutkastare @sv

uskonnonopettaja
type: Concept
source: Kansallinen RDA-termi
source: YSO-termi
source: ALLFO-term @sv
source: Nationell RDA-term @sv
created: 2018-11-01
modified: 2024-08-27
alternative label: teachers of religious education @en
alternative label: uskonnonopettajat
broader: aineenopettaja
in scheme: Metatietosanasto
preferred label: teacher of religious education @en
preferred label: religionslärare @sv

paperityöntekijä
type: Concept
source: Kansallinen RDA-termi
source: YSO-termi
source: ALLFO-term @sv
source: Nationell RDA-term @sv
created: 2018-11-01
modified: 2024-08-27
alternative label: paper industry workers @en
alternative label: paperiteollisuuden työntekijät
alternative label: paperityöläiset
alternative label: paperityöntekijät
broader: työntekijä
in scheme: Metatietosanasto
preferred label: paper industry worker @en
preferred label: pappersarbetare @sv

arkistonhoitaja
type: Concept
source: Kansallinen RDA-termi
source: YSO-termi
source: ALLFO-term @sv
source: Nationell RDA-term @sv
created: 2018-11-01
modified: 2024-08-27
alternative label: archivists @en
alternative label: arkistonhoitajat
alternative label: arkivarier @sv
in scheme: Metatietosanasto
narrower: valtionarkistonhoitaja
preferred label: archivist @en
preferred label: arkivarie @sv

taidemaalari
type: Concept
source: Kansallinen RDA-termi
source: YSO-termi
source: ALLFO-term @sv
source: Nationell RDA-term @sv
created: 2018-11-01
modified: 2024-08-27
alternative label: painters @en
alternative label: maalarit
alternative label: taidemaalarit
alternative label: konstmålare @sv
alternative label: målare @sv
broader: kuvataiteilija
in scheme: Metatietosanasto
preferred label: painter (visual artist) @en
preferred label: målare (konstnär) @sv

baritoni
type: Concept
source: Kansallinen RDA-termi
source: YSO-termi
source: ALLFO-term @sv
source: Nationell RDA-term @sv
created: 2018-11-01
modified: 2024-08-27
alternative label: baritonilaulajat
alternative label: baritonit
alternative label: laulajat -- baritoni
alternative label: baryton (sångare) @sv
alternative label: barytoner @sv
alternative label: barytonsångare @sv
broader: mieslaulaja
in scheme: Metatietosanasto
preferred label: baryton @sv

televisiotoimittaja
type: Concept
source: Kansallinen RDA-termi
source: YSO-termi
source: ALLFO-term @sv
source: Nationell RDA-term @sv
created: 2018-11-01
modified: 2024-08-27
alternative label: television journalists @en
alternative label: television reporters @en
alternative label: televisiotoimittajat
alternative label: tv-toimittajat
alternative label: TV-journalister @sv
alternative label: tevejournalister @sv
alternative label: teveredaktörer @sv
alternative label: tevereportrar @sv
alternative label: tv-journalister @sv
alternative label: tv-redaktörer @sv
alternative label: tv-reportrar @sv
broader: toimittaja
in scheme: Metatietosanasto
preferred label: television journalist @en
preferred label: tv-journalist @sv

puutarhatyöntekijä
type: Concept
source: Kansallinen RDA-termi
source: YSO-termi
source: ALLFO-term @sv
source: Nationell RDA-term @sv
created: 2018-11-01
modified: 2024-08-27
alternative label: garden workers @en
alternative label: puutarhatyöntekijät
broader: työntekijä
in scheme: Metatietosanasto
preferred label: garden worker @en
preferred label: trädgårdsarbetare @sv

tiedetoimittaja
type: Concept
source: Kansallinen RDA-termi
source: YSO-termi
source: ALLFO-term @sv
source: Nationell RDA-term @sv
created: 2018-11-01
modified: 2024-08-27
alternative label: science editors @en
alternative label: science journalists @en
alternative label: tiedetoimittajat
alternative label: vetenskapsjournalister @sv
alternative label: vetenskapsredaktörer @sv
broader: toimittaja
in scheme: Metatietosanasto
preferred label: science editor @en
preferred label: vetenskapsredaktör @sv

hotellivirkailija
type: Concept
source: Kansallinen RDA-termi
source: YSO-termi
source: ALLFO-term @sv
source: Nationell RDA-term @sv
created: 2018-11-01
modified: 2024-08-27
alternative label: hotel receptionists @en
alternative label: hotellivirkailijat
alternative label: hotellanställd @sv
alternative label: hotellreceptionister @sv
alternative label: receptionist @sv
broader: virkailija
in scheme: Metatietosanasto
preferred label: hotel receptionist @en
preferred label: hotellreceptionist @sv

maakuntajohtaja
type: Concept
source: Kansallinen RDA-termi
source: YSO-termi
source: ALLFO-term @sv
source: Nationell RDA-term @sv
created: 2018-11-01
modified: 2024-08-27
alternative label: region mayors @en
alternative label: maakuntajohtajat
alternative label: landskapsdirektörer @sv
broader: johtaja
in scheme: Metatietosanasto
preferred label: region mayor @en
preferred label: landskapsdirektör @sv

metsätalousinsinööri
type: Concept
source: Kansallinen RDA-termi
source: YSO-termi
source: ALLFO-term @sv
source: Nationell RDA-term @sv
created: 2018-11-01
modified: 2024-08-27
alternative label: forestry engineers @en
alternative label: metsätalousinsinöörit
alternative label: skogsbruksingenjörer @sv
broader: insinööri
in scheme: Metatietosanasto
preferred label: forestry engineer @en
preferred label: skogsbruksingenjör @sv

atk-suunnittelija
type: Concept
source: Kansallinen RDA-termi
source: YSO-termi
source: ALLFO-term @sv
source: Nationell RDA-term @sv
created: 2018-11-01
modified: 2024-08-27
alternative label: data systems designers @en
alternative label: atk-suunnittelijat
alternative label: ADB-planerare @sv
alternative label: dataplanerare @sv
broader: suunnittelija
in scheme: Metatietosanasto
preferred label: data systems designer @en
preferred label: adb-planerare @sv

valosuunnittelija
type: Concept
source: Kansallinen RDA-termi
source: YSO-termi
source: ALLFO-term @sv
source: Nationell RDA-term @sv
created: 2018-11-01
modified: 2024-08-27
alternative label: lighting designers @en
alternative label: valosuunnittelijat
broader: näyttämötaiteilija
in scheme: Metatietosanasto
preferred label: lighting designer @en
preferred label: ljusdesigner @sv

merimiespappi
type: Concept
source: Kansallinen RDA-termi
source: YSO-termi
source: ALLFO-term @sv
source: Nationell RDA-term @sv
created: 2018-11-01
modified: 2024-08-27
alternative label: seamen's ministers @en
alternative label: merimiespapit
alternative label: sjömanspräster @sv
broader: pappi
in scheme: Metatietosanasto
preferred label: seamen's minister @en
preferred label: sjömanspräst @sv

raitiovaununkuljettaja
type: Concept
source: Kansallinen RDA-termi
source: YSO-termi
source: ALLFO-term @sv
source: Nationell RDA-term @sv
created: 2018-11-01
modified: 2024-08-27
alternative label: tram drivers @en
alternative label: raitiovaununkuljettajat
broader: kuljettaja
in scheme: Metatietosanasto
preferred label: tram driver @en
preferred label: spårvagnsförare @sv

metsätyöntekijä
type: Concept
source: Kansallinen RDA-termi
source: YSO-termi
source: ALLFO-term @sv
source: Nationell RDA-term @sv
created: 2018-11-01
modified: 2024-08-27
alternative label: metsätyömies
broader: työntekijä
in scheme: Metatietosanasto
preferred label: forest worker @en
preferred label: skogsarbetare @sv

urkuri
type: Concept
source: Kansallinen RDA-termi
source: YSO-termi
source: ALLFO-term @sv
source: Nationell RDA-term @sv
created: 2018-11-01
modified: 2024-08-27
alternative label: organists @en
alternative label: urkurit
alternative label: organister @sv
broader: soittaja
in scheme: Metatietosanasto
preferred label: organist @en

näytelmäkirjailija
type: Concept
source: Kansallinen RDA-termi
source: YSO-termi
source: ALLFO-term @sv
source: Nationell RDA-term @sv
created: 2018-11-01
modified: 2024-08-27
alternative label: playwrights @en
alternative label: näytelmäkirjailijat
broader: kirjailija
in scheme: Metatietosanasto
preferred label: playwright @en
preferred label: dramatiker @sv

lapsiasiavaltuutettu
type: Concept
source: Kansallinen RDA-termi
source: YSO-termi
source: ALLFO-term @sv
source: Nationell RDA-term @sv
created: 2018-11-01
modified: 2024-08-27
alternative label: comissioners for children @en
alternative label: ombudsmen for children @en
alternative label: lapsiasiainvaltuutetut
alternative label: lapsiasiamiehet
alternative label: lapsiasiavaltuutetut
alternative label: barnombudsmän @sv
broader: valtuutettu
in scheme: Metatietosanasto
preferred label: ombudsman for children @en
preferred label: barnombudsman @sv

lentokonemekaanikko
type: Concept
source: Kansallinen RDA-termi
source: YSO-termi
source: ALLFO-term @sv
source: Nationell RDA-term @sv
created: 2018-11-01
modified: 2024-08-27
alternative label: aircraft mechanics @en
alternative label: aviation mechanics @en
alternative label: lentokonemekaanikot
broader: mekaanikko
in scheme: Metatietosanasto
preferred label: aircraft mechanic (occupation) @en
preferred label: flygmekaniker @sv

voimistelija
type: Concept
source: Kansallinen RDA-termi
source: YSO-termi
source: ALLFO-term @sv
source: Nationell RDA-term @sv
created: 2018-11-01
modified: 2024-08-27
alternative label: gymnasts @en
alternative label: voimistelijat
alternative label: gymnaster @sv
broader: urheilija
in scheme: Metatietosanasto
preferred label: gymnast @en

leipurimestari
type: Concept
source: Kansallinen RDA-termi
source: YSO-termi
source: ALLFO-term @sv
source: Nationell RDA-term @sv
created: 2018-11-01
modified: 2024-08-27
alternative label: master bakers @en
alternative label: leipurimestarit
broader: leipuri
in scheme: Metatietosanasto
preferred label: master baker @en
preferred label: bagarmästare @sv

elokuvanäyttelijä
type: Concept
source: Kansallinen RDA-termi
source: YSO-termi
source: ALLFO-term @sv
source: Nationell RDA-term @sv
created: 2018-11-01
modified: 2024-08-27
alternative label: film actors @en
alternative label: elokuvanäyttelijät
alternative label: filmitähdet
alternative label: filmstjärnor @sv
broader: näyttelijä
in scheme: Metatietosanasto
preferred label: film actor @en
preferred label: filmskådespelare @sv

imaami
type: Concept
source: Kansallinen RDA-termi
source: YSO-termi
source: ALLFO-term @sv
source: Nationell RDA-term @sv
created: 2018-11-01
modified: 2024-08-27
alternative label: imams @en
alternative label: imaamit
alternative label: imamer @sv
broader: uskonnollinen johtaja
in scheme: Metatietosanasto
preferred label: imam @en

erikoishammaslääkäri
type: Concept
source: Kansallinen RDA-termi
source: YSO-termi
source: ALLFO-term @sv
source: Nationell RDA-term @sv
created: 2018-11-01
modified: 2024-08-27
alternative label: dental specialists @en
alternative label: erikoishammaslääkärit
broader: hammaslääkäri
in scheme: Metatietosanasto
preferred label: dental specialist @en
preferred label: specialtandläkare @sv

basso
type: Concept
source: Kansallinen RDA-termi
source: YSO-termi
source: ALLFO-term @sv
source: Nationell RDA-term @sv
created: 2018-11-01
modified: 2024-08-27
alternative label: basses @en
alternative label: bassolaulajat
alternative label: bassot
alternative label: laulaja (basso)
alternative label: bas (sångare) @sv
alternative label: basar @sv
alternative label: bassångare @sv
alternative label: sångare (bas) @sv
broader: mieslaulaja
in scheme: Metatietosanasto
preferred label: bass (singer) @en
preferred label: bas @sv

matkailuyrittäjä
type: Concept
source: Kansallinen RDA-termi
source: YSO-termi
source: ALLFO-term @sv
source: Nationell RDA-term @sv
created: 2018-11-01
modified: 2024-08-27
alternative label: tourism entrepreneurs @en
alternative label: matkailuyrittäjät
broader: yrittäjä
in scheme: Metatietosanasto
preferred label: tourism entrepreneur @en
preferred label: turismföretagare @sv

automaatioinsinööri
type: Concept
source: Kansallinen RDA-termi
source: YSO-termi
source: ALLFO-term @sv
source: Nationell RDA-term @sv
created: 2018-11-01
modified: 2024-08-27
alternative label: automation engineers @en
alternative label: automaatioinsinöörit
alternative label: automationsingenjörer @sv
broader: insinööri
in scheme: Metatietosanasto
preferred label: automation engineer @en
preferred label: automationsingenjör @sv

malli
type: Concept
source: Kansallinen RDA-termi
source: YSO-termi
source: ALLFO-term @sv
source: Nationell RDA-term @sv
created: 2018-11-01
modified: 2024-08-27
alternative label: malli (ammatti)
alternative label: mannekiini
alternative label: mannekäng @sv
alternative label: modell @sv
in scheme: Metatietosanasto
narrower: valokuvamalli
preferred label: modell (yrke) @sv

kisälli
type: Concept
source: Kansallinen RDA-termi
source: YSO-termi
source: ALLFO-term @sv
source: Nationell RDA-term @sv
created: 2018-11-01
modified: 2024-08-27
alternative label: journey workers @en
alternative label: journeymen @en
alternative label: kisällit
alternative label: gesäller @sv
broader: käsityöläinen
in scheme: Metatietosanasto
preferred label: journeyman @en
preferred label: gesäll @sv

cembalisti
type: Concept
source: Kansallinen RDA-termi
source: YSO-termi
source: ALLFO-term @sv
source: Nationell RDA-term @sv
created: 2018-11-01
modified: 2024-08-27
alternative label: harpsichordists @en
alternative label: cembalistit
alternative label: klavesinistit
alternative label: cembalister @sv
alternative label: klavecinister @sv
broader: soittaja
in scheme: Metatietosanasto
preferred label: harpsichordist @en
preferred label: cembalist @sv

systeemisuunnittelija
type: Concept
source: Kansallinen RDA-termi
source: YSO-termi
source: ALLFO-term @sv
source: Nationell RDA-term @sv
created: 2018-11-01
modified: 2024-08-27
alternative label: systems designers @en
alternative label: systeeminsuunnittelijat
alternative label: systeemisuunnittelijat
broader: suunnittelija
in scheme: Metatietosanasto
preferred label: systems designer @en
preferred label: systemplanerare @sv

allergologi
type: Concept
source: Kansallinen RDA-termi
source: YSO-termi
source: ALLFO-term @sv
source: Nationell RDA-term @sv
created: 2018-11-01
modified: 2024-08-27
alternative label: allergists @en
alternative label: allergologists @en
alternative label: allergologit
alternative label: allergologer @sv
broader: lääkäri
in scheme: Metatietosanasto
preferred label: allergologist @en
preferred label: allergolog @sv

pikaluistelija
type: Concept
source: Kansallinen RDA-termi
source: YSO-termi
source: ALLFO-term @sv
source: Nationell RDA-term @sv
created: 2018-11-01
modified: 2024-08-27
alternative label: speed skaters @en
alternative label: pikaluistelijat
alternative label: hastighetsskridskoåkare @sv
alternative label: hastighetsåkare på skridskor @sv
broader: luistelija
in scheme: Metatietosanasto
preferred label: speed skater @en
preferred label: snabbskrinnare @sv

moottoripyöräilijä
type: Concept
source: Kansallinen RDA-termi
source: YSO-termi
source: ALLFO-term @sv
source: Nationell RDA-term @sv
created: 2018-11-01
modified: 2024-08-27
alternative label: bikers @en
alternative label: motorcyclists @en
alternative label: moottoripyöräilijät
alternative label: motorcyklister @sv
broader: urheilija
in scheme: Metatietosanasto
preferred label: motorcyclist @en
preferred label: motorcyklist @sv

vammaisten avustaja
type: Concept
source: Kansallinen RDA-termi
source: YSO-termi
source: ALLFO-term @sv
source: Nationell RDA-term @sv
created: 2018-11-01
modified: 2024-08-27
alternative label: assistants for disabled people @en
alternative label: vammaisten avustajat
alternative label: assistenter till funktionshindrade @sv
alternative label: assistenter till handikappade @sv
alternative label: handikappassistenter @sv
broader: avustaja
in scheme: Metatietosanasto
preferred label: assistant for disabled people @en
preferred label: handikappassistent @sv

sairaalapappi
type: Concept
source: Kansallinen RDA-termi
source: YSO-termi
source: ALLFO-term @sv
source: Nationell RDA-term @sv
created: 2018-11-01
modified: 2024-08-27
alternative label: hospital priests @en
alternative label: sairaalapapit
alternative label: sairaalapastori
alternative label: sjukhuspastor @sv
alternative label: sjukhuspräster @sv
broader: pappi
in scheme: Metatietosanasto
preferred label: hospital priest @en
preferred label: sjukhuspräst @sv

trukinkuljettaja
type: Concept
source: Kansallinen RDA-termi
source: YSO-termi
source: ALLFO-term @sv
source: Nationell RDA-term @sv
created: 2018-11-01
modified: 2024-08-27
alternative label: forklift operators @en
alternative label: trukinkuljettajat
broader: kuljettaja
in scheme: Metatietosanasto
preferred label: forklift operator @en
preferred label: truckförare @sv

viulunrakentaja
type: Concept
source: Kansallinen RDA-termi
source: YSO-termi
source: ALLFO-term @sv
source: Nationell RDA-term @sv
created: 2018-11-01
modified: 2024-08-27
alternative label: violin makers @en
alternative label: viulunrakentajat
broader: soitinrakentaja
in scheme: Metatietosanasto
preferred label: violin maker @en
preferred label: violinbyggare @sv

tanssinopettaja
type: Concept
source: Kansallinen RDA-termi
source: YSO-termi
source: ALLFO-term @sv
source: Nationell RDA-term @sv
created: 2018-11-01
modified: 2024-08-27
alternative label: dance teachers @en
alternative label: tanssinopettajat
alternative label: danspedagog @sv
broader: opettaja
in scheme: Metatietosanasto
preferred label: dance teacher @en
preferred label: danslärare @sv

musiikkikustantaja
type: Concept
source: Kansallinen RDA-termi
source: YSO-termi
source: ALLFO-term @sv
source: Nationell RDA-term @sv
created: 2018-11-01
modified: 2024-08-27
alternative label: music publishers @en
alternative label: musiikkikustantajat
alternative label: musiikkikustantamot
alternative label: nuottikustantajat
alternative label: nuottikustantamot
alternative label: musikförläggare @sv
alternative label: notförlag @sv
broader: kustantaja
in scheme: Metatietosanasto
preferred label: music publisher @en
preferred label: musikförlag @sv

altto
type: Concept
source: Kansallinen RDA-termi
source: YSO-termi
source: ALLFO-term @sv
source: Nationell RDA-term @sv
created: 2018-11-01
modified: 2024-08-27
alternative label: altos @en
alternative label: contraltos @en
alternative label: altot
alternative label: alttolaulajat
alternative label: laulajat -- altto
alternative label: alt (sångare) @sv
alternative label: altar @sv
alternative label: altsångare @sv
broader: naislaulaja
in scheme: Metatietosanasto
preferred label: alto (singer) @en
preferred label: alt @sv

lastenkirjailija
type: Concept
source: Kansallinen RDA-termi
source: YSO-termi
source: ALLFO-term @sv
source: Nationell RDA-term @sv
created: 2018-11-01
modified: 2024-08-27
alternative label: children's authors @en
alternative label: lastenkirjailijat
broader: kirjailija
in scheme: Metatietosanasto
preferred label: children's author @en
preferred label: barnboksförfattare @sv

katutyöntekijä
type: Concept
source: Kansallinen RDA-termi
source: YSO-termi
source: ALLFO-term @sv
source: Nationell RDA-term @sv
created: 2018-11-01
modified: 2024-08-27
alternative label: road construction workers @en
alternative label: katutyöntekijät
broader: työntekijä
in scheme: Metatietosanasto
preferred label: road construction worker @en
preferred label: gatuarbetare @sv

lähetystyöntekijä
type: Concept
source: Kansallinen RDA-termi
source: YSO-termi
source: ALLFO-term @sv
source: Nationell RDA-term @sv
created: 2018-11-01
modified: 2024-08-27
alternative label: missionaries @en
alternative label: lähetyssaarnaajat
alternative label: lähetystyöntekijät
alternative label: missionspredikanter @sv
alternative label: missionärer @sv
broader: kirkon työntekijä
in scheme: Metatietosanasto
preferred label: missionary @en
preferred label: missionär @sv

tietokoneasentaja
type: Concept
source: Kansallinen RDA-termi
source: YSO-termi
source: ALLFO-term @sv
source: Nationell RDA-term @sv
created: 2018-11-01
modified: 2024-08-27
alternative label: computer equipment fitters @en
alternative label: computer installers @en
alternative label: computer mechanics @en
alternative label: tietokoneasentajat
alternative label: datamontörer @sv
alternative label: datormontörer @sv
broader: asentaja
in scheme: Metatietosanasto
preferred label: computer mechanic @en
preferred label: datormontör @sv

lentomestari
type: Concept
source: Kansallinen RDA-termi
source: YSO-termi
source: ALLFO-term @sv
source: Nationell RDA-term @sv
created: 2018-11-01
modified: 2024-08-27
alternative label: lentomestarit
broader: sotilaslentäjä
in scheme: Metatietosanasto
preferred label: flygmästare @sv

komentaja
type: Concept
source: Kansallinen RDA-termi
source: YSO-termi
source: ALLFO-term @sv
source: Nationell RDA-term @sv
created: 2018-11-01
modified: 2024-08-27
alternative label: commanders @en
alternative label: komentajat
alternative label: befälhavare @sv
broader: upseeri
in scheme: Metatietosanasto
preferred label: commander @en
preferred label: kommendör @sv

oikeustoimittaja
type: Concept
source: Kansallinen RDA-termi
source: YSO-termi
source: ALLFO-term @sv
source: Nationell RDA-term @sv
created: 2018-11-01
modified: 2024-08-27
alternative label: legal journalists @en
alternative label: oikeustoimittajat
alternative label: rättsjournalister @sv
alternative label: rättsredaktörer @sv
alternative label: rättsreportrar @sv
broader: toimittaja
in scheme: Metatietosanasto
preferred label: legal journalist @en
preferred label: rättsjournalist @sv

puhelinasentaja
type: Concept
source: Kansallinen RDA-termi
source: YSO-termi
source: ALLFO-term @sv
source: Nationell RDA-term @sv
created: 2018-11-01
modified: 2024-08-27
alternative label: telephone fitters @en
alternative label: puhelinasentajat
alternative label: telefonmontörer @sv
alternative label: telemontörer @sv
broader: asentaja
in scheme: Metatietosanasto
preferred label: telephone fitter @en
preferred label: telefonmontör @sv

alttoviulisti
type: Concept
source: Kansallinen RDA-termi
source: YSO-termi
source: ALLFO-term @sv
source: Nationell RDA-term @sv
created: 2018-11-01
modified: 2024-08-27
alternative label: alttoviulistit
alternative label: altviolinister @sv
alternative label: violaster @sv
broader: soittaja
in scheme: Metatietosanasto
preferred label: altviolinist @sv

solisti
type: Concept
source: Kansallinen RDA-termi
source: YSO-termi
source: ALLFO-term @sv
source: Nationell RDA-term @sv
created: 2018-11-01
modified: 2024-08-27
alternative label: soloists @en
alternative label: solistit
alternative label: solister @sv
broader: esittäjä
in scheme: Metatietosanasto
preferred label: soloist @en
preferred label: solist @sv

aikuiskouluttaja
type: Concept
source: Kansallinen RDA-termi
source: YSO-termi
source: ALLFO-term @sv
source: Nationell RDA-term @sv
created: 2018-11-01
modified: 2024-08-27
alternative label: adult education educators @en
alternative label: adult educators @en
alternative label: aikuiskouluttajat
broader: kouluttaja
in scheme: Metatietosanasto
preferred label: adult educator @en
preferred label: vuxenutbildare @sv

puoluesihteeri
type: Concept
source: Kansallinen RDA-termi
source: YSO-termi
source: ALLFO-term @sv
source: Nationell RDA-term @sv
created: 2018-11-01
modified: 2024-08-27
alternative label: party secretaries @en
alternative label: puoluesihteerit
broader: sihteeri
in scheme: Metatietosanasto
preferred label: party secretary @en
preferred label: partisekreterare @sv

assistentti
type: Concept
source: Kansallinen RDA-termi
source: YSO-termi
source: ALLFO-term @sv
source: Nationell RDA-term @sv
created: 2018-11-01
modified: 2024-08-27
alternative label: assistants @en
alternative label: assistentit
alternative label: assistenter @sv
in scheme: Metatietosanasto
narrower: museoassistentti
preferred label: assistant (university) @en
preferred label: assistent @sv

teollisuusneuvos
type: Concept
source: Kansallinen RDA-termi
source: YSO-termi
source: ALLFO-term @sv
source: Nationell RDA-term @sv
created: 2018-11-01
modified: 2024-08-27
alternative label: teollisuusneuvokset
alternative label: teollisuusneuvos (ammatti)
alternative label: industriråd (yrke) @sv
broader: virkamies
in scheme: Metatietosanasto
preferred label: industriråd @sv

kilpapyöräilijä
type: Concept
source: Kansallinen RDA-termi
source: YSO-termi
source: ALLFO-term @sv
source: Nationell RDA-term @sv
created: 2018-11-01
modified: 2024-08-27
alternative label: cyclists @en
alternative label: racing cyclists @en
alternative label: kilpapyöräilijät
alternative label: racercyklister @sv
alternative label: tävlingscyklister @sv
broader: urheilija
in scheme: Metatietosanasto
preferred label: cyclist (athlete) @en
preferred label: tävlingscyklist @sv

kulttuurivaikuttaja
type: Concept
source: Kansallinen RDA-termi
source: YSO-termi
source: ALLFO-term @sv
source: Nationell RDA-term @sv
created: 2018-11-01
modified: 2024-08-27
alternative label: influential cultural figures @en
alternative label: kulttuurivaikuttajat
alternative label: kulturpersoner @sv
alternative label: kulturpersonligheter @sv
broader: yhteiskunnallinen vaikuttaja
in scheme: Metatietosanasto
preferred label: influential cultural figure @en
preferred label: kulturpåverkare @sv

tenori
type: Concept
source: Kansallinen RDA-termi
source: YSO-termi
source: ALLFO-term @sv
source: Nationell RDA-term @sv
created: 2018-11-01
modified: 2024-08-27
alternative label: tenors @en
alternative label: laulajat -- tenori
alternative label: tenorilaulajat
alternative label: tenorit
alternative label: tenorer @sv
alternative label: tenorsångare @sv
broader: mieslaulaja
in scheme: Metatietosanasto
preferred label: tenor (singer) @en
preferred label: tenor (sångare) @sv

eduskunnan oikeusasiamies
type: Concept
source: Kansallinen RDA-termi
source: YSO-termi
source: ALLFO-term @sv
source: Nationell RDA-term @sv
created: 2018-11-01
modified: 2024-08-27
alternative label: ombudsmen of the parliament @en
alternative label: parliamentary ombudsmen @en
alternative label: parliamentary ombudspersons @en
alternative label: eduskunnan oikeusasiamiehet
alternative label: riksdagens justitieombudsmän @sv
broader: oikeusasiamies
in scheme: Metatietosanasto
preferred label: parliamentary ombudsman @en
preferred label: riksdagens justitieombudsman @sv

koreografi
type: Concept
source: Kansallinen RDA-termi
source: YSO-termi
source: ALLFO-term @sv
source: Nationell RDA-term @sv
created: 2018-11-01
modified: 2024-08-27
alternative label: koreografi (ammatti)
alternative label: koreograf (yrke) @sv
broader: näyttämötaiteilija
in scheme: Metatietosanasto
preferred label: choreographer @en
preferred label: koreograf @sv

eläinsuojeluasiamies
type: Concept
source: Kansallinen RDA-termi
source: YSO-termi
source: ALLFO-term @sv
source: Nationell RDA-term @sv
created: 2018-11-01
modified: 2024-08-27
alternative label: animal welfare ombudsmen @en
alternative label: animal welfare ombudspersons @en
alternative label: eläinsuojeluasiamiehet
alternative label: djurskyddsombudsmän @sv
broader: asiamies
in scheme: Metatietosanasto
preferred label: animal welfare ombudsman @en
preferred label: djurskyddsombudsman @sv

pääsuunnittelija
type: Concept
source: Kansallinen RDA-termi
source: YSO-termi
source: ALLFO-term @sv
source: Nationell RDA-term @sv
created: 2018-11-01
modified: 2024-08-27
alternative label: head designers @en
alternative label: principal designers @en
alternative label: pääsuunnittelijat
broader: suunnittelija
in scheme: Metatietosanasto
preferred label: principal designer @en
preferred label: huvudplanerare @sv

televisionäyttelijä
type: Concept
source: Kansallinen RDA-termi
source: YSO-termi
source: ALLFO-term @sv
source: Nationell RDA-term @sv
created: 2018-11-01
modified: 2024-08-27
alternative label: television actors @en
alternative label: TV-näyttelijät
alternative label: televisionäyttelijät
alternative label: TV-skådespelare @sv
alternative label: televisionskådespelare @sv
alternative label: televisionsskådespelare @sv
alternative label: teveskådespelare @sv
broader: näyttelijä
in scheme: Metatietosanasto
preferred label: television actor @en
preferred label: tv-skådespelare @sv

itkijä
type: Concept
source: Kansallinen RDA-termi
source: YSO-termi
source: ALLFO-term @sv
source: Nationell RDA-term @sv
created: 2018-11-01
modified: 2024-08-27
alternative label: weepers @en
alternative label: itkijänaiset
alternative label: itkijät
alternative label: gråterskor @sv
broader: perinteentaitaja
in scheme: Metatietosanasto
preferred label: weeper (mourner) @en
preferred label: gråterska @sv

keräilijä
type: Concept
source: Kansallinen RDA-termi
source: YSO-termi
source: ALLFO-term @sv
source: Nationell RDA-term @sv
created: 2018-11-01
modified: 2024-08-27
alternative label: collectors @en
alternative label: keräilijät
in scheme: Metatietosanasto
narrower: filatelisti
preferred label: collector @en
preferred label: samlare @sv

varastotyöntekijä
type: Concept
source: Kansallinen RDA-termi
source: YSO-termi
source: ALLFO-term @sv
source: Nationell RDA-term @sv
created: 2018-11-01
modified: 2024-08-27
alternative label: warehouse workers @en
alternative label: varastotyöntekijät
broader: työntekijä
in scheme: Metatietosanasto
preferred label: warehouse worker @en
preferred label: lagerarbetare @sv

hopeaseppä
type: Concept
source: Kansallinen RDA-termi
source: YSO-termi
source: ALLFO-term @sv
source: Nationell RDA-term @sv
created: 2018-11-01
modified: 2024-08-27
alternative label: silversmiths @en
alternative label: hopeasepät
alternative label: silversmeder @sv
broader: seppä
in scheme: Metatietosanasto
preferred label: silversmith @en
preferred label: silversmed @sv

sairaankuljettaja
type: Concept
source: Kansallinen RDA-termi
source: YSO-termi
source: ALLFO-term @sv
source: Nationell RDA-term @sv
created: 2018-11-01
modified: 2024-08-27
alternative label: ambulance drivers @en
alternative label: sairaankuljettajat
broader: autonkuljettaja
in scheme: Metatietosanasto
preferred label: ambulance driver @en
preferred label: ambulansförare @sv

teatterintutkija
type: Concept
source: Kansallinen RDA-termi
source: YSO-termi
source: ALLFO-term @sv
source: Nationell RDA-term @sv
created: 2018-11-01
modified: 2024-08-27
alternative label: teatterintutkijat
alternative label: teatteritutkijat
broader: tutkija
in scheme: Metatietosanasto
preferred label: teaterforskare @sv

psykiatri
type: Concept
source: Kansallinen RDA-termi
source: YSO-termi
source: ALLFO-term @sv
source: Nationell RDA-term @sv
created: 2018-11-01
modified: 2024-08-27
alternative label: psychiatrists @en
alternative label: psykiatrit
alternative label: psykiatrar @sv
alternative label: psykiatrer @sv
alternative label: psykiatriker @sv
broader: lääkäri
in scheme: Metatietosanasto
preferred label: psychiatrist @en
preferred label: psykiater @sv

valtionpäämies
type: Concept
source: Kansallinen RDA-termi
source: YSO-termi
source: ALLFO-term @sv
source: Nationell RDA-term @sv
created: 2018-11-01
modified: 2024-08-27
alternative label: head of state (profession) @en
alternative label: heads of state @en
alternative label: valtion päämiehet
alternative label: valtion päämies (ammatti)
alternative label: valtionpäämiehet
alternative label: valtionpäämies (ammatti)
alternative label: statschefer @sv
alternative label: statsöverhuvud (yrke) @sv
in scheme: Metatietosanasto
narrower: presidentti
preferred label: head of state @en
preferred label: statsöverhuvud @sv

presidentti
type: Concept
source: Kansallinen RDA-termi
source: YSO-termi
source: ALLFO-term @sv
source: Nationell RDA-term @sv
created: 2018-11-01
modified: 2024-08-27
alternative label: president (profession) @en
alternative label: presidents @en
alternative label: presidentit
alternative label: presidentti (ammatti)
alternative label: tasavallan presidentti
alternative label: president (yrke) @sv
alternative label: presidenter @sv
alternative label: republikens president @sv
broader: valtionpäämies
in scheme: Metatietosanasto
preferred label: president @en

sairaanhoidon opettaja
type: Concept
source: Kansallinen RDA-termi
source: YSO-termi
source: ALLFO-term @sv
source: Nationell RDA-term @sv
created: 2018-11-01
modified: 2024-08-27
alternative label: sairaanhoidonopettaja (ammatti)
alternative label: sjukvårdslärare (yrke) @sv
broader: ammatillisten opintojen opettaja
in scheme: Metatietosanasto
preferred label: nurse educator @en
preferred label: sjukvårdslärare @sv

apteekkari
type: Concept
source: Kansallinen RDA-termi
source: YSO-termi
source: ALLFO-term @sv
source: Nationell RDA-term @sv
created: 2018-11-01
modified: 2024-08-27
alternative label: pharmacists @en
alternative label: apteekkarit
broader: yrittäjä
in scheme: Metatietosanasto
preferred label: pharmacist (entrepreneur) @en
preferred label: apotekare @sv

sairaalafyysikko
type: Concept
source: Kansallinen RDA-termi
source: YSO-termi
source: ALLFO-term @sv
source: Nationell RDA-term @sv
created: 2018-11-01
modified: 2024-08-27
alternative label: hospital physicists @en
alternative label: sairaalafyysikot
broader: fyysikko
in scheme: Metatietosanasto
preferred label: hospital physicist @en
preferred label: sjukhusfysiker @sv

laulunopettaja
type: Concept
source: Kansallinen RDA-termi
source: YSO-termi
source: ALLFO-term @sv
source: Nationell RDA-term @sv
created: 2018-11-01
modified: 2024-08-27
alternative label: singing teachers @en
alternative label: laulunopettajat
alternative label: sångpedagoger @sv
broader: opettaja
in scheme: Metatietosanasto
preferred label: singing teacher @en
preferred label: sångpedagog @sv

arkistonjohtaja
type: Concept
source: Kansallinen RDA-termi
source: YSO-termi
source: ALLFO-term @sv
source: Nationell RDA-term @sv
created: 2018-11-01
modified: 2024-08-27
alternative label: archive directors @en
alternative label: arkistonjohtajat
broader: johtaja
in scheme: Metatietosanasto
preferred label: archive director @en
preferred label: arkivföreståndare @sv

postinjakaja
type: Concept
source: Kansallinen RDA-termi
source: YSO-termi
source: ALLFO-term @sv
source: Nationell RDA-term @sv
created: 2018-11-01
modified: 2024-08-27
alternative label: mail carriers @en
alternative label: postmen @en
alternative label: posteljoonit
alternative label: postiljoonit
alternative label: postimiehet
alternative label: postinjakajat
alternative label: postiljoner @sv
alternative label: postutdelare @sv
broader: postityöntekijä
in scheme: Metatietosanasto
preferred label: mail carrier @en
preferred label: brevbärare @sv

maisema-arkkitehti
type: Concept
source: Kansallinen RDA-termi
source: YSO-termi
source: ALLFO-term @sv
source: Nationell RDA-term @sv
created: 2018-11-01
modified: 2024-08-27
alternative label: maisema-arkkitehti (ammatti)
alternative label: landskapsarkitekt (yrke) @sv
broader: arkkitehti
in scheme: Metatietosanasto
preferred label: landscape architect @en
preferred label: landskapsarkitekt @sv

ihotautilääkäri
type: Concept
source: Kansallinen RDA-termi
source: YSO-termi
source: ALLFO-term @sv
source: Nationell RDA-term @sv
created: 2018-11-01
modified: 2024-08-27
alternative label: dermatologists @en
alternative label: ihotautilääkärit
alternative label: dermatologer @sv
alternative label: hudläkare @sv
broader: lääkäri
in scheme: Metatietosanasto
preferred label: dermatologist @en
preferred label: dermatolog @sv

sotilasjohtaja
type: Concept
source: Kansallinen RDA-termi
source: YSO-termi
source: ALLFO-term @sv
source: Nationell RDA-term @sv
created: 2018-11-01
modified: 2024-08-27
alternative label: military leaders @en
alternative label: sotilasjohtajat
broader: johtaja
in scheme: Metatietosanasto
preferred label: military leader @en
preferred label: militärbefälhavare @sv

muotisuunnittelija
type: Concept
source: Kansallinen RDA-termi
source: YSO-termi
source: ALLFO-term @sv
source: Nationell RDA-term @sv
created: 2018-11-01
modified: 2024-08-27
alternative label: fashion designers @en
alternative label: muotisuunnittelijat
alternative label: muotitaiteilijat
alternative label: modeskapare @sv
broader: suunnittelija
in scheme: Metatietosanasto
preferred label: fashion designer @en
preferred label: modedesigner @sv

painonnostaja
type: Concept
source: Kansallinen RDA-termi
source: YSO-termi
source: ALLFO-term @sv
source: Nationell RDA-term @sv
created: 2018-11-01
modified: 2024-08-27
alternative label: weight lifters @en
alternative label: weightlifters @en
alternative label: painonnostajat
broader: urheilija
in scheme: Metatietosanasto
preferred label: weightlifter @en
preferred label: tyngdlyftare @sv

toimitusjohtaja
type: Concept
source: Kansallinen RDA-termi
source: YSO-termi
source: ALLFO-term @sv
source: Nationell RDA-term @sv
created: 2018-11-01
modified: 2024-08-27
alternative label: chief executive officers @en
alternative label: managing directors @en
alternative label: toimitusjohtajat
alternative label: vd:ar @sv
alternative label: verkställande direktörer @sv
broader: johtaja
in scheme: Metatietosanasto
preferred label: chief executive officer @en
preferred label: verkställande direktör @sv

patenttiasiamies
type: Concept
source: Kansallinen RDA-termi
source: YSO-termi
source: ALLFO-term @sv
source: Nationell RDA-term @sv
created: 2018-11-01
modified: 2024-08-27
alternative label: patent agents @en
alternative label: patenttiasiamiehet
alternative label: patentombudsman @sv
broader: asiamies
in scheme: Metatietosanasto
preferred label: patent agent @en
preferred label: patentombud @sv

sosiaaliasiamies
type: Concept
source: Kansallinen RDA-termi
source: YSO-termi
source: ALLFO-term @sv
source: Nationell RDA-term @sv
created: 2018-11-01
modified: 2024-08-27
alternative label: social ombudsmen @en
alternative label: social ombudspersons @en
alternative label: sosiaaliasiamiehet
alternative label: socialombudsman @sv
broader: asiamies
in scheme: Metatietosanasto
preferred label: social ombudsman @en
preferred label: socialombud @sv

teollisoikeusasiamies
type: Concept
source: Kansallinen RDA-termi
source: YSO-termi
source: ALLFO-term @sv
source: Nationell RDA-term @sv
created: 2018-11-01
modified: 2024-08-27
alternative label: industrial property agents @en
alternative label: teollisoikeusasiamiehet
alternative label: ombud för industriell äganderätt @sv
broader: asiamies
in scheme: Metatietosanasto
preferred label: industrial property agent @en
preferred label: ombud för industriellt rättsskydd @sv

sellisti
type: Concept
source: Kansallinen RDA-termi
source: YSO-termi
source: ALLFO-term @sv
source: Nationell RDA-term @sv
created: 2018-11-01
modified: 2024-08-27
alternative label: cellists @en
alternative label: sellistit
alternative label: cellister @sv
broader: soittaja
in scheme: Metatietosanasto
preferred label: cellist @en

tavaramerkkiasiamies
type: Concept
source: Kansallinen RDA-termi
source: YSO-termi
source: ALLFO-term @sv
source: Nationell RDA-term @sv
created: 2018-11-01
modified: 2024-08-27
alternative label: trademark agents @en
alternative label: trademark attorneys @en
alternative label: tavaramerkkiasiamiehet
broader: asiamies
in scheme: Metatietosanasto
preferred label: trademark agent @en
preferred label: varumärkesombud @sv

dramaturgi
type: Concept
source: Kansallinen RDA-termi
source: YSO-termi
source: ALLFO-term @sv
source: Nationell RDA-term @sv
created: 2018-11-01
modified: 2024-08-27
alternative label: dramaturgi (ammatti)
alternative label: dramaturg (yrke) @sv
broader: näyttämötaiteilija
definition: näytelmätekstien muokkaaja
definition: bearbetare av dramatexter @sv
in scheme: Metatietosanasto
preferred label: dramaturge @en
preferred label: dramaturg @sv

lavastaja
type: Concept
source: RDA-termi
source: RDA-term @sv
created: 2016-01-08
modified: 2025-07-04
alternative label: art director
alternative label: lavastaja (suhde)
alternative label: lavastaja (toimija)
alternative label: scenograf (aktör) @sv
alternative label: scenograf (relation) @sv
broader: esitykseen osallinen toimija
definition: Toimija, joka osallistuu ekspression tekemiseen valvomalla taiteilijoita ja käsityöläisiä, jotka rakentavat lavasteita elokuvatuotantoihin. (RDA Registry)
definition: Aktör som deltar i utförandet av ett uttryck, genom att övervaka konstnärer och hantverkare som bygger kulisser för filmproduktioner. @sv
in scheme: Metatietosanasto
preferred label: art director agent @en
preferred label: scenograf @sv

tietokirjailija
type: Concept
source: Kansallinen RDA-termi
source: YSO-termi
source: ALLFO-term @sv
source: Nationell RDA-term @sv
created: 2018-11-01
modified: 2024-08-27
alternative label: non-fiction writers @en
alternative label: nonfiction writers @en
alternative label: tietokirjailijat
broader: kirjailija
in scheme: Metatietosanasto
preferred label: nonfiction writer @en
preferred label: fackboksförfattare @sv

poliitikko
type: Concept
source: Kansallinen RDA-termi
source: YSO-termi
source: ALLFO-term @sv
source: Nationell RDA-term @sv
created: 2018-11-01
modified: 2024-08-27
alternative label: politicians @en
alternative label: poliitikot
alternative label: valtiomiehet
alternative label: statskvinnor @sv
alternative label: statsmän @sv
in scheme: Metatietosanasto
narrower: kunnallispoliitikko
preferred label: politician @en
preferred label: politiker @sv

suntio
type: Concept
source: Kansallinen RDA-termi
source: YSO-termi
source: ALLFO-term @sv
source: Nationell RDA-term @sv
created: 2018-11-01
modified: 2024-08-27
alternative label: vergers @en
alternative label: suntiot
broader: kirkon työntekijä
in scheme: Metatietosanasto
preferred label: verger @en
preferred label: kyrkvaktmästare @sv

kapteeni
type: Concept
source: Kansallinen RDA-termi
source: YSO-termi
source: ALLFO-term @sv
source: Nationell RDA-term @sv
created: 2018-11-01
modified: 2024-11-05
alternative label: captains @en
alternative label: kapteeni (upseeri)
alternative label: kapteenit
alternative label: kapten (officer) @sv
alternative label: kaptener @sv
broader: upseeri
in scheme: Metatietosanasto
preferred label: captain @en
preferred label: kapten @sv

ulkomaantoimittaja
type: Concept
source: Kansallinen RDA-termi
source: YSO-termi
source: ALLFO-term @sv
source: Nationell RDA-term @sv
created: 2018-11-01
modified: 2024-08-27
alternative label: foreign affairs journalists @en
alternative label: international news correspondents @en
alternative label: ulkomaantoimittajat
alternative label: utrikesjournalister @sv
alternative label: utrikesredaktörer @sv
alternative label: utrikesreportrar @sv
alternative label: utrikesreportrar, utrikesjournalister @sv
broader: toimittaja
in scheme: Metatietosanasto
preferred label: foreign affairs journalist @en
preferred label: utrikesredaktör @sv

hiihtäjä
type: Concept
source: Kansallinen RDA-termi
source: YSO-termi
source: ALLFO-term @sv
source: Nationell RDA-term @sv
created: 2018-11-01
modified: 2024-08-27
alternative label: skiers @en
alternative label: hiihtäjät
broader: urheilija
in scheme: Metatietosanasto
preferred label: skier @en
preferred label: skidåkare @sv

DJ
type: Concept
source: RDA-termi
source: RDA-term @sv
created: 2016-01-08
modified: 2025-08-28
alternative label: DJ (toimija)
alternative label: DJ-miks. (DJ-miksaaja)
alternative label: DJ-miksaaja
alternative label: DJ (aktör) @sv
alternative label: DJ-mix. (DJ-mixer) @sv
alternative label: DJ-mixer @sv
alternative label: discjockey @sv
alternative label: diskjockey @sv
broader: esitykseen osallinen toimija
definition: Toimija, joka osallistuu ekspression tekemiseen miksaamalla ääniraitoja yhteen yhtäjaksoiseksi raidaksi live-esityksessä tai äänitysstudiossa. (RDA Registry)
definition: Aktör som deltar i utförandet av ett uttryck genom att mixa ljudspår till ett sammanhängande spår under ett liveframträdande eller i en inspelningsstudio. @sv
in scheme: Metatietosanasto
preferred label: DJ agent @en
scope note: Ei koske uudelleenmiksauksia, jotka olennaisesti muuttavat alkuperäisen teoksen luonnetta ja sisältöä, mikä johtaa uuteen teokseen, eikä äänitteen useampien raitojen miksaamista ja yhdistelyä. (RDA Registry)
scope note: Gäller inte remixer som väsentligen ändrar det ursprungliga verkets karaktär och innehåll, vilket leder till ett nytt verk, och inte heller mixning och kombinering av flera spår i en ljudinspelning. @sv

jäteautonkuljettaja
type: Concept
source: Kansallinen RDA-termi
source: YSO-termi
source: ALLFO-term @sv
source: Nationell RDA-term @sv
created: 2018-11-01
modified: 2024-08-27
alternative label: refuse collection vehicle drivers @en
alternative label: refuse collectors @en
alternative label: waste collectors @en
alternative label: jäteautonkuljettajat
alternative label: sopbilschaufförer @sv
alternative label: sopbilsförare @sv
broader: autonkuljettaja
in scheme: Metatietosanasto
preferred label: refuse collection vehicle driver @en
preferred label: sopbilschaufför @sv

kolmiloikkaaja
type: Concept
source: Kansallinen RDA-termi
source: YSO-termi
source: ALLFO-term @sv
source: Nationell RDA-term @sv
created: 2018-11-01
modified: 2024-08-27
alternative label: triple jumpers @en
alternative label: kolmiloikkaajat
broader: yleisurheilija
in scheme: Metatietosanasto
preferred label: triple jumper @en
preferred label: trestegshoppare @sv

lausuja
type: Concept
source: Kansallinen RDA-termi
source: YSO-termi
source: ALLFO-term @sv
source: Nationell RDA-term @sv
created: 2018-11-01
modified: 2024-08-27
alternative label: lausuja (ammatti)
alternative label: recitatör (yrke) @sv
broader: näyttämötaiteilija
in scheme: Metatietosanasto
preferred label: reciter @en
preferred label: recitatör @sv

lehtikustantaja
type: Concept
source: Kansallinen RDA-termi
source: YSO-termi
source: ALLFO-term @sv
source: Nationell RDA-term @sv
created: 2018-11-01
modified: 2024-08-27
alternative label: magazine and newspaper publishers @en
alternative label: lehtikustantajat
alternative label: lehtikustantamot
alternative label: lehtitalot
alternative label: tidningsförläggare @sv
alternative label: tidningshus @sv
alternative label: tidningsutgivare @sv
broader: kustantaja
in scheme: Metatietosanasto
preferred label: magazine and newspaper publisher @en
preferred label: tidningsförlag @sv

eripainos julkaisusta
type: Concept
source: Kansallinen RDA-termi
source: Nationell RDA-term @sv
created: 2016-01-08
modified: 2024-10-10
broader: osa aineistoa
in scheme: Metatietosanasto
preferred label: särtryck ur publikationen @sv
scope note: Eripainoksen kuvailusta viitataan julkaisuun, josta eripainos on tehty.
scope note: Vid beskrivningen av särtryck hänvisas till publikationen från vilken särtrycket är gjort. @sv

lämmityslaiteasentaja
type: Concept
source: Kansallinen RDA-termi
source: YSO-termi
source: ALLFO-term @sv
source: Nationell RDA-term @sv
created: 2018-11-01
modified: 2024-08-27
alternative label: heating equipment fitters @en
alternative label: lämmityslaiteasentajat
alternative label: värmeelementsmontörer @sv
broader: asentaja
in scheme: Metatietosanasto
preferred label: heating equipment fitter @en
preferred label: värmeelementsmontör @sv

rakennustyöntekijä
type: Concept
source: Kansallinen RDA-termi
source: YSO-termi
source: ALLFO-term @sv
source: Nationell RDA-term @sv
created: 2018-11-01
modified: 2024-08-27
alternative label: construction workers @en
alternative label: rakennustyöntekijät
alternative label: byggarbetare @sv
broader: työntekijä
in scheme: Metatietosanasto
preferred label: construction worker @en
preferred label: byggnadsarbetare @sv

piiri-insinööri
type: Concept
source: Kansallinen RDA-termi
source: YSO-termi
source: ALLFO-term @sv
source: Nationell RDA-term @sv
created: 2018-11-01
modified: 2024-08-27
alternative label: district engineers @en
alternative label: piiri-insinöörit
alternative label: distriktsingenjörer @sv
broader: insinööri
in scheme: Metatietosanasto
preferred label: district engineer @en
preferred label: distriktsingenjör @sv

jäätanssija
type: Concept
source: Kansallinen RDA-termi
source: YSO-termi
source: ALLFO-term @sv
source: Nationell RDA-term @sv
created: 2018-11-01
modified: 2024-08-27
alternative label: ice dancers @en
alternative label: jäätanssijat
broader: taitoluistelija
in scheme: Metatietosanasto
preferred label: ice dancer @en
preferred label: isdansare @sv

koomikko
type: Concept
source: Kansallinen RDA-termi
source: YSO-termi
source: ALLFO-term @sv
source: Nationell RDA-term @sv
created: 2018-11-01
modified: 2024-08-27
alternative label: comedians @en
alternative label: koomikot
broader: näyttelijä
in scheme: Metatietosanasto
preferred label: comedian @en
preferred label: komiker @sv

amiraali
type: Concept
source: Kansallinen RDA-termi
source: YSO-termi
source: ALLFO-term @sv
source: Nationell RDA-term @sv
created: 2018-11-01
modified: 2024-08-27
alternative label: admirals @en
alternative label: amiraalit
alternative label: amiraler @sv
broader: upseeri
in scheme: Metatietosanasto
preferred label: admiral @en
preferred label: amiral @sv

antiikkikauppias
type: Concept
source: Kansallinen RDA-termi
source: YSO-termi
source: ALLFO-term @sv
source: Nationell RDA-term @sv
created: 2018-11-01
modified: 2024-08-27
alternative label: antique dealers @en
alternative label: antiques dealer @en
alternative label: antiques dealers @en
alternative label: antiikkikauppiaat
broader: kauppias
in scheme: Metatietosanasto
preferred label: antique dealer @en
preferred label: antikhandlare @sv

rajavartija
type: Concept
source: Kansallinen RDA-termi
source: YSO-termi
source: ALLFO-term @sv
source: Nationell RDA-term @sv
created: 2018-11-01
modified: 2024-08-27
alternative label: frontier guards @en
alternative label: rajavartijat
in scheme: Metatietosanasto
narrower: merivartija
preferred label: frontier guard @en
preferred label: gränsbevakare @sv

kuvataideopettaja
type: Concept
source: Kansallinen RDA-termi
source: YSO-termi
source: ALLFO-term @sv
source: Nationell RDA-term @sv
created: 2018-11-01
modified: 2024-08-27
alternative label: art education teachers @en
alternative label: kuvataideopettajat
alternative label: konstlärare @sv
broader: aineenopettaja
in scheme: Metatietosanasto
preferred label: art teacher @en
preferred label: bildkonstlärare @sv

lehtikuvaaja
type: Concept
source: Kansallinen RDA-termi
source: YSO-termi
source: ALLFO-term @sv
source: Nationell RDA-term @sv
created: 2018-11-01
modified: 2024-08-27
alternative label: photojournalists @en
alternative label: press photographers @en
alternative label: lehtikuvaajat
alternative label: pressfotografer @sv
broader: valokuvaaja
in scheme: Metatietosanasto
preferred label: press photographer @en
preferred label: pressfotograf @sv

kappalainen
type: Concept
source: Kansallinen RDA-termi
source: YSO-termi
source: ALLFO-term @sv
source: Nationell RDA-term @sv
created: 2018-11-01
modified: 2024-08-27
alternative label: chaplains @en
alternative label: kappalaiset
alternative label: kaplaner @sv
alternative label: komministrar @sv
broader: pappi
in scheme: Metatietosanasto
preferred label: chaplain @en
preferred label: kaplan @sv

sosiaalijohtaja
type: Concept
source: Kansallinen RDA-termi
source: YSO-termi
source: ALLFO-term @sv
source: Nationell RDA-term @sv
created: 2018-11-01
modified: 2024-08-27
alternative label: directors of social welfare services @en
alternative label: sosiaalijohtajat
alternative label: socialchefer @sv
alternative label: socialdirektörer @sv
broader: johtaja
in scheme: Metatietosanasto
preferred label: director of social welfare services @en
preferred label: socialdirektör @sv

adjutantti
type: Concept
source: Kansallinen RDA-termi
source: YSO-termi
source: ALLFO-term @sv
source: Nationell RDA-term @sv
created: 2018-11-01
modified: 2024-08-27
alternative label: adjutants @en
alternative label: adjutantit
alternative label: adjutanter @sv
broader: sotilashenkilö
in scheme: Metatietosanasto
preferred label: adjutant @en

yliopettaja
type: Concept
source: Kansallinen RDA-termi
source: YSO-termi
source: ALLFO-term @sv
source: Nationell RDA-term @sv
created: 2018-11-01
modified: 2024-08-27
alternative label: principal lecturers @en
alternative label: yliopettajat
broader: opettaja
in scheme: Metatietosanasto
preferred label: principal lecturer @en
preferred label: överlärare @sv

äänisuunnittelija
type: Concept
source: Kansallinen RDA-termi
source: YSO-termi
source: ALLFO-term @sv
source: Nationell RDA-term @sv
created: 2018-11-01
modified: 2024-08-27
alternative label: audio designers @en
alternative label: sound designers @en
alternative label: äänisuunnittelijat
broader: näyttämötaiteilija
in scheme: Metatietosanasto
preferred label: sound designer @en
preferred label: ljuddesigner @sv

kirjastonjohtaja
type: Concept
source: Kansallinen RDA-termi
source: YSO-termi
source: ALLFO-term @sv
source: Nationell RDA-term @sv
created: 2018-11-01
modified: 2024-08-27
alternative label: library directors @en
alternative label: kirjastonjohtajat
alternative label: ylikirjastonhoitaja
alternative label: bibliotekschefer @sv
alternative label: biblioteksdirektörer @sv
alternative label: överbibliotekarier @sv
broader: johtaja
in scheme: Metatietosanasto
preferred label: library director @en
preferred label: bibliotekschef @sv

sisustussuunnittelija
type: Concept
source: Kansallinen RDA-termi
source: YSO-termi
source: ALLFO-term @sv
source: Nationell RDA-term @sv
created: 2018-11-01
modified: 2024-08-27
alternative label: interior decorators @en
alternative label: sisustussuunnittelijat
alternative label: inredare @sv
alternative label: inredningsdesigner @sv
broader: suunnittelija
in scheme: Metatietosanasto
preferred label: interior decorator @en
preferred label: inredningsplanerare @sv

asianajaja
type: Concept
source: Kansallinen RDA-termi
source: YSO-termi
source: ALLFO-term @sv
source: Nationell RDA-term @sv
created: 2018-11-01
modified: 2024-08-27
alternative label: advocates @en
alternative label: asianajajat
alternative label: advokater @sv
broader: juristi
in scheme: Metatietosanasto
preferred label: advocate (lawyer) @en
preferred label: advokat @sv

kulttuurituottaja
type: Concept
source: Kansallinen RDA-termi
source: YSO-termi
source: ALLFO-term @sv
source: Nationell RDA-term @sv
created: 2018-11-01
modified: 2024-08-27
alternative label: cultural producers @en
alternative label: kulttuurituottajat
alternative label: kulturproducenter @sv
broader: tuottaja
in scheme: Metatietosanasto
preferred label: cultural producer @en
preferred label: kulturproducent @sv

työssäkäyntiavustaja
type: Concept
source: Kansallinen RDA-termi
source: YSO-termi
source: ALLFO-term @sv
source: Nationell RDA-term @sv
created: 2018-11-01
modified: 2024-08-27
alternative label: assistants for employment of disabled people @en
alternative label: työssäkäyntiavustajat
alternative label: arbetsbiträden @sv
broader: avustaja
in scheme: Metatietosanasto
preferred label: assistant for employment of disabled people @en
preferred label: arbetsbiträde @sv

apulaiskaupunginjohtaja
type: Concept
source: Kansallinen RDA-termi
source: YSO-termi
source: ALLFO-term @sv
source: Nationell RDA-term @sv
created: 2018-11-01
modified: 2024-08-27
alternative label: deputy mayors @en
alternative label: apulaiskaupunginjohtajat
alternative label: biträdande stadsdirektörer @sv
broader: kaupunginjohtaja
in scheme: Metatietosanasto
preferred label: deputy mayor @en
preferred label: biträdande stadsdirektör @sv

jakelupäällikkö
type: Concept
source: Kansallinen RDA-termi
source: YSO-termi
source: ALLFO-term @sv
source: Nationell RDA-term @sv
created: 2018-11-01
modified: 2024-08-27
alternative label: distribution managers @en
alternative label: jakelupäälliköt
alternative label: distributionschefer @sv
broader: päällikkö
in scheme: Metatietosanasto
preferred label: distribution manager @en
preferred label: distributionschef @sv

metsäteknikko
type: Concept
source: Kansallinen RDA-termi
source: YSO-termi
source: ALLFO-term @sv
source: Nationell RDA-term @sv
created: 2018-11-01
modified: 2024-08-27
alternative label: forestry technicians @en
alternative label: metsäteknikot
broader: teknikko
in scheme: Metatietosanasto
preferred label: forestry technician @en
preferred label: skogstekniker @sv

merimies
type: Concept
source: Kansallinen RDA-termi
source: YSO-termi
source: ALLFO-term @sv
source: Nationell RDA-term @sv
created: 2018-11-01
modified: 2024-08-27
alternative label: mariners @en
alternative label: sailors @en
alternative label: merimiehet
alternative label: sjömän @sv
in scheme: Metatietosanasto
narrower: puolimatruusi
preferred label: mariner @en
preferred label: sjöman @sv

nuohooja
type: Concept
source: Kansallinen RDA-termi
source: YSO-termi
source: ALLFO-term @sv
source: Nationell RDA-term @sv
created: 2018-11-01
modified: 2024-08-27
alternative label: chimney sweeps @en
alternative label: nuohoojat
in scheme: Metatietosanasto
narrower: nuohoojamestari
preferred label: chimney sweep @en
preferred label: sotare @sv

nuohoojamestari
type: Concept
source: Kansallinen RDA-termi
source: YSO-termi
source: ALLFO-term @sv
source: Nationell RDA-term @sv
created: 2018-11-01
modified: 2024-08-27
alternative label: master chimney sweeps @en
alternative label: nuohoojamestarit
broader: nuohooja
in scheme: Metatietosanasto
preferred label: master chimney sweep @en
preferred label: sotarmästare @sv

historianopettaja
type: Concept
source: Kansallinen RDA-termi
source: YSO-termi
source: ALLFO-term @sv
source: Nationell RDA-term @sv
created: 2018-11-01
modified: 2024-08-27
alternative label: history teachers @en
alternative label: historianopettajat
broader: aineenopettaja
in scheme: Metatietosanasto
preferred label: history teacher @en
preferred label: historielärare @sv

musiikkiterapeutti
type: Concept
source: Kansallinen RDA-termi
source: YSO-termi
source: ALLFO-term @sv
source: Nationell RDA-term @sv
created: 2018-11-01
modified: 2024-08-27
alternative label: music therapists @en
alternative label: musiikkiterapeutit
alternative label: musikterapeuter @sv
broader: terapeutti
in scheme: Metatietosanasto
preferred label: music therapist @en
preferred label: musikterapeut @sv

ikonimaalari
type: Concept
source: Kansallinen RDA-termi
source: YSO-termi
source: ALLFO-term @sv
source: Nationell RDA-term @sv
created: 2018-11-01
modified: 2024-08-27
alternative label: icon painters @en
alternative label: ikonimaalarit
broader: kuvataiteilija
in scheme: Metatietosanasto
preferred label: icon painter @en
preferred label: ikonmålare @sv

muotoilija
type: Concept
source: Kansallinen RDA-termi
source: YSO-termi
source: ALLFO-term @sv
source: Nationell RDA-term @sv
created: 2018-11-01
modified: 2024-08-27
alternative label: muotoilija (ammatti)
alternative label: formgivare (yrke) @sv
broader: taiteilija
in scheme: Metatietosanasto
preferred label: designer (artist) @en
preferred label: formgivare @sv

koneinsinööri
type: Concept
source: Kansallinen RDA-termi
source: YSO-termi
source: ALLFO-term @sv
source: Nationell RDA-term @sv
created: 2018-11-01
modified: 2024-08-27
alternative label: mechanical engineers @en
alternative label: koneinsinöörit
alternative label: maskiningenjörer @sv
broader: insinööri
in scheme: Metatietosanasto
preferred label: mechanical engineer @en
preferred label: maskiningenjör @sv

mentalisti
type: Concept
source: Kansallinen RDA-termi
source: YSO-termi
source: ALLFO-term @sv
source: Nationell RDA-term @sv
created: 2018-11-01
modified: 2024-08-27
alternative label: mentalistit
alternative label: mentalister @sv
broader: taikuri
in scheme: Metatietosanasto
preferred label: mentalist @sv

kustannusjohtaja
type: Concept
source: Kansallinen RDA-termi
source: YSO-termi
source: ALLFO-term @sv
source: Nationell RDA-term @sv
created: 2018-11-01
modified: 2024-08-27
alternative label: publishing directors @en
alternative label: kustannusjohtajat
alternative label: förlagsdirektörer @sv
broader: johtaja
in scheme: Metatietosanasto
preferred label: publishing director @en
preferred label: förlagsdirektör @sv

työsuojelupäällikkö
type: Concept
source: Kansallinen RDA-termi
source: YSO-termi
source: ALLFO-term @sv
source: Nationell RDA-term @sv
created: 2018-11-01
modified: 2024-08-27
alternative label: labour protection officers @en
alternative label: occupational safety officers @en
alternative label: työsuojelupäälliköt
alternative label: arbetarskyddschefer @sv
broader: päällikkö
in scheme: Metatietosanasto
preferred label: labour protection officer @en
preferred label: arbetarskyddschef @sv

puhevammaisten tulkki
type: Concept
source: Kansallinen RDA-termi
source: YSO-termi
source: ALLFO-term @sv
source: Nationell RDA-term @sv
created: 2018-11-01
modified: 2024-08-27
alternative label: interpreters for the speech-impaired @en
alternative label: puhevammaisten tulkit
alternative label: tolkar för talhandikappade @sv
broader: tulkki
in scheme: Metatietosanasto
preferred label: interpreter for the speech-impaired @en
preferred label: tolk för talhandikappade @sv

sotilastarkkailija
type: Concept
source: Kansallinen RDA-termi
source: YSO-termi
source: ALLFO-term @sv
source: Nationell RDA-term @sv
created: 2018-11-01
modified: 2024-08-27
alternative label: military observers @en
alternative label: sotilastarkkailijat
alternative label: militära observatörer @sv
alternative label: militärobservatörer @sv
broader: sotilashenkilö
in scheme: Metatietosanasto
preferred label: military observer @en
preferred label: militär observatör @sv

kulttuuritoimittaja
type: Concept
source: Kansallinen RDA-termi
source: YSO-termi
source: ALLFO-term @sv
source: Nationell RDA-term @sv
created: 2018-11-01
modified: 2024-08-27
alternative label: arts editors @en
alternative label: arts journalists @en
alternative label: kulttuuritoimittajat
alternative label: kulturredaktörer @sv
broader: toimittaja
in scheme: Metatietosanasto
preferred label: arts editor @en
preferred label: kulturredaktör @sv

puuseppä
type: Concept
source: Kansallinen RDA-termi
source: YSO-termi
source: ALLFO-term @sv
source: Nationell RDA-term @sv
created: 2018-11-01
modified: 2024-08-27
alternative label: carpenters @en
alternative label: puusepät
broader: seppä
in scheme: Metatietosanasto
preferred label: carpenter (artisan) @en
preferred label: snickare @sv

poliisipäällikkö
type: Concept
source: Kansallinen RDA-termi
source: YSO-termi
source: ALLFO-term @sv
source: Nationell RDA-term @sv
created: 2018-11-01
modified: 2024-08-27
alternative label: police chiefs @en
alternative label: poliisipäälliköt
alternative label: polischefer @sv
broader: päällikkö
in scheme: Metatietosanasto
preferred label: police chief @en
preferred label: polischef @sv

toimintaterapeutti
type: Concept
source: Kansallinen RDA-termi
source: YSO-termi
source: ALLFO-term @sv
source: Nationell RDA-term @sv
created: 2018-11-01
modified: 2024-08-27
alternative label: occupational therapists @en
alternative label: toimintaterapeutit
alternative label: arbetsterapeuter @sv
alternative label: ergoterapeuter @sv
broader: terapeutti
in scheme: Metatietosanasto
preferred label: occupational therapist @en
preferred label: ergoterapeut @sv

logoterapeutti
type: Concept
source: Kansallinen RDA-termi
source: YSO-termi
source: ALLFO-term @sv
source: Nationell RDA-term @sv
created: 2018-11-01
modified: 2024-08-27
alternative label: logotherapists @en
alternative label: logoterapeutit
alternative label: logoterapeuter @sv
broader: psykoterapeutti
in scheme: Metatietosanasto
preferred label: logotherapist @en
preferred label: logoterapeut @sv

voimistelunopettaja
type: Concept
source: Kansallinen RDA-termi
source: YSO-termi
source: ALLFO-term @sv
source: Nationell RDA-term @sv
created: 2018-11-01
modified: 2024-08-27
alternative label: voimistelunopettaja (ammatti)
alternative label: gymnastiklärare (yrke) @sv
broader: opettaja
in scheme: Metatietosanasto
preferred label: gymnastics teacher @en
preferred label: gymnastiklärare @sv

luontaishoitaja
type: Concept
source: Kansallinen RDA-termi
source: YSO-termi
source: ALLFO-term @sv
source: Nationell RDA-term @sv
created: 2018-11-01
modified: 2024-08-27
alternative label: naturopaths @en
alternative label: luontaishoitajat
alternative label: luontaisterapeutit
alternative label: vaihtoehtohoitajat
alternative label: naturterapeuter @sv
broader: terapeutti
in scheme: Metatietosanasto
preferred label: naturopath @en
preferred label: naturterapeut @sv

vaatesuunnittelija
type: Concept
source: Kansallinen RDA-termi
source: YSO-termi
source: ALLFO-term @sv
source: Nationell RDA-term @sv
created: 2018-11-01
modified: 2024-08-27
alternative label: clothing designers @en
alternative label: vaatesuunnittelijat
alternative label: vaatetussuunnittelijat
alternative label: kläddesigner @sv
broader: suunnittelija
in scheme: Metatietosanasto
preferred label: clothing designer @en
preferred label: kläddesigner (planerare) @sv

teollisuusputkiasentaja
type: Concept
source: Kansallinen RDA-termi
source: YSO-termi
source: ALLFO-term @sv
source: Nationell RDA-term @sv
created: 2018-11-01
modified: 2024-08-27
alternative label: industrial pipe fitters @en
alternative label: teollisuusputkiasentajat
alternative label: industrirörmontörer @sv
broader: asentaja
in scheme: Metatietosanasto
preferred label: industrial pipe fitter @en
preferred label: industrirörmontör @sv

kiekonheittäjä
type: Concept
source: Kansallinen RDA-termi
source: YSO-termi
source: ALLFO-term @sv
source: Nationell RDA-term @sv
created: 2018-11-01
modified: 2024-08-27
alternative label: discus throwers @en
alternative label: kiekonheittäjät
broader: yleisurheilija
in scheme: Metatietosanasto
preferred label: discus thrower @en
preferred label: diskuskastare @sv

kaukolämpöasentaja
type: Concept
source: Kansallinen RDA-termi
source: YSO-termi
source: ALLFO-term @sv
source: Nationell RDA-term @sv
created: 2018-11-01
modified: 2024-08-27
alternative label: district heating fitters @en
alternative label: kaukolämpöasentajat
alternative label: fjärrvärmemontörer @sv
broader: asentaja
in scheme: Metatietosanasto
preferred label: district heating fitter @en
preferred label: fjärrvärmemontör @sv

jalkapalloilija
type: Concept
source: Kansallinen RDA-termi
source: YSO-termi
source: ALLFO-term @sv
source: Nationell RDA-term @sv
created: 2018-11-01
modified: 2024-08-27
alternative label: football players @en
alternative label: footballers @en
alternative label: jalkapalloilijat
broader: urheilija
in scheme: Metatietosanasto
preferred label: football player @en
preferred label: fotbollsspelare @sv

kustannustoimittaja
type: Concept
source: Kansallinen RDA-termi
source: YSO-termi
source: ALLFO-term @sv
source: Nationell RDA-term @sv
created: 2018-11-01
modified: 2024-08-27
alternative label: publishing editors @en
alternative label: kustannustoimittajat
alternative label: förlagsredaktörer @sv
broader: toimittaja
in scheme: Metatietosanasto
preferred label: publishing editor @en
preferred label: förlagsredaktör @sv

basisti
type: Concept
source: Kansallinen RDA-termi
source: YSO-termi
source: ALLFO-term @sv
source: Nationell RDA-term @sv
created: 2018-11-01
modified: 2024-08-27
alternative label: bass players @en
alternative label: bassists @en
alternative label: basistit
alternative label: bassokitaristi
alternative label: muusikko (bassokitara)
alternative label: muusikko (sähköbasso)
alternative label: basgitarrist @sv
alternative label: basister @sv
broader: soittaja
in scheme: Metatietosanasto
preferred label: bassist @en
preferred label: basist @sv

ravintolatyöntekijä
type: Concept
source: Kansallinen RDA-termi
source: YSO-termi
source: ALLFO-term @sv
source: Nationell RDA-term @sv
created: 2018-11-01
modified: 2024-08-27
alternative label: restaurant workers @en
alternative label: ravintolatyöntekijät
alternative label: restauranganställd @sv
alternative label: restauranganställda @sv
broader: työntekijä
in scheme: Metatietosanasto
preferred label: restaurant worker @en
preferred label: restaurangarbetare @sv

hotellinjohtaja
type: Concept
source: Kansallinen RDA-termi
source: YSO-termi
source: ALLFO-term @sv
source: Nationell RDA-term @sv
created: 2018-11-01
modified: 2024-08-27
alternative label: hotel managers @en
alternative label: hotelkeepers @en
alternative label: hotellinjohtajat
alternative label: hotellchefer @sv
alternative label: hotelldirektörer @sv
broader: johtaja
in scheme: Metatietosanasto
preferred label: hotel manager @en
preferred label: hotelldirektör @sv

automekaanikko
type: Concept
source: Kansallinen RDA-termi
source: YSO-termi
source: ALLFO-term @sv
source: Nationell RDA-term @sv
created: 2018-11-01
modified: 2024-08-27
alternative label: car mechanics @en
alternative label: automekaanikot
broader: mekaanikko
in scheme: Metatietosanasto
preferred label: car mechanic @en
preferred label: bilmekaniker @sv

tanssija
type: Concept
source: Kansallinen RDA-termi
source: YSO-termi
source: ALLFO-term @sv
source: Nationell RDA-term @sv
created: 2018-11-01
modified: 2024-08-27
alternative label: dancers @en
alternative label: balettitanssijat
alternative label: ballerinat
alternative label: tanssijat
alternative label: tanssitaiteilijat
alternative label: balettdansöser @sv
alternative label: ballerinor @sv
alternative label: danskonstnärer @sv
alternative label: dansöser @sv
broader: näyttämötaiteilija
in scheme: Metatietosanasto
preferred label: dancer @en
preferred label: dansare @sv

aitajuoksija
type: Concept
source: Kansallinen RDA-termi
source: YSO-termi
source: ALLFO-term @sv
source: Nationell RDA-term @sv
created: 2018-11-01
modified: 2024-08-27
alternative label: hurdlers @en
alternative label: aitajuoksijat
broader: juoksija
in scheme: Metatietosanasto
preferred label: hurdler @en
preferred label: hinderlöpare @sv

vuoriteknikko
type: Concept
source: Kansallinen RDA-termi
source: YSO-termi
source: ALLFO-term @sv
source: Nationell RDA-term @sv
created: 2018-11-01
modified: 2024-08-27
alternative label: mountain engineers @en
alternative label: vuoriteknikot
broader: teknikko
in scheme: Metatietosanasto
preferred label: mountain engineer @en
preferred label: bergstekniker @sv

kultaseppä
type: Concept
source: Kansallinen RDA-termi
source: YSO-termi
source: ALLFO-term @sv
source: Nationell RDA-term @sv
created: 2018-11-01
modified: 2024-08-27
alternative label: goldsmiths @en
alternative label: kultasepät
alternative label: guldsmeder @sv
broader: seppä
in scheme: Metatietosanasto
preferred label: goldsmith @en
preferred label: guldsmed @sv

patentti-insinööri
type: Concept
source: Kansallinen RDA-termi
source: YSO-termi
source: ALLFO-term @sv
source: Nationell RDA-term @sv
created: 2018-11-01
modified: 2024-08-27
alternative label: patent engineers @en
alternative label: patentti-insinöörit
alternative label: patentingenjörer @sv
broader: insinööri
in scheme: Metatietosanasto
preferred label: patent engineer @en
preferred label: patentingenjör @sv

automaalari
type: Concept
source: Kansallinen RDA-termi
source: YSO-termi
source: ALLFO-term @sv
source: Nationell RDA-term @sv
created: 2018-11-01
modified: 2024-08-27
alternative label: vehicle painters @en
alternative label: automaalarit
alternative label: bilmålare @sv
broader: maalari
in scheme: Metatietosanasto
preferred label: vehicle painter @en
preferred label: billackerare @sv

eläintenkouluttaja
type: Concept
source: Kansallinen RDA-termi
source: YSO-termi
source: ALLFO-term @sv
source: Nationell RDA-term @sv
created: 2018-11-01
modified: 2024-08-27
alternative label: animal trainers @en
alternative label: eläintenkouluttajat
broader: kouluttaja
in scheme: Metatietosanasto
preferred label: animal trainer @en
preferred label: djurtränare @sv

taloustoimittaja
type: Concept
source: Kansallinen RDA-termi
source: YSO-termi
source: ALLFO-term @sv
source: Nationell RDA-term @sv
created: 2018-11-01
modified: 2024-08-27
alternative label: economic correspondents @en
alternative label: financial editors @en
alternative label: financial journalists @en
alternative label: taloustoimittajat
alternative label: ekonomiredaktörer @sv
broader: toimittaja
in scheme: Metatietosanasto
preferred label: financial journalist @en
preferred label: ekonomiredaktör @sv

rakennuspäällikkö
type: Concept
source: Kansallinen RDA-termi
source: YSO-termi
source: ALLFO-term @sv
source: Nationell RDA-term @sv
created: 2018-11-01
modified: 2024-08-27
alternative label: construction managers @en
alternative label: rakennuspäälliköt
alternative label: byggnadschefer @sv
broader: päällikkö
in scheme: Metatietosanasto
preferred label: construction manager @en
preferred label: byggnadschef @sv

arkkipiispa
type: Concept
source: Kansallinen RDA-termi
source: YSO-termi
source: ALLFO-term @sv
source: Nationell RDA-term @sv
created: 2018-11-01
modified: 2024-08-27
alternative label: archbishops @en
alternative label: arkkipiispat
alternative label: ärkebiskopar @sv
broader: piispa
in scheme: Metatietosanasto
preferred label: archbishop @en
preferred label: ärkebiskop @sv

kuvaamataidonopettaja
type: Concept
source: Kansallinen RDA-termi
source: YSO-termi
source: ALLFO-term @sv
source: Nationell RDA-term @sv
created: 2018-11-01
modified: 2024-08-27
alternative label: kuvaamataidonopettaja (ammatti)
alternative label: teckningslärare (yrke) @sv
broader: aineenopettaja
in scheme: Metatietosanasto
preferred label: art teacher @en
preferred label: teckningslärare @sv

vankilanjohtaja
type: Concept
source: Kansallinen RDA-termi
source: YSO-termi
source: ALLFO-term @sv
source: Nationell RDA-term @sv
created: 2018-11-01
modified: 2024-08-27
alternative label: directors of prison administrations @en
alternative label: vankilanjohtajat
alternative label: fängelsedirektörer @sv
broader: johtaja
in scheme: Metatietosanasto
preferred label: director of prison administration @en
preferred label: fängelsedirektör @sv

työntutkija
type: Concept
source: Kansallinen RDA-termi
source: YSO-termi
source: ALLFO-term @sv
source: Nationell RDA-term @sv
created: 2018-11-01
modified: 2024-08-27
alternative label: work researchers @en
alternative label: työntutkijat
alternative label: arbetsstudiemän @sv
broader: tutkija
in scheme: Metatietosanasto
preferred label: work researcher @en
preferred label: arbetsstudieman @sv

sotilaslääkäri
type: Concept
source: Kansallinen RDA-termi
source: YSO-termi
source: ALLFO-term @sv
source: Nationell RDA-term @sv
created: 2018-11-01
modified: 2024-08-27
alternative label: military medical doctors @en
alternative label: sotilaslääkärit
broader: lääkäri
in scheme: Metatietosanasto
preferred label: military medical doctor @en
preferred label: militärläkare @sv

laatupäällikkö
type: Concept
source: Kansallinen RDA-termi
source: YSO-termi
source: ALLFO-term @sv
source: Nationell RDA-term @sv
created: 2018-11-01
modified: 2024-08-27
alternative label: quality managers @en
alternative label: laatupäälliköt
alternative label: kvalitetschefer @sv
broader: päällikkö
in scheme: Metatietosanasto
preferred label: quality manager @en
preferred label: kvalitetschef @sv

läänieläinlääkäri
type: Concept
source: Kansallinen RDA-termi
source: YSO-termi
source: ALLFO-term @sv
source: Nationell RDA-term @sv
created: 2018-11-01
modified: 2024-08-27
alternative label: regional veterinary officers @en
alternative label: läänineläinlääkärit
alternative label: länsveterinärer @sv
broader: eläinlääkäri
in scheme: Metatietosanasto
preferred label: regional veterinary officer @en
preferred label: länsveterinär @sv

konepäällikkö
type: Concept
source: Kansallinen RDA-termi
source: YSO-termi
source: ALLFO-term @sv
source: Nationell RDA-term @sv
created: 2018-11-01
modified: 2024-08-27
alternative label: chief mechanic engineers @en
alternative label: konepäälliköt
alternative label: maskinchefer @sv
broader: päällikkö
in scheme: Metatietosanasto
preferred label: chief mechanic engineer @en
preferred label: maskinchef @sv

harmonikansoittaja
type: Concept
source: Kansallinen RDA-termi
source: YSO-termi
source: ALLFO-term @sv
source: Nationell RDA-term @sv
created: 2018-11-01
modified: 2024-08-27
alternative label: accordionists @en
alternative label: hanurinsoittajat
alternative label: hanuristit
alternative label: harmonikansoittajat
broader: soittaja
in scheme: Metatietosanasto
preferred label: accordionist @en
preferred label: dragspelare @sv

musiikkikirjastonhoitaja
type: Concept
source: Kansallinen RDA-termi
source: YSO-termi
source: ALLFO-term @sv
source: Nationell RDA-term @sv
created: 2018-11-01
modified: 2024-08-27
alternative label: music librarians @en
alternative label: musiikkikirjastonhoitajat
alternative label: musikbibliotekarier @sv
broader: kirjastonhoitaja
in scheme: Metatietosanasto
preferred label: music librarian @en
preferred label: musikbibliotekarie @sv

maaseutuyrittäjä
type: Concept
source: Kansallinen RDA-termi
source: YSO-termi
source: ALLFO-term @sv
source: Nationell RDA-term @sv
created: 2018-11-01
modified: 2024-08-27
alternative label: rural entrepreneurs @en
alternative label: maaseutuyrittäjät
broader: yrittäjä
in scheme: Metatietosanasto
preferred label: rural entrepreneur @en
preferred label: landsbygdsföretagare @sv

nopeuslaskija
type: Concept
source: Kansallinen RDA-termi
source: YSO-termi
source: ALLFO-term @sv
source: Nationell RDA-term @sv
created: 2018-11-01
modified: 2024-08-27
alternative label: speed skiers @en
alternative label: nopeuslaskijat
broader: urheilija
in scheme: Metatietosanasto
preferred label: speed skier @en
preferred label: speedskiåkare @sv

kirjeenvaihtaja
type: Concept
source: Kansallinen RDA-termi
source: YSO-termi
source: ALLFO-term @sv
source: Nationell RDA-term @sv
created: 2018-11-01
modified: 2024-08-27
alternative label: correspondents @en
alternative label: kirjeenvaihtajat
alternative label: brevväxlare @sv
alternative label: korrespondenter @sv
in scheme: Metatietosanasto
narrower: sotakirjeenvaihtaja
preferred label: correspondent @en
preferred label: korrespondent @sv

kirjastonhoitaja
type: Concept
source: Kansallinen RDA-termi
source: YSO-termi
source: ALLFO-term @sv
source: Nationell RDA-term @sv
created: 2018-11-01
modified: 2024-08-27
alternative label: librarians @en
alternative label: kirjastonhoitajat
alternative label: bibliotekarier @sv
in scheme: Metatietosanasto
narrower: musiikkikirjastonhoitaja
preferred label: librarian @en
preferred label: bibliotekarie @sv

hallituksen puheenjohtaja
type: Concept
source: Kansallinen RDA-termi
source: YSO-termi
source: ALLFO-term @sv
source: Nationell RDA-term @sv
created: 2018-11-01
modified: 2024-08-27
alternative label: chairman of the board @en
alternative label: chairpersons of the board @en
alternative label: hallituksen puheenjohtajat
broader: puheenjohtaja
in scheme: Metatietosanasto
preferred label: chairperson of the board @en
preferred label: styrelseordförande @sv

kotiavustaja
type: Concept
source: Kansallinen RDA-termi
source: YSO-termi
source: ALLFO-term @sv
source: Nationell RDA-term @sv
created: 2018-11-01
modified: 2024-08-27
alternative label: domestic helpers @en
alternative label: kotiavustajat
broader: avustaja
in scheme: Metatietosanasto
preferred label: domestic helper @en
preferred label: hemhjälpare @sv

harrastajanäyttelijä
type: Concept
source: Kansallinen RDA-termi
source: YSO-termi
source: ALLFO-term @sv
source: Nationell RDA-term @sv
created: 2018-11-01
modified: 2024-08-27
alternative label: amateur actors @en
alternative label: harrastajanäyttelijät
broader: näyttelijä
in scheme: Metatietosanasto
preferred label: amateur actor @en
preferred label: amatörskådespelare @sv

diakoni
type: Concept
source: Kansallinen RDA-termi
source: YSO-termi
source: ALLFO-term @sv
source: Nationell RDA-term @sv
created: 2018-11-01
modified: 2024-08-27
alternative label: deacons @en
alternative label: diakonit
alternative label: diakoner @sv
broader: kirkon työntekijä
in scheme: Metatietosanasto
preferred label: deacon @en
preferred label: diakon @sv

varaosamyyjä
type: Concept
source: Kansallinen RDA-termi
source: YSO-termi
source: ALLFO-term @sv
source: Nationell RDA-term @sv
created: 2018-11-01
modified: 2024-08-27
alternative label: parts salespeople @en
alternative label: varaosamyyjät
broader: myyjä
in scheme: Metatietosanasto
preferred label: parts salesperson @en
preferred label: reservdelsförsäljare @sv

kaivostyöntekijä
type: Concept
source: Kansallinen RDA-termi
source: YSO-termi
source: ALLFO-term @sv
source: Nationell RDA-term @sv
created: 2018-11-01
modified: 2024-08-27
alternative label: miners @en
alternative label: kaivostyöläiset
alternative label: kaivostyöntekijät
broader: työntekijä
in scheme: Metatietosanasto
preferred label: miner @en
preferred label: gruvarbetare @sv

televisio-ohjaaja
type: Concept
source: Kansallinen RDA-termi
source: YSO-termi
source: ALLFO-term @sv
source: Nationell RDA-term @sv
created: 2018-11-01
modified: 2024-08-27
alternative label: television directors @en
alternative label: televisio-ohjaajat
alternative label: tv-regissörer @sv
broader: ohjaaja (taiteet ja media)
in scheme: Metatietosanasto
preferred label: television director @en
preferred label: tv-regissör @sv

metsäkoneenkuljettaja
type: Concept
source: Kansallinen RDA-termi
source: YSO-termi
source: ALLFO-term @sv
source: Nationell RDA-term @sv
created: 2018-11-01
modified: 2024-08-27
alternative label: forest machine operators @en
alternative label: forest machinery operators @en
alternative label: forestry machine operators @en
alternative label: metsäkoneenkuljettajat
alternative label: skogsmaskinförare @sv
broader: kuljettaja
in scheme: Metatietosanasto
preferred label: forest machine operator @en
preferred label: skogsmaskinsförare @sv

kilpakävelijä
type: Concept
source: Kansallinen RDA-termi
source: YSO-termi
source: ALLFO-term @sv
source: Nationell RDA-term @sv
created: 2018-11-01
modified: 2024-08-27
alternative label: racewalkers @en
alternative label: kilpakävelijät
alternative label: tävlingsgångare @sv
broader: yleisurheilija
in scheme: Metatietosanasto
preferred label: race walker @en
preferred label: gångare @sv

karjapaimen
type: Concept
source: Kansallinen RDA-termi
source: YSO-termi
source: ALLFO-term @sv
source: Nationell RDA-term @sv
created: 2018-11-01
modified: 2024-08-27
alternative label: cattle herders @en
alternative label: cowboyt
alternative label: karjapaimenet
alternative label: cowboyer @sv
broader: paimen
in scheme: Metatietosanasto
preferred label: cattle herder @en
preferred label: cowboy @sv

kuvittaja
type: Concept
source: Kansallinen RDA-termi
source: YSO-termi
source: ALLFO-term @sv
source: Nationell RDA-term @sv
created: 2018-11-01
modified: 2024-08-27
alternative label: kuvittaja (ammatti)
alternative label: illustratör (yrke) @sv
broader: kuvataiteilija
in scheme: Metatietosanasto
preferred label: illustrator @en
preferred label: illustratör @sv

terveydenhuollon opettaja
type: Concept
source: Kansallinen RDA-termi
source: YSO-termi
source: ALLFO-term @sv
source: Nationell RDA-term @sv
created: 2018-11-01
modified: 2024-08-27
alternative label: health care teachers @en
alternative label: terveydenhuollon opettajat
broader: ammatillisten opintojen opettaja
in scheme: Metatietosanasto
preferred label: health care teacher @en
preferred label: hälsovårdslärare @sv

asuntoministeri
type: Concept
source: Kansallinen RDA-termi
source: YSO-termi
source: ALLFO-term @sv
source: Nationell RDA-term @sv
created: 2018-11-01
modified: 2024-08-27
alternative label: ministers of housing @en
alternative label: asuntoministerit
alternative label: bostadsministrar @sv
broader: ministeri
in scheme: Metatietosanasto
preferred label: minister of housing @en
preferred label: bostadsminister @sv

majuri
type: Concept
source: Kansallinen RDA-termi
source: YSO-termi
source: ALLFO-term @sv
source: Nationell RDA-term @sv
created: 2018-11-01
modified: 2024-08-27
alternative label: majors @en
alternative label: majurit
alternative label: majorer @sv
broader: upseeri
in scheme: Metatietosanasto
preferred label: major @en

paavi
type: Concept
source: Kansallinen RDA-termi
source: YSO-termi
source: ALLFO-term @sv
source: Nationell RDA-term @sv
created: 2018-11-01
modified: 2024-08-27
alternative label: paavi (ammatti)
alternative label: påve (yrke) @sv
broader: uskonnollinen johtaja
in scheme: Metatietosanasto
preferred label: påve @sv

teollisuustoimihenkilö
type: Concept
source: Kansallinen RDA-termi
source: YSO-termi
source: ALLFO-term @sv
source: Nationell RDA-term @sv
created: 2018-11-01
modified: 2024-08-27
alternative label: industrial employees @en
alternative label: teollisuustoimihenkilöt
alternative label: industritjänstemän @sv
broader: toimihenkilö
in scheme: Metatietosanasto
preferred label: industrial employee @en
preferred label: industritjänsteman @sv

rakennusinsinööri
type: Concept
source: Kansallinen RDA-termi
source: YSO-termi
source: ALLFO-term @sv
source: Nationell RDA-term @sv
created: 2018-11-01
modified: 2024-08-27
alternative label: civil engineers @en
alternative label: rakennusinsinöörit
alternative label: byggnadsingenjörer @sv
broader: insinööri
in scheme: Metatietosanasto
preferred label: civil engineer @en
preferred label: byggnadsingenjör @sv

pääjohtaja
type: Concept
source: Kansallinen RDA-termi
source: YSO-termi
source: ALLFO-term @sv
source: Nationell RDA-term @sv
created: 2018-11-01
modified: 2024-08-27
alternative label: directors general @en
alternative label: pääjohtaja (ammatti)
alternative label: pääjohtajat
alternative label: generaldirektör (yrke) @sv
alternative label: generaldirektörer @sv
broader: johtaja
in scheme: Metatietosanasto
preferred label: director general @en
preferred label: generaldirektör @sv

ihmisoikeusaktivisti
type: Concept
source: Kansallinen RDA-termi
source: YSO-termi
source: ALLFO-term @sv
source: Nationell RDA-term @sv
created: 2018-11-01
modified: 2024-08-27
alternative label: human rights activists @en
alternative label: ihmisoikeusaktivistit
alternative label: människorättsaktivister @sv
broader: aktivisti
in scheme: Metatietosanasto
preferred label: human rights activist @en
preferred label: människorättsaktivist @sv

suutari
type: Concept
source: Kansallinen RDA-termi
source: YSO-termi
source: ALLFO-term @sv
source: Nationell RDA-term @sv
created: 2018-11-01
modified: 2024-08-27
alternative label: shoemakers @en
alternative label: suutarit
broader: käsityöläinen
in scheme: Metatietosanasto
preferred label: shoemaker @en
preferred label: skomakare @sv

tehdasjohtaja
type: Concept
source: Kansallinen RDA-termi
source: YSO-termi
source: ALLFO-term @sv
source: Nationell RDA-term @sv
created: 2018-11-01
modified: 2024-08-27
alternative label: factory managers @en
alternative label: tehtaanjohtajat
alternative label: fabrikschefer @sv
broader: johtaja
in scheme: Metatietosanasto
preferred label: factory manager @en
preferred label: fabrikschef @sv

palveluntuottaja
type: Concept
source: Kansallinen RDA-termi
source: YSO-termi
source: ALLFO-term @sv
source: Nationell RDA-term @sv
created: 2018-11-01
modified: 2024-08-27
alternative label: service producers @en
alternative label: palveluntuottajat
alternative label: tjänsteproducenter @sv
broader: tuottaja
in scheme: Metatietosanasto
preferred label: service producer @en
preferred label: tjänsteproducent @sv

anestesiologi
type: Concept
source: Kansallinen RDA-termi
source: YSO-termi
source: ALLFO-term @sv
source: Nationell RDA-term @sv
created: 2018-11-01
modified: 2024-08-27
alternative label: anesthesiologists @en
alternative label: anesthetists @en
alternative label: anestesialääkärit
alternative label: anestesiologit
alternative label: nukutuslääkärit
alternative label: anestesiologer @sv
broader: lääkäri
in scheme: Metatietosanasto
preferred label: anesthesiologist @en
preferred label: anestesiolog @sv

matkailuopas
type: Concept
source: Kansallinen RDA-termi
source: YSO-termi
source: ALLFO-term @sv
source: Nationell RDA-term @sv
created: 2018-11-01
modified: 2024-08-27
alternative label: tourist guides @en
alternative label: matkailuoppaat
alternative label: reseguider @sv
alternative label: turistguider @sv
broader: opas
in scheme: Metatietosanasto
preferred label: tourist guide (service occupation) @en
preferred label: turistguide @sv

kontratenori
type: Concept
source: Kansallinen RDA-termi
source: YSO-termi
source: ALLFO-term @sv
source: Nationell RDA-term @sv
created: 2018-11-01
modified: 2024-08-27
alternative label: countertenors @en
alternative label: kontratenorilaulajat
alternative label: kontratenorit
alternative label: laulajat -- kontratenori
alternative label: kontratenor (sångare) @sv
alternative label: kontratenorer @sv
alternative label: kontratenorsångare @sv
broader: mieslaulaja
in scheme: Metatietosanasto
preferred label: countertenor (singer) @en
preferred label: kontratenor @sv

ympäristötaiteilija
type: Concept
source: Kansallinen RDA-termi
source: YSO-termi
source: ALLFO-term @sv
source: Nationell RDA-term @sv
created: 2018-11-01
modified: 2024-08-27
alternative label: environmental artists @en
alternative label: ympäristötaiteilijat
alternative label: miljökonstnärer @sv
broader: taiteilija
in scheme: Metatietosanasto
preferred label: environmental artist @en
preferred label: miljökonstnär @sv

päätoimittaja
type: Concept
source: Kansallinen RDA-termi
source: YSO-termi
source: ALLFO-term @sv
source: Nationell RDA-term @sv
created: 2018-11-01
modified: 2024-08-27
alternative label: päätoimittaja (ammatti)
alternative label: chefredaktör (yrke) @sv
broader: toimittaja
in scheme: Metatietosanasto
preferred label: chief editor @en
preferred label: chefredaktör @sv

palomestari
type: Concept
source: Kansallinen RDA-termi
source: YSO-termi
source: ALLFO-term @sv
source: Nationell RDA-term @sv
created: 2018-11-01
modified: 2024-08-27
alternative label: senior fire fighters @en
alternative label: palomestarit
broader: palomies
in scheme: Metatietosanasto
preferred label: senior fire fighter @en
preferred label: brandmästare @sv

seitsenottelija
type: Concept
source: Kansallinen RDA-termi
source: YSO-termi
source: ALLFO-term @sv
source: Nationell RDA-term @sv
created: 2018-11-01
modified: 2024-08-27
alternative label: heptathletes @en
alternative label: seitsenottelijat
broader: yleisurheilija
in scheme: Metatietosanasto
preferred label: heptathlete @en
preferred label: sjukampare @sv

kulkukauppias
type: Concept
source: Kansallinen RDA-termi
source: YSO-termi
source: ALLFO-term @sv
source: Nationell RDA-term @sv
created: 2018-11-01
modified: 2024-08-27
alternative label: peddlers @en
alternative label: pedlars @en
alternative label: kulkukauppiaat
alternative label: nasare @sv
broader: kauppias
in scheme: Metatietosanasto
preferred label: pedlar @en
preferred label: gårdfarihandlare @sv

rikostoimittaja
type: Concept
source: Kansallinen RDA-termi
source: YSO-termi
source: ALLFO-term @sv
source: Nationell RDA-term @sv
created: 2018-11-01
modified: 2024-08-27
alternative label: crime journalists @en
alternative label: crime reporters @en
alternative label: rikostoimittajat
alternative label: brottsjournalister @sv
alternative label: brottsreportrar @sv
alternative label: kriminaljournalister @sv
alternative label: kriminalredaktörer @sv
alternative label: kriminalreportrar @sv
broader: toimittaja
in scheme: Metatietosanasto
preferred label: crime journalist @en
preferred label: brottsjournalist @sv

oikeudenkäyntiavustaja
type: Concept
source: Kansallinen RDA-termi
source: YSO-termi
source: ALLFO-term @sv
source: Nationell RDA-term @sv
created: 2018-11-01
modified: 2024-08-27
alternative label: counsels @en
alternative label: legal counsels @en
alternative label: oikeudenkäyntiavustajat
alternative label: rättegångsbiträden @sv
broader: avustaja
in scheme: Metatietosanasto
preferred label: counsel @en
preferred label: rättegångsbiträde @sv

kotiopettaja
type: Concept
source: Kansallinen RDA-termi
source: YSO-termi
source: ALLFO-term @sv
source: Nationell RDA-term @sv
created: 2018-11-01
modified: 2024-08-27
alternative label: in-home tutors @en
alternative label: kotiopettajat
alternative label: kotiopettajattaret
alternative label: guvernanter @sv
alternative label: informatorer @sv
broader: opettaja
in scheme: Metatietosanasto
preferred label: in-home tutor @en
preferred label: informator @sv

taikuri
type: Concept
source: Kansallinen RDA-termi
source: YSO-termi
source: ALLFO-term @sv
source: Nationell RDA-term @sv
created: 2018-11-01
modified: 2024-08-27
alternative label: magicians @en
alternative label: taikurit
alternative label: trollkonstnärer @sv
in scheme: Metatietosanasto
narrower: mentalisti
preferred label: magician @en
preferred label: trollkonstnär @sv

konsernijohtaja
type: Concept
source: Kansallinen RDA-termi
source: YSO-termi
source: ALLFO-term @sv
source: Nationell RDA-term @sv
created: 2018-11-01
modified: 2024-08-27
alternative label: corporate managers @en
alternative label: konsernijohtajat
alternative label: koncernchefer @sv
alternative label: koncernledare @sv
broader: johtaja
in scheme: Metatietosanasto
preferred label: corporate manager @en
preferred label: koncernchef @sv

lähetetty työntekijä
type: Concept
source: Kansallinen RDA-termi
source: YSO-termi
source: ALLFO-term @sv
source: Nationell RDA-term @sv
created: 2018-11-01
modified: 2024-08-27
alternative label: posted workers @en
alternative label: lähetetyt työntekijät
alternative label: utsända arbetare @sv
broader: työntekijä
in scheme: Metatietosanasto
preferred label: posted worker @en
preferred label: utsänd arbetare @sv

mäkihyppääjä
type: Concept
source: Kansallinen RDA-termi
source: YSO-termi
source: ALLFO-term @sv
source: Nationell RDA-term @sv
created: 2018-11-01
modified: 2024-08-27
alternative label: ski jumpers @en
alternative label: mäkihyppääjät
broader: urheilija
in scheme: Metatietosanasto
preferred label: ski jumper @en
preferred label: backhoppare @sv

gynekologi
type: Concept
source: Kansallinen RDA-termi
source: YSO-termi
source: ALLFO-term @sv
source: Nationell RDA-term @sv
created: 2018-11-01
modified: 2024-08-27
alternative label: gynecologists @en
alternative label: gynekologit
alternative label: gynekologer @sv
broader: lääkäri
in scheme: Metatietosanasto
preferred label: gynecologist @en
preferred label: gynekolog @sv

nuorisotyöntekijä
type: Concept
source: Kansallinen RDA-termi
source: YSO-termi
source: ALLFO-term @sv
source: Nationell RDA-term @sv
created: 2018-11-01
modified: 2024-08-27
alternative label: youth workers @en
alternative label: nuorisotyöntekijät
broader: työntekijä
in scheme: Metatietosanasto
preferred label: youth worker @en
preferred label: ungdomsarbetare @sv

kuulantyöntäjä
type: Concept
source: Kansallinen RDA-termi
source: YSO-termi
source: ALLFO-term @sv
source: Nationell RDA-term @sv
created: 2018-11-01
modified: 2024-08-27
alternative label: shot-putters @en
alternative label: kuulantyöntäjät
broader: yleisurheilija
in scheme: Metatietosanasto
preferred label: shot-putter @en
preferred label: kulstötare @sv

musiikkitoimittaja
type: Concept
source: Kansallinen RDA-termi
source: YSO-termi
source: ALLFO-term @sv
source: Nationell RDA-term @sv
created: 2018-11-01
modified: 2024-08-27
alternative label: music journalists @en
alternative label: musiikkitoimittajat
alternative label: musikjournalister @sv
alternative label: musikredaktörer @sv
alternative label: musikreportrar @sv
broader: toimittaja
in scheme: Metatietosanasto
preferred label: music journalist @en
preferred label: musikredaktör @sv

klovni
type: Concept
source: Kansallinen RDA-termi
source: YSO-termi
source: ALLFO-term @sv
source: Nationell RDA-term @sv
created: 2018-11-01
modified: 2024-08-27
alternative label: clowns @en
alternative label: klovnit
alternative label: clowner @sv
broader: sirkustaiteilija
in scheme: Metatietosanasto
preferred label: clown @en

maalivahti
type: Concept
source: Kansallinen RDA-termi
source: YSO-termi
source: ALLFO-term @sv
source: Nationell RDA-term @sv
created: 2018-11-01
modified: 2024-08-27
alternative label: goalkeepers @en
alternative label: maalivahdit
alternative label: målvakter @sv
broader: urheilija
in scheme: Metatietosanasto
preferred label: goalkeeper @en
preferred label: målvakt @sv

nuorisosihteeri
type: Concept
source: Kansallinen RDA-termi
source: YSO-termi
source: ALLFO-term @sv
source: Nationell RDA-term @sv
created: 2018-11-01
modified: 2024-08-27
alternative label: youth secretaries @en
alternative label: nuorisosihteerit
broader: sihteeri
in scheme: Metatietosanasto
preferred label: youth secretary @en
preferred label: ungdomssekreterare @sv

elokuvaohjaaja
type: Concept
source: Kansallinen RDA-termi
source: YSO-termi
source: ALLFO-term @sv
source: Nationell RDA-term @sv
created: 2018-11-01
modified: 2024-08-27
alternative label: elokuvaohjaaja (ammatti)
alternative label: filmregissör (yrke) @sv
broader: ohjaaja (taiteet ja media)
in scheme: Metatietosanasto
preferred label: film director @en
preferred label: filmregissör @sv

kansanedustajan avustaja
type: Concept
source: Kansallinen RDA-termi
source: YSO-termi
source: ALLFO-term @sv
source: Nationell RDA-term @sv
created: 2018-11-01
modified: 2024-08-27
alternative label: assistants for members of parliament @en
alternative label: kansanedustajan avustajat
alternative label: ledamotsassistenter @sv
alternative label: riksdagsledamots specialmedarbetare @sv
broader: avustaja
in scheme: Metatietosanasto
preferred label: assistant for member of parliament @en
preferred label: ledamotsassistent @sv

keittiötyöntekijä
type: Concept
source: Kansallinen RDA-termi
source: YSO-termi
source: ALLFO-term @sv
source: Nationell RDA-term @sv
created: 2018-11-01
modified: 2024-08-27
alternative label: kitchen workers @en
alternative label: keittiötyöntekijät
alternative label: köksanställda @sv
alternative label: kökspersonal @sv
broader: työntekijä
in scheme: Metatietosanasto
preferred label: kitchen worker @en
preferred label: köksarbetare @sv

pankkitoimihenkilö
type: Concept
source: Kansallinen RDA-termi
source: YSO-termi
source: ALLFO-term @sv
source: Nationell RDA-term @sv
created: 2018-11-01
modified: 2025-04-12
alternative label: bank employees @en
alternative label: pankkitoimihenkilöt
alternative label: pankkivirkailijat
alternative label: bankfunktionärer @sv
alternative label: banktjänstemän @sv
alternative label: banktjänsteperson @sv
broader: toimihenkilö
in scheme: Metatietosanasto
preferred label: bank clerk @en
preferred label: banktjänsteman @sv

värjääjä
type: Concept
source: Kansallinen RDA-termi
source: YSO-termi
source: ALLFO-term @sv
source: Nationell RDA-term @sv
created: 2018-11-01
modified: 2024-08-27
alternative label: dyers @en
alternative label: värjärimestarit
alternative label: värjärit
alternative label: värjääjät
broader: käsityöläinen
in scheme: Metatietosanasto
preferred label: dyer @en
preferred label: färgare @sv

puutarha-arkkitehti
type: Concept
source: Kansallinen RDA-termi
source: YSO-termi
source: ALLFO-term @sv
source: Nationell RDA-term @sv
created: 2018-11-01
modified: 2024-08-27
alternative label: puutarha-arkkitehdit
alternative label: trädgårdsarkitekter @sv
broader: arkkitehti
in scheme: Metatietosanasto
preferred label: trädgårdsarkitekt @sv

teollisuustyöntekijä
type: Concept
source: Kansallinen RDA-termi
source: YSO-termi
source: ALLFO-term @sv
source: Nationell RDA-term @sv
created: 2018-11-01
modified: 2024-08-27
alternative label: industrial workers @en
alternative label: tehdastyöläiset
alternative label: teollisuustyöläiset
alternative label: teollisuustyöntekijät
broader: työntekijä
in scheme: Metatietosanasto
preferred label: industrial worker @en
preferred label: industriarbetare @sv

golfaaja
type: Concept
source: Kansallinen RDA-termi
source: YSO-termi
source: ALLFO-term @sv
source: Nationell RDA-term @sv
created: 2018-11-01
modified: 2024-08-27
alternative label: golfers @en
alternative label: golfaajat
alternative label: golfinpelaajat
broader: urheilija
in scheme: Metatietosanasto
preferred label: golfer @en
preferred label: golfspelare @sv

kunnanvaltuutettu
type: Concept
source: Kansallinen RDA-termi
source: YSO-termi
source: ALLFO-term @sv
source: Nationell RDA-term @sv
created: 2018-11-01
modified: 2024-08-27
alternative label: municipal councillors @en
alternative label: kunnanvaltuutetut
alternative label: kommunfullmäktigeledamöter @sv
broader: valtuutettu
in scheme: Metatietosanasto
preferred label: municipal councillor @en
preferred label: kommunfullmäktigeledamot @sv

maanmittausteknikko
type: Concept
source: Kansallinen RDA-termi
source: YSO-termi
source: ALLFO-term @sv
source: Nationell RDA-term @sv
created: 2018-11-01
modified: 2024-08-27
alternative label: surveying technicians @en
alternative label: maanmittausteknikot
broader: teknikko
in scheme: Metatietosanasto
preferred label: surveying technician @en
preferred label: lantmäteritekniker @sv

tanssimuusikko
type: Concept
source: Kansallinen RDA-termi
source: YSO-termi
source: ALLFO-term @sv
source: Nationell RDA-term @sv
created: 2018-11-01
modified: 2024-08-27
alternative label: dance musicians @en
alternative label: tanssimuusikot
broader: muusikko
in scheme: Metatietosanasto
preferred label: dance musician @en
preferred label: dansmusiker @sv

koneyrittäjä
type: Concept
source: Kansallinen RDA-termi
source: YSO-termi
source: ALLFO-term @sv
source: Nationell RDA-term @sv
created: 2018-11-01
modified: 2024-08-27
alternative label: forestry and earth moving contractors @en
alternative label: koneyrittäjät
alternative label: maskinentreprenörer @sv
broader: yrittäjä
in scheme: Metatietosanasto
preferred label: forestry and earth moving contractor @en
preferred label: maskinentreprenör @sv

aktivisti
type: Concept
source: Kansallinen RDA-termi
source: YSO-termi
source: ALLFO-term @sv
source: Nationell RDA-term @sv
created: 2018-11-01
modified: 2024-08-27
alternative label: activists @en
alternative label: aktivistit
alternative label: aktivister @sv
in scheme: Metatietosanasto
narrower: ihmisoikeusaktivisti
preferred label: activist @en
preferred label: aktivist @sv

vaatturi
type: Concept
source: Kansallinen RDA-termi
source: YSO-termi
source: ALLFO-term @sv
source: Nationell RDA-term @sv
created: 2018-11-01
modified: 2024-08-27
alternative label: tailors @en
alternative label: räätälit
alternative label: vaatturit
alternative label: skräddare @sv
broader: käsityöläinen
in scheme: Metatietosanasto
preferred label: tailor @en
preferred label: skräddare (yrke) @sv

lääninrovasti
type: Concept
source: Kansallinen RDA-termi
source: YSO-termi
source: ALLFO-term @sv
source: Nationell RDA-term @sv
created: 2018-11-01
modified: 2024-08-27
alternative label: area deans @en
alternative label: lääninrovastit
alternative label: kontraktsprostar @sv
broader: rovasti
in scheme: Metatietosanasto
preferred label: area dean @en
preferred label: kontraktsprost @sv

projektipäällikkö
type: Concept
source: Kansallinen RDA-termi
source: YSO-termi
source: ALLFO-term @sv
source: Nationell RDA-term @sv
created: 2018-11-01
modified: 2024-08-27
alternative label: project managers @en
alternative label: projektijohtajat
alternative label: projektipäälliköt
alternative label: projektchefer @sv
broader: päällikkö
in scheme: Metatietosanasto
preferred label: project manager @en
preferred label: projektledare @sv

liikunnanopettaja
type: Concept
source: Kansallinen RDA-termi
source: YSO-termi
source: ALLFO-term @sv
source: Nationell RDA-term @sv
created: 2018-11-01
modified: 2024-08-27
alternative label: PE teachers @en
alternative label: physical education teachers @en
alternative label: liikunnanopettajat
broader: aineenopettaja
in scheme: Metatietosanasto
preferred label: physical education teacher @en
preferred label: idrottslärare @sv

kirkkoherra
type: Concept
source: Kansallinen RDA-termi
source: YSO-termi
source: ALLFO-term @sv
source: Nationell RDA-term @sv
created: 2018-11-01
modified: 2024-08-27
alternative label: parish ministers @en
alternative label: senior pastors @en
alternative label: vicars @en
alternative label: kirkkoherrat
alternative label: kyrkoherdar @sv
broader: pappi
in scheme: Metatietosanasto
preferred label: parish minister @en
preferred label: kyrkoherde @sv

lehdistöpäällikkö
type: Concept
source: Kansallinen RDA-termi
source: YSO-termi
source: ALLFO-term @sv
source: Nationell RDA-term @sv
created: 2018-11-01
modified: 2024-08-27
alternative label: press officers @en
alternative label: lehdistöpäälliköt
alternative label: pressansvariga @sv
alternative label: presschefer @sv
broader: päällikkö
in scheme: Metatietosanasto
preferred label: press officer @en
preferred label: presschef @sv

tekstiilityöopettaja
type: Concept
source: Kansallinen RDA-termi
source: YSO-termi
source: ALLFO-term @sv
source: Nationell RDA-term @sv
created: 2018-11-01
modified: 2024-08-27
alternative label: teachers in textile handicraft @en
alternative label: tekstiilityönopettajat
broader: käsityönopettaja
in scheme: Metatietosanasto
preferred label: teacher in textile handicraft @en
preferred label: textillärare @sv

rikosetsivä
type: Concept
source: Kansallinen RDA-termi
source: YSO-termi
source: ALLFO-term @sv
source: Nationell RDA-term @sv
created: 2018-11-01
modified: 2024-08-27
alternative label: detectives @en
alternative label: etsivät
alternative label: rikosetsivät
alternative label: brottsutredare @sv
alternative label: detektiver @sv
alternative label: kriminaldetektiver @sv
broader: poliisi
in scheme: Metatietosanasto
preferred label: detective @en
preferred label: detektiv @sv

pienyrittäjä
type: Concept
source: Kansallinen RDA-termi
source: YSO-termi
source: ALLFO-term @sv
source: Nationell RDA-term @sv
created: 2018-11-01
modified: 2024-08-27
alternative label: small-scale entrepreneurs @en
alternative label: pienyrittäjät
broader: yrittäjä
in scheme: Metatietosanasto
preferred label: small-scale entrepreneur @en
preferred label: småföretagare @sv

verkkotoimittaja
type: Concept
source: Kansallinen RDA-termi
source: YSO-termi
source: ALLFO-term @sv
source: Nationell RDA-term @sv
created: 2018-11-01
modified: 2024-08-27
alternative label: web editors @en
alternative label: verkkotoimittajat
alternative label: webbredaktörer @sv
broader: toimittaja
in scheme: Metatietosanasto
preferred label: web editor @en
preferred label: webbredaktör @sv

kaupunginsihteeri
type: Concept
source: Kansallinen RDA-termi
source: YSO-termi
source: ALLFO-term @sv
source: Nationell RDA-term @sv
created: 2018-11-01
modified: 2024-08-27
alternative label: city secretaries @en
alternative label: kaupunginsihteerit
broader: sihteeri
in scheme: Metatietosanasto
preferred label: city secretary @en
preferred label: stadssekreterare @sv

lääketyöntekijä
type: Concept
source: Kansallinen RDA-termi
source: YSO-termi
source: ALLFO-term @sv
source: Nationell RDA-term @sv
created: 2018-11-01
modified: 2024-08-27
alternative label: pharmacy assistants @en
alternative label: lääketyöntekijät
broader: työntekijä
in scheme: Metatietosanasto
preferred label: pharmacy assistant @en
preferred label: läkemedelsarbetare @sv

kaupunginvaltuutettu
type: Concept
source: Kansallinen RDA-termi
source: YSO-termi
source: ALLFO-term @sv
source: Nationell RDA-term @sv
created: 2018-11-01
modified: 2024-08-27
alternative label: town and city councillors @en
alternative label: kaupunginvaltuutetut
alternative label: stadsfullmäktigeledamöter @sv
broader: valtuutettu
in scheme: Metatietosanasto
preferred label: town and city councillor @en
preferred label: stadsfullmäktigeledamot @sv

merivartija
type: Concept
source: Kansallinen RDA-termi
source: YSO-termi
source: ALLFO-term @sv
source: Nationell RDA-term @sv
created: 2018-11-01
modified: 2024-08-27
alternative label: coastguards @en
alternative label: merivartijat
alternative label: kustbevakare @sv
broader: rajavartija
in scheme: Metatietosanasto
preferred label: coastguard @en
preferred label: sjöbevakare @sv

sotilasammattihenkilö
type: Concept
source: Kansallinen RDA-termi
source: YSO-termi
source: ALLFO-term @sv
source: Nationell RDA-term @sv
created: 2018-11-01
modified: 2024-08-27
alternative label: sotilasammattihenkilöt
alternative label: innehavare av militär specialtjänst @sv
alternative label: militär specialpersonal @sv
alternative label: stamanställda @sv
alternative label: yrkesmilitärer @sv
broader: sotilashenkilö
in scheme: Metatietosanasto
preferred label: yrkesmilitär @sv

kuurojenpappi
type: Concept
source: Kansallinen RDA-termi
source: YSO-termi
source: ALLFO-term @sv
source: Nationell RDA-term @sv
created: 2018-11-01
modified: 2024-08-27
alternative label: priests for the deaf @en
alternative label: kuurojenpapit
alternative label: dövpräster @sv
alternative label: präster för döva @sv
broader: pappi
in scheme: Metatietosanasto
preferred label: priest for the deaf @en
preferred label: dövpräst @sv

jääkiekkoilija
type: Concept
source: Kansallinen RDA-termi
source: YSO-termi
source: ALLFO-term @sv
source: Nationell RDA-term @sv
created: 2018-11-01
modified: 2024-08-27
alternative label: ice hockey players @en
alternative label: jääkiekkoilijat
broader: urheilija
in scheme: Metatietosanasto
preferred label: ice hockey player @en
preferred label: ishockeyspelare @sv

hammaslaborantti
type: Concept
source: Kansallinen RDA-termi
source: YSO-termi
source: ALLFO-term @sv
source: Nationell RDA-term @sv
created: 2018-11-01
modified: 2024-08-27
alternative label: dental laboratory assistants @en
alternative label: hammaslaborantit
alternative label: tandlaboranter @sv
broader: laborantti
in scheme: Metatietosanasto
preferred label: dental laboratory worker @en
preferred label: tandlaborant @sv

urheiluvaikuttaja
type: Concept
source: Kansallinen RDA-termi
source: YSO-termi
source: ALLFO-term @sv
source: Nationell RDA-term @sv
created: 2018-11-01
modified: 2024-08-27
alternative label: influential sports figures @en
alternative label: urheiluvaikuttajat
alternative label: idrottspersonligheter @sv
alternative label: idrottspåverkare @sv
alternative label: sportpersonligheter @sv
broader: yhteiskunnallinen vaikuttaja
in scheme: Metatietosanasto
preferred label: influential sports figure @en
preferred label: idrottspersonlighet @sv

valtion työntekijä
type: Concept
source: Kansallinen RDA-termi
source: YSO-termi
source: ALLFO-term @sv
source: Nationell RDA-term @sv
created: 2018-11-01
modified: 2024-08-27
alternative label: government employees @en
alternative label: state employees @en
alternative label: valtion työntekijät
alternative label: statens arbetstagare @sv
alternative label: statligt anställda @sv
alternative label: statsanställda @sv
alternative label: statstjänstemän @sv
broader: työntekijä
in scheme: Metatietosanasto
preferred label: government employee @en
preferred label: statsanställd @sv

runonlaulaja
type: Concept
source: Kansallinen RDA-termi
source: YSO-termi
source: ALLFO-term @sv
source: Nationell RDA-term @sv
created: 2018-11-01
modified: 2024-08-27
alternative label: Karelian folk singers @en
alternative label: rune singers @en
alternative label: runonlaulajat
broader: perinteentaitaja
in scheme: Metatietosanasto
preferred label: rune singer @en
preferred label: runosångare @sv

tietoliikenneasentaja
type: Concept
source: Kansallinen RDA-termi
source: YSO-termi
source: ALLFO-term @sv
source: Nationell RDA-term @sv
created: 2018-11-01
modified: 2024-08-27
alternative label: telecommunication technicians @en
alternative label: telecommunications installers @en
alternative label: tietoliikenneasentajat
alternative label: datakommunikationsmontörer @sv
broader: asentaja
in scheme: Metatietosanasto
preferred label: telecommunications installer @en
preferred label: datakommunikationsmontör @sv

puheterapeutti
type: Concept
source: Kansallinen RDA-termi
source: YSO-termi
source: ALLFO-term @sv
source: Nationell RDA-term @sv
created: 2018-11-01
modified: 2024-08-27
alternative label: speech therapists @en
alternative label: puheterapeutit
alternative label: talterapeuter @sv
broader: terapeutti
in scheme: Metatietosanasto
preferred label: speech therapist @en
preferred label: talterapeut @sv

kotiteollisuusopettaja
type: Concept
source: Kansallinen RDA-termi
source: YSO-termi
source: ALLFO-term @sv
source: Nationell RDA-term @sv
created: 2018-11-01
modified: 2024-08-27
alternative label: kotiteollisuusopettaja (ammatti)
alternative label: hemslöjdslärare (yrke) @sv
broader: ammatillisten opintojen opettaja
in scheme: Metatietosanasto
preferred label: teacher in handicraft school @en
preferred label: hemslöjdslärare @sv

oppilaitospappi
type: Concept
source: Kansallinen RDA-termi
source: YSO-termi
source: ALLFO-term @sv
source: Nationell RDA-term @sv
created: 2018-11-01
modified: 2024-08-27
alternative label: campus chaplains @en
alternative label: oppilaitospapit
alternative label: oppilaitospastorit
alternative label: skolpräst @sv
alternative label: studentpastorer @sv
alternative label: studentpräster @sv
broader: pappi
in scheme: Metatietosanasto
preferred label: campus chaplain @en
preferred label: studentpräst @sv

kehonrakentaja
type: Concept
source: Kansallinen RDA-termi
source: YSO-termi
source: ALLFO-term @sv
source: Nationell RDA-term @sv
created: 2018-11-01
modified: 2024-08-27
alternative label: bodybuilders @en
alternative label: kehonrakentajat
alternative label: bodybuildare @sv
broader: urheilija
in scheme: Metatietosanasto
preferred label: bodybuilder @en
preferred label: kroppsbyggare @sv

puolimatruusi
type: Concept
source: Kansallinen RDA-termi
source: YSO-termi
source: ALLFO-term @sv
source: Nationell RDA-term @sv
created: 2018-11-01
modified: 2024-08-27
alternative label: ordinary seamen @en
alternative label: puolimatruusit
alternative label: lättmatroser @sv
broader: merimies
in scheme: Metatietosanasto
preferred label: ordinary seaman @en
preferred label: lättmatros @sv

yhdenvertaisuusvaltuutettu
type: Concept
source: Kansallinen RDA-termi
source: YSO-termi
source: ALLFO-term @sv
source: Nationell RDA-term @sv
created: 2018-11-01
modified: 2024-08-27
alternative label: non-discrimination ombudsmen @en
alternative label: yhdenvertaisuusvaltuutetut
alternative label: diskrimineringsombudsmän @sv
broader: valtuutettu
in scheme: Metatietosanasto
preferred label: non-discrimination ombudsman @en
preferred label: diskrimineringsombudsman @sv

hammasteknikko
type: Concept
source: Kansallinen RDA-termi
source: YSO-termi
source: ALLFO-term @sv
source: Nationell RDA-term @sv
created: 2018-11-01
modified: 2024-08-27
alternative label: dental technicians @en
alternative label: hammasteknikot
broader: teknikko
in scheme: Metatietosanasto
preferred label: dental technician (occupation) @en
preferred label: tandtekniker @sv

urologi
type: Concept
source: Kansallinen RDA-termi
source: YSO-termi
source: ALLFO-term @sv
source: Nationell RDA-term @sv
created: 2018-11-01
modified: 2024-08-27
alternative label: urologists @en
alternative label: urologit
alternative label: urologer @sv
broader: lääkäri
in scheme: Metatietosanasto
preferred label: urologist @en
preferred label: urolog @sv

urheilujohtaja
type: Concept
source: Kansallinen RDA-termi
source: YSO-termi
source: ALLFO-term @sv
source: Nationell RDA-term @sv
created: 2018-11-01
modified: 2024-08-27
alternative label: sports leaders @en
alternative label: urheilujohtajat
alternative label: idrottschefer @sv
alternative label: sportchefer @sv
alternative label: sportdirektörer @sv
broader: johtaja
in scheme: Metatietosanasto
preferred label: sports leader @en
preferred label: sportdirektör @sv

erityislastentarhanopettaja
type: Concept
source: Kansallinen RDA-termi
source: YSO-termi
source: ALLFO-term @sv
source: Nationell RDA-term @sv
created: 2018-11-01
modified: 2024-08-27
alternative label: erityislastentarhanopettaja (ammatti)
alternative label: specialbarnträdgårdslärare (yrke) @sv
broader: lastentarhanopettaja
in scheme: Metatietosanasto
preferred label: special kindergarten teacher @en
preferred label: specialbarnträdgårdslärare @sv

pienviljelijä
type: Concept
source: Kansallinen RDA-termi
source: YSO-termi
source: ALLFO-term @sv
source: Nationell RDA-term @sv
created: 2018-11-01
modified: 2024-08-27
alternative label: small farmers @en
alternative label: pienviljelijät
broader: maanviljelijä
in scheme: Metatietosanasto
preferred label: small farmer @en
preferred label: småbrukare @sv

kotieläintuottaja
type: Concept
source: Kansallinen RDA-termi
source: YSO-termi
source: ALLFO-term @sv
source: Nationell RDA-term @sv
created: 2018-11-01
modified: 2024-08-27
alternative label: kotieläintuottajat
alternative label: husdjursproducenter @sv
broader: maatalousyrittäjä
in scheme: Metatietosanasto
preferred label: husdjursproducent @sv

pienkustantaja
type: Concept
source: Kansallinen RDA-termi
source: YSO-termi
source: ALLFO-term @sv
source: Nationell RDA-term @sv
created: 2018-11-01
modified: 2024-08-27
alternative label: small publishers @en
alternative label: pienkustantajat
broader: kustantaja
in scheme: Metatietosanasto
preferred label: small publisher @en
preferred label: småförlag @sv

graafikko
type: Concept
source: Kansallinen RDA-termi
source: Nationell RDA-term @sv
created: 2016-01-08
modified: 2024-12-18
alternative label: graaf. (graafikko)
alternative label: graafikko (suhde)
alternative label: grafiker (relation) @sv
broader: taiteilija
in scheme: Metatietosanasto
preferred label: grafiker @sv
scope note: Katso myös graafinen suunnittelija.
scope note: Teoksen tekijä.
scope note: Se även grafisk formgivare. @sv
scope note: Verkets skapare. @sv

kitaristi
type: Concept
source: Kansallinen RDA-termi
source: YSO-termi
source: ALLFO-term @sv
source: Nationell RDA-term @sv
created: 2018-11-01
modified: 2024-08-27
alternative label: guitar player @en
alternative label: guitarists @en
alternative label: kitaristit
alternative label: gitarrister @sv
alternative label: gitarrspelare @sv
broader: soittaja
in scheme: Metatietosanasto
preferred label: guitarist @en
preferred label: gitarrist @sv

teatterinjohtaja
type: Concept
source: Kansallinen RDA-termi
source: YSO-termi
source: ALLFO-term @sv
source: Nationell RDA-term @sv
created: 2018-11-01
modified: 2024-08-27
alternative label: theatre managers @en
alternative label: teatterinjohtajat
alternative label: teaterchefer @sv
broader: johtaja
in scheme: Metatietosanasto
preferred label: theatre manager @en
preferred label: teaterchef @sv

kaksoisagentti
type: Concept
source: Kansallinen RDA-termi
source: YSO-termi
source: ALLFO-term @sv
source: Nationell RDA-term @sv
created: 2018-11-01
modified: 2024-08-27
alternative label: double agents @en
alternative label: kaksoisagentit
alternative label: dubbelagenter @sv
broader: vakoilija
in scheme: Metatietosanasto
preferred label: double agent @en
preferred label: dubbelagent @sv

musiikintutkija
type: Concept
source: Kansallinen RDA-termi
source: YSO-termi
source: ALLFO-term @sv
source: Nationell RDA-term @sv
created: 2018-11-01
modified: 2024-08-27
alternative label: music researchers @en
alternative label: musiikintutkijat
alternative label: musiikkitieteilijät
alternative label: musikologit
alternative label: musikvetare @sv
broader: tutkija
in scheme: Metatietosanasto
preferred label: music researcher @en
preferred label: musikforskare @sv

sosiaalipsykologi
type: Concept
source: Kansallinen RDA-termi
source: YSO-termi
source: ALLFO-term @sv
source: Nationell RDA-term @sv
created: 2018-11-01
modified: 2024-08-27
alternative label: social psychologists @en
alternative label: sosiaalipsykologit
alternative label: socialpsykologer @sv
broader: psykologi
in scheme: Metatietosanasto
preferred label: social psychologist @en
preferred label: socialpsykolog @sv

videotaiteilija
type: Concept
source: Kansallinen RDA-termi
source: YSO-termi
source: ALLFO-term @sv
source: Nationell RDA-term @sv
created: 2018-11-01
modified: 2024-08-27
alternative label: video artists @en
alternative label: videotaiteilijat
alternative label: videokonstnärer @sv
broader: taiteilija
in scheme: Metatietosanasto
preferred label: video artist @en
preferred label: videokonstnär @sv

läänintaiteilija
type: Concept
source: Kansallinen RDA-termi
source: YSO-termi
source: ALLFO-term @sv
source: Nationell RDA-term @sv
created: 2018-11-01
modified: 2024-08-27
alternative label: provincial artists @en
alternative label: regional artists @en
alternative label: läänintaiteilijat
alternative label: länskonstnärer @sv
broader: taiteilija
in scheme: Metatietosanasto
preferred label: regional artist @en
preferred label: länskonstnär @sv

kotitalouskoneasentaja
type: Concept
source: Kansallinen RDA-termi
source: YSO-termi
source: ALLFO-term @sv
source: Nationell RDA-term @sv
created: 2018-11-01
modified: 2024-08-27
alternative label: household appliance mechanics @en
alternative label: kotitalouskoneasentajat
alternative label: installatörer av hushållsmaskiner @sv
broader: asentaja
in scheme: Metatietosanasto
preferred label: household appliance mechanic @en
preferred label: installatör av hushållsmaskin @sv

minstreli
type: Concept
source: Kansallinen RDA-termi
source: YSO-termi
source: ALLFO-term @sv
source: Nationell RDA-term @sv
created: 2018-11-01
modified: 2024-08-27
alternative label: minstrels @en
alternative label: minstrelit
broader: muusikko
in scheme: Metatietosanasto
preferred label: minstrel @en

maanmittausinsinööri
type: Concept
source: Kansallinen RDA-termi
source: YSO-termi
source: ALLFO-term @sv
source: Nationell RDA-term @sv
created: 2018-11-01
modified: 2024-08-27
alternative label: surveying engineers @en
alternative label: maanmittausinsinöörit
alternative label: lantmäteriingenjörer @sv
broader: insinööri
in scheme: Metatietosanasto
preferred label: survey engineer @en
preferred label: lantmäteriingenjör @sv

liittokansleri
type: Concept
source: Kansallinen RDA-termi
source: YSO-termi
source: ALLFO-term @sv
source: Nationell RDA-term @sv
created: 2018-11-01
modified: 2024-08-27
alternative label: federal chancellors @en
alternative label: liittokanslerit
alternative label: förbundskanslerer @sv
broader: kansleri
in scheme: Metatietosanasto
preferred label: federal chancellor @en
preferred label: förbundskansler @sv

kunnanjohtaja
type: Concept
source: Kansallinen RDA-termi
source: YSO-termi
source: ALLFO-term @sv
source: Nationell RDA-term @sv
created: 2018-11-01
modified: 2024-08-27
alternative label: kunnanjohtaja (ammatti)
alternative label: kommundirektör (yrke) @sv
broader: kuntajohtaja
in scheme: Metatietosanasto
preferred label: kommundirektör @sv

maataloustyöntekijä
type: Concept
source: Kansallinen RDA-termi
source: YSO-termi
source: ALLFO-term @sv
source: Nationell RDA-term @sv
created: 2018-11-01
modified: 2024-08-27
alternative label: agricultural laborers @en
alternative label: farm workers @en
alternative label: maataloustyöntekijät
broader: työntekijä
in scheme: Metatietosanasto
preferred label: agricultural laborer @en
preferred label: lantarbetare @sv

oopperaohjaaja
type: Concept
source: Kansallinen RDA-termi
source: YSO-termi
source: ALLFO-term @sv
source: Nationell RDA-term @sv
created: 2018-11-01
modified: 2024-08-27
alternative label: opera directors @en
alternative label: oopperaohjaajat
alternative label: operaregissörer @sv
broader: ohjaaja (taiteet ja media)
in scheme: Metatietosanasto
preferred label: opera director @en
preferred label: operaregissör @sv

kanteleensoittaja
type: Concept
source: Kansallinen RDA-termi
source: YSO-termi
source: ALLFO-term @sv
source: Nationell RDA-term @sv
created: 2018-11-01
modified: 2024-08-27
alternative label: kantele players @en
alternative label: kanneltajat
alternative label: kanteleensoittajat
alternative label: kantelistit
broader: soittaja
in scheme: Metatietosanasto
preferred label: kantele player @en
preferred label: kantelespelare @sv

äidinkielenopettaja
type: Concept
source: Kansallinen RDA-termi
source: YSO-termi
source: ALLFO-term @sv
source: Nationell RDA-term @sv
created: 2018-11-01
modified: 2024-08-27
alternative label: native language teachers @en
alternative label: äidinkielenopettajat
broader: aineenopettaja
in scheme: Metatietosanasto
preferred label: native language teacher @en
preferred label: modersmålslärare @sv

sairaalateologi
type: Concept
source: Kansallinen RDA-termi
source: YSO-termi
source: ALLFO-term @sv
source: Nationell RDA-term @sv
created: 2018-11-01
modified: 2024-08-27
alternative label: hospital theologians @en
alternative label: sairaalateologit
alternative label: sjukhusteologer @sv
broader: teologi
in scheme: Metatietosanasto
preferred label: hospital theologian @en
preferred label: sjukhusteolog @sv

insinööriupseeri
type: Concept
source: Kansallinen RDA-termi
source: YSO-termi
source: ALLFO-term @sv
source: Nationell RDA-term @sv
created: 2018-11-01
modified: 2024-08-27
alternative label: engineer officers @en
alternative label: insinööriupseerit
alternative label: tekniska officerare @sv
broader: upseeri
in scheme: Metatietosanasto
preferred label: engineer officer @en
preferred label: ingenjörsofficerare @sv

uimari
type: Concept
source: Kansallinen RDA-termi
source: YSO-termi
source: ALLFO-term @sv
source: Nationell RDA-term @sv
created: 2018-11-01
modified: 2024-08-27
alternative label: swimmers @en
alternative label: uimarit
broader: urheilija
in scheme: Metatietosanasto
preferred label: swimmer @en
preferred label: simmare @sv

heraldikko
type: Concept
source: Kansallinen RDA-termi
source: YSO-termi
source: ALLFO-term @sv
source: Nationell RDA-term @sv
created: 2018-11-01
modified: 2024-08-27
alternative label: heraldists @en
alternative label: heraldikot
alternative label: vaakunasuunnittelijat
alternative label: vaakunataitelijat
broader: kuvataiteilija
in scheme: Metatietosanasto
preferred label: heraldist @en
preferred label: heraldiker @sv

pääsihteeri
type: Concept
source: Kansallinen RDA-termi
source: YSO-termi
source: ALLFO-term @sv
source: Nationell RDA-term @sv
created: 2018-11-01
modified: 2024-08-27
alternative label: secretaries general @en
alternative label: pääsihteerit
broader: sihteeri
in scheme: Metatietosanasto
preferred label: secretary general @en
preferred label: generalsekreterare @sv

paparazzi
type: Concept
source: Kansallinen RDA-termi
source: YSO-termi
source: ALLFO-term @sv
source: Nationell RDA-term @sv
created: 2018-11-01
modified: 2024-08-27
alternative label: paparazzis @en
alternative label: paparazzit
alternative label: papparazzit
alternative label: salakuvaajat
broader: valokuvaaja
in scheme: Metatietosanasto

valokuvamalli
type: Concept
source: Kansallinen RDA-termi
source: YSO-termi
source: ALLFO-term @sv
source: Nationell RDA-term @sv
created: 2018-11-01
modified: 2024-08-27
alternative label: photo models @en
alternative label: photographic models @en
alternative label: valokuvamallit
alternative label: fotomodeller @sv
broader: malli
in scheme: Metatietosanasto
preferred label: photographic model @en
preferred label: fotomodell @sv

elintarviketyöntekijä
type: Concept
source: Kansallinen RDA-termi
source: YSO-termi
source: ALLFO-term @sv
source: Nationell RDA-term @sv
created: 2018-11-01
modified: 2024-08-27
alternative label: food workers @en
alternative label: elintarviketyöläiset
alternative label: elintarviketyöntekijät
broader: työntekijä
in scheme: Metatietosanasto
preferred label: food worker @en
preferred label: livsmedelsarbetare @sv

parturimestari
type: Concept
source: Kansallinen RDA-termi
source: YSO-termi
source: ALLFO-term @sv
source: Nationell RDA-term @sv
created: 2018-11-01
modified: 2024-08-27
alternative label: men's hairdressing specialists @en
alternative label: parturimestarit
broader: parturi
in scheme: Metatietosanasto
preferred label: men's hairdressing specialist @en
preferred label: barberarmästare @sv

nosturinkuljettaja
type: Concept
source: Kansallinen RDA-termi
source: YSO-termi
source: ALLFO-term @sv
source: Nationell RDA-term @sv
created: 2018-11-01
modified: 2024-08-27
alternative label: crane operators @en
alternative label: nosturinkuljettajat
broader: kuljettaja
in scheme: Metatietosanasto
preferred label: crane operator @en
preferred label: kranförare @sv

sopraano
type: Concept
source: Kansallinen RDA-termi
source: YSO-termi
source: ALLFO-term @sv
source: Nationell RDA-term @sv
created: 2018-11-01
modified: 2024-08-27
alternative label: sopranos @en
alternative label: koloratuurisopraanot
alternative label: laulaja (sopraano)
alternative label: sopraanolaulajat
alternative label: sopraanot
alternative label: koloratursopran @sv
alternative label: sopran (sångare) @sv
alternative label: sopraner @sv
alternative label: sopransångare @sv
alternative label: sångare (sopran) @sv
broader: naislaulaja
in scheme: Metatietosanasto
preferred label: soprano (singer) @en
preferred label: sopran @sv

perhepäivähoidon ohjaaja
type: Concept
source: Kansallinen RDA-termi
source: YSO-termi
source: ALLFO-term @sv
source: Nationell RDA-term @sv
created: 2018-11-01
modified: 2024-08-27
alternative label: family day care supervisors @en
alternative label: perhepäivähoidon ohjaajat
alternative label: familjedagvårdshandledare @sv
broader: ohjaaja (kasvatus ja opastus)
in scheme: Metatietosanasto
preferred label: family day care supervisor @en
preferred label: familjedagvårdsledare @sv

lapsitähti
type: Concept
source: Kansallinen RDA-termi
source: YSO-termi
source: ALLFO-term @sv
source: Nationell RDA-term @sv
created: 2018-11-01
modified: 2024-08-27
alternative label: child stars @en
alternative label: lapsitähdet
alternative label: barnstjärnor @sv
broader: julkisuuden henkilö
in scheme: Metatietosanasto
preferred label: child star @en
preferred label: barnstjärna @sv

osastonsihteeri
type: Concept
source: Kansallinen RDA-termi
source: YSO-termi
source: ALLFO-term @sv
source: Nationell RDA-term @sv
created: 2018-11-01
modified: 2024-08-27
alternative label: deparment secretaries @en
alternative label: osastonsihteerit
broader: sihteeri
in scheme: Metatietosanasto
preferred label: department secretary @en
preferred label: avdelningssekreterare @sv

vakuutuslääkäri
type: Concept
source: Kansallinen RDA-termi
source: YSO-termi
source: ALLFO-term @sv
source: Nationell RDA-term @sv
created: 2018-11-01
modified: 2024-08-27
alternative label: insurance physicians @en
alternative label: vakuutuslääkärit
broader: lääkäri
in scheme: Metatietosanasto
preferred label: insurance physician @en
preferred label: försäkringsbolagsläkare @sv

valtakunnansyyttäjä
type: Concept
source: Kansallinen RDA-termi
source: YSO-termi
source: ALLFO-term @sv
source: Nationell RDA-term @sv
created: 2018-11-01
modified: 2024-08-27
alternative label: prosecutors general @en
alternative label: valtakunnansyyttäjät
broader: syyttäjä
in scheme: Metatietosanasto
preferred label: prosecutor general @en
preferred label: riksåklagare @sv

kertoja
type: Concept
source: RDA-termi
source: RDA-term @sv
created: 2016-01-08
modified: 2025-10-02
alternative label: narrator @en
alternative label: kert. (kertoja)
alternative label: kertoja (toimija)
alternative label: berättare (aktör) @sv
broader: esittäjä
definition: Toimija, joka on esittäjä, joka osallistuu ekspression tekemiseen lukemalla ääneen tai kertomalla toiminnasta, tapauksesta tai muusta tapahtumasta. (RDA Registry)
definition: Aktör som är en framförare, som deltar i utförandet av ett uttryck genom att högläsa eller berätta om en handling, en händelse eller något annat förlopp. @sv
in scheme: Metatietosanasto
preferred label: narrator agent @en
preferred label: berättare @sv

rakennusteknikko
type: Concept
source: Kansallinen RDA-termi
source: YSO-termi
source: ALLFO-term @sv
source: Nationell RDA-term @sv
created: 2018-11-01
modified: 2024-08-27
alternative label: building engineers @en
alternative label: construction engineers @en
alternative label: rakennusteknikot
alternative label: byggnadstekniker @sv
alternative label: byggtekniker @sv
broader: teknikko
in scheme: Metatietosanasto
preferred label: construction engineer @en
preferred label: byggnadstekniker (yrke) @sv

tenniksenpelaaja
type: Concept
source: Kansallinen RDA-termi
source: YSO-termi
source: ALLFO-term @sv
source: Nationell RDA-term @sv
created: 2018-11-01
modified: 2024-08-27
alternative label: tennis players @en
alternative label: tenniksenpelaajat
broader: urheilija
in scheme: Metatietosanasto
preferred label: tennis player @en
preferred label: tennisspelare @sv

puolustusvoimain komentaja
type: Concept
source: Kansallinen RDA-termi
source: YSO-termi
source: ALLFO-term @sv
source: Nationell RDA-term @sv
created: 2018-11-01
modified: 2024-08-27
alternative label: chiefs of defence @en
alternative label: puolustusvoimain komentajat
alternative label: kommendörer för försvarsmakten @sv
broader: sotilashenkilö
in scheme: Metatietosanasto
preferred label: chief of defence @en
preferred label: kommendör för försvarsmakten @sv

patologi
type: Concept
source: Kansallinen RDA-termi
source: YSO-termi
source: ALLFO-term @sv
source: Nationell RDA-term @sv
created: 2018-11-01
modified: 2024-08-27
alternative label: pathologists @en
alternative label: patologit
alternative label: patologer @sv
broader: lääkäri
in scheme: Metatietosanasto
preferred label: pathologist @en
preferred label: patolog @sv

tuomiorovasti
type: Concept
source: Kansallinen RDA-termi
source: YSO-termi
source: ALLFO-term @sv
source: Nationell RDA-term @sv
created: 2018-11-01
modified: 2024-08-27
alternative label: tuomiorovastit
alternative label: domprostar @sv
broader: rovasti
in scheme: Metatietosanasto
preferred label: domprost @sv

pesäpalloilija
type: Concept
source: Kansallinen RDA-termi
source: YSO-termi
source: ALLFO-term @sv
source: Nationell RDA-term @sv
created: 2018-11-01
modified: 2024-08-27
alternative label: players of Finnish baseball @en
alternative label: pesäpalloilijat
broader: urheilija
in scheme: Metatietosanasto
preferred label: player of Finnish baseball @en
preferred label: bobollsspelare @sv

kassamyyjä
type: Concept
source: Kansallinen RDA-termi
source: YSO-termi
source: ALLFO-term @sv
source: Nationell RDA-term @sv
created: 2018-11-01
modified: 2024-08-27
alternative label: cashiers @en
alternative label: kassamyyjät
alternative label: kassat -- myyjät
alternative label: kassaexpediter @sv
broader: myyjä
in scheme: Metatietosanasto
preferred label: cashier (salespeople) @en
preferred label: kassaexpedit @sv

lapsinäyttelijä
type: Concept
source: Kansallinen RDA-termi
source: YSO-termi
source: ALLFO-term @sv
source: Nationell RDA-term @sv
created: 2018-11-01
modified: 2024-08-27
alternative label: child actors @en
alternative label: lapsinäyttelijät
broader: näyttelijä
in scheme: Metatietosanasto
preferred label: child actor @en
preferred label: barnskådespelare @sv

toiminnanjohtaja
type: Concept
source: Kansallinen RDA-termi
source: YSO-termi
source: ALLFO-term @sv
source: Nationell RDA-term @sv
created: 2018-11-01
modified: 2024-08-27
alternative label: executive directors @en
alternative label: executive managers @en
alternative label: toiminnanjohtajat
alternative label: verksamhetschefer @sv
broader: johtaja
in scheme: Metatietosanasto
preferred label: executive director @en
preferred label: verksamhetsledare @sv

julkisuuden henkilö
type: Concept
source: Kansallinen RDA-termi
source: YSO-termi
source: ALLFO-term @sv
source: Nationell RDA-term @sv
created: 2018-11-01
modified: 2024-08-27
alternative label: public figures @en
alternative label: julkisuuden henkilöt
alternative label: julkkikset
alternative label: offentliga personer @sv
in scheme: Metatietosanasto
narrower: lapsitähti
preferred label: public figure @en
preferred label: offentlig person @sv

kuvatoimittaja
type: Concept
source: Kansallinen RDA-termi
source: YSO-termi
source: ALLFO-term @sv
source: Nationell RDA-term @sv
created: 2018-11-01
modified: 2024-08-27
alternative label: kuvatoimittaja (ammatti)
alternative label: bildredaktör (yrke) @sv
broader: toimittaja
in scheme: Metatietosanasto
preferred label: photo journalist @en
preferred label: bildredaktör @sv

vapaaottelija
type: Concept
source: Kansallinen RDA-termi
source: YSO-termi
source: ALLFO-term @sv
source: Nationell RDA-term @sv
created: 2018-11-01
modified: 2024-08-27
alternative label: mixed martial artists @en
alternative label: vapaaottelijat
broader: urheilija
in scheme: Metatietosanasto
preferred label: mixed martial artist @en
preferred label: mixed martial arts utövare @sv

nyrkkeilijä
type: Concept
source: Kansallinen RDA-termi
source: YSO-termi
source: ALLFO-term @sv
source: Nationell RDA-term @sv
created: 2018-11-01
modified: 2024-08-27
alternative label: boxers @en
alternative label: nyrkkeilijät
broader: urheilija
in scheme: Metatietosanasto
preferred label: boxer @en
preferred label: boxare @sv

neurologi
type: Concept
source: Kansallinen RDA-termi
source: YSO-termi
source: ALLFO-term @sv
source: Nationell RDA-term @sv
created: 2018-11-01
modified: 2024-08-27
alternative label: neurologists @en
alternative label: neurologit
alternative label: neurologer @sv
broader: lääkäri
in scheme: Metatietosanasto
preferred label: neurologist @en
preferred label: neurolog @sv

lastenlääkäri
type: Concept
source: Kansallinen RDA-termi
source: YSO-termi
source: ALLFO-term @sv
source: Nationell RDA-term @sv
created: 2018-11-01
modified: 2024-08-27
alternative label: pediatricians @en
alternative label: lastenlääkärit
broader: lääkäri
in scheme: Metatietosanasto
preferred label: pediatrician @en
preferred label: barnläkare @sv

kenraaliluutnantti
type: Concept
source: Kansallinen RDA-termi
source: YSO-termi
source: ALLFO-term @sv
source: Nationell RDA-term @sv
created: 2018-11-01
modified: 2024-08-27
alternative label: lieutenants general @en
alternative label: kenraaliluutnantit
alternative label: generallöjtnanter @sv
broader: upseeri
in scheme: Metatietosanasto
preferred label: lieutenant general @en
preferred label: generallöjtnant @sv

kampaaja
type: Concept
source: Kansallinen RDA-termi
source: YSO-termi
source: ALLFO-term @sv
source: Nationell RDA-term @sv
created: 2018-11-01
modified: 2024-08-27
alternative label: hair stylists @en
alternative label: hairdressers @en
alternative label: hiusmuotoilijat
alternative label: kampaajat
alternative label: damfrisörer @sv
alternative label: frisörer @sv
alternative label: hårfrisörer @sv
in scheme: Metatietosanasto
narrower: kampaajamestari
preferred label: hairdresser @en
preferred label: damfrisör @sv

ulosottomies
type: Concept
source: Kansallinen RDA-termi
source: YSO-termi
source: ALLFO-term @sv
source: Nationell RDA-term @sv
created: 2018-11-01
modified: 2024-08-27
alternative label: bailiffs @en
alternative label: ulosottomiehet
alternative label: utmätningsmän @sv
broader: virkamies
in scheme: Metatietosanasto
preferred label: bailiff @en
preferred label: utmätningsman @sv

lavastaja
type: Concept
source: Kansallinen RDA-termi
source: YSO-termi
source: ALLFO-term @sv
source: Nationell RDA-term @sv
created: 2018-11-01
modified: 2024-08-27
alternative label: lavastaja (ammatti)
alternative label: scenograf (yrke) @sv
broader: näyttämötaiteilija
in scheme: Metatietosanasto
preferred label: set designer @en
preferred label: scenograf @sv

soitonopettaja
type: Concept
source: Kansallinen RDA-termi
source: YSO-termi
source: ALLFO-term @sv
source: Nationell RDA-term @sv
created: 2018-11-01
modified: 2024-08-27
alternative label: instrument teachers @en
alternative label: music instrument teachers @en
alternative label: musical instrument teachers @en
alternative label: instrumenttiopettajat
alternative label: instrumenttipedagogit
alternative label: soitinpedagogit
alternative label: soitonopettajat
alternative label: instrumentallärare @sv
alternative label: instrumentpedagoger @sv
broader: opettaja
in scheme: Metatietosanasto
preferred label: instrument teacher @en
preferred label: instrumentlärare @sv

kutoja
type: Concept
source: Kansallinen RDA-termi
source: YSO-termi
source: ALLFO-term @sv
source: Nationell RDA-term @sv
created: 2018-11-01
modified: 2024-08-27
alternative label: weavers @en
alternative label: kutojat
alternative label: vävare @sv
broader: käsityöläinen
in scheme: Metatietosanasto
preferred label: weaver (occupation) @en
preferred label: vävare (yrke) @sv

everstiluutnantti
type: Concept
source: Kansallinen RDA-termi
source: YSO-termi
source: ALLFO-term @sv
source: Nationell RDA-term @sv
created: 2018-11-01
modified: 2024-08-27
alternative label: lieutenant colonels @en
alternative label: everstiluutnantit
alternative label: överstelöjtnanter @sv
broader: upseeri
in scheme: Metatietosanasto
preferred label: lieutenant colonel @en
preferred label: överstelöjtnant @sv

asemapäällikkö
type: Concept
source: Kansallinen RDA-termi
source: YSO-termi
source: ALLFO-term @sv
source: Nationell RDA-term @sv
created: 2018-11-01
modified: 2024-08-27
alternative label: station masters @en
alternative label: asemapäälliköt
alternative label: stationsinspektorer @sv
broader: päällikkö
in scheme: Metatietosanasto
preferred label: station master @en
preferred label: stationsinspektor @sv

julkinen notaari
type: Concept
source: Kansallinen RDA-termi
source: YSO-termi
source: ALLFO-term @sv
source: Nationell RDA-term @sv
created: 2018-11-01
modified: 2024-08-27
alternative label: notaries public @en
alternative label: julkiset notaarit
broader: virkamies
in scheme: Metatietosanasto
preferred label: notary public @en
preferred label: notarius publicus @sv

elinkeinoasiamies
type: Concept
source: Kansallinen RDA-termi
source: YSO-termi
source: ALLFO-term @sv
source: Nationell RDA-term @sv
created: 2018-11-01
modified: 2024-08-27
alternative label: trade ombudsmen @en
alternative label: trade ombudspersons @en
alternative label: trade promoters @en
alternative label: elinkeinoasiamiehet
alternative label: näringsombud @sv
alternative label: näringsombudsmän @sv
broader: asiamies
in scheme: Metatietosanasto
preferred label: trade ombudsman @en
preferred label: näringsombudsman @sv

puolue
type: Concept
source: Kansallinen RDA-termi
source: Nationell RDA-term @sv
created: 2016-01-08
modified: 2024-05-24
alternative label: puolueet (yhteisön tyyppi)
alternative label: partier (typ av institution) @sv
example: Labor Progressive (puolue)
example: Labor Progressive (parti) @sv
in scheme: Metatietosanasto
preferred label: parti @sv
related: järjestö
scope note: Käytetään järjestöistä, joiden toiminta perustuu yhdistyslain lisäksi puoluelakiin.
scope note: Används om organisationer vars verksamhet grundar sig på förutom föreningslagen även på partilagen. @sv

ratsastuksenopettaja
type: Concept
source: Kansallinen RDA-termi
source: YSO-termi
source: ALLFO-term @sv
source: Nationell RDA-term @sv
created: 2018-11-01
modified: 2024-08-27
alternative label: riding instructors @en
alternative label: ratsastuksenopettajat
broader: opettaja
in scheme: Metatietosanasto
preferred label: riding instructor @en
preferred label: ridlärare @sv

meijeriteknikko
type: Concept
source: Kansallinen RDA-termi
source: YSO-termi
source: ALLFO-term @sv
source: Nationell RDA-term @sv
created: 2018-11-01
modified: 2024-08-27
alternative label: dairy industry technician engineers @en
alternative label: meijeriteknikot
broader: elintarviketeknikko
in scheme: Metatietosanasto
preferred label: dairy industry technician engineer @en
preferred label: mejeritekniker @sv

endokrinologi
type: Concept
source: Kansallinen RDA-termi
source: YSO-termi
source: ALLFO-term @sv
source: Nationell RDA-term @sv
created: 2018-11-01
modified: 2024-08-27
alternative label: endocrinologists @en
alternative label: endokrinologit
alternative label: endokrinologer @sv
broader: lääkäri
in scheme: Metatietosanasto
preferred label: endocrinologist @en
preferred label: endokrinolog @sv

laborantti
type: Concept
source: Kansallinen RDA-termi
source: YSO-termi
source: ALLFO-term @sv
source: Nationell RDA-term @sv
created: 2018-11-01
modified: 2024-08-27
alternative label: laboratorians @en
alternative label: laboratory workers @en
alternative label: laborantit
alternative label: laboranter @sv
in scheme: Metatietosanasto
narrower: hammaslaborantti
preferred label: laboratory worker @en
preferred label: laborant @sv

sähkösuunnittelija
type: Concept
source: Kansallinen RDA-termi
source: YSO-termi
source: ALLFO-term @sv
source: Nationell RDA-term @sv
created: 2018-11-01
modified: 2024-08-27
alternative label: electrical designers @en
alternative label: sähkösuunnittelijat
broader: suunnittelija
in scheme: Metatietosanasto
preferred label: electrical designer @en
preferred label: elplanerare @sv

valtiovarainministeri
type: Concept
source: Kansallinen RDA-termi
source: YSO-termi
source: ALLFO-term @sv
source: Nationell RDA-term @sv
created: 2018-11-01
modified: 2024-08-27
alternative label: ministers of finance @en
alternative label: valtiovarainministerit
alternative label: finansministrar @sv
broader: ministeri
in scheme: Metatietosanasto
preferred label: minister of finance @en
preferred label: finansminister @sv

lähetti
type: Concept
source: Kansallinen RDA-termi
source: YSO-termi
source: ALLFO-term @sv
source: Nationell RDA-term @sv
created: 2018-11-01
modified: 2024-08-27
alternative label: messengers @en
alternative label: lähetit
alternative label: bud @sv
in scheme: Metatietosanasto
narrower: polkupyörälähetti
preferred label: messenger @en
preferred label: bud (person) @sv

radiotoimittaja
type: Concept
source: Kansallinen RDA-termi
source: YSO-termi
source: ALLFO-term @sv
source: Nationell RDA-term @sv
created: 2018-11-01
modified: 2024-08-27
alternative label: radio journalists @en
alternative label: radiotoimittajat
alternative label: radiojournalister @sv
alternative label: radioredaktörer @sv
alternative label: radioreportrar @sv
broader: toimittaja
in scheme: Metatietosanasto
preferred label: radio journalist @en
preferred label: radiojournalist @sv

kunnan työntekijä
type: Concept
source: Kansallinen RDA-termi
source: YSO-termi
source: ALLFO-term @sv
source: Nationell RDA-term @sv
created: 2018-11-01
modified: 2024-08-27
alternative label: municipal employees @en
alternative label: kunnan työntekijät
alternative label: kuntatyöntekijät
alternative label: kommunalanställda @sv
alternative label: kommunalarbetare @sv
alternative label: kommunalt anställda @sv
alternative label: kommunanställda @sv
alternative label: kommunens arbetstagare @sv
broader: työntekijä
in scheme: Metatietosanasto
preferred label: municipal employee @en
preferred label: kommunalanställd @sv

personal trainer
type: Concept
source: Kansallinen RDA-termi
source: YSO-termi
source: ALLFO-term @sv
source: Nationell RDA-term @sv
created: 2018-11-01
modified: 2024-08-27
alternative label: personal trainers @en
alternative label: personal trainerit
alternative label: personliga tränare @sv
broader: ohjaaja (kasvatus ja opastus)
in scheme: Metatietosanasto
preferred label: personlig tränare @sv

kihlakunnantuomari
type: Concept
source: Kansallinen RDA-termi
source: YSO-termi
source: ALLFO-term @sv
source: Nationell RDA-term @sv
created: 2018-11-01
modified: 2024-08-27
alternative label: circuit judges @en
alternative label: kihlakunnantuomarit
alternative label: häradshövdingar @sv
broader: tuomari (oikeus)
in scheme: Metatietosanasto
preferred label: circuit judge @en
preferred label: häradshövding @sv

eläinlääkäri
type: Concept
source: Kansallinen RDA-termi
source: YSO-termi
source: ALLFO-term @sv
source: Nationell RDA-term @sv
created: 2018-11-01
modified: 2024-08-27
alternative label: eläinlääkäri (ammatti)
alternative label: veterinär (yrke) @sv
in scheme: Metatietosanasto
narrower: läänieläinlääkäri
preferred label: veterinarian @en
preferred label: veterinär @sv

kirjastovirkailija
type: Concept
source: Kansallinen RDA-termi
source: YSO-termi
source: ALLFO-term @sv
source: Nationell RDA-term @sv
created: 2018-11-01
modified: 2024-08-27
alternative label: library assistants @en
alternative label: kirjastovirkailijat
alternative label: biblioteksassistenter @sv
alternative label: biblioteksfunktionärer @sv
alternative label: bibliotekstjänstemän @sv
broader: virkailija
in scheme: Metatietosanasto
preferred label: library assistant @en
preferred label: biblioteksfunktionär @sv

lentokoneenasentaja
type: Concept
source: Kansallinen RDA-termi
source: YSO-termi
source: ALLFO-term @sv
source: Nationell RDA-term @sv
created: 2018-11-01
modified: 2024-08-27
alternative label: aircraft maintenance technicians @en
alternative label: lentokoneenasentajat
alternative label: flygplansmontörer @sv
broader: asentaja
in scheme: Metatietosanasto
preferred label: aircraft maintenance technician @en
preferred label: flygplansmontör @sv

kotitalousopettaja
type: Concept
source: Kansallinen RDA-termi
source: YSO-termi
source: ALLFO-term @sv
source: Nationell RDA-term @sv
created: 2018-11-01
modified: 2024-08-27
alternative label: kotitalousopettaja (ammatti)
alternative label: lärare i huslig ekonomi (yrke) @sv
broader: aineenopettaja
in scheme: Metatietosanasto
preferred label: home economics teacher @en
preferred label: lärare i huslig ekonomi @sv

kunnallispoliitikko
type: Concept
source: Kansallinen RDA-termi
source: YSO-termi
source: ALLFO-term @sv
source: Nationell RDA-term @sv
created: 2018-11-01
modified: 2024-08-27
alternative label: local politicians @en
alternative label: kunnallispoliitikot
alternative label: kuntapoliitikot
alternative label: kommunpolitiker @sv
broader: poliitikko
in scheme: Metatietosanasto
preferred label: local politician @en
preferred label: kommunalpolitiker @sv

koulupsykologi
type: Concept
source: Kansallinen RDA-termi
source: YSO-termi
source: ALLFO-term @sv
source: Nationell RDA-term @sv
created: 2018-11-01
modified: 2024-08-27
alternative label: school psychologists @en
alternative label: koulupsykologit
alternative label: skolpsykologer @sv
broader: psykologi
in scheme: Metatietosanasto
preferred label: school psychologist @en
preferred label: skolpsykolog @sv

nuortenkirjailija
type: Concept
source: Kansallinen RDA-termi
source: YSO-termi
source: ALLFO-term @sv
source: Nationell RDA-term @sv
created: 2018-11-01
modified: 2024-08-27
alternative label: young adult authors @en
alternative label: youth authors @en
alternative label: nuorisokirjailijat
alternative label: nuortenkirjailijat
broader: kirjailija
in scheme: Metatietosanasto
preferred label: youth author @en
preferred label: ungdomsförfattare @sv

sähköteknikko
type: Concept
source: Kansallinen RDA-termi
source: YSO-termi
source: ALLFO-term @sv
source: Nationell RDA-term @sv
created: 2018-11-01
modified: 2024-08-27
alternative label: electrical technicians @en
alternative label: sähköteknikot
broader: teknikko
in scheme: Metatietosanasto
preferred label: electrical technician @en
preferred label: eltekniker @sv

yksityisopettaja
type: Concept
source: Kansallinen RDA-termi
source: YSO-termi
source: ALLFO-term @sv
source: Nationell RDA-term @sv
created: 2018-11-01
modified: 2024-08-27
alternative label: tutors @en
alternative label: yksityisopettajat
broader: opettaja
in scheme: Metatietosanasto
preferred label: tutor (private teacher) @en
preferred label: privatlärare @sv

kukkakauppias
type: Concept
source: Kansallinen RDA-termi
source: YSO-termi
source: ALLFO-term @sv
source: Nationell RDA-term @sv
created: 2018-11-01
modified: 2024-08-27
alternative label: florists @en
alternative label: kukkakauppiaat
broader: kauppias
in scheme: Metatietosanasto
preferred label: florist @en
preferred label: blomsterhandlare @sv

painija
type: Concept
source: Kansallinen RDA-termi
source: YSO-termi
source: ALLFO-term @sv
source: Nationell RDA-term @sv
created: 2018-11-01
modified: 2024-08-27
alternative label: wrestlers @en
alternative label: painijat
broader: urheilija
in scheme: Metatietosanasto
preferred label: wrestler @en
preferred label: brottare @sv

kyläavustaja
type: Concept
source: Kansallinen RDA-termi
source: YSO-termi
source: ALLFO-term @sv
source: Nationell RDA-term @sv
created: 2018-11-01
modified: 2024-08-27
alternative label: village helpers @en
alternative label: kyläavustajat
alternative label: kylätalkkarit
alternative label: bya-assistenter @sv
alternative label: byahjälpare @sv
alternative label: byassistenter @sv
broader: avustaja
in scheme: Metatietosanasto
preferred label: village helper @en
preferred label: bya-assistent @sv

sosiaaliohjaaja
type: Concept
source: Kansallinen RDA-termi
source: YSO-termi
source: ALLFO-term @sv
source: Nationell RDA-term @sv
created: 2018-11-01
modified: 2024-08-27
alternative label: social advisors @en
alternative label: social councellors @en
alternative label: sosiaaliohjaajat
alternative label: socialledare @sv
broader: ohjaaja (kasvatus ja opastus)
in scheme: Metatietosanasto
preferred label: social advisor @en
preferred label: socialhandledare @sv

sähköinsinööri
type: Concept
source: Kansallinen RDA-termi
source: YSO-termi
source: ALLFO-term @sv
source: Nationell RDA-term @sv
created: 2018-11-01
modified: 2024-08-27
alternative label: electrical engineers @en
alternative label: sähköinsinöörit
alternative label: elingenjörer @sv
broader: insinööri
in scheme: Metatietosanasto
preferred label: electrical engineer @en
preferred label: elingenjör @sv

kardiologi
type: Concept
source: Kansallinen RDA-termi
source: YSO-termi
source: ALLFO-term @sv
source: Nationell RDA-term @sv
created: 2018-11-01
modified: 2024-08-27
alternative label: cardiologists @en
alternative label: kardiologit
alternative label: kardiologer @sv
broader: lääkäri
in scheme: Metatietosanasto
preferred label: cardiologist @en
preferred label: kardiolog @sv

sivistystoimijohtaja
type: Concept
source: Kansallinen RDA-termi
source: YSO-termi
source: ALLFO-term @sv
source: Nationell RDA-term @sv
created: 2018-11-01
modified: 2024-08-27
alternative label: sivistystoimenjohtajat
alternative label: bildningsdirektörer @sv
broader: johtaja
in scheme: Metatietosanasto
preferred label: bildningsdirektör @sv

aliupseeri
type: Concept
source: Kansallinen RDA-termi
source: YSO-termi
source: ALLFO-term @sv
source: Nationell RDA-term @sv
created: 2018-11-01
modified: 2024-08-27
alternative label: non-commissioned officers @en
alternative label: petty officers @en
alternative label: aliupseerit
broader: sotilashenkilö
in scheme: Metatietosanasto
preferred label: non-commissioned officer @en
preferred label: underofficerare @sv

libretisti
type: Concept
source: RDA-termi
source: RDA-term @sv
created: 2016-01-08
modified: 2025-08-13
preferred label: librettist @sv
alternative label: libretisti (suhde)
alternative label: libretisti (toimija)
alternative label: librettist (aktör) @sv
alternative label: librettist (relation) @sv
broader: kirjoittaja
definition: Toimija, joka on musiikki- tai koreografisen teoksen, kuten oopperan, baletin tai muun musiikillisen näyttämöteoksen tai oratorion sanojen kirjoittaja. (RDA Registry)
definition: Aktör som är författare till texten i ett musikaliskt eller koreografiskt verk, såsom en opera, en balett eller något annat musikaliskt sceniskt verk eller oratorium. @sv
in scheme: Metatietosanasto
preferred label: librettist agent @en
scope note: Ei kata pelkkien musikaalilaulujen sanojen kirjoittajaa. (RDA Registry)
scope note: Gäller inte författare till texter i enbart musikalsånger. @sv

suurlähettiläs
type: Concept
source: Kansallinen RDA-termi
source: YSO-termi
source: ALLFO-term @sv
source: Nationell RDA-term @sv
created: 2018-11-01
modified: 2024-08-27
alternative label: ambassadors @en
alternative label: suurlähettiläät
alternative label: ambassadörer @sv
broader: diplomaatti
in scheme: Metatietosanasto
preferred label: ambassador @en
preferred label: ambassadör @sv

hallintopäällikkö
type: Concept
source: Kansallinen RDA-termi
source: YSO-termi
source: ALLFO-term @sv
source: Nationell RDA-term @sv
created: 2018-11-01
modified: 2024-08-27
alternative label: administrative managers @en
alternative label: hallintopäälliköt
alternative label: förvaltningschefer @sv
broader: päällikkö
in scheme: Metatietosanasto
preferred label: administrative manager @en
preferred label: förvaltningschef @sv

verovirkailija
type: Concept
source: Kansallinen RDA-termi
source: YSO-termi
source: ALLFO-term @sv
source: Nationell RDA-term @sv
created: 2018-11-01
modified: 2024-08-27
alternative label: revenue officials @en
alternative label: verovirkailijat
alternative label: skattebyråtjänstemän @sv
broader: virkailija
in scheme: Metatietosanasto
preferred label: revenue official @en
preferred label: skattebyråtjänsteman @sv

prokuraattori
type: Concept
source: Kansallinen RDA-termi
source: YSO-termi
source: ALLFO-term @sv
source: Nationell RDA-term @sv
created: 2018-11-01
modified: 2024-08-27
alternative label: procurators @en
alternative label: prokuraattorit
alternative label: prokuratorer @sv
broader: virkamies
in scheme: Metatietosanasto
preferred label: procurator @en
preferred label: prokurator @sv

luonto-opas
type: Concept
source: Kansallinen RDA-termi
source: YSO-termi
source: ALLFO-term @sv
source: Nationell RDA-term @sv
created: 2018-11-01
modified: 2024-08-27
alternative label: luonto-oppaat
alternative label: naturguider @sv
broader: opas
in scheme: Metatietosanasto
preferred label: naturguide (yrke) @sv

turkisompelija
type: Concept
source: Kansallinen RDA-termi
source: YSO-termi
source: ALLFO-term @sv
source: Nationell RDA-term @sv
created: 2018-11-01
modified: 2024-08-27
alternative label: fur workers @en
alternative label: turkisompelijat
broader: ompelija
in scheme: Metatietosanasto
preferred label: fur worker @en
preferred label: pälssömmare @sv

koulunkäynninohjaaja
type: Concept
source: Kansallinen RDA-termi
source: YSO-termi
source: ALLFO-term @sv
source: Nationell RDA-term @sv
created: 2018-11-01
modified: 2024-08-27
alternative label: special needs teaching assistants @en
alternative label: koulunkäynnin ohjaajat
alternative label: koulunkäynninohjaajat
broader: ohjaaja (kasvatus ja opastus)
in scheme: Metatietosanasto
preferred label: special needs teaching assistant @en
preferred label: skolgångshandledare @sv

laivasähköasentaja
type: Concept
source: Kansallinen RDA-termi
source: YSO-termi
source: ALLFO-term @sv
source: Nationell RDA-term @sv
created: 2018-11-01
modified: 2024-08-27
alternative label: marine electricians @en
alternative label: laivasähköasentajat
broader: asentaja
in scheme: Metatietosanasto
preferred label: marine electrician @en
preferred label: fartygselektriker @sv

rautatievirkamies
type: Concept
source: Kansallinen RDA-termi
source: YSO-termi
source: ALLFO-term @sv
source: Nationell RDA-term @sv
created: 2018-11-01
modified: 2024-08-27
alternative label: railway officials @en
alternative label: rautatievirkamiehet
alternative label: järnvägstjänstemän @sv
broader: virkamies
in scheme: Metatietosanasto
preferred label: railway official @en
preferred label: järnvägstjänsteman @sv

sähköasentaja
type: Concept
source: Kansallinen RDA-termi
source: YSO-termi
source: ALLFO-term @sv
source: Nationell RDA-term @sv
created: 2018-11-01
modified: 2024-08-27
alternative label: electricians @en
alternative label: sähköasentajat
alternative label: elmontörer @sv
broader: asentaja
in scheme: Metatietosanasto
preferred label: electrician @en
preferred label: elektriker @sv

puoluejohtaja
type: Concept
source: Kansallinen RDA-termi
source: YSO-termi
source: ALLFO-term @sv
source: Nationell RDA-term @sv
created: 2018-11-01
modified: 2024-08-27
alternative label: party leaders @en
alternative label: puolueen puheenjohtajat
alternative label: puoluejohtajat
broader: johtaja
in scheme: Metatietosanasto
preferred label: party leader @en
preferred label: partiledare @sv

paimen
type: Concept
source: Kansallinen RDA-termi
source: YSO-termi
source: ALLFO-term @sv
source: Nationell RDA-term @sv
created: 2018-11-01
modified: 2024-08-27
alternative label: herders @en
alternative label: paimenet
alternative label: herdar @sv
in scheme: Metatietosanasto
narrower: karjapaimen
preferred label: herder @en
preferred label: herde @sv

kulttuurisihteeri
type: Concept
source: Kansallinen RDA-termi
source: YSO-termi
source: ALLFO-term @sv
source: Nationell RDA-term @sv
created: 2018-11-01
modified: 2024-08-27
alternative label: secretaries for cultural affairs @en
alternative label: kulttuurisihteerit
broader: sihteeri
in scheme: Metatietosanasto
preferred label: secretary for cultural affairs @en
preferred label: kultursekreterare @sv

koulutuskeskus
type: Concept
source: Kansallinen RDA-termi
source: Nationell RDA-term @sv
created: 2016-01-08
modified: 2024-05-24
alternative label: kurssikeskus
alternative label: kurscentrum @sv
alternative label: utbildningscentrum @sv
example: Innova (koulutuskeskus)
example: Innova (utbildningscenter) @sv
in scheme: Metatietosanasto
preferred label: utbildningscenter @sv
related: oppilaitos

latoja
type: Concept
source: Kansallinen RDA-termi
source: YSO-termi
source: ALLFO-term @sv
source: Nationell RDA-term @sv
created: 2018-11-01
modified: 2024-08-27
alternative label: compositors @en
alternative label: typesetters @en
alternative label: latojat
broader: kirjapainotyöntekijä
in scheme: Metatietosanasto
preferred label: typesetter @en
preferred label: sättare @sv

sosiaalisihteeri
type: Concept
source: Kansallinen RDA-termi
source: YSO-termi
source: ALLFO-term @sv
source: Nationell RDA-term @sv
created: 2018-11-01
modified: 2024-08-27
alternative label: social secretaries @en
alternative label: sosiaalisihteerit
broader: sihteeri
in scheme: Metatietosanasto
preferred label: social secretary (occupation) @en
preferred label: socialsekreterare @sv

autoteknikko
type: Concept
source: Kansallinen RDA-termi
source: YSO-termi
source: ALLFO-term @sv
source: Nationell RDA-term @sv
created: 2018-11-01
modified: 2024-08-27
alternative label: car technicians @en
alternative label: autoteknikot
broader: teknikko
in scheme: Metatietosanasto
preferred label: car technician @en
preferred label: biltekniker @sv

korkeushyppääjä
type: Concept
source: Kansallinen RDA-termi
source: YSO-termi
source: ALLFO-term @sv
source: Nationell RDA-term @sv
created: 2018-11-01
modified: 2024-08-27
alternative label: high jumpers @en
alternative label: korkeushyppääjät
broader: yleisurheilija
in scheme: Metatietosanasto
preferred label: high jumper @en
preferred label: höjdhoppare @sv

elinkeinoministeri
type: Concept
source: Kansallinen RDA-termi
source: YSO-termi
source: ALLFO-term @sv
source: Nationell RDA-term @sv
created: 2018-11-01
modified: 2024-08-27
alternative label: ministers of economic affairs @en
alternative label: elinkeinoministerit
alternative label: näringsministrar @sv
broader: ministeri
in scheme: Metatietosanasto
preferred label: minister of economic affairs @en
preferred label: näringsminister @sv

koneenasentaja
type: Concept
source: Kansallinen RDA-termi
source: YSO-termi
source: ALLFO-term @sv
source: Nationell RDA-term @sv
created: 2018-11-01
modified: 2024-08-27
alternative label: machine fitters @en
alternative label: mechanical fitters @en
alternative label: koneenasentajat
alternative label: maskinmontörer @sv
broader: asentaja
in scheme: Metatietosanasto
preferred label: machine fitter @en
preferred label: maskinmontör @sv

ammatinvalintapsykologi
type: Concept
source: Kansallinen RDA-termi
source: YSO-termi
source: ALLFO-term @sv
source: Nationell RDA-term @sv
created: 2018-11-01
modified: 2024-08-27
alternative label: vocational psychologists @en
alternative label: ammatinvalintapsykologit
alternative label: yrkesvalspsykologer @sv
broader: psykologi
in scheme: Metatietosanasto
preferred label: vocational psychologist @en
preferred label: yrkesvalspsykolog @sv

opintosihteeri
type: Concept
source: Kansallinen RDA-termi
source: YSO-termi
source: ALLFO-term @sv
source: Nationell RDA-term @sv
created: 2018-11-01
modified: 2024-08-27
alternative label: student affairs secretaries @en
alternative label: opintosihteerit
broader: sihteeri
in scheme: Metatietosanasto
preferred label: student affairs secretary @en
preferred label: studiesekreterare @sv

kauppaopettaja
type: Concept
source: Kansallinen RDA-termi
source: YSO-termi
source: ALLFO-term @sv
source: Nationell RDA-term @sv
created: 2018-11-01
modified: 2024-08-27
alternative label: teachers of commerce studies @en
alternative label: kauppaopettajat
broader: opettaja
in scheme: Metatietosanasto
preferred label: teacher of commerce studies @en
preferred label: handelslärare @sv

kansanrunoudentutkija
type: Concept
source: Kansallinen RDA-termi
source: YSO-termi
source: ALLFO-term @sv
source: Nationell RDA-term @sv
created: 2018-11-01
modified: 2024-08-27
alternative label: folkloristit
alternative label: kansanrunoudentutkijat
alternative label: folklorister @sv
broader: tutkija
in scheme: Metatietosanasto
preferred label: folklorist @en

huilisti
type: Concept
source: Kansallinen RDA-termi
source: YSO-termi
source: ALLFO-term @sv
source: Nationell RDA-term @sv
created: 2018-11-01
modified: 2024-08-27
alternative label: flute players @en
alternative label: flutists @en
alternative label: huilistit
alternative label: flöjtister @sv
broader: soittaja
in scheme: Metatietosanasto
preferred label: flute player @en
preferred label: flöjtist @sv

työkoneenkuljettaja
type: Concept
source: Kansallinen RDA-termi
source: YSO-termi
source: ALLFO-term @sv
source: Nationell RDA-term @sv
created: 2018-11-01
modified: 2024-08-27
alternative label: machinery operators @en
alternative label: työkoneenkuljettajat
broader: kuljettaja
in scheme: Metatietosanasto
preferred label: machinery operator @en
preferred label: maskinförare @sv

maatalouskoneasentaja
type: Concept
source: Kansallinen RDA-termi
source: YSO-termi
source: ALLFO-term @sv
source: Nationell RDA-term @sv
created: 2018-11-01
modified: 2024-08-27
alternative label: agricultural machinery mechanics @en
alternative label: maatalouskoneasentajat
alternative label: lantbruksmaskinmontörer @sv
broader: asentaja
in scheme: Metatietosanasto
preferred label: agricultural mechanic @en
preferred label: lantbruksmaskinmontör @sv

kauppateknikko
type: Concept
source: Kansallinen RDA-termi
source: YSO-termi
source: ALLFO-term @sv
source: Nationell RDA-term @sv
created: 2018-11-01
modified: 2024-08-27
alternative label: trade technicians @en
alternative label: kauppateknikot
broader: teknikko
in scheme: Metatietosanasto
preferred label: trade technician @en
preferred label: handelstekniker @sv

automyyjä
type: Concept
source: Kansallinen RDA-termi
source: YSO-termi
source: ALLFO-term @sv
source: Nationell RDA-term @sv
created: 2018-11-01
modified: 2024-08-27
alternative label: car salespersons @en
alternative label: automyyjät
alternative label: autonmyyjät
broader: myyjä
in scheme: Metatietosanasto
preferred label: car salesperson @en
preferred label: bilförsäljare @sv

apuneuvoteknikko
type: Concept
source: Kansallinen RDA-termi
source: YSO-termi
source: ALLFO-term @sv
source: Nationell RDA-term @sv
created: 2018-11-01
modified: 2024-08-27
alternative label: apuneuvoteknikot
broader: teknikko
in scheme: Metatietosanasto
preferred label: hjälpmedelstekniker @sv

kunnanlääkäri
type: Concept
source: Kansallinen RDA-termi
source: YSO-termi
source: ALLFO-term @sv
source: Nationell RDA-term @sv
created: 2018-11-01
modified: 2024-08-27
alternative label: municipal doctors @en
alternative label: kunnanlääkärit
broader: lääkäri
in scheme: Metatietosanasto
preferred label: municipal doctor @en
preferred label: kommunalläkare @sv

muotitoimittaja
type: Concept
source: Kansallinen RDA-termi
source: YSO-termi
source: ALLFO-term @sv
source: Nationell RDA-term @sv
created: 2018-11-01
modified: 2024-08-27
alternative label: fashion editors @en
alternative label: muotitoimittajat
alternative label: modejournalister @sv
alternative label: moderedaktörer @sv
alternative label: modereportrar @sv
broader: toimittaja
in scheme: Metatietosanasto
preferred label: fashion editor @en
preferred label: modejournalist @sv

kieltenopettaja
type: Concept
source: Kansallinen RDA-termi
source: YSO-termi
source: ALLFO-term @sv
source: Nationell RDA-term @sv
created: 2018-11-01
modified: 2024-08-27
alternative label: language teachers @en
alternative label: kieltenopettajat
broader: aineenopettaja
in scheme: Metatietosanasto
preferred label: language teacher @en
preferred label: språklärare @sv

suunnistaja
type: Concept
source: Kansallinen RDA-termi
source: YSO-termi
source: ALLFO-term @sv
source: Nationell RDA-term @sv
created: 2018-11-01
modified: 2024-08-27
alternative label: orienteers @en
alternative label: suunnistajat
broader: urheilija
in scheme: Metatietosanasto
preferred label: orienteer @en
preferred label: orienterare @sv

kenraali
type: Concept
source: Kansallinen RDA-termi
source: YSO-termi
source: ALLFO-term @sv
source: Nationell RDA-term @sv
created: 2018-11-01
modified: 2024-08-27
alternative label: generals @en
alternative label: kenraalit
alternative label: generaler @sv
broader: upseeri
in scheme: Metatietosanasto
preferred label: general @en

jääpalloilija
type: Concept
source: Kansallinen RDA-termi
source: YSO-termi
source: ALLFO-term @sv
source: Nationell RDA-term @sv
created: 2018-11-01
modified: 2024-08-27
alternative label: bandy players @en
alternative label: jääpalloilijat
broader: urheilija
in scheme: Metatietosanasto
preferred label: bandy player @en
preferred label: bandyspelare @sv

minstrel show -esiintyjä
type: Concept
source: Kansallinen RDA-termi
source: YSO-termi
source: ALLFO-term @sv
source: Nationell RDA-term @sv
created: 2018-11-01
modified: 2024-08-27
alternative label: minstrel show performers @en
alternative label: minstrel show -esiintyjät
alternative label: minstrel show-artister @sv
alternative label: minstrelartister @sv
broader: viihdetaiteilija
in scheme: Metatietosanasto
preferred label: minstrel show performer @en
preferred label: minstrel show-artist @sv

urheilutoimittaja
type: Concept
source: Kansallinen RDA-termi
source: YSO-termi
source: ALLFO-term @sv
source: Nationell RDA-term @sv
created: 2018-11-01
modified: 2024-08-27
alternative label: sports commentators @en
alternative label: sports editors @en
alternative label: sports journalists @en
alternative label: urheiluselostajat
alternative label: urheilutoimittajat
alternative label: sportjournalister @sv
broader: toimittaja
in scheme: Metatietosanasto
preferred label: sports journalist @en
preferred label: sportjournalist @sv

pituushyppääjä
type: Concept
source: Kansallinen RDA-termi
source: YSO-termi
source: ALLFO-term @sv
source: Nationell RDA-term @sv
created: 2018-11-01
modified: 2024-08-27
alternative label: long jumpers @en
alternative label: pituushyppääjät
broader: yleisurheilija
in scheme: Metatietosanasto
preferred label: long jumper @en
preferred label: längdhoppare @sv

lentäjä
type: Concept
source: Kansallinen RDA-termi
source: YSO-termi
source: ALLFO-term @sv
source: Nationell RDA-term @sv
created: 2018-11-01
modified: 2024-08-27
alternative label: air pilots @en
alternative label: lentäjät
alternative label: piloter @sv
in scheme: Metatietosanasto
narrower: sotilaslentäjä
preferred label: air pilot @en
preferred label: flygare @sv

talousjohtaja
type: Concept
source: Kansallinen RDA-termi
source: YSO-termi
source: ALLFO-term @sv
source: Nationell RDA-term @sv
created: 2018-11-01
modified: 2024-08-27
alternative label: directors of finance @en
alternative label: financial directors @en
alternative label: talousjohtajat
alternative label: ekonomidirektörer @sv
broader: johtaja
in scheme: Metatietosanasto
preferred label: financial director @en
preferred label: ekonomidirektör @sv

syyttäjä
type: Concept
source: Kansallinen RDA-termi
source: YSO-termi
source: ALLFO-term @sv
source: Nationell RDA-term @sv
created: 2018-11-01
modified: 2024-08-27
alternative label: prosecutors @en
alternative label: syyttäjät
alternative label: viralliset syyttäjät
alternative label: allmänna åklagare @sv
in scheme: Metatietosanasto
narrower: valtakunnansyyttäjä
preferred label: prosecutor @en
preferred label: åklagare @sv

historiantutkija
type: Concept
source: Kansallinen RDA-termi
source: YSO-termi
source: ALLFO-term @sv
source: Nationell RDA-term @sv
created: 2018-11-01
modified: 2024-08-27
alternative label: historians @en
alternative label: history scholars @en
alternative label: historiantutkijat
alternative label: historioitsijat
alternative label: historieforskare @sv
alternative label: historiker @sv
broader: tutkija
in scheme: Metatietosanasto
preferred label: history scholar @en
preferred label: historiker (forskare) @sv

toimistopäällikkö
type: Concept
source: Kansallinen RDA-termi
source: YSO-termi
source: ALLFO-term @sv
source: Nationell RDA-term @sv
created: 2018-11-01
modified: 2024-08-27
alternative label: office managers @en
alternative label: toimistopäälliköt
alternative label: byråchefer @sv
alternative label: kontorschefer @sv
broader: päällikkö
in scheme: Metatietosanasto
preferred label: office manager @en
preferred label: byråchef @sv

jääkäri
type: Concept
source: Kansallinen RDA-termi
source: YSO-termi
source: ALLFO-term @sv
source: Nationell RDA-term @sv
created: 2018-11-01
modified: 2024-08-27
alternative label: infantry soldiers @en
alternative label: jaegers @en
alternative label: jääkärit
alternative label: jägare @sv
broader: sotilas
in scheme: Metatietosanasto
preferred label: jaeger @en
preferred label: jägare (soldat) @sv

koulunjohtaja
type: Concept
source: Kansallinen RDA-termi
source: YSO-termi
source: ALLFO-term @sv
source: Nationell RDA-term @sv
created: 2018-11-01
modified: 2024-08-27
alternative label: head teachers @en
alternative label: koulunjohtajat
alternative label: skolledare @sv
broader: johtaja
in scheme: Metatietosanasto
preferred label: head teacher @en
preferred label: skolföreståndare @sv

preeses
type: Concept
source: RDA-termi
source: RDA-term @sv
created: 2016-01-08
modified: 2025-08-16
broader: teoksen tekijä
definition: Henkilö, joka on akateemisen väitöstilaisuuden puheenjohtaja ja joka yleensä esittelee väitöskirjan tiedekunnan edustajana sekä osallistuu siitä käytävään keskusteluun. (RDA Registry)
definition: Person som är ordförande för en akademisk disputation och som vanligen presenterar en doktorsavhandling som representant för en fakultet, samt deltar i diskussionen kring den. @sv
in scheme: Metatietosanasto
preferred label: praeses @en
preferred label: preses @sv

työpaikkaohjaaja
type: Concept
source: Kansallinen RDA-termi
source: YSO-termi
source: ALLFO-term @sv
source: Nationell RDA-term @sv
created: 2018-11-01
modified: 2024-08-27
alternative label: workplace instructors @en
alternative label: työpaikkaohjaajat
alternative label: arbetsplatsutbildare @sv
broader: ohjaaja (kasvatus ja opastus)
in scheme: Metatietosanasto
preferred label: workplace instructor @en
preferred label: arbetsplatshandledare @sv

metsäkoneasentaja
type: Concept
source: Kansallinen RDA-termi
source: YSO-termi
source: ALLFO-term @sv
source: Nationell RDA-term @sv
created: 2018-11-01
modified: 2024-08-27
alternative label: forest machine mechanics @en
alternative label: forest machinery mechanics @en
alternative label: forestry machine mechanics @en
alternative label: metsäkoneasentajat
alternative label: skogsmaskinsmontörer @sv
broader: asentaja
in scheme: Metatietosanasto
preferred label: forest machine mechanic @en
preferred label: skogsmaskinsmontör @sv

DJ
type: Concept
source: Kansallinen RDA-termi
source: YSO-termi
source: ALLFO-term @sv
source: Nationell RDA-term @sv
created: 2018-11-01
modified: 2024-08-27
alternative label: DJs @en
alternative label: disc jockeys @en
alternative label: DJ:t
alternative label: disc jockeyt
alternative label: discjockeyt
alternative label: tiskijukat
alternative label: discjockey @sv
alternative label: diskjockeyer @sv
alternative label: dj:ar @sv
broader: muusikko
in scheme: Metatietosanasto
preferred label: disc jockey @en
preferred label: diskjockey @sv

satulaseppä
type: Concept
source: Kansallinen RDA-termi
source: YSO-termi
source: ALLFO-term @sv
source: Nationell RDA-term @sv
created: 2018-11-01
modified: 2024-08-27
alternative label: satulasepät
broader: seppä
in scheme: Metatietosanasto
preferred label: sadelmakare @sv

metallityöntekijä
type: Concept
source: Kansallinen RDA-termi
source: YSO-termi
source: ALLFO-term @sv
source: Nationell RDA-term @sv
created: 2018-11-01
modified: 2024-08-27
alternative label: metal workers @en
alternative label: metallityöläiset
alternative label: metallityöntekijät
broader: työntekijä
in scheme: Metatietosanasto
preferred label: metal worker @en
preferred label: metallarbetare @sv

sotilasasiamies
type: Concept
source: Kansallinen RDA-termi
source: YSO-termi
source: ALLFO-term @sv
source: Nationell RDA-term @sv
created: 2018-11-01
modified: 2024-08-27
alternative label: military attachés @en
alternative label: sotilasasiamiehet
alternative label: militärattacheer @sv
alternative label: militärattachéer @sv
broader: asiamies
in scheme: Metatietosanasto
preferred label: military attaché @en
preferred label: militärattaché @sv

maratoonari
type: Concept
source: Kansallinen RDA-termi
source: YSO-termi
source: ALLFO-term @sv
source: Nationell RDA-term @sv
created: 2018-11-01
modified: 2024-08-27
alternative label: marathon runners @en
alternative label: maratoonarit
broader: kestävyysjuoksija
in scheme: Metatietosanasto
preferred label: marathon runner @en
preferred label: maratonlöpare @sv

maatalouskonemyyjä
type: Concept
source: Kansallinen RDA-termi
source: YSO-termi
source: ALLFO-term @sv
source: Nationell RDA-term @sv
created: 2018-11-01
modified: 2024-08-27
alternative label: agricultural machinery salespeople @en
alternative label: maatalouskonemyyjät
broader: myyjä
in scheme: Metatietosanasto
preferred label: agricultural equipment salesperson @en
preferred label: försäljare av jordbruksmaskiner @sv

ulkoasiainministeri
type: Concept
source: Kansallinen RDA-termi
source: YSO-termi
source: ALLFO-term @sv
source: Nationell RDA-term @sv
created: 2018-11-01
modified: 2024-08-27
alternative label: foreign ministers @en
alternative label: ministers of foreign affairs @en
alternative label: ulkoasiainministerit
alternative label: ulkoministerit
alternative label: utrikesministrar @sv
broader: ministeri
in scheme: Metatietosanasto
preferred label: minister of foreign affairs @en
preferred label: utrikesminister @sv

nuoriso-ohjaaja
type: Concept
source: Kansallinen RDA-termi
source: YSO-termi
source: ALLFO-term @sv
source: Nationell RDA-term @sv
created: 2018-11-01
modified: 2024-08-27
alternative label: youth leaders @en
alternative label: nuoriso-ohjaajat
broader: ohjaaja (kasvatus ja opastus)
in scheme: Metatietosanasto
preferred label: youth leader @en
preferred label: ungdomsledare @sv

ihmisoikeusvaltuutettu
type: Concept
source: Kansallinen RDA-termi
source: YSO-termi
source: ALLFO-term @sv
source: Nationell RDA-term @sv
created: 2018-11-01
modified: 2024-08-27
alternative label: high commissioners for human rights @en
alternative label: ihmisoikeusvaltuutetut
alternative label: kommissarier för mänskliga rättigheter @sv
broader: valtuutettu
in scheme: Metatietosanasto
preferred label: high commissioner for human rights @en
preferred label: kommissarie för mänskliga rättigheter @sv

tekninen toimihenkilö
type: Concept
source: Kansallinen RDA-termi
source: YSO-termi
source: ALLFO-term @sv
source: Nationell RDA-term @sv
created: 2018-11-01
modified: 2024-08-27
alternative label: technical employees @en
alternative label: tekniset toimihenkilöt
alternative label: tekniska tjänstemän @sv
broader: toimihenkilö
in scheme: Metatietosanasto
preferred label: technical employee @en
preferred label: teknisk tjänsteman @sv

viittomakielentulkki
type: Concept
source: Kansallinen RDA-termi
source: YSO-termi
source: ALLFO-term @sv
source: Nationell RDA-term @sv
created: 2018-11-01
modified: 2024-08-27
alternative label: sign language interpreters @en
alternative label: viittomakielentulkit
alternative label: teckenspråkstolkar @sv
broader: tulkki
in scheme: Metatietosanasto
preferred label: sign language interpreter @en
preferred label: teckenspråkstolk @sv

raittiussihteeri
type: Concept
source: Kansallinen RDA-termi
source: YSO-termi
source: ALLFO-term @sv
source: Nationell RDA-term @sv
created: 2018-11-01
modified: 2024-08-27
alternative label: temperance secretaries @en
alternative label: raittiussihteerit
broader: sihteeri
in scheme: Metatietosanasto
preferred label: temperance secretary @en
preferred label: nykterhetssekreterare @sv

ampumahiihtäjä
type: Concept
source: Kansallinen RDA-termi
source: YSO-termi
source: ALLFO-term @sv
source: Nationell RDA-term @sv
created: 2018-11-01
modified: 2024-08-27
alternative label: biathlonists @en
alternative label: ampumahiihtäjät
alternative label: skidskyttar @sv
broader: urheilija
in scheme: Metatietosanasto
preferred label: biathlonist @en
preferred label: skidskytt @sv

toimistotyöntekijä
type: Concept
source: Kansallinen RDA-termi
source: YSO-termi
source: ALLFO-term @sv
source: Nationell RDA-term @sv
created: 2018-11-01
modified: 2024-08-27
alternative label: toimistotyöntekijät
alternative label: kontorsanställda @sv
broader: työntekijä
in scheme: Metatietosanasto
preferred label: kontorsanställd @sv

jonglööri
type: Concept
source: Kansallinen RDA-termi
source: YSO-termi
source: ALLFO-term @sv
source: Nationell RDA-term @sv
created: 2018-11-01
modified: 2024-08-27
alternative label: jugglers @en
alternative label: jonglöörit
alternative label: jonglörer @sv
broader: sirkustaiteilija
in scheme: Metatietosanasto
preferred label: juggler @en
preferred label: jonglör @sv

konserttimestari
type: Concept
source: Kansallinen RDA-termi
source: YSO-termi
source: ALLFO-term @sv
source: Nationell RDA-term @sv
created: 2018-11-01
modified: 2024-08-27
alternative label: concertmasters @en
alternative label: konserttimestarit
broader: viulisti
in scheme: Metatietosanasto
preferred label: concertmaster @en
preferred label: konsertmästare @sv

ministerivaltiosihteeri
type: Concept
source: Kansallinen RDA-termi
source: YSO-termi
source: ALLFO-term @sv
source: Nationell RDA-term @sv
created: 2018-11-01
modified: 2024-08-27
alternative label: minister–secretaries of state @en
alternative label: ministerivaltiosihteerit
broader: sihteeri
in scheme: Metatietosanasto
preferred label: minister–secretary of state @en
preferred label: ministerstatssekreterare @sv

kaupunkireviisori
type: Concept
source: Kansallinen RDA-termi
source: YSO-termi
source: ALLFO-term @sv
source: Nationell RDA-term @sv
created: 2018-11-01
modified: 2024-08-27
alternative label: city auditors @en
alternative label: kaupunginreviisorit
alternative label: stadsrevisorer @sv
broader: virkamies
in scheme: Metatietosanasto
preferred label: city auditor @en
preferred label: stadsrevisor @sv

laivamekaanikko
type: Concept
source: Kansallinen RDA-termi
source: YSO-termi
source: ALLFO-term @sv
source: Nationell RDA-term @sv
created: 2018-11-01
modified: 2024-08-27
alternative label: ship's mechanics @en
alternative label: laivamekaanikot
broader: mekaanikko
in scheme: Metatietosanasto
preferred label: ship's mechanic @en
preferred label: fartygsmekaniker @sv

urkujenrakentaja
type: Concept
source: Kansallinen RDA-termi
source: YSO-termi
source: ALLFO-term @sv
source: Nationell RDA-term @sv
created: 2018-11-01
modified: 2024-08-27
alternative label: organ builders @en
alternative label: urkujenrakentajat
alternative label: urkurakentajat
broader: soitinrakentaja
in scheme: Metatietosanasto
preferred label: organ builder @en
preferred label: orgelbyggare @sv

marsalkka
type: Concept
source: Kansallinen RDA-termi
source: YSO-termi
source: ALLFO-term @sv
source: Nationell RDA-term @sv
created: 2018-11-01
modified: 2024-08-27
alternative label: marshals @en
alternative label: marsalkat
alternative label: sotamarsalkat
alternative label: fältmarskalkar @sv
alternative label: marskalkar @sv
broader: sotilashenkilö
in scheme: Metatietosanasto
preferred label: marshal @en
preferred label: marskalk @sv

elokuvatuottaja
type: Concept
source: Kansallinen RDA-termi
source: YSO-termi
source: ALLFO-term @sv
source: Nationell RDA-term @sv
created: 2018-11-01
modified: 2024-08-27
alternative label: elokuvatuottaja (ammatti)
alternative label: filmproducent (yrke) @sv
broader: tuottaja
in scheme: Metatietosanasto
preferred label: film producer @en
preferred label: filmproducent @sv

ääninäyttelijä
type: Concept
source: Kansallinen RDA-termi
source: YSO-termi
source: ALLFO-term @sv
source: Nationell RDA-term @sv
created: 2018-11-01
modified: 2024-08-27
alternative label: voice actors @en
alternative label: ääninäyttelijät
alternative label: dubbare @sv
broader: näyttelijä
in scheme: Metatietosanasto
preferred label: voice actor @en
preferred label: röstskådespelare @sv

musiikinopettaja
type: Concept
source: Kansallinen RDA-termi
source: YSO-termi
source: ALLFO-term @sv
source: Nationell RDA-term @sv
created: 2018-11-01
modified: 2024-08-27
alternative label: musiikinopettaja (ammatti)
alternative label: musiklärare (yrke) @sv
broader: aineenopettaja
in scheme: Metatietosanasto
preferred label: music teacher @en
preferred label: musiklärare @sv

lossinkuljettaja
type: Concept
source: Kansallinen RDA-termi
source: YSO-termi
source: ALLFO-term @sv
source: Nationell RDA-term @sv
created: 2018-11-01
modified: 2024-08-27
alternative label: ferry drivers @en
alternative label: ferrymen @en
alternative label: lossinkuljettajat
broader: kuljettaja
in scheme: Metatietosanasto
preferred label: ferry driver @en
preferred label: färjförare @sv

raivaajasukeltaja
type: Concept
source: Kansallinen RDA-termi
source: YSO-termi
source: ALLFO-term @sv
source: Nationell RDA-term @sv
created: 2018-11-01
modified: 2024-08-27
alternative label: EOD divers @en
alternative label: raivaajasukeltajat
alternative label: raivaussukeltajat
broader: sotilashenkilö
in scheme: Metatietosanasto
preferred label: EOD diver @en
preferred label: röjdykare @sv

teatteriopettaja
type: Concept
source: Kansallinen RDA-termi
source: YSO-termi
source: ALLFO-term @sv
source: Nationell RDA-term @sv
created: 2018-11-01
modified: 2024-08-27
alternative label: theatre teachers @en
alternative label: teatteriopettajat
broader: opettaja
in scheme: Metatietosanasto
preferred label: theatre teacher @en
preferred label: teaterlärare @sv

lukkoseppä
type: Concept
source: Kansallinen RDA-termi
source: YSO-termi
source: ALLFO-term @sv
source: Nationell RDA-term @sv
created: 2018-11-01
modified: 2024-08-27
alternative label: locksmiths @en
alternative label: lukkosepät
alternative label: låssmeder @sv
broader: seppä
in scheme: Metatietosanasto
preferred label: locksmith @en
preferred label: låssmed @sv

diplomaatti
type: Concept
source: Kansallinen RDA-termi
source: YSO-termi
source: ALLFO-term @sv
source: Nationell RDA-term @sv
created: 2018-11-01
modified: 2024-08-27
alternative label: diplomats @en
alternative label: diplomaatit
alternative label: diplomater @sv
in scheme: Metatietosanasto
narrower: suurlähettiläs
preferred label: diplomat @en

graafikko
type: Concept
source: Kansallinen RDA-termi
source: YSO-termi
source: ALLFO-term @sv
source: Nationell RDA-term @sv
created: 2018-11-01
modified: 2024-08-27
alternative label: graafikko (ammatti)
alternative label: grafiker (bildkonstnär) @sv
alternative label: grafiker (yrke) @sv
broader: kuvataiteilija
in scheme: Metatietosanasto
preferred label: graphic artist @en
preferred label: grafiker @sv

putkiasentaja
type: Concept
source: Kansallinen RDA-termi
source: YSO-termi
source: ALLFO-term @sv
source: Nationell RDA-term @sv
created: 2018-11-01
modified: 2024-08-27
alternative label: pipe fitters @en
alternative label: putkiasentajat
alternative label: rörmontörer @sv
broader: asentaja
in scheme: Metatietosanasto
preferred label: pipefitter @en
preferred label: rörmontör @sv

tekninen suunnittelija
type: Concept
source: Kansallinen RDA-termi
source: YSO-termi
source: ALLFO-term @sv
source: Nationell RDA-term @sv
created: 2018-11-01
modified: 2024-08-27
alternative label: technical designers @en
alternative label: tekniset suunnittelijat
alternative label: konstruktörer @sv
alternative label: tekniska planerare @sv
broader: suunnittelija
in scheme: Metatietosanasto
preferred label: technical designer @en
preferred label: konstruktör @sv

tuotepäällikkö
type: Concept
source: Kansallinen RDA-termi
source: YSO-termi
source: ALLFO-term @sv
source: Nationell RDA-term @sv
created: 2018-11-01
modified: 2024-08-27
alternative label: product managers @en
alternative label: tuotepäälliköt
alternative label: produktchefer @sv
broader: päällikkö
in scheme: Metatietosanasto
preferred label: product manager @en
preferred label: produktchef @sv

erityisopettaja
type: Concept
source: Kansallinen RDA-termi
source: YSO-termi
source: ALLFO-term @sv
source: Nationell RDA-term @sv
created: 2018-11-01
modified: 2024-08-27
alternative label: special needs teachers @en
alternative label: erityisopettajat
broader: opettaja
in scheme: Metatietosanasto
preferred label: special needs teacher @en
preferred label: speciallärare @sv

harrastajakirjoittaja
type: Concept
source: Kansallinen RDA-termi
source: YSO-termi
source: ALLFO-term @sv
source: Nationell RDA-term @sv
created: 2018-11-01
modified: 2025-09-24
alternative label: amateur writers @en
alternative label: harrastajakirjoittajat
broader: kirjailija
in scheme: Metatietosanasto
preferred label: amateur writer @en
preferred label: amatörförfattare @sv

libretisti
type: Concept
source: Kansallinen RDA-termi
source: YSO-termi
source: ALLFO-term @sv
source: Nationell RDA-term @sv
created: 2018-11-01
modified: 2024-08-27
alternative label: libretisti (ammatti)
alternative label: librettist (yrke) @sv
broader: sanoittaja
in scheme: Metatietosanasto
preferred label: librettist @en

urheilulääkäri
type: Concept
source: Kansallinen RDA-termi
source: YSO-termi
source: ALLFO-term @sv
source: Nationell RDA-term @sv
created: 2018-11-01
modified: 2024-08-27
alternative label: sports physicians @en
alternative label: urheilulääkärit
broader: lääkäri
in scheme: Metatietosanasto
preferred label: sports physician @en
preferred label: idrottsläkare @sv

kriminaalipsykologi
type: Concept
source: Kansallinen RDA-termi
source: YSO-termi
source: ALLFO-term @sv
source: Nationell RDA-term @sv
created: 2018-11-01
modified: 2024-08-27
alternative label: criminal psychologists @en
alternative label: kriminaalipsykologit
alternative label: rikospsykologit
alternative label: kriminalpsykologer @sv
broader: psykologi
in scheme: Metatietosanasto
preferred label: criminal psychologist @en
preferred label: kriminalpsykolog @sv

kirjallisuudentutkija
type: Concept
source: Kansallinen RDA-termi
source: YSO-termi
source: ALLFO-term @sv
source: Nationell RDA-term @sv
created: 2018-11-01
modified: 2024-08-27
alternative label: literary scholars @en
alternative label: kirjallisuudentutkijat
alternative label: kirjallisuustieteilijä
alternative label: litteraturvetare @sv
broader: tutkija
in scheme: Metatietosanasto
preferred label: literary scholar @en
preferred label: litteraturforskare @sv

kehitysvammaisten ohjaaja
type: Concept
source: Kansallinen RDA-termi
source: YSO-termi
source: ALLFO-term @sv
source: Nationell RDA-term @sv
created: 2018-11-01
modified: 2024-08-27
alternative label: instructors for persons with developmental disabilities @en
alternative label: kehitysvammaisten ohjaajat
alternative label: handledare av utvecklingshämmade @sv
alternative label: ledare för utvecklingsstörda @sv
broader: ohjaaja (kasvatus ja opastus)
in scheme: Metatietosanasto
preferred label: instructor for persons with developmental disabilities @en
preferred label: handledare för personer med utvecklingsstörning @sv

kuorma-autonkuljettaja
type: Concept
source: Kansallinen RDA-termi
source: YSO-termi
source: ALLFO-term @sv
source: Nationell RDA-term @sv
created: 2018-11-01
modified: 2024-08-27
alternative label: lorry drivers @en
alternative label: truck drivers @en
alternative label: kuorma-autonkuljettajat
alternative label: lastbilschaufförer @sv
broader: autonkuljettaja
in scheme: Metatietosanasto
preferred label: lorry driver @en
preferred label: lastbilsförare @sv

moukarinheittäjä
type: Concept
source: Kansallinen RDA-termi
source: YSO-termi
source: ALLFO-term @sv
source: Nationell RDA-term @sv
created: 2018-11-01
modified: 2024-08-27
alternative label: hammer throwers @en
alternative label: moukarinheittäjät
broader: yleisurheilija
in scheme: Metatietosanasto
preferred label: hammer thrower @en
preferred label: släggkastare @sv

sulkapalloilija
type: Concept
source: Kansallinen RDA-termi
source: YSO-termi
source: ALLFO-term @sv
source: Nationell RDA-term @sv
created: 2018-11-01
modified: 2024-08-27
alternative label: badminton players @en
alternative label: sulkapalloilijat
broader: urheilija
in scheme: Metatietosanasto
preferred label: badminton player @en
preferred label: badmintonspelare @sv

taiteilijaprofessori
type: Concept
source: Kansallinen RDA-termi
source: YSO-termi
source: ALLFO-term @sv
source: Nationell RDA-term @sv
created: 2018-11-01
modified: 2024-08-27
alternative label: artist professors @en
alternative label: taiteilijaprofessorit
alternative label: konstnärsprofessorer @sv
broader: professori
in scheme: Metatietosanasto
preferred label: artist professor @en
preferred label: konstnärsprofessor @sv

kanta-aliupseeri
type: Concept
source: Kansallinen RDA-termi
source: YSO-termi
source: ALLFO-term @sv
source: Nationell RDA-term @sv
created: 2018-11-01
modified: 2024-08-27
alternative label: regular non-commisioned officers @en
alternative label: kanta-aliupseerit
broader: sotilashenkilö
in scheme: Metatietosanasto
preferred label: regular non-commisioned officer @en
preferred label: stamunderofficerare @sv

tallipäällikkö
type: Concept
source: Kansallinen RDA-termi
source: YSO-termi
source: ALLFO-term @sv
source: Nationell RDA-term @sv
created: 2018-11-01
modified: 2024-10-05
alternative label: team chiefs @en
alternative label: team principals @en
alternative label: tallipäälliköt
alternative label: stallchefer (motorsport) @sv
broader: päällikkö
in scheme: Metatietosanasto
preferred label: team principal (motor sports) @en
preferred label: stallchef (motorsport) @sv

yhdyskuntasuunnittelija
type: Concept
source: Kansallinen RDA-termi
source: YSO-termi
source: ALLFO-term @sv
source: Nationell RDA-term @sv
created: 2018-11-01
modified: 2024-08-27
alternative label: community planners @en
alternative label: yhdyskuntasuunnittelijat
broader: suunnittelija
in scheme: Metatietosanasto
preferred label: community planner @en
preferred label: samhällsplanerare @sv

vänrikki
type: Concept
source: Kansallinen RDA-termi
source: YSO-termi
source: ALLFO-term @sv
source: Nationell RDA-term @sv
created: 2018-11-01
modified: 2024-08-27
alternative label: second lieutenants @en
alternative label: vänrikit
alternative label: fänrikar @sv
broader: upseeri
in scheme: Metatietosanasto
preferred label: second lieutenant @en
preferred label: fänrik @sv

myyntipäällikkö
type: Concept
source: Kansallinen RDA-termi
source: YSO-termi
source: ALLFO-term @sv
source: Nationell RDA-term @sv
created: 2018-11-01
modified: 2024-08-27
alternative label: sales executives @en
alternative label: sales managers @en
alternative label: myyntipäälliköt
alternative label: försäljningschefer @sv
broader: päällikkö
in scheme: Metatietosanasto
preferred label: sales manager @en
preferred label: försäljningschef @sv

mezzosopraano
type: Concept
source: Kansallinen RDA-termi
source: YSO-termi
source: ALLFO-term @sv
source: Nationell RDA-term @sv
created: 2018-11-29
modified: 2024-08-27
alternative label: laulaja (mezzosopraano)
alternative label: mezzosopraano (laulaja)
alternative label: mezzosopran (sångare) @sv
alternative label: sångare (mezzosopran) @sv
broader: naislaulaja
in scheme: Metatietosanasto
preferred label: mezzosopran @sv

perustuu osittain teokseen
type: Concept
source: Kansallinen RDA-termi
source: Nationell RDA-term @sv
created: 2018-12-14
modified: 2024-10-09
alternative label: pohjautuu osittain teokseen
alternative label: baserar sig delvis på verket @sv
broader: teoksen perustana
in scheme: Metatietosanasto
preferred label: delvis baserat på verket @sv

oppiarvon myöntävä yhteisö
type: Concept
source: RDA-termi
source: RDA-term @sv
created: 2016-01-08
modified: 2025-05-29
alternative label: granting institution or faculty @en
alternative label: laitos tai tiedekunta
alternative label: institution eller fakultet @sv
alternative label: utfärdare av akademisk examen @sv
broader: teoksen tekijä
definition: Yhteisö, joka hyväksyy teoksen, joka on akateemiseen oppiarvoon liittyvä opinnäyte tai väitöskirja. (RDA Registry)
definition: Institution som godkänner ett verk som är ett lärdomsprov eller en doktorsavhandling i anslutning till en akademisk läromsgrad. @sv
in scheme: Metatietosanasto
preferred label: degree granting institution @en
preferred label: institution som beviljar lärdomsgrad @sv

dramaturgi
type: Concept
source: Kansallinen RDA-termi
source: Nationell RDA-term @sv
created: 2016-01-08
modified: 2025-01-08
alternative label: dramat. (dramaturgi)
alternative label: dramaturgi (suhde)
alternative label: dramaturg (relation) @sv
broader: kirjoittaja
definition: Liittää teoksen henkilöön, joka sovittaa aineiston esitykseksi.
definition: Sammankopplar verk med en person som bearbetar material för sceniskt uppförande. @sv
in scheme: Metatietosanasto
preferred label: dramaturg @sv
scope note: Teoksen tekijä
scope note: Verkets skapare @sv

videoteknikko
type: Concept
source: Kansallinen RDA-termi
source: Nationell RDA-term @sv
created: 2016-01-08
modified: 2025-01-08
broader: esitykseen osallinen henkilö
definition: Liittää ekspression henkilöön, joka osallistuu ekspression tekemiseen valvomalla videotallennuksen teknistä toteutusta.
definition: Sammankopplar uttryck med en person som deltar i utförandet av ett uttryck genom att övervaka det tekniska förverkligandet av en ljud- eller videoinspelning. @sv
in scheme: Metatietosanasto
preferred label: video engineer @en
preferred label: videotekniker @sv

joikaaja
type: Concept
source: Kansallinen RDA-termi
source: YSO-termi
source: ALLFO-term @sv
source: Nationell RDA-term @sv
created: 2019-02-16
modified: 2024-08-27
broader: laulaja
definition: Laulaja, joka esittää joikuja joikaamalla.
definition: Sångare som framför jojkar. @sv
in scheme: Metatietosanasto
preferred label: joikers @en
preferred label: joikare @sv

yhteisö muutoksenhakijana
type: Concept
source: RDA-termi
source: RDA-term @sv
created: 2019-02-20
modified: 2025-08-27
broader: teoksen tekijä
definition: Yhteisö, joka hakee muutosta alemman oikeusasteen päätökseen. (RDA Registry)
definition: Institution som söker ändring av ett beslut i lägre rättsinstans. @sv
in scheme: Metatietosanasto
preferred label: appellant corporate body @en
preferred label: institution som ändringssökande @sv

henkilö muutoksenhakijana
type: Concept
source: RDA-termi
source: RDA-term @sv
created: 2019-02-20
modified: 2025-06-14
broader: teoksen tekijä
definition: Henkilö, joka hakee muutosta alemman oikeusasteen päätökseen. (RDA Registry)
definition: Person som söker ändring av ett beslut i lägre rättsinstans. @sv
in scheme: Metatietosanasto
preferred label: appellant person @en
preferred label: person som ändringssökande @sv

roolittaja
type: Concept
source: RDA-termi
source: RDA-term @sv
created: 2019-02-20
modified: 2025-08-19
alternative label: casting director @en
alternative label: roolittaja (toimija)
alternative label: castare @sv
alternative label: rollbesättare @sv
alternative label: rollsättare (aktör) @sv
broader: teoksen tekijä
definition: Toimija, joka on vastuussa useimmista esiintyjien roolien ja tehtävien antamiseen kuuluvista tehtävistä. (RDA Registry)
definition: Aktör som svarar för de flesta uppgifter som hör till utdelandet av roller och uppgifter för framträdare. @sv
in scheme: Metatietosanasto
preferred label: casting director agent @en
preferred label: rollsättare @sv

henkilö muutoksenhakijan vastapuolena
type: Concept
source: RDA-termi
source: RDA-term @sv
created: 2019-02-20
modified: 2025-06-14
broader: teoksen tekijä
definition: Henkilö, jota vastaan muutoksenhaku alemman oikeusasteen päätökseen kohdistuu. (RDA Registry)
definition: Person som ett ändringssökande av ett beslut i lägre rättsinstans riktar sig mot. @sv
in scheme: Metatietosanasto
preferred label: appellee person @en
preferred label: person som den ändringssökandes motpart @sv

järjestäjä
type: Concept
source: RDA-termi
source: RDA-term @sv
created: 2019-02-20
modified: 2025-11-26
alternative label: organizer @en
alternative label: järjestäjä (toimija)
alternative label: arrangör av evenemang @sv
alternative label: evenemangsarrangör (aktör) @sv
alternative label: mötesarrangör @sv
broader: teoksen tekijä
definition: Toimija, joka järjestää konferenssin, näyttelyn tai muun tapahtuman, joka antaa alun teokselle. (RDA Registry)
definition: Aktör som ordnar en konferens, en utställning eller något annat evenemang som ger upphov till ett verk. @sv
in scheme: Metatietosanasto
preferred label: organizer agent @en
preferred label: evenemangsarrangör @sv

yhteisö muutoksenhakijan vastapuolena
type: Concept
source: RDA-termi
source: RDA-term @sv
created: 2019-02-20
modified: 2025-08-27
broader: teoksen tekijä
definition: Yhteisö, jota vastaan muutoksenhaku alemman oikeusasteen päätökseen kohdistuu. (RDA Registry)
definition: Institution som ett ändringssökande av ett beslut i lägre rättsinstans riktar sig mot. @sv
in scheme: Metatietosanasto
preferred label: appellee corporate body @en
preferred label: institution som den ändringssökandes motpart @sv

keskustelija
type: Concept
source: Kansallinen RDA-termi
source: Nationell RDA-term @sv
created: 2019-02-20
modified: 2025-01-08
broader: teoksen tekijä
definition: Liittää teoksen henkilöön, joka toimimalla keskustelijana osallistuu teoksen luomiseen.
definition: Sammankopplar verk med en person som deltar i skapandet av ett verk genom att fungera som debattör. @sv
in scheme: Metatietosanasto
preferred label: debattör @sv
scope note: Teoksen tekijä.
scope note: Verkets skapare. @sv

henkilökantaja
type: Concept
source: RDA-termi
source: RDA-term @sv
created: 2019-02-20
modified: 2025-06-14
alternative label: kärande (person) @sv
broader: teoksen tekijä
definition: Henkilö, joka nostaa kanteen siviilioikeudenkäyntiin. (RDA Registry)
definition: Person som väcker talan i civilrättsligt mål. @sv
in scheme: Metatietosanasto
preferred label: plaintiff person @en
preferred label: person som kärande @sv

keskustelija (ekspressio)
type: Concept
source: Kansallinen RDA-termi
source: Nationell RDA-term @sv
created: 2019-02-20
modified: 2025-01-08
broader: esitykseen osallinen henkilö
definition: Liittää ekspression henkilöön, joka osallistuu ekspression sisältämään keskusteluosuuteen toimimalla keskustelijana.
definition: Sammankopplar uttryck med en person, som deltar i diskussionsdelen i ett uttryck genom att fungera som debattör. @sv
in scheme: Metatietosanasto
preferred label: debattör (uttryck) @sv

yhteisökantaja
type: Concept
source: RDA-termi
source: RDA-term @sv
created: 2019-02-20
modified: 2025-08-27
broader: teoksen tekijä
definition: Yhteisö, joka nostaa kanteen siviilioikeudenkäyntiin. (RDA Registry)
definition: Institution som väcker talan i civilrättsligt mål. @sv
in scheme: Metatietosanasto
preferred label: plaintiff corporate body @en
preferred label: institution som kärande @sv

toimituspäällikkö
type: Concept
source: RDA-termi
source: RDA-term @sv
created: 2019-02-27
modified: 2025-08-23
alternative label: editorial director @en
alternative label: toimituspäällikkö (toimija)
alternative label: redaktionschef (aktör) @sv
broader: teoksen tekijä
definition: Toimija, jolla on juridinen tai tiedollinen vastuu, mutta ei luovaa vastuuta, diakronisen teoksen toimituslinjasta ja sisällöstä. (RDA Registry)
definition: Aktör som har ett juridiskt eller kunskapsmässigt ansvar, men inte kreativt ansvar, för ett diakroniskt verks redaktionella linje och innehåll. @sv
in scheme: Metatietosanasto
preferred label: editorial director agent @en
preferred label: redaktionschef @sv
scope note: Ei kata teoksen ekspression sisällön tarkastamista, selkeyttämistä tai muuta muutosta. (RDA Registry)
scope note: Gäller inte justering, förtydligande eller annan ändring av innehållet i ett verks uttryck. @sv

tutkija
type: Concept
source: RDA-termi
source: RDA-term @sv
created: 2019-02-27
modified: 2025-08-23
alternative label: researcher @en
alternative label: tutkija (toimija)
alternative label: forskare (aktör) @sv
broader: teoksen tekijä
definition: Toimija, joka tukee teoksen syntymistä tutkimuksellaan. (RDA Registry)
definition: Aktör som stöder uppkomsten av ett verk med sin forskning. @sv
in scheme: Metatietosanasto
preferred label: researcher agent @en
preferred label: forskare @sv

teoksen perustaja
type: Concept
source: RDA-termi
source: RDA-term @sv
created: 2019-02-27
modified: 2025-08-22
alternative label: founder of work @en
alternative label: teoksen perustaja (toimija)
alternative label: grundare (aktör) av verk @sv
broader: teoksen tekijä
definition: Toimija, joka on vastuussa diakronisen teoksen alullepanosta. (RDA Registry)
definition: Aktör som svarar för igångsättningen av ett diakroniskt verk. @sv
in scheme: Metatietosanasto
preferred label: founder agent of work @en
preferred label: grundare av verk @sv

tallettaja
type: Concept
source: RDA-termi
source: RDA-term @sv
created: 2019-03-02
modified: 2025-08-21
alternative label: depositor @en
alternative label: tallettaja (toimija)
alternative label: deponent @sv
alternative label: deponerat av (aktör) @sv
broader: nykyinen omistaja
definition: Kappaleen nykyinen omistaja, joka tallettaa kappaleen toisen toimijan huostaan omistajuudesta luopumatta. (RDA Registry)
definition: Nuvarande ägare till ett exemplar, som förvarar exemplaret hos en annan aktör, utan att överlåta ägarskapet. @sv
in scheme: Metatietosanasto
preferred label: depositor agent @en
preferred label: deponerat av @sv

sensori
type: Concept
source: RDA-termi
source: RDA-term @sv
created: 2019-03-02
modified: 2025-08-19
preferred label: censor @sv
alternative label: sensori (toimija)
alternative label: censor (aktör) @sv
broader: tarkistaja
definition: Toimija, joka osallistuu ekspression tekemiseen tarkastamalla toisen ekspression sisältöä kiistanalaisen sisällön salaamiseksi moraalisin, poliittisin, sotilaallisin tai muin perustein, mutta jättäen alkuperäisen teoksen luonteen ja yleisen sisällön olennaisilta osiltaan muuttumattomaksi. (RDA Registry)
definition: Aktör som deltar i utförandet av ett uttryck, genom att granska innehållet i ett annat uttryck för att dölja kontroversiellt innehåll på moraliska, politiska, militära eller andra grunder, men ändå låta det ursprungliga verkets karaktär och allmänna innehåll till sina väsentliga delar förbli oförändrat. @sv
in scheme: Metatietosanasto
preferred label: censor agent @en
scope note: Ei koske laajaa muokkausta, joka johtaa uuden teoksen luomiseen. (RDA Registry)
scope note: Gäller inte omfattande redigering, som leder till skapandet av ett nytt verk. @sv

esittelijä
type: Concept
source: RDA-termi
source: RDA-term @sv
created: 2019-03-02
modified: 2025-06-05
alternative label: on-screen presenter @en
alternative label: esittelijä (suhde)
alternative label: esittelijä (toimija)
alternative label: introduktör @sv
alternative label: presentatör (relation) @sv
broader: esittäjä
definition: Toimija, joka on esittäjä, joka osallistuu ekspression tekemiseen esiintymällä televisiossa tai elokuvassa taustatiedon antajana. (RDA Registry)
definition: Aktör som är en framförare, som deltar i utförandet av ett uttryck genom att framträda i tv eller film med bakgrundsinformation. @sv
in scheme: Metatietosanasto
preferred label: onscreen presenter agent @en
preferred label: presentatör @sv
scope note: Koskee ei-fiktiivisessä elokuvassa tai fiktiivisen elokuvan johdannossa esiintymistä. Ei koske esiintymistä ruudussa ei-esittävässä roolissa. (RDA Registry)
scope note: Gäller framträdande i icke-fiktiv film eller i inledning till fiktiv film. @sv

erikoistehosteiden tekijä
type: Concept
source: RDA-termi
source: RDA-term @sv
created: 2019-03-02
modified: 2025-06-04
alternative label: special effects provider @en
alternative label: erikoistehosteiden tekijä (toimija)
alternative label: skapare av specialeffekter (aktör) @sv
broader: esitykseen osallinen toimija
definition: Toimija, joka osallistuu liikkuvan kuvan tai ääniteoksen ekspression tekemiseen suunnittelemalla ja luomalla taltioinnin aikana tapahtuvat erikoistehosteet, kuten mekaaniset tehosteet ja kameralla toteutettavat optiset tehosteet. (RDA Registry)
definition: Aktör som deltar i utförandet av uttryck av rörlig bild eller ljudverk, genom att planera eller skapa specialeffekter som sker under inspelning, såsom mekaniska effekter och optiska effekter skapade med kamera. @sv
in scheme: Metatietosanasto
preferred label: special effects provider agent @en
preferred label: skapare av specialeffekter @sv

musiikkiohjelmoija
type: Concept
source: RDA-termi
source: RDA-term @sv
created: 2019-03-02
modified: 2025-08-14
alternative label: music programmer @en
alternative label: musiikkiohjelmoija (toimija)
alternative label: musikprogrammerare (aktör) @sv
broader: esitykseen osallinen toimija
definition: Toimija, joka osallistuu musiikkiteoksen ekspression tekemiseen tuottamalla ääniä sähköisillä äänilaitteilla tai tietokoneohjelmilla. (RDA Registry)
definition: Aktör som deltar i skapandet av ett musikverks uttryck, genom att producera ljud med elektriska ljudenheter eller datorprogram. @sv
in scheme: Metatietosanasto
preferred label: music programmer agent @en
preferred label: musikprogrammerare @sv
scope note: Ei koske uuden musiikkiteoksen luomista. (RDA Registry)
scope note: Gäller inte skapandet av ett nytt musikverk. @sv

kapellimestari
type: Concept
source: RDA-termi
source: RDA-term @sv
created: 2019-03-02
modified: 2025-08-13
alternative label: instrumental conductor @en
alternative label: kapellimestari (suhde)
alternative label: kapellimestari (toimija)
alternative label: kapellmästare (aktör) @sv
alternative label: kapellmästare (relation) @sv
alternative label: orkesterdirigent @sv
broader: johtaja
definition: Toimija, joka on johtaja, joka osallistuu ekspression tekemiseen johtamalla soitinryhmää musiikki- tai näytelmäesityksessä. (RDA Registry)
definition: Aktör som är en dirigent som deltar i utförandet av ett uttryck, genom att leda en instrumentgrupp i en musik- eller dramaföreställning. @sv
in scheme: Metatietosanasto
preferred label: instrumental conductor agent @en
preferred label: kapellmästare @sv

tuotantosuunnittelija
type: Concept
source: RDA-termi
source: RDA-term @sv
created: 2016-01-08
modified: 2025-08-23
alternative label: production designer @en
alternative label: lavastussuunnittelija
alternative label: tuotantosuunnittelija (toimija)
alternative label: produktionsdesigner (aktör) @sv
broader: esitykseen osallinen toimija
definition: Toimija, joka vastaa elokuvatuotannon visuaalisen kokonaisilmeen suunnittelusta. (RDA Registry)
definition: Aktör som svarar för designen i det visuella helhetsuttrycket för en filmproduktion. @sv
in scheme: Metatietosanasto
preferred label: production designer agent @en
preferred label: produktionsdesigner @sv

ohjelmistokehittäjä
type: Concept
source: RDA-termi
source: RDA-term @sv
created: 2019-03-02
modified: 2025-08-15
alternative label: software developer @en
alternative label: ohjelmistokehittäjä (suhde)
alternative label: ohjelmistokehittäjä (toimija)
alternative label: programutvecklare (aktör) @sv
alternative label: programutvecklare (relation) @sv
broader: yhdistymään osallinen toimija
definition: Toimija, joka osallistuu ekspression tekemiseen tutkimalla, suunnittelemalla, toteuttamalla tai testaamalla ohjelmistoa. (RDA Registry)
definition: Aktör som deltar i skapandet av ett uttryck, genom att undersöka, planera, förverkliga eller testa en programvara. @sv
in scheme: Metatietosanasto
preferred label: software developer agent @en
preferred label: programutvecklare @sv

liikkuvaan kuvaan osallistuja
type: Concept
source: RDA-termi
source: RDA-term @sv
created: 2019-03-02
modified: 2025-07-05
alternative label: on-screen participant @en
alternative label: liikkuvaan kuvaan osallistuja (toimija)
alternative label: osallistuja
alternative label: deltagare @sv
alternative label: deltagare (aktör) i rörlig bild @sv
broader: esitykseen osallinen toimija
definition: Toimija, joka osallistuu ei-fiktiivisen liikkuvan kuvan teoksen ekspression tekemiseen ottamalla aktiivisen roolin osallistujana. (RDA Registry)
definition: Aktör som deltar i utförandet av ett uttryck av ett icke-fiktivt verk med rörlig bild, genom att ta en aktiv roll som deltagare. @sv
in scheme: Metatietosanasto
preferred label: onscreen participant agent @en
preferred label: deltagare i rörlig bild @sv
scope note: Ei koske esiintymistä lisä- tai taustatietojen kertojana. (RDA Registry)
scope note: Gäller inte uppträdande som berättare av tilläggs- eller bakgrundsinformation. @sv

moderoija
type: Concept
source: RDA-termi
source: RDA-term @sv
created: 2019-03-02
modified: 2025-08-14
broader: esittäjä
definition: Toimija, joka on esittäjä, joka osallistuu ekspression tekemiseen juontamalla (usein lähetettyä) ohjelmaa, jossa keskustellaan eri aiheista tavallisesti keskusteluun liittyvien aiheiden asiantuntijoiden kanssa. (RDA Registry)
definition: Aktör som är en framförare som deltar i utförandet av ett uttryck, genom att leda ett (ofta utsänt) program, i vilket olika ämnen diskuteras, vanligen tillsammans med experter i ämnen som relaterar till diskussionen. @sv
in scheme: Metatietosanasto
preferred label: moderator agent @en
preferred label: moderator @sv

kuoronjohtaja
type: Concept
source: RDA-termi
source: RDA-term @sv
created: 2019-03-02
modified: 2025-07-04
alternative label: choral conductor @en
alternative label: kuoronjohtaja (suhde)
alternative label: kuoronjohtaja (toimija)
alternative label: kördirigent (aktör) @sv
alternative label: kördirigent (relation) @sv
alternative label: körledare @sv
broader: johtaja
definition: Toimija, joka on johtaja, joka osallistuu ekspression tekemiseen johtamalla kuoroa musiikki- tai näytelmäesityksessä. (RDA Registry)
definition: Aktör som är en dirigent som deltar i utförandet av ett uttryck, genom att leda en kör i en musik- eller dramaföreställning. @sv
in scheme: Metatietosanasto
preferred label: choral conductor agent @en
preferred label: kördirigent @sv

dubbausohjaaja
type: Concept
source: RDA-termi
source: RDA-term @sv
created: 2019-03-02
modified: 2025-05-27
alternative label: dubbing director @en
alternative label: dubbausohjaaja (toimija)
alternative label: dubbningsregissör (aktör) @sv
broader: esitykseen osallinen toimija
definition: Toimija, joka vastaa uuden dialogin tai muiden äänien lisäämisprosessin yleisestä johtamisesta ja valvonnasta ekspression ääniraidan täydentämiseksi. (RDA Registry)
definition: Aktör som svarar för ledning och övervakning av tillägget av ny dialog eller andra röster för att komplettera ett uttrycks ljudspår. @sv
in scheme: Metatietosanasto
preferred label: dubbing director agent @en
preferred label: dubbningsregissör @sv

metalli- ja konepajateollisuus
type: Concept
source: Kansallinen RDA-termi
source: Nationell RDA-term @sv
created: 2019-03-13
modified: 2026-05-06
alternative label: konepajateollisuus
alternative label: metalliteollisuus
alternative label: maskinverkstadsindustri @sv
alternative label: metalindustri @sv
broader: teollisuus
in scheme: Metatietosanasto
preferred label: metall- och maskinverkstadsindustri @sv

sosiaali- ja terveyshallinto
type: Concept
source: Kansallinen RDA-termi
source: Nationell RDA-term @sv
created: 2019-03-13
modified: 2026-05-06
alternative label: social- och hälsoförvaltning @sv
broader: julkinen hallinto
example: sosiaali- ja terveysministeriö, lääkintöhallitus, lääkelaitos, sosiaalihallitus, piirilääkärit, työsuojelupiirit, ammattientarkastajat
example: social- och hälsovårdsministeriet, medicinalstyrelsen, läkemedelsverket, socialstyrelsen, distriktsläkare, arbetarskyddsdistrikt, yrkesinspektörer @sv
in scheme: Metatietosanasto
preferred label: social- och hälsovårdsförvaltning @sv

tekstiili- ja vaatetusteollisuus
type: Concept
source: Kansallinen RDA-termi
source: Nationell RDA-term @sv
created: 2019-03-13
modified: 2026-05-06
alternative label: jalkineteollisuus
alternative label: nahkateollisuus
alternative label: tekstiiliteollisuus
alternative label: turkisteollisuus
alternative label: vaatetusteollisuus
alternative label: klädindustri @sv
alternative label: läderindustri @sv
alternative label: pälsindustri @sv
alternative label: skoindustri @sv
alternative label: textil- och beklädnadsindustri @sv
alternative label: textil- och klädindustri @sv
alternative label: textilindustri @sv
broader: teollisuus
in scheme: Metatietosanasto
preferred label: textil- och konfektionsindustri @sv

ulkoasiainhallinto
type: Concept
source: Kansallinen RDA-termi
source: Nationell RDA-term @sv
created: 2019-03-13
modified: 2026-05-06
broader: julkinen hallinto
example: ulkoasiainministeriö, edustustot
example: utrikesministeriet, representationer @sv
in scheme: Metatietosanasto
preferred label: utrikesförvaltning @sv

ympäristö- ja vesihallinto
type: Concept
source: Kansallinen RDA-termi
source: Nationell RDA-term @sv
created: 2019-03-13
modified: 2026-05-06
alternative label: asuntohallinto
alternative label: kaavoitushallinto
alternative label: vesi- ja ympäristöhallinto
alternative label: vesihallinto
alternative label: ympäristönsuojeluhallinto
alternative label: bostadsförvaltning @sv
alternative label: miljövårdsförvaltning @sv
alternative label: vatten- och miljöförvaltning @sv
alternative label: vattenförvaltning @sv
broader: julkinen hallinto
example: ympäristöministeriö, ympäristökeskukset, maanviljelysinsinööripiirit ja vesipiirit
example: miljöministeriet, miljöcentraler, lantbruksingenjörsdistrikt och vattendistrikt @sv
in scheme: Metatietosanasto
preferred label: miljö- och vattenförvaltning @sv

sosiaalivakuutus
type: Concept
source: Kansallinen RDA-termi
source: Nationell RDA-term @sv
created: 2019-03-13
modified: 2026-05-06
broader: julkinen hallinto
example: Kansaneläkelaitos, Kuntien eläkevakuutus
example: Folkpensionsanstalten, Kommunernas pensionsförsäkring @sv
in scheme: Metatietosanasto
preferred label: socialförsäkring @sv

opetus- ja kulttuurihallinto
type: Concept
source: Kansallinen RDA-termi
source: Nationell RDA-term @sv
created: 2019-03-13
modified: 2026-05-06
alternative label: kouluhallinto
alternative label: kulttuurihallinto
alternative label: taidehallinto
alternative label: tiedehallinto
alternative label: urheiluhallinto
alternative label: idrottsförvaltning @sv
alternative label: konstförvaltning @sv
alternative label: kulturförvaltning @sv
alternative label: skolförvaltning @sv
alternative label: vetenskapsförvaltning @sv
broader: julkinen hallinto
example: opetus- ja kulttuuriministeriö, kouluhallitus, Kansallisarkisto, Museovirasto, kansakouluntarkastajat, Suomen Akatemia, kirjastontarkastajat, kouluvirastot
example: undervisnings- och kulturministeriet, skolstyrelsen, Riksarkivet, Museiverket, folkskoleinspektörer, Finlands Akademi, biblioteksinspektörer, skolverk @sv
in scheme: Metatietosanasto
preferred label: undervisnings- och kulturförvaltning @sv

kansanhuolto ja elintarvikehuolto
type: Concept
source: Kansallinen RDA-termi
source: Nationell RDA-term @sv
created: 2019-03-13
modified: 2026-05-06
alternative label: elintarvikehuolto
alternative label: kansanhuolto
alternative label: folkförsörjning @sv
alternative label: livsmedelsförsörjning @sv
broader: julkinen hallinto
example: kansanhuoltoministeriö, elintarvikehallitus, kansanhuoltopiirit, elintarviketoimistot, Suomen Huolto
example: folkförsörjningsministeriet, livsmedelsstyrelsen, folkförsörjningsdistrikt, livsmedelsbyråer, Finlands Folkhjälp @sv
in scheme: Metatietosanasto
preferred label: folkförsörjning och livsmedelsförsörjning @sv

puolustushallinto
type: Concept
source: Kansallinen RDA-termi
source: Nationell RDA-term @sv
created: 2019-03-13
modified: 2026-05-06
broader: julkinen hallinto
example: puolustusministeriö
example: försvarsministeriet @sv
in scheme: Metatietosanasto
preferred label: försvarsförvaltning @sv

metsäteollisuus
type: Concept
source: Kansallinen RDA-termi
source: Nationell RDA-term @sv
created: 2019-03-13
modified: 2026-05-06
broader: teollisuus
in scheme: Metatietosanasto
preferred label: skogsindustri @sv

työ- ja elinkeinohallinto
type: Concept
source: Kansallinen RDA-termi
source: Nationell RDA-term @sv
created: 2019-03-13
modified: 2026-05-06
alternative label: elinkeinohallinto
alternative label: elintarvikehallinto
alternative label: kauppa- ja teollisuushallinto
alternative label: kauppahallinto
alternative label: kilpailuhallinto
alternative label: kuluttajahallinto
alternative label: teollisuushallinto
alternative label: työhallinto
alternative label: työvoimahallinto
alternative label: arbetsförvaltning @sv
alternative label: arbetskraftsförvaltning @sv
alternative label: handels- och industriförvaltning @sv
alternative label: handelsförvaltning @sv
alternative label: industriförvaltning @sv
alternative label: konkurrensförvaltning @sv
alternative label: konsumentförvaltning @sv
alternative label: livsmedelsförvaltning @sv
alternative label: näringsförvaltning @sv
broader: julkinen hallinto
example: kauppa- ja teollisuusministeriö; patentti- ja rekisterihallitus; työministeriö; työ- ja elinkeinokeskukset; työvoimahallinnon piiri- ja paikallisviranomaiset; ammattikunnat; merimieshuoneet; Sotakorvausteollisuuden valtuuskunta; työasiamiehet; työvoimapiirit; työvoimatoimistot; työ- ja elinkeinotoimistot; työvoimapäälliköt; ammatinvalinnanohjauksen piiritoimistot; työriitojen piirisovittelijat; työvoima- ja elinkeinokeskukset; elinkeino-, liikenne- ja ympäristökeskukset; teollisuuspiirit; pienteollisuuspiirit; yrityspalvelun piiritoimistot; sähköhuollon aluetoimikunnat; elintarvikevirastot
example: handels- och industriministeriet, patent- och registerstyrelsen, arbetsministeriet, arbets- och näringscentraler, arbetskraftsförvaltningens distrikts- och lokala myndigheter, yrkeskårer, sjömanshus, Delegationen för krigsskadeståndsindustrin @sv
in scheme: Metatietosanasto
preferred label: arbets- och näringsförvaltning @sv

graafinen teollisuus
type: Concept
source: Kansallinen RDA-termi
source: Nationell RDA-term @sv
created: 2019-03-13
modified: 2026-05-06
alternative label: kirjapainoala
alternative label: boktryckarbranschen @sv
broader: teollisuus
in scheme: Metatietosanasto
preferred label: grafisk industri @sv

elektroniikka- ja sähköteollisuus
type: Concept
source: Kansallinen RDA-termi
source: Nationell RDA-term @sv
created: 2019-03-13
modified: 2026-05-06
alternative label: elektroniikkateollisuus
alternative label: sähköteollisuus
alternative label: elektronikindustri @sv
alternative label: elindustri @sv
broader: teollisuus
in scheme: Metatietosanasto
preferred label: elektronik- och elindustri @sv

elintarviketeollisuus
type: Concept
source: Kansallinen RDA-termi
source: Nationell RDA-term @sv
created: 2019-03-13
modified: 2026-05-06
broader: teollisuus
in scheme: Metatietosanasto
preferred label: livsmedelsindustri @sv

kemianteollisuus
type: Concept
source: Kansallinen RDA-termi
source: Nationell RDA-term @sv
created: 2019-03-13
modified: 2026-05-06
alternative label: kemiindustri @sv
broader: teollisuus
in scheme: Metatietosanasto
preferred label: kemisk industri @sv

kirkon hallinto
type: Concept
source: Kansallinen RDA-termi
source: Nationell RDA-term @sv
created: 2019-03-13
modified: 2026-05-06
alternative label: kyrklig förvaltning @sv
alternative label: kyrkoförvaltning @sv
broader: julkinen hallinto
example: kirkolliskokous, kirkkohallitus, Suomen ortodoksinen kirkollishallitus, tuomiokapitulit, rovastikunnat, evankelis-luterilaiset ja ortodoksiset seurakunnat
example: kyrkomötet, kyrkostyrelsen, kyrkostyrelsen för Finlands ortodoxa kyrka, domkapitel, prosterier, evangelisk-lutherska och ortodoxa församlingar @sv
in scheme: Metatietosanasto
preferred label: kyrkans förvaltning @sv

lääketeollisuus
type: Concept
source: Kansallinen RDA-termi
source: Nationell RDA-term @sv
created: 2019-03-13
modified: 2026-05-06
broader: teollisuus
in scheme: Metatietosanasto
preferred label: läkemedelsindustri @sv

jakautunut yhteisö
type: Concept
source: RDA-termi
source: RDA-term @sv
created: 2019-03-30
modified: 2025-07-01
alternative label: jakautumista edeltänyt yhteisö
alternative label: institution före uppdelning @sv
broader: yhteisön edeltäjä
definition: Yhteisö, joka on jakautunut toiseen yhteisöön. (RDA Registry)
definition: Institution som har uppdelats i en annan institution. @sv
in scheme: Metatietosanasto
preferred label: predecessor of split @en
preferred label: uppdelad institution @sv

lasi-, kivi- ja saviteollisuus
type: Concept
source: Kansallinen RDA-termi
source: Nationell RDA-term @sv
created: 2019-05-02
modified: 2026-05-06
alternative label: keraaminen teollisuus
alternative label: kiviteollisuus
alternative label: lasiteollisuus
alternative label: glas-, sten- och keramisk kindustri @sv
alternative label: glasindustri @sv
alternative label: keramikindustri @sv
alternative label: stenindustri @sv
broader: teollisuus
in scheme: Metatietosanasto
preferred label: glas-, sten- och keramikindustri @sv

lähetystösihteeri
type: Concept
source: Kansallinen RDA-termi
source: Nationell RDA-term @sv
created: 2019-05-03
modified: 2025-10-30
broader: sihteeri
in scheme: Metatietosanasto
preferred label: legationssekreterare @sv

taloustieteiden tohtori
type: Concept
source: Kansallinen RDA-termi
source: Nationell RDA-term @sv
created: 2019-05-07
modified: 2024-05-24
alternative label: TTT
broader: tohtori
in scheme: Metatietosanasto
preferred label: doktor i ekonomiska vetenskaper @sv

farmasian kandidaatti
type: Concept
source: Kansallinen RDA-termi
source: Nationell RDA-term @sv
created: 2019-05-07
modified: 2024-05-24
alternative label: FaK
broader: kandidaatti
in scheme: Metatietosanasto
preferred label: farmacie kandidat @sv

terveydenhuollon kandidaatti
type: Concept
source: Kansallinen RDA-termi
source: Nationell RDA-term @sv
created: 2019-05-07
modified: 2024-05-24
alternative label: THK
broader: kandidaatti
in scheme: Metatietosanasto
preferred label: kandidat i hälsovård @sv

oikeustieteen maisteri
type: Concept
source: Kansallinen RDA-termi
source: Nationell RDA-term @sv
created: 2019-05-07
modified: 2024-05-24
alternative label: OTM
broader: maisteri
in scheme: Metatietosanasto
preferred label: juris magister @sv

kuvataiteen tohtori
type: Concept
source: Kansallinen RDA-termi
source: Nationell RDA-term @sv
created: 2019-05-07
modified: 2024-05-24
alternative label: KuT
broader: tohtori
in scheme: Metatietosanasto
preferred label: bildkonstdoktor @sv

hammaslääketieteen tohtori
type: Concept
source: Kansallinen RDA-termi
source: Nationell RDA-term @sv
created: 2019-05-07
modified: 2024-05-24
alternative label: HLT
broader: tohtori
in scheme: Metatietosanasto
preferred label: odontologie doktor @sv

tanssitaiteen lisensiaatti
type: Concept
source: Kansallinen RDA-termi
source: Nationell RDA-term @sv
created: 2019-05-07
modified: 2024-05-24
alternative label: TanssitL
broader: lisensiaatti
in scheme: Metatietosanasto
preferred label: danskonstlicentiat @sv

kauppatieteiden kandidaatti
type: Concept
source: Kansallinen RDA-termi
source: Nationell RDA-term @sv
created: 2019-05-07
modified: 2024-05-24
alternative label: KTK
broader: kandidaatti
in scheme: Metatietosanasto
preferred label: ekonomie kandidat @sv

terveystieteiden kandidaatti
type: Concept
source: Kansallinen RDA-termi
source: Nationell RDA-term @sv
created: 2019-05-07
modified: 2024-05-24
alternative label: TtK
broader: kandidaatti
in scheme: Metatietosanasto
preferred label: kandidat i hälsovetenskaper @sv

oikeustieteen lisensiaatti
type: Concept
source: Kansallinen RDA-termi
source: Nationell RDA-term @sv
created: 2019-05-07
modified: 2024-05-24
alternative label: OTL
broader: lisensiaatti
in scheme: Metatietosanasto
preferred label: juris licentiat @sv

luonnontieteiden kandidaatti
type: Concept
source: Kansallinen RDA-termi
source: Nationell RDA-term @sv
created: 2019-05-07
modified: 2024-05-24
alternative label: LuK
broader: kandidaatti
in scheme: Metatietosanasto
preferred label: kandidat i naturvetenskaperna @sv

kasvatustieteen maisteri
type: Concept
source: Kansallinen RDA-termi
source: Nationell RDA-term @sv
created: 2019-05-07
modified: 2024-05-24
alternative label: KM
alternative label: kasvatustieteiden maisteri
broader: maisteri
in scheme: Metatietosanasto
preferred label: pedagogie magister @sv

lakitieteen lisensiaatti
type: Concept
source: Kansallinen RDA-termi
source: Nationell RDA-term @sv
created: 2019-05-07
modified: 2024-05-24
alternative label: LaL
broader: lisensiaatti
in scheme: Metatietosanasto
preferred label: juris licentiat @sv

eläinlääketieteen tohtori
type: Concept
source: Kansallinen RDA-termi
source: Nationell RDA-term @sv
created: 2019-05-07
modified: 2024-05-24
alternative label: ELT
broader: tohtori
in scheme: Metatietosanasto
preferred label: veterinärmedicine doktor @sv

teologian lisensiaatti
type: Concept
source: Kansallinen RDA-termi
source: Nationell RDA-term @sv
created: 2019-05-07
modified: 2024-05-24
alternative label: TL
broader: lisensiaatti
in scheme: Metatietosanasto
preferred label: teologie licentait @sv

musiikin lisensiaatti
type: Concept
source: Kansallinen RDA-termi
source: Nationell RDA-term @sv
created: 2019-05-07
modified: 2024-05-24
alternative label: MuL
broader: lisensiaatti
in scheme: Metatietosanasto
preferred label: musiklicentiat @sv

tekniikan kandidaatti
type: Concept
source: Kansallinen RDA-termi
source: Nationell RDA-term @sv
created: 2019-05-07
modified: 2024-05-24
alternative label: TkK
broader: kandidaatti
in scheme: Metatietosanasto
preferred label: teknologie kandidat @sv

liikuntatieteiden kandidaatti
type: Concept
source: Kansallinen RDA-termi
source: Nationell RDA-term @sv
created: 2019-05-07
modified: 2024-05-24
alternative label: LitK
broader: kandidaatti
in scheme: Metatietosanasto
preferred label: kandidat i gymnastik- och idrottsvetenskaper @sv

teatteritaiteen maisteri
type: Concept
source: Kansallinen RDA-termi
source: Nationell RDA-term @sv
created: 2019-05-07
modified: 2024-05-24
alternative label: TeM
broader: maisteri
in scheme: Metatietosanasto
preferred label: magister i teaterkonst @sv

terveystieteiden maisteri
type: Concept
source: Kansallinen RDA-termi
source: Nationell RDA-term @sv
created: 2019-05-07
modified: 2024-05-24
alternative label: TtM
broader: maisteri
in scheme: Metatietosanasto
preferred label: magister i hälsovetenskaper @sv

asiantuntija
type: Concept
source: RDA-termi
source: RDA-term @sv
created: 2016-01-08
modified: 2025-04-16
alternative label: consultant @en
alternative label: asiantuntija (suhde)
alternative label: asiantuntija (toimija)
alternative label: expert (relation) @sv
alternative label: sakkunnig @sv
alternative label: specialist @sv
broader: teoksen tekijä
definition: Toimija, joka tarjoaa asiantuntijapalveluita ja usein antaa suosituksia toimijalle, joka esiintyy teoksen tekijänä. (RDA Registry)
definition: Aktör som erbjuder experttjänster och ofta ger rekommendationer åt en aktör, som är upphovsperson till ett verk. @sv
in scheme: Metatietosanasto
preferred label: consultant agent @en
preferred label: expert @sv

musiikin maisteri
type: Concept
source: Kansallinen RDA-termi
source: Nationell RDA-term @sv
created: 2019-05-07
modified: 2024-05-24
alternative label: MuM
broader: maisteri
in scheme: Metatietosanasto
preferred label: musikmagister @sv

lääketieteen ja kirurgian tohtori
type: Concept
source: Kansallinen RDA-termi
source: Nationell RDA-term @sv
created: 2019-05-07
modified: 2024-05-24
alternative label: LKT
broader: tohtori
in scheme: Metatietosanasto
preferred label: medicine och kirurgie doktor @sv

farmasian maisteri
type: Concept
source: Kansallinen RDA-termi
source: Nationell RDA-term @sv
created: 2019-05-07
modified: 2024-05-24
alternative label: FaM
broader: maisteri
in scheme: Metatietosanasto
preferred label: farmacie magister @sv

psykologian tohtori
type: Concept
source: Kansallinen RDA-termi
source: Nationell RDA-term @sv
created: 2019-05-07
modified: 2024-05-24
alternative label: PsT
alternative label: PsD @sv
broader: tohtori
in scheme: Metatietosanasto
preferred label: psykologie doktor @sv

lääketieteen tohtori
type: Concept
source: Kansallinen RDA-termi
source: Nationell RDA-term @sv
created: 2019-05-07
modified: 2024-05-24
alternative label: LT
broader: tohtori
in scheme: Metatietosanasto
preferred label: medicine doktor @sv

oikeustieteen tohtori
type: Concept
source: Kansallinen RDA-termi
source: Nationell RDA-term @sv
created: 2019-05-07
modified: 2024-05-24
alternative label: OTT
broader: tohtori
in scheme: Metatietosanasto
preferred label: juris doktor @sv

terveydenhuollon tohtori
type: Concept
source: Kansallinen RDA-termi
source: Nationell RDA-term @sv
created: 2019-05-07
modified: 2024-05-24
alternative label: THT
broader: tohtori
in scheme: Metatietosanasto
preferred label: doktor i hälsovård @sv

liikuntakasvatuksen kandidaatti
type: Concept
source: Kansallinen RDA-termi
source: Nationell RDA-term @sv
created: 2019-05-07
modified: 2024-05-24
alternative label: LiK
broader: kandidaatti
in scheme: Metatietosanasto
preferred label: kandidat i fysisk fostran @sv

yhteiskuntatieteiden kandidaatti
type: Concept
source: Kansallinen RDA-termi
source: Nationell RDA-term @sv
created: 2019-05-07
modified: 2024-05-24
alternative label: YTK
broader: kandidaatti
in scheme: Metatietosanasto
preferred label: kandidat i samhällsvetenskaper @sv

yhteiskuntatieteiden maisteri
type: Concept
source: Kansallinen RDA-termi
source: Nationell RDA-term @sv
created: 2019-05-07
modified: 2024-05-24
alternative label: YTM
broader: maisteri
in scheme: Metatietosanasto
preferred label: magister i samhällsvetenskaper @sv

lakitieteen kandidaatti
type: Concept
source: Kansallinen RDA-termi
source: Nationell RDA-term @sv
created: 2019-05-07
modified: 2024-05-24
alternative label: LaK
broader: kandidaatti
in scheme: Metatietosanasto
preferred label: juris kandidat @sv

tekniikan tohtori
type: Concept
source: Kansallinen RDA-termi
source: Nationell RDA-term @sv
created: 2019-05-07
modified: 2024-05-24
alternative label: TkT
alternative label: TkD @sv
broader: tohtori
in scheme: Metatietosanasto
preferred label: teknologie doktor @sv

hammaslääketieteen lisensiaatti
type: Concept
source: Kansallinen RDA-termi
source: Nationell RDA-term @sv
created: 2019-05-07
modified: 2024-05-24
alternative label: HLL
broader: lisensiaatti
in scheme: Metatietosanasto
preferred label: odontologie licentiat @sv

kasvatustieteen lisensiaatti
type: Concept
source: Kansallinen RDA-termi
source: Nationell RDA-term @sv
created: 2019-05-07
modified: 2024-05-24
alternative label: KL
alternative label: kasvatustieteiden lisensiaatti
broader: lisensiaatti
in scheme: Metatietosanasto
preferred label: pedagogie licentiat @sv

filosofian tohtori
type: Concept
source: Kansallinen RDA-termi
source: Nationell RDA-term @sv
created: 2019-05-07
modified: 2024-05-24
alternative label: FT
broader: tohtori
in scheme: Metatietosanasto
preferred label: filosofie doktor @sv

psykologian lisensiaatti
type: Concept
source: Kansallinen RDA-termi
source: Nationell RDA-term @sv
created: 2019-05-07
modified: 2024-05-24
alternative label: PsL
broader: lisensiaatti
in scheme: Metatietosanasto
preferred label: psykologie licentiat @sv

elintarviketieteiden lisensiaatti
type: Concept
source: Kansallinen RDA-termi
source: Nationell RDA-term @sv
created: 2019-05-07
modified: 2024-05-24
alternative label: ETL
broader: lisensiaatti
in scheme: Metatietosanasto
preferred label: licentiat i livsmedelsvetenskaper @sv

humanististen tieteiden kandidaatti
type: Concept
source: Kansallinen RDA-termi
source: Nationell RDA-term @sv
created: 2019-05-07
modified: 2024-05-24
alternative label: HuK
broader: kandidaatti
in scheme: Metatietosanasto
preferred label: kandidat i de humanistiska vetenskaperna @sv

filosofian kandidaatti
type: Concept
source: Kansallinen RDA-termi
source: Nationell RDA-term @sv
created: 2019-05-07
modified: 2024-05-24
alternative label: FK
broader: kandidaatti
in scheme: Metatietosanasto
preferred label: filosofie kandidat @sv

maatalous- ja metsätieteiden lisensiaatti
type: Concept
source: Kansallinen RDA-termi
source: Nationell RDA-term @sv
created: 2019-05-07
modified: 2024-05-24
alternative label: MML
broader: lisensiaatti
in scheme: Metatietosanasto
preferred label: agronomie- och forstlicentiat @sv

psykologian kandidaatti
type: Concept
source: Kansallinen RDA-termi
source: Nationell RDA-term @sv
created: 2019-05-07
modified: 2024-05-24
alternative label: PsK
broader: kandidaatti
in scheme: Metatietosanasto
preferred label: psykologie kandidat @sv

farmasian lisensiaatti
type: Concept
source: Kansallinen RDA-termi
source: Nationell RDA-term @sv
created: 2019-05-07
modified: 2024-05-24
alternative label: FaL
broader: lisensiaatti
in scheme: Metatietosanasto
preferred label: farmacie licentiat @sv

teologian tohtori
type: Concept
source: Kansallinen RDA-termi
source: Nationell RDA-term @sv
created: 2019-05-07
modified: 2024-05-24
alternative label: TT
alternative label: TD @sv
broader: tohtori
in scheme: Metatietosanasto
preferred label: teologie doktor @sv

farmasian tohtori
type: Concept
source: Kansallinen RDA-termi
source: Nationell RDA-term @sv
created: 2019-05-07
modified: 2024-05-24
alternative label: FaT
broader: tohtori
in scheme: Metatietosanasto
preferred label: farmacie doktor @sv

terveydenhuollon lisensiaatti
type: Concept
source: Kansallinen RDA-termi
source: Nationell RDA-term @sv
created: 2019-05-07
modified: 2024-05-24
alternative label: THL
broader: lisensiaatti
in scheme: Metatietosanasto
preferred label: licentiat i hälsovård @sv

kuvataiteen kandidaatti
type: Concept
source: Kansallinen RDA-termi
source: Nationell RDA-term @sv
created: 2019-05-07
modified: 2024-05-24
alternative label: KuK
broader: kandidaatti
in scheme: Metatietosanasto
preferred label: bildkonstkandidat @sv

kuvataiteen lisensiaatti
type: Concept
source: Kansallinen RDA-termi
source: Nationell RDA-term @sv
created: 2019-05-07
modified: 2024-05-24
alternative label: KuL
broader: lisensiaatti
in scheme: Metatietosanasto
preferred label: bildkonstlicentiat @sv

oikeustieteen kandidaatti
type: Concept
source: Kansallinen RDA-termi
source: Nationell RDA-term @sv
created: 2019-05-07
modified: 2024-05-24
alternative label: OTK
broader: kandidaatti
in scheme: Metatietosanasto
preferred label: juris kandidat @sv

kasvatustieteen kandidaatti
type: Concept
source: Kansallinen RDA-termi
source: Nationell RDA-term @sv
created: 2019-05-07
modified: 2024-05-24
alternative label: KK
alternative label: kasvatustieteiden kandidaatti
broader: kandidaatti
in scheme: Metatietosanasto
preferred label: pedagogie kandidat @sv

terveydenhuollon maisteri
type: Concept
source: Kansallinen RDA-termi
source: Nationell RDA-term @sv
created: 2019-05-07
modified: 2024-05-24
alternative label: THM
broader: maisteri
in scheme: Metatietosanasto
preferred label: magister i hälsovård @sv

sanoittaja
type: Concept
source: RDA-termi
source: RDA-term @sv
created: 2016-01-08
modified: 2025-08-27
alternative label: lyricist @en
alternative label: san. (sanoittaja)
alternative label: sanoittaja (suhde)
alternative label: sanoittaja (toimija)
alternative label: författare till sångtext @sv
alternative label: sångtextförfattare (relation) @sv
alternative label: text. (sångtextförfattare) @sv
broader: kirjoittaja
definition: Toimija, joka on populaarimusiikkiin kuuluvan laulun, mukaan lukien musikaalilaulun, sanojen kirjoittaja. (RDA Registry)
definition: Aktör som är författare till ord i en sång, även en musikalsång, som hör till populärmusik. @sv
in scheme: Metatietosanasto
preferred label: lyricist agent @en
preferred label: sångtextförfattare @sv
scope note: Ei kata pelkän musikaalin dialogin kirjoittajaa. (RDA Registry)
scope note: Gäller inte författare till endast dialog i en musikal. @sv

yhteiskuntatieteiden tohtori
type: Concept
source: Kansallinen RDA-termi
source: Nationell RDA-term @sv
created: 2019-05-07
modified: 2024-05-24
alternative label: YTT
broader: tohtori
in scheme: Metatietosanasto
preferred label: doktor i samhällsvetenskaper @sv

musiikin kandidaatti
type: Concept
source: Kansallinen RDA-termi
source: Nationell RDA-term @sv
created: 2019-05-07
modified: 2024-05-24
alternative label: MuK
broader: kandidaatti
in scheme: Metatietosanasto
preferred label: musikkandidat @sv

taloustieteiden maisteri
type: Concept
source: Kansallinen RDA-termi
source: Nationell RDA-term @sv
created: 2019-05-07
modified: 2024-05-24
alternative label: TTM
broader: maisteri
in scheme: Metatietosanasto
preferred label: magister i ekonomiska vetenskaper @sv

teatteritaiteen kandidaatti
type: Concept
source: Kansallinen RDA-termi
source: Nationell RDA-term @sv
created: 2019-05-07
modified: 2024-05-24
alternative label: TeK
broader: kandidaatti
in scheme: Metatietosanasto
preferred label: kandidat i teaterkonst @sv

terveystieteiden lisensiaatti
type: Concept
source: Kansallinen RDA-termi
source: Nationell RDA-term @sv
created: 2019-05-07
modified: 2024-05-24
alternative label: TtL
broader: lisensiaatti
in scheme: Metatietosanasto
preferred label: licentiat i hälsovetenskaper @sv

hallintotieteiden lisensiaatti
type: Concept
source: Kansallinen RDA-termi
source: Nationell RDA-term @sv
created: 2019-05-07
modified: 2024-05-24
alternative label: HTL
broader: lisensiaatti
in scheme: Metatietosanasto
preferred label: licentiat i administrativa vetenskaper @sv

liikuntatieteiden lisensiaatti
type: Concept
source: Kansallinen RDA-termi
source: Nationell RDA-term @sv
created: 2019-05-07
modified: 2024-05-24
alternative label: LitL
broader: lisensiaatti
in scheme: Metatietosanasto
preferred label: licentiat i gymnastik- och idrottsvetenskaper @sv

taiteen maisteri
type: Concept
source: Kansallinen RDA-termi
source: Nationell RDA-term @sv
created: 2019-05-07
modified: 2024-05-24
alternative label: TaM
broader: maisteri
in scheme: Metatietosanasto
preferred label: konstmagister @sv

elintarviketieteiden tohtori
type: Concept
source: Kansallinen RDA-termi
source: Nationell RDA-term @sv
created: 2019-05-07
modified: 2024-05-24
alternative label: ETT
broader: tohtori
in scheme: Metatietosanasto
preferred label: doktor i livsmedelsvetenskaper @sv

lainopin kandidaatti
type: Concept
source: Kansallinen RDA-termi
source: Nationell RDA-term @sv
created: 2019-05-07
modified: 2024-05-24
alternative label: LOK
broader: kandidaatti
in scheme: Metatietosanasto
preferred label: juris kandidat @sv

valtiotieteiden maisteri
type: Concept
source: Kansallinen RDA-termi
source: Nationell RDA-term @sv
created: 2019-05-07
modified: 2024-05-24
alternative label: VTM
alternative label: valtiotieteen maisteri
broader: maisteri
in scheme: Metatietosanasto
preferred label: politices magister @sv

kauppatieteiden maisteri
type: Concept
source: Kansallinen RDA-termi
source: Nationell RDA-term @sv
created: 2019-05-07
modified: 2024-05-24
alternative label: KTM
broader: maisteri
in scheme: Metatietosanasto
preferred label: ekonomie magister @sv

teatteritaiteen tohtori
type: Concept
source: Kansallinen RDA-termi
source: Nationell RDA-term @sv
created: 2019-05-07
modified: 2024-05-24
alternative label: TeT
alternative label: TeD @sv
broader: tohtori
in scheme: Metatietosanasto
preferred label: doktor i teaterkonst @sv

kauppatieteiden lisensiaatti
type: Concept
source: Kansallinen RDA-termi
source: Nationell RDA-term @sv
created: 2019-05-07
modified: 2024-05-24
alternative label: KTL
broader: lisensiaatti
in scheme: Metatietosanasto
preferred label: ekonomie licentiat @sv

hallintotieteiden kandidaatti
type: Concept
source: Kansallinen RDA-termi
source: Nationell RDA-term @sv
created: 2019-05-07
modified: 2024-05-24
alternative label: HTK
broader: kandidaatti
in scheme: Metatietosanasto
preferred label: kandidat i administrativa vetenskaper @sv

kasvatustieteiden tohtori
type: Concept
source: Kansallinen RDA-termi
source: Nationell RDA-term @sv
created: 2019-05-07
modified: 2024-05-24
alternative label: KT
broader: tohtori
in scheme: Metatietosanasto
preferred label: pedagogie doktor @sv

sotatieteiden maisteri
type: Concept
source: Kansallinen RDA-termi
source: Nationell RDA-term @sv
created: 2019-05-07
modified: 2024-05-24
alternative label: SM
broader: maisteri
in scheme: Metatietosanasto
preferred label: magister i militärvetenskaper @sv

lääketieteen kandidaatti
type: Concept
source: Kansallinen RDA-termi
source: Nationell RDA-term @sv
created: 2019-05-07
modified: 2024-05-24
alternative label: LK
broader: kandidaatti
in scheme: Metatietosanasto
preferred label: medicine kandidat @sv

psykologian maisteri
type: Concept
source: Kansallinen RDA-termi
source: Nationell RDA-term @sv
created: 2019-05-07
modified: 2024-05-24
alternative label: PsM
broader: maisteri
in scheme: Metatietosanasto
preferred label: psykologie magister @sv

lakitieteen tohtori
type: Concept
source: Kansallinen RDA-termi
source: Nationell RDA-term @sv
created: 2019-05-07
modified: 2024-05-24
alternative label: LaT
broader: tohtori
in scheme: Metatietosanasto
preferred label: juris doktor @sv

taiteen tohtori
type: Concept
source: Kansallinen RDA-termi
source: Nationell RDA-term @sv
created: 2019-05-07
modified: 2024-05-24
alternative label: TaT
broader: tohtori
in scheme: Metatietosanasto
preferred label: konstdoktor @sv

tekniikan lisensiaatti
type: Concept
source: Kansallinen RDA-termi
source: Nationell RDA-term @sv
created: 2019-05-07
modified: 2024-05-24
alternative label: TkL
broader: lisensiaatti
in scheme: Metatietosanasto
preferred label: teknologie licentiat @sv

valtiotieteiden kandidaatti
type: Concept
source: Kansallinen RDA-termi
source: Nationell RDA-term @sv
created: 2019-05-07
modified: 2024-05-24
alternative label: VTK
alternative label: valtiotieteen kandidaatti
broader: kandidaatti
in scheme: Metatietosanasto
preferred label: politices kandidat @sv

eläinlääketieteen lisensiaatti
type: Concept
source: Kansallinen RDA-termi
source: Nationell RDA-term @sv
created: 2019-05-07
modified: 2024-05-24
alternative label: ELL
broader: lisensiaatti
in scheme: Metatietosanasto
preferred label: veterinärmedicine licentiat @sv

terveystieteiden tohtori
type: Concept
source: Kansallinen RDA-termi
source: Nationell RDA-term @sv
created: 2019-05-07
modified: 2024-05-24
alternative label: TtT
broader: tohtori
in scheme: Metatietosanasto
preferred label: doktor i hälsovetenskaper @sv

hallintotieteiden tohtori
type: Concept
source: Kansallinen RDA-termi
source: Nationell RDA-term @sv
created: 2019-05-07
modified: 2024-05-24
alternative label: HTT
broader: tohtori
in scheme: Metatietosanasto
preferred label: doktor i administrativa vetenskaper @sv

taloustieteiden lisensiaatti
type: Concept
source: Kansallinen RDA-termi
source: Nationell RDA-term @sv
created: 2019-05-07
modified: 2024-05-24
alternative label: TTL
broader: lisensiaatti
in scheme: Metatietosanasto
preferred label: licentiat i ekonomiska vetenskaper @sv

taiteen kandidaatti
type: Concept
source: Kansallinen RDA-termi
source: Nationell RDA-term @sv
created: 2019-05-07
modified: 2024-05-24
alternative label: TaK
broader: kandidaatti
in scheme: Metatietosanasto
preferred label: konstkandidat @sv

kuvataiteen maisteri
type: Concept
source: Kansallinen RDA-termi
source: Nationell RDA-term @sv
created: 2019-05-07
modified: 2024-05-24
alternative label: KuM
broader: maisteri
in scheme: Metatietosanasto
preferred label: magister i bildkonst @sv

maatalous- ja metsätieteiden tohtori
type: Concept
source: Kansallinen RDA-termi
source: Nationell RDA-term @sv
created: 2019-05-07
modified: 2024-05-24
alternative label: MMT
broader: tohtori
in scheme: Metatietosanasto
preferred label: agronomie- och forstdoktor @sv

teologian maisteri
type: Concept
source: Kansallinen RDA-termi
source: Nationell RDA-term @sv
created: 2019-05-07
modified: 2024-05-24
alternative label: TM
broader: maisteri
in scheme: Metatietosanasto
preferred label: teologie magister @sv

elintarviketieteiden maisteri
type: Concept
source: Kansallinen RDA-termi
source: Nationell RDA-term @sv
created: 2019-05-07
modified: 2024-05-24
alternative label: ETM
broader: maisteri
in scheme: Metatietosanasto
preferred label: magister i livsmedelsvetenskaper @sv

teatteritaiteen lisensiaatti
type: Concept
source: Kansallinen RDA-termi
source: Nationell RDA-term @sv
created: 2019-05-07
modified: 2024-05-24
alternative label: TeL
broader: lisensiaatti
in scheme: Metatietosanasto
preferred label: licentiat i teaterkonst @sv

filosofian maisteri
type: Concept
source: Kansallinen RDA-termi
source: Nationell RDA-term @sv
created: 2019-05-07
modified: 2024-05-24
alternative label: FM
broader: maisteri
in scheme: Metatietosanasto
preferred label: filosofie magister @sv

hammaslääketieteen kandidaatti
type: Concept
source: Kansallinen RDA-termi
source: Nationell RDA-term @sv
created: 2019-05-07
modified: 2024-05-24
alternative label: HLK
broader: kandidaatti
in scheme: Metatietosanasto
preferred label: odontologie kandidat @sv

taiteen lisensiaatti
type: Concept
source: Kansallinen RDA-termi
source: Nationell RDA-term @sv
created: 2019-05-07
modified: 2024-05-24
alternative label: TaL
broader: lisensiaatti
in scheme: Metatietosanasto
preferred label: konstlicentiat @sv

maatalous- ja metsätieteiden kandidaatti
type: Concept
source: Kansallinen RDA-termi
source: Nationell RDA-term @sv
created: 2019-05-07
modified: 2024-05-24
alternative label: MMK
broader: kandidaatti
in scheme: Metatietosanasto
preferred label: agronomie- och forstkandidat @sv

elintarviketieteiden kandidaatti
type: Concept
source: Kansallinen RDA-termi
source: Nationell RDA-term @sv
created: 2019-05-07
modified: 2024-05-24
alternative label: ETK
broader: kandidaatti
in scheme: Metatietosanasto
preferred label: kandidat i livsmedelsvetenskaper @sv

liikuntatieteiden tohtori
type: Concept
source: Kansallinen RDA-termi
source: Nationell RDA-term @sv
created: 2019-05-07
modified: 2024-05-24
alternative label: LitT
broader: tohtori
in scheme: Metatietosanasto
preferred label: doktor i gymnastik- och idrottsvetenskap @sv

liikuntatieteiden maisteri
type: Concept
source: Kansallinen RDA-termi
source: Nationell RDA-term @sv
created: 2019-05-07
modified: 2024-05-24
alternative label: LitM
broader: maisteri
in scheme: Metatietosanasto
preferred label: magister i gymnastik- och idrottsvetenskaper @sv

sotatieteiden kandidaatti
type: Concept
source: Kansallinen RDA-termi
source: Nationell RDA-term @sv
created: 2019-05-07
modified: 2024-05-24
alternative label: SK
broader: kandidaatti
in scheme: Metatietosanasto
preferred label: kandidat i militärvetenskaper @sv

hallintotieteiden maisteri
type: Concept
source: Kansallinen RDA-termi
source: Nationell RDA-term @sv
created: 2019-05-07
modified: 2024-05-24
alternative label: HTM
broader: maisteri
in scheme: Metatietosanasto
preferred label: magister i administrativa vetenskaper @sv

valtiotieteiden tohtori
type: Concept
source: Kansallinen RDA-termi
source: Nationell RDA-term @sv
created: 2019-05-07
modified: 2024-05-24
alternative label: VTT
broader: tohtori
in scheme: Metatietosanasto
preferred label: politices doktor @sv

maatalous- ja metsätieteiden maisteri
type: Concept
source: Kansallinen RDA-termi
source: Nationell RDA-term @sv
created: 2019-05-07
modified: 2024-05-24
alternative label: MMM
broader: maisteri
in scheme: Metatietosanasto
preferred label: agronomie- och forstmagister @sv

tanssitaiteen kandidaatti
type: Concept
source: Kansallinen RDA-termi
source: Nationell RDA-term @sv
created: 2019-05-07
modified: 2024-05-24
alternative label: TanssitK
broader: kandidaatti
in scheme: Metatietosanasto
preferred label: danskonstkandidat @sv

filosofian lisensiaatti
type: Concept
source: Kansallinen RDA-termi
source: Nationell RDA-term @sv
created: 2019-05-07
modified: 2024-05-24
alternative label: FL
broader: lisensiaatti
in scheme: Metatietosanasto
preferred label: filosofie licentiat @sv

tanssitaiteen maisteri
type: Concept
source: Kansallinen RDA-termi
source: Nationell RDA-term @sv
created: 2019-05-07
modified: 2024-05-24
alternative label: TanssitM
broader: maisteri
in scheme: Metatietosanasto
preferred label: danskonstmagister @sv

lääketieteen lisensiaatti
type: Concept
source: Kansallinen RDA-termi
source: Nationell RDA-term @sv
created: 2019-05-07
modified: 2024-05-24
alternative label: LL
broader: lisensiaatti
in scheme: Metatietosanasto
preferred label: medicine licentiat @sv

opettajakandidaatti
type: Concept
source: Kansallinen RDA-termi
source: Nationell RDA-term @sv
created: 2019-05-07
modified: 2024-05-24
alternative label: OpK
broader: kandidaatti
in scheme: Metatietosanasto
preferred label: lärarekandidat @sv

yhteiskuntatieteiden lisensiaatti
type: Concept
source: Kansallinen RDA-termi
source: Nationell RDA-term @sv
created: 2019-05-07
modified: 2024-05-24
alternative label: YTL
broader: lisensiaatti
in scheme: Metatietosanasto
preferred label: licentiat i samhällsvetenskaper @sv

musiikin tohtori
type: Concept
source: Kansallinen RDA-termi
source: Nationell RDA-term @sv
created: 2019-05-07
modified: 2024-05-24
alternative label: MuT
alternative label: MuD @sv
broader: tohtori
in scheme: Metatietosanasto
preferred label: musikdoktor @sv

teologian kandidaatti
type: Concept
source: Kansallinen RDA-termi
source: Nationell RDA-term @sv
created: 2019-05-07
modified: 2024-05-24
alternative label: TK
broader: kandidaatti
in scheme: Metatietosanasto
preferred label: teologie kandidat @sv

sotatieteiden tohtori
type: Concept
source: Kansallinen RDA-termi
source: Nationell RDA-term @sv
created: 2019-05-07
modified: 2024-05-24
alternative label: ST
broader: tohtori
in scheme: Metatietosanasto
preferred label: doktor i militärvetenskaper @sv

kauppatieteiden tohtori
type: Concept
source: Kansallinen RDA-termi
source: Nationell RDA-term @sv
created: 2019-05-07
modified: 2024-05-24
alternative label: KTT
broader: tohtori
in scheme: Metatietosanasto
preferred label: ekonomie doktor @sv

taloustieteiden kandidaatti
type: Concept
source: Kansallinen RDA-termi
source: Nationell RDA-term @sv
created: 2019-05-07
modified: 2024-05-24
alternative label: TTK
broader: kandidaatti
in scheme: Metatietosanasto
preferred label: kandidat i ekonomiska vetenskaper @sv

tanssitaiteen tohtori
type: Concept
source: Kansallinen RDA-termi
source: Nationell RDA-term @sv
created: 2019-05-07
modified: 2024-05-24
alternative label: TanssitT
broader: tohtori
in scheme: Metatietosanasto
preferred label: danskonstkdoktor @sv

valtiotieteiden lisensiaatti
type: Concept
source: Kansallinen RDA-termi
source: Nationell RDA-term @sv
created: 2019-05-07
modified: 2024-05-24
alternative label: VTL
broader: lisensiaatti
in scheme: Metatietosanasto
preferred label: politices licentiat @sv

opistonopettaja
type: Concept
source: Kansallinen RDA-termi
source: Nationell RDA-term @sv
created: 2019-07-11
modified: 2025-11-04
alternative label: opiston opettaja
alternative label: institutlärare @sv
broader: opettaja
definition: Aikuiskasvatus- ja aikuisopiston opettaja.
definition: Lärare vid vuxenutbildningsinstitut. @sv
in scheme: Metatietosanasto
preferred label: lärare vid institut @sv

kunnansihteeri
type: Concept
source: Kansallinen RDA-termi
source: Nationell RDA-term @sv
created: 2019-07-11
modified: 2025-11-04
broader: sihteeri
definition: (Maaseutu)kunnan hallinnon sihteerintehtäviä hoitava virkamies (Lähde: Kielitoimiston sanakirja).
definition: Tjänsteman som sköter förvaltningens sekreteraruppgifter i (landsorts)kommun. @sv
in scheme: Metatietosanasto
preferred label: municipal secretary @en
preferred label: kommunsekreterare @sv

metsätyönjohtaja
type: Concept
source: Kansallinen RDA-termi
source: Nationell RDA-term @sv
created: 2019-07-11
modified: 2025-11-04
alternative label: skogsarbetsledare @sv
alternative label: skogsrättare @sv
broader: työnjohtaja
in scheme: Metatietosanasto
preferred label: skogsförman @sv

laskentasihteeri
type: Concept
source: Kansallinen RDA-termi
source: Nationell RDA-term @sv
created: 2019-07-11
modified: 2025-11-04
alternative label: kalkyleringssekreterare @sv
broader: sihteeri
in scheme: Metatietosanasto
preferred label: redovisningssekreterare @sv

sairaalanjohtaja
type: Concept
source: Kansallinen RDA-termi
source: Nationell RDA-term @sv
created: 2019-07-11
modified: 2025-11-04
broader: koulutoimenjohtaja
in scheme: Metatietosanasto
preferred label: sjukhusdirektör @sv

festivaali
type: Concept
source: Kansallinen RDA-termi
source: Nationell RDA-term @sv
created: 2016-01-08
modified: 2024-05-24
alternative label: elokuvafestivaali
alternative label: juhlaviikot
alternative label: musiikkijuhlat
alternative label: filmfestival @sv
alternative label: jubileumsveckor @sv
alternative label: musikfestival @sv
alternative label: musikfestspel @sv
broader: tapahtuma
example: Haku päällä (festivaali)
example: Världen i byn (festival) @sv
in scheme: Metatietosanasto
preferred label: festival @sv

arkistoamanuenssi
type: Concept
source: Kansallinen RDA-termi
source: Nationell RDA-term @sv
created: 2019-07-11
modified: 2025-11-04
broader: amanuenssi
in scheme: Metatietosanasto
preferred label: arkivamanuens @sv

hallintosihteeri
type: Concept
source: Kansallinen RDA-termi
source: Nationell RDA-term @sv
created: 2019-07-11
modified: 2025-11-04
broader: sihteeri
definition: Korkeimman hallinto-oikeuden vakinainen esittelijä (Lähde: Kielitoimiston sanakirja).
definition: Ordinarie föredragande vid högsta förvaltningsdomstolen. @sv
in scheme: Metatietosanasto
preferred label: judicial secretary @en
preferred label: förvaltningssekreterare @sv

vientisihteeri
type: Concept
source: Kansallinen RDA-termi
source: Nationell RDA-term @sv
created: 2019-07-11
modified: 2025-11-04
broader: sihteeri
in scheme: Metatietosanasto
preferred label: exportsekreterare @sv

julkishallinnon päällikkö
type: Concept
source: Kansallinen RDA-termi
source: Nationell RDA-term @sv
created: 2019-07-11
modified: 2025-11-04
broader: päällikkö
in scheme: Metatietosanasto
preferred label: chef för offentlig förvaltning @sv

lentovirkailija
type: Concept
source: Kansallinen RDA-termi
source: Nationell RDA-term @sv
created: 2019-07-11
modified: 2025-11-04
broader: virkailija
in scheme: Metatietosanasto
preferred label: flygtjänsteman @sv

kulttuuritoimenjohtaja
type: Concept
source: Kansallinen RDA-termi
source: Nationell RDA-term @sv
created: 2019-07-11
modified: 2025-11-04
broader: johtaja
in scheme: Metatietosanasto
preferred label: kulturdirektör @sv

ostopäällikkö
type: Concept
source: Kansallinen RDA-termi
source: Nationell RDA-term @sv
created: 2019-07-11
modified: 2025-11-04
broader: päällikkö
in scheme: Metatietosanasto
preferred label: inköpschef @sv

rahoituspäällikkö
type: Concept
source: Kansallinen RDA-termi
source: Nationell RDA-term @sv
created: 2019-07-11
modified: 2025-11-04
alternative label: finanschef @sv
broader: päällikkö
in scheme: Metatietosanasto
preferred label: finansieringschef @sv

junamies
type: Concept
source: Kansallinen RDA-termi
source: Nationell RDA-term @sv
created: 2019-07-11
modified: 2025-11-04
broader: rautatieläinen
definition: Erilaisia ratapihan työtehtäviä hoitava rautateiden työntekijä (Lähde: Kielitoimiston sanakirja).
definition: Järnvägsarbetare som sköter olika uppgifter vid bangårdar. @sv
in scheme: Metatietosanasto
preferred label: tågkarl @sv

museovirkailija
type: Concept
source: Kansallinen RDA-termi
source: Nationell RDA-term @sv
created: 2019-07-11
modified: 2025-11-04
broader: virkailija
in scheme: Metatietosanasto
preferred label: museitjänsteman @sv

viestintäsihteeri
type: Concept
source: Kansallinen RDA-termi
source: Nationell RDA-term @sv
created: 2019-07-11
modified: 2025-11-04
broader: sihteeri
in scheme: Metatietosanasto
preferred label: kommunikationssekreterare @sv

julkisasiamies
type: Concept
source: Kansallinen RDA-termi
source: Nationell RDA-term @sv
created: 2019-07-11
modified: 2025-11-04
broader: asiamies
in scheme: Metatietosanasto
preferred label: generaladvokat @sv

hoitoavustaja
type: Concept
source: Kansallinen RDA-termi
source: Nationell RDA-term @sv
created: 2019-07-11
modified: 2025-11-04
broader: avustaja
in scheme: Metatietosanasto
preferred label: vårdassistent @sv

ammattikorkeakoulun lehtori
type: Concept
source: Kansallinen RDA-termi
source: Nationell RDA-term @sv
created: 2019-07-11
modified: 2025-11-04
alternative label: ammattikorkeakoulunlehtori
alternative label: yrkeshögskolelektor @sv
broader: lehtori (opettaja)
in scheme: Metatietosanasto
preferred label: lektor vid yrkeshögskola @sv

tietoasiantuntija
type: Concept
source: Kansallinen RDA-termi
source: Nationell RDA-term @sv
created: 2019-07-11
modified: 2025-11-04
alternative label: informationsexpert @sv
broader: asiantuntija
in scheme: Metatietosanasto
preferred label: information specialist @en
preferred label: informationsspecialist @sv

toimistosihteeri
type: Concept
source: Kansallinen RDA-termi
source: Nationell RDA-term @sv
created: 2019-07-11
modified: 2025-11-04
alternative label: kanslisekreterare @sv
alternative label: kontorssekreterare @sv
broader: sihteeri
definition: Toimistossa työskentelevä sihteeri (Lähde: Kielitoimiston sanakirja).
definition: Sekreterare som arbetar på kontor. @sv
in scheme: Metatietosanasto
preferred label: byråsekreterare @sv

varikkopäällikkö
type: Concept
source: Kansallinen RDA-termi
source: Nationell RDA-term @sv
created: 2019-07-11
modified: 2025-11-04
broader: päällikkö
in scheme: Metatietosanasto
preferred label: depåchef @sv

viestintäasiantuntija
type: Concept
source: Kansallinen RDA-termi
source: Nationell RDA-term @sv
created: 2019-07-11
modified: 2025-11-04
alternative label: kommunikationsexpert @sv
broader: asiantuntija
in scheme: Metatietosanasto
preferred label: kommunikationsspecialist @sv

apulaisprofessori
type: Concept
source: Kansallinen RDA-termi
source: Nationell RDA-term @sv
created: 2019-07-11
modified: 2025-11-04
broader: professori
in scheme: Metatietosanasto
preferred label: associate professor @en
preferred label: biträdande professor @sv

tietopalvelusihteeri
type: Concept
source: Kansallinen RDA-termi
source: Nationell RDA-term @sv
created: 2019-07-11
modified: 2025-11-04
alternative label: informationstjänstsekreterare @sv
broader: sihteeri
in scheme: Metatietosanasto
preferred label: informatikerassistent @sv

sairaalatyöntekijä
type: Concept
source: Kansallinen RDA-termi
source: Nationell RDA-term @sv
created: 2019-07-11
modified: 2025-11-04
alternative label: sjukhusanställd @sv
alternative label: sjukhuspersonal @sv
broader: työntekijä
in scheme: Metatietosanasto
preferred label: sjukhusarbetare @sv

ravintolapäällikkö
type: Concept
source: Kansallinen RDA-termi
source: Nationell RDA-term @sv
created: 2019-07-11
modified: 2025-11-04
broader: päällikkö
in scheme: Metatietosanasto
preferred label: restaurangchef @sv

arkistovirkailija
type: Concept
source: Kansallinen RDA-termi
source: Nationell RDA-term @sv
created: 2019-07-11
modified: 2025-11-04
alternative label: arkivtjänsteman @sv
broader: virkailija
in scheme: Metatietosanasto
preferred label: arkivfunktionär @sv

piiriasiamies
type: Concept
source: Kansallinen RDA-termi
source: Nationell RDA-term @sv
created: 2019-07-11
modified: 2025-11-04
alternative label: distriktsombudsman @sv
alternative label: kretsombud @sv
broader: asiamies
in scheme: Metatietosanasto
preferred label: distriktsombud @sv

lukion lehtori
type: Concept
source: Kansallinen RDA-termi
source: Nationell RDA-term @sv
created: 2019-07-11
modified: 2025-11-04
alternative label: lukionlehtori
alternative label: gymnasielektor @sv
broader: lehtori (opettaja)
in scheme: Metatietosanasto
preferred label: lektor vid gymnasium @sv

museoassistentti
type: Concept
source: Kansallinen RDA-termi
source: Nationell RDA-term @sv
created: 2019-07-11
modified: 2025-11-04
broader: assistentti
in scheme: Metatietosanasto
preferred label: museiassistent @sv

järjestösihteeri
type: Concept
source: Kansallinen RDA-termi
source: Nationell RDA-term @sv
created: 2019-07-11
modified: 2025-11-04
broader: sihteeri
definition: Erilaisissa järjestöissä esimerkiksi puoluetoimistossa mm. suunnittelu- ja koulutustehtäviä hoitava toimihenkilö (Lähde: Kielitoimiston sanakirja).
definition: Funktionär som sköter planerings- och utbildningsuppgifter i olika organisationer, t.ex. vid partikansli e.d. @sv
in scheme: Metatietosanasto
preferred label: secretary of an organization @en
preferred label: organisationssekreterare @sv

kalanviljelijä
type: Concept
source: Kansallinen RDA-termi
source: Nationell RDA-term @sv
created: 2019-07-11
modified: 2025-11-04
broader: maatalousyrittäjä
in scheme: Metatietosanasto
preferred label: fiskodlare @sv

maatalousteknikko
type: Concept
source: Kansallinen RDA-termi
source: Nationell RDA-term @sv
created: 2019-07-11
modified: 2025-11-04
broader: teknikko
in scheme: Metatietosanasto
preferred label: lantbrukstekniker @sv

tekniikan erityisasiantuntija
type: Concept
source: Kansallinen RDA-termi
source: Nationell RDA-term @sv
created: 2019-07-11
modified: 2025-11-04
broader: asiantuntija
in scheme: Metatietosanasto
preferred label: specialist inom teknik @sv

koneteollisuustyöntekijä
type: Concept
source: Kansallinen RDA-termi
source: Nationell RDA-term @sv
created: 2019-07-11
modified: 2025-11-04
broader: työntekijä
in scheme: Metatietosanasto
preferred label: maskinindustriarbetare @sv

tullivirkailija
type: Concept
source: Kansallinen RDA-termi
source: Nationell RDA-term @sv
created: 2019-07-11
modified: 2025-11-04
broader: virkailija
in scheme: Metatietosanasto
preferred label: customs officer @en
preferred label: tulltjänsteman @sv

ylilääkäri
type: Concept
source: Kansallinen RDA-termi
source: Nationell RDA-term @sv
created: 2019-07-11
modified: 2025-11-04
broader: lääkäri
in scheme: Metatietosanasto
preferred label: överläkare @sv

kanavapäällikkö
type: Concept
source: Kansallinen RDA-termi
source: Nationell RDA-term @sv
created: 2019-07-11
modified: 2025-11-04
broader: päällikkö
in scheme: Metatietosanasto
preferred label: kanalchef @sv

ostoasiamies
type: Concept
source: Kansallinen RDA-termi
source: Nationell RDA-term @sv
created: 2019-07-11
modified: 2025-11-04
alternative label: inköpsombud @sv
broader: asiamies
in scheme: Metatietosanasto
preferred label: inköpsagent @sv

korkeakouluopettaja
type: Concept
source: Kansallinen RDA-termi
source: Nationell RDA-term @sv
created: 2019-07-11
modified: 2025-11-04
alternative label: korkeakoulun opettaja
alternative label: korkeakoulunopettaja
alternative label: högskollärare @sv
broader: opettaja
in scheme: Metatietosanasto
preferred label: högskolelärare @sv

korkeakoulun amanuenssi
type: Concept
source: Kansallinen RDA-termi
source: Nationell RDA-term @sv
created: 2019-07-11
modified: 2025-11-04
broader: amanuenssi
in scheme: Metatietosanasto
preferred label: department secretary @en
preferred label: högskoleamanuens @sv

myyntisihteeri
type: Concept
source: Kansallinen RDA-termi
source: Nationell RDA-term @sv
created: 2019-07-11
modified: 2025-11-04
broader: sihteeri
in scheme: Metatietosanasto
preferred label: försäljningssekreterare @sv

myymäläpäällikkö
type: Concept
source: Kansallinen RDA-termi
source: Nationell RDA-term @sv
created: 2019-07-11
modified: 2025-11-04
broader: päällikkö
definition: Myymäläpäällikkö tai -hoitaja vastaa yksittäisen myymälän tai liikkeen toiminnasta ja tuloksesta sekä yrityksen liikeidean toteutumisesta (Lähde: Ammattinetti).
definition: En butikschef eller -föreståndare ansvarar för en viss butiks eller affärs verksamhet och resultat, samt för förverkligandet av företagets affärsidé. @sv
in scheme: Metatietosanasto
preferred label: butikschef @sv

arkistotutkija
type: Concept
source: Kansallinen RDA-termi
source: Nationell RDA-term @sv
created: 2019-07-11
modified: 2025-11-04
broader: tutkija
in scheme: Metatietosanasto
preferred label: arkivforskare @sv

verosihteeri
type: Concept
source: Kansallinen RDA-termi
source: Nationell RDA-term @sv
created: 2019-07-11
modified: 2025-11-04
broader: sihteeri
in scheme: Metatietosanasto
preferred label: skattesekreterare @sv

liikkeenharjoittaja
type: Concept
source: Kansallinen RDA-termi
source: Nationell RDA-term @sv
created: 2019-07-11
modified: 2025-11-04
alternative label: rörelseidkare @sv
broader: yrittäjä
in scheme: Metatietosanasto
preferred label: affärsidkare @sv

yliopiston lehtori
type: Concept
source: Kansallinen RDA-termi
source: Nationell RDA-term @sv
created: 2019-07-11
modified: 2025-11-04
alternative label: yliopistonlehtori
alternative label: yliopistonopettaja
alternative label: universitetslektor @sv
alternative label: universitetslärare @sv
broader: lehtori (opettaja)
in scheme: Metatietosanasto
preferred label: lektor vid universitet @sv

järjestötyöntekijä
type: Concept
source: Kansallinen RDA-termi
source: Nationell RDA-term @sv
created: 2019-07-11
modified: 2025-11-04
alternative label: föreningsarbetare @sv
broader: työntekijä
in scheme: Metatietosanasto
preferred label: organisationsarbetare @sv

markkinointisuunnittelija
type: Concept
source: Kansallinen RDA-termi
source: Nationell RDA-term @sv
created: 2019-07-11
modified: 2025-11-04
alternative label: marknadsplanerare @sv
broader: kuvanveistäjä
in scheme: Metatietosanasto
preferred label: marknadsföringsplanerare @sv

kuvaussihteeri
type: Concept
source: Kansallinen RDA-termi
source: Nationell RDA-term @sv
created: 2019-07-11
modified: 2025-11-04
broader: sihteeri
in scheme: Metatietosanasto
preferred label: skripta @sv

etnomusikologi
type: Concept
source: Kansallinen RDA-termi
source: Nationell RDA-term @sv
created: 2019-07-11
modified: 2025-11-04
alternative label: kansanmusiikin tutkija
broader: tutkija
in scheme: Metatietosanasto
preferred label: etnomusikolog @sv

tullivirkamies
type: Concept
source: Kansallinen RDA-termi
source: Nationell RDA-term @sv
created: 2019-07-11
modified: 2025-11-04
broader: virkamies
in scheme: Metatietosanasto
preferred label: tulltjänsteman @sv

matkanjohtaja
type: Concept
source: Kansallinen RDA-termi
source: Nationell RDA-term @sv
created: 2019-07-11
modified: 2025-11-04
alternative label: färdledare @sv
alternative label: turistledare @sv
broader: liikenneopettaja
in scheme: Metatietosanasto
preferred label: reseledare @sv

seurakunnan työntekijä
type: Concept
source: Kansallinen RDA-termi
source: Nationell RDA-term @sv
created: 2019-07-11
modified: 2025-11-04
alternative label: församlingsanställd @sv
broader: työntekijä
in scheme: Metatietosanasto
preferred label: församlingsarbetare @sv

vesiliikennetyöntekijä
type: Concept
source: Kansallinen RDA-termi
source: Nationell RDA-term @sv
created: 2019-07-11
modified: 2025-11-04
broader: työntekijä
in scheme: Metatietosanasto
preferred label: sjötrafikarbetare @sv

koneasiamies
type: Concept
source: Kansallinen RDA-termi
source: Nationell RDA-term @sv
created: 2019-07-11
modified: 2025-11-04
alternative label: maskinombud @sv
broader: asiamies
in scheme: Metatietosanasto
preferred label: maskinagent @sv

asiakasneuvoja
type: Concept
source: Kansallinen RDA-termi
source: Nationell RDA-term @sv
created: 2019-07-12
modified: 2025-11-04
broader: neuvoja
in scheme: Metatietosanasto
preferred label: kundrådgivare @sv

vakuutusasiamies
type: Concept
source: Kansallinen RDA-termi
source: Nationell RDA-term @sv
created: 2019-07-11
modified: 2025-11-04
alternative label: försäkringsagent @sv
broader: asiamies
in scheme: Metatietosanasto
preferred label: försäkringsombud @sv

matkailuvirkailija
type: Concept
source: Kansallinen RDA-termi
source: Nationell RDA-term @sv
created: 2019-07-11
modified: 2025-11-04
broader: virkailija
in scheme: Metatietosanasto
preferred label: turisttjänsteman @sv

tuotantopäällikkö
type: Concept
source: Kansallinen RDA-termi
source: Nationell RDA-term @sv
created: 2019-07-11
modified: 2025-11-04
alternative label: tillverkningschef @sv
broader: päällikkö
in scheme: Metatietosanasto
preferred label: produktionschef @sv

vanhustenhoitaja
type: Concept
source: Kansallinen RDA-termi
source: Nationell RDA-term @sv
created: 2019-07-11
modified: 2025-11-04
alternative label: åldringsvårdare @sv
broader: avustaja
in scheme: Metatietosanasto
preferred label: äldrevårdare @sv

lääketieteen tutkija
type: Concept
source: Kansallinen RDA-termi
source: Nationell RDA-term @sv
created: 2019-07-11
modified: 2025-11-04
alternative label: lääketieteentutkija
alternative label: medicinsk forskare @sv
broader: tutkija
in scheme: Metatietosanasto
preferred label: forskare i medicin @sv

kunnanasiamies-veroasiamies
type: Concept
source: Kansallinen RDA-termi
source: Nationell RDA-term @sv
created: 2019-07-11
modified: 2025-11-04
broader: asiamies
in scheme: Metatietosanasto
preferred label: kommunalombud-skatteombud @sv

metsäasiamies
type: Concept
source: Kansallinen RDA-termi
source: Nationell RDA-term @sv
created: 2019-07-11
modified: 2025-11-04
broader: asiamies
in scheme: Metatietosanasto
preferred label: skogsombud @sv

terveydenhuollon työntekijä
type: Concept
source: Kansallinen RDA-termi
source: Nationell RDA-term @sv
created: 2019-07-11
modified: 2025-11-04
broader: työntekijä
in scheme: Metatietosanasto
preferred label: hälsovårdsarbetare @sv

kunnanhallituksen puheenjohtaja
type: Concept
source: Kansallinen RDA-termi
source: Nationell RDA-term @sv
created: 2019-07-11
modified: 2025-11-04
alternative label: kommunfullmäktigeordförande @sv
alternative label: ordförande för kommunfullmäktige @sv
broader: puheenjohtaja
in scheme: Metatietosanasto
preferred label: kommunfullmäktiges ordförande @sv

kotitalousteknikko
type: Concept
source: Kansallinen RDA-termi
source: Nationell RDA-term @sv
created: 2019-07-11
modified: 2025-11-04
alternative label: hemhushållstekniker @sv
broader: teknikko
in scheme: Metatietosanasto
preferred label: hushållstekniker @sv

osastopäällikkö
type: Concept
source: Kansallinen RDA-termi
source: Nationell RDA-term @sv
created: 2019-07-11
modified: 2025-11-04
broader: päällikkö
in scheme: Metatietosanasto
preferred label: avdelningschef @sv

valimotyöntekijä
type: Concept
source: Kansallinen RDA-termi
source: Nationell RDA-term @sv
created: 2019-07-11
modified: 2025-11-04
broader: työntekijä
in scheme: Metatietosanasto
preferred label: gjuteriarbetare @sv

matkailusihteeri
type: Concept
source: Kansallinen RDA-termi
source: Nationell RDA-term @sv
created: 2019-07-11
modified: 2025-11-04
alternative label: turismsekreterare @sv
broader: sihteeri
in scheme: Metatietosanasto
preferred label: turistsekreterare @sv

tiedotusneuvoja
type: Concept
source: Kansallinen RDA-termi
source: Nationell RDA-term @sv
created: 2019-07-12
modified: 2025-11-04
alternative label: kommunikationsrådgivare @sv
broader: neuvoja
in scheme: Metatietosanasto
preferred label: informationsrådgivare @sv

museovartija
type: Concept
source: Kansallinen RDA-termi
source: Nationell RDA-term @sv
created: 2019-07-11
modified: 2025-11-04
broader: vartija
in scheme: Metatietosanasto
preferred label: museivakt @sv

atk-asiantuntija
type: Concept
source: Kansallinen RDA-termi
source: Nationell RDA-term @sv
created: 2019-07-11
modified: 2025-11-04
alternative label: adb-specialist @sv
broader: asiantuntija
in scheme: Metatietosanasto
preferred label: adb-expert @sv

vakuutusvirkailija
type: Concept
source: Kansallinen RDA-termi
source: Nationell RDA-term @sv
created: 2019-07-11
modified: 2025-11-04
alternative label: etuuskäsittelijä (vakuutus)
alternative label: korvausneuvoja
broader: virkailija
in scheme: Metatietosanasto
preferred label: försäkringstjänsteman @sv

vaihetyöntekijä
type: Concept
source: Kansallinen RDA-termi
source: Nationell RDA-term @sv
created: 2019-07-11
modified: 2025-11-04
broader: työntekijä
in scheme: Metatietosanasto
preferred label: tempoarbetare @sv

piiripäällikkö
type: Concept
source: Kansallinen RDA-termi
source: Nationell RDA-term @sv
created: 2019-07-11
modified: 2025-11-04
alternative label: kretschef @sv
broader: päällikkö
in scheme: Metatietosanasto
preferred label: distriktschef @sv

tuotekehittäjä
type: Concept
source: Kansallinen RDA-termi
source: Nationell RDA-term @sv
created: 2019-07-11
modified: 2025-11-04
broader: työntekijä
in scheme: Metatietosanasto
preferred label: produktutvecklare @sv

maa- ja metsätaloustieteilijä
type: Concept
source: Kansallinen RDA-termi
source: Nationell RDA-term @sv
created: 2019-07-11
modified: 2025-11-04
alternative label: maa- ja metsätalousttieteentutkija
broader: tutkija
in scheme: Metatietosanasto
preferred label: jord- och skogsbruksforskare @sv

metsätalousneuvoja
type: Concept
source: Kansallinen RDA-termi
source: Nationell RDA-term @sv
created: 2019-07-12
modified: 2025-11-04
alternative label: skogsinstruktör @sv
alternative label: skogsvårdsrådgivare @sv
broader: neuvoja
in scheme: Metatietosanasto
preferred label: skogsvårdskonsulent @sv

televirkailija
type: Concept
source: Kansallinen RDA-termi
source: Nationell RDA-term @sv
created: 2019-07-11
modified: 2025-11-04
broader: virkailija
in scheme: Metatietosanasto
preferred label: teletjänsteman @sv

leipomotyöntekijä
type: Concept
source: Kansallinen RDA-termi
source: Nationell RDA-term @sv
created: 2019-07-12
modified: 2025-11-04
broader: työntekijä
in scheme: Metatietosanasto
preferred label: bageriarbetare @sv

liikennepäällikkö
type: Concept
source: Kansallinen RDA-termi
source: Nationell RDA-term @sv
created: 2019-07-12
modified: 2025-11-04
broader: päällikkö
definition: Liikennepäällikkö vastaa liikenteen sujuvuudesta tietyssä paikassa (esimerkiksi satamassa).
definition: En trafikchef ansvarar för att trafiken löper på en viss plats, t.ex. i en hamn. @sv
in scheme: Metatietosanasto
preferred label: trafikchef @sv

teollisuusyrittäjä
type: Concept
source: Kansallinen RDA-termi
source: Nationell RDA-term @sv
created: 2019-07-12
modified: 2025-11-04
broader: yrittäjä
in scheme: Metatietosanasto
preferred label: industriföretagare @sv

uittotyöntekijä
type: Concept
source: Kansallinen RDA-termi
source: Nationell RDA-term @sv
created: 2019-07-12
modified: 2025-11-04
alternative label: tukkijätkä
alternative label: uittomies
alternative label: flottare @sv
broader: työntekijä
in scheme: Metatietosanasto
preferred label: flottningsarbetare @sv

elektroniikkatyöntekijä
type: Concept
source: Kansallinen RDA-termi
source: Nationell RDA-term @sv
created: 2019-07-12
modified: 2025-11-04
broader: työntekijä
in scheme: Metatietosanasto
preferred label: elektronikarbetare @sv

ratavartija
type: Concept
source: Kansallinen RDA-termi
source: Nationell RDA-term @sv
created: 2019-07-12
modified: 2025-11-04
alternative label: radanvartija
broader: vartija
definition: Ratavartijan tehtävänä oli hoitaa tiettyä tavallisesti noin viiden kilometrin pituista rataosuutta; hän huolehti siitä, että rata pysyi kunnossa, tasoristeysten laippaurat olivat puhtaat, naulat ja pultit kohdallaan ja muutenkin varmistaa rataosuuden toimivuus (Lähde: Wikipedia.)
definition: Banvaktens uppgift var att sköta en viss, vanligen ca fem kilometer lång sträcka av en järnväg. Han såg till att spåret och korsningarna var i skick och överlag att bandelen fungerade. @sv
in scheme: Metatietosanasto
preferred label: banvakt @sv

tietyöntekijä
type: Concept
source: Kansallinen RDA-termi
source: Nationell RDA-term @sv
created: 2019-07-12
modified: 2025-11-04
broader: työntekijä
in scheme: Metatietosanasto
preferred label: vägarbetare @sv

kalustetyöntekijä
type: Concept
source: Kansallinen RDA-termi
source: Nationell RDA-term @sv
created: 2019-07-12
modified: 2025-11-04
broader: työntekijä
in scheme: Metatietosanasto
preferred label: möbelarbetare @sv

kaupunginhallituksen puheenjohtaja
type: Concept
source: Kansallinen RDA-termi
source: Nationell RDA-term @sv
created: 2019-07-12
modified: 2025-11-04
alternative label: ordförande för stadsfullmäktige @sv
alternative label: stadsfullmäktigeordförande @sv
broader: puheenjohtaja
in scheme: Metatietosanasto
preferred label: stadsfullmäktiges ordförande @sv

kirjastoamanuenssi
type: Concept
source: Kansallinen RDA-termi
source: Nationell RDA-term @sv
created: 2019-07-12
modified: 2025-11-04
broader: amanuenssi
in scheme: Metatietosanasto
preferred label: assistant librarian @en
preferred label: biblioteksamanuens @sv

esittelysihteeri
type: Concept
source: Kansallinen RDA-termi
source: Nationell RDA-term @sv
created: 2019-07-12
modified: 2025-11-04
broader: sihteeri
in scheme: Metatietosanasto
preferred label: föredragningssekreterare @sv

museoamanuenssi
type: Concept
source: Kansallinen RDA-termi
source: Nationell RDA-term @sv
created: 2019-07-12
modified: 2025-11-04
broader: amanuenssi
in scheme: Metatietosanasto
preferred label: amanuensis @en
preferred label: museiamanuens @sv

koulutuspäällikkö
type: Concept
source: Kansallinen RDA-termi
source: Nationell RDA-term @sv
created: 2019-07-12
modified: 2025-11-04
alternative label: skolningschef @sv
broader: päällikkö
in scheme: Metatietosanasto
preferred label: utbildningschef @sv

markkinointipäällikkö
type: Concept
source: Kansallinen RDA-termi
source: Nationell RDA-term @sv
created: 2019-07-12
modified: 2025-11-04
alternative label: marknadschef @sv
broader: päällikkö
in scheme: Metatietosanasto
preferred label: marknadsföringschef @sv

jalkinetyöntekijä
type: Concept
source: Kansallinen RDA-termi
source: Nationell RDA-term @sv
created: 2019-07-12
modified: 2025-11-04
broader: työntekijä
in scheme: Metatietosanasto
preferred label: skoarbetare @sv

julkaisusihteeri
type: Concept
source: Kansallinen RDA-termi
source: Nationell RDA-term @sv
created: 2019-07-12
modified: 2025-11-04
broader: sihteeri
in scheme: Metatietosanasto
preferred label: publikationssekreterare @sv

museo-opas
type: Concept
source: Kansallinen RDA-termi
source: Nationell RDA-term @sv
created: 2019-07-12
modified: 2025-11-04
broader: opas
in scheme: Metatietosanasto
preferred label: museiguide @sv

tekstiilityöntekijä
type: Concept
source: Kansallinen RDA-termi
source: Nationell RDA-term @sv
created: 2019-07-12
modified: 2025-11-04
broader: työntekijä
in scheme: Metatietosanasto
preferred label: textilarbetare @sv

mediatyöntekijä
type: Concept
source: Kansallinen RDA-termi
source: Nationell RDA-term @sv
created: 2019-07-12
modified: 2025-11-04
alternative label: radiotyöntekijä
alternative label: televisiotyöntekijä
alternative label: mediaarbetare @sv
alternative label: radioarbetare @sv
alternative label: tv-arbetare @sv
broader: työntekijä
in scheme: Metatietosanasto
preferred label: mediearbetare @sv

kuljetuspäällikkö
type: Concept
source: Kansallinen RDA-termi
source: Nationell RDA-term @sv
created: 2019-07-12
modified: 2025-11-04
broader: päällikkö
definition: Kuljetuspäällikkö on logistiikan insinööri, joka on vastuussa tavaran kuljetuksen ja varastoinnin logistiikan hoitumisesta.
definition: En transportchef är en ingenjör i logistik som ansvarar för att logistiken vid godstransport och -lagring löper. @sv
in scheme: Metatietosanasto
preferred label: transportchef @sv

museotyöntekijä
type: Concept
source: Kansallinen RDA-termi
source: Nationell RDA-term @sv
created: 2019-07-12
modified: 2025-11-04
alternative label: museianställd @sv
broader: työntekijä
in scheme: Metatietosanasto
preferred label: museiarbetare @sv

mainossuunnittelija
type: Concept
source: Kansallinen RDA-termi
source: Nationell RDA-term @sv
created: 2019-07-12
modified: 2025-11-04
alternative label: reklamplanerare @sv
broader: suunnittelija
in scheme: Metatietosanasto
preferred label: reklamdesigner @sv

rahtityöntekijä
type: Concept
source: Kansallinen RDA-termi
source: Nationell RDA-term @sv
created: 2019-07-12
modified: 2025-11-04
broader: työntekijä
in scheme: Metatietosanasto
preferred label: fraktarbetare @sv

henkilöstöpäällikkö
type: Concept
source: Kansallinen RDA-termi
source: Nationell RDA-term @sv
created: 2019-07-12
modified: 2025-11-04
broader: päällikkö
in scheme: Metatietosanasto
preferred label: personalchef @sv

asematyöntekijä
type: Concept
source: Kansallinen RDA-termi
source: Nationell RDA-term @sv
created: 2019-07-12
modified: 2025-11-04
alternative label: stationsanställd @sv
broader: työntekijä
in scheme: Metatietosanasto
preferred label: stationsarbetare @sv

lasityöntekijä
type: Concept
source: Kansallinen RDA-termi
source: Nationell RDA-term @sv
created: 2019-07-12
modified: 2025-11-04
broader: työntekijä
in scheme: Metatietosanasto
preferred label: glasarbetare @sv

laboratoriotyöntekijä
type: Concept
source: Kansallinen RDA-termi
source: Nationell RDA-term @sv
created: 2019-07-12
modified: 2025-11-04
alternative label: laboratorieanställd @sv
broader: työntekijä
in scheme: Metatietosanasto
preferred label: laboratoriearbetare @sv

aluepäällikkö
type: Concept
source: Kansallinen RDA-termi
source: Nationell RDA-term @sv
created: 2019-07-12
modified: 2025-11-04
alternative label: platschef @sv
broader: päällikkö
in scheme: Metatietosanasto
preferred label: regionchef @sv

majakkapäällikkö
type: Concept
source: Kansallinen RDA-termi
source: Nationell RDA-term @sv
created: 2019-07-12
modified: 2025-11-04
broader: päällikkö
in scheme: Metatietosanasto
preferred label: fyrmästare @sv

konttoripäällikkö
type: Concept
source: Kansallinen RDA-termi
source: Nationell RDA-term @sv
created: 2019-07-12
modified: 2025-11-04
broader: päällikkö
in scheme: Metatietosanasto
preferred label: kontorschef @sv

panimotyöntekijä
type: Concept
source: Kansallinen RDA-termi
source: Nationell RDA-term @sv
created: 2019-07-12
modified: 2025-11-04
alternative label: bryggerianställd @sv
broader: työntekijä
in scheme: Metatietosanasto
preferred label: bryggeriarbetare @sv

puutyöntekijä
type: Concept
source: Kansallinen RDA-termi
source: Nationell RDA-term @sv
created: 2019-07-12
modified: 2025-11-04
broader: työntekijä
in scheme: Metatietosanasto
preferred label: träarbetare @sv

arkistotyöntekijä
type: Concept
source: Kansallinen RDA-termi
source: Nationell RDA-term @sv
created: 2019-07-12
modified: 2025-11-04
alternative label: arkivanställd @sv
broader: työntekijä
in scheme: Metatietosanasto
preferred label: arkivarbetare @sv

puistotyöntekijä
type: Concept
source: Kansallinen RDA-termi
source: Nationell RDA-term @sv
created: 2019-07-12
modified: 2025-11-04
broader: työntekijä
in scheme: Metatietosanasto
preferred label: parkarbetare @sv

pesulatyöntekijä
type: Concept
source: Kansallinen RDA-termi
source: Nationell RDA-term @sv
created: 2019-07-12
modified: 2025-11-04
alternative label: tvätterianställd @sv
alternative label: tvätteripersonal @sv
broader: työntekijä
in scheme: Metatietosanasto
preferred label: tvätteriarbetare @sv

arkistosihteeri
type: Concept
source: Kansallinen RDA-termi
source: Nationell RDA-term @sv
created: 2019-07-12
modified: 2025-11-04
broader: sihteeri
in scheme: Metatietosanasto
preferred label: arkivsekreterare @sv

nahkatyöntekijä
type: Concept
source: Kansallinen RDA-termi
source: Nationell RDA-term @sv
created: 2019-07-12
modified: 2025-11-04
broader: työntekijä
in scheme: Metatietosanasto
preferred label: läderarbetare @sv

erikoistutkija
type: Concept
source: Kansallinen RDA-termi
source: Nationell RDA-term @sv
created: 2019-07-12
modified: 2025-11-04
broader: tutkija
in scheme: Metatietosanasto
preferred label: specialforskare @sv

esittäjä
type: Concept
source: Kansallinen RDA-termi
source: Nationell RDA-term @sv
created: 2019-09-18
modified: 2026-01-03
broader: aineistoon liittyvä henkilö
definition: Nuottiaineistoon liittyvä esittäjä.
definition: Framförare relaterad till notmaterial. @sv
in scheme: Metatietosanasto
preferred label: performer @en
preferred label: framförare @sv

sukututkija
type: Concept
source: Kansallinen RDA-termi
source: Nationell RDA-term @sv
created: 2019-10-29
modified: 2025-01-08
broader: yhdistymään osallinen henkilö
definition: Henkilö, joka osallistuu ekspression tekemiseen lisäämällä julkaisuun sukututkimuksen aineistoa.
definition: Person som deltar i utförandet av ett uttryck genom att tillföra en publikation släktforskarmaterial. @sv
in scheme: Metatietosanasto
preferred label: genealogist @en
preferred label: släktforskare @sv

harrastajarunoilija
type: Concept
source: Kansallinen RDA-termi
source: YSO-termi
source: ALLFO-term @sv
source: Nationell RDA-term @sv
created: 2020-01-24
modified: 2024-08-27
alternative label: harrastajarunoilijat
alternative label: harrasterunoilija
alternative label: harrasterunoilijat
alternative label: amatörlyriker @sv
alternative label: amatörpoet @sv
broader: runoilija
in scheme: Metatietosanasto
preferred label: amateur poet @en
preferred label: amatördiktare @sv

tuubansoittaja
type: Concept
source: Kansallinen RDA-termi
source: YSO-termi
source: ALLFO-term @sv
source: Nationell RDA-term @sv
created: 2020-01-24
modified: 2024-08-27
alternative label: tuubansoittajat
alternative label: tuubisti
alternative label: tubaspelare @sv
broader: soittaja
in scheme: Metatietosanasto
preferred label: tubaist @sv

virsirunoilija
type: Concept
source: Kansallinen RDA-termi
source: Nationell RDA-term @sv
created: 2020-01-24
modified: 2025-11-04
alternative label: virsirunoilijat
broader: runoilija
in scheme: Metatietosanasto
preferred label: psalmdiktare @sv

mandoliininsoittaja
type: Concept
source: Kansallinen RDA-termi
source: YSO-termi
source: ALLFO-term @sv
source: Nationell RDA-term @sv
created: 2020-01-24
modified: 2024-08-27
alternative label: mandoliininsoittajat
alternative label: mandoliinisti
alternative label: mandolinisti
alternative label: mandolinist @sv
broader: soittaja
in scheme: Metatietosanasto
preferred label: mandolinspelare @sv

pasunisti
type: Concept
source: Kansallinen RDA-termi
source: YSO-termi
source: ALLFO-term @sv
source: Nationell RDA-term @sv
created: 2020-01-24
modified: 2024-08-27
alternative label: pasunistit
alternative label: pasuunansoittaja
broader: soittaja
in scheme: Metatietosanasto
preferred label: basunist @sv

huuliharpunsoittaja
type: Concept
source: Kansallinen RDA-termi
source: Nationell RDA-term @sv
created: 2020-01-24
modified: 2025-11-04
alternative label: harpisti (huuliharpunsoittaja)
alternative label: huuliharpunsoittajat
broader: soittaja
in scheme: Metatietosanasto
preferred label: munspelare @sv

banjonsoittaja
type: Concept
source: Kansallinen RDA-termi
source: YSO-termi
source: ALLFO-term @sv
source: Nationell RDA-term @sv
created: 2020-01-24
modified: 2024-08-27
alternative label: banjonsoittajat
alternative label: banjoist @sv
broader: soittaja
in scheme: Metatietosanasto
preferred label: banjospelare @sv

oppikirjailija
type: Concept
source: Kansallinen RDA-termi
source: Nationell RDA-term @sv
created: 2020-01-24
modified: 2025-11-04
alternative label: oppikirjailijat
broader: kirjailija
in scheme: Metatietosanasto
preferred label: läroboksförfattare @sv

harpunsoittaja
type: Concept
source: Kansallinen RDA-termi
source: YSO-termi
source: ALLFO-term @sv
source: Nationell RDA-term @sv
created: 2020-01-24
modified: 2024-08-27
alternative label: harpisti (harpunsoittaja)
alternative label: harpunsoittajat
alternative label: harpister @sv
alternative label: harpospelare @sv
alternative label: harpspelare @sv
broader: soittaja
in scheme: Metatietosanasto
preferred label: harpist @sv

käyrätorvensoittaja
type: Concept
source: Kansallinen RDA-termi
source: YSO-termi
source: ALLFO-term @sv
source: Nationell RDA-term @sv
created: 2020-01-24
modified: 2024-08-27
alternative label: cornisti
alternative label: käyrätorvensoittajat
alternative label: valthornspelare @sv
broader: soittaja
in scheme: Metatietosanasto
preferred label: valthornist @sv

lehtitoimittaja
type: Concept
source: Kansallinen RDA-termi
source: YSO-termi
source: ALLFO-term @sv
source: Nationell RDA-term @sv
created: 2020-01-24
modified: 2024-08-27
alternative label: aikakauslehtitoimittaja
alternative label: lehtitoimittajat
alternative label: sanomalehtitoimittaja
alternative label: tidningsredaktör @sv
alternative label: tidningsreporter @sv
alternative label: tidskriftsjournalist @sv
broader: toimittaja
in scheme: Metatietosanasto
preferred label: tidningsjournalist @sv

oboisti
type: Concept
source: Kansallinen RDA-termi
source: YSO-termi
source: ALLFO-term @sv
source: Nationell RDA-term @sv
created: 2020-01-24
modified: 2024-08-27
alternative label: oboensoittaja
alternative label: oboistit
alternative label: oboespelare @sv
broader: soittaja
in scheme: Metatietosanasto
preferred label: oboist @sv

musiikkituottaja
type: Concept
source: Kansallinen RDA-termi
source: YSO-termi
source: ALLFO-term @sv
source: Nationell RDA-term @sv
created: 2020-01-24
modified: 2024-08-27
alternative label: musiikkituottajat
broader: tuottaja
in scheme: Metatietosanasto
preferred label: music producer @en
preferred label: musikproducent @sv

puhallinsoittaja
type: Concept
source: Kansallinen RDA-termi
source: YSO-termi
source: ALLFO-term @sv
source: Nationell RDA-term @sv
created: 2020-01-24
modified: 2024-08-27
alternative label: puhallinsoittajat
alternative label: blåsare @sv
broader: soittaja
in scheme: Metatietosanasto
preferred label: blåsinstrumentalist @sv

AMK-opinnäytetyö
type: Concept
source: Kansallinen RDA-termi
source: Nationell RDA-term @sv
created: 2016-01-08
modified: 2024-05-24
in scheme: Metatietosanasto
narrower: ylempi AMK-opinnäytetyö
preferred label: YH-examensarbete @sv

kirjallisuuskriitikko
type: Concept
source: Kansallinen RDA-termi
source: Nationell RDA-term @sv
created: 2020-01-28
modified: 2025-08-21
alternative label: kirjallisuusarvostelija
broader: kriitikko
in scheme: Metatietosanasto
preferred label: litteraturkritiker @sv

taidekriitikko
type: Concept
source: Kansallinen RDA-termi
source: Nationell RDA-term @sv
created: 2020-01-28
modified: 2025-08-21
alternative label: taidearvostelija
alternative label: konstrecensent @sv
broader: kriitikko
in scheme: Metatietosanasto
preferred label: art critic @en
preferred label: konstkritiker @sv

musiikkikriitikko
type: Concept
source: Kansallinen RDA-termi
source: Nationell RDA-term @sv
created: 2020-01-28
modified: 2025-08-21
alternative label: musiikkiarvostelija
alternative label: musikrecensent @sv
broader: kriitikko
in scheme: Metatietosanasto
preferred label: music critic @en
preferred label: musikkritiker @sv

elokuvakriitikko
type: Concept
source: Kansallinen RDA-termi
source: Nationell RDA-term @sv
created: 2020-01-28
modified: 2025-08-21
alternative label: elokuva-arvostelija
alternative label: filmrecensent @sv
broader: kriitikko
in scheme: Metatietosanasto
preferred label: film critic @en
preferred label: filmkritiker @sv

rap-artisti
type: Concept
source: Kansallinen RDA-termi
source: YSO-termi
source: ALLFO-term @sv
source: Nationell RDA-term @sv
created: 2020-01-28
modified: 2024-08-27
alternative label: MCs @en
alternative label: rapper @en
alternative label: MC
alternative label: rap-artistit
alternative label: räppääjät
alternative label: rappare @sv
broader: muusikko
in scheme: Metatietosanasto
preferred label: rap artist @en

luontovalokuvaaja
type: Concept
source: Kansallinen RDA-termi
source: Nationell RDA-term @sv
created: 2020-02-15
modified: 2024-08-27
broader: valokuvaaja
in scheme: Metatietosanasto
preferred label: naturfotograf @sv

seurakuntapastori
type: Concept
source: Kansallinen RDA-termi
source: YSO-termi
source: ALLFO-term @sv
source: Nationell RDA-term @sv
created: 2020-02-15
modified: 2024-08-27
broader: pappi
in scheme: Metatietosanasto
preferred label: församlingspastor @sv

sotilaskapellimestari
type: Concept
source: Kansallinen RDA-termi
source: YSO-termi
source: ALLFO-term @sv
source: Nationell RDA-term @sv
created: 2020-02-15
modified: 2024-08-27
alternative label: sotilaskapellimestari (ammatti)
alternative label: militärkapellmästare (yrke) @sv
broader: kapellimestari
in scheme: Metatietosanasto
preferred label: militärkapellmästare @sv

liikenainen
type: Concept
source: Kansallinen RDA-termi
source: Nationell RDA-term @sv
created: 2020-02-15
modified: 2025-11-04
broader: yrittäjä
in scheme: Metatietosanasto
preferred label: affärskvinna @sv

liikemies
type: Concept
source: Kansallinen RDA-termi
source: YSO-termi
source: ALLFO-term @sv
source: Nationell RDA-term @sv
created: 2020-02-15
modified: 2024-08-27
broader: yrittäjä
in scheme: Metatietosanasto
preferred label: affärsman @sv

erikoissairaanhoitaja
type: Concept
source: Kansallinen RDA-termi
source: YSO-termi
source: ALLFO-term @sv
source: Nationell RDA-term @sv
created: 2020-02-15
modified: 2024-08-27
alternative label: erikoissairaanhoitajat
alternative label: specialsjuksköterska @sv
broader: sairaanhoitaja
in scheme: Metatietosanasto
preferred label: specialsjukskötare @sv

kehittämispäällikkö
type: Concept
source: Kansallinen RDA-termi
source: Nationell RDA-term @sv
created: 2020-02-15
modified: 2025-11-04
broader: päällikkö
in scheme: Metatietosanasto
preferred label: utvecklingschef @sv

steel-kitaristi
type: Concept
source: Kansallinen RDA-termi
source: YSO-termi
source: ALLFO-term @sv
source: Nationell RDA-term @sv
created: 2020-02-15
modified: 2024-08-27
alternative label: steel-gitarrist @sv
broader: soittaja
in scheme: Metatietosanasto
preferred label: steelgitarrist @sv

isäntäorganisaatio
type: Concept
source: RDA-termi
source: RDA-term @sv
created: 2016-01-08
modified: 2025-07-01
alternative label: host institution @en
broader: teokseen liittyvä yhteisö
definition: Yhteisö, joka isännöi teokselle alun antavan konferenssin, näyttelyn tai muun tapahtuman, mutta jolla on vähän tai ei lainkaan vastuuta teoksen sisällöstä (RDA Registry)
definition: Institution som agerar värd för en konferens, en utställning eller något annat evenemang som ger upphov till ett verk, men som har litet eller inget alls ansvar för innehållet i verket. @sv
in scheme: Metatietosanasto
preferred label: hosting institution @en
preferred label: värdorganisation @sv

tehtävien tekijä
type: Concept
source: Kansallinen RDA-termi
source: Nationell RDA-term @sv
created: 2020-04-04
modified: 2025-01-08
broader: yhdistymään osallinen henkilö
definition: Henkilö, joka osallistuu ekspression tekemiseen lisäämällä siihen tehtäviä.
definition: Person som deltar i utförandet av ett uttryck genom att tillfoga uppgifter. @sv
in scheme: Metatietosanasto
preferred label: skapare av uppgifter @sv

yhteenveto
type: Concept
source: RDA-termi
source: RDA-term @sv
created: 2020-04-17
modified: 2025-11-18
alternative label: yhteenveto (ekspressio)
alternative label: sammandrag @sv
alternative label: sammanfattning (uttryck) @sv
broader: johdannaisteoksen versio
definition: Teoksen ekspressio, joka koostuu toisen teoksen ekspression sisällön lyhyestä koosteesta. (RDA Registry)
definition: Uttryck av verk, som består av en kort sammanfattning av innehållet i ett annat verks uttryck. @sv
in scheme: Metatietosanasto
preferred label: summarized as expression @en
preferred label: sammanfattning @sv

vastaava kappale
type: Concept
source: RDA-termi
source: RDA-term @sv
created: 2020-04-17
modified: 2025-11-18
alternative label: equivalent item relationship @en
alternative label: vastaavan kappaleen suhde
broader: kappaleeseen liittyvä kappale
definition: Kappale, joka edustaa teoksen saman ekspression manifestaatiota. (RDA Registry)
definition: Exemplar som representerar en manifestation av samma uttryck av ett verk. @sv
in scheme: Metatietosanasto
preferred label: equivalent item @en
preferred label: motsvarande exemplar @sv

peilisivusto
type: Concept
source: RDA-termi
source: RDA-term @sv
created: 2020-04-17
modified: 2025-08-16
alternative label: spegelsajt @sv
broader: samansisältöinen aineisto
definition: Manifestaatio, joka on verkkosivuston tarkka kopio ja jota käytetään parantamaan alkuperäisen sivuston saavutettavuutta vähentämällä verkkoliikenteen kuormitusta. (RDA Registry)
definition: Manifestation som är en precis kopia av en webbplats och som används för att förbättra tillgängligheten till en ursprunglig sida, genom att minska nättrafikens belastning. @sv
in scheme: Metatietosanasto
preferred label: mirror site @en
preferred label: spegelsida @sv

yhteensidottu
type: Concept
source: RDA-termi
source: RDA-term @sv
created: 2020-04-17
modified: 2025-08-27
broader: saman kokoelman kappale
definition: Kappale, joka on fyysisesti sidottu yhteen toisen samassa kokoelmassa olevan kappaleen kanssa. (RDA Registry)
definition: Exemplar som fysiskt är sammanbundet med ett annat exemplar som finns i samma samling. @sv
in scheme: Metatietosanasto
preferred label: bound with @en
preferred label: sammanbunden @sv

mikrofilmillä myös
type: Concept
source: RDA-termi
source: RDA-term @sv
created: 2020-04-17
modified: 2025-08-14
alternative label: mikrofilmillä myös (kappale)
alternative label: på mikrofilmen även (exemplar) @sv
broader: saman kokoelman kappale
definition: Kappale, joka on samalla mikromuotoisella tallenteella toisen kappale kanssa. (RDA Registry)
definition: Exemplar som finns på samma mikroformsbärare tillsammans med ett annat exemplar. @sv
in scheme: Metatietosanasto
preferred label: filmed with item @en
preferred label: på mikrofilmen även @sv

levyllä myös
type: Concept
source: RDA-termi
source: RDA-term @sv
created: 2020-04-17
modified: 2025-07-04
alternative label: levyllä myös (kappale)
alternative label: på skivan även (exemplar) @sv
broader: saman kokoelman kappale
definition: Kappale, joka on samalla levyllä toisen kappale kanssa. (RDA Registry)
definition: Exemplar som finns på samma skiva som ett annat exemplar. @sv
in scheme: Metatietosanasto
preferred label: on disc with item @en
preferred label: på skivan även @sv

levyllä myös
type: Concept
source: RDA-termi
source: RDA-term @sv
created: 2020-04-17
modified: 2025-07-04
alternative label: levyllä myös (manifestaatio)
alternative label: på skivan även (manifestation) @sv
broader: tallenteella myös
definition: Manifestaatio, joka on julkaistu samalla levyllä kuin kuvailun kohteena oleva manifestaatio. (RDA Registry)
definition: Manifestation som finns publicerad på samma skiva som en beskriven manifestation. @sv
in scheme: Metatietosanasto
preferred label: on disc with manifestation @en
preferred label: på skivan även @sv

filmillä myös
type: Concept
source: RDA-termi
source: RDA-term @sv
created: 2020-04-17
modified: 2025-06-11
alternative label: filmillä myös (manifestaatio)
alternative label: filmad med @sv
alternative label: på filmen även (manifestation) @sv
broader: tallenteella myös
definition: Manifestaatio, joka on kuvattu samalle filmille kuin kuvailun kohteena oleva manifestaatio. (RDA Registry)
definition: Manifestation som har filmats på samma film som den manifestation som är föremål för beskrivning. @sv
in scheme: Metatietosanasto
preferred label: filmed with manifestation @en
preferred label: på filmen även @sv

opiskelija
type: Concept
source: RDA-termi
source: RDA-term @sv
created: 2020-04-17
modified: 2025-08-15
broader: yhteisöön liittyvä henkilö
definition: Henkilö, joka saa opetusta oppilaitoksessa. (RDA Registry)
definition: Person som får undervisning vid en läroinrättning. @sv
in scheme: Metatietosanasto
preferred label: enrolled student @en
preferred label: studerande @sv

assistentti
type: Concept
source: RDA-termi
source: RDA-term @sv
created: 2020-05-03
modified: 2025-04-16
broader: kollega
definition: Henkilö, joka on kollega, joka avustaa toista henkilöä. (RDA Registry)
definition: Person som är en kollega, som assisterar en annan person. @sv
in scheme: Metatietosanasto
preferred label: assistant @en
preferred label: assistent @sv

kumppani
type: Concept
source: RDA-termi
source: RDA-term @sv
created: 2020-05-03
modified: 2025-07-04
alternative label: kompanjon @sv
broader: kollega
definition: Henkilö, joka on kollega, joka toimii toisen henkilön kanssa yhteiseksi hyväksi, useimmiten yrityskumppanina. (RDA Registry)
definition: Person som är en kollega som verkar tillsammans med en annan person för gemensam nytta, vanligen som företagskompanjon. @sv
in scheme: Metatietosanasto
preferred label: partner @en

työtoveri
type: Concept
source: RDA-termi
source: RDA-term @sv
created: 2020-05-03
modified: 2025-08-23
alternative label: co-worker @en
alternative label: kollega @sv
broader: kollega
definition: Henkilö, joka on kollega, joka työskentelee tai jakaa tehtävän toisen henkilön kanssa. (RDA Registry)
definition: Person som är en kollega, som arbetar eller delar uppgift med en annan person. @sv
in scheme: Metatietosanasto
preferred label: coworker @en
preferred label: arbetskamrat @sv

oppilas
type: Concept
source: RDA-termi
source: RDA-term @sv
created: 2020-05-03
modified: 2025-08-15
alternative label: opiskelija
broader: henkilöön liittyvä henkilö
definition: Henkilö, joka saa opetusta toiselta henkilöltä. (RDA Registry)
definition: Person som får undervisning av en annan person. @sv
in scheme: Metatietosanasto
preferred label: student @en
preferred label: elev @sv

assistentti henkilölle
type: Concept
source: RDA-termi
source: RDA-term @sv
created: 2020-05-03
modified: 2025-04-16
alternative label: avustettu
alternative label: assistent till @sv
alternative label: assisterad @sv
broader: kollega
definition: Henkilö, joka on kollega, jota toinen henkilö avustaa. (RDA Registry)
definition: Person som är en kollega, som en annan person assisterar. @sv
in scheme: Metatietosanasto
preferred label: assistant to @en
preferred label: assistent till personen @sv

ystävä
type: Concept
source: RDA-termi
source: RDA-term @sv
created: 2020-05-04
modified: 2025-08-28
broader: henkilöön liittyvä henkilö
definition: Henkilö, jolla on molemminpuolinen kiintymys- tai kunnioitussuhde toiseen henkilöön. (RDA Registry)
definition: Person som har en ömsesidig vänskaplig anknytningsrelation med en annan person. @sv
in scheme: Metatietosanasto
preferred label: friend @en
preferred label: vän @sv

suvun kantahenkilö
type: Concept
source: RDA-termi
source: RDA-term @sv
created: 2020-05-04
modified: 2025-08-21
alternative label: progenitor @en
alternative label: kantaisä
alternative label: anfader @sv
alternative label: anmoder @sv
alternative label: stamfader @sv
alternative label: stammoder @sv
broader: suvun henkilöjäsen
definition: Henkilö, josta suku polveutuu. (RDA Registry)
definition: Person som en släkt härstammar från. @sv
in scheme: Metatietosanasto
preferred label: descendant family of person of @en
preferred label: släktens stamperson @sv

opiskelutoveri
type: Concept
source: RDA-termi
source: RDA-term @sv
created: 2020-05-04
modified: 2025-08-15
alternative label: medstuderande @sv
broader: henkilöön liittyvä henkilö
definition: Henkilö, joka on toisen opiskelijan kollega, joka myös virallisesti opiskelee. (RDA Registry)
definition: Person som är kollega till en annan studerande, som också officiellt studerar. @sv
in scheme: Metatietosanasto
preferred label: fellow student @en
preferred label: studiekamrat @sv

yhteisöä sponsoroiva henkilö
type: Concept
source: RDA-termi
source: RDA-term @sv
created: 2020-05-05
modified: 2025-08-27
alternative label: sponsor @en
alternative label: sponsori
broader: yhteisöön liittyvä henkilö
definition: Henkilö, joka rahoittaa tai tukee yhteisöä. (RDA Registry)
definition: Person som finansierar eller stöder en institution. @sv
in scheme: Metatietosanasto
preferred label: sponsoring person of corporate body @en
preferred label: person som sponsrar institution @sv

pääjohtaja
type: Concept
source: RDA-termi
source: RDA-term @sv
created: 2020-05-05
modified: 2025-08-16
broader: toimihenkilö
definition: Henkilö, joka on toimihenkilö, joka on yhteisön ylin viranhaltija. (RDA Registry)
definition: Person som är den högsta tjänsteinnehavaren i en institution. @sv
in scheme: Metatietosanasto
preferred label: chief executive @en
preferred label: generaldirektör @sv

loppututkinnon suorittanut
type: Concept
source: RDA-termi
source: RDA-term @sv
created: 2020-05-05
modified: 2025-07-05
broader: yhteisöön liittyvä henkilö
definition: Henkilö, jolle laitos tai tiedekunta on myöntänyt akateemisen loppututkinnon. (RDA Registry)
definition: Person som en institution eller en fakultet beviljat en akademisk slutexamen. @sv
in scheme: Metatietosanasto
preferred label: graduate @en
preferred label: slutexamen utförd av @sv

edunvalvoja
type: Concept
source: RDA-termi
source: RDA-term @sv
created: 2020-05-05
modified: 2025-05-27
broader: toimihenkilö
definition: Henkilö, joka on toimihenkilö, jolla on valtuudet tehdä päätöksiä yhteisön eduksi. (RDA Registry)
definition: Person som har befogenheter att fatta beslut för en institutions bästa. @sv
in scheme: Metatietosanasto
preferred label: trustee @en
preferred label: förvaltare @sv

henkilöstä polveutuva suku
type: Concept
source: RDA-termi
source: RDA-term @sv
created: 2020-05-06
modified: 2025-03-19
alternative label: descendants @en
alternative label: jälkeläiset
alternative label: avkomlingar @sv
alternative label: efterkommande @sv
broader: henkilöjäsen suvussa
definition: Suku, joka polveutuu tietystä henkilöstä. (RDA Registry)
definition: Släkt som härstammar från en viss person. @sv
in scheme: Metatietosanasto
preferred label: descendant family of person @en
preferred label: släkt härstammande från personen @sv

yhteisöä sponsoroiva suku
type: Concept
source: RDA-termi
source: RDA-term @sv
created: 2020-05-06
modified: 2025-08-27
alternative label: sponsoring family @en
alternative label: sponsoroiva suku
alternative label: sponsrande släkt @sv
broader: yhteisöön liittyvä suku
definition: Suku, joka sponsoroi yhteisöä. (RDA Registry)
definition: Släkt som sponsrar en institution. @sv
in scheme: Metatietosanasto
preferred label: sponsoring family of corporate body @en
preferred label: släkt som sponsrar institution @sv

suvusta polveutuva suku
type: Concept
source: RDA-termi
source: RDA-term @sv
created: 2020-05-06
modified: 2025-03-19
alternative label: descendant family @en
alternative label: polveutuva suku
alternative label: härstammande släkt @sv
broader: suvun sukuhaara
definition: Suku, joka polveutuu toisesta suvusta. (RDA Registry)
definition: Släkt som härstammar från en annan släkt. @sv
in scheme: Metatietosanasto
preferred label: descendant family of family @en
preferred label: släkt härstammande från släkten @sv

yhteisön perustanut suku
type: Concept
source: RDA-termi
source: RDA-term @sv
created: 2020-05-06
modified: 2025-08-27
alternative label: founding family @en
alternative label: perustajasuku
alternative label: grundande släkt @sv
broader: yhteisöön liittyvä suku
definition: Suku, joka perusti yhteisön. (RDA Registry)
definition: Släkt som grundat en instituion. @sv
in scheme: Metatietosanasto
preferred label: founding family of corporate body @en
preferred label: grundare (släkt) av institution @sv

jakautumisesta muodostunut yhteisö
type: Concept
source: RDA-termi
source: RDA-term @sv
created: 2020-05-07
modified: 2025-07-01
alternative label: jakautumisesta muodostunut
alternative label: bildats genom uppdelning @sv
broader: yhteisön seuraaja
definition: Yhteisö, joka on seuraus toisen yhteisön jakautumisesta. (RDA Registry)
definition: Institution som är en följd av uppdelningen av en annan institution. @sv
in scheme: Metatietosanasto
preferred label: product of split @en
preferred label: institution bildad genom uppdelning @sv

sulautunut yhteisöön
type: Concept
source: RDA-termi
source: RDA-term @sv
created: 2020-05-07
modified: 2025-08-21
broader: yhteisöön liittyvä yhteisö
definition: Yhteisö, johon toinen yhteisö on sulautunut. (RDA Registry)
definition: Institution i vilken en institution uppgått. @sv
in scheme: Metatietosanasto
preferred label: absorbing corporate body @en
preferred label: uppgått i institutionen @sv

alayhteisö
type: Concept
source: RDA-termi
source: RDA-term @sv
created: 2020-05-07
modified: 2025-04-15
broader: yhteisöön liittyvä yhteisö
definition: Yhteisö, joka on hierarkkisesti toisen yhteisön alainen. (RDA Registry)
definition: Institution som är hierarkiskt underordnad en annan institution. @sv
in scheme: Metatietosanasto
preferred label: hierarchical subordinate @en
preferred label: underordnad institution @sv

kattoyhteisö
type: Concept
source: RDA-termi
source: RDA-term @sv
created: 2020-05-07
modified: 2025-07-03
broader: yhteisöön liittyvä yhteisö
definition: Yhteisö, joka on hierarkkisesti ylempänä toista yhteisöä. (RDA Registry)
definition: Institution som står hierarkiskt över en annan institution. @sv
in scheme: Metatietosanasto
preferred label: hierarchical superior @en
preferred label: överordnad institution @sv

oppilaitos
type: Concept
source: RDA-termi
source: RDA-term @sv
created: 2020-05-07
modified: 2025-08-15
alternative label: oppilaitos (opiskelutaso)
alternative label: läroanstalt (utbildningsnivå) @sv
alternative label: läroinrättning @sv
alternative label: skola @sv
alternative label: utbildningsinstitution @sv
broader: henkilöön liittyvä yhteisö
definition: Oppilaitos, joka antaa opetusta henkilölle. (RDA Registry)
definition: Läroinrättning som ger undervisning till en person. @sv
in scheme: Metatietosanasto
preferred label: student at @en
preferred label: läroanstalt @sv

yhteisöjäsen yhteisössä
type: Concept
source: RDA-termi
source: RDA-term @sv
created: 2020-05-07
modified: 2025-08-27
alternative label: membership corporate body @en
alternative label: laajempi jäsenyhteisö
alternative label: yhteisön laajempi jäsenyhteisö
alternative label: vidare medlemsinstitution @sv
broader: yhteisöön liittyvä yhteisö
definition: Yhteisö, jossa yhteisö on jäsenenä. (RDA Registry)
definition: Institution i vilken en institution är medlem. @sv
in scheme: Metatietosanasto
preferred label: corporate body member of corporate body of @en
preferred label: institutionsmedlem i institutionen @sv

suvun sponsoroima yhteisö
type: Concept
source: RDA-termi
source: RDA-term @sv
created: 2020-05-07
modified: 2025-08-21
broader: sukuun liittyvä yhteisö
definition: Yhteisö, jota suku sponsoroi. (RDA Registry)
definition: Institution som en släkt sponsrar. @sv
in scheme: Metatietosanasto
preferred label: sponsored corporate body of family @en
preferred label: institution sponsrad av släkt @sv

työnantaja
type: Concept
source: RDA-termi
source: RDA-term @sv
created: 2020-05-07
modified: 2025-08-23
broader: henkilöjäsen yhteisössä
definition: Yhteisö, joka työllistää henkilön. (RDA Registry)
definition: Institution som sysselsätter en person. @sv
in scheme: Metatietosanasto
preferred label: employer @en
preferred label: arbetsgivare @sv

pääjohtajana yhteisössä
type: Concept
source: RDA-termi
source: RDA-term @sv
created: 2020-05-07
modified: 2025-08-16
alternative label: generaldirektör i institutionen @sv
broader: toimihenkilönä yhteisössä
definition: Yhteisö, jossa toimihenkilö on ylin viranhaltija. (RDA Registry)
definition: Institution, i vilken en person är den högsta tjänsteinnehavaren. @sv
in scheme: Metatietosanasto
preferred label: chief executive of @en
preferred label: generaldirektör för institutionen @sv

edunvalvojana yhteisössä
type: Concept
source: RDA-termi
source: RDA-term @sv
created: 2020-05-07
modified: 2025-05-27
broader: toimihenkilönä yhteisössä
definition: Yhteisö, jossa toimihenkilöllä on valtuudet tehdä päätöksiä yhteisön eduksi. (RDA Registry)
definition: Institution, i vilken en tjänsteperson har befogenheter att fatta beslut för institutionens bästa. @sv
in scheme: Metatietosanasto
preferred label: trustee of @en
preferred label: förvaltare av institutionen @sv

tutkinnon myöntänyt oppilaitos
type: Concept
source: RDA-termi
source: RDA-term @sv
created: 2020-05-07
modified: 2025-08-23
alternative label: loppututkinnon myöntäjä
alternative label: slutexamen beviljad av @sv
broader: henkilöön liittyvä yhteisö
definition: Yhteisö, joka on laitos tai tiedekunta, joka on myöntänyt henkilölle akateemisen loppututkinnon. (RDA Registry)
definition: Institution som är en institution eller fakultet, som har beviljat en person en akademisk slutexamen. @sv
in scheme: Metatietosanasto
preferred label: graduate of @en
preferred label: läroanstalt som beviljat examen @sv

yhteisön perustanut yhteisö
type: Concept
source: RDA-termi
source: RDA-term @sv
created: 2020-05-07
modified: 2025-08-27
alternative label: founding corporate body @en
alternative label: perustajayhteisö
alternative label: grundande institution @sv
broader: yhteisöön liittyvä yhteisö
definition: Yhteisö, joka perusti toisen yhteisön. (RDA Registry)
definition: Institution som grundat en annan institution. @sv
in scheme: Metatietosanasto
preferred label: founding corporate body of corporate body @en
preferred label: grundare (institution) av institution @sv

yhteisön perustama yhteisö
type: Concept
source: RDA-termi
source: RDA-term @sv
created: 2020-05-07
modified: 2025-08-27
alternative label: perustanut yhteisön
alternative label: grundat institutionen @sv
broader: yhteisöön liittyvä yhteisö
definition: Yhteisö, joka on yhteisön perustama. (RDA Registry)
definition: Institution som en institution grundat. @sv
in scheme: Metatietosanasto
preferred label: founded corporate body of corporate body @en
preferred label: institution grundad av en institution @sv

yhteisöä sponsoroiva yhteisö
type: Concept
source: RDA-termi
source: RDA-term @sv
created: 2020-05-07
modified: 2025-08-27
alternative label: sponsoring corporate body @en
alternative label: sponsoroiva yhteisö
alternative label: sponsrande institution @sv
broader: yhteisöön liittyvä yhteisö
definition: Yhteisö, joka sponsoroi toista yhteisöä. (RDA Registry)
definition: Institution som sponsrar en annan institution. @sv
in scheme: Metatietosanasto
preferred label: sponsoring corporate body of corporate body @en
preferred label: institution som sponsrar institution @sv

laajempi emoyhtiö
type: Concept
source: RDA-termi
source: RDA-term @sv
created: 2020-05-07
modified: 2025-07-04
broader: yhteisöön liittyvä yhteisö
definition: Laajempi yhteisö, jolla on yhteys paikallisiin tytäryhtiöihin organisaatiorakenteen kautta. (RDA Registry)
definition: Vidare institution som har kontakt till lokala dotterbolag genom organisationsstrukturen. @sv
in scheme: Metatietosanasto
preferred label: broader affiliated body @en
preferred label: moderbolag @sv

suvun perustama yhteisö
type: Concept
source: RDA-termi
source: RDA-term @sv
created: 2020-05-07
modified: 2025-08-21
broader: sukuun liittyvä yhteisö
definition: Yhteisö, jonka suku on perustanut. (RDA Registry)
definition: Institution som en släkt har grundat. @sv
in scheme: Metatietosanasto
preferred label: founded corporate body of family @en
preferred label: institution grundad av släkt @sv

yhteisön sponsoroima yhteisö
type: Concept
source: RDA-termi
source: RDA-term @sv
created: 2020-05-07
modified: 2025-08-27
alternative label: sponsoroitu yhteisö
alternative label: sponsrad institution @sv
broader: yhteisöön liittyvä yhteisö
definition: Yhteisö, jota toinen yhteisö sponsoroi. (RDA Registry)
definition: Institution som en annan institution sponsrar. @sv
in scheme: Metatietosanasto
preferred label: sponsored corporate body of corporate body @en
preferred label: institution sponsrad av institution @sv

paikallinen tytäryhtiö
type: Concept
source: RDA-termi
source: RDA-term @sv
created: 2020-05-08
modified: 2025-08-15
broader: yhteisöön liittyvä yhteisö
definition: Paikallinen yhteisö, jolla on yhteys emoyhtiön edustamaan laajempaan organisaatioon. (RDA Registry)
definition: Lokal institution, som står i kontakt med en större organisation som ett moderbolag representerar. @sv
in scheme: Metatietosanasto
preferred label: local affiliate @en
preferred label: lokalt dotterbolag @sv

kanssayhdistyjä
type: Concept
source: RDA-termi
source: RDA-term @sv
created: 2020-05-08
modified: 2025-01-16
alternative label: yhteisöön yhdistynyt
alternative label: sammanslagits med institution @sv
broader: yhteisöön liittyvä yhteisö
definition: Yhteisö, joka on sulautunut toiseen yhteisöön muodostaakseen kolmannen yhteisön. (RDA Registry)
definition: Institution som har sammanslagits med en annan institution för att bilda en tredje institution. @sv
in scheme: Metatietosanasto
preferred label: mergee @en
preferred label: sammanslagits tillsammans med @sv

yhteisön yhteisöjäsen
type: Concept
source: RDA-termi
source: RDA-term @sv
created: 2020-05-08
modified: 2025-08-27
alternative label: corporate member @en
alternative label: yhteisöjäsen
alternative label: yhteisön jäsenyhteisö
alternative label: institutionsmedlem @sv
alternative label: medlemsinstitution i institutionen @sv
broader: yhteisöön liittyvä yhteisö
definition: Yhteisö, joka on toisen yhteisön jäsenyhteisö. (RDA Registry)
definition: Institution i vilken en annan institution är medlemsinstitution. @sv
in scheme: Metatietosanasto
preferred label: corporate body member of corporate body @en
preferred label: institutionsmedlem i institutionen @sv

yhteiskonferenssi
type: Concept
source: RDA-termi
source: RDA-term @sv
created: 2020-05-08
modified: 2025-08-27
broader: yhteisöön liittyvä yhteisö
definition: Yhteisö, joka on konferenssi, joka järjestetään yhdessä toisen konferenssin kanssa. (RDA Registry)
definition: Institution som är en konferens, som arrangeras tillsammans med en annan konferens. @sv
in scheme: Metatietosanasto
preferred label: jointly held conference @en
preferred label: gemensam konferens @sv

äänituottaja
type: Concept
source: RDA-termi
source: RDA-term @sv
created: 2020-05-09
modified: 2025-08-27
alternative label: audio producer @en
alternative label: äänituottaja (toimija)
alternative label: ljudproducent (aktör) @sv
broader: tuottaja
definition: Toimija, joka on tuottaja, joka on vastuussa useimpien äänitteen liiketoiminnallisten tehtävien hoitamisesta. (RDA Registry)
definition: Aktör som är en producent, som svarar för skötseln av de flesta kommersiella uppgifterna kring en ljudinspelning. @sv
in scheme: Metatietosanasto
preferred label: audio producer agent @en
preferred label: ljudproducent @sv

valtiosopimuksen allekirjoittaja
type: Concept
source: RDA-termi
source: RDA-term @sv
created: 2020-05-09
modified: 2025-08-23
alternative label: signatär @sv
broader: teoksen tekijä
definition: Yhteisö, joka on allekirjoittanut, ratifioinut tai liittynyt valtiosopimukseen. (RDA Registry)
definition: Institution som har undertecknat, ratifierat eller anslutit sig till ett fördrag. @sv
in scheme: Metatietosanasto
preferred label: participant in treaty @en
preferred label: undertecknare av fördrag @sv

säilyttäjä
type: Concept
source: RDA-termi
source: RDA-term @sv
created: 2020-05-14
modified: 2025-08-21
alternative label: custodian @en
alternative label: säilyttäjä (toimija)
alternative label: bevarare @sv
alternative label: depositarie @sv
alternative label: förvaltare @sv
alternative label: förvarare (aktör) @sv
broader: kappaleeseen liittyvä toimija
definition: Toimija, jolla on kappaleen laillinen säilyttämisoikeus. (RDA Registry)
definition: Aktör som har juridisk förvaringsrätt till ett exemplar. @sv
in scheme: Metatietosanasto
preferred label: custodian agent @en
preferred label: förvarare @sv

opettaja
type: Concept
source: RDA-termi
source: RDA-term @sv
created: 2016-01-08
modified: 2025-08-15
alternative label: instructor @en
alternative label: opettaja (suhde)
alternative label: opettaja (toimija)
alternative label: lärare (aktör) @sv
alternative label: lärare (relation) @sv
broader: esittäjä
definition: Toimija, joka on esittäjä, joka osallistuu ekspression tekemiseen opettamalla tai pitämällä havaintoesityksen. (RDA Registry)
definition: Aktör som är en framförare, som deltar i utförandet av ett uttryck, genom att undervisa eller hålla en demonstration. @sv
in scheme: Metatietosanasto
preferred label: instructor agent @en
preferred label: lärare @sv

säätävä hallintoelin
type: Concept
source: RDA-termi
source: RDA-term @sv
created: 2020-11-02
modified: 2025-08-21
alternative label: säätävä lainkäyttöalue
alternative label: verkställande jurisdiktion @sv
broader: teoksen tekijä
definition: Yhteisö, joka on teoksen, joka on laki, asetus, perustuslaki, tuomioistuinta koskeva sääntö tai muu säädös, säätävä hallintoelin. (RDA Registry)
definition: Institution som är stadgande förvaltningsorgan för ett verk som är en lag, en förordning, en grundlag, en regel som gäller domstol, eller någon annan rättsakt. @sv
in scheme: Metatietosanasto
preferred label: enacting government @en
preferred label: stadgande förvaltningsorgan @sv

työntekijä
type: Concept
source: RDA-termi
source: RDA-term @sv
created: 2021-01-27
modified: 2025-08-23
alternative label: työntekijä (suhde)
alternative label: anställd (relation) @sv
broader: yhteisön henkilöjäsen
definition: Henkilö, joka on työntekijänä yhteisössä. (RDA Registry)
definition: Person som är arbetstagare i en institution. @sv
in scheme: Metatietosanasto
preferred label: employee @en
preferred label: arbetstagare @sv

monikkosisarus
type: Concept
source: AgRelOn, an Agent Relationship Ontology
source: Kansallinen RDA-termi
source: Nationell RDA-term @sv
created: 2021-01-27
modified: 2025-08-28
alternative label: kaksoissisarus
alternative label: kaksoissisko
alternative label: kaksoisveli
alternative label: kaksonen
alternative label: kaksoset
alternative label: kolmoset
alternative label: neloset
alternative label: fyrling @sv
alternative label: trilling @sv
alternative label: tvilling @sv
broader: henkilöön liittyvä henkilö
definition: Kuvailtavan henkilön sisarus, joka on syntynyt saman raskauden tuloksena. Koskee kaksosia, kolmosia ja muita monikkolapsia.
definition: Syskon till en beskriven person, som har fötts ur samma graviditet. Gäller tvillingar, trillingar och andra flerlingsbarn. @sv
in scheme: Metatietosanasto
preferred label: has multiple birth sibling @en
preferred label: flerling @sv

tuttava
type: Concept
source: AgRelOn, an Agent Relationship Ontology
source: Kansallinen RDA-termi
source: Nationell RDA-term @sv
created: 2021-01-27
modified: 2025-08-28
broader: henkilöön liittyvä henkilö
definition: Henkilö, jonka kuvailtava henkilö tuntee yksityisesti.
definition: Person som en beskriven person känner privat. @sv
in scheme: Metatietosanasto
preferred label: has acquaintance @en
preferred label: bekant @sv

ottosisarus
type: Concept
source: AgRelOn, an Agent Relationship Ontology
source: Kansallinen RDA-termi
source: Nationell RDA-term @sv
created: 2021-01-27
modified: 2025-08-28
alternative label: sisarpuoli
alternative label: velipuoli
alternative label: styvbror @sv
alternative label: styvsyster @sv
broader: henkilöön liittyvä henkilö
definition: Kuvailtavan henkilön sisarus, kun vähintään toinen sisaruksista ei ole kummankaan yhteisen vanhemman biologinen lapsi.
definition: Syskon till en beskriven person, då åtminstone ett av syskonen inte är biologiskt barn till någon av de gemensamma föräldrarna. @sv
in scheme: Metatietosanasto
preferred label: has stepsibling @en
preferred label: styvsyskon @sv

adoptiosisarus
type: Concept
source: AgRelOn, an Agent Relationship Ontology
source: Kansallinen RDA-termi
source: Nationell RDA-term @sv
created: 2021-01-27
modified: 2025-08-28
broader: henkilöön liittyvä henkilö
definition: Kuvailtavan henkilön sisarus, kun vähintään toinen sisaruksista on yhteisten vanhempien adoptiolapsi.
definition: Syskon till en beskriven person, då åtminstone ett av syskonen är adoptivbarn till gemensamma föräldrar. @sv
in scheme: Metatietosanasto
preferred label: has adoptive sibling @en
preferred label: adoptivsyskon @sv

lapsipuoli
type: Concept
source: AgRelOn, an Agent Relationship Ontology
source: Kansallinen RDA-termi
source: Nationell RDA-term @sv
created: 2021-01-27
modified: 2025-08-28
alternative label: styvdotter @sv
alternative label: styvson @sv
broader: henkilöön liittyvä henkilö
definition: Kuvailtavan henkilön puolison lapsi.
definition: Barn till en beskriven persons partner. @sv
in scheme: Metatietosanasto
preferred label: has stepchild @en
preferred label: styvbarn @sv

puoliso
type: Concept
source: AgRelOn, an Agent Relationship Ontology
source: Kansallinen RDA-termi
source: Nationell RDA-term @sv
created: 2021-01-27
modified: 2025-08-28
alternative label: aviopuoliso
alternative label: maka @sv
alternative label: make @sv
broader: henkilöön liittyvä henkilö
definition: Henkilö, jonka kanssa kuvailtava henkilö on avioliitossa.
definition: Person med vilken en beskriven person är gift. @sv
in scheme: Metatietosanasto
preferred label: has spouse @en
preferred label: partner @sv

rakastaja
type: Concept
source: AgRelOn, an Agent Relationship Ontology
source: Kansallinen RDA-termi
source: Nationell RDA-term @sv
created: 2021-01-27
modified: 2025-08-28
alternative label: rakastajatar
alternative label: älskarinna @sv
broader: henkilöön liittyvä henkilö
definition: Henkilö, jonka kanssa kuvailtavalla henkilöllä on rakkaussuhde eivätkä he ole keskenään naimisissa.
definition: Person med vilken en beskriven person har ett kärleksförhållande, utan att vara gifta. @sv
in scheme: Metatietosanasto
preferred label: has lover @en
preferred label: älskare @sv

sisaruksen lapsi
type: Concept
source: AgRelOn, an Agent Relationship Ontology
source: Kansallinen RDA-termi
source: Nationell RDA-term @sv
created: 2021-01-27
modified: 2025-08-28
alternative label: sisarenpoika
alternative label: sisarentytär
alternative label: veljenpoika
alternative label: veljentytär
alternative label: brorsdotter @sv
alternative label: brorsson @sv
alternative label: syskons barn @sv
alternative label: systerdotter @sv
alternative label: systerson @sv
broader: henkilöön liittyvä henkilö
definition: Kuvailtavan henkilön sisaruksen lapsi.
definition: Barn till en beskriven persons syskon. @sv
in scheme: Metatietosanasto
preferred label: has niece or nephew @en
preferred label: syskonbarn @sv

avopuoliso
type: Concept
source: AgRelOn, an Agent Relationship Ontology
source: Kansallinen RDA-termi
source: Nationell RDA-term @sv
created: 2021-01-27
modified: 2025-08-28
broader: henkilöön liittyvä henkilö
definition: Henkilö, jonka kanssa kuvailtava henkilö asuu yhdessä ja on parisuhteessa, olematta avioliitossa.
definition: Person med vilken en beskriven person bor och är i ett förhållande, utan att vara gifta. @sv
in scheme: Metatietosanasto
preferred label: has cohabitee @en
preferred label: sambo @sv

sisarus
type: Concept
source: AgRelOn, an Agent Relationship Ontology
source: Kansallinen RDA-termi
source: Nationell RDA-term @sv
created: 2021-01-27
modified: 2025-08-28
alternative label: has brother @en
alternative label: has sister @en
alternative label: sisar (sukulainen)
alternative label: sisko
alternative label: veli
alternative label: bror @sv
alternative label: syster @sv
broader: henkilöön liittyvä henkilö
definition: Kuvailtavan henkilön sisarus, riippumatta biologisesta sukulaisuudesta.
definition: Syskon till en beskriven person, oberoende biologiskt släktskap. @sv
in scheme: Metatietosanasto
preferred label: has sibling @en
preferred label: syskon @sv

sukulainen
type: Concept
source: AgRelOn, an Agent Relationship Ontology
source: Kansallinen RDA-termi
source: Nationell RDA-term @sv
created: 2021-01-27
modified: 2025-08-28
broader: henkilöön liittyvä henkilö
definition: Henkilö, jolle kuvailtava henkilö on sukua. Ei viittaa vain biologiseen sukulaisuuteen, vaan myös avioliiton, adoption tai kasvatuksen kautta muodostuneisiin suhteisiin.
definition: Person med vilken en beskriven person är släkt. Hänvisar inte enbart till biologiskt släktskap, utan även relationer som bildats genom äktenskap, adoption eller fostran. @sv
in scheme: Metatietosanasto
preferred label: has relative @en
preferred label: släkting @sv

puolison sisarus
type: Concept
source: AgRelOn, an Agent Relationship Ontology
source: Kansallinen RDA-termi
source: Nationell RDA-term @sv
created: 2021-01-27
modified: 2025-08-28
alternative label: kyty
alternative label: käly
alternative label: lanko
alternative label: nato
alternative label: sisaruksen puoliso
alternative label: makas/makes syskon @sv
alternative label: svägerska @sv
alternative label: svåger @sv
alternative label: syskons partner @sv
broader: henkilöön liittyvä henkilö
definition: Kuvailtavan henkilön puolison sisarus.
definition: Syskon till en beskriven persons partner. @sv
in scheme: Metatietosanasto
preferred label: has sibling-in-law @en
preferred label: partners syskon @sv

kasvattisisarus
type: Concept
source: AgRelOn, an Agent Relationship Ontology
source: Kansallinen RDA-termi
source: Nationell RDA-term @sv
created: 2021-01-27
modified: 2025-08-28
broader: henkilöön liittyvä henkilö
definition: Kuvailtavan henkilön sisarus, kun vähintään toinen sisaruksista on yhteisen vanhemman kasvattilapsi.
definition: En beskriven persons syskon, då åtminstone ett av syskonen är fosterbarn till en gemensam förälder. @sv
in scheme: Metatietosanasto
preferred label: has foster sibling @en
preferred label: fostersyskon @sv

hengellinen kontakti
type: Concept
source: AgRelOn, an Agent Relationship Ontology
source: Kansallinen RDA-termi
source: Nationell RDA-term @sv
created: 2021-01-27
modified: 2025-08-28
alternative label: amma
alternative label: guru
alternative label: hengellinen isä
alternative label: hengellinen vanhempi
alternative label: hengellinen äiti
alternative label: andlig fader @sv
alternative label: andlig moder @sv
broader: henkilöön liittyvä henkilö
definition: Henkilö tai hengellinen entiteetti, johon kuvailtavalla henkilöllä tai hengellisellä entiteetillä on hengellinen yhteys. Yhteys voi olla esim. kanavointia, guru-oppilas- tai psykoanalyytikko-potilas-suhde
definition: Person eller andlig entitet, med vilken en beskriven person eller andlig entitet har andlig kontakt. Kontakten kan ske via kanalisering, som ett förhållande mellan guru och elev eller mellan psykoanalytiker och patient. @sv
in scheme: Metatietosanasto
preferred label: has spiritual contact @en
preferred label: andlig kontakt @sv

erityiskoulu
type: Concept
source: Kansallinen RDA-termi
source: Nationell RDA-term @sv
created: 2021-04-20
modified: 2024-12-18
broader: oppilaitos
definition: Oppilaitos, jonka opetus on tarkoitettu vammaisuuden, sairauden, kehityksessä viivästymisen tai muun vastaavan syyn vuoksi erityistä tukea tarvitsevalle oppijalle (Opetus- ja koulutussanasto).
definition: Läroanstalt som erbjuder undervisning till elever som p.g.a. funktionshinder, sjukdom, fördröjning i utvecklingen eller annan motsvarande orsak behöver särskilt stöd. @sv
in scheme: Metatietosanasto
preferred label: specialskola @sv

kunnallinen liikelaitos
type: Concept
source: Kansallinen RDA-termi
source: Nationell RDA-term @sv
created: 2021-04-20
modified: 2024-05-24
alternative label: kunnan liikelaitos
alternative label: kuntayhtymän liikelaitos
alternative label: liikelaitoskuntayhtymä
broader: liikelaitos
definition: Kunnan tai kuntayhtymän omistama liiketoimintaa harjoittava organisaatio.
definition: Organisation som utövar affärsverksamhet och ägs av kommun eller kommunsamfällighet. @sv
in scheme: Metatietosanasto
preferred label: kommunalt affärsverk @sv

osakeyhtiö
type: Concept
source: Kansallinen RDA-termi
source: Nationell RDA-term @sv
created: 2021-04-20
modified: 2024-05-24
alternative label: julkinen osakeyhtiö
alternative label: osuuspankkiosakeyhtiö
alternative label: säästöpankkiosakeyhtiö
alternative label: vakuutusosakeyhtiö
alternative label: yksityinen osakeyhtiö
alternative label: försäkringsaktiebolag @sv
alternative label: publikt aktiebolag @sv
alternative label: sparbanksaktiebolag @sv
broader: yhtiö
definition: Yhtiö jonka peruspääoma koostuu osakkaiden sijoituksista (osakkeista) ja jossa osakkaat eivät ole henkilökohtaisesti vastuussa yhtiön sitoumuksista (Kielitoimiston sanakirja).
definition: Bolag, vars grundkapital består av delägarnas investeringar (aktier) och i vilka delägarna inte personligen är ansvariga för bolagets obligationer. @sv
in scheme: Metatietosanasto
preferred label: aktiebolag @sv

pappisseminaari
type: Concept
source: Kansallinen RDA-termi
source: Nationell RDA-term @sv
created: 2021-04-20
modified: 2024-12-18
broader: oppilaitos
definition: Roomalaiskatolisen kirkon ja ortodoksisten kirkkojen pappeinkoulutuslaitos.
definition: Prästutbildningsinstitution i romersk-katolska kyrkan och ortodoxa kyrkor. @sv
in scheme: Metatietosanasto
preferred label: prästseminarium @sv

divisioona
type: Concept
source: Kansallinen RDA-termi
source: Nationell RDA-term @sv
created: 2021-04-20
modified: 2024-05-24
broader: sotilasyksikkö
definition: Itsenäisiin sotatoimiin pystyvä armeijan sotatoimiyhtymä, jossa on tyypillisesti kaikki aselajiyksiköt. Divisioonista, prikaateista ja pienemmistä yksiköistä muodostetaan armeijakunta (Wikipedia).
definition: Militärt förband, med förmåga till självständiga krigsoperationer och vanligen med alla vapenslagsenheter. @sv
in scheme: Metatietosanasto
preferred label: division @sv

viranomainen
type: Concept
source: Kansallinen RDA-termi
source: Nationell RDA-term @sv
created: 2021-04-20
modified: 2025-10-30
alternative label: aluehallintoviranomainen
alternative label: asutusviranomainen
alternative label: elinkeinoviranomainen
alternative label: elintarvikeviranomainen
alternative label: elintarvikevirasto
alternative label: finanssivalvontaviranomainen
alternative label: ilmasuojeluviranomainen
alternative label: kansanhuoltoviranomainen
alternative label: kirkkoherranvirasto
alternative label: kirkollisviranomainen
alternative label: kunnallisviranomainen
alternative label: kunnallisvirasto
alternative label: liikenneviranomainen
alternative label: maahanmuuttoviranomainen
alternative label: maanmittausviranomainen
alternative label: maatalousviranomainen
alternative label: merenkulkuviranomainen
alternative label: metsäkeskus
alternative label: metsätalousviranomainen
alternative label: opetusviranomainen
alternative label: paikallisviranomainen
alternative label: pelastuslaitos
alternative label: pelastusviranomainen
alternative label: piiriviranomainen
alternative label: postilaitos
alternative label: postiviranomainen
alternative label: puolustushallintoviranomainen
alternative label: rakennusviranomainen
alternative label: rakennusvirasto
alternative label: rautatieviranomainen
alternative label: sosiaaliviranomainen
alternative label: sotasensuuriviranomainen
alternative label: syyttäjäviranomainen
alternative label: syyttäjävirasto
alternative label: terveysviranomainen
alternative label: tulliviranomainen
alternative label: turvallisuusviranomainen
alternative label: työsuojeluviranomainen
alternative label: työviranomainen
alternative label: ulkoasiainhallintoviranomainen
alternative label: ulosottoviranomainen
alternative label: ulosottovirasto
alternative label: vaaliviranomainen
alternative label: vankeinhoitoviranomainen
alternative label: veroviranomainen
alternative label: verovirasto
alternative label: virasto
alternative label: väestönsiirtoviranomainen
alternative label: väestönsuojeluviranomainen
alternative label: ympäristöviranomainen
alternative label: arbetarskyddsmyndighet @sv
alternative label: arbetsmyndighet @sv
alternative label: befolkningsskyddsmyndighet @sv
alternative label: byggnadsmyndighet @sv
alternative label: distriktsmyndighet @sv
alternative label: exekutionsverk @sv
alternative label: finansinspektionsmyndighet @sv
alternative label: folkförsörjningsmyndighet @sv
alternative label: fångvårdsmyndighet @sv
alternative label: försvarsförvaltningsmyndighet @sv
alternative label: hälsovårdsmyndighet @sv
alternative label: kommunal myndighet @sv
alternative label: krigscensurmyndighet @sv
alternative label: kyrklig myndighet @sv
alternative label: lantbruksmyndighet @sv
alternative label: lantmäterimyndighet @sv
alternative label: livsmedelsmyndighet @sv
alternative label: livsmedelsverk @sv
alternative label: lokalmyndighet @sv
alternative label: migrationsmyndighet @sv
definition: Valtionhallinnon pysyvä toimielin, jolle on säädöksillä annettu toimivalta ja velvollisuus tiettyjen tehtävien hoitamiseen omalla toimialallaan: virasto tai laitos, tai yksittäinen virkamies kuten tasa-arvovaltuutettu (Wikipedia).
in scheme: Metatietosanasto
narrower: keskusvirasto
scope note: Kunnallisista viranomaisista käytä termiä: kunta, kuntayhtymä tai kaupunki.
scope note: Om kommunala myndigheter används termen: kommun, samkommun eller stad. @sv

prikaati
type: Concept
source: Kansallinen RDA-termi
source: Nationell RDA-term @sv
created: 2021-04-20
modified: 2024-05-24
broader: sotilasyksikkö
definition: Nykyaikaisissa asevoimissa pienin itsenäisiin sotatoimiin pystyvä armeijan sotatoimiyhtymä (Wikipedia).
definition: Militär operativ enhet. @sv
in scheme: Metatietosanasto
preferred label: brigad @sv

alioikeus
type: Concept
source: Kansallinen RDA-termi
source: Nationell RDA-term @sv
created: 2021-04-20
modified: 2024-05-24
alternative label: kihlakunnanoikeus
alternative label: käräjäoikeus
alternative label: raastuvanoikeus
alternative label: tuomiokunta (alioikeus)
alternative label: domsaga (underrätt) @sv
alternative label: häradsrätt @sv
alternative label: rådstuvurätt @sv
alternative label: tingsrätt @sv
alternative label: underdomstol @sv
broader: tuomioistuin
definition: Yleinen alioikeus. Alioikeus on oikeuslaitoksen alin oikeusaste. Suomessa yleisinä alioikeuksina ovat vuodesta 1993 lähtien toimineet käräjäoikeudet, joissa riita- ja rikosasiat yleensä pannaan vireille. (Wikipedia.)
definition: Allmän underrätt. Lägsta instans i domstolsväsendet. I Finland fungerar tingsrätter sedan år 1993 som allmänna underrätter, i vilka tviste- och brottsmål vanligen inleds. @sv
in scheme: Metatietosanasto
preferred label: underrätt @sv

sotatuomioistuin
type: Concept
source: Kansallinen RDA-termi
source: Nationell RDA-term @sv
created: 2021-04-20
modified: 2024-05-24
alternative label: kenttäoikeus
alternative label: sotaoikeus
alternative label: fältdomstol @sv
alternative label: fältkrigsrätt @sv
alternative label: krigsrätt @sv
broader: tuomioistuin
definition: Sodanaikainen lähinnä sotilasrikoksia käsittelevä tuomioistuin.
definition: Domstol under krigstid, som behandlar främst militära brott. @sv
in scheme: Metatietosanasto
preferred label: krigsdomstol @sv

lentue
type: Concept
source: Kansallinen RDA-termi
source: Nationell RDA-term @sv
created: 2021-04-20
modified: 2024-08-27
broader: sotilasyksikkö
definition: Ilmavoimien sotilasyksikkö, johon kuuluu useampi lentokone, niiden miehistö ja kenttähenkilöstö (Wikipedia).
definition: Militär enhet inom flygvapnet, till vilken hör flera flygplan, manskap och fältpersonal. @sv
in scheme: Metatietosanasto
preferred label: flyggrupp @sv

oppikoulu
type: Concept
source: Kansallinen RDA-termi
source: Nationell RDA-term @sv
created: 2021-04-20
modified: 2024-12-18
alternative label: ala-alkeiskoulu
alternative label: kansalaiskoulu (oppikoulu)
alternative label: keskikoulu
alternative label: lyseo (oppikoulu)
alternative label: reaalikoulu
alternative label: triviaalikoulu
alternative label: tyttökoulu
alternative label: yhteiskoulu
alternative label: yläalkeiskoulu
alternative label: flickskola @sv
alternative label: lyceum @sv
alternative label: lärdomsskola @sv
alternative label: medborgarskola (läroverk) @sv
alternative label: mellanskola @sv
alternative label: realskola @sv
alternative label: samskola @sv
alternative label: trivialskola @sv
broader: oppilaitos
definition: Oppikoulu oli Suomessa ennen peruskoulu-uudistuksen voimaantuloa valtioneuvoston luvalla ylempää koulusivistystä varten perustettu valtion, kunnallinen tai yksityinen oppilaitos, johon voivat kuulua ylioppilastutkintoon johtava ja sitä kautta korkeakouluopintoihin valmentava lukio, sekä keskiasteen opintoihin oikeuttava keskikoulu. Kokonaisuutena oppikoulu oli kahdeksanvuotinen oppilaitos, joka lakkautettiin peruskoulu-uudistuksen yhteydessä 1970-luvulla. (Wikipedia.)
definition: Läroverk (officiellt även lärdomsskola) var i Finland statliga, kommunala eller privata läroinrättningar som grundats för högre skolbildning, och som kunde bestå av mellanskola och gymnasium. I sin helhet utgjorde läroverk en åttaårig utbildning. Läroverket som skolform upphävdes i samband med grundskolereformen på 1970-talet. @sv
in scheme: Metatietosanasto
preferred label: läroverk @sv

näyttely
type: Concept
source: Kansallinen RDA-termi
source: Nationell RDA-term @sv
created: 2021-04-20
modified: 2024-05-24
alternative label: taidenäyttely
alternative label: konstutställning @sv
broader: tapahtuma
in scheme: Metatietosanasto
preferred label: utställning @sv

yliopisto
type: Concept
source: Kansallinen RDA-termi
source: Nationell RDA-term @sv
created: 2021-04-20
modified: 2024-12-18
alternative label: kauppakorkeakoulu
alternative label: korkeakoulu (yliopisto, yhteisötyyppi)
alternative label: teknillinen korkeakoulu
alternative label: handelshögskola @sv
alternative label: högskola (universitet, institutionstyp) @sv
alternative label: teknisk högskola @sv
broader: oppilaitos
definition: Koulutusorganisaatio, jonka tehtävänä on edistää vapaata tutkimusta ja tieteellistä ja taiteellista sivistystä sekä antaa tutkimukseen perustuvaa korkeinta opetusta (Opetus- ja koulutussanasto).
definition: Utbildningsorganisation med uppgift att främja fri forskning och vetenskaplig och konstnärlig bildning, samt ge forskningsbaserad undervisning på högsta nivå. @sv
in scheme: Metatietosanasto
preferred label: universitet @sv

hallitus (toimielin)
type: Concept
source: Kansallinen RDA-termi
source: Nationell RDA-term @sv
created: 2021-04-20
modified: 2024-05-24
alternative label: hallitus (yhteisötyyppi)
alternative label: johtokunta
alternative label: kaupunginhallitus
alternative label: kunnanhallitus
alternative label: tuomiokapituli
alternative label: direktion @sv
alternative label: domkapitel @sv
alternative label: kommunstyrelse @sv
alternative label: stadsstyrelse @sv
alternative label: styrelse (institutionstyp) @sv
broader: toimielin
definition: Yhdistyksen, yhtiön tms. toimeenpaneva (usein myös päättävä) elin (Kielitoimiston sanakirja).
definition: Verkställande (ofta även beslutande) organ i förening, bolag e.d. @sv
in scheme: Metatietosanasto
preferred label: styrelse @sv

komppania
type: Concept
source: Kansallinen RDA-termi
source: Nationell RDA-term @sv
created: 2021-04-20
modified: 2024-05-24
broader: sotilasyksikkö
definition: Armeijan perusyksikkö, jolla on yhteinen huolto ja talous (Wikipedia).
definition: Grundenhet i armé, med gemensamt underhåll och gemensam ekonomi. @sv
in scheme: Metatietosanasto
preferred label: kompani @sv

neuvottelukunta
type: Concept
source: Kansallinen RDA-termi
source: Nationell RDA-term @sv
created: 2021-04-20
modified: 2024-05-24
alternative label: rådgivande delegation @sv
broader: toimielin
definition: Johonkin tarkoitukseen asetettu neuvoa antava elin (Kielitoimiston sanakirja). Myös asiantuntijaelin, jota käytetään tavallisesti julkisyhteisöjen hallintojärjestelmässä asiantuntijoiden, instituutioiden ja kansalaisten välisinä keskustelu- ja neuvottelufoorumeina (Wikipedia).
definition: Rådgivande organ som tillsatts för ett visst ändamål. Även expertorgan som vanligen används i offentliga samfunds förvaltningssystem, som diskussions- och förhandlingsforum mellan experter, institutioner och medborgare. @sv
in scheme: Metatietosanasto
preferred label: förhandlingsdelegation @sv

lippukunta
type: Concept
source: Kansallinen RDA-termi
source: Nationell RDA-term @sv
created: 2021-04-20
modified: 2024-08-27
broader: sotilasyksikkö
definition: Historiallinen termi. Jalkaväen yksikkö 1500-1700-luvuilla.
definition: Historisk term. Infanterienhet på 1500-1700-talen. @sv
in scheme: Metatietosanasto
preferred label: fänika @sv

urheilutapahtuma
type: Concept
source: Kansallinen RDA-termi
source: Nationell RDA-term @sv
created: 2021-04-20
modified: 2024-05-24
alternative label: kilpa-ajot
alternative label: liikuntatapahtuma
alternative label: ottelu
alternative label: peli (tapahtuma)
alternative label: turnaus (urheilu)
alternative label: urheilukilpailu
alternative label: urheilukisat (tapahtuma)
alternative label: urheiluturnaus
alternative label: idrottsevenemang @sv
alternative label: idrottstävling @sv
alternative label: match @sv
alternative label: race @sv
alternative label: spel (evenemang) @sv
alternative label: sportturnering @sv
alternative label: sporttävling @sv
alternative label: turnering (sport) @sv
broader: tapahtuma
in scheme: Metatietosanasto
preferred label: sportevenemang @sv

luottolaitos
type: Concept
source: Kansallinen RDA-termi
source: Nationell RDA-term @sv
created: 2021-04-20
modified: 2024-05-24
alternative label: hypoteekkiyhdistys
alternative label: liikepankki
alternative label: osuuspankki
alternative label: pankki
alternative label: säästöpankki
alternative label: affärsbank @sv
alternative label: andelsbank @sv
alternative label: bank @sv
alternative label: hypoteksförening @sv
alternative label: kreditanstalt @sv
alternative label: sparbank @sv
broader: yhtiö
definition: Pankit ym. luottolaitokset (Kielitoimiston sanakirja).
definition: Banker och andra kreditinrättningar. @sv
in scheme: Metatietosanasto
preferred label: kreditinstitut @sv

päihdehuoltolaitos
type: Concept
source: Kansallinen RDA-termi
source: Nationell RDA-term @sv
created: 2021-04-20
modified: 2024-05-24
alternative label: A-klinikka
alternative label: alkoholistihuoltola
alternative label: päiväkeskus
alternative label: A-klinik @sv
alternative label: vårdinstitution för rusmedelsmissbrukare @sv
broader: sosiaalihuoltolaitos
in scheme: Metatietosanasto
preferred label: institution för missbrukarvård @sv

valiokunta
type: Concept
source: Kansallinen RDA-termi
source: Nationell RDA-term @sv
created: 2021-04-20
modified: 2024-05-24
broader: toimielin
definition: Elin, jonka jokin edustajisto, järjestö tms. on asettanut keskuudestaan asioiden valmistelua varten (Kielitoimiston sanakirja) ja jota kutsutaan valiokunnaksi.
definition: Organ som någon representantkår, organisation e.d. har utsett för att bereda ärenden. @sv
in scheme: Metatietosanasto
preferred label: utskott @sv

vakuutuslaitos
type: Concept
source: Kansallinen RDA-termi
source: Nationell RDA-term @sv
created: 2021-04-20
modified: 2024-05-24
alternative label: eläkesäätiö
alternative label: hautausavustuskassa
alternative label: keskinäinen vakuutusyhtiö
alternative label: sairauskassa
alternative label: työeläkekassa
alternative label: työeläkevakuutusyhtiö
alternative label: työttömyyskassa
alternative label: vakuutuskassa
alternative label: vakuutusyhdistys
alternative label: arbetslöshetskassa @sv
alternative label: arbetspensionsförsäkringsbolag @sv
alternative label: arbetspensionskassa @sv
alternative label: begravningshjälpskassa @sv
alternative label: försäkringsförening @sv
alternative label: försäkringskassa @sv
alternative label: pensionsstiftelse @sv
alternative label: sjukkassa @sv
alternative label: ömsesidigt försäkringsbolag @sv
broader: yhtiö
definition: Vakuutuksia antava laitos (Kielitoimiston sanakirja).
definition: Inrättning som erbjuder försäkringar. @sv
in scheme: Metatietosanasto
preferred label: försäkringsanstalt @sv

turvakoti/ensikoti
type: Concept
source: Kansallinen RDA-termi
source: Nationell RDA-term @sv
created: 2021-04-20
modified: 2024-05-24
alternative label: ensikoti
alternative label: turvakoti
alternative label: mödrahem @sv
alternative label: skyddshem @sv
broader: sosiaalihuoltolaitos
definition: Perheväkivallan uhreja tilapäisesti majoittava asuntola (turvakoti) tai laitos jossa varsinkin yksinhuoltajaäidit lapsineen saavat hoitoa synnytyksen aikoihin (ensikoti) (Kielitoimiston sanakirja).
definition: Tillfälligt hem för familjevåldsoffer eller inrättning var särskilt ensamstående mödrar med barn får vård kring tiden för förlossning. @sv
in scheme: Metatietosanasto
preferred label: skyddshem/mödrahem @sv

varuskunta
type: Concept
source: Kansallinen RDA-termi
source: Nationell RDA-term @sv
created: 2021-04-20
modified: 2024-05-24
broader: sotilasyksikkö
definition: Kiinteä sotilasalue, jonka tehtävänä on palvella sinne sijoitettuja joukkoja, sotilaslaitoksia ja esikuntia (Wikipedia).
definition: Permanent militärområde med service för de militära styrkor, anläggningar och staber som är förlagda dit. @sv
in scheme: Metatietosanasto
preferred label: garnison @sv

valtuuskunta
type: Concept
source: Kansallinen RDA-termi
source: Nationell RDA-term @sv
created: 2021-04-20
modified: 2024-05-24
alternative label: delegaatio
alternative label: valtuusto (määrätehtävään valtuutettu)
broader: toimielin
definition: Määrätehtävään valtuutettu edustajisto (Kielitoimiston sanakirja).
definition: Representantkår befullmäktigad för en bestämd uppgift. @sv
example: Eduskunnan pankkivaltuusto
example: Riksdagens bankfullmäktige @sv
in scheme: Metatietosanasto
preferred label: delegation @sv

lennosto
type: Concept
source: Kansallinen RDA-termi
source: Nationell RDA-term @sv
created: 2021-04-20
modified: 2024-08-27
broader: sotilasyksikkö
definition: Ilmavoimien operatiivinen joukko-osasto, joka jakaantuu yhteen tai useampaan laivueeseen (Wikipedia).
definition: Operativt truppförband inom flygvapnet, som kan indelas i flera divisioner. @sv
in scheme: Metatietosanasto
preferred label: flygflottilj @sv

lukio
type: Concept
source: Kansallinen RDA-termi
source: Nationell RDA-term @sv
created: 2021-04-20
modified: 2024-12-18
alternative label: aikuislukio
alternative label: iltalukio
alternative label: lukio (yhteisötyyppi)
alternative label: lyseo (lukio)
alternative label: musiikkilukio
alternative label: taidelukio
alternative label: konstgymnasium @sv
alternative label: kvällsgymnasium @sv
alternative label: lyceum @sv
alternative label: musikgymnasium @sv
alternative label: vuxengymnasium @sv
broader: oppilaitos
definition: Peruskoulu-uudistuksen jälkeen toisen asteen yleissivistävistä oppilaitoksista käytetty nimitys.
definition: Läraoanstalt som ger allmänbildande undervisning på andra stadiet. @sv
in scheme: Metatietosanasto
preferred label: gymnasium @sv

poikakuoro
type: Concept
source: Kansallinen RDA-termi
source: Nationell RDA-term @sv
created: 2021-04-20
modified: 2024-05-24
alternative label: pojkkör @sv
broader: kuoro
in scheme: Metatietosanasto
preferred label: gosskör @sv

kilpailu (tapahtuma)
type: Concept
source: Kansallinen RDA-termi
source: Nationell RDA-term @sv
created: 2021-04-20
modified: 2024-05-24
alternative label: kilpa (tapahtuma)
alternative label: kisat (tapahtumat)
alternative label: tävling (evenemang) @sv
broader: tapahtuma
definition: Tilaisuus, jossa kilpaillaan, esim. kisa(t), ottelu(t), turnaus (Kielitoimiston sanakirja).
definition: Tillfälle för tävling, t.ex. mästerskap, match, turnering. @sv
in scheme: Metatietosanasto
preferred label: tävling @sv
scope note: Urheilukilpailuista käytetään termiä urheilutapahtuma.
scope note: Om idrottstävlingar används termen sportevenemang. @sv

sotilasopetuslaitos
type: Concept
source: Kansallinen RDA-termi
source: Nationell RDA-term @sv
created: 2021-04-20
modified: 2024-12-18
alternative label: kadettikoulu
alternative label: maanpuolustuskorkeakoulu
alternative label: maanpuolustusopisto
alternative label: reserviupseerikoulu
alternative label: upseerikoulu
alternative label: försvarshögskola @sv
alternative label: försvarsinstitut @sv
alternative label: kadettskola @sv
alternative label: officersskola @sv
alternative label: reservofficersskola @sv
broader: oppilaitos
in scheme: Metatietosanasto
preferred label: militär undervisningsanstalt @sv

ammatillinen oppilaitos
type: Concept
source: Kansallinen RDA-termi
source: Nationell RDA-term @sv
created: 2021-04-20
modified: 2024-12-18
alternative label: ammatillinen aikuiskoulutuskeskus
alternative label: ammatillinen erityisoppilaitos
alternative label: ammatti-instituutti
alternative label: ammattikoulu
alternative label: ammattikoulujen opettajaopisto
alternative label: ammattiopisto
alternative label: ammattioppilaitos
alternative label: hotelli- ja ravintolaoppilaitos
alternative label: kauppaoppilaitos
alternative label: kieli-instituutti
alternative label: koti- ja laitostalousoppilaitos
alternative label: kotiteollisuusoppilaitos
alternative label: kuljetusalan oppilaitos
alternative label: käsi- ja taideteollisuusalan oppilaitos
alternative label: maatalousalan oppilaitos
alternative label: merenkulkuoppilaitos
alternative label: metsä- ja puutalousoppilaitos
alternative label: sairaanhoito-oppilaitos
alternative label: sosiaalialan oppilaitos
alternative label: suojelualan oppilaitos
alternative label: taideoppilaitos
alternative label: teknillinen oppilaitos
alternative label: terveydenhuolto-oppilaitos
alternative label: urheiluoppilaitos
alternative label: viestintäalan oppilaitos
alternative label: yrkesinriktad läroanstalt @sv
alternative label: yrkesinstitut @sv
alternative label: yrkesläroinrättning @sv
alternative label: yrkesskola @sv
broader: oppilaitos
definition: Toiseen asteen ammattiin valmistava oppilaitos.
definition: Andra stadiets läroanstalt som ger utbildning för ett yrke. @sv
in scheme: Metatietosanasto
preferred label: yrkesläroanstalt @sv

kiinteistöyhtiö
type: Concept
source: Kansallinen RDA-termi
source: Nationell RDA-term @sv
created: 2021-04-20
modified: 2024-05-24
alternative label: asunto-osakeyhtiö
alternative label: keskinäinen kiinteistöosakeyhtiö
alternative label: kiinteistöosakeyhtiö
alternative label: taloyhtiö
alternative label: bostadsaktiebolag @sv
alternative label: fastighetsaktiebolag @sv
alternative label: husbolag @sv
broader: yhtiö
definition: Kiinteistön hallintaa ja omistusta hoitava yhtiö.
definition: Bolag som sköter ägo och förvaltning av en fastighet. @sv
in scheme: Metatietosanasto
preferred label: fastighetsbolag @sv

esikunta
type: Concept
source: Kansallinen RDA-termi
source: Nationell RDA-term @sv
created: 2021-04-20
modified: 2024-05-24
alternative label: päämaja
alternative label: högkvarter @sv
broader: sotilasyksikkö
definition: Asevoimien johto-organisaatio, joka toimii komentajan apuna (Wikipedia).
definition: Ledningsorganisation för väpnade styrkor, som biträder kommendören. @sv
example: ilmavoimien esikunta
example: maavoimien esikunta
example: merivoimien esikunta
example: staben för landstridskrafterna @sv
example: staben för luftstridskrafterna @sv
example: staben för sjöstridskrafterna @sv
in scheme: Metatietosanasto
preferred label: stab @sv

laboratorio
type: Concept
source: Kansallinen RDA-termi
source: Nationell RDA-term @sv
created: 2021-04-20
modified: 2024-05-24
alternative label: laboratorio (laboratoriopalvelu)
alternative label: laboratorium (laboratorietjänster) @sv
definition: Laitos tai osasto, joka tarjoaa terveydenhuollon laboratoriopalveluita.
definition: Inrättning eller avdelning som erbjuder laboratorietjänster inom hälso- och sjukvård. @sv
in scheme: Metatietosanasto
preferred label: laboratorium @sv
related: terveydenhuoltolaitos

johtoryhmä
type: Concept
source: Kansallinen RDA-termi
source: Nationell RDA-term @sv
created: 2021-04-20
modified: 2024-05-24
alternative label: direktoraatti
alternative label: johtajisto
alternative label: direktorat @sv
alternative label: ledning @sv
alternative label: styrgrupp @sv
broader: toimielin
definition: Johtajaa johtamisessa tukeva, alemmista johtajista ja muista henkilöstön jäsenistöstä koostuva ryhmä.
definition: Grupp bestående av lägre chefer och andra medlemmar ur personalen, som stöder chefen i ledningen. @sv
in scheme: Metatietosanasto
preferred label: ledningsgrupp @sv

pataljoona
type: Concept
source: Kansallinen RDA-termi
source: Nationell RDA-term @sv
created: 2021-04-20
modified: 2024-05-24
broader: sotilasyksikkö
definition: Armeijan joukkoyksikkö, joka käsittää useamman perusyksikön. Pataljoonan komentajana toimii rauhan aikana everstiluutnantti tai majuri, sodan aikana kapteeni tai yliluutnantti (Wikipedia).
definition: Truppenhet i armé, som omfattar flera grundenheter och som under fredstid leds av en överstelöjtnant eller major och under krigstid av en kapten eller premiärlöjtnant. @sv
in scheme: Metatietosanasto
preferred label: bataljon @sv

ammattikorkeakoulu
type: Concept
source: Kansallinen RDA-termi
source: Nationell RDA-term @sv
created: 2021-04-20
modified: 2024-12-18
alternative label: ammatilliset opettajakorkeakoulut
alternative label: korkeakoulu (ammattikorkeakoulu, yhteisötyyppi)
broader: oppilaitos
definition: Koulutusorganisaatio, jonka tehtävänä on tarjota työelämän vaatimuksiin sekä tutkimukseen, taiteellisiin ja sivistyksellisiin lähtökohtiin perustuvaa opetusta, joka tähtää ammatillisiin asiantuntijatehtäviin (Opetus- ja koulutussanasto).
definition: Utbildningsorganisation med uppgift att erbjuda undervisning som är grundad på arbetslivets krav, forskning, konstnärliga och utbildningsmässiga utgångspunkter, och som åsyftar professionella expertuppgifter. @sv
in scheme: Metatietosanasto
preferred label: yrkeshögskola @sv

konferenssi/seminaari
type: Concept
source: Kansallinen RDA-termi
source: Nationell RDA-term @sv
created: 2021-04-20
modified: 2024-05-24
alternative label: kokous (konferenssi)
alternative label: konferenssi
alternative label: kongressi
alternative label: opintopäivät
alternative label: seminaari
alternative label: symposiumi
alternative label: konferens @sv
alternative label: kongress @sv
alternative label: seminarium @sv
alternative label: symposium @sv
broader: tapahtuma
in scheme: Metatietosanasto
preferred label: konferens/seminarium @sv

peruskoulu
type: Concept
source: Kansallinen RDA-termi
source: Nationell RDA-term @sv
created: 2021-04-20
modified: 2024-12-18
alternative label: ala-aste
alternative label: alakoulu
alternative label: peruskoulu (yhteisötyyppi)
alternative label: yläaste
alternative label: yläkoulu
alternative label: grundskola (institutionstyp) @sv
alternative label: högstadium @sv
alternative label: lågstadium @sv
broader: oppilaitos
definition: Oppilaitos, joka antaa yhdeksänvuotiseksi mitoitettua perusopetusta (Opetus- ja koulutussanasto).
definition: Läroanstalt som erbjuder nioårig grundläggande utbildning. @sv
in scheme: Metatietosanasto
preferred label: grundskola @sv

hallintotuomioistuin
type: Concept
source: Kansallinen RDA-termi
source: Nationell RDA-term @sv
created: 2021-04-20
modified: 2024-05-24
alternative label: hallinto-oikeus
alternative label: lääninoikeus
alternative label: förvaltningsrätt @sv
alternative label: länsrätt @sv
broader: tuomioistuin
definition: Hallinto-oikeudellisia asioita käsittelevä tuomioistuin (Kielitoimiston sanakirja).
definition: Domstol som behandlar förvaltningsrättsliga ärenden. @sv
in scheme: Metatietosanasto
preferred label: förvaltningsdomstol @sv

armeijakunta
type: Concept
source: Kansallinen RDA-termi
source: Nationell RDA-term @sv
created: 2021-04-20
modified: 2025-05-27
broader: sotilasyksikkö
definition: Itsenäisiin sotatoimiin pystyvä armeijan sotatoimiyhtymä, johon kuuluu kaikkia sen tehtävään tarvitsemia maavoimien aselajeja (Wikipedia).
definition: Militärt förband med förmåga till självständiga krigsoperationer och med alla de arméns vapenslag som behövs för uppgiften. @sv
example: Suomen I armeijakunta (jatkosota)
example: Finlands I armékår (fortsättningskriget) @sv
in scheme: Metatietosanasto
preferred label: armékår @sv

vanhustenhuoltolaitos
type: Concept
source: Kansallinen RDA-termi
source: Nationell RDA-term @sv
created: 2021-04-20
modified: 2024-05-24
alternative label: hoitokoti
alternative label: kunnalliskoti
alternative label: vaivaiskoti
alternative label: vanhainkoti
alternative label: kommunalhem @sv
alternative label: vårdhem @sv
alternative label: vårdinstitution för åldringar @sv
alternative label: äldrehem @sv
alternative label: ålderdomshem @sv
alternative label: åldringshem @sv
broader: sosiaalihuoltolaitos
in scheme: Metatietosanasto
preferred label: vårdinrättning för äldre @sv

patteristo
type: Concept
source: Kansallinen RDA-termi
source: Nationell RDA-term @sv
created: 2021-04-20
modified: 2024-08-27
alternative label: artilleridivision @sv
alternative label: sektion (militär) @sv
broader: sotilasyksikkö
definition: Pataljoonaa vastaava tykistön joukkoyksikkö, johon kuuluu yleensä kolme tulipatteria sekä esikunta- ja huoltopatteri (Wikipedia).
definition: Truppenhet inom artilleri. @sv
in scheme: Metatietosanasto
preferred label: sektion @sv

päiväkoti
type: Concept
source: Kansallinen RDA-termi
source: Nationell RDA-term @sv
created: 2021-04-20
modified: 2024-05-24
alternative label: lastentarha
alternative label: barnträdgård @sv
broader: sosiaalihuoltolaitos
in scheme: Metatietosanasto
preferred label: daghem @sv

sotasairaala
type: Concept
source: Kansallinen RDA-termi
source: Nationell RDA-term @sv
created: 2021-04-20
modified: 2024-05-24
alternative label: kenttäsairaala
alternative label: sotilassairaala
alternative label: fältsjukhus @sv
alternative label: soldatsjukhus @sv
broader: sairaala
definition: Sodanaikainen lääkintähuoltoyksikkö.
definition: Enhet för medicinalvård under krigstid. @sv
in scheme: Metatietosanasto
preferred label: krigssjukhus @sv

armeija
type: Concept
source: Kansallinen RDA-termi
source: Nationell RDA-term @sv
created: 2021-04-20
modified: 2024-05-24
broader: sotilasyksikkö
definition: Sotatoimiyhtymä, joka koostuu esikunnasta ja yleensä armeijakunnista, jotka on edelleen jaettu divisiooniin tai prikaateihin (Wikipedia).
definition: Militär enhet som består av stab och vanligen armékårer, som vidare är indelade i divisioner eller brigader. @sv
example: Kannaksen armeija
example: Näsets armé @sv
in scheme: Metatietosanasto
preferred label: armé @sv

sinfoniaorkesteri
type: Concept
source: Kansallinen RDA-termi
source: Nationell RDA-term @sv
created: 2021-04-20
modified: 2024-05-24
broader: orkesteri
in scheme: Metatietosanasto
preferred label: symfoniorkester @sv

harjoittelukoulu
type: Concept
source: Kansallinen RDA-termi
source: Nationell RDA-term @sv
created: 2021-04-20
modified: 2025-12-06
alternative label: normaalikoulu
alternative label: normalskola @sv
broader: oppilaitos
definition: Yliopistojen kasvatustieteelliseen tiedekuntaan kuuluva oppilaitos, jossa opettajakokelaat harjoittelevat. Ennen peruskoulu-uudistusta kansakoulunopettajien koulutuksesta vastanneiden opettajaseminaarien harjoittelukoulu.
definition: Läroinrättning som hör till en pedagogisk fakultet vid ett universitet, där lärarstuderande praktiserar. @sv
in scheme: Metatietosanasto
preferred label: övningsskola @sv

valtuusto
type: Concept
source: Kansallinen RDA-termi
source: Nationell RDA-term @sv
created: 2021-04-20
modified: 2024-05-24
alternative label: kaupunginvaltuusto
alternative label: kirkkovaltuusto
alternative label: kunnanvaltuusto
alternative label: fullmäktigeförsamling @sv
alternative label: kommunalfullmäktige @sv
alternative label: kommunfullmäktige @sv
alternative label: kyrkofullmäktige @sv
alternative label: stadsfullmäktige @sv
broader: toimielin
definition: Yhteisössä päätösvaltaa käyttävä edustajisto (Kielitoimiston sanakirja).
definition: Församling representanter med beslutanderätt i en institution. @sv
in scheme: Metatietosanasto
preferred label: fullmäktige @sv

erityistuomioistuin
type: Concept
source: Kansallinen RDA-termi
source: Nationell RDA-term @sv
created: 2021-04-20
modified: 2024-05-24
alternative label: aksiisioikeus
alternative label: hallioikeus
alternative label: linnaoikeus
alternative label: maaoikeus
alternative label: tarkastusoikeus
alternative label: vesioikeus
alternative label: accisrätt @sv
alternative label: hallrätt @sv
alternative label: jorddomstol @sv
alternative label: prövningsrätt @sv
alternative label: slottsrätt @sv
alternative label: vattendomstol @sv
broader: tuomioistuin
definition: Laissa erikseen määrättyjä asiaryhmiä käsittelevä tuomioistuin (Kielitoimiston sanakirja).
definition: Domstol som behandlar ärendekategorier skilt bestämda i lagen. @sv
example: markkinaoikeus, työtuomioistuin, vakuutusoikeus, valtakunnanoikeus, vesioikeus, maaoikeus
example: marknadsdomstolen, arbetsdomstolen, försäkringsdomstolen, riksrätten, vattendomstolen, jorddomstolen @sv
in scheme: Metatietosanasto
preferred label: specialdomstol @sv

hoitokunta
type: Concept
source: Kansallinen RDA-termi
source: Nationell RDA-term @sv
created: 2021-04-20
modified: 2024-05-24
broader: toimielin
definition: Jonkin hoitamisesta huolehtiva elin (Kielitoimiston sanakirja), jota kutsutaan hoitokunnaksi.
definition: Organ som handhar skötseln av något och som benämns förvaltningsnämnd. @sv
in scheme: Metatietosanasto
preferred label: förvaltningsnämnd @sv

patteri
type: Concept
source: Kansallinen RDA-termi
source: Nationell RDA-term @sv
created: 2021-04-20
modified: 2024-08-27
broader: sotilasyksikkö
definition: Komppaniaa vastaava tykistön perusyksikkö (Wikipedia).
definition: Grundenhet vid artilleri. @sv
in scheme: Metatietosanasto
preferred label: batteri @sv

lastensuojelulaitos
type: Concept
source: Kansallinen RDA-termi
source: Nationell RDA-term @sv
created: 2021-04-20
modified: 2024-05-24
alternative label: kasvatuslaitos
alternative label: koulukoti
alternative label: lastenkoti
alternative label: nuorisoasema
alternative label: nuorisokoti
alternative label: vastaanottokoti
alternative label: barnhem @sv
alternative label: barnskyddsinstitution @sv
alternative label: mottagningshem @sv
alternative label: skolhem @sv
alternative label: ungdomshem @sv
alternative label: ungdomsstation @sv
alternative label: uppfostringsanstalt @sv
broader: sosiaalihuoltolaitos
in scheme: Metatietosanasto
preferred label: barnskyddsanstalt @sv

opisto
type: Concept
source: Kansallinen RDA-termi
source: Nationell RDA-term @sv
created: 2021-04-20
modified: 2024-12-18
alternative label: aikuisopisto
alternative label: kansalaisopisto
alternative label: kansanopisto
alternative label: kesäyliopisto
alternative label: liikunnan koulutuskeskus
alternative label: opintokeskus
alternative label: työväenopisto
alternative label: vapaaopisto
alternative label: arbetarinstitut @sv
alternative label: folkhögskola @sv
alternative label: medborgarinstitut @sv
alternative label: sommaruniversitet @sv
alternative label: studiecenter @sv
alternative label: vuxeninstitut @sv
broader: oppilaitos
definition: Yleissivistävää tai erikoisalan opetusta tai ammattikoulutusta antavia vapaansivistystyön oppilaitoksia (Kielitoimiston sanakirja).
definition: Läroanstalt inom fritt bildningsarbete som ger allmänbildande eller specialiserad undervisning. @sv
in scheme: Metatietosanasto
preferred label: institut @sv

maistraatti
type: Concept
source: Kansallinen RDA-termi
source: Nationell RDA-term @sv
created: 2021-04-20
modified: 2024-05-24
definition: Historiallinen termi. Maistraatit olivat vuoteen 1978 asti niin sanottujen vanhojen kaupunkien, eli ennen vuotta 1959 perustettujen kaupunkien, virastoja, jotka ratkaisivat mm. lupa-asioita ja joilla oli toimivaltaa järjestysasioissa. Maistraatti toimi myös ulosotonhaltijana ja suoritti kiinteistöjen pakkohuutokaupat alueellaan sekä toimi muutoksenhakuelimenä kaupunginvoutien ratkaisuihin (Arkistojen portti).
definition: Historisk term. Ämbetsverk i städer fram till år 1978 som bl.a. avgjorde tillståndsärenden och som hade befogenheter i ordningsmål etc. Magistrater fungerade också som överexekutor och utförde exekutiva auktioner av fastigheter på sina områden, samt fungerade som besvärsinstans för statsfogdars avgöranden. @sv
in scheme: Metatietosanasto
preferred label: magistrat @sv
related: järjestysoikeus
scope note: Ei käytetä vuoden 1996 kihlakuntauudistuksen myötä perustetuista maistraateista.
scope note: Används inte om magistrat som grundades i samband med häradsreformen år 1996. @sv

perhekeskus
type: Concept
source: Kansallinen RDA-termi
source: Nationell RDA-term @sv
created: 2021-04-20
modified: 2024-05-24
alternative label: familjecentral @sv
broader: sosiaalihuoltolaitos
definition: Yhteensovitettu lasten, nuorten ja perheiden hyvinvoinnin ja avuntarpeisiin vastaava palveluverkosto, joka toimii ja jota johdetaan yhtenä kokonaisuutena.
definition: Samordnat servicenätverk för barn, ungdomars och familjers välmående och hjälpbehov, som fungerar och leds som en helhet. @sv
in scheme: Metatietosanasto
preferred label: familjecenter @sv

järjestysoikeus
type: Concept
source: Kansallinen RDA-termi
source: Nationell RDA-term @sv
created: 2021-04-20
modified: 2024-05-24
definition: Historiallinen termi. Järjestysoikeus oli yleistä hallintoa, järjestystä ja taloutta käsittelevä julkinen hallintoviranomainen ja tuomioistuin Suomen kauppaloissa sekä vuodesta 1960 lähtien myös uusissa kaupungeissa, joissa ei ollut raas­tuvan­oikeutta eikä maistraattia (Wikipedia).
definition: Historisk term. Offentlig förvaltningsmyndighet och domstol som skötte allmän förvaltning, ordning och ekonomi i finländska köpingar, och fr.o.m. år 1960 också i nya städer som inte hade rådstuvurätt eller magistrat. @sv
in scheme: Metatietosanasto
preferred label: ordningsrätt @sv
related: maistraatti

henkilöyhtiö
type: Concept
source: Kansallinen RDA-termi
source: Nationell RDA-term @sv
created: 2021-04-20
modified: 2024-05-24
alternative label: avoin yhtiö
alternative label: kommandiittiyhtiö
alternative label: kommanditbolag @sv
alternative label: öppet bolag @sv
broader: yhtiö
definition: Kahden tai useamman oikeushenkilön tai luonnollisen henkilön yhteistoimintaan perustuva yritysmuoto, jolle on tunnusomaista yhtiön itsenäisyys (henkilöyhtiö on omistajistaan erillinen oikeussubjekti), yhtiömiesten henkilökohtainen osallistuminen yhtiön toimintaan ja heidän rajaton vastuunsa yhtiön velvoitteista sekä yhtiöllä oleva tietty taloudellinen tarkoitus. (Tieteen termipankki.)
definition: Företagsform som grundar sig på samverkan mellan två eller flera juridiska eller naturliga personer, och som karakteriseras av bolagets självständighet, bolagsmännens personliga deltagande i bolagets verksamhet och deras obegränsade ansvar för bolagets åligganden, samt det specifika ekonomiska syfte som bolaget har. @sv
in scheme: Metatietosanasto
preferred label: personbolag @sv

linnake
type: Concept
source: Kansallinen RDA-termi
source: Nationell RDA-term @sv
created: 2021-04-20
modified: 2024-05-24
alternative label: merilinnake
alternative label: havsfort @sv
broader: sotilasyksikkö
definition: Merivoimien rannikkojoukkojen sotilasyksikkö (Wikipedia).
definition: Militär enhet för marinens kuststyrkor. @sv
in scheme: Metatietosanasto
preferred label: fort @sv

tyttökuoro
type: Concept
source: Kansallinen RDA-termi
source: Nationell RDA-term @sv
created: 2021-04-20
modified: 2024-05-24
broader: kuoro
in scheme: Metatietosanasto
preferred label: flickkör @sv

kansakoulu
type: Concept
source: Kansallinen RDA-termi
source: Nationell RDA-term @sv
created: 2021-04-20
modified: 2024-12-18
alternative label: kansalaiskoulu
alternative label: medborgarskola @sv
broader: oppilaitos
definition: Historiallinen termi. Kansakoulu oli Suomessa aluksi nelivuotinen oppilaitos, joita alettiin perustaa vuoden 1866 kansakouluasetuksen myötä. Asetuksen mukaan kaupungit velvoitettiin perustamaan kansakouluja, mutta maaseudulla kunta sai päättää. 1800-luvun loppupuolella ja 1900-luvun alkupuolella kiertokoulut olivat maaseudulla tärkeitä. Vuonna 1921 tuli voimaan oppivelvollisuuslaki, jolloin kansakoulu muuttui kuusivuotiseksi ja kiertokoulut lakkautettiin. Kansakoulut lakkautettiin peruskoulu-uudistuksen yhteydessä 1970-luvulla. (Wikipedia.)
definition: Historisk term. Folkskolan var i Finland till en början en fyraårig skola som började grundas i samband med folkskolförordningen år 1866. Enligt förordningen ålades städerna att grunda folkskolor, men på landsbygden fick kommunerna bestämma själva. Kring sekelskiftet var ambulatoriska skolor viktiga på landsbygden. År 1921 trädde lagen om läroplikt i kraft och då blev folkskolan sexårig och de ambulatoriska skolorna upphävdes. Folkskolorna upphävdes i samband med grundskolereformen på 1970-talet. @sv
in scheme: Metatietosanasto
preferred label: folkskola @sv
scope note: Yhteisötermiä käytetään myös kansalaiskouluista, joka on varsinaisen kansakoulun jatkokoulu.
scope note: Termen används även om medborgarskolor, som var en fortsättning på den egentliga folkskolan. @sv

opettajaseminaari
type: Concept
source: Kansallinen RDA-termi
source: Nationell RDA-term @sv
created: 2021-04-20
modified: 2024-12-18
alternative label: seminaari (opettajaseminaari)
alternative label: seminarium (lärarseminarium) @sv
broader: oppilaitos
definition: Historiallinen termi. Kansakoulunopettajien opettajanvalmistuslaitoksesta käytetty nimitys 1863-1973.
definition: Historisk term. Benämning på inrättning för folkskollärarutbildning år 1863-1973. @sv
in scheme: Metatietosanasto
preferred label: lärarseminarium @sv

keskusvirasto
type: Concept
source: Kansallinen RDA-termi
source: Nationell RDA-term @sv
created: 2021-04-20
modified: 2024-05-24
alternative label: julkisoikeudellinen laitos
broader: viranomainen
definition: Jonkin ministeriön alainen, valtakunnallinen viranomainen tai erillislaitos.
definition: Nationell myndighet eller fristående institution, som befinner sig under ett ministerium. @sv
in scheme: Metatietosanasto
preferred label: centralt ämbetsverk @sv

valtion liikelaitos
type: Concept
source: Kansallinen RDA-termi
source: Nationell RDA-term @sv
created: 2021-04-20
modified: 2024-05-24
broader: liikelaitos
definition: Valtion omistama liiketoimintaa harjoittava organisaatio.
definition: Organisation i statens ägo, som utövar affärsverksamhet. @sv
in scheme: Metatietosanasto
preferred label: statligt affärsverk @sv

eskadroona
type: Concept
source: Kansallinen RDA-termi
source: Nationell RDA-term @sv
created: 2021-04-20
modified: 2024-08-27
broader: sotilasyksikkö
definition: Historiallinen termi. Ratsuväen perusyksikkö.
definition: Historisk term. Grundenhet vid kavalleri. @sv
in scheme: Metatietosanasto
preferred label: skvadron @sv

laivue (ilmavoimat)
type: Concept
source: Kansallinen RDA-termi
source: Nationell RDA-term @sv
created: 2021-04-20
modified: 2024-08-27
broader: sotilasyksikkö
definition: Ilmavoimissa kolmen tai neljän lentueen muodostama joukkoyksikkö (Wikipedia).
definition: Truppenhet inom flygvapnet. @sv
in scheme: Metatietosanasto
preferred label: flottilj (flygvapnet) @sv

sotilastukikohta
type: Concept
source: Kansallinen RDA-termi
source: Nationell RDA-term @sv
created: 2021-04-20
modified: 2024-05-24
alternative label: tukikohta
alternative label: bas @sv
broader: sotilasyksikkö
definition: Asevoimien tukikohta, johon on sijoitettu sotajoukkoja ja -kalustoa.
definition: Bas för vapenmakt, vid vilken militära styrkor och materiel är placerad. @sv
in scheme: Metatietosanasto
preferred label: militärbas @sv

neuvosto
type: Concept
source: Kansallinen RDA-termi
source: Nationell RDA-term @sv
created: 2021-04-20
modified: 2024-05-24
alternative label: hallintoneuvosto
alternative label: förvaltningsråd @sv
broader: toimielin
definition: Valtion, yhtiön tai muun yhteisön päättävä tai neuvoa antava elin (Kielitoimiston sanakirja).
definition: Beslutande eller rådgivande organ för stat, bolag eller annan institution. @sv
in scheme: Metatietosanasto
preferred label: råd @sv

laivue (merivoimat)
type: Concept
source: Kansallinen RDA-termi
source: Nationell RDA-term @sv
created: 2021-04-20
modified: 2024-08-27
broader: sotilasyksikkö
definition: Merivoimien joukkoyksikkö, joka koostuu viiriköistä tai alusperusyksiköistä (Wikipedia).
definition: Truppenhet inom marinen. @sv
in scheme: Metatietosanasto
preferred label: flottilj (marinen) @sv

lippue
type: Concept
source: Kansallinen RDA-termi
source: Nationell RDA-term @sv
created: 2021-04-20
modified: 2024-08-27
alternative label: marineskader @sv
broader: sotilasyksikkö
definition: Merivoimien joukko-osasto, johon kuuluu 3-6 laivuetta sekä esikunta ja huoltoyksiköt (Wikipedia).
definition: Truppförband inom marinen. @sv
in scheme: Metatietosanasto
preferred label: flottavdelning @sv

alun perin julkaistu
type: Concept
source: Kansallinen RDA-termi
source: Nationell RDA-term @sv
created: 2021-05-01
modified: 2025-01-08
alternative label: ursprungligen publicerad @sv
broader: samansisältöinen aineisto
in scheme: Metatietosanasto
preferred label: ursprungligen utgiven @sv

oikeussihteeri
type: Concept
source: Kansallinen RDA-termi
source: Nationell RDA-term @sv
created: 2021-06-17
modified: 2025-11-04
broader: sihteeri
in scheme: Metatietosanasto
preferred label: justitiesekreterare @sv

erityisasiantuntija
type: Concept
source: Kansallinen RDA-termi
source: Nationell RDA-term @sv
created: 2021-11-13
modified: 2025-11-04
alternative label: specialexpert @sv
broader: asiantuntija
in scheme: Metatietosanasto
preferred label: specialsakkunnig @sv

hiippakunta
type: Concept
source: Kansallinen RDA-termi
source: Nationell RDA-term @sv
created: 2021-12-08
modified: 2025-08-23
alternative label: biskopsstift @sv
alternative label: stift (kyrkan) @sv
definition: Kirkon aluehallinnon yksikkö tai sen toimialue.
definition: Administrativ enhet eller verksamhetsområde för kyrkans regionalförvaltning. @sv
example: Kuopion hiippakunta; Helsingin arkkihiippakunta; Helsingin katolinen hiippakunta
example: Kuopio stift; Helsingfors ärkestift; Helsingfors katolska stift @sv
in scheme: Metatietosanasto
preferred label: stift @sv
related: rovastikunta

osavaltio
type: Concept
source: Kansallinen RDA-termi
source: Nationell RDA-term @sv
created: 2021-12-08
modified: 2025-08-23
definition: Liittovaltion osa tai sen toimialue, jota kutsutaan osavaltioksi.
definition: Del av förbundsstat eller dess verksamhetsområde som kallas delstat. @sv
example: Alaska (Yhdysvallat); Hessen (Saksa)
example: Alaska (Förenta staterna); Hessen (Tyskland) @sv
in scheme: Metatietosanasto
preferred label: delstat @sv
related: valtio (hallintoalue)

alusmaa
type: Concept
source: Kansallinen RDA-termi
source: Nationell RDA-term @sv
created: 2021-12-08
modified: 2025-08-23
alternative label: kolonia (siirtomaa)
alternative label: protektoraatti
alternative label: siirtomaa
alternative label: koloni @sv
alternative label: protektorat @sv
definition: Jonkin valtion alainen, yleensä sen rajojen ulkopuolinen epäitsenäinen alue. Myös aluetta hallinnoiva yhteisö.
definition: Osjälvständigt område i någon stats besittning, vanligtvis utanför statens egna gränser. Även institution som förvaltar området. @sv
example: Kapmaa; Saksan Uusi-Guinea; Uusi-Ranska
example: Kapprovinsen; Tyska Nya Guinea; Nya Frankrike @sv
in scheme: Metatietosanasto
preferred label: besittning @sv
related: itsehallintoalue

rovastikunta
type: Concept
source: Kansallinen RDA-termi
source: Nationell RDA-term @sv
created: 2021-12-08
modified: 2025-08-23
alternative label: kontrakt (prosteri) @sv
definition: Suomen evankelis-luterilaisen kirkon hiippakunnan hallinnollinen osa tai sen toimialue.
definition: Administrativ del av stift eller dess verksamhetsområde inom Evangelisk-lutherska kyrkan i Finland. @sv
example: Tampereen tuomiorovastikunta; Kangasalan rovastikunta
example: Tammerfors domprosteri; Kangasala prosteri @sv
in scheme: Metatietosanasto
preferred label: prosteri @sv
related: hiippakunta

itsehallintoalue
type: Concept
source: Kansallinen RDA-termi
source: Nationell RDA-term @sv
created: 2021-12-08
modified: 2025-08-23
alternative label: autonom region @sv
alternative label: autonomt område @sv
definition: Valtion hallinnollinen tai valtiosta riippuvainen alue, jolle on määritelty jonkinasteinen itsehallinto tai autonomia (Wikipedia). Myös alueella oleva itsehallinnollinen yhteisö.
definition: Område tillhörande eller beroende av en stat, men med någon form av självstyre eller autonomi. Även självstyrande institution på området. @sv
example: Ahvenanmaa; Grönlanti
example: Åland; Grönland @sv
in scheme: Metatietosanasto
preferred label: självstyrelseområde @sv
related: alusmaa

vapaaherrakunta
type: Concept
source: Kansallinen RDA-termi
source: Nationell RDA-term @sv
created: 2021-12-08
modified: 2025-08-23
alternative label: läänitys (vapaaherrakunta)
alternative label: förläning (friherreskap) @sv
definition: Tarkoitetaan Suomeen 1500- ja 1600-luvuilla perustettuja feodaalisia vapaaherrakuntia ja niiden läänityksiä.
definition: Avser feodala friherreskap och sådana förläningar som grundades i Finland på 1500-1600-talen. @sv
example: Limingan vapaaherrakunta
example: Limingo friherreskap @sv
in scheme: Metatietosanasto
preferred label: friherreskap @sv
related: kreivikunta

valtio (hallintoalue)
type: Concept
source: Kansallinen RDA-termi
source: Nationell RDA-term @sv
created: 2021-12-08
modified: 2025-08-23
alternative label: kansantasavalta
alternative label: keisarikunta
alternative label: kuningaskunta
alternative label: liittovaltio
alternative label: ruhtinaskunta
alternative label: tasavalta
alternative label: valtakunta
alternative label: federation @sv
alternative label: folkrepublik @sv
alternative label: furstendöme @sv
alternative label: förbundsstat @sv
alternative label: kejsardöme @sv
alternative label: konungarike @sv
alternative label: kungarike @sv
alternative label: republik @sv
alternative label: rike @sv
definition: Itsenäinen valtio tai sen hallinnoima alue.
definition: Självständig stat eller område som den besitter. @sv
example: Suomi; Iso-Britannia; Japani; Monaco; Pohjois-Korea; Australia
example: Finland; Storbritannien; Japan; Monaco; Nordkorea; Australien @sv
in scheme: Metatietosanasto
preferred label: stat (förvaltningsområde) @sv
related: osavaltio

kreivikunta
type: Concept
source: Kansallinen RDA-termi
source: Nationell RDA-term @sv
created: 2021-12-08
modified: 2025-08-23
alternative label: läänitys (kreivikunta)
alternative label: förläning (grevskap) @sv
definition: Tarkoitetaan Suomeen 1500- ja 1600-luvuilla perustettuja feodaalisia kreivikuntia ja niiden läänityksiä.
definition: Avser feodala grevskap och förläningar som grundades i Finland på 1500- och 1600-talen. @sv
example: Raaseporin kreivikunta
example: Raseborgs grevskap @sv
in scheme: Metatietosanasto
preferred label: grevskap @sv
related: vapaaherrakunta

sisustusarkkitehti
type: Concept
source: Kansallinen RDA-termi
source: Nationell RDA-term @sv
created: 2021-12-18
modified: 2025-05-27
alternative label: sisustusarkkitehti (suhde)
alternative label: inredningsarkitekt (relation) @sv
broader: teoksen tekijä
definition: Liittää teoksen henkilöön, joka vastaa sisustuksen taiteellisesta suunnittelusta.
definition: Sammankopplar verk med en person som svarar för den konstnärliga planeringen av inredning. @sv
in scheme: Metatietosanasto
preferred label: inredningsarkitekt @sv
scope note: Teoksen tekijä.
scope note: Verkets skapare. @sv

taltioija
type: Concept
source: RDA-termi
source: RDA-term @sv
created: 2022-02-10
modified: 2025-08-21
alternative label: recordist @en
alternative label: taltioija (toimija)
broader: esitykseen osallinen toimija
definition: Toimija, joka osallistuu ekspression tekemiseen käyttämällä tallennuslaitetta äänen tai videon taltioimiseen tallennustilanteessa. (RDA Registry)
definition: Aktör som deltar i utförandet av ett uttryck, genom att använda en inspelningsapparat för att lagra ljud eller video vid ett inspelningstillfälle. @sv
in scheme: Metatietosanasto
preferred label: recordist agent @en
preferred label: inspelande aktör @sv
scope note: Sisältää luonnonäänten, musiikkiesitysten ja muiden tapahtumien kenttätallennukset. (RDA Registry)
scope note: Inbegriper fältinspelningar av naturljud, musikframföranden och andra evenemang. @sv

poliittiset järjestöt
type: Concept
source: Kansallinen RDA-termi
source: Nationell RDA-term @sv
created: 2022-03-15
modified: 2026-05-06
alternative label: protestiliikkeet
alternative label: puolueet (toimiala)
alternative label: puoluejärjestöt
alternative label: työväenjärjestöt
alternative label: työväenyhdistykset
alternative label: arbetarföreningar @sv
alternative label: arbetarorganisationer @sv
alternative label: partier (verksamhetsområde) @sv
alternative label: partiorganisationer @sv
alternative label: proteströrelser @sv
broader: järjestötoiminta
definition: Poliittiset puolueet, niiden paikallisyhdistykset, nais-, nuoriso- ja seniorijärjestöt ja muut aatteellisia ja laaja-alaisesti yhteiskunnallisia asioita ajavat järjestöt ja liikkeet.
definition: Politiska partier, deras lokalföreningar, kvinno-, ungdoms-, och seniororganisationer, samt andra organisationer och rörelser som driver ideella och övergripande samhälleliga frågor. @sv
in scheme: Metatietosanasto
preferred label: politiska organisationer @sv

elinkeinojärjestöt
type: Concept
source: Kansallinen RDA-termi
source: Nationell RDA-term @sv
created: 2022-03-15
modified: 2026-05-06
alternative label: kaupan järjestöt
alternative label: metsänhoitoyhdistykset
alternative label: talous- ja elinkeinojärjestöt
alternative label: työnantajajärjestöt
alternative label: yrittäjäjärjestöt
alternative label: arbetsgivarorganisationer @sv
alternative label: företagarorganisationer @sv
alternative label: handelns organisationer @sv
alternative label: näringsorganisationer @sv
alternative label: skogsvårdsföreningar @sv
broader: järjestötoiminta
definition: Tietyn toimialan elinkeinotoiminnan edistämistä ajavat etujärjestöt ja niiden yhteenliittymät, työnantajajärjestöt sekä taloudellista toimintaa ja yrittäjyyttä toimialasta riippumatta edistävät järjestöt.
definition: Intresseorganisationer och sammanslutningar av sådana som främjar näringsverksamhet inom en viss bransch, arbetsgivarorganisationer, samt organisationer som främjar ekonomisk verksamhet och företagsamhet, oberoende av bransch. @sv
in scheme: Metatietosanasto
preferred label: näringslivsorganisationer @sv

maanpuolustusjärjestöt
type: Concept
source: Kansallinen RDA-termi
source: Nationell RDA-term @sv
created: 2022-03-15
modified: 2026-05-06
alternative label: maanpuolustuskillat
alternative label: sotilaalliset järjestöt
alternative label: försvarsgillen @sv
alternative label: militära organisationer @sv
broader: järjestötoiminta
definition: Kansalaisten maanpuolustustahtoa ylläpitävät, vapaaehtoista maanpuolustustyötä tekevät ja sotilasperinteitä vaalivat järjestöt.
definition: Organisationer som upprätthåller medborgarnas försvarsvilja, utför frivilligt försvarsarbete och värnar om militära traditioner. @sv
in scheme: Metatietosanasto
preferred label: försvarsorganisationer @sv

kuluttajajärjestöt
type: Concept
source: Kansallinen RDA-termi
source: Nationell RDA-term @sv
created: 2022-03-15
modified: 2026-05-06
broader: järjestötoiminta
definition: Kuluttajien edunvalvonta- ja neuvontajärjestöt.
definition: Intressebevaknings- och rådgivningsorganisationer för konsumenter. @sv
in scheme: Metatietosanasto
preferred label: konsumentorganisationer @sv

sosiaalijärjestöt
type: Concept
source: Kansallinen RDA-termi
source: Nationell RDA-term @sv
created: 2022-03-15
modified: 2026-05-06
alternative label: huoltosäätiöt
alternative label: lastensuojelujärjestöt
alternative label: omaisjärjestöt
alternative label: vammaisjärjestöt
alternative label: anhörigorganisationer @sv
alternative label: barnskyddsorganisationer @sv
alternative label: handikapporganisationer @sv
alternative label: vårdstiftelser @sv
broader: järjestötoiminta
definition: Sosiaalipalveluiden asiakasryhmien ja heidän omaistensa edunvalvontaa harjoittavat sekä sosiaalipalveluita, neuvontaa ja vertaistukea tarjoavat järjestöt.
definition: Organisationer som bevakar klientgruppers samt anhörigas intressen inom socialservice, samt erbjuder socialservice, rådgivning och kamratstöd. @sv
in scheme: Metatietosanasto
preferred label: sociala organisationer @sv

uskonnolliset järjestöt
type: Concept
source: Kansallinen RDA-termi
source: Nationell RDA-term @sv
created: 2022-03-15
modified: 2026-05-06
broader: järjestötoiminta
definition: Kristilliset yhdistykset sekä eri uskontokuntia ja maailmankatsomuksia edustavat järjestöt.
definition: Kristna föreningar och organisationer som representerar olika religioner och livsåskådningar. @sv
in scheme: Metatietosanasto
preferred label: religiösa organisationer @sv

opiskelijajärjestöt
type: Concept
source: Kansallinen RDA-termi
source: Nationell RDA-term @sv
created: 2022-03-15
modified: 2026-05-06
alternative label: ainejärjestöt (toimiala)
alternative label: oppilaskunnat
alternative label: toverikunnat
alternative label: ylioppilasjärjestöt
alternative label: elevkårer @sv
alternative label: studentföreningar @sv
alternative label: ämnesföreningar (verksamhetsområde) @sv
broader: järjestötoiminta
definition: Opiskelijoiden edunvalvontaa harjoittavat järjestöt.
definition: Organisationer som bevakar studenters intressen. @sv
in scheme: Metatietosanasto
preferred label: studentorganisationer @sv

maatalousjärjestöt
type: Concept
source: Kansallinen RDA-termi
source: Nationell RDA-term @sv
created: 2022-03-15
modified: 2026-05-06
alternative label: maamiesseurat
alternative label: maataloussäätiöt
alternative label: lantbruksstiftelser @sv
alternative label: lantmannagillen @sv
broader: järjestötoiminta
definition: Maataloutta edistävät, maatalousneuvontaa tarjoavat järjestöt.
definition: Organisationer som främjar lantbruk och erbjuder lantbruksrådgivning. @sv
in scheme: Metatietosanasto
preferred label: lantbruksorganisationer @sv

eläkeläisjärjestöt
type: Concept
source: Kansallinen RDA-termi
source: Nationell RDA-term @sv
created: 2022-03-15
modified: 2026-05-06
alternative label: seniorijärjestöt
alternative label: pensionärsföreningar @sv
alternative label: seniororganisationer @sv
broader: järjestötoiminta
definition: Eläkkeensaajien ja ikäihmisten edunvalvonta- ja harrastusjärjestöt.
definition: Intressebevaknings- och hobbyorganisationer för pensionärer och äldre. @sv
in scheme: Metatietosanasto
preferred label: pensionärsorganisationer @sv

pelastusjärjestöt
type: Concept
source: Kansallinen RDA-termi
source: Nationell RDA-term @sv
created: 2022-03-15
modified: 2026-05-06
alternative label: vapaaehtoiset palokunnat
alternative label: väestönsuojeluyhdistykset
alternative label: befolkningsskyddsföreningar @sv
alternative label: frivilliga brandkårer @sv
broader: järjestötoiminta
definition: Pelastustyötä tekevät ja edistävät järjestöt.
definition: Organisationer som utför och främjar räddningsarbete. @sv
in scheme: Metatietosanasto
preferred label: räddningsorganisationer @sv

ympäristöjärjestöt
type: Concept
source: Kansallinen RDA-termi
source: Nationell RDA-term @sv
created: 2022-03-15
modified: 2026-05-06
alternative label: eläinsuojeluyhdistykset
alternative label: luonnonsuojelujärjestöt
alternative label: ympäristöyhdistykset
alternative label: djurskyddsföreningar @sv
alternative label: miljöföreningar @sv
alternative label: naturskyddsföreningar @sv
alternative label: naturskyddsorganisationer @sv
broader: järjestötoiminta
definition: Ympäristön- ja luonnonsuojelua, eläinten suojelua ja kestävää elämäntapaa edistävät järjestöt.
definition: Organisationer som främjar miljö- och naturskydd, djurskydd och hållbar livsstil. @sv
in scheme: Metatietosanasto
preferred label: miljöorganisationer @sv

rauhanjärjestöt
type: Concept
source: Kansallinen RDA-termi
source: Nationell RDA-term @sv
created: 2022-03-15
modified: 2026-05-06
alternative label: avustusjärjestöt
alternative label: humanitaariset järjestöt
alternative label: ihmisoikeusjärjestöt
alternative label: hjälporganisationer @sv
alternative label: humanitära organisationer @sv
alternative label: människorättsorganisationer @sv
broader: järjestötoiminta
definition: Rauhantyötä tekevät, rauhanaatetta edistävät, ihmisarvoa ja ihmisoikeuksia ylläpitävät ja inhimillistä hätää lievittävät järjestöt.
definition: Organisationer som utför fredsarbete, främjar fredstanken, stöder människovärdet och mänskliga rättigheter, samt lindrar mänsklig nöd. @sv
in scheme: Metatietosanasto
preferred label: fredsorganisationer @sv

nuorisojärjestöt
type: Concept
source: Kansallinen RDA-termi
source: Nationell RDA-term @sv
created: 2022-03-15
modified: 2026-05-06
alternative label: nuorisoseurat
alternative label: nuorisosäätiöt
alternative label: ungdomsföreningar @sv
alternative label: ungdomsstiftelser @sv
broader: järjestötoiminta
definition: Nuorisotyötä tekevät sekä lasten- ja nuorten hyvinvointia edistävät järjestöt.
definition: Organisationer som utför ungdomsarbete och främjar barns och ungdomars välmående. @sv
in scheme: Metatietosanasto
preferred label: ungdomsorganisationer @sv

raittiusjärjestöt
type: Concept
source: Kansallinen RDA-termi
source: Nationell RDA-term @sv
created: 2022-03-15
modified: 2026-05-06
alternative label: raittiusseurat
alternative label: nykterhetsföreningar @sv
broader: järjestötoiminta
definition: Raitista elämäntapaa edistävät järjestöt.
definition: Organisationer som främjar en nykter livsstil. @sv
in scheme: Metatietosanasto
preferred label: nykterhetsorganisationer @sv

sotaveteraanijärjestöt
type: Concept
source: Kansallinen RDA-termi
source: Nationell RDA-term @sv
created: 2022-03-15
modified: 2026-05-06
broader: järjestötoiminta
definition: Rintamapalveluun osallistuneiden miesten ja naisten järjestöt, niiden perinnejärjestöt ja sotainvalidijärjestöt.
definition: Organisationer för personer som deltagit i fronttjänst, deras traditionsorganisationer och krigsinvalidorganisationer. @sv
in scheme: Metatietosanasto
preferred label: krigsveteranorganisationer @sv

matkailualan järjestöt
type: Concept
source: Kansallinen RDA-termi
source: Nationell RDA-term @sv
created: 2022-03-15
modified: 2026-05-06
alternative label: matkailuyhdistykset
alternative label: turistbranschens organisationer @sv
alternative label: turistföreningar @sv
alternative label: turistorganisationer @sv
broader: järjestötoiminta
definition: Matkailua ja siihen liittyvää toimintaa edistävät järjestöt.
definition: Organisationer som främjar turism och därtillhörande verksamhet. @sv
in scheme: Metatietosanasto
preferred label: turismorganisationer @sv

hyväntekeväisyysjärjestöt
type: Concept
source: Kansallinen RDA-termi
source: Nationell RDA-term @sv
created: 2022-03-15
modified: 2026-05-06
alternative label: palvelujärjestöt
alternative label: välgörenhetsföreningar @sv
broader: järjestötoiminta
definition: Auttamis- ja hyväntekeväisyystyötä tekevät järjestöt.
definition: Organisationer som utför hjälp- och välgörenhetsarbete. @sv
in scheme: Metatietosanasto
preferred label: välgörenhetsorganisationer @sv

kotitalousjärjestöt
type: Concept
source: Kansallinen RDA-termi
source: Nationell RDA-term @sv
created: 2022-03-15
modified: 2026-05-06
alternative label: marttayhdistykset
alternative label: hushållningsorganisationer @sv
alternative label: hushållsföreningar @sv
alternative label: marthaföreningar @sv
broader: järjestötoiminta
definition: Kotitaloutta ja käsityötaitoja edistävät, kotitalousneuvontaa tarjoavat järjestöt.
definition: Organisationer som främjar hushållning och handarbetskonst, samt erbjuder hushållsrådgivning. @sv
in scheme: Metatietosanasto
preferred label: hushållsorganisationer @sv

kannatusyhdistykset
type: Concept
source: Kansallinen RDA-termi
source: Nationell RDA-term @sv
created: 2022-03-15
modified: 2026-05-06
alternative label: tukisäätiöt
alternative label: tukiyhdistykset
alternative label: garantiföreningar @sv
alternative label: stödföreningar @sv
alternative label: stödstiftelser @sv
broader: järjestötoiminta
definition: Jotain toista yhteisöä henkisesti tai taloudellisesti tukevat järjestöt.
definition: Organisationer som intellektuellt eller ekonomiskt stöder en annan sammanslutning. @sv
in scheme: Metatietosanasto
preferred label: understödsföreningar @sv

naisasiajärjestöt
type: Concept
source: Kansallinen RDA-termi
source: Nationell RDA-term @sv
created: 2022-03-15
modified: 2026-05-06
broader: järjestötoiminta
definition: Sukupuolten välistä tasa-arvoa ja naisten yhteiskunnallista asemaa edistävät järjestöt.
definition: Organisationer som främjar jämställdhet mellan könen och kvinnors samhälleliga ställning. @sv
in scheme: Metatietosanasto
preferred label: kvinnosaksorganisationer @sv

asukasyhdistykset
type: Concept
source: Kansallinen RDA-termi
source: Nationell RDA-term @sv
created: 2022-03-15
modified: 2026-05-06
alternative label: kiinteistöyhdistykset
alternative label: omakotiyhdistykset
alternative label: egnahemsföreningar @sv
alternative label: fastighetsföreningar @sv
alternative label: invånarföreningar @sv
broader: järjestötoiminta
definition: Tietyn alueen asukkaiden kiinteistö- ja elinympäristöasioita ja lähidemokratiaa edistävät järjestöt.
definition: Organisationer som främjar ärenden gällande fastigheter och livsmiljö samt närdemokrati för invånarna på ett visst område. @sv
in scheme: Metatietosanasto
preferred label: boendeföreningar @sv

kansainväliset järjestöt
type: Concept
source: Kansallinen RDA-termi
source: Nationell RDA-term @sv
created: 2022-03-15
modified: 2026-05-06
alternative label: maailmanjärjestöt
alternative label: ystävyysseurat
alternative label: vänskapsföreningar @sv
alternative label: vänsällskap @sv
alternative label: världsorganisationer @sv
broader: järjestötoiminta
definition: Erimaalaisista jäsenistä muodostuvat kansalaisjärjestöt, erimaalaisten kuntien ja kaupunkien sekä kansojen väliset ystävyysjärjestöt ja valtioiden väliset yhteistyöjärjestöt.
definition: Medborgarorganisationer som består av medlemmar från olika länder, vänskapsorganisationer mellan kommuner, städer och folk i olika länder, samt samarbetsorganisationer mellan stater. @sv
in scheme: Metatietosanasto
preferred label: internationella organisationer @sv

tiedejärjestöt
type: Concept
source: Kansallinen RDA-termi
source: Nationell RDA-term @sv
created: 2022-03-15
modified: 2026-05-06
alternative label: tiedesäätiöt
alternative label: tieteelliset seurat
alternative label: vetenskapliga organisationer @sv
alternative label: vetenskapliga samfund @sv
alternative label: vetenskapsstiftelser @sv
broader: järjestötoiminta
definition: Jonkin tieteenalan tai yleensä tieteen harjoittamista, tieteellistä tutkimusta ja opetusta sekä tiedon hyödyntämistä edistävät järjestöt.
definition: Organisationer som främjar en vetenskaplig disciplin eller överlag utövande av vetenskap, vetenskaplig forskning och undervisning, samt utnyttjande av kunskap. @sv
in scheme: Metatietosanasto
preferred label: vetenskapsorganisationer @sv

monikulttuuriset järjestöt
type: Concept
source: Kansallinen RDA-termi
source: Nationell RDA-term @sv
created: 2022-03-15
modified: 2026-05-06
alternative label: multikulturella organisationer @sv
broader: järjestötoiminta
definition: Maahanmuuttajien kulttuuria ylläpitävät ja suomalaisten ja maahanmuuttajien yhteisöllisyyttä edistävät järjestöt.
definition: Organisationer som upprätthåller invandrares kultur och främjar finländares och invandrares gemenskap. @sv
in scheme: Metatietosanasto
preferred label: mångkulturella organisationer @sv

terveysjärjestöt
type: Concept
source: Kansallinen RDA-termi
source: Nationell RDA-term @sv
created: 2022-03-15
modified: 2026-05-06
alternative label: potilasyhdistykset
alternative label: patientföreningar @sv
broader: järjestötoiminta
definition: Potilaiden edunvalvontaa harjoittavat sekä terveysneuvontaa ja vertaistukea tarjoavat järjestöt.
definition: Organisationer som bevakar patienters intressen samt erbjuder hälsorådgivning och kamratstöd. @sv
in scheme: Metatietosanasto
preferred label: hälsoorganisationer @sv

kunnallishallinto
type: Concept
source: Kansallinen RDA-termi
source: Nationell RDA-term @sv
created: 2022-05-19
modified: 2026-05-06
alternative label: kunnanosahallinto
alternative label: kommunaladministration @sv
alternative label: kommundelsförvaltning @sv
alternative label: kommunförvaltning @sv
broader: sisäasiainhallinto
example: kunnanvaltuustot; kunnalliset lautakunnat; kunnalliset hoitokunnat
example: kommunfullmäktige; kommunala nämnder; kommunala förvaltningsnämnder @sv
in scheme: Metatietosanasto
preferred label: kommunalförvaltning @sv

ilmavoimat
type: Concept
source: Kansallinen RDA-termi
source: Nationell RDA-term @sv
created: 2022-05-19
modified: 2026-05-06
alternative label: luftstridskrafter @sv
broader: puolustusvoimat
definition: Puolustusvoimain puolustushaara ja aselaji.
definition: Försvarsmaktens försvarsgren och vapenslag. @sv
in scheme: Metatietosanasto
preferred label: flygvapnet @sv

rautatiehallinto
type: Concept
source: Kansallinen RDA-termi
source: Nationell RDA-term @sv
created: 2022-05-19
modified: 2026-05-06
broader: liikenne- ja rakennushallinto
example: rata-alueet; ratakeskukset; ratapiirit; ratajaksot; liikennealueet; liikennepiirit; liikennejaksot; tuotantoasemat; rautatiepiirit; rautatievarikot
example: banområden; bancentraler; bandistrikt, bansektioner; järnvägsdistrikt; järnvägsdepåer @sv
in scheme: Metatietosanasto
preferred label: järnvägsförvaltning @sv

sisäinen turvallisuus
type: Concept
source: Kansallinen RDA-termi
source: Nationell RDA-term @sv
created: 2022-05-19
modified: 2026-05-06
alternative label: evakuointi
alternative label: pelastushallinto
alternative label: poliisihallinto
alternative label: siirtoväen huolto
alternative label: väestönsiirto
alternative label: väestönsuojelu
alternative label: befolkningsomflyttning @sv
alternative label: befolkningsskydd @sv
alternative label: evakuering @sv
alternative label: förflyttning av befolkning @sv
alternative label: polisförvaltning @sv
alternative label: räddningsförvaltning @sv
broader: sisäasiainhallinto
example: lääninrikospoliisikeskukset; pelastuslaitokset; hätäkeskukset; vastaanottokeskukset; väestönsuojelukeskukset; siirtoväen huoltojohtajat; väestönsiirtoleirit; siirtotavaratoimistot
example: länskriminalpoliscentraler; räddningscentraler; nödcentraler; mottagningscentraler; befolkningsskyddscentraler @sv
in scheme: Metatietosanasto
preferred label: inre säkerhet @sv

verohallinto
type: Concept
source: Kansallinen RDA-termi
source: Nationell RDA-term @sv
created: 2022-05-19
modified: 2026-05-06
broader: valtiovarainhallinto
example: verolautakunnat; verotoimistot; läänin tarkastuslautakunnat; läänin verotarkastajat; lääninverolautakunta; lääninverotoimisto
example: skattenämnder; skattebyråer; länsskatteinspektörer; länsskattenämnder @sv
in scheme: Metatietosanasto
preferred label: skatteförvaltning @sv

merenkulkuhallinto
type: Concept
source: Kansallinen RDA-termi
source: Nationell RDA-term @sv
created: 2022-05-19
modified: 2026-05-06
alternative label: sjöfartsadministration @sv
broader: liikenne- ja rakennushallinto
example: luotsiasemat; merenkulkupiirit; luotsipiirit
example: lotsstationer; sjöfartsdistrikt; lotsdistrikt @sv
in scheme: Metatietosanasto
preferred label: sjöfartsförvaltning @sv

huoltojoukot
type: Concept
source: Kansallinen RDA-termi
source: Nationell RDA-term @sv
created: 2022-05-19
modified: 2026-05-06
alternative label: kaatuneiden evakuointi
alternative label: kenttäposti
alternative label: materiaalihuolto
alternative label: sotaeläinlääkintä
alternative label: sotavankien hoito
alternative label: sotilaskuljetus
alternative label: sotilasvartiointi
alternative label: valistustoiminta
alternative label: viihdytystoiminta
alternative label: evakuering av stupade @sv
alternative label: fältpost @sv
alternative label: krigsfångevård @sv
alternative label: materialförsörjning @sv
alternative label: militär veterinärmedicin @sv
alternative label: soldatbevakning @sv
alternative label: soldattransport @sv
alternative label: upplysningsverksamhet @sv
broader: puolustusvoimat
example: varikot; huoltokeskukset; vartiot; vartioasemat; vartioalueet; vartiokeskukset
example: depåer; underhållscentraler; bevakningsstationer; bevakningsområden; bevakningscentraler @sv
in scheme: Metatietosanasto
preferred label: underhållstrupper @sv

vankeinhoito
type: Concept
source: Kansallinen RDA-termi
source: Nationell RDA-term @sv
created: 2022-05-19
modified: 2026-05-06
broader: oikeushallinto
example: yhdyskuntaseuraamustoimistot; Rikosseuraamuslaitos
example: byråer för samhällspåföljder; Brottspåföljdsmyndigheten @sv
in scheme: Metatietosanasto
preferred label: fångvård @sv

aluehallinto
type: Concept
source: Kansallinen RDA-termi
source: Nationell RDA-term @sv
created: 2022-05-19
modified: 2026-05-06
alternative label: kihlakuntahallinto
alternative label: lääninhallinto
alternative label: maakuntahallinto
alternative label: voutihallinto
alternative label: fogdeförvaltning @sv
alternative label: häradsförvaltning @sv
alternative label: landskapsförvaltning @sv
alternative label: länsförvaltning @sv
alternative label: regionalförvaltning @sv
broader: sisäasiainhallinto
example: aluehallintovirastot; lääninvaltuuskunnat; läänintoimistot; läänin hätäaputoimikunnat; kruununpolttimot; kruununmakasiinit; kihlakunnanvirastot
example: regionförvaltningsverk; länsdelegationer; länsnämnder; nödhjälpskommittéer; kronobrännerier; kronomagasin; häradsämbeten @sv
in scheme: Metatietosanasto
preferred label: regionförvaltning @sv

viestintähallinto
type: Concept
source: Kansallinen RDA-termi
source: Nationell RDA-term @sv
created: 2022-05-19
modified: 2026-05-06
alternative label: posti- ja telehallinto
alternative label: postihallinto
alternative label: telehallinto
alternative label: post- och teleförvaltning @sv
alternative label: postförvaltning @sv
alternative label: teleförvaltning @sv
broader: liikenne- ja rakennushallinto
example: postipiirit; postitoimistot; telealueet; telepiirit
example: postdistrikt; postkontor; teleområden; teledistrikt @sv
in scheme: Metatietosanasto
preferred label: kommunikationsförvaltning @sv

rajavalvonta
type: Concept
source: Kansallinen RDA-termi
source: Nationell RDA-term @sv
created: 2022-05-19
modified: 2026-05-06
alternative label: rajaturvallisuus
alternative label: gränsbevakning @sv
alternative label: gränskontroll @sv
alternative label: gränssäkerhet @sv
broader: sisäasiainhallinto
example: rajavartiostot; merivartiostot
example: gränsbevakningsavdelningar; sjöbevakningssektioner @sv
in scheme: Metatietosanasto
preferred label: gränsövervakning @sv

metsätaloushallinto
type: Concept
source: Kansallinen RDA-termi
source: Nationell RDA-term @sv
created: 2022-05-19
modified: 2026-05-06
alternative label: metsähallinto
alternative label: forstförvaltning @sv
broader: maa- ja metsätaloushallinto
example: metsähallinnon piirikuntakonttorit; metsähallinnon tarkastuspiirit; metsänhoitoalueet
example: forstförvaltningens distriktskontor; forstförvaltningens inspektionsdistrikt @sv
in scheme: Metatietosanasto
preferred label: skogsbruksförvaltning @sv

vaalitoimi
type: Concept
source: Kansallinen RDA-termi
source: Nationell RDA-term @sv
created: 2022-05-19
modified: 2026-05-06
broader: oikeushallinto
example: vaalipiirien keskuslautakunnat
example: valkretsars centralnämnder @sv
in scheme: Metatietosanasto
preferred label: valadministration @sv

maavoimat
type: Concept
source: Kansallinen RDA-termi
source: Nationell RDA-term @sv
created: 2022-05-19
modified: 2026-05-06
alternative label: armén (landstridskrafter) @sv
alternative label: landstridskrafter @sv
broader: puolustusvoimat
definition: Puolustusvoimain puolustushaara ja aselaji.
definition: Försvarsmaktens försvarsgren och vapenslag. @sv
in scheme: Metatietosanasto
preferred label: armén @sv

rakennushallinto
type: Concept
source: Kansallinen RDA-termi
source: Nationell RDA-term @sv
created: 2022-05-19
modified: 2026-05-06
alternative label: kaavoitushallinto
alternative label: byggförvaltning @sv
broader: liikenne- ja rakennushallinto
example: lääninrakennustoimistot; rakennuspiirit; rakennusvirastot
example: byggnadsdistrikt; byggnadsexpeditioner @sv
in scheme: Metatietosanasto
preferred label: byggnadsförvaltning @sv

tie- ja vesirakennushallinto
type: Concept
source: Kansallinen RDA-termi
source: Nationell RDA-term @sv
created: 2022-05-19
modified: 2026-05-06
alternative label: tiehallinto
alternative label: vesirakennushallinto
alternative label: vattenbyggnadsförvaltning @sv
alternative label: vägförvaltning @sv
broader: liikenne- ja rakennushallinto
example: tiepiirit; tie- ja vesirakennuspiirit; vesirakennuspiirit
example: vägdistrikt; väg- och vattenbyggnadsdistrikt; vattenbyggnadsdistrikt @sv
in scheme: Metatietosanasto
preferred label: väg- och vattenbyggnadsförvaltning @sv

syyttäjätoimi
type: Concept
source: Kansallinen RDA-termi
source: Nationell RDA-term @sv
created: 2022-05-19
modified: 2026-05-06
alternative label: åklagarväsen @sv
broader: oikeushallinto
example: kaupunginviskaalit; hovioikeuspiirien valtionsyyttäjät; syyttäjänvirastot; syyttäjälaitokset; Oulun kaupunginviskaali; Syyttäjänvirasto
example: stadsfiskaler; hovrättskretsars statsåklagare; åklagarämbeten; åklagarmyndigheter; Uleåborgs stadsfiskal; Åklagarmyndigheten @sv
in scheme: Metatietosanasto
preferred label: åklagarväsende @sv

merivoimat
type: Concept
source: Kansallinen RDA-termi
source: Nationell RDA-term @sv
created: 2022-05-19
modified: 2026-05-06
alternative label: sjöstridskrafter @sv
broader: puolustusvoimat
definition: Puolustusvoimain puolustushaara ja aselaji.
definition: Försvarsmaktens försvarsgren och vapenslag. @sv
in scheme: Metatietosanasto
preferred label: marinen @sv

ajoneuvohallinto
type: Concept
source: Kansallinen RDA-termi
source: Nationell RDA-term @sv
created: 2022-05-19
modified: 2026-05-06
broader: liikenne- ja rakennushallinto
example: katsastusviranomaiset
example: besiktningsmyndigheter @sv
in scheme: Metatietosanasto
preferred label: fordonsförvaltning @sv

puolustusvoimain ylin johto
type: Concept
source: Kansallinen RDA-termi
source: Nationell RDA-term @sv
created: 2022-05-19
modified: 2026-05-06
alternative label: försvarets högsta ledning @sv
broader: puolustusvoimat
example: päämaja; pääesikunta; pääesikunnan osastot; pääesikunnan toimistot
example: högkvarter; huvudstaben; huvudstabens avdelningar; huvudstabens byråer @sv
in scheme: Metatietosanasto
preferred label: försvarsmaktens högsta ledning @sv

kalastushallinto
type: Concept
source: Kansallinen RDA-termi
source: Nationell RDA-term @sv
created: 2022-05-19
modified: 2026-05-06
broader: maa- ja metsätaloushallinto
example: kalastuspiirit
example: fiskeförvaltning @sv
example: fiskeområden @sv
example: fiskeriadministration @sv
example: fiskeridistrikt @sv
in scheme: Metatietosanasto
preferred label: fiskeriförvaltning @sv

tullihallinto
type: Concept
source: Kansallinen RDA-termi
source: Nationell RDA-term @sv
created: 2022-05-19
modified: 2026-05-06
broader: valtiovarainhallinto
example: tullikamarit; piiritullikamarit; tullivartioasemat; tulliasemat; tullitoimistot
example: tullkammare; distriktstullkammare; tullstationer; tullbevakningsstationer; tullexpeditioner @sv
in scheme: Metatietosanasto
preferred label: tullförvaltning @sv

maataloushallinto
type: Concept
source: Kansallinen RDA-termi
source: Nationell RDA-term @sv
created: 2022-05-19
modified: 2026-05-06
alternative label: maatilahallinto
alternative label: gårdsbruksförvaltning @sv
alternative label: lantbruksadministration @sv
broader: maa- ja metsätaloushallinto
example: maanviljelysinsinööripiirit; maaseutuelinkeinopiirit; maatalouspiirit
example: lantbruksingenjörsdistrikt; landsbygdsnäringsdistrikt; lantbruksdistrikt @sv
in scheme: Metatietosanasto
preferred label: lantbruksförvaltning @sv

finanssihallinto
type: Concept
source: Kansallinen RDA-termi
source: Nationell RDA-term @sv
created: 2022-05-19
modified: 2026-05-06
broader: valtiovarainhallinto
example: säästöpankkitarkastuspiirit
example: sparbanksinspektionsdistrikt @sv
in scheme: Metatietosanasto
preferred label: finansförvaltning @sv

maanmittaushallinto
type: Concept
source: Kansallinen RDA-termi
source: Nationell RDA-term @sv
created: 2022-05-19
modified: 2026-05-06
broader: maa- ja metsätaloushallinto
example: läänin maanmittauskonttorit; maanmittaustoimistot
example: länslantmäterikontor; lantmäterikontor @sv
in scheme: Metatietosanasto
preferred label: lantmäteriförvaltning @sv

lyhentäjä
type: Concept
source: RDA-termi
source: RDA-term @sv
created: 2016-01-08
modified: 2025-07-05
alternative label: abridger @en
alternative label: lyhentäjä (toimija)
alternative label: förkortad av (aktör) @sv
broader: tarkistaja
definition: Toimija, joka osallistuu ekspression tekemiseen lyhentämällä siihen liittyvän teoksen ekspressiota muuttamatta esityksen yleistä sisältöä tai tyyliä. (RDA Registry)
definition: Aktör som deltar i skapandet av ett uttryck, genom att förkorta ett relaterat verks uttryck utan att förändra framställningens allmänna innehåll eller stil. @sv
in scheme: Metatietosanasto
preferred label: abridger agent @en
preferred label: förkortad av @sv
scope note: Ei koske oleellista muokkausta, joka johtaa uuden teoksen luomiseen. (RDA Registry)
scope note: Gäller inte betydande ändringar, som leder till skapandet av ett nytt verk. @sv

asutushallinto
type: Concept
source: Kansallinen RDA-termi
source: Nationell RDA-term @sv
created: 2022-05-19
modified: 2026-05-06
broader: maa- ja metsätaloushallinto
example: asukkaanottolautakunnat; asutuspiirit; asutustarkastajat; asutustoimikunnat; asutustoiminnan johtajat; maanhankinnan tarkastuspiirit; maankäyttötoimikunnat; maanlunastustoimikunnat; pika-asutustoimikunnat; virkatalojen tarkastajat; vuokratoimikunnat
example: åbonämnder; kolonisationsdistrikt; kolonisationsinspektörer; kolonisationskommissioner; markanvändningskommissioner; jordinlösningsnämnder; snabbkolonisationskommissioner; boställsinspektörer @sv
in scheme: Metatietosanasto
preferred label: kolonisationsförvaltning @sv

ilmailuhallinto
type: Concept
source: Kansallinen RDA-termi
source: Nationell RDA-term @sv
created: 2022-05-19
modified: 2026-05-06
broader: liikenne- ja rakennushallinto
in scheme: Metatietosanasto
preferred label: luftfartsförvaltning @sv

ulosottotoimi
type: Concept
source: Kansallinen RDA-termi
source: Nationell RDA-term @sv
created: 2022-05-19
modified: 2026-05-06
alternative label: exekutionsväsen @sv
alternative label: utsökningsväsen @sv
broader: oikeushallinto
example: kaupunginvoudit; ulosottovirastot
example: stadsfogdar; exekutionsverk @sv
in scheme: Metatietosanasto
preferred label: utsökningsväsende @sv

kustantamo
type: Concept
source: Kansallinen RDA-termi
source: Nationell RDA-term @sv
created: 2022-08-16
modified: 2024-05-24
alternative label: kustantaja (yhteisö)
alternative label: förlag (institution) @sv
in scheme: Metatietosanasto
narrower: musiikkikustantamo
preferred label: förlag @sv

kehitysjohtaja
type: Concept
source: Kansallinen RDA-termi
source: Nationell RDA-term @sv
created: 2022-11-15
modified: 2025-11-04
alternative label: utvecklingschef (utvecklingsledare) @sv
alternative label: utvecklingsdirektör @sv
broader: johtaja
in scheme: Metatietosanasto
preferred label: utvecklingsledare @sv

tutkimusjohtaja
type: Concept
source: Kansallinen RDA-termi
source: Nationell RDA-term @sv
created: 2022-11-15
modified: 2025-11-04
alternative label: forskningschef (forskningsledare) @sv
alternative label: forskningsdirektör @sv
broader: johtaja
in scheme: Metatietosanasto
preferred label: forskningsledare @sv

nuottijulkaisu
type: Concept
created: 2023-01-21
modified: 2023-05-05
alternative label: musikalier @sv
broader: nuotti
in scheme: Metatietosanasto
preferred label: notpublikation @sv

lehtileikkeet
type: Concept
created: 2023-01-21
modified: 2023-05-05
alternative label: tidningsklipp @sv
alternative label: tidningsutklipp @sv
broader: teksti
in scheme: Metatietosanasto
preferred label: tidningsurklipp @sv

päiväkirja
type: Concept
created: 2023-01-21
modified: 2023-05-05
broader: teksti
in scheme: Metatietosanasto
preferred label: dagbok @sv

kartta
type: Concept
created: 2023-01-21
modified: 2023-05-05
broader: kuva
in scheme: Metatietosanasto
preferred label: karta @sv

ympäristötaide
type: Concept
created: 2023-01-21
modified: 2023-05-05
broader: taideteos
in scheme: Metatietosanasto
preferred label: miljökonst @sv

käsikirjoitus
type: Concept
created: 2023-01-21
modified: 2023-05-05
alternative label: handskrift @sv
broader: teksti
in scheme: Metatietosanasto
preferred label: manuskript @sv

puhe
type: Concept
created: 2023-01-21
modified: 2023-05-05
broader: ääni
in scheme: Metatietosanasto
preferred label: tal @sv

biotaide
type: Concept
created: 2023-01-21
modified: 2023-05-05
broader: taideteos
in scheme: Metatietosanasto
preferred label: biokonst @sv

piirustus
type: Concept
created: 2023-01-21
modified: 2023-05-05
broader: taideteos
in scheme: Metatietosanasto
preferred label: teckning @sv

valokuva
type: Concept
created: 2023-01-21
modified: 2023-05-05
alternative label: foto @sv
broader: taideteos
in scheme: Metatietosanasto
preferred label: fotografi @sv

nuottikäsikirjoitus
type: Concept
created: 2023-01-21
modified: 2023-05-05
alternative label: nothandskrift @sv
broader: nuotti
in scheme: Metatietosanasto
preferred label: notmanuskript @sv

asiakirja
type: Concept
created: 2023-01-21
modified: 2023-05-05
alternative label: dokument @sv
broader: teksti
in scheme: Metatietosanasto
preferred label: handling @sv

pienpainate
type: Concept
created: 2023-01-21
modified: 2023-05-05
alternative label: dagsländetryck @sv
alternative label: efemärt material @sv
alternative label: efemärt tryck @sv
alternative label: vardagstryck @sv
broader: teksti
in scheme: Metatietosanasto
preferred label: småtryck @sv

rakennus
type: Concept
created: 2023-01-21
modified: 2023-05-05
broader: paikka
in scheme: Metatietosanasto
preferred label: byggnad @sv

kirja
type: Concept
created: 2023-01-21
modified: 2023-05-05
broader: teksti
in scheme: Metatietosanasto
preferred label: bok @sv

tapahtumatallenne
type: Concept
created: 2023-01-21
modified: 2023-05-05
broader: ääni
in scheme: Metatietosanasto
preferred label: evenemangsinspelning @sv

lehti
type: Concept
created: 2023-01-21
modified: 2023-05-05
alternative label: tidskrift @sv
broader: teksti
in scheme: Metatietosanasto
preferred label: tidning @sv

tv-ohjelma
type: Concept
created: 2023-01-21
modified: 2023-05-05
broader: liikkuva kuva
in scheme: Metatietosanasto
preferred label: tv-program @sv

keruuvastaus
type: Concept
created: 2023-01-21
modified: 2023-05-05
broader: teksti
in scheme: Metatietosanasto
preferred label: insamlingssvar @sv

grafiikka
type: Concept
created: 2023-01-21
modified: 2023-05-05
broader: taideteos
in scheme: Metatietosanasto
preferred label: grafik @sv

tietokoneohjelma
type: Concept
created: 2023-01-21
modified: 2023-05-05
alternative label: dataprogram @sv
broader: data
in scheme: Metatietosanasto
preferred label: datorprogram @sv

malli
type: Concept
created: 2023-01-21
modified: 2023-05-05
alternative label: mall @sv
broader: muu
in scheme: Metatietosanasto
preferred label: modell @sv

muu
type: Concept
created: 2023-01-21
modified: 2023-05-05
alternative label: annat @sv
in scheme: Metatietosanasto
narrower: malli
preferred label: annan @sv

taideteollisuusesine
type: Concept
created: 2023-01-21
modified: 2023-05-05
broader: taideteos
in scheme: Metatietosanasto
preferred label: konstindustriellt föremål @sv

maalaus
type: Concept
created: 2023-01-21
modified: 2023-05-05
broader: taideteos
in scheme: Metatietosanasto
preferred label: målning @sv

taiteilijan työvälineet
type: Concept
created: 2023-01-21
modified: 2023-05-05
alternative label: konstnärsverktyg @sv
broader: taideteos
in scheme: Metatietosanasto
preferred label: konstnärsredskap @sv

data
type: Concept
created: 2023-01-21
modified: 2023-05-05
in scheme: Metatietosanasto
narrower: tietokoneohjelma

painokuva
type: Concept
created: 2023-01-21
modified: 2023-05-05
alternative label: tryckbild @sv
broader: kuva
in scheme: Metatietosanasto
preferred label: tryckt bild @sv

piirustus
type: Concept
created: 2023-01-21
modified: 2023-05-05
broader: kuva
in scheme: Metatietosanasto
preferred label: teckning @sv

kirje
type: Concept
created: 2023-01-21
modified: 2023-05-05
broader: teksti
in scheme: Metatietosanasto
preferred label: brev @sv

haastattelu
type: Concept
created: 2023-01-21
modified: 2023-05-05
broader: ääni
in scheme: Metatietosanasto
preferred label: intervju @sv

esineteos
type: Concept
created: 2023-01-21
modified: 2023-05-05
broader: taideteos
in scheme: Metatietosanasto
preferred label: föremålsverk @sv

veistos
type: Concept
created: 2023-01-21
modified: 2023-05-05
alternative label: staty @sv
broader: taideteos
in scheme: Metatietosanasto
preferred label: skulptur @sv

kulttuuriympäristö
type: Concept
created: 2023-01-21
modified: 2023-05-05
alternative label: kulturell miljö @sv
broader: paikka
in scheme: Metatietosanasto
preferred label: kulturmiljö @sv

radio-ohjelma
type: Concept
created: 2023-01-21
modified: 2023-05-05
broader: ääni
in scheme: Metatietosanasto
preferred label: radioprogram @sv

valokuva
type: Concept
created: 2023-01-21
modified: 2023-05-05
alternative label: foto @sv
broader: kuva
in scheme: Metatietosanasto
preferred label: fotografi @sv

mediataide
type: Concept
created: 2023-01-21
modified: 2023-05-05
alternative label: mediakonst @sv
broader: taideteos
in scheme: Metatietosanasto
preferred label: mediekonst @sv

rakennettu ympäristö
type: Concept
created: 2023-01-21
modified: 2023-05-05
alternative label: bebyggd miljö @sv
broader: paikka
in scheme: Metatietosanasto
preferred label: byggd miljö @sv

haastattelu
type: Concept
created: 2023-01-21
modified: 2023-05-05
broader: liikkuva kuva
in scheme: Metatietosanasto
preferred label: intervju @sv

elokuva
type: Concept
created: 2023-01-21
modified: 2023-05-05
broader: liikkuva kuva
in scheme: Metatietosanasto
preferred label: film @sv

installaatio
type: Concept
created: 2023-01-21
modified: 2023-05-05
broader: taideteos
in scheme: Metatietosanasto
preferred label: installation @sv

musiikki
type: Concept
created: 2023-01-21
modified: 2023-05-05
broader: ääni
in scheme: Metatietosanasto
preferred label: musik @sv

muinaisjäännös
type: Concept
created: 2023-01-21
modified: 2023-05-05
alternative label: fornminne @sv
broader: paikka
in scheme: Metatietosanasto
preferred label: fornlämning @sv

tapahtumatallenne
type: Concept
created: 2023-01-21
modified: 2023-05-05
broader: liikkuva kuva
in scheme: Metatietosanasto
preferred label: evenemangsinspelning @sv

julkaistu myös nimellä
type: Concept
source: Kansallinen RDA-termi
source: Nationell RDA-term @sv
created: 2023-05-05
modified: 2025-01-08
broader: teoksen edeltävä versio
in scheme: Metatietosanasto
preferred label: även utgiven med titeln @sv

julkaistu aiemmin nimellä
type: Concept
source: Kansallinen RDA-termi
source: Nationell RDA-tem @sv
created: 2023-05-05
modified: 2025-01-08
broader: teoksen edeltävä versio
in scheme: Metatietosanasto
preferred label: tidigare utgiven med titeln @sv

julkaistu myöhemmin nimellä
type: Concept
source: Kansallinen RDA-termi
source: Nationell RDA-term @sv
created: 2023-05-05
modified: 2025-01-08
broader: teoksen edeltävä versio
in scheme: Metatietosanasto
preferred label: senare utgiven med titeln @sv

kapteeniluutnantti
type: Concept
source: Kansallinen RDA-termi
source: Nationell RDA-term @sv
created: 2024-02-29
modified: 2025-11-04
broader: upseeri
in scheme: Metatietosanasto
preferred label: kaptenlöjtnant @sv

prikaatikenraali
type: Concept
source: Kansallinen RDA-termi
source: Nationell RDA-term @sv
created: 2024-02-29
modified: 2025-11-04
alternative label: prikaatinkenraali
broader: upseeri
in scheme: Metatietosanasto
preferred label: brigadgeneral @sv

kontra-amiraali
type: Concept
source: Kansallinen RDA-termi
source: Nationell RDA-term @sv
created: 2024-02-29
modified: 2025-11-04
broader: upseeri
in scheme: Metatietosanasto
preferred label: konteramiral @sv

kenraalimajuri
type: Concept
source: Kansallinen RDA-termi
source: Nationell RDA-term @sv
created: 2024-02-29
modified: 2025-11-04
broader: upseeri
in scheme: Metatietosanasto
preferred label: generalmajor @sv

lippueamiraali
type: Concept
source: Kansallinen RDA-termi
source: Nationell RDA-term @sv
created: 2024-02-29
modified: 2025-11-04
broader: upseeri
in scheme: Metatietosanasto
preferred label: flottiljamiral @sv

vara-amiraali
type: Concept
source: Kansallinen RDA-termi
source: Nationell RDA-term @sv
created: 2024-02-29
modified: 2025-11-04
alternative label: vice amiral @sv
broader: upseeri
in scheme: Metatietosanasto
preferred label: viceamiral @sv

kommodori
type: Concept
source: Kansallinen RDA-termi
source: Nationell RDA-term @sv
created: 2024-02-29
modified: 2025-11-04
broader: upseeri
in scheme: Metatietosanasto
preferred label: kommodor @sv

yliluutnantti
type: Concept
source: Kansallinen RDA-termi
source: Nationell RDA-term @sv
created: 2024-02-29
modified: 2025-11-04
alternative label: överlöjtnant @sv
broader: upseeri
in scheme: Metatietosanasto
preferred label: premiärlöjtnant @sv

aliluutnantti
type: Concept
source: Kansallinen RDA-termi
source: Nationell RDA-term @sv
created: 2024-02-29
modified: 2025-11-04
broader: upseeri
in scheme: Metatietosanasto
preferred label: underlöjtnant @sv

komentajakapteeni
type: Concept
source: Kansallinen RDA-termi
source: Nationell RDA-term @sv
created: 2024-02-29
modified: 2025-11-04
broader: upseeri
in scheme: Metatietosanasto
preferred label: kommendörkapten @sv

käytettävissä vapaakappalekirjastoissa
type: Concept
source: Kansallinen RDA-termi
source: Nationell RDA-term @sv
created: 2024-03-22
modified: 2024-10-10
broader: muu julkaisumuoto
in scheme: Metatietosanasto
preferred label: tillgänglig i friexemplarsbibliotek @sv

leuʹddaaja
type: Concept
source: Kansallinen RDA-termi
source: Nationell RDA-term @sv
created: 2024-07-06
modified: 2024-08-27
alternative label: leuddaaja
alternative label: leu’ddaaja
broader: laulaja
definition: Itäsaamelaisen perinnemusiikin laulaja.
definition: Sångare inom östsamisk traditionell musik. @sv
in scheme: Metatietosanasto
preferred label: leu’ddare @sv

julkaisija
type: Concept
source: RDA-termi
source: RDA-term @sv
created: 2016-01-08
modified: 2025-07-01
alternative label: issuing body @en
alternative label: julkaisija (suhde)
alternative label: julkaisija (toimija)
alternative label: utgivande instans @sv
alternative label: utgivare (aktör) @sv
alternative label: utgivare (relation) @sv
broader: teokseen liittyvä toimija
definition: Toimija, joka julkaisee teoksen. (RDA Registry)
definition: Aktör som ger ut ett verk. @sv
in scheme: Metatietosanasto
preferred label: issuing agent @en
preferred label: utgivare @sv

piirustuksenopettaja
type: Concept
source: Kansallinen RDA-termi
source: Nationell RDA-term @sv
created: 2024-10-12
modified: 2024-11-05
broader: aineenopettaja
in scheme: Metatietosanasto
preferred label: teckningslärare @sv

teos omistettu
type: Concept
source: Kansallinen RDA-termi
source: Nationell RDA-term @sv
created: 2024-10-15
modified: 2024-12-18
broader: teoksen omistuksen kohde
definition: Teos on omistettu yhteisölle.
definition: Verket har dedicerats till en institution. @sv
in scheme: Metatietosanasto
preferred label: verket dedicerat till @sv

kenraalisuperintendentti
type: Concept
source: Kansallinen RDA-termi
source: Nationell RDA-term @sv
created: 2024-11-08
modified: 2025-08-20
alternative label: kenraali-superintendentti
broader: kirkon työntekijä
in scheme: Metatietosanasto
preferred label: generalsuperintendent @sv

laulaja
type: Concept
source: Kansallinen RDA-termi
source: Nationell RDA-term @sv
created: 2024-12-18
modified: 2025-07-04
alternative label: musiikkiin osallinen laulaja (yhteisö)
alternative label: sångare (institution) som är bidragsgivare till musik @sv
broader: musiikkiin osallinen yhteisö
definition: Aggregaattiin sisältyvässä musiikissa ääntään käyttämällä, säestyksellä tai ilman, esiintyvä yhteisö. Lauluesitys voi sisältää tai olla sisältämättä todellisia sanoja.
definition: Institution som uppträder i musik som ingår i ett aggregat, genom att använda sin röst, med eller utan ackompanjemang. Sångframförandet kan vara med eller utan riktiga ord. @sv
in scheme: Metatietosanasto
preferred label: sångare @sv

soittaja
type: Concept
source: RDA-termi
source: RDA-term @sv
created: 2024-12-18
modified: 2025-08-19
alternative label: soittaja (yhteisö)
alternative label: instrumentalist (institution) @sv
broader: esittäjä
definition: Yhteisö, joka on esittäjä, joka osallistuu ekspression tekemiseen soittamalla soitinta. (RDA Registry)
definition: Institution som är en framförare, som deltar i utförandet av ett uttryck genom att spela ett instrument. @sv
in scheme: Metatietosanasto
preferred label: instrumentalist corporate body @en
preferred label: instrumentalist @sv

laulaja
type: Concept
source: RDA-termi
source: RDA-term @sv
created: 2016-01-08
modified: 2025-07-04
alternative label: singer @en
alternative label: laulaja (suhde)
alternative label: laulaja (toimija)
alternative label: sångare (aktör) @sv
alternative label: sångare (relation) @sv
broader: esittäjä
definition: Toimija, joka on esittäjä, joka osallistuu ekspression tekemiseen käyttämällä ääntään, soitinsäestyksellä tai ilman, tuottaakseen musiikkia. (RDA Registry)
definition: Aktör som är en framförare, som deltar i utförandet av ett uttryck, genom att använda sin röst, med eller utan instrumentalackompanjemang, för att producera musik. @sv
in scheme: Metatietosanasto
preferred label: singer agent @en
preferred label: sångare @sv
scope note: Laulajan esitys voi sisältää tai olla sisältämättä todellisia sanoja. (RDA Registry)
scope note: Sångarens framförande kan vara med eller utan riktiga ord. @sv

tekstiteoksen kirjoittaja
type: Concept
source: Kansallinen RDA-termi
source: Nationell RDA-term @sv
created: 2024-12-18
modified: 2025-08-22
alternative label: tekstiteoksen kirjoittaja (yhteisö)
alternative label: författare (institution) till textverk @sv
broader: kirjoittaja
definition: A corporate body who is responsible for creating a textual work that complements a work. @en
definition: Yhteisö, joka on vastuussa toista teosta täydentävän tekstin luomisesta.
definition: Institution som svarar för skapandet av en text som kompletterar ett annat verk. @sv
in scheme: Metatietosanasto
preferred label: author corporate body of textual work @en
preferred label: författare till textverk @sv

televisio-ohjaaja
type: Concept
source: RDA-termi
source: RDA-term @sv
created: 2024-12-18
modified: 2025-08-22
alternative label: televisio-ohjaaja (yhteisö)
alternative label: tv-regissör (institution) @sv
broader: ohjaaja
definition: Yhteisö, joka on ohjaaja, joka on vastuussa televisio-ohjelman yleisestä johtamisesta ja valvonnasta. (RDA Registry)
definition: Institution som är en regissör, som svarar för allmän ledning och övervakning av ett tv-program. @sv
in scheme: Metatietosanasto
preferred label: television director corporate body @en
preferred label: tv-regissör @sv

vastaanottaja
type: Concept
source: RDA-termi
source: RDA-term @sv
created: 2024-12-18
modified: 2025-08-23
alternative label: vastaanottaja (yhteisö)
alternative label: mottagare (institution) @sv
broader: teokseen liittyvä yhteisö
definition: Yhteisö, jolle teos tai teoksen osa on osoitettu. (RDA Registry)
definition: Institution till vilken ett verk eller en del av ett verk har riktats. @sv
in scheme: Metatietosanasto
preferred label: addressee corporate body @en
preferred label: mottagare @sv

digitaaliseen sisältöön osallinen toimija
type: Concept
source: RDA-termi
source: RDA-term @sv
created: 2024-12-18
modified: 2025-04-16
broader: aggregaattiin osallinen toimija
definition: Aggregaattiin osallinen toimija, joka on luonut aggregaattiin sisältyvän digitaalisen sisällön ekspression. (RDA Registry)
definition: Aktör som bidragit till ett aggregat och som skapat ett uttryck med digitalt innehåll som ingår i ett aggregat. @sv
in scheme: Metatietosanasto
preferred label: contributor agent of computer content @en
preferred label: bidragsgivare (aktör) till digitalt innehåll @sv

musiikkiohjelmoija
type: Concept
source: RDA-termi
source: RDA-term @sv
created: 2024-12-18
modified: 2025-08-14
alternative label: musiikkiohjelmoija (yhteisö)
alternative label: musikprogrammerare (institution) @sv
broader: esitykseen osallinen yhteisö
definition: Yhteisö, joka osallistuu musiikkiteoksen ekspression tekemiseen tuottamalla ääniä sähköisillä äänilaitteilla tai tietokoneohjelmilla. (RDA Registry)
definition: Aktör som deltar i skapandet av ett musikverks uttryck, genom att producera ljud med elektriska ljudenheter eller datorprogram. @sv
in scheme: Metatietosanasto
preferred label: music programmer corporate body @en
preferred label: musikprogrammerare @sv
scope note: Ei koske uuden musiikkiteoksen luomista. (RDA Registry)
scope note: Gäller inte skapandet av ett nytt musikverk. @sv

elokuvaohjaaja
type: Concept
source: Kansallinen RDA-termi
source: Nationell RDA-term @sv
created: 2024-12-18
modified: 2025-05-27
alternative label: liikkuvaan kuvaan osallinen elokuvaohjaaja (yhteisö)
alternative label: filmregissör (institution) som är bidragsgivare till rörlig bild @sv
broader: liikkuvaan kuvaan osallinen yhteisö
definition: Aggregaattiin sisältyvän elokuvan yleisestä johtamisesta ja valvomisesta vastaava yhteisö.
definition: Institution som svarar för allmän ledning och övervakning av en film som ingår i ett aggregat. @sv
in scheme: Metatietosanasto
preferred label: filmregissör @sv

värittäjä
type: Concept
source: RDA-termi
source: RDA-term @sv
created: 2024-12-18
modified: 2025-08-23
alternative label: colorist corporate body @en
alternative label: värittäjä (yhteisö)
alternative label: färgläggare (institution) @sv
broader: yhdistymään osallinen yhteisö
definition: Yhteisö, joka osallistuu ekspression tekemiseen värittämällä piirustuksia, vedoksia, valokuvia, karttoja, liikkuvia kuvia tai muuta sisältöä. (RDA Registry)
definition: Institution som deltar i utförandet av ett uttryck, genom att färglägga ritningar, råkopior, fotografier, kartor, rörliga bilder eller annat innehåll. @sv
in scheme: Metatietosanasto
preferred label: colourist corporate body @en
preferred label: färgläggare @sv

haastattelija
type: Concept
source: Kansallinen RDA-termi
source: Nationell RDA-term @sv
created: 2024-12-18
modified: 2025-06-13
alternative label: liikkuvaan kuvaan osallinen haastattelija (yhteisö)
alternative label: intervjuare (institution) som är bidragsgivare till rörlig bild @sv
broader: liikkuvaan kuvaan osallinen yhteisö
definition: Aggregaattiin sisältyvään liikkuvan kuvan aineistoon tietoa keräävä yhteisö. Haastattelee, raportoi, tekee kyselytutkimusta tai kerää ihmisiltä tietoa muulla tavoin.
definition: Institution som samlar information till material med rörlig bild som ingår i ett aggregat, genom att intervjua, rapportera, göra gallup eller på annat sätt samla in uppgifter från människor. @sv
in scheme: Metatietosanasto
preferred label: intervjuare @sv

erikoistehosteiden tekijä
type: Concept
source: Kansallinen RDA-termi
source: Nationell RDA-term @sv
created: 2024-12-18
modified: 2025-06-04
alternative label: liikkuvaan kuvaan osallinen erikoistehosteiden tekijä (henkilö)
alternative label: skapare av specialeffekter (person) som är bidragsgivare till rörlig bild @sv
broader: liikkuvaan kuvaan osallinen henkilö
definition: Aggregaattiin sisältyvien liikkuvan kuvan tai äänen taltiointien erikoistehosteet (esim. mekaaniset tehosteet ja kameralla toteutettavat optiset tehosteet) tekevä henkilö.
definition: Person som skapar specialeffekter (t.ex. mekaniska effekter och optiska effekter skapade med kamera) i inspelningar av rörlig bild eller ljud, som ingår i aggregat. @sv
in scheme: Metatietosanasto
preferred label: skapare av specialeffekter @sv

koreografi (manifestaatio)
type: Concept
source: RDA-termi
source: RDA-term @sv
created: 2024-12-18
modified: 2026-02-27
alternative label: contributor person of choreography @en
alternative label: koreografiaan osallinen henkilö
alternative label: bidragsgivare (person) till koreografi @sv
broader: aggregaattiin osallinen henkilö
definition: Aggregaattiin osallinen henkilö, joka on luonut aggregaattiin sisältyvän koreografisen teoksen ekspression.
definition: Person som bidragit till ett aggregat genom att skapa ett uttryck av ett koreografiskt verk som ingår i ett aggregat. @sv
in scheme: Metatietosanasto
preferred label: choreographer (manifestation) @en
preferred label: koreograf (manifestation) @sv

kappaleen entisöijä
type: Concept
source: RDA-termi
source: RDA-term @sv
created: 2024-12-18
modified: 2025-07-03
alternative label: kappaleen entisöijä (henkilö)
alternative label: konservator (person) av exemplar @sv
alternative label: restauratör av exemplar @sv
broader: muokkaaja
definition: Henkilö, joka vastaa teknisistä, toimituksellisista ja tiedollisista toimenpiteistä, joiden tarkoitus on palauttaa huonokuntoinen kappale mahdollisimman lähelle sen alkuperäistä kuntoa. (RDA Registry)
definition: Person som svarar för tekniska, redaktionella och kunskapsmässiga åtgärder, vilkas syfte är att återställa ett exemplar i dåligt skick så nära som möjligt dess ursprungliga skick. @sv
in scheme: Metatietosanasto
preferred label: restorationist person of item @en
preferred label: konservator av exemplar @sv

kappaleen omistuksen kohde
type: Concept
source: RDA-termi
source: RDA-term @sv
created: 2024-12-18
modified: 2025-07-03
alternative label: kappaleen omistuksen kohde (henkilö)
alternative label: dedikationsmottagare @sv
alternative label: exemplaret dedicerat till (person) @sv
broader: kappaleeseen liittyvä henkilö
definition: Henkilö, jolle kappale on omistettu. (RDA Registry)
definition: Person som ett exemplar är tillägnat. @sv
in scheme: Metatietosanasto
preferred label: dedicatee person of item @en
preferred label: exemplaret dedicerat till @sv

kertoja
type: Concept
source: RDA-termi
source: RDA-term @sv
created: 2024-12-18
modified: 2025-07-03
alternative label: kertoja (henkilö)
alternative label: berättare (person) @sv
broader: esittäjä
definition: Henkilö, joka on esittäjä, joka osallistuu ekspression tekemiseen lukemalla ääneen tai kertomalla toiminnasta, tapauksesta tai muusta tapahtumasta. (RDA Registry)
definition: Person som är en framförare, som deltar i utförandet av ett uttryck genom att högläsa eller berätta om en handling, en händelse eller något annat förlopp. @sv
in scheme: Metatietosanasto
preferred label: narrator person @en
preferred label: berättare @sv

sensori
type: Concept
source: RDA-termi
source: RDA-term @sv
created: 2024-12-18
modified: 2025-08-19
alternative label: sensori (henkilö)
alternative label: censor (person) @sv
broader: tarkistaja
definition: Henkilö, joka osallistuu ekspression tekemiseen tarkastamalla toisen ekspression sisältöä kiistanalaisen sisällön salaamiseksi moraalisin, poliittisin, sotilaallisin tai muin perustein, mutta jättäen alkuperäisen teoksen luonteen ja yleisen sisällön olennaisilta osiltaan muuttumattomaksi. (RDA Registry)
definition: Person som deltar i utförandet av ett uttryck, genom att granska innehållet i ett annat uttryck för att dölja kontroversiellt innehåll på moraliska, politiska, militära eller andra grunder, men ändå låta det ursprungliga verkets karaktär och allmänna innehåll till sina väsentliga delar förbli oförändrat. @sv
in scheme: Metatietosanasto
preferred label: censor person @en
preferred label: censor @sv
scope note: Ei koske laajaa muokkausta, joka johtaa uuden teoksen luomiseen. (RDA Registry)
scope note: Gäller inte omfattande redigering, som leder till skapandet av ett nytt verk. @sv

moderoija
type: Concept
source: Kansallinen RDA-termi
source: Nationell RDA-term @sv
created: 2024-12-18
modified: 2025-08-14
alternative label: liikkuvaan kuvaan osallinen moderoija (yhteisö)
alternative label: moderator (institution) som är bidragsgivare till rörlig bild @sv
broader: liikkuvaan kuvaan osallinen yhteisö
definition: Aggregaattiin sisältyvää keskusteluohjelmaa juontava yhteisö audiovisuaalisessa aineistossa.
definition: Institution som leder ett diskussionsprogram i audiovisuellt material som ingår i ett aggregat. @sv
in scheme: Metatietosanasto
preferred label: moderator @sv

haastattelija (ekspressio)
type: Concept
source: RDA-termi
source: RDA-term @sv
created: 2024-12-18
modified: 2026-03-10
alternative label: ekspression haastattelija (yhteisö)
alternative label: version haastattelija
alternative label: intervjuare (institution) i uttryck @sv
broader: esitykseen osallinen yhteisö
definition: Yhteisö, joka osallistuu ekspression tekemiseen toimimalla haastattelijana, toimittajana, mielipidetutkijana tai jonain muuna toimijana, joka kerää tietoja. (RDA Registry)
definition: Institution som deltar i utförandet av ett uttryck genom att fungera som intervjuare, journalist, opinionsmätare eller någon annan aktör som samlar in information. @sv
in scheme: Metatietosanasto
preferred label: interviewer corporate body of expression @en
preferred label: intervjuare (uttryck) @sv

elokuvan jakelija
type: Concept
source: RDA-termi
source: RDA-term @sv
created: 2024-12-18
modified: 2025-05-27
alternative label: elokuvan jakelija (henkilö)
alternative label: filmdistributör (person) @sv
broader: jakelija
definition: Henkilö, joka on vastuussa elokuvan tms. manifestaation jakamisesta elokuvateattereille tai muille jakelukanaville. (RDA Registry)
definition: Person som svarar för distributionen av en film eller annan dylik manifestation till biografer eller andra distributionskanaler. @sv
in scheme: Metatietosanasto
preferred label: film distributor person @en
preferred label: filmdistributör @sv

äänisuunnittelija
type: Concept
source: RDA-termi
source: RDA-term @sv
created: 2024-12-18
modified: 2025-08-27
alternative label: äänisuunnittelija (henkilö)
alternative label: ljuddesigner (person) @sv
broader: esitykseen osallinen henkilö
definition: Henkilö, joka osallistuu ekspression tekemiseen suunnittelemalla ja luomalla äänikomponentteja. (RDA Registry)
definition: Person som deltar i utförandet av ett uttryck, genom att planera och skapa ljudkomponenter. @sv
in scheme: Metatietosanasto
preferred label: sound designer person @en
preferred label: ljuddesigner @sv

dubbausohjaaja
type: Concept
source: Kansallinen RDA-termi
source: Nationell RDA-term @sv
created: 2024-12-18
modified: 2025-05-27
alternative label: liikkuvaan kuvaan osallinen dubbausohjaaja (henkilö)
alternative label: dubbningsregissör (person) som är bidragsgivare till rörlig bild @sv
broader: liikkuvaan kuvaan osallinen henkilö
definition: Aggregaattiin sisältyvää ääniraitaa täydentävän dialogin tai muiden äänien lisäämisen yleisestä johtamisesta ja valvonnasta vastaava henkilö.
definition: Person som svarar för allmän ledning och övervakning av tillägget av dialog eller andra röster, som kompletterar ett ljudspår som ingår i ett aggregat. @sv
in scheme: Metatietosanasto
preferred label: dubbningsregissör @sv

sovittaja
type: Concept
source: RDA-termi
source: RDA-term @sv
created: 2024-12-18
modified: 2025-08-19
alternative label: sovittaja (yhteisö)
alternative label: arrangör (institution) @sv
broader: tarkistaja
definition: Yhteisö, joka osallistuu teoksen ekspression tekemiseen muokkaamalla sävellyksen alkuperäisteoksesta poikkeavalle esityskokoonpanolle. (RDA Registry)
definition: Institution som deltar i utförandet av ett verks uttryck, genom att omarbeta kompositionen för en musikalisk besättning som avviker från originalverket. @sv
in scheme: Metatietosanasto
preferred label: arranger corporate body of music @en
preferred label: arrangör @sv
scope note: Sovittaja voi myös muokata teosta samalle esityskokoonpanolle tms. säilyttäen alkuperäisen sävellyksen musiikillisen sisällön olennaisilta osin muuttumattomana. Tähän ei sisälly laaja muokkaaminen, joka johtaa uuden musiikkiteoksen luomiseen. (RDA Registry)
scope note: En arrangör kan också bearbeta verket för samma musikaliska besättning eller dylikt och bevara originalkompositionens musikaliska innehåll till sina väsentliga delar oförändrade. I detta ingår inte omfattande ändringar som leder till skapandet av ett nytt musikverk. @sv

tekstiin osallinen toimija
type: Concept
source: RDA-termi
source: RDA-term @sv
created: 2024-12-18
modified: 2025-08-22
alternative label: writer of added commentary @en
alternative label: writer of added lyrics @en
alternative label: writer of added text @en
alternative label: writer of afterword @en
alternative label: writer of foreword @en
alternative label: writer of introduction @en
alternative label: writer of postface @en
alternative label: writer of preface @en
alternative label: writer of supplementary textual content @en
broader: aggregaattiin osallinen toimija
definition: Aggregaattiin osallinen toimija, joka on luonut aggregaattiin sisältyvän tekstiteoksen ekspression. (RDA Registry)
definition: Aktör som bidragit till ett aggregat och skapat ett uttryck av ett textverk som ingår i ett aggregat. @sv
in scheme: Metatietosanasto
preferred label: contributor agent of text @en
preferred label: bidragsgivare (aktör) till text @sv

televisio-ohjaaja
type: Concept
source: Kansallinen RDA-termi
source: Nationell RDA-term @sv
created: 2024-12-18
modified: 2025-08-22
alternative label: liikkuvaan kuvaan osallinen televisio-ohjaaja (yhteisö)
alternative label: tv-regissör (institution) som är bidragsgivare till rörlig bild @sv
broader: liikkuvaan kuvaan osallinen yhteisö
definition: Aggregaattiin sisältyvän TV-ohjelman yleisestä johtamisesta ja valvomisesta vastaava yhteisö.
definition: Institution som svarar för allmän ledning och övervakning av ett tv-program som ingår i ett aggregat. @sv
in scheme: Metatietosanasto
preferred label: tv-regissör @sv

versioon liittyvä toimija
type: Concept
source: RDA-termi
source: RDA-term @sv
created: 2024-12-18
modified: 2025-08-23
alternative label: ekspressioon liittyvä toimija
alternative label: aktör relaterad till uttrycket @sv
definition: Toimija, joka liittyy ekspressioon. (RDA Registry)
definition: Aktör som relaterar till ett uttryck. @sv
in scheme: Metatietosanasto
narrower: version tekijä
preferred label: related agent of expression @en
preferred label: aktör relaterad till versionen @sv

kuvittaja
type: Concept
source: Kansallinen RDA-termi
source: Nationell RDA-term @sv
created: 2024-12-18
modified: 2025-07-04
alternative label: tekstiin osallinen kuvittaja (yhteisö)
alternative label: illustratör (institution) som är bidragsgivare till text @sv
broader: tekstiin osallinen yhteisö
definition: Aggregaattiin kuuluvaa sisältöä selittävän tai koristavan kuvan yhteisötekijä.
definition: Upphovsinstitution för en bild som förklarar eller dekorerar innehåll som hör till ett aggregat. @sv
in scheme: Metatietosanasto
preferred label: illustratör @sv

ääniteknikko
type: Concept
source: Kansallinen RDA-termi
source: Nationell RDA-term @sv
created: 2024-12-18
modified: 2025-08-27
alternative label: liikkuvaan kuvaan osallinen ääniteknikko (yhteisö)
alternative label: ljudtekniker (institution) som är bidragsgivare till rörlig bild @sv
broader: liikkuvaan kuvaan osallinen yhteisö
definition: Aggregaattiin sisältyvän äänen teknisistä näkökohdista äänitys-, miksaus- ja äänentoistoprosessien aikana huolehtiva yhteisö.
definition: Institution som sköter de tekniska aspekterna på ljud som ingår i ett aggregat, under inspelnings-, mixnings- och ljudåtergivningsprocesser. @sv
in scheme: Metatietosanasto
preferred label: ljudtekniker @sv

liikkuvan kuvan tanssija
type: Concept
source: Kansallinen RDA-termi
source: Nationell RDA-term @sv
created: 2024-12-18
modified: 2025-07-05
alternative label: liikkuvaan kuvaan osallinen tanssija (henkilö)
alternative label: dansare (person) som är bidragsgivare till rörlig bild @sv
broader: liikkuvaan kuvaan osallinen henkilö
definition: Henkilö, joka tanssii aggregaattiin sisältyvässä liikkuvassa kuvassa.
definition: Person som dansar i rörlig bild som ingår i ett aggregat. @sv
in scheme: Metatietosanasto
preferred label: dansare i rörlig bild @sv

esittelijä
type: Concept
source: RDA-termi
source: RDA-term @sv
created: 2024-12-18
modified: 2025-06-05
alternative label: esittelijä (yhteisö)
alternative label: presentatör (institution) @sv
broader: esittäjä
definition: Yhteisö, joka on esittäjä, joka osallistuu ekspression tekemiseen esiintymällä televisiossa tai elokuvassa taustatiedon antajana. (RDA Registry)
definition: Institution som är en framförare, som deltar i utförandet av ett uttryck genom att framträda i tv eller film med bakgrundsinformation. @sv
in scheme: Metatietosanasto
preferred label: onscreen presenter corporate body @en
preferred label: presentatör @sv
scope note: Koskee ei-fiktiivisessä elokuvassa tai fiktiivisen elokuvan johdannossa esiintymistä. Ei koske esiintymistä ruudussa ei-esittävässä roolissa. (RDA Registry)
scope note: Gäller framträdande i icke-fiktiv film eller i inledning till fiktiv film. @sv

esittäjä
type: Concept
source: Kansallinen RDA-termi
source: Nationell RDA-term @sv
created: 2024-12-18
modified: 2025-05-29
alternative label: musiikkiin osallinen esittäjä (henkilö)
alternative label: framförande person som är bidragsgivare till musik @sv
broader: musiikkiin osallinen henkilö
definition: Aggregaattiin sisältyvässä esityksessä näyttelevä, tanssiva, musiikkia esittävä tai muussa roolissa esiintyvä henkilö.
definition: Person som uppträder med skådespel, dans, musik eller något annat, i en föreställning som ingår i ett aggregat. @sv
in scheme: Metatietosanasto
preferred label: framförande person @sv

vastaanottaja
type: Concept
source: RDA-termi
source: RDA-term @sv
created: 2024-12-18
modified: 2025-08-23
alternative label: vastaanottaja (henkilö)
alternative label: mottagare (person) @sv
broader: teokseen liittyvä henkilö
definition: Henkilö, jolle teos tai teoksen osa on osoitettu. (RDA Registry)
definition: Person till vilken ett verk eller en del av ett verk har riktats. @sv
in scheme: Metatietosanasto
preferred label: addressee person @en
preferred label: mottagare @sv

kokoelman muodostaja
type: Concept
source: RDA-termi
source: RDA-term @sv
created: 2024-12-18
modified: 2025-07-03
alternative label: kokoelman muodostaja (yhteisö)
alternative label: samlare (institution) @sv
broader: teoksen tekijä
definition: Yhteisö, joka vastaa kokoelmateoksen luomisesta valitsemalla ja järjestämällä kappaleita, jotka edustavat muiden teosten ilmentymää. (RDA Registry)
definition: Institution som svarar för skapandet av ett samlingsverk, genom att välja och ordna exemplar som representerar uttryck för andra verk. @sv
in scheme: Metatietosanasto
preferred label: collector corporate body @en
preferred label: samlare @sv

kääntäjä
type: Concept
source: RDA-termi
source: RDA-term @sv
created: 2024-12-18
modified: 2025-07-04
alternative label: kääntäjä (henkilö)
alternative label: översättare (person) @sv
broader: teoksen version tekijä
definition: Henkilö, joka osallistuu ekspression tekemiseen ilmaisemalla teoksen kielellisen sisällön alkuperäisen teoksen aiemmista ekspressioista poikkeavalla kielellä. (RDA Registry)
definition: Person som deltar i skapandet av ett uttryck, genom att uttrycka ett verks språkliga innehåll på ett språk som avviker från ett originalverks tidigare uttryck. @sv
in scheme: Metatietosanasto
preferred label: translator person @en
preferred label: översättare @sv
scope note: Kääntäjä voi myös kääntää kielisisältöä saman kielen eri aikakausien muotojen välillä. (RDA Registry)
scope note: En översättare kan också översätta språkligt innehåll mellan olika former av samma språk från olika tidsperioder. @sv

pöytäkirjan laatija
type: Concept
source: Kansallinen RDA-termi
source: Nationell RDA-term @sv
created: 2024-12-18
modified: 2025-08-16
alternative label: tekstiin osallinen pöytäkirjan laatija (yhteisö)
alternative label: protokollförare (institution) som är bidragsgivare till text @sv
broader: tekstiin osallinen yhteisö
definition: Aggregaattiin sisältyvän kokouspöytäkirjan laatinut yhteisö.
definition: Institution som sammanställt ett mötesprotokoll som ingår i ett aggregat. @sv
in scheme: Metatietosanasto
preferred label: protokollförare @sv

leikkaaja
type: Concept
source: Kansallinen RDA-termi
source: Nationell RDA-term @sv
created: 2024-12-18
modified: 2025-07-04
alternative label: liikkuvaan kuvaan osallinen leikkaaja (yhteisö)
alternative label: klippare (institution) som är bidragsgivare till rörlig bild @sv
broader: liikkuvaan kuvaan osallinen yhteisö
definition: Aggregaattiin sisältyvän filmin, videon tai muiden liikkuvan kuvan formaattien kokoamisesta, järjestämisestä ja leikkauksesta, sekä kuvan että äänen osalta, vastaava yhteisö.
definition: Institution som svarar för samling, ordnande och klippning av film, video eller andra format för rörlig bild som ingår i ett aggregat, både beträffande bild och ljud. @sv
in scheme: Metatietosanasto
preferred label: klippare @sv

liikkuvan kuvan äänisuunnittelija
type: Concept
source: Kansallinen RDA-termi
source: Nationell RDA-term @sv
created: 2024-12-18
modified: 2025-07-05
alternative label: liikkuvaan kuvaan osallinen äänisuunnittelija (henkilö)
alternative label: ljuddesigner (person) som är bidragsgivare till rörlig bild @sv
broader: liikkuvaan kuvaan osallinen henkilö
definition: Aggregaattiin sisältyvän liikkuvan kuvan ääniä suunnitteleva ja tekevä henkilö.
definition: Person som planerat och utfört ljud i rörlig bild som ingår i ett aggregat. @sv
in scheme: Metatietosanasto
preferred label: ljuddesigner för rörlig bild @sv

kappaleella kunnioitettu yhteisö
type: Concept
source: RDA-termi
source: RDA-term @sv
created: 2024-12-18
modified: 2025-04-10
alternative label: festskriftsföremål @sv
broader: kappaleeseen liittyvä yhteisö
definition: Yhteisö, jota kappaleella kunnioitetaan. (RDA Registry)
definition: Institution som är tillägnad ett exemplar. @sv
in scheme: Metatietosanasto
preferred label: honouree corporate body of item @en
preferred label: exemplar tillägnat institutionen @sv

lavastaja
type: Concept
source: Kansallinen RDA-termi
source: Nationell RDA-term @sv
created: 2024-12-18
modified: 2025-07-04
alternative label: liikkuvaan kuvaan osallinen lavastaja (henkilö)
alternative label: scenograf (person) som är bidragsgivare till rörlig bild @sv
broader: liikkuvaan kuvaan osallinen henkilö
definition: Aggregaattiin sisältyvän elokuvan tuotannon lavasteiden rakentajia valvova henkilö.
definition: Person som övervakar byggare av kulisser i en filmproduktion som ingår i ett aggregat. @sv
in scheme: Metatietosanasto
preferred label: scenograf @sv

ääniteknikko
type: Concept
source: Kansallinen RDA-termi
source: Nationell RDA-term @sv
created: 2024-12-18
modified: 2025-08-27
alternative label: liikkuvaan kuvaan osallinen ääniteknikko (henkilö)
alternative label: ljudtekniker (person) som är bidragsgivare till rörlig bild @sv
broader: liikkuvaan kuvaan osallinen henkilö
definition: Aggregaattiin sisältyvän äänen teknisistä näkökohdista äänitys-, miksaus- ja äänentoistoprosessien aikana huolehtiva henkilö.
definition: Person som sköter de tekniska aspekterna på ljud som ingår i ett aggregat, under inspelnings-, mixnings- och ljudåtergivningsprocesser. @sv
in scheme: Metatietosanasto
preferred label: ljudtekniker @sv

ohjelmoija
type: Concept
source: RDA-termi
source: RDA-term @sv
created: 2016-01-08
modified: 2025-08-15
alternative label: programmer @en
alternative label: ohjelmoija (suhde)
alternative label: ohjelmoija (toimija)
alternative label: programmoija
alternative label: programmerare (aktör) @sv
alternative label: programmerare (relation) @sv
broader: teoksen tekijä
definition: Toimija, joka on vastuussa tietokoneohjelman luomisesta. (RDA Registry)
definition: Aktör som svarar för skapandet av ett datorprogram. @sv
in scheme: Metatietosanasto
preferred label: programmer agent @en
preferred label: programmerare @sv

kokousten raportoija
type: Concept
source: RDA-termi
source: RDA-term @sv
created: 2024-12-18
modified: 2025-07-03
alternative label: kokousten raportoija (yhteisö)
alternative label: mötesrapportör (institution) @sv
broader: kirjoittaja
definition: Yhteisö, joka on kirjoittaja, joka on saanut organisaatiolta tehtäväkseen raportoida kokousmenettelyistä. (RDA Registry)
definition: Institution som är en författare, som fått i uppgift av en organisation att rapportera om mötesförfaranden. @sv
in scheme: Metatietosanasto
preferred label: rapporteur corporate body @en
preferred label: mötesrapportör @sv
scope note: Ei kata pöytäkirjan laatimiseen rajoittuvaa vastuuta. (RDA Registry)
scope note: Omfattar inte ansvar som är begränsat till protokollföring. @sv

julkaisemattoman aineiston tuottaja
type: Concept
source: RDA-termi
source: RDA-term @sv
created: 2024-12-18
modified: 2025-07-01
alternative label: julkaisemattoman manifestaation tuottaja (yhteisö)
alternative label: producent (institution) för opublicerad manifestation @sv
broader: aineiston tekijä
definition: Yhteisö, joka on vastuussa julkaisemattoman manifestaation kaiverruksesta, valmistuksesta, kokoonpanosta tai muusta tuotantotavasta. (RDA Registry)
definition: Institution som svarar för gravering, tillverkning, sammansättning eller annat tillverkningssätt för en opublicerad manifestation. @sv
in scheme: Metatietosanasto
preferred label: producer corporate body of unpublished manifestation @en
preferred label: producent för opublicerat material @sv

ääninäyttelijä
type: Concept
source: RDA-termi
source: RDA-term @sv
created: 2024-12-18
modified: 2025-08-27
alternative label: ääninäyttelijä (henkilö)
alternative label: röstskådespelare (person) @sv
broader: näyttelijä
definition: Henkilö, joka on näyttelijä, joka osallistuu ekspression tekemiseen antamalla äänen hahmoille radio- ja äänituotannoissa ja animoiduille hahmoille elokuvateoksissa sekä esiintymällä radio- ja TV-mainoksissa, dubatuissa ekspressioissa tms. (RDA Registry)
definition: Person som är en skådespelare, som deltar i utförandet av ett uttryck, genom att ge röst åt karaktärer i radio- och ljudproduktioner och animerade karaktärer i filmverk, samt genom att framträda i radio- och tv-reklarm, i dubbade uttryck etc. @sv
in scheme: Metatietosanasto
preferred label: voice actor person @en
preferred label: röstskådespelare @sv

lyhentäjä
type: Concept
source: RDA-termi
source: RDA-term @sv
created: 2024-12-18
modified: 2025-07-05
alternative label: lyhentäjä (yhteisö)
alternative label: förkortad av (institution) @sv
broader: tarkistaja
definition: Yhteisö, joka osallistuu ekspression tekemiseen lyhentämällä siihen liittyvän teoksen ekspressiota muuttamatta esityksen yleistä sisältöä tai tyyliä. (RDA Registry)
definition: Institution som deltar i skapandet av ett uttryck, genom att förkorta ett relaterat verks uttryck utan att förändra framställningens allmänna innehåll eller stil. @sv
in scheme: Metatietosanasto
preferred label: abridger corporate body @en
preferred label: förkortad av @sv
scope note: Ei koske oleellista muokkausta, joka johtaa uuden teoksen luomiseen. (RDA Registry)
scope note: Gäller inte betydande ändringar, som leder till skapandet av ett nytt verk. @sv

visuaalisten tehosteiden tekijä
type: Concept
source: Kansallinen RDA-termi
source: Nationell RDA-term @sv
created: 2024-12-18
modified: 2025-08-23
alternative label: liikkuvaan kuvaan osallinen visuaalisten tehosteiden tekijä (yhteisö)
alternative label: skapare (institution) av visuella effekter som är bidragsgivare till rörlig bild @sv
broader: liikkuvaan kuvaan osallinen yhteisö
definition: Aggregaattiin sisältyvän liikkuvan kuvan visuaaliset tehosteet jälkituotantovaiheessa suunnitteleva ja tekevä yhteisö.
definition: Institution som planerar och utför visuella effekter i postproduktionsfasen av rörlig bild som ingår i ett aggregat. @sv
in scheme: Metatietosanasto
preferred label: skapare av visuella effekter @sv

tekstiteoksen kirjoittaja
type: Concept
source: Kansallinen RDA-termi
source: Nationell RDA-term @sv
created: 2024-12-18
modified: 2025-08-22
alternative label: tekstiteoksen kirjoittaja (henkilö)
alternative label: författare (person) till textverk @sv
broader: kirjoittaja
definition: A person who is responsible for creating a textual work that complements a work. @en
definition: Henkilö, joka on vastuussa toista teosta täydentävän tekstin luomisesta.
definition: Person som svarar för skapandet av en text som kompletterar ett annat verk. @sv
in scheme: Metatietosanasto
preferred label: author person of textual work @en
preferred label: författare till textverk @sv

värittäjä
type: Concept
source: RDA-termi
source: RDA-term @sv
created: 2024-12-18
modified: 2025-08-23
alternative label: colorist person @en
alternative label: värittäjä (henkilö)
alternative label: färgläggare (person) @sv
broader: yhdistymään osallinen henkilö
definition: Henkilö, joka osallistuu ekspression tekemiseen värittämällä piirustuksia, vedoksia, valokuvia, karttoja, liikkuvia kuvia tai muuta sisältöä. (RDA Registry)
definition: Person som deltar i utförandet av ett uttryck, genom att färglägga ritningar, råkopior, fotografier, kartor, rörliga bilder eller annat innehåll. @sv
in scheme: Metatietosanasto
preferred label: colourist person @en
preferred label: färgläggare @sv

DJ
type: Concept
source: RDA-termi
source: RDA-term @sv
created: 2024-12-18
modified: 2025-08-28
alternative label: DJ (yhteisö)
alternative label: DJ (institution) @sv
alternative label: discjockey @sv
alternative label: diskjockey @sv
broader: esitykseen osallinen yhteisö
definition: Yhteisö, joka osallistuu ekspression tekemiseen miksaamalla ääniraitoja yhteen yhtäjaksoiseksi raidaksi live-esityksessä tai äänitysstudiossa. (RDA Registry)
definition: Institution som deltar i utförandet av ett uttryck genom att mixa ljudspår till ett sammanhängande spår under ett liveframträdande eller i en inspelningsstudio. @sv
in scheme: Metatietosanasto
preferred label: DJ corporate body @en
scope note: Ei koske uudelleenmiksauksia, jotka olennaisesti muuttavat alkuperäisen teoksen luonnetta ja sisältöä, mikä johtaa uuteen teokseen, eikä äänitteen useampien raitojen miksaamista ja yhdistelyä. (RDA Registry)
scope note: Gäller inte remixer som väsentligen ändrar det ursprungliga verkets karaktär och innehåll, vilket leder till ett nytt verk, och inte heller mixning och kombinering av flera spår i en ljudinspelning. @sv

paperinvalmistaja
type: Concept
source: RDA-termi
source: RDA-term @sv
created: 2024-12-18
modified: 2025-08-16
alternative label: paperinvalmistaja (yhteisö)
alternative label: pappersmakare @sv
alternative label: papperstillverkare (institution) @sv
broader: aineistoon liittyvä yhteisö
definition: Yhteisö, joka on vastuussa manifestaatioon käytettävän paperin valmistamisesta. (RDA Registry)
definition: Institution som svarar för tillverkningen av papper som använts i en manifestation. @sv
in scheme: Metatietosanasto
preferred label: papermaker corporate body @en
preferred label: papperstillverkare @sv

toimittaja
type: Concept
source: RDA-termi
source: RDA-term @sv
created: 2024-12-18
modified: 2025-08-23
alternative label: editor corporate body of text @en
alternative label: tekstin toimittaja (yhteisö)
alternative label: toimittaja (yhteisö)
alternative label: redaktör (institution) @sv
alternative label: redaktör (institution) för text @sv
broader: yhdistymään osallinen yhteisö
definition: Yhteisö, joka osallistuu ekspression tekemiseen tarkistamalla muiden toimijoiden luomaa sisältöä julkaisu- tai muiden käyttöstandardien saavuttamiseksi. (RDA Registry)
definition: Institution som deltar i utförandet av ett uttryck, genom att justera innehåll som skapats av andra aktörer, för att uppfylla utgivnings- och andra bruksstandarder. @sv
in scheme: Metatietosanasto
preferred label: editor corporate body @en
preferred label: redaktör @sv
scope note: Sisältöön kuuluvat liikenotaatio, nuottikirjoitus, taktiili liikenotaatio, taktiili nuottikirjoitus, taktiili teksti ja teksti. (RDA Registry)
scope note: Till innehåll hör rörelsenotation, taktil rörelsenotation, taktil musiknotation, taktil text och text. @sv

näyttämöohjaaja
type: Concept
source: Kansallinen RDA-termi
source: Nationell RDA-term @sv
created: 2024-12-18
modified: 2025-08-15
alternative label: liikkuvaan kuvaan osallinen näyttämöohjaaja (henkilö)
alternative label: scenregissör (person) som är bidragsgivare till rörlig bild @sv
broader: liikkuvaan kuvaan osallinen henkilö
definition: Aggregaattiin sisältyvää näyttämöesitystä johtava ja valvova henkilö.
definition: Person som leder och övervakar ett sceniskt framförande som ingår i ett aggregat. @sv
in scheme: Metatietosanasto
preferred label: scenregissör @sv

uudelleenmiksaaja
type: Concept
source: RDA-termi
source: RDA-term @sv
created: 2024-12-18
modified: 2025-11-25
alternative label: remiksaaja (henkilö)
alternative label: uudelleenmiksaaja (henkilö)
alternative label: remixer (person) @sv
broader: teoksen tekijä
definition: Henkilö, joka on vastuussa ääniteoksen luomisesta manipuloimalla, yhdistelemällä, sekoittamalla ja uudelleen tuottamalla aiemmin äänitettyjä ääniä. (RDA Registry)
definition: Person som svarar för skapandet av ett ljudverk, genom att manipulera, kombinera, blanda och återproducera tidigare inspelade ljud. @sv
in scheme: Metatietosanasto
preferred label: remix artist person @en
preferred label: remixer @sv
scope note: Ei kata uudelleenmiksaamista, joka ei oleellisesti muuta alkuperäisen teoksen luonnetta ja sisältöä eikä aiemmin äänitettyjen musiikkikappaleiden yhdistämistä yhdeksi musiikkikappaleeksi. (RDA Registry)
scope note: Gäller inte remixande som inte väsentligen ändrar det ursprungliga verkets karaktär och innehåll, och inte sammanfogande av tidigare inspelade musikstycken till ett musikstycke. @sv

ohjelmistokehittäjä
type: Concept
source: Kansallinen RDA-termi
source: Nationell RDA-term @sv
created: 2024-12-18
modified: 2025-08-14
alternative label: digitaaliseen sisältöön osallinen ohjelmistokehittäjä (henkilö)
alternative label: programutvecklare (person) som är bidragsgivare till digitalt innehåll @sv
broader: digitaaliseen sisältöön osallinen henkilö
definition: Aggregaatin digitaaliseen sisältöön kuuluvan tietokoneohjelman henkilötekijä.
definition: Upphovsperson till datorprogram som ingår i ett aggregats digitala innehåll. @sv
in scheme: Metatietosanasto
preferred label: programutvecklare @sv

elokuvatuottaja
type: Concept
source: RDA-termi
source: RDA-term @sv
created: 2024-12-18
modified: 2025-05-27
alternative label: elokuvatuottaja (henkilö)
alternative label: filmproducent (person) @sv
broader: tuottaja
definition: Henkilö, joka on tuottaja, joka on vastuussa suurimmasta osasta elokuvan tuotannon liiketoiminnasta. (RDA Registry)
definition: Person som är en producent, som svarar för största delen av affärsverksamheten kring en filmproduktion. @sv
in scheme: Metatietosanasto
preferred label: film producer person @en
preferred label: filmproducent @sv

maanmittari
type: Concept
source: RDA-termi
source: RDA-term @sv
created: 2024-12-18
modified: 2025-08-14
alternative label: surveyor @en
alternative label: maanmittari (toimija)
alternative label: lantmätare (aktör) @sv
broader: kartantekijä
definition: Toimija, joka kartografiaan osallisena toimijana tuottaa maantieteellisen alueen mitat tai mittasuhteet. (RDA Registry)
definition: Aktör som är delaktig aktör i kartografi och ger mått eller proportioner för ett geografiskt område. @sv
in scheme: Metatietosanasto
preferred label: surveyor agent @en
preferred label: lantmätare @sv

roolittaja
type: Concept
source: RDA-termi
source: RDA-term @sv
created: 2024-12-18
modified: 2025-08-19
alternative label: roolittaja (henkilö)
alternative label: castare @sv
alternative label: rollbesättare @sv
alternative label: rollsättare (person) @sv
broader: teoksen tekijä
definition: Henkilö, joka on vastuussa useimmista esiintyjien roolien ja tehtävien antamiseen kuuluvista tehtävistä. (RDA Registry)
definition: Person som svarar för de flesta uppgifter som hör till utdelandet av roller och uppgifter för framträdare. @sv
in scheme: Metatietosanasto
preferred label: casting director person @en
preferred label: rollsättare @sv

laulaja
type: Concept
source: Kansallinen RDA-termi
source: Nationell RDA-term @sv
created: 2024-12-18
modified: 2025-07-04
alternative label: musiikkiin osallinen laulaja (henkilö)
alternative label: sångare (person) som är bidragsgivare till musik @sv
broader: musiikkiin osallinen henkilö
definition: Aggregaattiin sisältyvässä musiikissa ääntään käyttämällä, säestyksellä tai ilman, esiintyvä henkilö. Lauluesitys voi sisältää tai olla sisältämättä todellisia sanoja.
definition: Person som uppträder i musik som ingår i ett aggregat, genom att använda sin röst, med eller utan ackompanjemang. Sångframförandet kan vara med eller utan riktiga ord. @sv
in scheme: Metatietosanasto
preferred label: sångare @sv

lahjoittaja
type: Concept
source: RDA-termi
source: RDA-term @sv
created: 2024-12-18
modified: 2025-07-04
alternative label: lahjoittaja (yhteisö)
alternative label: donator (institution) @sv
broader: aiempi omistaja
definition: Kappaleen aiempi omistajayhteisö, joka lahjoittaa sen toiselle omistajalle. (RDA Registry)
definition: Tidigare ägarinstitution till ett exemplar, som donerar det till en annan ägare. @sv
in scheme: Metatietosanasto
preferred label: donor corporate body @en
preferred label: donator @sv

esittelijä
type: Concept
source: Kansallinen RDA-termi
source: Nationell RDA-term @sv
created: 2024-12-18
modified: 2025-06-11
alternative label: liikkuvaan kuvaan osallinen esittelijä (yhteisö)
alternative label: presentatör (institution) som är bidragsgivare till rörlig bild @sv
broader: liikkuvaan kuvaan osallinen yhteisö
definition: Aggregaattiin kuuluvaan sisältöön liittyvää taustatietoa antava yhteisö televisio-ohjelmassa tai elokuvassa.
definition: Institution som ger bakgrundsinformation i tv-program eller film, i anslutning till innehåll som hör till ett aggregat. @sv
in scheme: Metatietosanasto
preferred label: presentatör @sv

henkilön perustama yhteisö
type: Concept
source: RDA-termi
source: RDA-term @sv
created: 2024-12-18
modified: 2025-01-11
broader: henkilöön liittyvä yhteisö
definition: Yhteisö, jonka henkilö on perustanut. (RDA Registry)
definition: Institution som en person grundat. @sv
in scheme: Metatietosanasto
preferred label: founded corporate body of person @en
preferred label: institution grundad av person @sv

DJ
type: Concept
source: RDA-termi
source: RDA-term @sv
created: 2024-12-18
modified: 2025-08-28
alternative label: DJ (henkilö)
alternative label: DJ (person) @sv
alternative label: discjockey @sv
alternative label: diskjockey @sv
broader: esitykseen osallinen henkilö
definition: Henkilö, joka osallistuu ekspression tekemiseen miksaamalla ääniraitoja yhteen yhtäjaksoiseksi raidaksi live-esityksessä tai äänitysstudiossa. (RDA Registry)
definition: Person som deltar i utförandet av ett uttryck genom att mixa ljudspår till ett sammanhängande spår under ett liveframträdande eller i en inspelningsstudio. @sv
in scheme: Metatietosanasto
preferred label: DJ person @en
scope note: Ei koske uudelleenmiksauksia, jotka olennaisesti muuttavat alkuperäisen teoksen luonnetta ja sisältöä, mikä johtaa uuteen teokseen, eikä äänitteen useampien raitojen miksaamista ja yhdistelyä. (RDA Registry)
scope note: Gäller inte remixer som väsentligen ändrar det ursprungliga verkets karaktär och innehåll, vilket leder till ett nytt verk, och inte heller mixning och kombinering av flera spår i en ljudinspelning. @sv

julkaisija
type: Concept
source: RDA-termi
source: RDA-term @sv
created: 2024-12-18
modified: 2025-07-01
alternative label: julkaisija (henkilö)
alternative label: utgivare (person) @sv
broader: teokseen liittyvä henkilö
definition: Henkilö, joka julkaisee teoksen. (RDA Registry)
definition: Person som ger ut ett verk. @sv
in scheme: Metatietosanasto
preferred label: issuing person @en
preferred label: utgivare @sv

kuvaaja
type: Concept
source: RDA-termi
source: RDA-term @sv
created: 2024-12-18
modified: 2025-07-04
alternative label: kuvaaja (henkilö)
alternative label: filmfotograf (person) @sv
broader: teoksen tekijä
definition: Henkilö, joka tallentaa kuvia joko sähköisesti tai filmille tai videolle ja usein valitsee ja järjestää valaistuksen. (RDA Registry)
definition: Person som spelar in bilder antingen elektroniskt, eller på film eller video, och ofta väljer och arrangerar belysningen. @sv
in scheme: Metatietosanasto
preferred label: director person of photography @en
preferred label: filmfotograf @sv
scope note: Elokuvan kuvaajaa kutsutaan myös elokuvaajaksi. (RDA Registry)

kuvaaja
type: Concept
source: Kansallinen RDA-termi
source: Nationell RDA-term @sv
created: 2024-12-18
modified: 2025-07-04
alternative label: liikkuvaan kuvaan osallinen kuvaaja (yhteisö)
alternative label: filmfotograf (institution) som är bidragsgivare till rörlig bild @sv
broader: liikkuvaan kuvaan osallinen yhteisö
definition: Aggregaattiin sisältyvän liikkuvan kuvan joko digitaalisesti, filmille tai videolle tallentava yhteisö. Voi hoitaa myös valaistuksen. Elokuvan kuvaajaa kutsutaan myös elokuvaajaksi.
definition: Institution som spelar in rörlig bild som ingår i ett aggregat antingen digitalt, på film eller på video. Kan även sköta belysning. @sv
in scheme: Metatietosanasto
preferred label: filmfotograf @sv

televisiotuottaja
type: Concept
source: RDA-termi
source: RDA-term @sv
created: 2024-12-18
modified: 2025-08-22
alternative label: televisiotuottaja (henkilö)
alternative label: tv-producent (person) @sv
broader: tuottaja
definition: Henkilö, joka on tuottaja, joka on vastuussa suurimmasta osasta televisio-ohjelman liiketoiminnasta. (RDA Registry)
definition: Person som är en producent, som svarar för största delen av affärsverksamheten kring ett tv-program. @sv
in scheme: Metatietosanasto
preferred label: television producer person @en
preferred label: tv-producent @sv

kappaleen entisöijä
type: Concept
source: RDA-termi
source: RDA-term @sv
created: 2024-12-18
modified: 2025-07-03
alternative label: kappaleen entisöijä (yhteisö)
alternative label: konservator (institution) av exemplar @sv
alternative label: restauratör av exemplar @sv
broader: muokkaaja
definition: Yhteisö, joka vastaa teknisistä, toimituksellisista ja tiedollisista toimenpiteistä, joiden tarkoitus on palauttaa huonokuntoinen kappale mahdollisimman lähelle sen alkuperäistä kuntoa. (RDA Registry)
definition: Institution som svarar för tekniska, redaktionella och kunskapsmässiga åtgärder, vilkas syfte är att återställa ett exemplar i dåligt skick så nära som möjligt dess ursprungliga skick. @sv
in scheme: Metatietosanasto
preferred label: restorationist corporate body of item @en
preferred label: konservator av exemplar @sv

painaja
type: Concept
source: RDA-termi
source: RDA-term @sv
created: 2024-12-18
modified: 2025-08-15
alternative label: painaja (yhteisö)
alternative label: tryckare (institution) @sv
broader: valmistaja
definition: Yhteisö, joka on vastuussa painetun tekstin, nuottiaineiston tai muun sisällön manifestaation valmistamiseen painolaatalta tai -levyltä. (RDA Registry)
definition: Institution som svarar för tillverkningen av tryckt text, notmaterial eller något annat innehålls manifestation, med tryckplåt eller dylikt. @sv
in scheme: Metatietosanasto
preferred label: printer corporate body @en
preferred label: tryckare @sv
scope note: Sisältää kirjan, sanomalehden, aikakauslehden, julisteen tai partituurin valmistamisen. (RDA Registry)
scope note: Omfattar tillverkning av böcker, dagstidningar, tidskrifter, planscher eller partitur. @sv

televisiotuottaja
type: Concept
source: RDA-termi
source: RDA-term @sv
created: 2024-12-18
modified: 2025-08-22
alternative label: televisiotuottaja (yhteisö)
alternative label: tv-producent (institution) @sv
broader: tuottaja
definition: Yhteisö, joka on tuottaja, joka on vastuussa suurimmasta osasta televisio-ohjelman liiketoiminnasta. (RDA Registry)
definition: Institution som är en producent, som svarar för största delen av affärsverksamheten kring ett tv-program. @sv
in scheme: Metatietosanasto
preferred label: television producer corporate body @en
preferred label: tv-producent @sv

transkriboija
type: Concept
source: RDA-termi
source: RDA-term @sv
created: 2024-12-18
modified: 2025-08-23
alternative label: transkriboija (yhteisö)
alternative label: transkriberare (institution) @sv
broader: tarkistaja
definition: Yhteisö, joka osallistuu ekspression tekemiseen kirjoittamalla muistiin tai nuotintamalla kirjoittamattoman tai nuotintamattoman sisällön tai muuttamalla sen merkintäjärjestelmästä toiseen. (RDA Registry)
definition: Institution som deltar i utförandet av ett uttryck, genom att uppteckna eller skriva ner noter för ett oskrivet eller onoterat innehåll eller ändra dess notationssystem till ett annat. @sv
in scheme: Metatietosanasto
preferred label: transcriber corporate body @en
preferred label: transkriberare @sv
scope note: Tähän ei kuulu musiikkiteoksen transkribointi eri soittimelle tai esitysryhmälle. (RDA Registry)
scope note: Hit hör inte transkribering av ett musikverk för ett annat instrument eller en annan framförande grupp. @sv

julkaisemattoman aineiston tuottaja
type: Concept
source: RDA-termi
source: RDA-term @sv
created: 2024-12-18
modified: 2025-07-01
alternative label: producer of unpublished manifestation @en
alternative label: julkaisemattoman manifestaation tuottaja
alternative label: julkaisemattoman manifestaation tuottaja (toimija)
alternative label: producent (aktör) för opublicerat material @sv
alternative label: producent för opublicerad manifestation @sv
broader: aineiston tekijä
definition: Toimija, joka on vastuussa julkaisemattoman manifestaation kaiverruksesta, valmistuksesta, kokoonpanosta tai muusta valmistustavasta. (RDA Registry)
definition: Aktör som svarar för gravering, tillverkning, sammansättning eller annat tillverkningssätt för en opublicerad manifestation. @sv
in scheme: Metatietosanasto
preferred label: producer agent of unpublished manifestation @en
preferred label: producent för opublicerat material @sv

puvustaja
type: Concept
source: Kansallinen RDA-termi
source: Nationell RDA-term @sv
created: 2024-12-18
modified: 2025-08-16
alternative label: liikkuvaan kuvaan osallinen puvustaja (henkilö)
alternative label: kostymör (person) som är bidragsgivare till rörlig bild @sv
broader: liikkuvaan kuvaan osallinen henkilö
definition: Aggregaattiin sisältyvän elokuvan, musiikki- tai näytelmäesityksen puvustuksen suunnitellut henkilö.
definition: Person som planerat kostymdesignen i en film, ett musikaliskt eller sceniskt framförande, som ingår i ett aggregat. @sv
in scheme: Metatietosanasto
preferred label: kostymör @sv

liikkuvaan kuvaan osallistuja
type: Concept
source: RDA-termi
source: RDA-term @sv
created: 2024-12-18
modified: 2025-07-05
alternative label: liikkuvaan kuvaan osallistuja (yhteisö)
alternative label: deltagare (institution) i rörlig bild @sv
broader: esitykseen osallinen yhteisö
definition: Yhteisö, joka osallistuu ei-fiktiivisen liikkuvan kuvan teoksen ekspression tekemiseen ottamalla aktiivisen roolin osallistujana. (RDA Registry)
definition: Institution som deltar i utförandet av ett uttryck av ett icke-fiktivt verk med rörlig bild, genom att ta en aktiv roll som deltagare. @sv
in scheme: Metatietosanasto
preferred label: onscreen participant corporate body @en
preferred label: deltagare i rörlig bild @sv
scope note: Ei koske esiintymistä lisä- tai taustatietojen kertojana. (RDA Registry)
scope note: Gäller inte uppträdande som berättare av tilläggs- eller bakgrundsinformation. @sv

moderoija
type: Concept
source: RDA-termi
source: RDA-term @sv
created: 2024-12-18
modified: 2025-08-14
alternative label: moderoija (henkilö)
alternative label: moderator (person) @sv
broader: esittäjä
definition: Henkilö, joka on esittäjä, joka osallistuu ekspression tekemiseen juontamalla (usein lähetettyä) ohjelmaa, jossa keskustellaan eri aiheista tavallisesti keskusteluun liittyvien aiheiden asiantuntijoiden kanssa. (RDA Registry)
definition: Person som är en framförare som deltar i utförandet av ett uttryck, genom att leda ett (ofta utsänt) program, i vilket olika ämnen diskuteras, vanligen tillsammans med experter i ämnen som relaterar till diskussionen. @sv
in scheme: Metatietosanasto
preferred label: moderator person @en
preferred label: moderator @sv

yhteisövastaaja siviilioikeudessa
type: Concept
source: RDA-termi
source: RDA-term @sv
created: 2024-12-18
modified: 2025-08-27
broader: yhteisövastaaja
definition: Yhteisö, jota vastaan on nostettu kanne. (RDA Registry)
definition: Institution mot vilken talan väckts. @sv
in scheme: Metatietosanasto
preferred label: civil defendant corporate body @en
preferred label: institution som svarande i civilmål @sv

kuoronjohtaja
type: Concept
source: RDA-termi
source: RDA-term @sv
created: 2024-12-18
modified: 2025-07-04
alternative label: kuoronjohtaja (yhteisö)
alternative label: kördirigent (institution) @sv
broader: johtaja
definition: Yhteisö, joka on johtaja, joka osallistuu ekspression tekemiseen johtamalla kuoroa musiikki- tai näytelmäesityksessä. (RDA Registry)
definition: Institution som är en dirigent som deltar i utförandet av ett uttryck, genom att leda en kör i en musik- eller dramaföreställning. @sv
in scheme: Metatietosanasto
preferred label: choral conductor corporate body @en
preferred label: kördirigent @sv

kappaleeseen liittyvä versio
type: Concept
source: RDA-termi
source: RDA-term @sv
created: 2024-12-18
modified: 2025-07-03
Vastavuoroinen suhde: versioon liittyvä kappale
alternative label: kappaleeseen liittyvä ekspressio
alternative label: uttryck relaterat till exemplaret @sv
definition: Ekspressio, joka liittyy kappaleeseen. (RDA Registry)
definition: Uttryck som relaterar till ett exemplar. @sv
in scheme: Metatietosanasto
preferred label: related expression of item @en
preferred label: version relaterad till exemplaret @sv

haastattelija (ekspressio)
type: Concept
source: RDA-termi
source: RDA-term @sv
created: 2024-12-18
modified: 2026-03-10
alternative label: ekspression haastattelija (henkilö)
alternative label: version haastattelija
alternative label: intervjuare (person) i uttryck @sv
broader: esitykseen osallinen henkilö
definition: Henkilö, joka osallistuu ekspression tekemiseen toimimalla haastattelijana, toimittajana, mielipidetutkijana tai jonain muuna toimijana, joka kerää tietoja. (RDA Registry)
definition: Person som deltar i utförandet av ett uttryck genom att fungera som intervjuare, journalist, opinionsmätare eller någon annan aktör som samlar in information. @sv
in scheme: Metatietosanasto
preferred label: interviewer person of expression @en
preferred label: intervjuare (uttryck) @sv

tuomioistuimen kirjuri
type: Concept
source: Kansallinen RDA-termi
source: Nationell RDA-term @sv
created: 2024-12-18
modified: 2025-08-23
alternative label: tekstiin osallinen tuomioistuimen kirjuri (yhteisö)
alternative label: domstolssekreterare (institution) som är bidragsgivare till text @sv
broader: tekstiin osallinen yhteisö
definition: Aggregaattiin sisältyvän tuomioistuimen lausunnon julkaistavaksi valmisteleva yhteisö.
definition: Institution som förbereder en domstols utlåtande, som ingår i ett aggregat, för publicering. @sv
in scheme: Metatietosanasto
preferred label: domstolssekreterare @sv

teoksen valokuvaaja
type: Concept
source: RDA-termi
source: RDA-term @sv
created: 2024-12-18
modified: 2025-08-23
alternative label: teoksen valokuvaaja (yhteisö)
alternative label: fotograf (institution) till verk @sv
broader: teoksen tekijä
definition: Yhteisö, joka on vastuussa valokuvateoksen luomisesta. (RDA Registry)
definition: Institution som svarar för skapandet av ett fotografiskt verk. @sv
in scheme: Metatietosanasto
preferred label: photographer corporate body of work @en
preferred label: fotograf till verk @sv

kääntäjä
type: Concept
source: Kansallinen RDA-termi
source: Nationell RDA-term @sv
created: 2024-12-18
modified: 2025-07-04
alternative label: tekstiin osallinen kääntäjä (yhteisö)
alternative label: översättare (institution) som är bidragsgivare till text @sv
broader: tekstiin osallinen yhteisö
definition: Aggregaattiin sisältyvää tekstiä alkuperäisestä sisällöstä poikkeavaan kieleen kääntänyt yhteisö. Kääntäjä voi myös kääntää kielisisältöä saman kielen eri aikakausien muotojen välillä.
definition: Institution som översatt en text som ingår i ett aggregat, till ett språk som avviker från det ursprungliga innehållet. En översättare kan också översätta språkligt innehåll mellan olika former av samma språk från olika tidsperioder. @sv
in scheme: Metatietosanasto
preferred label: översättare @sv

taltioija
type: Concept
source: Kansallinen RDA-termi
source: Nationell RDA-term @sv
created: 2024-12-18
modified: 2025-08-21
alternative label: musiikkiin osallinen taltioija (henkilö)
alternative label: inspelande aktör (person) som är bidragsgivare till musik @sv
broader: musiikkiin osallinen henkilö
definition: Aggregaattiin sisältyvän tallenteen äänityksen teknistä puolta valvova henkilö.
definition: Person som övervakar den tekniska delen av upptagningen av en ljudinspelning som ingår i ett aggregat. @sv
in scheme: Metatietosanasto
preferred label: inspelande person @sv

dubbausohjaaja
type: Concept
source: Kansallinen RDA-termi
source: Nationell RDA-term @sv
created: 2024-12-18
modified: 2025-05-27
alternative label: liikkuvaan kuvaan osallinen dubbausohjaaja (yhteisö)
alternative label: dubbningsregissör (institution) som är bidragsgivare till rörlig bild @sv
broader: liikkuvaan kuvaan osallinen yhteisö
definition: Aggregaattiin sisältyvää ääniraitaa täydentävän dialogin tai muiden äänien lisäämisen yleisestä johtamisesta ja valvonnasta vastaava yhteisö.
definition: Institution som svarar för allmän ledning och övervakning av tillägget av dialog eller andra röster, som kompletterar ett ljudspår som ingår i ett aggregat. @sv
in scheme: Metatietosanasto
preferred label: dubbningsregissör @sv

tutkija
type: Concept
source: Kansallinen RDA-termi
source: Nationell RDA-term @sv
created: 2024-12-18
modified: 2025-08-23
alternative label: tekstiin osallinen tutkija (henkilö)
alternative label: forskare (person) som är bidragsgivare till text @sv
broader: tekstiin osallinen henkilö
definition: Aggregaattiin sisältyvän tutkimuksen henkilötekijä.
definition: Upphovsperson till forskning som ingår i ett aggregat. @sv
in scheme: Metatietosanasto
preferred label: forskare @sv

toimituspäällikkö
type: Concept
source: RDA-termi
source: RDA-term @sv
created: 2024-12-18
modified: 2025-08-23
alternative label: toimituspäällikkö (yhteisö)
alternative label: redaktionschef (institution) @sv
broader: teoksen tekijä
definition: Yhteisö, jolla on juridinen tai tiedollinen vastuu, mutta ei luovaa vastuuta, diakronisen teoksen toimituslinjasta ja sisällöstä. (RDA Registry)
definition: Institution som har ett juridiskt eller kunskapsmässigt ansvar, men inte kreativt ansvar, för ett diakroniskt verks redaktionella linje och innehåll. @sv
in scheme: Metatietosanasto
preferred label: editorial director corporate body @en
preferred label: redaktionschef @sv
scope note: Ei kata teoksen ekspression sisällön tarkastamista, selkeyttämistä tai muuta muutosta. (RDA Registry)
scope note: Gäller inte justering, förtydligande eller annan ändring av innehållet i ett verks uttryck. @sv

tekstaaja
type: Concept
source: Kansallinen RDA-termi
source: Nationell RDA-term @sv
created: 2024-12-18
modified: 2025-08-22
alternative label: tekstiin osallinen tekstaaja (henkilö)
alternative label: textare (person) som är bidragsgivare till text @sv
broader: tekstiin osallinen henkilö
definition: Aggregaattiin sisältyvän sarjakuvasisällön tekstin ja graafiset äänitehosteet piirtävä henkilö.
definition: Person som ritar text och grafiska ljudeffekter i serieinnehåll som ingår i ett aggregat. @sv
in scheme: Metatietosanasto
preferred label: textare @sv

keksijä
type: Concept
source: Kansallinen RDA-termi
source: Nationell RDA-term @sv
created: 2024-12-18
modified: 2025-07-03
alternative label: esineeseen osallinen keksijä (henkilö)
alternative label: uppfinnare (person) som är bidragsgivare till föremål @sv
broader: esineeseen osallinen henkilö
definition: Aggregaattiin liittyvän uuden välineen tai menetelmän luonut henkilö.
definition: Person som skapat ett nytt redskap eller en ny metod som ingår i ett aggregat. @sv
in scheme: Metatietosanasto
preferred label: uppfinnare @sv

liikkuvan kuvan puhuja
type: Concept
source: Kansallinen RDA-termi
source: Nationell RDA-term @sv
created: 2024-12-18
modified: 2025-07-05
alternative label: liikkuvaan kuvaan osallinen puhuja (yhteisö)
alternative label: talare (institution) som är bidragsgivare till rörlig bild @sv
broader: liikkuvaan kuvaan osallinen yhteisö
definition: Aggregaattiin sisältyvässä liikkuvassa kuvassa puhuva yhteisö. Esimerkiksi luennon tai puheen pitäjä.
definition: Institution som talar i rörlig bild som ingår i ett aggregat. Till exempel föredrags- eller talhållare. @sv
in scheme: Metatietosanasto
preferred label: talare i rörlig bild @sv

suvun kantasuku
type: Concept
source: RDA-termi
source: RDA-term @sv
created: 2024-12-18
modified: 2025-08-21
alternative label: descendant family of @en
alternative label: kantasuku
alternative label: stamsläkt @sv
broader: sukuhaara suvussa
definition: Suku, josta toinen suku polveutuu. (RDA Registry)
definition: Släkt som en annan släkt härstammar från. @sv
in scheme: Metatietosanasto
preferred label: descendant family of family of @en
preferred label: släktens stamsläkt @sv

piirtäjä
type: Concept
source: Kansallinen RDA-termi
source: Nationell RDA-term @sv
created: 2024-12-18
modified: 2025-08-16
alternative label: esineeseen osallinen piirtäjä (henkilö)
alternative label: ritare (person) som är bidragsgivare till föremål @sv
broader: esineeseen osallinen henkilö
definition: Aggregaattiin sisältyviä tarkkoja suunnitelmia tai piirroksia rakennuksista, laivoista, lentokoneista, laitteista, esineistä laatinut henkilö.
definition: Person som utarbetat precisa planer eller ritningar av byggnader, fartyg, flygplan, apparater eller föremål, som ingår i ett aggregat. @sv
in scheme: Metatietosanasto
preferred label: ritare @sv

roolittaja
type: Concept
source: RDA-termi
source: RDA-term @sv
created: 2024-12-18
modified: 2025-08-19
alternative label: roolittaja (yhteisö)
alternative label: castare @sv
alternative label: rollbesättare @sv
alternative label: rollsättare (institution) @sv
broader: teoksen tekijä
definition: Yhteisö, joka on vastuussa useimmista esiintyjien roolien ja tehtävien antamiseen kuuluvista tehtävistä. (RDA Registry)
definition: Institution som svarar för de flesta uppgifter som hör till utdelandet av roller och uppgifter för framträdare. @sv
in scheme: Metatietosanasto
preferred label: casting director corporate body @en
preferred label: rollsättare @sv

tallettaja
type: Concept
source: RDA-termi
source: RDA-term @sv
created: 2024-12-18
modified: 2025-08-21
alternative label: tallettaja (yhteisö)
alternative label: deponent @sv
alternative label: deponerat av (institution) @sv
broader: nykyinen omistaja
definition: Kappaleen nykyinen omistajayhteisö, joka tallettaa kappaleen toisen toimijan huostaan omistajuudesta luopumatta. (RDA Registry)
definition: Nuvarande ägarinstitution till ett exemplar, som förvarar exemplaret hos en annan aktör, utan att överlåta ägarskapet. @sv
in scheme: Metatietosanasto
preferred label: depositor corporate body @en
preferred label: deponerat av @sv

näyttämöohjaaja
type: Concept
source: Kansallinen RDA-termi
source: Nationell RDA-term @sv
created: 2024-12-18
modified: 2025-08-15
alternative label: liikkuvaan kuvaan osallinen näyttämöohjaaja (yhteisö)
alternative label: scenregissör (institution) som är bidragsgivare till rörlig bild @sv
broader: liikkuvaan kuvaan osallinen yhteisö
definition: Aggregaattiin sisältyvää näyttämöesitystä johtava ja valvova yhteisö.
definition: Institution som leder och övervakar ett sceniskt framförande som ingår i ett aggregat. @sv
in scheme: Metatietosanasto
preferred label: scenregissör @sv

puheeseen osallinen toimija
type: Concept
source: RDA-termi
source: RDA-term @sv
created: 2024-12-18
modified: 2025-08-16
broader: aggregaattiin osallinen toimija
definition: Aggregaattiin osallinen toimija, joka on luonut aggregaattiin sisältyvän puheteoksen ekspression. (RDA Registry)
definition: Aktör som bidragit till ett aggregat och skapat ett uttryck av ett talverk som ingår i ett aggregat. @sv
in scheme: Metatietosanasto
preferred label: contributor agent of speech @en
preferred label: bidragsgivare (aktör) till tal @sv

musiikin äänittäjä
type: Concept
source: Kansallinen RDA-termi
source: Nationell RDA-term @sv
created: 2024-12-18
modified: 2025-08-14
alternative label: musiikkiin osallinen äänittäjä (henkilö)
alternative label: inspelningstekniker (person) som är bidragsgivare till musik @sv
broader: musiikkiin osallinen henkilö
definition: Aggregaattiin sisältyvän äänityksen teknistä toteutusta valvova henkilö.
definition: Person som övervakar det tekniska förverkligandet av en ljudinspelning som ingår i ett aggregat. @sv
in scheme: Metatietosanasto
preferred label: inspelningstekniker för musik @sv

videon musiikin säveltäjä
type: Concept
source: Kansallinen RDA-termi
source: Nationell RDA-term @sv
created: 2024-12-18
modified: 2025-08-23
alternative label: videon musiikin säveltäjä (henkilö)
alternative label: kompositör (person) av videomusik @sv
broader: säveltäjä
definition: A person who is responsible for creating a video music work that complements a musical work. @en
definition: Henkilö, joka on vastuussa videota täydentävän musiikin luomisesta.
definition: Person som svarar för skapandet av musik som kompletterar en video. @sv
in scheme: Metatietosanasto
preferred label: composer person of video music work @en
preferred label: kompositör av videomusik @sv

elokuvatuottaja
type: Concept
source: Kansallinen RDA-termi
source: Nationell RDA-term @sv
created: 2024-12-18
modified: 2025-05-27
alternative label: liikkuvaan kuvaan osallinen elokuvatuottaja (henkilö)
alternative label: filmproducent (person) som är bidragsgivare till rörlig bild @sv
broader: liikkuvaan kuvaan osallinen henkilö
definition: Aggregaattiin sisältyvän elokuvan tuotannon liiketoiminnasta ensisijaisesti vastaava henkilö.
definition: Person som i första hand svarar för affärsverksamheten kring produktionen av en film som ingår i ett aggregat. @sv
in scheme: Metatietosanasto
preferred label: filmproducent @sv

leikkaaja
type: Concept
source: RDA-termi
source: RDA-term @sv
created: 2024-12-18
modified: 2025-07-04
alternative label: leikkaaja (henkilö)
alternative label: klippare (person) @sv
broader: yhdistymään osallinen henkilö
definition: Henkilö, joka vastaa filmin, videon tai muiden liikkuvan kuvan formaattien kokoamisesta, järjestämisestä ja leikkauksesta sekä kuvan että äänen osalta. (RDA Registry)
definition: Person som svarar för samling, ordnande och klippning av film, video eller andra format för rörlig bild, både beträffande bild och ljud. @sv
in scheme: Metatietosanasto
preferred label: editor person of moving image work @en
preferred label: klippare @sv

sarjakuvantekijä
type: Concept
source: Kansallinen RDA-termi
source: Nationell RDA-term @sv
created: 2024-12-18
modified: 2025-08-19
alternative label: stillkuvaan osallinen sarjakuvantekijä (yhteisö)
alternative label: serieskapare (institution) som är bidragsgivare till stillbild @sv
broader: stillkuvaan osallinen yhteisö
definition: Aggregaattiin sisältyvän sarjakuvan kuvien yhteisötekijä.
definition: Upphovsinstitution för bilder i tecknad serie som ingår i ett aggregat. @sv
in scheme: Metatietosanasto
preferred label: serieskapare @sv

valokuvaaja
type: Concept
source: Kansallinen RDA-termi
source: Nationell RDA-term @sv
created: 2024-12-18
modified: 2025-08-23
alternative label: stillkuvaan osallinen valokuvaaja (henkilö)
alternative label: fotograf (person) som är bidragsgivare till stillbild @sv
broader: stillkuvaan osallinen henkilö
definition: Aggregaattiin sisältyvän valokuvan henkilötekijä.
definition: Upphovsperson till fotografi som ingår i ett aggregat. @sv
in scheme: Metatietosanasto
preferred label: fotograf @sv

näyttelijä
type: Concept
source: Kansallinen RDA-termi
source: Nationell RDA-term @sv
created: 2024-12-18
modified: 2025-08-15
alternative label: liikkuvaan kuvaan osallinen näyttelijä (yhteisö)
alternative label: skådespelare (institution) som är bidragsgivare till rörlig bild @sv
broader: liikkuvaan kuvaan osallinen yhteisö
definition: Aggregaattiin sisältyvässä musiikki- tai näytelmäesityksessä näyttelevä yhteisö.
definition: Institution som skådespelar i ett musikaliskt eller sceniskt uppförande som ingår i ett aggregat. @sv
in scheme: Metatietosanasto
preferred label: skådespelare @sv

maanmittari
type: Concept
source: RDA-termi
source: RDA-term @sv
created: 2024-12-18
modified: 2025-08-14
alternative label: maanmittari (yhteisö)
alternative label: lantmätare (institution) @sv
broader: kartantekijä
definition: Yhteisö, joka kartografiaan osallisena toimijana tuottaa maantieteellisen alueen mitat tai mittasuhteet. (RDA Registry)
definition: Institution som är delaktig aktör i kartografi och ger mått eller proportioner för ett geografiskt område. @sv
in scheme: Metatietosanasto
preferred label: surveyor corporate body @en
preferred label: lantmätare @sv

uudelleenmiksaaja
type: Concept
source: RDA-termi
source: RDA-term @sv
created: 2024-12-18
modified: 2025-11-25
alternative label: remiksaaja (yhteisö)
alternative label: uudelleenmiksaaja (yhteisö)
alternative label: remixer (institution) @sv
broader: teoksen tekijä
definition: Yhteisö, joka on vastuussa ääniteoksen luomisesta manipuloimalla, yhdistelemällä, sekoittamalla ja uudelleen tuottamalla aiemmin äänitettyjä ääniä. (RDA Registry)
definition: Institution som svarar för skapandet av ett ljudverk, genom att manipulera, kombinera, blanda och återproducera tidigare inspelade ljud. @sv
in scheme: Metatietosanasto
preferred label: remix artist corporate body @en
preferred label: remixer @sv
scope note: Ei kata uudelleenmiksaamista, joka ei oleellisesti muuta alkuperäisen teoksen luonnetta ja sisältöä eikä aiemmin äänitettyjen musiikkikappaleiden yhdistämistä yhdeksi musiikkikappaleeksi. (RDA Registry)
scope note: Gäller inte remixande som inte väsentligen ändrar det ursprungliga verkets karaktär och innehåll, och inte sammanfogande av tidigare inspelade musikstycken till ett musikstycke. @sv

sitoja
type: Concept
source: RDA-termi
source: RDA-term @sv
created: 2024-12-18
modified: 2025-08-19
alternative label: sitoja (yhteisö)
alternative label: bokbindare (institution) @sv
broader: muokkaaja
definition: Yhteisö, joka sitoo kappaleen. (RDA Registry)
definition: Institution som binder ett exemplar. @sv
in scheme: Metatietosanasto
preferred label: binder corporate body @en
preferred label: bokbindare @sv

haastattelija
type: Concept
source: Kansallinen RDA-termi
source: Nationell RDA-term @sv
created: 2024-12-18
modified: 2025-06-13
alternative label: tekstiin osallinen teoksen haastattelija (yhteisö)
alternative label: intervjuare (institution) som är bidragsgivare till text i verk @sv
broader: tekstiin osallinen yhteisö
definition: Aggregaattiin sisältyviä tietoja keräävä yhteisö. Haastattelee, raportoi, tekee kyselytutkimusta tai kerää ihmisiltä tietoa muulla tavoin.
definition: Institution som samlar information som ingår i ett aggregat, genom att intervjua, rapportera, göra gallup eller på annat sätt samla in uppgifter från människor. @sv
in scheme: Metatietosanasto
preferred label: intervjuare @sv

asiantuntija
type: Concept
source: RDA-termi
source: RDA-term @sv
created: 2024-12-18
modified: 2025-04-16
alternative label: asiantuntija (henkilö)
alternative label: expert (person) @sv
broader: teoksen tekijä
definition: Henkilö, joka tarjoaa asiantuntijapalveluita ja usein antaa suosituksia toimijalle, joka esiintyy teoksen tekijänä. (RDA Registry)
definition: Person som erbjuder experttjänster och ofta ger rekommendationer åt en aktör, som är upphovsperson till ett verk. @sv
in scheme: Metatietosanasto
preferred label: consultant person @en
preferred label: expert @sv

nukettaja
type: Concept
source: Kansallinen RDA-termi
source: Nationell RDA-term @sv
created: 2024-12-18
modified: 2025-08-15
alternative label: liikkuvaan kuvaan osallinen nukettaja (yhteisö)
alternative label: dockspelare (institution) som är bidragsgivare till rörlig bild @sv
broader: liikkuvaan kuvaan osallinen yhteisö
definition: Aggregaattiin sisältyvässä esityksessä tai filmissä nukkeja käsittelevä yhteisö.
definition: Institution som hanterar dockor i en föreställning eller film som ingår i ett aggregat. @sv
in scheme: Metatietosanasto
preferred label: dockspelare @sv

toimeksiantaja
type: Concept
source: RDA-termi
source: RDA-term @sv
created: 2024-12-18
modified: 2025-08-23
alternative label: toimeksiantaja (yhteisö)
alternative label: beställare @sv
alternative label: uppdragsgivare (institution) @sv
broader: teokseen liittyvä yhteisö
definition: Yhteisö, joka on vastuussa teoksen teettämisestä. (RDA Registry)
definition: Institution som svarar för beställandet av ett verk. @sv
in scheme: Metatietosanasto
preferred label: commissioning corporate body @en
preferred label: uppdragsgivare @sv

liikkuvaan kuvaan osallistuja
type: Concept
source: RDA-termi
source: RDA-term @sv
created: 2024-12-18
modified: 2025-07-05
alternative label: liikkuvaan kuvaan osallistuja (henkilö)
alternative label: deltagare (person) i rörlig bild @sv
broader: esitykseen osallinen henkilö
definition: Henkilö, joka osallistuu ei-fiktiivisen liikkuvan kuvan teoksen ekspression tekemiseen ottamalla aktiivisen roolin osallistujana. (RDA Registry)
definition: Person som deltar i utförandet av ett uttryck av ett icke-fiktivt verk med rörlig bild, genom att ta en aktiv roll som deltagare. @sv
in scheme: Metatietosanasto
preferred label: onscreen participant person @en
preferred label: deltagare i rörlig bild @sv
scope note: Ei koske esiintymistä lisä- tai taustatietojen kertojana. (RDA Registry)
scope note: Gäller inte uppträdande som berättare av tilläggs- eller bakgrundsinformation. @sv

sanoittaja
type: Concept
source: Kansallinen RDA-termi
source: Nationell RDA-term @sv
created: 2024-12-18
modified: 2025-08-19
alternative label: musiikkiin osallinen sanoittaja (yhteisö)
alternative label: författare till sångtext @sv
alternative label: sångtextförfattare (institution) som är bidragsgivare till musik @sv
broader: musiikkiin osallinen yhteisö
definition: Aggregaattiin sisältyvään populaarimusiikkiin kuuluvan laulun, mukaan lukien musikaalilaulun, sanat kirjoittanut yhteisö.
definition: Institution som är författare till ord i en sång, även en musikalsång, som hör till populärmusik. @sv
in scheme: Metatietosanasto
preferred label: sångtextförfattare @sv

musiikkiohjelmoija
type: Concept
source: RDA-termi
source: RDA-term @sv
created: 2024-12-18
modified: 2025-08-14
alternative label: musiikkiohjelmoija (henkilö)
alternative label: musikprogrammerare (person) @sv
broader: esitykseen osallinen henkilö
definition: Henkilö, joka osallistuu musiikkiteoksen ekspression tekemiseen tuottamalla ääniä sähköisillä äänilaitteilla tai tietokoneohjelmilla. (RDA Registry)
definition: Person som deltar i skapandet av ett musikverks uttryck, genom att producera ljud med elektriska ljudenheter eller datorprogram. @sv
in scheme: Metatietosanasto
preferred label: music programmer person @en
preferred label: musikprogrammerare @sv
scope note: Ei koske uuden musiikkiteoksen luomista. (RDA Registry)
scope note: Gäller inte skapandet av ett nytt musikverk. @sv

haastateltava (ekspressio)
type: Concept
source: RDA-termi
source: RDA-term @sv
created: 2024-12-18
modified: 2026-03-10
alternative label: ekspression haastateltava (henkilö)
alternative label: version haastateltava
alternative label: intervjuobjekt (person) i uttryck @sv
broader: esitykseen osallinen henkilö
definition: Henkilö, joka osallistuu teoksen ekspression tekemiseen vastaamalla haastattelijalle, tavallisesti toimittajalle, mielipidetutkijalle tai jollekin muulle toimijalle, joka kerää tietoja. (RDA Registry)
definition: Person som deltar i utförandet av ett uttryck av ett verk genom att svara en intervjuare, vanligen en journalist, opinionsmätare eller någon annan aktör, som samlar information. @sv
in scheme: Metatietosanasto
preferred label: interviewee person of expression @en
preferred label: intervjuobjekt (uttryck) @sv

sensori
type: Concept
source: Kansallinen RDA-termi
source: Nationell RDA-term @sv
created: 2024-12-18
modified: 2025-08-19
alternative label: liikkuvaan kuvaan osallinen sensori (yhteisö)
alternative label: censor (institution) som är bidragsgivare till rörlig bild @sv
broader: liikkuvaan kuvaan osallinen yhteisö
definition: Aggregaattiin sisältyvää liikkuvaa kuvaa tarkastava yhteisö. Sensori tarkastaa sisältöä kiistanalaisen sisällön salaamiseksi moraalisin, poliittisin, sotilaallisin tai muin perustein. Alkuperäisen teoksen luonteen ja yleisen sisällön sensori jättää olennaisilta osiltaan muuttumattomaksi.
definition: Institution som granskar rörlig bild som ingår i ett aggregat. Censorn granskar innehållet för att dölja kontroversiellt innehåll på moraliska, politiska, militära eller andra grunder. Det ursprungliga verkets karaktär och allmänna innehåll lämnas till sina väsentliga delar oförändrat. @sv
in scheme: Metatietosanasto
preferred label: censor @sv

teoksella kunnioitettu henkilö
type: Concept
source: RDA-termi
source: RDA-term @sv
created: 2024-12-18
modified: 2025-08-22
alternative label: honoree person of work @en
alternative label: festskriftsföremål @sv
broader: teokseen liittyvä henkilö
definition: Henkilö, jonka kunniaksi teos on tehty. (RDA Registry)
definition: Person till vilkens ära ett verk har gjorts. @sv
in scheme: Metatietosanasto
preferred label: honouree person of work @en
preferred label: verk tillägnat personen @sv

DJ
type: Concept
source: Kansallinen RDA-termi
source: Nationell RDA-term @sv
created: 2024-12-18
modified: 2025-04-15
alternative label: musiikkiin osallinen DJ (yhteisö)
alternative label: DJ (institution) som är bidragsgivare till musik @sv
alternative label: discjockey @sv
alternative label: diskjockey @sv
broader: musiikkiin osallinen yhteisö
definition: Aggregaattiin sisältyviä ääniraitoja yhteen yhtäjaksoiseksi raidaksi live-esityksessä tai äänitysstudiossa miksaava yhteisö.
definition: Institution som mixar ljudspår som ingår i ett aggregat till ett sammanhängande spår under ett liveframträdande eller i en inspelningsstudio. @sv
in scheme: Metatietosanasto

sukuun liittyvä henkilö
type: Concept
source: RDA-termi
source: RDA-term @sv
created: 2024-12-18
modified: 2025-08-21
definition: Henkilö, joka liittyy sukuun. (RDA Registry)
definition: Person som relaterar till en släkt. @sv
in scheme: Metatietosanasto
narrower: suvun henkilöjäsen
preferred label: related person of family @en
preferred label: person relaterad till släkten @sv

taiteilija
type: Concept
source: Kansallinen RDA-termi
source: Nationell RDA-term @sv
created: 2024-12-18
modified: 2025-08-21
alternative label: stillkuvaan osallinen taiteilija (yhteisö)
alternative label: konstnär (institution) som är bidragsgivare till stillbild @sv
broader: stillkuvaan osallinen yhteisö
definition: Aggregaattiin sisältyvän alkuperäisen graafisen suunnitelman, piirroksen, maalauksen tms. yhteisötekijä.
definition: Upphovsinstitution till en ursprunglig grafisk design, teckning, målning eller dylikt, som ingår i ett aggregat. @sv
in scheme: Metatietosanasto
preferred label: konstnär @sv

kokoelman muodostaja
type: Concept
source: RDA-termi
source: RDA-term @sv
created: 2024-12-18
modified: 2025-07-03
alternative label: kokoelman muodostaja (toimija)
alternative label: samlare (aktör) @sv
broader: teoksen tekijä
definition: Toimija, joka vastaa kokoelmateoksen luomisesta valitsemalla ja järjestämällä kappaleita, jotka edustavat muiden teosten ilmentymää. (RDA Registry)
definition: Aktör som svarar för skapandet av ett samlingsverk, genom att välja och ordna exemplar som representerar uttryck för andra verk. @sv
in scheme: Metatietosanasto
preferred label: collector agent @en
preferred label: samlare @sv

designer
type: Concept
source: Kansallinen RDA-termi
source: Nationell RDA-term @sv
created: 2024-12-18
modified: 2025-04-16
alternative label: esineeseen osallinen designer (yhteisö)
alternative label: designer (institution) som är bidragsgivare till föremål @sv
broader: esineeseen osallinen yhteisö
definition: Aggregaattiin liittyvän kohteen suunnitellut tai muotoillut yhteisö.
definition: Institution som designat eller formgett ett objekt som relaterar till ett aggregat. @sv
in scheme: Metatietosanasto

musiikillinen johtaja
type: Concept
source: RDA-termi
source: RDA-term @sv
created: 2024-12-18
modified: 2025-08-14
alternative label: musiikillinen johtaja (yhteisö)
alternative label: musikalisk ledare (institution) @sv
broader: esitykseen osallinen yhteisö
definition: Yhteisö, joka osallistuu ekspression tekemiseen koordinoimalla säveltäjien, äänileikkaajien ja äänimiksaajien toimintaa elokuvatuotannossa tai musiikki- tai näytelmäesityksessä. (RDA Registry)
definition: Institution som deltar i utförandet av ett uttryck, genom att koordinera kompositörers, ljudklippares och ljudmixares verksamhet i en filmproduktion eller i ett musikaliskt eller sceniskt uppförande. @sv
in scheme: Metatietosanasto
preferred label: musical director corporate body @en
preferred label: musikalisk ledare @sv

opettaja
type: Concept
source: RDA-termi
source: RDA-term @sv
created: 2024-12-18
modified: 2025-08-15
alternative label: opettaja (henkilö)
alternative label: lärare (person) @sv
broader: esittäjä
definition: Henkilö, joka on esittäjä, joka osallistuu ekspression tekemiseen opettamalla tai pitämällä havaintoesityksen. (RDA Registry)
definition: Person som är en framförare, som deltar i utförandet av ett uttryck, genom att undervisa eller hålla en demonstration. @sv
in scheme: Metatietosanasto
preferred label: instructor person @en
preferred label: lärare @sv

maisema-arkkitehti
type: Concept
source: RDA-termi
source: RDA-term @sv
created: 2024-12-18
modified: 2025-08-14
alternative label: maisema-arkkitehti (henkilö)
alternative label: landskapsarkitekt (person) @sv
broader: arkkitehti
definition: Henkilö, joka on arkkitehti, joka on vastuussa maisemateosten luomisesta. (RDA Registry)
definition: Person som är en arkitekt och svarar för skapandet av landskapsverk. @sv
in scheme: Metatietosanasto
preferred label: landscape architect person @en
preferred label: landskapsarkitekt @sv

ohjelmistokehittäjä
type: Concept
source: RDA-termi
source: RDA-term @sv
created: 2024-12-18
modified: 2025-08-15
alternative label: ohjelmistokehittäjä (henkilö)
alternative label: programutvecklare (person) @sv
broader: yhdistymään osallinen henkilö
definition: Henkilö, joka osallistuu ekspression tekemiseen tutkimalla, suunnittelemalla, toteuttamalla tai testaamalla ohjelmistoa. (RDA Registry)
definition: Person som deltar i skapandet av ett uttryck, genom att undersöka, planera, förverkliga eller testa en programvara. @sv
in scheme: Metatietosanasto
preferred label: software developer person @en
preferred label: programutvecklare @sv

laulaja
type: Concept
source: RDA-termi
source: RDA-term @sv
created: 2024-12-18
modified: 2025-07-04
alternative label: laulaja (yhteisö)
alternative label: sångare (institution) @sv
broader: esittäjä
definition: Yhteisö, joka on esittäjä, joka osallistuu ekspression tekemiseen käyttämällä ääntään, soitinsäestyksellä tai ilman, tuottaakseen musiikkia. (RDA Registry)
definition: Institution som är en framförare, som deltar i utförandet av ett uttryck, genom att använda sin röst, med eller utan instrumentalackompanjemang, för att producera musik. @sv
in scheme: Metatietosanasto
preferred label: singer corporate body @en
preferred label: sångare @sv
scope note: Laulajan esitys voi sisältää tai olla sisältämättä todellisia sanoja. (RDA Registry)
scope note: Sångarens framförande kan vara med eller utan riktiga ord. @sv

koreografi
type: Concept
source: RDA-termi
source: RDA-term @sv
created: 2024-12-18
modified: 2025-07-04
alternative label: koreografi (yhteisö)
alternative label: koreograf (institution) @sv
broader: teoksen tekijä
definition: Yhteisö, joka on vastuussa koreografisen teoksen luomisesta. (RDA Registry)
definition: Institution som svarar för skapandet av ett koreografiskt verk. @sv
in scheme: Metatietosanasto
preferred label: choreographer corporate body @en
preferred label: koreograf @sv

stillkuvan arkkitehti
type: Concept
source: Kansallinen RDA-termi
source: Nationell RDA-term @sv
created: 2024-12-18
modified: 2025-08-21
alternative label: stillkuvaan osallinen arkkitehti (henkilö)
alternative label: arkitekt (person) som är bidragsgivare till stillbild @sv
broader: stillkuvaan osallinen henkilö
definition: Aggregaattiin sisältyvään arkkitehtonisen stillkuvan / piirustuksen henkilötekijä.
definition: Upphovsperson till arkitektonisk stillbild/ritning som ingår i ett verk. @sv
in scheme: Metatietosanasto
preferred label: arkitekt för stillbild @sv

valosuunnittelija
type: Concept
source: RDA-termi
source: RDA-term @sv
created: 2024-12-18
modified: 2025-08-23
alternative label: valosuunnittelija (yhteisö)
alternative label: ljusdesigner (institution) @sv
alternative label: ljussättare @sv
broader: esitykseen osallinen yhteisö
definition: Yhteisö, joka osallistuu ekspression tekemiseen suunnittelemalla ja luomalla valokomponentteja. (RDA Registry)
definition: Institution som deltar i utförandet av ett uttryck, genom att planera och skapa ljuskomponenter. @sv
in scheme: Metatietosanasto
preferred label: lighting designer corporate body @en
preferred label: ljusdesigner @sv

erikoistehosteiden tekijä
type: Concept
source: RDA-termi
source: RDA-term @sv
created: 2024-12-18
modified: 2025-06-04
alternative label: erikoistehosteiden tekijä (yhteisö)
alternative label: skapare av specialeffekter (institution) @sv
broader: esitykseen osallinen yhteisö
definition: Yhteisö, joka osallistuu liikkuvan kuvan tai ääniteoksen ekspression tekemiseen suunnittelemalla ja luomalla taltioinnin aikana tapahtuvat erikoistehosteet, kuten mekaaniset tehosteet ja kameralla toteutettavat optiset tehosteet. (RDA Registry)
definition: Institution som deltar i utförandet av uttryck av rörlig bild eller ljudverk, genom att planera eller skapa specialeffekter som sker under inspelning, såsom mekaniska effekter och optiska effekter skapade med kamera. @sv
in scheme: Metatietosanasto
preferred label: special effects provider corporate body @en
preferred label: skapare av specialeffekter @sv

elokuvantekijä
type: Concept
source: Kansallinen RDA-termi
source: Nationell RDA-term @sv
created: 2024-12-18
modified: 2025-05-27
alternative label: liikkuvaan kuvaan osallinen elokuvantekijä (henkilö)
alternative label: filmskapare (person) som är bidragsgivare till rörlig bild @sv
broader: liikkuvaan kuvaan osallinen henkilö
definition: Aggregaattiin sisältyvän elokuvan tekijä, joka vastaa itse koko elokuvan ideoinnista ja toteutuksesta.
definition: Skapare av film som ingår i ett aggregat, och som svarar för idén till och förverkligandet av en hel film. @sv
in scheme: Metatietosanasto
preferred label: filmskapare @sv

äänisuunnittelija
type: Concept
source: RDA-termi
source: RDA-term @sv
created: 2024-12-18
modified: 2025-08-27
alternative label: äänisuunnittelija (yhteisö)
alternative label: ljuddesigner (institution) @sv
broader: esitykseen osallinen yhteisö
definition: Yhteisö, joka osallistuu ekspression tekemiseen suunnittelemalla ja luomalla äänikomponentteja. (RDA Registry)
definition: Institution som deltar i utförandet av ett uttryck, genom att planera och skapa ljudkomponenter. @sv
in scheme: Metatietosanasto
preferred label: sound designer corporate body @en
preferred label: ljuddesigner @sv

sensori
type: Concept
source: Kansallinen RDA-termi
source: Nationell RDA-term @sv
created: 2024-12-18
modified: 2025-08-19
alternative label: liikkuvaan kuvaan osallinen sensori (henkilö)
alternative label: censor (person) som är bidragsgivare till rörlig bild @sv
broader: liikkuvaan kuvaan osallinen henkilö
definition: Aggregaattiin sisältyvää liikkuvaa kuvaa tarkastava henkilö. Sensori tarkastaa sisältöä kiistanalaisen sisällön salaamiseksi moraalisin, poliittisin, sotilaallisin tai muin perustein. Alkuperäisen teoksen luonteen ja yleisen sisällön sensori jättää olennaisilta osiltaan muuttumattomaksi.
definition: Person som granskar rörlig bild som ingår i ett aggregat. Censorn granskar innehållet för att dölja kontroversiellt innehåll på moraliska, politiska, militära eller andra grunder. Det ursprungliga verkets karaktär och allmänna innehåll lämnas till sina väsentliga delar oförändrat. @sv
in scheme: Metatietosanasto
preferred label: censor @sv

televisiotuottaja
type: Concept
source: Kansallinen RDA-termi
source: Nationell RDA-term @sv
created: 2024-12-18
modified: 2025-08-22
alternative label: liikkuvaan kuvaan osallinen televisiotuottaja (yhteisö)
alternative label: tv-producent (institution) som är bidragsgivare till rörlig bild @sv
broader: liikkuvaan kuvaan osallinen yhteisö
definition: Aggregaattiin sisältyvän TV-ohjelman tuotannon liiketoiminnasta ensisijaisesti vastaava yhteisö.
definition: Institution som i första hand svarar för affärsverksamheten kring produktionen av ett tv-program som ingår i ett aggregat. @sv
in scheme: Metatietosanasto
preferred label: tv-producent @sv

sarjakuvantekijä
type: Concept
source: Kansallinen RDA-termi
source: Nationell RDA-term @sv
created: 2024-12-18
modified: 2025-08-19
alternative label: tekstiin osallinen sarjakuvantekijä (yhteisö)
alternative label: serieskapare (institution) som är bidragsgivare till text @sv
broader: tekstiin osallinen yhteisö
definition: Aggregaattiin sisältyvän sarjakuvan yhteisötekijä.
definition: Upphovsinstitution för tecknad serie som ingår i ett aggregat. @sv
in scheme: Metatietosanasto
preferred label: serieskapare @sv

yhteisöjäsen suvussa
type: Concept
source: RDA-termi
source: RDA-term @sv
created: 2024-12-18
modified: 2025-03-19
alternative label: yhteisöön kuuluva suku
broader: yhteisöön liittyvä suku
definition: Suku, jonka jäsen yhteisö on. (RDA Registry)
definition: Släkt som en institution tillhör. @sv
in scheme: Metatietosanasto
preferred label: corporate body member of family of @en
preferred label: institutionsmedlem i släkten @sv

musiikkiteoksen tekstin kirjoittaja
type: Concept
source: Kansallinen RDA-termi
source: Nationell RDA-term @sv
created: 2024-12-18
modified: 2025-05-29
alternative label: musiikkiteoksen tekstin kirjoittaja (henkilö)
alternative label: författare (person) till text i musikverk @sv
broader: kirjoittaja
definition: A person who is responsible for writing a textual work that is basis of a non-dramatic musical work, other than an oratorio. @en
definition: Henkilö, joka on ei-näytelmällisen musiikkiteoksen (muun kuin oratorion) pohjalla olevan tekstin kirjoittaja.
definition: Person som är författare till en text som är grunden för ett icke-dramatiskt musikverk (annat än oratorium). @sv
in scheme: Metatietosanasto
preferred label: author person of musical work @en
preferred label: författare till text i musikverk @sv

raportoija
type: Concept
source: Kansallinen RDA-termi
source: Nationell RDA-term @sv
created: 2024-12-18
modified: 2025-08-14
alternative label: tekstiin osallinen raportoija (yhteisö)
alternative label: rapportör (institution) som är bidragsgivare till text @sv
broader: tekstiin osallinen yhteisö
definition: Aggregaattiin liittyvissä teksteissä kokouksista raportoiva yhteisö.
definition: Person som rapporterar om möten i texter som relaterar till ett aggregat. @sv
in scheme: Metatietosanasto
preferred label: rapportör @sv

taltioija
type: Concept
source: Kansallinen RDA-termi
source: Nationell RDA-term @sv
created: 2024-12-18
modified: 2025-08-21
alternative label: musiikkiin osallinen taltioija (yhteisö)
alternative label: inspelande aktör (institution) som är bidragsgivare till musik @sv
broader: musiikkiin osallinen yhteisö
definition: Aggregaattiin sisältyvän tallenteen äänityksen teknistä puolta valvova yhteisö.
definition: Institution som övervakar den tekniska delen av upptagningen av en ljudinspelning som ingår i ett aggregat. @sv
in scheme: Metatietosanasto
preferred label: inspelande institution @sv

johtaja
type: Concept
source: Kansallinen RDA-termi
source: Nationell RDA-term @sv
created: 2024-12-18
modified: 2025-07-01
alternative label: musiikkiin osallinen johtaja (yhteisö)
alternative label: dirigent (institution) som är bidragsgivare till musik @sv
broader: musiikkiin osallinen yhteisö
definition: Aggregaattiin sisältyvän musiikkiesityksen tai näytelmän esiintyjäryhmää johtava yhteisö.
definition: Institution som dirigerar en uppträdande grupp i ett musikuppträdande eller skådespel som ingår i ett aggregat. @sv
in scheme: Metatietosanasto
preferred label: dirigent @sv

tekstaaja
type: Concept
source: RDA-termi
source: RDA-term @sv
created: 2024-12-18
modified: 2025-08-22
alternative label: tekstaaja (yhteisö)
alternative label: textare (institution) @sv
broader: yhdistymään osallinen yhteisö
definition: Yhteisö, joka osallistuu sarjakuvan, sarjakuvaromaanin tms. ekspression tekemiseen piirtämällä tekstin ja graafiset äänitehosteet. (RDA Registry)
definition: Institution som deltar i utförandet av ett uttryck av en tecknad serie, grafisk roman eller dylikt, genom att rita texten och grafiska ljudeffekter. @sv
in scheme: Metatietosanasto
preferred label: letterer corporate body @en
preferred label: textare @sv

valaja
type: Concept
source: RDA-termi
source: RDA-term @sv
created: 2024-12-18
modified: 2025-08-23
alternative label: valaja (yhteisö)
alternative label: gjutare (institution) @sv
broader: aineiston tekijä
definition: Yhteisö, joka on vastuussa manifestaation valmistamisesta muovaamalla sulatettua tai nestemäistä ainetta muotin avulla. (RDA Registry)
definition: Institution som svarar för tillverkningen av en manifestation, genom att forma smält eller flytande ämne med hjälp av en form. @sv
in scheme: Metatietosanasto
preferred label: caster corporate body @en
preferred label: gjutare @sv

esittelijä
type: Concept
source: RDA-termi
source: RDA-term @sv
created: 2024-12-18
modified: 2025-06-05
alternative label: esittelijä (henkilö)
alternative label: presentatör (person) @sv
broader: esittäjä
definition: Henkilö, joka on esittäjä, joka osallistuu ekspression tekemiseen esiintymällä televisiossa tai elokuvassa taustatiedon antajana. (RDA Registry)
definition: Person som är en framförare, som deltar i utförandet av ett uttryck genom att framträda i tv eller film med bakgrundsinformation. @sv
in scheme: Metatietosanasto
preferred label: onscreen presenter person @en
preferred label: presentatör @sv
scope note: Koskee ei-fiktiivisessä elokuvassa tai fiktiivisen elokuvan johdannossa esiintymistä. Ei koske esiintymistä ruudussa ei-esittävässä roolissa. (RDA Registry)
scope note: Gäller framträdande i icke-fiktiv film eller i inledning till fiktiv film. @sv

arkkitehti
type: Concept
source: Kansallinen RDA-termi
source: Nationell RDA-term @sv
created: 2024-12-18
modified: 2025-04-16
alternative label: esineeseen osallinen arkkitehti (yhteisö)
alternative label: arkitekt (institution) som är bidragsgivare till föremål @sv
broader: esineeseen osallinen yhteisö
definition: Aggregaattiin sisältyvän arkkitehtisuunnitelman luomisesta vastuussa oleva yhteisö, mukaan lukien kuvaesityksestä, jonka tarkoitus on näyttää, miltä rakennus tai muu rakennelma näyttää valmiina.
definition: Institution som ansvarar för skapandet av en arkitektplan, inklusive en bildpresentation över hur en byggnad eller en annan konstruktion ska se ut när den är färdig, som ingår i ett aggregat. @sv
in scheme: Metatietosanasto
preferred label: arkitekt @sv

kuoronjohtaja
type: Concept
source: RDA-termi
source: RDA-term @sv
created: 2024-12-18
modified: 2025-07-04
alternative label: kuoronjohtaja (henkilö)
alternative label: kördirigent (person) @sv
broader: johtaja
definition: Henkilö, joka on johtaja, joka osallistuu ekspression tekemiseen johtamalla kuoroa musiikki- tai näytelmäesityksessä. (RDA Registry)
definition: Person som är en dirigent som deltar i utförandet av ett uttryck genom att leda en kör i en musik- eller dramaföreställning. @sv
in scheme: Metatietosanasto
preferred label: choral conductor person @en
preferred label: kördirigent @sv

juontaja
type: Concept
source: RDA-termi
source: RDA-term @sv
created: 2024-12-18
modified: 2025-07-01
alternative label: juontaja (henkilö)
alternative label: programledare (person) @sv
broader: esittäjä
definition: Henkilö, joka on esittäjä, joka osallistuu ekspression tekemiseen juontamalla (usein lähetettyä) ohjelmaa, johon osallistuu muita esittäjiä. (RDA Registry)
definition: Person som är en framförare som deltar i utförandet av ett uttryck, genom att leda ett (ofta utsänt) program, i vilket andra uppträdande deltar. @sv
in scheme: Metatietosanasto
preferred label: host person @en
preferred label: programledare @sv

televisio-ohjaaja
type: Concept
source: RDA-termi
source: RDA-term @sv
created: 2024-12-18
modified: 2025-08-22
alternative label: televisio-ohjaaja (henkilö)
alternative label: tv-regissör (person) @sv
broader: ohjaaja
definition: Henkilö, joka on ohjaaja, joka on vastuussa televisio-ohjelman yleisestä johtamisesta ja valvonnasta. (RDA Registry)
definition: Person som är en regissör, som svarar för allmän ledning och övervakning av ett tv-program. @sv
in scheme: Metatietosanasto
preferred label: television director person @en
preferred label: tv-regissör @sv

haastateltava (ekspressio)
type: Concept
source: RDA-termi
source: RDA-term @sv
created: 2024-12-18
modified: 2026-03-10
alternative label: ekspression haastateltava (yhteisö)
alternative label: version haastateltava
alternative label: intervjuobjekt (institution) i uttryck @sv
broader: esitykseen osallinen yhteisö
definition: Yhteisö, joka osallistuu teoksen ekspression tekemiseen vastaamalla haastattelijalle, tavallisesti toimittajalle, mielipidetutkijalle tai jollekin muulle toimijalle, joka kerää tietoja. (RDA Registry)
definition: Institution som deltar i utförandet av ett uttryck av ett verk genom att svara en intervjuare, vanligen en journalist, opinionsmätare eller någon annan aktör, som samlar information. @sv
in scheme: Metatietosanasto
preferred label: interviewee corporate body of expression @en
preferred label: intervjuobjekt (uttryck) @sv

kuvanveistäjä
type: Concept
source: RDA-termi
source: RDA-term @sv
created: 2016-01-08
modified: 2025-07-04
alternative label: sculptor @en
alternative label: kuvanveistäjä (suhde)
alternative label: kuvanveistäjä (toimija)
alternative label: skulptör (aktör) @sv
alternative label: skulptör (relation) @sv
broader: taiteilija
definition: Toimija, joka on taiteilija, joka on vastuussa kolmiulotteisen teoksen luomisesta muovaamalla, veistämällä tai vastaavalla tekniikalla. (RDA Registry)
definition: Aktör som är en konstnär som svarar för skapandet av ett tredimensionellt verk, genom att modellera, skära eller använda någon liknande teknik. @sv
in scheme: Metatietosanasto
preferred label: sculptor agent @en
preferred label: skulptör @sv

kalligrafi
type: Concept
source: RDA-termi
source: RDA-term @sv
created: 2024-12-18
modified: 2025-07-02
alternative label: kalligrafi (henkilö)
alternative label: kalligraf (person) @sv
broader: taiteilija
definition: Henkilö, joka on taiteilija, joka on vastuussa kalligrafiasta, jossa pääpaino on käsin kirjoittamisen tai graafisen taiteen esteettisissä arvoissa, riippumatta siitä, onko sama toimija myös vastuussa kirjoitetusta tekstistä. (RDA Registry)
definition: Person som är en konstnär som svarar för kalligrafi, i vilken huvudvikten ligger vid de estetiska värdena i handskrift eller grafisk konst, oberoende av om samma aktör också svarar för den skrivna texten. @sv
in scheme: Metatietosanasto
preferred label: calligrapher person @en
preferred label: kalligraf @sv

koreografiaan osallinen toimija
type: Concept
source: RDA-termi
source: RDA-term @sv
created: 2024-12-18
modified: 2025-07-04
broader: aggregaattiin osallinen toimija
definition: Aggregaattiin osallinen toimija, joka on luonut aggregaattiin sisältyvän koreografisen teoksen ekspression. (RDA Registry)
definition: Aktör som bidragit till ett aggregat genom att skapa ett uttryck av ett koreografiskt verk som ingår i ett aggregat. @sv
in scheme: Metatietosanasto
preferred label: contributor agent of choreography @en
preferred label: bidragsgivare (aktör) till koreografi @sv

elokuvaohjaaja
type: Concept
source: Kansallinen RDA-termi
source: Nationell RDA-term @sv
created: 2024-12-18
modified: 2025-05-27
alternative label: liikkuvaan kuvaan osallinen elokuvaohjaaja (henkilö)
alternative label: filmregissör (person) som är bidragsgivare till rörlig bild @sv
broader: liikkuvaan kuvaan osallinen henkilö
definition: Aggregaattiin sisältyvän elokuvan yleisestä johtamisesta ja valvomisesta vastaava henkilö.
definition: Person som svarar för allmän ledning och övervakning av en film som ingår i ett aggregat. @sv
in scheme: Metatietosanasto
preferred label: filmregissör @sv

sovittaja
type: Concept
source: Kansallinen RDA-termi
source: Nationell RDA-term @sv
created: 2024-12-18
modified: 2025-08-19
alternative label: musiikkiin osallinen sovittaja (henkilö)
alternative label: arrangör (person) som är bidragsgivare till musik @sv
broader: musiikkiin osallinen henkilö
definition: Aggregaattiin sisältyvän sävellyksen alkuperäisteoksesta poikkeavalle esiintymiskokoonpanolle muokkaava henkilö. Voi myös muokata sävellystä samankaltaiselle esityskokoonpanolle säilyttäen alkuperäisen sävellyksen musikaalisen sisällön olennaisilta osin muuttumattomana.
definition: Person som omarbetar en komposition som ingår i ett aggregat, för en musikalisk besättning som avviker från originalverkets. Personen kan också omarbeta kompositionen för en likartad besättning så att originalkompositionens musikaliska innehåll till sina väsentliga delar bevaras oförändrat. @sv
in scheme: Metatietosanasto
preferred label: arrangör @sv

tutkija
type: Concept
source: RDA-termi
source: RDA-term @sv
created: 2024-12-18
modified: 2025-08-23
alternative label: tutkija (henkilö)
alternative label: forskare (person) @sv
broader: teoksen tekijä
definition: Henkilö, joka tukee teoksen syntymistä tutkimuksellaan (RDA Registry)
definition: Person som stöder uppkomsten av ett verk genom sin forskning. @sv
in scheme: Metatietosanasto
preferred label: researcher person @en
preferred label: forskare @sv

entisöijä (ekspressio)
type: Concept
source: RDA-termi
source: RDA-term @sv
created: 2024-12-18
modified: 2026-04-14
alternative label: ekspression entisöijä (yhteisö)
alternative label: version entisöijä
alternative label: konservator (institution) av uttrycket @sv
alternative label: konservator av version @sv
alternative label: restauratör (uttryck) @sv
broader: tarkistaja
definition: Yhteisö, joka osallistuu ekspression tekemiseen restauroimalla tai yhdistelemällä aikaisempia ekspressioita, jotka voivat olla vaurioituneita tai fragmentaarisia, uuden ekspression luomiseksi. (RDA Registry)
definition: Institution som deltar i utförandet av ett uttryck genom att restaurera eller sammanfoga tidigare uttryck, som kan vara skadade eller fragmentariska, för att skapa ett nytt uttryck. @sv
in scheme: Metatietosanasto
preferred label: restorationist corporate body of expression @en
preferred label: konservator (uttryck) @sv

piirtäjä
type: Concept
source: RDA-termi
source: RDA-term @sv
created: 2024-12-18
modified: 2025-08-16
alternative label: piirtäjä (yhteisö)
alternative label: ritare (institution) @sv
broader: yhdistymään osallinen yhteisö
definition: Yhteisö, joka osallistuu arkkitehdin, suunnittelijan tai muun toimijan luoman ekspression tekemiseen tuottamalla tarkkoja suunnitelmia tai piirroksia rakennuksista, laivoista, lentokoneista, laitteista, esineistä tai muista luomuksista. (RDA Registry)
definition: Institution som deltar i utförandet av ett uttryck skapat av en arkitekt, designer eller annan dylik aktör, genom att skapa precisa planer eller ritningar av byggnader, fartyg, flygplan, apparater, föremål eller andra kreationer. @sv
in scheme: Metatietosanasto
preferred label: draftsman corporate body @en
preferred label: ritare @sv

panelisti
type: Concept
source: RDA-termi
source: RDA-term @sv
created: 2024-12-18
modified: 2025-08-16
alternative label: panelisti (yhteisö)
alternative label: deltagare (institution) i paneldiskussion @sv
alternative label: paneldeltagare @sv
broader: esittäjä
definition: Yhteisö, joka on esittäjä, joka osallistuu ekspression tekemiseen osallistumalla (usein lähetettyyn) ohjelmaan, jossa keskustellaan eri aiheista tavallisesti keskusteluun liittyvien aiheiden asiantuntijoiden kanssa. (RDA Registry)
definition: Institution som är en framförare som deltar i utförandet av ett uttryck, genom att delta i ett (ofta utsänt) program, i vilket olika ämnen diskuteras, vanligen tillsammans med experter inom ämnen som relaterar till diskussionen. @sv
in scheme: Metatietosanasto
preferred label: panelist corporate body @en
preferred label: deltagare i paneldiskussion @sv

yhteisön sukujäsen
type: Concept
source: RDA-termi
source: RDA-term @sv
created: 2024-12-18
modified: 2025-08-27
broader: yhteisöön liittyvä suku
definition: Suku, joka kuuluu yhteisöön. (RDA Registry)
definition: Släkt som hör till en institution. @sv
in scheme: Metatietosanasto
preferred label: family member of corporate body @en
preferred label: släktmedlem i institution @sv

puvustaja
type: Concept
source: RDA-termi
source: RDA-term @sv
created: 2024-12-18
modified: 2025-08-16
alternative label: puvustaja (henkilö)
alternative label: kostymör (person) @sv
broader: esitykseen osallinen henkilö
definition: Henkilö, joka osallistuu ekspression tekemiseen suunnittelemalla elokuvatuotannon tai musiikki- tai näytelmäesityksen puvustuksen. (RDA Registry)
definition: Person som deltar i utförandet av ett uttryck, genom att planera kostymdesignen i en filmproduktion eller ett musikaliskt eller sceniskt framförande. @sv
in scheme: Metatietosanasto
preferred label: costume designer person @en
preferred label: kostymör @sv

teoksen kartantekijä
type: Concept
source: RDA-termi
source: RDA-term @sv
created: 2024-12-18
modified: 2025-08-22
alternative label: teoksen kartantekijä (yhteisö)
alternative label: kartograf (institution) för verk @sv
broader: teoksen tekijä
definition: Yhteisö, joka on vastuussa kartografisen teoksen luomisesta. (RDA Registry)
definition: Institution som svarar för skapandet av ett kartografiskt verk. @sv
in scheme: Metatietosanasto
preferred label: cartographer corporate body of work @en
preferred label: kartograf för verk @sv

puheen puhuja
type: Concept
source: Kansallinen RDA-termi
source: Nationell RDA-term @sv
created: 2024-12-18
modified: 2025-08-16
alternative label: puheeseen osallinen puhuja (yhteisö)
alternative label: talare (institution) i talet @sv
broader: puheeseen osallinen yhteisö
definition: Aggregaattiin sisältyvän puheen pitävä yhteisö.
definition: Institution som håller ett tal som ingår i ett aggregat. @sv
in scheme: Metatietosanasto
preferred label: talare i tal @sv

arkkitehti
type: Concept
source: Kansallinen RDA-termi
source: Nationell RDA-term @sv
created: 2024-12-18
modified: 2025-04-16
alternative label: esineeseen osallinen arkkitehti (henkilö)
alternative label: arkitekt (person) som är bidragsgivare till föremål @sv
broader: esineeseen osallinen henkilö
definition: Aggregaattiin sisältyvän arkkitehtisuunnitelman luomisesta vastuussa oleva henkilö, mukaan lukien kuvaesityksestä, jonka tarkoitus on näyttää, miltä rakennus tai muu rakennelma näyttää valmiina.
definition: Person som ansvarar för skapandet av en arkitektplan, inklusive en bildpresentation över hur en byggnad eller en annan konstruktion ska se ut när den är färdig, som ingår i ett aggregat. @sv
in scheme: Metatietosanasto
preferred label: arkitekt @sv

transkriboija
type: Concept
source: RDA-termi
source: RDA-term @sv
created: 2024-12-18
modified: 2025-08-23
alternative label: transkriboija (henkilö)
alternative label: transkriberare (person) @sv
broader: tarkistaja
definition: Henkilö, joka osallistuu ekspression tekemiseen kirjoittamalla muistiin tai nuotintamalla kirjoittamattoman tai nuotintamattoman sisällön tai muuttamalla sen merkintäjärjestelmästä toiseen. (RDA Registry)
definition: Person som deltar i utförandet av ett uttryck, genom att uppteckna eller skriva ner noter för ett oskrivet eller onoterat innehåll eller ändra dess notationssystem till ett annat. @sv
in scheme: Metatietosanasto
preferred label: transcriber person @en
preferred label: transkriberare @sv
scope note: Tähän ei kuulu musiikkiteoksen transkribointi eri soittimelle tai esitysryhmälle. (RDA Registry)
scope note: Hit hör inte transkribering av ett musikverk för ett annat instrument eller en annan framförande grupp. @sv

erikoistehosteiden tekijä
type: Concept
source: RDA-termi
source: RDA-term @sv
created: 2024-12-18
modified: 2025-06-04
alternative label: erikoistehosteiden tekijä (henkilö)
alternative label: skapare av specialeffekter (person) @sv
broader: esitykseen osallinen henkilö
definition: Henkilö, joka osallistuu liikkuvan kuvan tai ääniteoksen ekspression tekemiseen suunnittelemalla ja luomalla taltioinnin aikana tapahtuvat erikoistehosteet, kuten mekaaniset tehosteet ja kameralla toteutettavat optiset tehosteet. (RDA Registry)
definition: Person som deltar i utförandet av uttryck av rörlig bild eller ljudverk, genom att planera eller skapa specialeffekter som sker under inspelning, såsom mekaniska effekter och optiska effekter skapade med kamera. @sv
in scheme: Metatietosanasto
preferred label: special effects provider person @en
preferred label: skapare av specialeffekter @sv

sovittaja
type: Concept
source: Kansallinen RDA-termi
source: Nationell RDA-term @sv
created: 2024-12-18
modified: 2025-08-19
alternative label: musiikkiin osallinen sovittaja (yhteisö)
alternative label: arrangör (institution) som är bidragsgivare till musik @sv
broader: musiikkiin osallinen yhteisö
definition: Aggregaattiin sisältyvän sävellyksen alkuperäisteoksesta poikkeavalle esiintymiskokoonpanolle muokkaava yhteisö. Voi myös muokata sävellystä samankaltaiselle esityskokoonpanolle säilyttäen alkuperäisen sävellyksen musikaalisen sisällön olennaisilta osin muuttumattomana.
definition: Institution som omarbetar en komposition som ingår i ett aggregat, för en musikalisk besättning som avviker från originalverkets. Institutionen kan också omarbeta kompositionen för en likartad besättning så att originalkompositionens musikaliska innehåll till sina väsentliga delar bevaras oförändrat. @sv
in scheme: Metatietosanasto
preferred label: arrangör @sv

entisöijä (ekspressio)
type: Concept
source: RDA-termi
source: RDA-term @sv
created: 2024-12-18
modified: 2026-04-14
alternative label: ekspression entisöijä (henkilö)
alternative label: version entisöijä
alternative label: konservator (person) av uttrycket @sv
alternative label: konservator av version @sv
alternative label: restauratör (uttryck) @sv
broader: tarkistaja
definition: Henkilö, joka osallistuu ekspression tekemiseen restauroimalla tai yhdistelemällä aikaisempia ekspressioita, jotka voivat olla vaurioituneita tai fragmentaarisia, uuden ekspression luomiseksi. (RDA Registry)
definition: Person som deltar i utförandet av ett uttryck genom att restaurera eller sammanfoga tidigare uttryck, som kan vara skadade eller fragmentariska, för att skapa ett nytt uttryck. @sv
in scheme: Metatietosanasto
preferred label: restorationist person of expression @en
preferred label: konservator (uttryck) @sv

tuotantosuunnittelija
type: Concept
source: RDA-termi
source: RDA-term @sv
created: 2024-12-18
modified: 2025-08-23
alternative label: tuotantosuunnittelija (yhteisö)
alternative label: produktionsdesigner (institution) @sv
broader: esitykseen osallinen yhteisö
definition: Yhteisö, joka vastaa elokuvatuotannon visuaalisen kokonaisilmeen suunnittelusta. (RDA Registry)
definition: Institution som svarar för designen i det visuella helhetsuttrycket för en filmproduktion. @sv
in scheme: Metatietosanasto
preferred label: production designer corporate body @en
preferred label: produktionsdesigner @sv

teoksen haastattelija
type: Concept
source: RDA-termi
source: RDA-term @sv
created: 2024-12-18
modified: 2026-03-28
alternative label: haastattelija (teos)
alternative label: teoksen haastattelija (henkilö)
alternative label: intervjuare (person) i verk @sv
broader: teoksen tekijä
definition: Henkilö, joka on vastuussa teoksen luomisesta toimimalla haastattelijana, toimittajana, mielipidetutkijana tai jonkinlaisena muuna toimijana, joka kerää tietoja. (RDA Registry)
definition: Person som svarar för skapandet av ett verk, genom att fungera som intervjuare, journalist, opinionsmätare eller någon annan aktör, som samlar information. @sv
in scheme: Metatietosanasto
preferred label: interviewer person of work @en
preferred label: intervjuare i verk @sv

leikkaaja
type: Concept
source: RDA-termi
source: RDA-term @sv
created: 2024-12-18
modified: 2025-07-04
alternative label: leikkaaja (yhteisö)
alternative label: klippare (institution) @sv
broader: esitykseen osallinen yhteisö
definition: Yhteisö, joka vastaa filmin, videon tai muiden liikkuvan kuvan formaattien kokoamisesta, järjestämisestä ja leikkauksesta sekä kuvan että äänen osalta. (RDA Registry)
definition: Institution som svarar för samling, ordnande och klippning av film, video eller andra format för rörlig bild, både beträffande bild och ljud. @sv
in scheme: Metatietosanasto
preferred label: editor corporate body of moving image work @en
preferred label: klippare @sv

transkriboija
type: Concept
source: Kansallinen RDA-termi
source: Nationell RDA-term @sv
created: 2024-12-18
modified: 2025-08-23
alternative label: tekstiin osallinen transkriboija (yhteisö)
alternative label: transkriberare (institution) som är bidragsgivare till text @sv
broader: tekstiin osallinen yhteisö
definition: Yhteisö, joka kirjoittamalla muistiin tai nuotintamalla kirjoittamattoman tai nuotintamattoman sisällön tai muuttamalla sen merkintäjärjestelmästä toiseen.
definition: Institution som upptecknar eller skriver ner noter för ett oskrivet eller onoterat innehåll eller ändrar dess notationssystem till ett annat. @sv
in scheme: Metatietosanasto
preferred label: transkriberare @sv

tunnettu jäsen suvussa
type: Concept
source: RDA-termi
source: RDA-term @sv
created: 2024-12-18
modified: 2025-03-19
alternative label: framstående medlem i släkten @sv
broader: henkilöjäsen suvussa
definition: Suku, jonka tunnettu jäsen henkilö on. (RDA Registry)
definition: Släkt som en allmänt känd person hör till. @sv
in scheme: Metatietosanasto
preferred label: prominent member of family of @en
preferred label: känd medlem i släkten @sv

suvun tunnettu jäsen
type: Concept
source: RDA-termi
source: RDA-term @sv
created: 2024-12-18
modified: 2025-03-19
alternative label: framstående medlem i släkten @sv
broader: suvun henkilöjäsen
definition: Sukuun kuuluva henkilö, joka on yleisesti tunnettu. (RDA Registry)
definition: Allmänt känd person som hör till en släkt. @sv
in scheme: Metatietosanasto
preferred label: prominent member of family @en
preferred label: känd medlem i släkten @sv

yhteisövastaaja rikosoikeudessa
type: Concept
source: RDA-termi
source: RDA-term @sv
created: 2024-12-18
modified: 2025-08-27
broader: yhteisövastaaja
definition: Yhteisö, joka on syytettynä rikosprosessissa. (RDA Registry)
definition: Institution som är åtalad i en straffprocess. @sv
in scheme: Metatietosanasto
preferred label: criminal defendant corporate body @en
preferred label: institution som svarande i brottmål @sv

ääninäyttelijä
type: Concept
source: RDA-termi
source: RDA-term @sv
created: 2024-12-18
modified: 2025-08-27
alternative label: ääninäyttelijä (yhteisö)
alternative label: röstskådespelare (institution) @sv
broader: näyttelijä
definition: Yhteisö, joka on näyttelijä, joka osallistuu ekspression tekemiseen antamalla äänen hahmoille radio- ja äänituotannoissa ja animoiduille hahmoille elokuvateoksissa sekä esiintymällä radio- ja TV-mainoksissa, dubatuissa ekspressioissa tms. (RDA Registry)
definition: Institution som är en skådespelare, som deltar i utförandet av ett uttryck, genom att ge röst åt karaktärer i radio- och ljudproduktioner och animerade karaktärer i filmverk, samt genom att framträda i radio- och tv-reklarm, i dubbade uttryck etc. @sv
in scheme: Metatietosanasto
preferred label: voice actor corporate body @en
preferred label: röstskådespelare @sv

sitoja
type: Concept
source: RDA-termi
source: RDA-term @sv
created: 2024-12-18
modified: 2025-08-19
alternative label: sitoja (henkilö)
alternative label: bokbindare (person) @sv
broader: muokkaaja
definition: Henkilö, joka sitoo kappaleen. (RDA Registry)
definition: Person som binder ett exemplar. @sv
in scheme: Metatietosanasto
preferred label: binder person @en
preferred label: bokbindare @sv

tarinankertoja
type: Concept
source: RDA-termi
source: RDA-term @sv
created: 2024-12-18
modified: 2025-08-21
alternative label: tarinankertoja (yhteisö)
alternative label: historieberättare (institution) @sv
broader: esittäjä
definition: Yhteisö, joka on esittäjä, joka osallistuu ekspression tekemiseen kertomalla tarinan draamallisella tai teatraalisella tulkinnalla. (RDA Registry)
definition: Institution som är en framförare, som deltar i utförandet av ett uttryck genom att framföra en berättelse med en dramatisk eller teatralisk tolkning. @sv
in scheme: Metatietosanasto
preferred label: storyteller corporate body @en
preferred label: historieberättare @sv

haastateltava
type: Concept
source: Kansallinen RDA-termi
source: Nationell RDA-term @sv
created: 2024-12-18
modified: 2025-06-13
alternative label: liikkuvaan kuvaan osallinen haastateltava (yhteisö)
alternative label: intervjuobjekt (institution) som är bidragsgivare till rörlig bild @sv
broader: liikkuvaan kuvaan osallinen yhteisö
definition: Aggregaattiin sisältyvään liikkuvan kuvan aineistoon tietoja keräävälle haastattelijalle (tavallisesti toimittaja tai mielipidemittauksen tekijä) vastauksia antava yhteisö.
definition: Institution som ger svar åt en intervjuare (vanligen en journalist eller opinionsmätare), som samlar information till material med rörlig bild som ingår i ett aggregat. @sv
in scheme: Metatietosanasto
preferred label: intervjuobjekt @sv

puvustaja
type: Concept
source: Kansallinen RDA-termi
source: Nationell RDA-term @sv
created: 2024-12-18
modified: 2025-08-16
alternative label: liikkuvaan kuvaan osallinen puvustaja (yhteisö)
alternative label: kostymör (institution) som är bidragsgivare till rörlig bild @sv
broader: liikkuvaan kuvaan osallinen yhteisö
definition: Aggregaattiin sisältyvän elokuvan, musiikki- tai näytelmäesityksen puvustuksen suunnitellut yhteisö.
definition: Institution som planerat kostymdesignen i en film, ett musikaliskt eller sceniskt framförande, som ingår i ett aggregat. @sv
in scheme: Metatietosanasto
preferred label: kostymör @sv

kaivertaja
type: Concept
source: RDA-termi
source: RDA-term @sv
created: 2024-12-18
modified: 2025-07-02
alternative label: kaivertaja (henkilö)
alternative label: gravör (person) @sv
broader: kuvalaatan valmistaja
definition: Henkilö, joka on vastuussa manifestaation valmistamisesta kaivertamalla kirjaimia, kuvioita tai muita merkkejä painamisessa käytettävälle pinnalle, kuten puu- tai metallipinnalle. (RDA Registry)
definition: Person som svarar för tillverkningen av en manifestation, genom att gravera bokstäver, mönster eller andra tecken på en yta som används vid tryck, såsom en trä- eller metallyta. @sv
in scheme: Metatietosanasto
preferred label: engraver person @en
preferred label: gravör @sv

opinnäytteen tarkastaja
type: Concept
source: Kansallinen RDA-termi
source: Nationell RDA-term @sv
created: 2024-12-18
modified: 2025-08-15
alternative label: tekstiin osallinen opinnäytteen tarkastaja (yhteisö)
alternative label: granskare av lärdomsprov (institution) som är bidragsgivare till text @sv
broader: tekstiin osallinen yhteisö
definition: Aggregaattiin sisältyvän opinnäytteen tarkastajaryhmän yhteisöjäsen.
definition: Institutionsmedlem i granskningsgrupp för lärdomsprov som ingår i ett aggregat. @sv
in scheme: Metatietosanasto
preferred label: granskare av lärdomsprov @sv

elokuvan jakelija
type: Concept
source: RDA-termi
source: RDA-term @sv
created: 2024-12-18
modified: 2025-05-27
alternative label: elokuvan jakelija (yhteisö)
alternative label: filmdistributör (institution) @sv
broader: jakelija
definition: Yhteisö, joka on vastuussa elokuvan tms. manifestaation jakamisesta elokuvateattereille tai muille jakelukanaville. (RDA Registry)
definition: Institution som svarar för distributionen av en film eller annan dylik manifestation till biografer eller andra distributionskanaler. @sv
in scheme: Metatietosanasto
preferred label: film distributor corporate body @en
preferred label: filmdistributör @sv

esittäjä
type: Concept
source: Kansallinen RDA-termi
source: Nationell RDA-term @sv
created: 2024-12-18
modified: 2025-05-29
alternative label: musiikkiin osallinen esittäjä (yhteisö)
alternative label: framförande institution som är bidragsgivare till musik @sv
broader: musiikkiin osallinen yhteisö
definition: Aggregaattiin sisältyvässä esityksessä näyttelevä, tanssiva, musiikkia esittävä tai muussa roolissa esiintyvä yhteisö.
definition: Institution som uppträder med skådespel, dans, musik eller något annat, i en föreställning som ingår i ett aggregat. @sv
in scheme: Metatietosanasto
preferred label: framförande institution @sv

lähetyksestä vastaava henkilö
type: Concept
source: RDA-termi
source: RDA-term @sv
created: 2024-12-18
modified: 2025-07-05
broader: kustantaja
definition: Henkilö, joka on vastuussa manifestaation lähettämisestä yleisölle radiossa, televisiossa, suoratoistolähetyksenä tai muuna lähetysmediana. (RDA Registry)
definition: Person som svarar för sändning av en manifestation för en publik i radio, television, som direktsändning eller i något annat sändningsmedium. @sv
in scheme: Metatietosanasto
preferred label: broadcaster person @en
preferred label: sändningsansvarig person @sv

esittämisestä vastaava henkilö
type: Concept
source: RDA-termi
source: RDA-term @sv
created: 2024-12-18
modified: 2025-06-11
broader: esittäjä
definition: Henkilö, joka sisältyy merkintään "X esittää:" ekspression sisältävän manifestaation alku- tai lopputeksteissä ja joka liittyy todennäköisesti liikkuvan kuvan teoksen ekspression tuotantoon, rahoitukseen tai jakeluun jollakin tavoin. (RDA Registry)
definition: Person som ingår i texten "X presenterar:" i för- och eftertexter i en manifestation som innehåller ett uttryck, och som troligtvis på något vis relaterar till produktion, finansiering eller distribution av ett uttryck för rörlig bild. @sv
in scheme: Metatietosanasto
preferred label: presenter person @en
preferred label: ansvarig person för framförande @sv

teoksen perustaja
type: Concept
source: RDA-termi
source: RDA-term @sv
created: 2024-12-18
modified: 2025-08-22
alternative label: teoksen perustaja (yhteisö)
alternative label: grundare (institution) av verk @sv
broader: teoksen tekijä
definition: Yhteisö, joka on vastuussa diakronisen teoksen alullepanosta. (RDA Registry)
definition: Institution som svarar för igångsättningen av ett diakroniskt verk. @sv
in scheme: Metatietosanasto
preferred label: founder corporate body of work @en
preferred label: grundare av verk @sv

liikkuvan kuvan puhuja
type: Concept
source: Kansallinen RDA-termi
source: Nationell RDA-term @sv
created: 2024-12-18
modified: 2025-07-05
alternative label: liikkuvaan kuvaan osallinen puhuja (henkilö)
alternative label: talare (person) som är bidragsgivare till rörlig bild @sv
broader: liikkuvaan kuvaan osallinen henkilö
definition: Aggregaattiin sisältyvässä liikkuvassa kuvassa puhuva henkilö. Esimerkiksi luennon tai puheen pitäjä.
definition: Person som talar i rörlig bild som ingår i ett aggregat. Till exempel föredrags- eller talhållare. @sv
in scheme: Metatietosanasto
preferred label: talare i rörlig bild @sv

juontaja
type: Concept
source: Kansallinen RDA-termi
source: Nationell RDA-term @sv
created: 2024-12-18
modified: 2025-07-01
alternative label: liikkuvaan kuvaan osallinen juontaja (yhteisö)
alternative label: programledare (institution) som är bidragsgivare till rörlig bild @sv
broader: liikkuvaan kuvaan osallinen yhteisö
definition: Aggregaattiin sisältyvää ohjelmaa juontava yhteisö.
definition: Institution som leder ett program som ingår i ett aggregat. @sv
in scheme: Metatietosanasto
preferred label: programledare @sv

stillkuvaan osallinen toimija
type: Concept
source: RDA-termi
source: RDA-term @sv
created: 2024-12-18
modified: 2025-08-21
alternative label: illustrator @en
alternative label: photographer (expression) @en
broader: aggregaattiin osallinen toimija
definition: Aggregaattiin osallinen toimija, joka on luonut aggregaattiin sisältyvän stillkuvateoksen ekspression. (RDA Registry)
definition: Aktör som bidragit till ett aggregat och skapat ett uttryck av ett stillbildsverk som ingår i ett aggregat. @sv
in scheme: Metatietosanasto
preferred label: contributor agent of still image @en
preferred label: bidragsgivare (aktör) till stillbild @sv

radio-ohjaaja
type: Concept
source: RDA-termi
source: RDA-term @sv
created: 2024-12-18
modified: 2025-08-16
alternative label: radio-ohjaaja (henkilö)
alternative label: radioregissör (person) @sv
broader: ohjaaja
definition: Henkilö, joka on ohjaaja, joka on vastuussa radio-ohjelman yleisestä johtamisesta ja valvonnasta. (RDA Registry)
definition: Person som är en regissör, som svarar för den allmänna ledningen och övervakningen av ett radioprogram. @sv
in scheme: Metatietosanasto
preferred label: radio director person @en
preferred label: radioregissör @sv

libretisti
type: Concept
source: RDA-termi
source: RDA-term @sv
created: 2024-12-18
modified: 2025-07-05
alternative label: libretisti (henkilö)
alternative label: librettist (person) @sv
broader: kirjoittaja
definition: Henkilö, joka on musiikki- tai koreografisen teoksen, kuten oopperan, baletin tai muun musiikillisen näyttämöteoksen tai oratorion sanojen kirjoittaja. (RDA Registry)
definition: Person som är författare till texten i ett musikaliskt eller koreografiskt verk, såsom en opera, en balett eller något annat musikaliskt sceniskt verk eller oratorium. @sv
in scheme: Metatietosanasto
preferred label: librettist person @en
preferred label: librettist @sv
scope note: Ei kata pelkkien musikaalilaulujen sanojen kirjoittajaa. (RDA Registry)
scope note: Gäller inte författare till texter i enbart musikalsånger. @sv

elokuvan musiikin säveltäjä
type: Concept
source: Kansallinen RDA-termi
source: Nationell RDA-term @sv
created: 2024-12-18
modified: 2025-05-27
alternative label: elokuvan musiikin säveltäjä (yhteisö)
alternative label: kompositör (institution) av filmmusik @sv
broader: säveltäjä
definition: A corporate body who is responsible for creating a motion picture music work that complements a musical work. @en
definition: Yhteisö, joka on vastuussa elokuvaa täydentävän musiikin luomisesta.
definition: Institution som svarar för skapandet av musik som kompletterar en film. @sv
in scheme: Metatietosanasto
preferred label: composer corporate body of motion picture music work @en
preferred label: kompositör av filmmusik @sv

metatietokuvailu henkilöstä
type: Concept
source: RDA-termi
source: RDA-term @sv
created: 2024-12-18
modified: 2025-08-14
broader: kuvaus henkilöstä
definition: Metatietoteoksen kuvailema henkilö. (RDA Registry)
definition: Person som ett metadataverk beskriver. @sv
in scheme: Metatietosanasto
preferred label: metadata description of person @en
preferred label: metadatabeskrivning av personen @sv

kääntäjä
type: Concept
source: RDA-termi
source: RDA-term @sv
created: 2024-12-18
modified: 2025-07-04
alternative label: kääntäjä (yhteisö)
alternative label: översättare (institution) @sv
broader: teoksen version tekijä
definition: Yhteisö, joka osallistuu ekspression tekemiseen ilmaisemalla teoksen kielellisen sisällön alkuperäisen teoksen aiemmista ekspressioista poikkeavalla kielellä. (RDA Registry)
definition: Institution som deltar i skapandet av ett uttryck, genom att uttrycka ett verks språkliga innehåll på ett språk som avviker från ett originalverks tidigare uttryck. @sv
in scheme: Metatietosanasto
preferred label: translator corporate body @en
preferred label: översättare @sv
scope note: Kääntäjä voi myös kääntää kielisisältöä saman kielen eri aikakausien muotojen välillä. (RDA Registry)
scope note: En översättare kan också översätta språkligt innehåll mellan olika former av samma språk från olika tidsperioder. @sv

henkilöön liittyvä suku
type: Concept
source: RDA-termi
source: RDA-term @sv
created: 2024-12-18
modified: 2025-06-14
definition: Suku, joka liittyy henkilöön. (RDA Registry)
definition: Släkt som är relaterad till en person. @sv
in scheme: Metatietosanasto
narrower: henkilöjäsen suvussa
preferred label: related family of person @en
preferred label: släkt relaterad till personen @sv

tuotantosuunnittelija
type: Concept
source: RDA-termi
source: RDA-term @sv
created: 2024-12-18
modified: 2025-08-23
alternative label: tuotantosuunnittelija (henkilö)
alternative label: produktionsdesigner (person) @sv
broader: esitykseen osallinen henkilö
definition: Henkilö, joka vastaa elokuvatuotannon visuaalisen kokonaisilmeen suunnittelusta. (RDA Registry)
definition: Person som svarar för designen i det visuella helhetsuttrycket för en filmproduktion. @sv
in scheme: Metatietosanasto
preferred label: production designer person @en
preferred label: produktionsdesigner @sv

soittaja
type: Concept
source: Kansallinen RDA-termi
source: Nationell RDA-term @sv
created: 2024-12-18
modified: 2025-08-19
alternative label: musiikkiin osallinen soittaja (henkilö)
alternative label: instrumentalist (person) som är bidragsgivare till musik @sv
broader: musiikkiin osallinen henkilö
definition: Aggregaattiin sisältyvässä musiikissa soitinta soittava henkilö.
definition: Person som spelar ett instrument i musik som ingår i ett aggregat. @sv
in scheme: Metatietosanasto
preferred label: instrumentalist @sv

näyttämöohjaaja
type: Concept
source: RDA-termi
source: RDA-term @sv
created: 2024-12-18
modified: 2025-08-15
alternative label: näyttämöohjaaja (yhteisö)
alternative label: scenregissör (institution) @sv
broader: esitykseen osallinen yhteisö
definition: Yhteisö, joka osallistuu näyttämöteoksen ekspression tekemiseen johtamalla tai valvomalla esitystä. (RDA Registry)
definition: Institution som deltar i utförandet av ett uttryck av ett sceniskt verk, genom att leda eller övervaka ett framförande. @sv
in scheme: Metatietosanasto
preferred label: stage director corporate body @en
preferred label: scenregissör @sv

valokuvaaja
type: Concept
source: Kansallinen RDA-termi
source: Nationell RDA-term @sv
created: 2024-12-18
modified: 2025-08-23
alternative label: stillkuvaan osallinen valokuvaaja (yhteisö)
alternative label: fotograf (institution) som är bidragsgivare till stillbild @sv
broader: stillkuvaan osallinen yhteisö
definition: Aggregaattiin sisältyvän valokuvan yhteisötekijä.
definition: Upphovsinstitution till fotografi som ingår i ett aggregat. @sv
in scheme: Metatietosanasto
preferred label: fotograf @sv

moderoija
type: Concept
source: Kansallinen RDA-termi
source: Nationell RDA-term @sv
created: 2024-12-18
modified: 2025-08-14
alternative label: liikkuvaan kuvaan osallinen moderoija (henkilö)
alternative label: moderator (person) som är bidragsgivare till rörlig bild @sv
broader: liikkuvaan kuvaan osallinen henkilö
definition: Aggregaattiin sisältyvää keskusteluohjelmaa juontava henkilö audiovisuaalisessa aineistossa.
definition: Person som leder ett diskussionsprogram i audiovisuellt material som ingår i ett aggregat. @sv
in scheme: Metatietosanasto
preferred label: moderator @sv

televisiotuottaja
type: Concept
source: Kansallinen RDA-termi
source: Nationell RDA-term @sv
created: 2024-12-18
modified: 2025-08-22
alternative label: liikkuvaan kuvaan osallinen televisiotuottaja (henkilö)
alternative label: tv-producent (person) som är bidragsgivare till rörlig bild @sv
broader: liikkuvaan kuvaan osallinen henkilö
definition: Aggregaattiin sisältyvän TV-ohjelman tuotannon liiketoiminnasta ensisijaisesti vastaava henkilö.
definition: Person som i första hand svarar för affärsverksamheten kring produktionen av ett tv-program som ingår i ett aggregat. @sv
in scheme: Metatietosanasto
preferred label: tv-producent @sv

libretisti
type: Concept
source: RDA-termi
source: RDA-term @sv
created: 2024-12-18
modified: 2025-07-05
alternative label: libretisti (yhteisö)
alternative label: librettist (institution) @sv
broader: kirjoittaja
definition: Yhteisö, joka on musiikki- tai koreografisen teoksen, kuten oopperan, baletin tai muun musiikillisen näyttämöteoksen tai oratorion sanojen kirjoittaja. (RDA Registry)
definition: Institution som är författare till texten i ett musikaliskt eller koreografiskt verk, såsom en opera, en balett eller något annat musikaliskt sceniskt verk eller oratorium. @sv
in scheme: Metatietosanasto
preferred label: librettist corporate body @en
preferred label: librettist @sv
scope note: Ei kata pelkkien musikaalilaulujen sanojen kirjoittajaa. (RDA Registry)
scope note: Gäller inte författare till texter i enbart musikalsånger. @sv

transkriboija
type: Concept
source: Kansallinen RDA-termi
source: Nationell RDA-term @sv
created: 2024-12-18
modified: 2025-08-23
alternative label: tekstiin osallinen transkriboija (henkilö)
alternative label: transkriberare (person) som är bidragsgivare till text @sv
broader: tekstiin osallinen henkilö
definition: Henkilö, joka kirjoittamalla muistiin tai nuotintamalla kirjoittamattoman tai nuotintamattoman sisällön tai muuttamalla sen merkintäjärjestelmästä toiseen.
definition: Person som upptecknar eller skriver ner noter för ett oskrivet eller onoterat innehåll eller ändrar dess notationssystem till ett annat. @sv
in scheme: Metatietosanasto
preferred label: transkriberare @sv

esittelijä
type: Concept
source: Kansallinen RDA-termi
source: Nationell RDA-term @sv
created: 2024-12-18
modified: 2025-06-11
alternative label: liikkuvaan kuvaan osallinen esittelijä (henkilö)
alternative label: presentatör (person) som är bidragsgivare till rörlig bild @sv
broader: liikkuvaan kuvaan osallinen henkilö
definition: Aggregaattiin kuuluvaan sisältöön liittyvää taustatietoa antava henkilö televisio-ohjelmassa tai elokuvassa.
definition: Person som ger bakgrundsinformation i tv-program eller film, i anslutning till innehåll som hör till ett aggregat. @sv
in scheme: Metatietosanasto
preferred label: presentatör @sv

televisio-ohjelman musiikin säveltäjä
type: Concept
source: Kansallinen RDA-termi
source: Nationell RDA-term @sv
created: 2024-12-18
modified: 2025-08-22
alternative label: televisio-ohjelman musiikin säveltäjä (henkilö)
alternative label: kompositör (person) av musik till tv-program @sv
broader: säveltäjä
definition: A person who is responsible for creating a television program music work that complements a musical work. @en
definition: Henkilö, joka on vastuussa televisio-ohjelmaa täydentävän musiikin luomisesta.
definition: Person som svarar för skapandet av musik som kompletterar ett tv-program. @sv
in scheme: Metatietosanasto
preferred label: composer person of television program music work @en
preferred label: kompositör av musik till tv-program @sv

panelisti
type: Concept
source: Kansallinen RDA-termi
source: Nationell RDA-term @sv
created: 2024-12-18
modified: 2025-08-16
alternative label: liikkuvaan kuvaan osallinen panelisti (henkilö)
alternative label: deltagare (person) i paneldiskussion som är bidragsgivare till rörlig bild @sv
broader: liikkuvaan kuvaan osallinen henkilö
definition: Aggregaattiin sisältyvään keskusteluohjelmaan osallistuva henkilö. Paneelikeskusteluissa käsitellään eri aiheita usein niitä tuntevien asiantuntijoiden kesken.
definition: Person som deltar i ett diskussionsprogram som ingår i ett aggregat. I paneldiskussioner behandlas olika ämnen, ofta mellan experter i ämnena. @sv
in scheme: Metatietosanasto
preferred label: deltagare i paneldiskussion @sv

kollotypian valmistaja
type: Concept
source: RDA-termi
source: RDA-term @sv
created: 2024-12-18
modified: 2025-07-03
alternative label: collotypist corporate body @en
alternative label: kollotypian valmistaja (yhteisö)
alternative label: framställare av ljustryck (institution) @sv
broader: painolaatan valmistaja
definition: Yhteisö, joka on vastuussa manifestaation valmistamisesta tekemällä vedoksia suoraan kovettuneelta gelatiinifilmiltä tai muulta materiaalilta, jossa on mustetta imeviä ja hylkiviä pintoja. (RDA Registry)
definition: Institution som svarar för tillverkning av en manifestation, genom att göra fotografiska avtryck direkt från härdad gelatinfilm eller annat material med bläckmottagande och bläckavvisande ytor. @sv
in scheme: Metatietosanasto
preferred label: collotyper corporate body @en
preferred label: framställare av ljustryck @sv

kuvaaja
type: Concept
source: Kansallinen RDA-termi
source: Nationell RDA-term @sv
created: 2024-12-18
modified: 2025-07-04
alternative label: liikkuvaan kuvaan osallinen kuvaaja (henkilö)
alternative label: filmfotograf (person) som är bidragsgivare till rörlig bild @sv
broader: liikkuvaan kuvaan osallinen henkilö
definition: Aggregaattiin sisältyvän liikkuvan kuvan joko digitaalisesti, filmille tai videolle tallentava henkilö. Voi hoitaa myös valaistuksen. Elokuvan kuvaajaa kutsutaan myös elokuvaajaksi.
definition: Person som spelar in rörlig bild som ingår i ett aggregat antingen digitalt, på film eller på video. Kan även sköta belysning. @sv
in scheme: Metatietosanasto
preferred label: filmfotograf @sv

videon musiikin säveltäjä
type: Concept
source: Kansallinen RDA-termi
source: Nationell RDA-term @sv
created: 2024-12-18
modified: 2025-08-23
alternative label: videon musiikin säveltäjä (yhteisö)
alternative label: kompositör (institution) av videomusik @sv
broader: säveltäjä
definition: A corporate body who is responsible for creating a video music work that complements a musical work. @en
definition: Yhteisö, joka on vastuussa videota täydentävän musiikin luomisesta.
definition: Institution som svarar för skapandet av musik som kompletterar en video. @sv
in scheme: Metatietosanasto
preferred label: composer corporate body of video music work @en
preferred label: kompositör av videomusik @sv

toimituspäällikkö
type: Concept
source: RDA-termi
source: RDA-term @sv
created: 2024-12-18
modified: 2025-08-23
alternative label: toimituspäällikkö (henkilö)
alternative label: redaktionschef (person) @sv
broader: teoksen tekijä
definition: Henkilö, jolla on juridinen tai tiedollinen vastuu, mutta ei luovaa vastuuta, diakronisen teoksen toimituslinjasta ja sisällöstä. (RDA Registry)
definition: Person som har ett juridiskt eller kunskapsmässigt ansvar, men inte kreativt ansvar för ett diakroniskt verks redaktionella linje och innehåll. @sv
in scheme: Metatietosanasto
preferred label: editorial director person @en
preferred label: redaktionschef @sv
scope note: Ei kata teoksen ekspression sisällön tarkastamista, selkeyttämistä tai muuta muutosta. (RDA Registry)
scope note: Gäller inte justering, förtydligande eller annan ändring av innehållet i ett verks uttryck. @sv

puhuja
type: Concept
source: RDA-termi
source: RDA-term @sv
created: 2024-12-18
modified: 2025-08-16
alternative label: puhuja (yhteisö)
alternative label: talare (institution) @sv
broader: esittäjä
definition: Yhteisö, joka on esittäjä, joka osallistuu teoksen ekspression tekemiseen puhumalla sanoja. (RDA Registry)
definition: Institution som är en framförare som deltar i utförandet av ett verks uttryck genom att tala ord. @sv
in scheme: Metatietosanasto
preferred label: speaker corporate body @en
preferred label: talare @sv
scope note: Sisältää luennon tai puheen. (RDA Registry)
scope note: Inbegriper en föreläsning eller ett tal. @sv

toimittaja
type: Concept
source: RDA-termi
source: RDA-term @sv
created: 2024-12-18
modified: 2025-08-23
alternative label: editor @en
alternative label: editor agent of text @en
alternative label: toimittaja (toimija)
alternative label: redaktör (aktör) @sv
broader: yhdistymään osallinen toimija
definition: Toimija, joka osallistuu ekspression tekemiseen tarkistamalla muiden toimijoiden luomaa sisältöä julkaisu- tai muiden käyttöstandardien saavuttamiseksi. (RDA Registry)
definition: Aktör som deltar i utförandet av ett uttryck, genom att justera innehåll som skapats av andra aktörer, för att uppfylla utgivnings- och andra bruksstandarder. @sv
in scheme: Metatietosanasto
preferred label: editor agent @en
preferred label: redaktör @sv
scope note: Sisältöön kuuluvat liikenotaatio, nuottikirjoitus, taktiili liikenotaatio, taktiili nuottikirjoitus, taktiili teksti ja teksti. (RDA Registry)
scope note: Till innehåll hör rörelsenotation, taktil rörelsenotation, taktil musiknotation, taktil text och text. @sv

puhuja
type: Concept
source: RDA-termi
source: RDA-term @sv
created: 2024-12-18
modified: 2025-08-16
alternative label: puhuja (henkilö)
alternative label: talare (person) @sv
broader: esittäjä
definition: Henkilö, joka on esittäjä, joka osallistuu teoksen ekspression tekemiseen puhumalla sanoja. (RDA Registry)
definition: Person som är en framförare som deltar i utförandet av ett verks uttryck genom att tala ord. @sv
in scheme: Metatietosanasto
preferred label: speaker person @en
preferred label: talare @sv
scope note: Sisältää luennon tai puheen. (RDA Registry)
scope note: Inbegriper en föreläsning eller ett tal. @sv

animaattori
type: Concept
source: RDA-termi
source: RDA-term @sv
created: 2024-12-18
modified: 2025-04-16
alternative label: animaattori (henkilö)
alternative label: animatör (person) @sv
broader: esitykseen osallinen henkilö
definition: Henkilö, joka osallistuu ekspression tekemiseen tuottamalla näennäistä liikettä elottomiin esineisiin tai piirroksiin. (RDA Registry)
definition: Person som deltar i skapandet av ett uttryck genom att ge skenbar rörelse åt livlösa objekt eller teckningar. @sv
in scheme: Metatietosanasto
preferred label: animator person @en
preferred label: animatör @sv
scope note: Ei koske animaatiopiirrosten tekijää. (RDA Registry)
scope note: Gäller inte skapare av animationsteckningar. @sv

opettaja
type: Concept
source: Kansallinen RDA-termi
source: Nationell RDA-term @sv
created: 2024-12-18
modified: 2025-08-15
alternative label: liikkuvaan kuvaan osallinen opettaja (yhteisö)
alternative label: lärare (institution) som är bidragsgivare till rörlig bild @sv
broader: liikkuvaan kuvaan osallinen yhteisö
definition: Aggregaattiin sisältyvässä AV-aineistossa opettava tai asiaa esittelevä yhteisö.
definition: Institution som undervisar eller förevisar en sak i AV-material som ingår i ett aggregat. @sv
in scheme: Metatietosanasto
preferred label: lärare @sv

säilyttäjä
type: Concept
source: RDA-termi
source: RDA-term @sv
created: 2024-12-18
modified: 2025-08-21
alternative label: säilyttäjä (yhteisö)
alternative label: förvaltare @sv
alternative label: förvarare (institution) @sv
broader: kappaleeseen liittyvä yhteisö
definition: Yhteisö, jolla on kappaleen laillinen säilyttämisoikeus. (RDA Registry)
definition: Institution som har juridisk förvaringsrätt till ett exemplar. @sv
in scheme: Metatietosanasto
preferred label: custodian corporate body @en
preferred label: förvarare @sv

ohjelmoija
type: Concept
source: Kansallinen RDA-termi
source: Nationell RDA-term @sv
created: 2024-12-18
modified: 2025-08-15
alternative label: digitaaliseen sisältöön osallinen ohjelmoija (yhteisö)
alternative label: programmerare (institution) som är bidragsgivare till digitalt innehåll @sv
broader: digitaaliseen sisältöön osallinen yhteisö
definition: Aggregaattiin sisältyvän digitaalisen sisällön yhteisötekijä.
definition: Upphovsinstitution till digitalt innehåll som ingår i ett aggregat. @sv
in scheme: Metatietosanasto
preferred label: programmerare @sv

lavastaja
type: Concept
source: RDA-termi
source: RDA-term @sv
created: 2024-12-18
modified: 2025-07-04
alternative label: lavastaja (yhteisö)
alternative label: scenograf (institution) @sv
broader: esitykseen osallinen yhteisö
definition: Yhteisö, joka osallistuu ekspression tekemiseen valvomalla taiteilijoita ja käsityöläisiä, jotka rakentavat lavasteita elokuvatuotantoihin. (RDA Registry)
definition: Institution som deltar i utförandet av ett uttryck, genom att övervaka konstnärer och hantverkare som bygger kulisser för filmproduktioner. @sv
in scheme: Metatietosanasto
preferred label: art director corporate body @en
preferred label: scenograf @sv

äänituottaja
type: Concept
source: RDA-termi
source: RDA-term @sv
created: 2024-12-18
modified: 2025-08-27
alternative label: äänituottaja (yhteisö)
alternative label: ljudproducent (institution) @sv
broader: tuottaja
definition: Yhteisö, joka on tuottaja, joka on vastuussa useimpien äänitteen liiketoiminnallisten tehtävien hoitamisesta. (RDA Registry)
definition: Institution som är en producent, som svarar för skötseln av de flesta kommersiella uppgifterna kring en ljudinspelning. @sv
in scheme: Metatietosanasto
preferred label: audio producer corporate body @en
preferred label: ljudproducent @sv

sovittaja
type: Concept
source: RDA-termi
source: RDA-term @sv
created: 2024-12-18
modified: 2025-08-19
alternative label: sovittaja (henkilö)
alternative label: arrangör (person) @sv
broader: tarkistaja
definition: Henkilö, joka osallistuu teoksen ekspression tekemiseen muokkaamalla sävellyksen alkuperäisteoksesta poikkeavalle esityskokoonpanolle. (RDA Registry)
definition: Person som deltar i utförandet av ett verks uttryck, genom att omarbeta kompositionen för en musikalisk besättning som avviker från originalverket. @sv
in scheme: Metatietosanasto
preferred label: arranger person of music @en
preferred label: arrangör @sv
scope note: Sovittaja voi myös muokata teosta samalle esityskokoonpanolle tms. säilyttäen alkuperäisen sävellyksen musiikillisen sisällön olennaisilta osin muuttumattomana. Tähän ei sisälly laaja muokkaaminen, joka johtaa uuden musiikkiteoksen luomiseen. (RDA Registry)
scope note: En arrangör kan också bearbeta verket för samma musikaliska besättning eller dylikt och bevara originalkompositionens musikaliska innehåll till sina väsentliga delar oförändrade. I detta ingår inte omfattande ändringar som leder till skapandet av ett nytt musikverk. @sv

panelisti
type: Concept
source: RDA-termi
source: RDA-term @sv
created: 2024-12-18
modified: 2025-08-16
alternative label: panelisti (henkilö)
alternative label: deltagare (person) i paneldiskussion @sv
alternative label: paneldeltagare @sv
broader: esittäjä
definition: Henkilö, joka on esittäjä, joka osallistuu ekspression tekemiseen osallistumalla (usein lähetettyyn) ohjelmaan, jossa keskustellaan eri aiheista tavallisesti keskusteluun liittyvien aiheiden asiantuntijoiden kanssa. (RDA Registry)
definition: Person som är en framförare som deltar i utförandet av ett uttryck, genom att delta i ett (ofta utsänt) program, i vilket olika ämnen diskuteras, vanligen tillsammans med experter inom ämnen som relaterar till diskussionen. @sv
in scheme: Metatietosanasto
preferred label: panelist person @en
preferred label: deltagare i paneldiskussion @sv

paperinvalmistaja
type: Concept
source: RDA-termi
source: RDA-term @sv
created: 2024-12-18
modified: 2025-08-16
alternative label: paperinvalmistaja (henkilö)
alternative label: pappersmakare @sv
alternative label: papperstillverkare (person) @sv
broader: aineistoon liittyvä henkilö
definition: Henkilö, joka on vastuussa manifestaatioon käytettävän paperin valmistamisesta. (RDA Registry)
definition: Person som svarar för tillverkningen av papper som använts i en manifestation. @sv
in scheme: Metatietosanasto
preferred label: papermaker person @en
preferred label: papperstillverkare @sv

litografi
type: Concept
source: RDA-termi
source: RDA-term @sv
created: 2024-12-18
modified: 2025-07-05
alternative label: litografi (yhteisö)
alternative label: litograf (institution) @sv
broader: kuvalaatan valmistaja
definition: Yhteisö, joka on vastuussa manifestaation valmistamisesta valmistamalla litografiassa käytetyn kivilaatan tai muun painolaatan. (RDA Registry)
definition: Institution som svarar för tillverkning av en manifestation, genom att tillverka en stenplatta eller någon annan tryckplåt som används i litografi. @sv
in scheme: Metatietosanasto
preferred label: lithographer corporate body @en
preferred label: litograf @sv
scope note: Litografi tarkoittaa myös graafikkoa, joka tekee piirroksen suoraan painamiseen käytettävälle pinnalle. (RDA Registry)
scope note: Avser också grafiker som gör en teckning direkt på en yta som används för tryckning. @sv

litografi
type: Concept
source: RDA-termi
source: RDA-term @sv
created: 2024-12-18
modified: 2025-07-05
alternative label: litografi (henkilö)
alternative label: litograf (person) @sv
broader: kuvalaatan valmistaja
definition: Henkilö, joka on vastuussa manifestaation valmistamisesta valmistamalla litografiassa käytetyn kivilaatan tai muun painolaatan. (RDA Registry)
definition: Person som svarar för tillverkning av en manifestation, genom att tillverka en stenplatta eller någon annan tryckplåt som används i litografi. @sv
in scheme: Metatietosanasto
preferred label: lithographer person @en
preferred label: litograf @sv
scope note: Litografi tarkoittaa myös graafikkoa, joka tekee piirroksen suoraan painamiseen käytettävälle pinnalle. (RDA Registry)
scope note: Avser också grafiker som gör en teckning direkt på en yta som används för tryckning. @sv

radiotuottaja
type: Concept
source: RDA-termi
source: RDA-term @sv
created: 2024-12-18
modified: 2025-08-19
alternative label: radiotuottaja (henkilö)
alternative label: radioproducent (person) @sv
broader: tuottaja
definition: Henkilö, joka on tuottaja, joka on vastuussa suurimmasta osasta radio-ohjelman liiketoiminnasta. (RDA Registry)
definition: Person som är en producent, som svarar för största delen av affärsverksamheten kring ett radioprogram. @sv
in scheme: Metatietosanasto
preferred label: radio producer person @en
preferred label: radioproducent @sv

taltioija
type: Concept
source: Kansallinen RDA-termi
source: Nationell RDA-term @sv
created: 2024-12-18
modified: 2025-08-21
alternative label: liikkuvaan kuvaan osallinen taltioija (yhteisö)
alternative label: inspelande aktör (institution) som är bidragsgivare till rörlig bild @sv
broader: liikkuvaan kuvaan osallinen yhteisö
definition: Aggregaattiin sisältyvää ääntä tai videota tallennuslaitteen avulla taltioiva yhteisö. Esimerkiksi luonnonäänten, folkloren, musiikin tms. kenttätallennukset.
definition: Institution som spelar in ljud eller video som ingår ett aggregat, med hjälp av en inspelningsapparat. T.ex. fältinspelningar av naturljud, folklore, musik eller dylikt. @sv
in scheme: Metatietosanasto
preferred label: inspelande institution @sv

animaattori
type: Concept
source: RDA-termi
source: RDA-term @sv
created: 2024-12-18
modified: 2025-04-16
alternative label: animaattori (yhteisö)
alternative label: animatör (institution) @sv
broader: esitykseen osallinen yhteisö
definition: Yhteisö, joka osallistuu ekspression tekemiseen tuottamalla näennäistä liikettä elottomiin esineisiin tai piirroksiin. (RDA Registry)
definition: Institution som deltar i skapandet av ett uttryck genom att ge skenbar rörelse åt livlösa objekt eller teckningar. @sv
in scheme: Metatietosanasto
preferred label: animator corporate body @en
preferred label: animatör @sv
scope note: Ei koske animaatiopiirrosten tekijää. (RDA Registry)
scope note: Gäller inte skapare av animationsteckningar. @sv

liikkuvaan kuvaan osallinen toimija
type: Concept
source: RDA-termi
source: RDA-term @sv
created: 2024-12-18
modified: 2025-07-05
broader: aggregaattiin osallinen toimija
definition: Aggregaattiin osallinen toimija, joka on luonut aggregaattiin sisältyvän liikkuvan kuvan teoksen ekspression. (RDA Registry)
definition: Aktör som bidragit till ett aggregat, genom att skapa ett uttryck av ett verk med rörlig bild, som ingår i ett aggregat. @sv
in scheme: Metatietosanasto
preferred label: contributor agent of moving image @en
preferred label: bidragsgivare (aktör) till rörlig bild @sv

kirjataiteilija
type: Concept
source: RDA-termi
source: RDA-term @sv
created: 2024-12-18
modified: 2025-07-03
alternative label: kirjataiteilija (henkilö)
alternative label: bokkonstnär (person) @sv
broader: taiteilija
definition: Henkilö, joka on taiteilija, joka on vastuussa kirjan muodon hyödyntämisestä tai sen fyysisen rakenteen muuttamisesta. (RDA Registry)
definition: Person som är en konstnär, som svarar för utnyttjande av bokens form eller ändring av dess fysiska struktur. @sv
in scheme: Metatietosanasto
preferred label: book artist person @en
preferred label: bokkonstnär @sv

musiikkiin osallinen toimija
type: Concept
source: RDA-termi
source: RDA-term @sv
created: 2024-12-18
modified: 2025-08-14
alternative label: composer (expression) @en
alternative label: säveltäjä (ekspressio)
alternative label: kompositör (uttryck) @sv
broader: aggregaattiin osallinen toimija
definition: Aggregaattiin osallinen toimija, joka on luonut aggregaattiin sisältyvän musiikkiteoksen ekspression. (RDA Registry)
definition: Aktör som bidragit till ett aggregat och skapat ett musikverks uttryck som ingår i ett aggregat. @sv
in scheme: Metatietosanasto
preferred label: contributor agent of music @en
preferred label: bidragsgivare (aktör) till musik @sv

henkilövastaaja siviilioikeudessa
type: Concept
source: RDA-termi
source: RDA-term @sv
created: 2024-12-18
modified: 2025-06-14
broader: henkilövastaaja
definition: Henkilö, jota vastaan on nostettu kanne. (RDA Registry)
definition: Person mot vilken talan väckts. @sv
in scheme: Metatietosanasto
preferred label: civil defendant person @en
preferred label: person som svarande i civilmål @sv

laulaja
type: Concept
source: RDA-termi
source: RDA-term @sv
created: 2024-12-18
modified: 2025-07-04
alternative label: laulaja (henkilö)
alternative label: sångare (person) @sv
broader: esittäjä
definition: Henkilö, joka on esittäjä, joka osallistuu ekspression tekemiseen käyttämällä ääntään, soitinsäestyksellä tai ilman, tuottaakseen musiikkia. (RDA Registry)
definition: Person som är en framförare, som deltar i utförandet av ett uttryck, genom att använda sin röst, med eller utan instrumentalackompanjemang, för att producera musik. @sv
in scheme: Metatietosanasto
preferred label: singer person @en
preferred label: sångare @sv
scope note: Laulajan esitys voi sisältää tai olla sisältämättä todellisia sanoja. (RDA Registry)
scope note: Sångarens framförande kan vara med eller utan riktiga ord. @sv

kommentaattori
type: Concept
source: Kansallinen RDA-termi
source: Nationell RDA-term @sv
created: 2024-12-18
modified: 2025-07-03
alternative label: liikkuvaan kuvaan osallinen kommentaattori (yhteisö)
alternative label: kommentator (institution) som är bidragsgivare till rörlig bild @sv
broader: liikkuvaan kuvaan osallinen yhteisö
definition: Aggregaattiin sisältyvän audiovisuaalisen aineiston aihetta tulkitseva, analysoiva tai keskustelussa käsittelevä yhteisö.
definition: Institution som tolkar, analyserar eller diskuterar ett ämne i audiovisuellt material som ingår i ett aggregat. @sv
in scheme: Metatietosanasto
preferred label: kommentator @sv

elokuvan musiikin säveltäjä
type: Concept
source: Kansallinen RDA-termi
source: Nationell RDA-term @sv
created: 2024-12-18
modified: 2025-05-27
alternative label: elokuvan musiikin säveltäjä (henkilö)
alternative label: kompositör (person) av filmmusik @sv
broader: säveltäjä
definition: A person who is responsible for creating a motion picture music work that complements a musical work. @en
definition: Henkilö, joka on vastuussa elokuvaa täydentävän musiikin luomisesta.
definition: Person som svarar för skapandet av musik som kompletterar en film. @sv
in scheme: Metatietosanasto
preferred label: composer person of motion picture music work @en
preferred label: kompositör av filmmusik @sv

kertoja
type: Concept
source: Kansallinen RDA-termi
source: Nationell RDA-term @sv
created: 2024-12-18
modified: 2025-07-03
alternative label: puheeseen osallinen kertoja (henkilö)
alternative label: berättare (person) som är bidragsgivare till tal @sv
broader: puheeseen osallinen henkilö
definition: Henkilö, joka aggregaattiin kuuluvassa sisällössä lukee ääneen tai kertoo toiminnasta, tapahtumasta, tapahtumien kulusta tms.
definition: Person som högläser eller berättar om en handling, en händelse, ett händelseförlopp eller något annat dylikt, i ett innehåll som hör till ett aggregat. @sv
in scheme: Metatietosanasto
preferred label: berättare @sv

lyhentäjä
type: Concept
source: RDA-termi
source: RDA-term @sv
created: 2024-12-18
modified: 2025-07-05
alternative label: lyhentäjä (henkilö)
alternative label: förkortad av (person) @sv
broader: tarkistaja
definition: Henkilö, joka osallistuu ekspression tekemiseen lyhentämällä siihen liittyvän teoksen ekspressiota muuttamatta esityksen yleistä sisältöä tai tyyliä. (RDA Registry)
definition: Person som deltar i skapandet av ett uttryck, genom att förkorta ett relaterat verks uttryck utan att förändra framställningens allmänna innehåll eller stil. @sv
in scheme: Metatietosanasto
preferred label: abridger person @en
preferred label: förkortad av @sv
scope note: Ei koske oleellista muokkausta, joka johtaa uuden teoksen luomiseen. (RDA Registry)
scope note: Gäller inte betydande ändringar, som leder till skapandet av ett nytt verk. @sv

kokousten raportoija
type: Concept
source: RDA-termi
source: RDA-term @sv
created: 2024-12-18
modified: 2025-07-03
alternative label: kokousten raportoija (henkilö)
alternative label: mötesrapportör (person) @sv
broader: kirjoittaja
definition: Henkilö, joka on kirjoittaja, joka on saanut organisaatiolta tehtäväkseen raportoida kokousmenettelyistä. (RDA Registry)
definition: Person som är en författare, som fått i uppgift av en organisation att rapportera om mötesförfaranden. @sv
in scheme: Metatietosanasto
preferred label: rapporteur person @en
preferred label: mötesrapportör @sv
scope note: Ei kata pöytäkirjan laatimiseen rajoittuvaa vastuuta. (RDA Registry)
scope note: Omfattar inte ansvar som är begränsat till protokollföring. @sv

säilyttäjä
type: Concept
source: RDA-termi
source: RDA-term @sv
created: 2024-12-18
modified: 2025-08-21
alternative label: säilyttäjä (henkilö)
alternative label: förvaltare @sv
alternative label: förvarare (person) @sv
broader: kappaleeseen liittyvä henkilö
definition: Henkilö, jolla on kappaleen laillinen säilyttämisoikeus. (RDA Registry)
definition: Person som har juridisk förvaringsrätt till ett exemplar. @sv
in scheme: Metatietosanasto
preferred label: custodian person @en
preferred label: förvarare @sv

erikoistehosteiden tekijä
type: Concept
source: Kansallinen RDA-termi
source: Nationell RDA-term @sv
created: 2024-12-18
modified: 2025-06-04
alternative label: liikkuvaan kuvaan osallinen erikoistehosteiden tekijä (yhteisö)
alternative label: skapare av specialeffekter (institution) som bidragsgivare till rörlig bild @sv
broader: liikkuvaan kuvaan osallinen yhteisö
definition: Aggregaattiin sisältyvien liikkuvan kuvan tai äänen taltiointien erikoistehosteet (esim. mekaaniset tehosteet ja kameralla toteutettavat optiset tehosteet) tekevä yhteisö.
definition: Institution som skapar specialeffekter (t.ex. mekaniska effekter och optiska effekter skapade med kamera) i inspelningar av rörlig bild eller ljud, som ingår i aggregat. @sv
in scheme: Metatietosanasto
preferred label: skapare av specialeffekter @sv

tutkija
type: Concept
source: RDA-termi
source: RDA-term @sv
created: 2024-12-18
modified: 2025-08-23
alternative label: tutkija (yhteisö)
alternative label: forskare (institution) @sv
broader: teoksen tekijä
definition: Yhteisö, joka tukee teoksen syntymistä tutkimuksellaan. (RDA Registry)
definition: Institution som stöder uppkomsten av ett verk genom sin forskning. @sv
in scheme: Metatietosanasto
preferred label: researcher corporate body @en
preferred label: forskare @sv

lavastaja
type: Concept
source: RDA-termi
source: RDA-term @sv
created: 2024-12-18
modified: 2025-07-04
alternative label: lavastaja (henkilö)
alternative label: scenograf (person) @sv
broader: esitykseen osallinen henkilö
definition: Henkilö, joka osallistuu ekspression tekemiseen valvomalla taiteilijoita ja käsityöläisiä, jotka rakentavat lavasteita elokuvatuotantoihin. (RDA Registry)
definition: Person som deltar i utförandet av ett uttryck, genom att övervaka konstnärer och hantverkare som bygger kulisser för filmproduktioner. @sv
in scheme: Metatietosanasto
preferred label: art director person @en
preferred label: scenograf @sv

maanmittari
type: Concept
source: RDA-termi
source: RDA-term @sv
created: 2024-12-18
modified: 2025-08-14
alternative label: maanmittari (henkilö)
alternative label: lantmätare (person) @sv
broader: kartantekijä
definition: Henkilö, joka kartografiaan osallisena toimijana tuottaa maantieteellisen alueen mitat tai mittasuhteet. (RDA Registry)
definition: Person som är delaktig aktör i kartografi och ger mått eller proportioner för ett geografiskt område. @sv
in scheme: Metatietosanasto
preferred label: surveyor person @en
preferred label: lantmätare @sv

pöytäkirjan laatija
type: Concept
source: RDA-termi
source: RDA-term @sv
created: 2024-12-18
modified: 2025-08-16
alternative label: pöytäkirjan laatija (yhteisö)
alternative label: protokollförare (institution) @sv
broader: yhdistymään osallinen yhteisö
definition: Yhteisö, joka vastaa kokouksen pöytäkirjan laatimisesta. (RDA Registry)
definition: Institution som svarar för sammanställandet av ett protokoll för ett möte. @sv
in scheme: Metatietosanasto
preferred label: minute taker corporate body @en
preferred label: protokollförare @sv

miksaaja
type: Concept
source: Kansallinen RDA-termi
source: Nationell RDA-term @sv
created: 2024-12-18
modified: 2025-08-14
alternative label: musiikkiin osallinen miksaaja (henkilö)
alternative label: mixer (person) som är bidragsgivare till musik @sv
broader: musiikkiin osallinen henkilö
definition: Aggregaattiin sisältyvässä musiikissa ääniraitoja käsittelevä, miksaava tai yhdistelevä henkilö.
definition: Person som behandlar, mixar och kombinerar ljudspår i musik som ingår i ett aggregat. @sv
in scheme: Metatietosanasto
preferred label: mixer @sv

elokuvaohjaaja
type: Concept
source: RDA-termi
source: RDA-term @sv
created: 2024-12-18
modified: 2025-05-27
alternative label: elokuvaohjaaja (henkilö)
alternative label: filmregissör (person) @sv
broader: ohjaaja
definition: Henkilö, joka on ohjaaja, joka on vastuussa elokuvatun esityksen yleisestä johtamisesta ja valvonnasta. (RDA Registry)
definition: Person som är en regissör, som svarar för allmän ledning och övervakning av en filmad föreställning som ingår i ett aggregat. @sv
in scheme: Metatietosanasto
preferred label: film director person @en
preferred label: filmregissör @sv

liikkuvan kuvan esittäjä
type: Concept
source: Kansallinen RDA-termi
source: Nationell RDA-term @sv
created: 2024-12-18
modified: 2025-07-05
alternative label: liikkuvaan kuvaan osallinen esittäjä (henkilö)
alternative label: framförande person som är bidragsgivare till rörlig bild @sv
broader: liikkuvaan kuvaan osallinen henkilö
definition: Aggregaattiin sisältyvässä liikkuvassa kuvassa esiintyvä henkilö.
definition: Person som deltar i rörlig bild som ingår i ett aggregat. @sv
in scheme: Metatietosanasto
preferred label: framförande person i rörlig bild @sv

kirjoittaja
type: Concept
source: Kansallinen RDA-termi
source: Nationell RDA-term @sv
created: 2024-12-18
modified: 2025-07-03
alternative label: tekstiin osallinen kirjoittaja (henkilö)
alternative label: författare (person) som är bidragsgivare till text @sv
broader: tekstiin osallinen henkilö
definition: Aggregaattiin sisältyvän tekstin kirjoittanut henkilö. Määritelmä kattaa myös uuden sisällön luomisen toisen tekijän tekstiä mukailemalla, muokkaamalla tai sovittamalla, jos muutos on olennaisesti muuttanut alkuperäisen luonnetta ja sisältöä tai ilmaisutapaa.
definition: Person som skrivit en text som ingår i ett aggregat. Innefattar även skapandet av nytt innehåll genom att omarbeta, redigera eller bearbeta text av en annan upphovsperson, såvida ändringen väsentligen har ändrat originalets karaktär och innehåll eller uttrycksform. @sv
in scheme: Metatietosanasto
preferred label: författare @sv

puheen äänisuunnittelija
type: Concept
source: Kansallinen RDA-termi
source: Nationell RDA-term @sv
created: 2024-12-18
modified: 2025-08-16
alternative label: puheeseen osallinen äänisuunnittelija (henkilö)
alternative label: ljuddesigner (person) som är bidragsgivare till tal @sv
broader: puheeseen osallinen henkilö
definition: Aggregaattiin sisältyvän puhesisällön äänikomponentteja suunnitteleva ja tekevä henkilö.
definition: Person som planerar och gör ljudkomponenter i ett talinnehåll som ingår i ett aggregat. @sv
in scheme: Metatietosanasto
preferred label: ljuddesigner för tal @sv

kirjataiteilija
type: Concept
source: RDA-termi
source: RDA-term @sv
created: 2024-12-18
modified: 2025-07-03
alternative label: kirjataiteilija (yhteisö)
alternative label: bokkonstnär (institution) @sv
broader: taiteilija
definition: Yhteisö, joka on taiteilija, joka on vastuussa kirjan muodon hyödyntämisestä tai sen fyysisen rakenteen muuttamisesta. (RDA Registry)
definition: Institution som är en konstnär, som svarar för utnyttjande av bokens form eller ändring av dess fysiska struktur. @sv
in scheme: Metatietosanasto
preferred label: book artist corporate body @en
preferred label: bokkonstnär @sv

tarinankertoja
type: Concept
source: RDA-termi
source: RDA-term @sv
created: 2016-01-08
modified: 2025-08-21
alternative label: storyteller @en
alternative label: tarinankertoja (toimija)
alternative label: historieberättare (aktör) @sv
broader: esittäjä
definition: Toimija, joka on esittäjä, joka osallistuu ekspression tekemiseen kertomalla tarinan draamallisella tai teatraalisella tulkinnalla. (RDA Registry)
definition: Aktör som är en framförare, som deltar i utförandet av ett uttryck genom att framföra en berättelse med en dramatisk eller teatralisk tolkning. @sv
in scheme: Metatietosanasto
preferred label: storyteller agent @en
preferred label: historieberättare @sv

kuvanveistäjä
type: Concept
source: Kansallinen RDA-termi
source: Nationell RDA-term @sv
created: 2024-12-18
modified: 2025-07-04
alternative label: esineeseen osallinen kuvanveistäjä (henkilö)
alternative label: skulptör (person) som är bidragsgivare till föremål @sv
broader: esineeseen osallinen henkilö
definition: Aggregaattiin sisältyvän kolmiulotteisen teoksen muovaamalla, veistämällä tai vastaavalla tekniikalla luonut henkilö.
definition: Person som skapat ett tredimensionellt verk som ingår i ett aggregat, genom att modellera, skära eller använda någon liknande teknik. @sv
in scheme: Metatietosanasto
preferred label: skulptör @sv

tuotantosuunnittelija
type: Concept
source: Kansallinen RDA-termi
source: Nationell RDA-term @sv
created: 2024-12-18
modified: 2025-08-14
alternative label: liikkuvaan kuvaan osallinen tuotantosuunnittelija (henkilö)
alternative label: produktionsdesigner (person) som är bidragsgivare till rörlig bild @sv
broader: liikkuvaan kuvaan osallinen henkilö
definition: Aggregaattiin liittyvän elokuvatuotannon visuaalisen kokonaisilmeen suunnitellut henkilö.
definition: Person som planerat det visuella helhetsuttrycket i en filmproduktion som relaterar till ett aggregat. @sv
in scheme: Metatietosanasto
preferred label: produktionsdesigner @sv

taltioija
type: Concept
source: RDA-termi
source: RDA-term @sv
created: 2024-12-18
modified: 2025-08-21
alternative label: taltioija (henkilö)
alternative label: inspelande aktör (person) @sv
broader: esitykseen osallinen henkilö
definition: Henkilö, joka osallistuu ekspression tekemiseen käyttämällä tallennuslaitetta äänen tai videon taltioimiseen tallennustilanteessa. (RDA Registry)
definition: Person som deltar i utförandet av ett uttryck, genom att använda en inspelningsapparat för att lagra ljud eller video vid ett inspelningstillfälle. @sv
in scheme: Metatietosanasto
preferred label: recordist person @en
preferred label: inspelande person @sv
scope note: Sisältää luonnonäänten, musiikkiesitysten ja muiden tapahtumien kenttä-äänitykset. (RDA Registry)
scope note: Inbegriper fältinspelningar av naturljud, musikframföranden och andra evenemang. @sv

maskeeraaja
type: Concept
source: RDA-termi
source: RDA-term @sv
created: 2024-12-18
modified: 2025-08-14
alternative label: maskeeraaja (yhteisö)
alternative label: maskör (institution) @sv
broader: esitykseen osallinen yhteisö
definition: Yhteisö, joka osallistuu ekspression tekemiseen vastaamalla elokuvan, musikaalin tai näyttämöteoksen maskeerauksesta. (RDA Registry)
definition: Institution som deltar i utförandet av ett uttryck, genom att svara för maskering i en film, en musikal eller ett sceniskt verk. @sv
in scheme: Metatietosanasto
preferred label: makeup artist corporate body @en
preferred label: maskör @sv

nukettaja
type: Concept
source: RDA-termi
source: RDA-term @sv
created: 2024-12-18
modified: 2025-08-15
alternative label: nukettaja (henkilö)
alternative label: dockspelare (person) @sv
broader: esittäjä
definition: Henkilö, joka on esittäjä, joka osallistuu ekspression tekemiseen käsittelemällä, kontrolloimalla tai ohjaamalla nukkeja tai marionetteja elokuvatuotannossa tai musiikki- tai näytelmäesityksessä. (RDA Registry)
definition: Person som är en framförare som deltar i utförandet av ett uttryck genom att hantera, kontrollera eller styra dockor eller marionetter i en filmproduktion eller ett musikaliskt eller sceniskt uppförande. @sv
in scheme: Metatietosanasto
preferred label: puppeteer person @en
preferred label: dockspelare @sv

visuaalisten tehosteiden tekijä
type: Concept
source: RDA-termi
source: RDA-term @sv
created: 2024-12-18
modified: 2025-08-23
alternative label: visuaalisten tehosteiden tekijä (henkilö)
alternative label: skapare (person) av visuella effekter @sv
broader: esitykseen osallinen henkilö
definition: Henkilö, joka osallistuu liikkuvan kuvan teoksen ekspression tekemiseen suunnittelemalla ja luomalla visuaaliset tehosteet jälkituotantovaiheessa. (RDA Registry)
definition: Person som deltar i utförandet av ett uttryck av ett verk med rörlig bild, genom att planera och skapa visuella effekter i postproduktionsfasen. @sv
in scheme: Metatietosanasto
preferred label: visual effects provider person @en
preferred label: skapare av visuella effekter @sv

järjestäjä
type: Concept
source: RDA-termi
source: RDA-term @sv
created: 2024-12-18
modified: 2025-11-26
alternative label: järjestäjä (henkilö)
alternative label: arrangör av evenemang @sv
alternative label: evenemangsarrangör (person) @sv
alternative label: mötesarrangör @sv
broader: teoksen tekijä
definition: Henkilö, joka järjestää konferenssin, näyttelyn tai muun tapahtuman, joka antaa alun teokselle. (RDA Registry)
definition: Person som ordnar en konferens, en utställning eller något annat evenemang som ger upphov till ett verk. @sv
in scheme: Metatietosanasto
preferred label: organizer person @en
preferred label: evenemangsarrangör @sv

illuminoinnin tekijä
type: Concept
source: RDA-termi
source: RDA-term @sv
created: 2024-12-18
modified: 2025-06-14
alternative label: illuminoinnin tekijä (yhteisö)
alternative label: illuminator (institution) @sv
alternative label: illuminatör @sv
broader: muokkaaja
definition: Yhteisö, joka koristelee yksittäisen kappaleen käyttäen jalometalleja tai värejä, usein yksityiskohtaisissa kuvioissa tai motiiveissa. (RDA Registry)
definition: Institution som dekorerar ett enskilt exemplar genom att använda ädelmetaller eller färger, ofta i detaljerade mönster eller motiv. @sv
in scheme: Metatietosanasto
preferred label: illuminator corporate body @en
preferred label: illuminator @sv

taltioija
type: Concept
source: Kansallinen RDA-termi
source: Nationell RDA-term @sv
created: 2024-12-18
modified: 2025-08-21
alternative label: liikkuvaan kuvaan osallinen taltioija (henkilö)
alternative label: inspelande aktör (person) som är bidragsgivare till rörlig bild @sv
broader: liikkuvaan kuvaan osallinen henkilö
definition: Aggregaattiin sisältyvää ääntä tai videota tallennuslaitteen avulla taltioiva henkilö. Esimerkiksi luonnonäänten, folkloren, musiikin tms. kenttätallennukset.
definition: Person som spelar in ljud eller video som ingår ett aggregat, med hjälp av en inspelningsapparat. T.ex. fältinspelningar av naturljud, folklore, musik eller dylikt. @sv
in scheme: Metatietosanasto
preferred label: inspelande person @sv

tanssija
type: Concept
source: RDA-termi
source: RDA-term @sv
created: 2024-12-18
modified: 2025-08-21
alternative label: tanssija (yhteisö)
alternative label: dansare (institution) @sv
broader: esittäjä
definition: Yhteisö, joka on esittäjä, joka osallistuu ekspression tekemiseen tanssimalla musiikki- tai näytelmäesityksessä. (RDA Registry)
definition: Institution som är en framförare, som deltar i utförandet av ett uttryck genom att dansa i ett musikaliskt eller dramatiskt framförande. @sv
in scheme: Metatietosanasto
preferred label: dancer corporate body @en
preferred label: dansare @sv

sukujäsen yhteisössä
type: Concept
source: RDA-termi
source: RDA-term @sv
created: 2024-12-18
modified: 2025-08-21
broader: sukuun liittyvä yhteisö
definition: Yhteisö, jonka jäsen suku on. (RDA Registry)
definition: Institution som en släkt är en del av. @sv
in scheme: Metatietosanasto
preferred label: family member of corporate body of @en
preferred label: släktmedlem i institutionen @sv

näyttämöohjaaja
type: Concept
source: RDA-termi
source: RDA-term @sv
created: 2024-12-18
modified: 2025-08-15
alternative label: näyttämöohjaaja (henkilö)
alternative label: scenregissör (person) @sv
broader: esitykseen osallinen henkilö
definition: Henkilö, joka osallistuu näyttämöteoksen ekspression tekemiseen johtamalla tai valvomalla esitystä. (RDA Registry)
definition: Person som deltar i utförandet av ett uttryck av ett sceniskt verk, genom att leda eller övervaka ett framförande. @sv
in scheme: Metatietosanasto
preferred label: stage director person @en
preferred label: scenregissör @sv

musiikkiohjelmoija
type: Concept
source: Kansallinen RDA-termi
source: Nationell RDA-term @sv
created: 2024-12-18
modified: 2025-08-14
alternative label: musiikkiin osallinen musiikkiohjelmoija (henkilö)
alternative label: musikprogrammerare (person) som är bidragsgivare till musik @sv
broader: musiikkiin osallinen henkilö
definition: Aggregaattiin sisältyvään musiikkiin sähköisillä äänilaitteilla tai tietokoneohjelmilla ääniä tekevä henkilö.
definition: Person som skapar ljud i musik som ingår i ett aggregat, med hjälp av elektriska ljudenheter eller datorprogram. @sv
in scheme: Metatietosanasto
preferred label: musikprogrammerare @sv

moderoija
type: Concept
source: RDA-termi
source: RDA-term @sv
created: 2024-12-18
modified: 2025-08-14
alternative label: moderoija (yhteisö)
alternative label: moderator (institution) @sv
broader: esittäjä
definition: Yhteisö, joka on esittäjä, joka osallistuu ekspression tekemiseen juontamalla (usein lähetettyä) ohjelmaa, jossa keskustellaan eri aiheista tavallisesti keskusteluun liittyvien aiheiden asiantuntijoiden kanssa. (RDA Registry)
definition: Institution som är en framförare som deltar i utförandet av ett uttryck, genom att leda ett (ofta utsänt) program, i vilket olika ämnen diskuteras, vanligen tillsammans med experter i ämnen som relaterar till diskussionen. @sv
in scheme: Metatietosanasto
preferred label: moderator corporate body @en
preferred label: moderator @sv

valosuunnittelija
type: Concept
source: RDA-termi
source: RDA-term @sv
created: 2024-12-18
modified: 2025-08-23
alternative label: valosuunnittelija (henkilö)
alternative label: ljusdesigner (person) @sv
alternative label: ljussättare @sv
broader: esitykseen osallinen henkilö
definition: Henkilö, joka osallistuu ekspression tekemiseen suunnittelemalla ja luomalla valokomponentteja. (RDA Registry)
definition: Person som deltar i utförandet av ett uttryck, genom att planera och skapa ljuskomponenter. @sv
in scheme: Metatietosanasto
preferred label: lighting designer person @en
preferred label: ljusdesigner @sv

tanssija
type: Concept
source: RDA-termi
source: RDA-term @sv
created: 2024-12-18
modified: 2025-08-21
alternative label: tanssija (henkilö)
alternative label: dansare (person) @sv
broader: esittäjä
definition: Henkilö, joka on esittäjä, joka osallistuu ekspression tekemiseen tanssimalla musiikki- tai näytelmäesityksessä. (RDA Registry)
definition: Person som är en framförare, som deltar i utförandet av ett uttryck genom att dansa i ett musikaliskt eller dramatiskt framförande. @sv
in scheme: Metatietosanasto
preferred label: dancer person @en
preferred label: dansare @sv

radio-ohjaaja
type: Concept
source: RDA-termi
source: RDA-term @sv
created: 2024-12-18
modified: 2025-08-16
alternative label: radio-ohjaaja (yhteisö)
alternative label: radioregissör (institution) @sv
broader: ohjaaja
definition: Yhteisö, joka on ohjaaja, joka on vastuussa radio-ohjelman yleisestä johtamisesta ja valvonnasta. (RDA Registry)
definition: Institution som är en regissör, som svarar för den allmänna ledningen och övervakningen av ett radioprogram. @sv
in scheme: Metatietosanasto
preferred label: radio director corporate body @en
preferred label: radioregissör @sv

asiantuntija
type: Concept
source: RDA-termi
source: RDA-term @sv
created: 2024-12-18
modified: 2025-04-16
alternative label: asiantuntija (yhteisö)
alternative label: expert (institution) @sv
broader: teoksen tekijä
definition: Yhteisö, joka tarjoaa asiantuntijapalveluita ja usein antaa suosituksia toimijalle, joka esiintyy teoksen tekijänä. (RDA Registry)
definition: Institution som erbjuder experttjänster och ofta ger rekommendationer åt en aktör, som är upphovsperson till ett verk. @sv
in scheme: Metatietosanasto
preferred label: consultant corporate body @en
preferred label: expert @sv

valosuunnittelija
type: Concept
source: Kansallinen RDA-termi
source: Nationell RDA-term @sv
created: 2024-12-18
modified: 2025-08-23
alternative label: liikkuvaan kuvaan osallinen valosuunnittelija (henkilö)
alternative label: ljusdesigner (person) som är bidragsgivare till rörlig bild @sv
alternative label: ljussättare @sv
broader: liikkuvaan kuvaan osallinen henkilö
definition: Aggregaattiin sisältyviä valokomponentteja suunnitteleva ja tekevä henkilö.
definition: Person som planerar och skapar ljuskomponenter, som ingår i ett aggregat. @sv
in scheme: Metatietosanasto
preferred label: ljusdesigner @sv

kuvittaja
type: Concept
source: Kansallinen RDA-termi
source: Nationell RDA-term @sv
created: 2024-12-18
modified: 2025-07-04
alternative label: tekstiin osallinen kuvittaja (henkilö)
alternative label: illustratör (person) som är bidragsgivare till text @sv
broader: tekstiin osallinen henkilö
definition: Aggregaattiin kuuluvaa sisältöä selittävän tai koristavan kuvan henkilötekijä.
definition: Upphovsperson för en bild som förklarar eller dekorerar innehåll som hör till ett aggregat. @sv
in scheme: Metatietosanasto
preferred label: illustratör @sv

teoksen haastattelija
type: Concept
source: RDA-termi
source: RDA-term @sv
created: 2024-12-18
modified: 2026-03-28
alternative label: haastattelija (teos)
alternative label: teoksen haastattelija (yhteisö)
alternative label: intervjuare (institution) i verk @sv
broader: teoksen tekijä
definition: Yhteisö, joka on vastuussa teoksen luomisesta toimimalla haastattelijana, toimittajana, mielipidetutkijana tai jonkinlaisena muuna toimijana, joka kerää tietoja. (RDA Registry)
definition: Institution som svarar för skapandet av ett verk, genom att fungera som intervjuare, journalist, opinionsmätare eller någon annan aktör, som samlar information. @sv
in scheme: Metatietosanasto
preferred label: interviewer corporate body of work @en
preferred label: intervjuare i verk @sv

teoksen kartantekijä
type: Concept
source: RDA-termi
source: RDA-term @sv
created: 2024-12-18
modified: 2025-08-22
alternative label: teoksen kartantekijä (henkilö)
alternative label: kartograf (person) för verk @sv
broader: teoksen tekijä
definition: Henkilö, joka on vastuussa kartografisen teoksen luomisesta. (RDA Registry)
definition: Person som svarar för skapandet av ett kartografiskt verk. @sv
in scheme: Metatietosanasto
preferred label: cartographer person of work @en
preferred label: kartograf för verk @sv

toimeksiantaja
type: Concept
source: RDA-termi
source: RDA-term @sv
created: 2024-12-18
modified: 2025-08-27
alternative label: toimeksiantaja (henkilö)
alternative label: beställare @sv
alternative label: uppdragsgivare (person) @sv
broader: teokseen liittyvä henkilö
definition: Henkilö, joka on vastuussa teoksen teettämisestä. (RDA Registry)
definition: Person som svarar för beställningen av ett verk. @sv
in scheme: Metatietosanasto
preferred label: commissioning person @en
preferred label: uppdragsgivare @sv

kertoja
type: Concept
source: Kansallinen RDA-termi
source: Nationell RDA-term @sv
created: 2024-12-18
modified: 2025-07-03
alternative label: puheeseen osallinen kertoja (yhteisö)
alternative label: berättare (institution) som är bidragsgivare till tal @sv
broader: puheeseen osallinen yhteisö
definition: Yhteisö, joka aggregaattiin kuuluvassa sisällössä lukee ääneen tai kertoo toiminnasta, tapahtumasta, tapahtumien kulusta tms.
definition: Institution som högläser eller berättar om en handling, en händelse, ett händelseförlopp eller något annat dylikt, i ett innehåll som hör till ett aggregat. @sv
in scheme: Metatietosanasto
preferred label: berättare @sv

tuomioistuimen kirjuri
type: Concept
source: RDA-termi
source: RDA-term @sv
created: 2024-12-18
modified: 2025-08-23
alternative label: tuomioistuimen kirjuri (henkilö)
alternative label: domstolssekreterare (person) @sv
broader: yhdistymään osallinen henkilö
definition: Henkilö, joka osallistuu teoksen ekspression tekemiseen valmistelemalla tuomioistuimen lausunnon julkaistavaksi. (RDA Registry)
definition: Person som deltar i utförandet av ett verks uttryck, genom att förbereda en domstols utlåtande för publicering. @sv
in scheme: Metatietosanasto
preferred label: court reporter person @en
preferred label: domstolssekreterare @sv

opinnäytteen ohjaaja
type: Concept
source: RDA-termi
source: RDA-term @sv
created: 2016-01-08
modified: 2025-05-29
alternative label: handledare för examen @sv
broader: akateeminen ohjaaja
definition: Henkilö, joka on akateeminen ohjaaja, joka on vastuussa teokseen johtavan akateemisen opinnäyte- tai väitöskirjatutkimuksen neuvomisesta tai valvonnasta. (RDA Registry)
definition: Person som är en akademisk handledare, som svarar för vägledning eller övervakning av ett lärdomsprov eller en doktorsavhandling som leder till ett verk. @sv
in scheme: Metatietosanasto
preferred label: degree supervisor @en
preferred label: handledare för lärdomsprov @sv
scope note: Kattaa opinnäytteen tai väitöskirjan ohjaajan. (RDA Registry)
scope note: Omfattar handledare för lärdomsprov eller doktorsavhandling. @sv

nukettaja
type: Concept
source: Kansallinen RDA-termi
source: Nationell RDA-term @sv
created: 2024-12-18
modified: 2025-08-15
alternative label: liikkuvaan kuvaan osallinen nukettaja (henkilö)
alternative label: dockspelare (person) som är bidragsgivare till rörlig bild @sv
broader: liikkuvaan kuvaan osallinen henkilö
definition: Aggregaattiin sisältyvässä esityksessä tai filmissä nukkeja käsittelevä henkilö.
definition: Person som hanterar dockor i en föreställning eller film som ingår i ett aggregat. @sv
in scheme: Metatietosanasto
preferred label: dockspelare @sv

maskeeraaja
type: Concept
source: Kansallinen RDA-termi
source: Nationell RDA-term @sv
created: 2024-12-18
modified: 2025-08-14
alternative label: liikkuvaan kuvaan osallinen maskeeraaja (yhteisö)
alternative label: maskör (institution) som är bidragsgivare till rörlig bild @sv
broader: liikkuvaan kuvaan osallinen yhteisö
definition: Aggregaattiin sisältyvän elokuvan, musikaalin tai näyttämöteoksen maskeerauksesta vastaava yhteisö.
definition: Institution som svarar för maskering i en film, en musikal eller ett sceniskt verk som ingår i ett aggregat. @sv
in scheme: Metatietosanasto
preferred label: maskör @sv

teoksen sponsori
type: Concept
source: RDA-termi
source: RDA-term @sv
created: 2024-12-18
modified: 2025-08-23
alternative label: teoksen sponsori (yhteisö)
alternative label: sponsor (institution) av verk @sv
broader: teokseen liittyvä yhteisö
definition: Yhteisö, joka sponsoroi teosta. (RDA Registry)
definition: Institution som sponsrar ett verk. @sv
in scheme: Metatietosanasto
preferred label: sponsoring corporate body of work @en
preferred label: sponsor av verk @sv
scope note: Kattaa tutkimuksen rahoituksen ja teoksen perustana olevan tapahtuman sponsoroinnin. (RDA Registry)
scope note: Täcker finansiering av forskning och sponsring av evenemang som är grund för ett verk. @sv

kirjataiteilija
type: Concept
source: Kansallinen RDA-termi
source: Nationell RDA-term @sv
created: 2024-12-18
modified: 2025-07-03
alternative label: esineeseen osallinen kirjataiteilja (henkilö)
alternative label: bokkonstnär (person) som är bidragsgivare till föremål @sv
broader: esineeseen osallinen henkilö
definition: Aggregaattiin liittyvää kirjataidesisältöä kirjan muotoa hyödyntämällä tai sen fyysistä rakennetta muuttamalla luonut henkilö.
definition: Person som skapat bokkonstnärligt innehåll som relaterar till ett aggregat, genom att utnyttja bokens form eller ändra dess fysiska struktur. @sv
in scheme: Metatietosanasto
preferred label: bokkonstnär @sv

henkilövastaaja rikosoikeudessa
type: Concept
source: RDA-termi
source: RDA-term @sv
created: 2024-12-18
modified: 2025-06-14
broader: henkilövastaaja
definition: Henkilö, joka on syytettynä rikosprosessissa. (RDA Registry)
definition: Person som är åtalad i en straffprocess. @sv
in scheme: Metatietosanasto
preferred label: criminal defendant person @en
preferred label: person som svarande i brottmål @sv

ohjelmoija
type: Concept
source: RDA-termi
source: RDA-term @sv
created: 2024-12-18
modified: 2025-08-15
alternative label: ohjelmoija (henkilö)
alternative label: programmerare (person) @sv
broader: teoksen tekijä
definition: Henkilö, joka on vastuussa tietokoneohjelman luomisesta. (RDA Registry)
definition: Person som svarar för skapandet av ett datorprogram. @sv
in scheme: Metatietosanasto
preferred label: programmer person @en
preferred label: programmerare @sv

lukija
type: Concept
source: Kansallinen RDA-termi
source: Nationell RDA-term @sv
created: 2024-12-18
modified: 2025-07-05
alternative label: puheeseen osallinen lukija (yhteisö)
alternative label: uppläsare (institution) som är bidragsgivare till tal @sv
broader: puheeseen osallinen yhteisö
definition: Aggregaattiin sisältyvää ääneenluentaa tekevä yhteisö.
definition: Institution som gör högläsning som ingår i ett aggregat. @sv
in scheme: Metatietosanasto
preferred label: uppläsare @sv

sarjakuvantekijä
type: Concept
source: Kansallinen RDA-termi
source: Nationell RDA-term @sv
created: 2024-12-18
modified: 2025-08-19
alternative label: stillkuvaan osallinen sarjakuvantekijä (henkilö)
alternative label: serieskapare (person) som är bidragsgivare till stillbild @sv
broader: stillkuvaan osallinen henkilö
definition: Aggregaattiin sisältyvän sarjakuvan kuvien henkilötekijä.
definition: Upphovsperson för bilder i tecknad serie som ingår i ett aggregat. @sv
in scheme: Metatietosanasto
preferred label: serieskapare @sv

juontaja
type: Concept
source: RDA-termi
source: RDA-term @sv
created: 2024-12-18
modified: 2025-07-01
alternative label: juontaja (yhteisö)
alternative label: programledare (institution) @sv
broader: esittäjä
definition: Yhteisö, joka on esittäjä, joka osallistuu ekspression tekemiseen juontamalla (usein lähetettyä) ohjelmaa, johon osallistuu muita esittäjiä. (RDA Registry)
definition: Institution som är en framförare som deltar i utförandet av ett uttryck, genom att leda ett (ofta utsänt) program, i vilket andra uppträdande deltar. @sv
in scheme: Metatietosanasto
preferred label: host corporate body @en
preferred label: programledare @sv

kertoja
type: Concept
source: RDA-termi
source: RDA-term @sv
created: 2024-12-18
modified: 2025-07-03
alternative label: kertoja (yhteisö)
alternative label: berättare (institution) @sv
broader: esittäjä
definition: Yhteisö, joka on esittäjä, joka osallistuu ekspression tekemiseen lukemalla ääneen tai kertomalla toiminnasta, tapauksesta tai muusta tapahtumasta. (RDA Registry)
definition: Institution som är en framförare, som deltar i utförandet av ett uttryck genom att högläsa eller berätta om en handling, en händelse eller något annat förlopp. @sv
in scheme: Metatietosanasto
preferred label: narrator corporate body @en
preferred label: berättare @sv

kappaleen omistuksen kohde
type: Concept
source: RDA-termi
source: RDA-term @sv
created: 2024-12-18
modified: 2025-07-03
alternative label: kappaleen omistuksen kohde (yhteisö)
alternative label: dedikationsmottagare @sv
alternative label: exemplaret dedicerat till (institution) @sv
broader: kappaleeseen liittyvä yhteisö
definition: Yhteisö, jolle kappale on omistettu. (RDA Registry)
definition: Institution som ett exemplar är tillägnat. @sv
in scheme: Metatietosanasto
preferred label: dedicatee corporate body of item @en
preferred label: exemplaret dedicerat till @sv

tarinankertoja
type: Concept
source: RDA-termi
source: RDA-term @sv
created: 2024-12-18
modified: 2025-08-21
alternative label: tarinankertoja (henkilö)
alternative label: historieberättare (person) @sv
broader: esittäjä
definition: Henkilö, joka on esittäjä, joka osallistuu ekspression tekemiseen kertomalla alkuperäisen tarinan draamallisella tai teatraalisella tulkinnalla. (RDA Registry)
definition: Person som är en framförare, som deltar i utförandet av ett uttryck genom att framföra en berättelse med en dramatisk eller teatralisk tolkning. @sv
in scheme: Metatietosanasto
preferred label: storyteller person @en
preferred label: historieberättare @sv

miksaaja
type: Concept
source: RDA-termi
source: RDA-term @sv
created: 2024-12-18
modified: 2025-11-25
alternative label: miksaaja (henkilö)
alternative label: mixer (person) @sv
broader: ääniteknikko
definition: Henkilö, joka osallistuu ekspression äänisisällön tekemiseen käsittelemällä, miksaamalla ja yhdistelemällä useampia äänitteen raitoja. (RDA Registry)
definition: Person som deltar i skapandet av ett uttrycks ljudinnehåll, genom att behandla, mixa och kombinera flera spår i en ljudinspelning. @sv
in scheme: Metatietosanasto
preferred label: mixing engineer person @en
preferred label: mixer @sv
scope note: Ei koske uudelleenmiksauksia, jotka olennaisesti muuttavat alkuperäisen teoksen luonnetta ja sisältöä, mikä johtaa uuteen teokseen. (RDA Registry)
scope note: Gäller inte remixer som väsentligen ändrar det ursprungliga verkets karaktär och innehåll, vilket leder till ett nytt verk. @sv

sensori
type: Concept
source: Kansallinen RDA-termi
source: Nationell RDA-term @sv
created: 2024-12-18
modified: 2025-08-19
alternative label: tekstiin osallinen sensori (yhteisö)
alternative label: censor (institution) som är bidragsgivare till text @sv
broader: tekstiin osallinen yhteisö
definition: Aggregaattiin sisältyvää tekstiä kiistanalaisen sisällön salaamiseksi moraalisin, poliittisin, sotilaallisin tai muin perustein tarkastanut yhteisö. Sensori tarkastaa sisältöä kiistanalaisen sisällön salaamiseksi moraalisin, poliittisin, sotilaallisin tai muin perustein. Alkuperäisen teoksen luonteen ja yleisen sisällön sensori jättää olennaisilta osiltaan muuttumattomaksi.
definition: Institution som granskat text som ingår i ett aggregat, för att dölja kontroversiellt innehåll på moraliska, politiska, militära eller andra grunder. Censorn lämnar det ursprungliga verkets karaktär och allmänna innehåll till sina väsentliga delar oförändrat. @sv
in scheme: Metatietosanasto
preferred label: censor @sv

versioon liittyvä kappale
type: Concept
source: RDA-termi
source: RDA-term @sv
created: 2024-12-18
modified: 2025-08-23
Vastavuoroinen suhde: kappaleeseen liittyvä versio
alternative label: ekspressioon liittyvä kappale
alternative label: exemplar relaterat till uttrycket @sv
definition: Kappale, joka liittyy ekspressioon. (RDA Registry)
definition: Exemplar som relaterar till ett uttryck. @sv
in scheme: Metatietosanasto
preferred label: related item of expression @en
preferred label: exemplar relaterat till versionen @sv

designer
type: Concept
source: Kansallinen RDA-termi
source: Nationell RDA-term @sv
created: 2024-12-18
modified: 2025-04-16
alternative label: esineeseen osallinen designer (henkilö)
alternative label: designer (person) som är bidragsgivare till föremål @sv
broader: esineeseen osallinen henkilö
definition: Aggregaattiin liittyvän kohteen suunnitellut tai muotoillut henkilö.
definition: Person som designat eller formgett ett objekt som relaterar till ett aggregat. @sv
in scheme: Metatietosanasto

julkaisemattoman aineiston tuottaja
type: Concept
source: RDA-termi
source: RDA-term @sv
created: 2024-12-18
modified: 2025-07-01
alternative label: julkaisemattoman manifestaation tuottaja (henkilö)
alternative label: producent (person) för opublicerad manifestation @sv
broader: aineiston tekijä
definition: Henkilö, joka on vastuussa julkaisemattoman manifestaation kaiverruksesta, valmistuksesta, kokoonpanosta tms. (RDA Registry)
definition: Person som svarar för gravering, tillverkning, sammansättning eller annat tillverkningssätt för en opublicerad manifestation. @sv
in scheme: Metatietosanasto
preferred label: producer person of unpublished manifestation @en
preferred label: producent för opublicerat material @sv

kappaleella kunnioitettu henkilö
type: Concept
source: RDA-termi
source: RDA-term @sv
created: 2024-12-18
modified: 2025-04-10
alternative label: festskriftsföremål @sv
broader: kappaleeseen liittyvä henkilö
definition: Henkilö, jota kappaleella kunnioitetaan. (RDA Registry)
definition: Person som är tillägnad ett exemplar. @sv
in scheme: Metatietosanasto
preferred label: honouree person of item @en
preferred label: exemplar tillägnat personen @sv

projektin ohjaaja
type: Concept
source: RDA-termi
source: RDA-term @sv
created: 2024-12-18
modified: 2025-08-16
broader: akateeminen ohjaaja
definition: Henkilö, joka on akateeminen ohjaaja, joka on vastuussa opiskelijan suorittaman, teokseen johtavan projektin neuvonnasta tai ohjaamisesta. (RDA Registry)
definition: Person som är en akademisk handledare, som ansvarar för rådgivning och handledning av ett projekt som en studerande genomför och som leder till ett verk. @sv
in scheme: Metatietosanasto
preferred label: project supervisor @en
preferred label: projekthandledare @sv

lähetyksestä vastaava yhteisö
type: Concept
source: RDA-termi
source: RDA-term @sv
created: 2024-12-18
modified: 2025-07-05
broader: kustantaja
definition: Yhteisö, joka on vastuussa manifestaation lähettämisestä yleisölle radiossa, televisiossa, suoratoistolähetyksenä tai muuna lähetysmediana. (RDA Registry)
definition: Institution som svarar för sändning av en manifestation för en publik i radio, television, som direktsändning eller i något annat sändningsmedium. @sv
in scheme: Metatietosanasto
preferred label: broadcaster corporate body @en
preferred label: sändningsansvarig institution @sv

metatietokuvailu toimijasta
type: Concept
source: RDA-termi
source: RDA-term @sv
created: 2024-12-18
modified: 2025-08-14
broader: kuvaus toimijasta
definition: Metatietoteoksen kuvailema toimija. (RDA Registry)
definition: Aktör som ett metadataverk beskriver. @sv
in scheme: Metatietosanasto
preferred label: metadata description of agent @en
preferred label: metadatabeskrivning av aktören @sv

kokoelman luetteloija
type: Concept
source: RDA-termi
source: RDA-term @sv
created: 2024-12-18
modified: 2025-07-03
alternative label: cataloguer agent @en
alternative label: collection registrar @en
alternative label: kokoelman luetteloija (toimija)
alternative label: samlingsregistrator (aktör) @sv
broader: kokoaja
definition: Toimija, joka vastaa analyyttisen luettelon luomisesta. (RDA Registry)
definition: Aktör som svarar för skapandet av en analytisk katalog. @sv
in scheme: Metatietosanasto
preferred label: collection registrar agent @en
preferred label: samlingsregistrator @sv

kuvanveistäjä
type: Concept
source: Kansallinen RDA-termi
source: Nationell RDA-term @sv
created: 2024-12-18
modified: 2025-07-04
alternative label: esineeseen osallinen kuvanveistäjä (yhteisö)
alternative label: skulptör (institution) som är bidragsgivare till föremål @sv
broader: esineeseen osallinen yhteisö
definition: Aggregaattiin sisältyvän kolmiulotteisen teoksen muovaamalla, veistämällä tai vastaavalla tekniikalla luonut yhteisö.
definition: Institution som skapat ett tredimensionellt verk som ingår i ett aggregat, genom att modellera, skära eller använda någon liknande teknik. @sv
in scheme: Metatietosanasto
preferred label: skulptör @sv

maskeeraaja
type: Concept
source: Kansallinen RDA-termi
source: Nationell RDA-term @sv
created: 2024-12-18
modified: 2025-08-14
alternative label: liikkuvaan kuvaan osallinen maskeeraaja (henkilö)
alternative label: maskör (person) som är bidragsgivare till rörlig bild @sv
broader: liikkuvaan kuvaan osallinen henkilö
definition: Aggregaattiin sisältyvän elokuvan, musikaalin tai näyttämöteoksen maskeerauksesta vastaava henkilö.
definition: Person som svarar för maskering i en film, en musikal eller ett sceniskt verk som ingår i ett aggregat. @sv
in scheme: Metatietosanasto
preferred label: maskör @sv

DJ
type: Concept
source: Kansallinen RDA-termi
source: Nationell RDA-term @sv
created: 2024-12-18
modified: 2025-04-15
alternative label: musiikkiin osallinen DJ (henkilö)
alternative label: DJ (person) som är bidragsgivare till musik @sv
alternative label: discjockey @sv
alternative label: diskjockey @sv
broader: musiikkiin osallinen henkilö
definition: Aggregaattiin sisältyviä ääniraitoja yhteen yhtäjaksoiseksi raidaksi live-esityksessä tai äänitysstudiossa miksaava henkilö.
definition: Person som mixar ljudspår som ingår i ett aggregat till ett sammanhängande spår under ett liveframträdande eller i en inspelningsstudio. @sv
in scheme: Metatietosanasto

lukija
type: Concept
source: Kansallinen RDA-termi
source: Nationell RDA-term @sv
created: 2024-12-18
modified: 2025-07-05
alternative label: puheeseen osallinen lukija (henkilö)
alternative label: uppläsare (person) som är bidragsgivare till tal @sv
broader: puheeseen osallinen henkilö
definition: Aggregaattiin sisältyvää ääneenluentaa tekevä henkilö.
definition: Person som gör högläsning som ingår i ett aggregat. @sv
in scheme: Metatietosanasto
preferred label: uppläsare @sv

nukettaja
type: Concept
source: RDA-termi
source: RDA-term @sv
created: 2024-12-18
modified: 2025-08-15
alternative label: nukettaja (yhteisö)
alternative label: dockspelare (institution) @sv
broader: esittäjä
definition: Yhteisö, joka on esittäjä, joka osallistuu ekspression tekemiseen käsittelemällä, kontrolloimalla tai ohjaamalla nukkeja tai marionetteja elokuvatuotannossa tai musiikki- tai näytelmäesityksessä. (RDA Registry)
definition: Institution som är en framförare som deltar i utförandet av ett uttryck genom att hantera, kontrollera eller styra dockor eller marionetter i en filmproduktion eller ett musikaliskt eller sceniskt uppförande. @sv
in scheme: Metatietosanasto
preferred label: puppeteer corporate body @en
preferred label: dockspelare @sv

koreografi (manifestaatio)
type: Concept
source: RDA-termi
source: RDA-term @sv
created: 2024-12-18
modified: 2026-03-24
alternative label: koreografiaan osallinen yhteisö
alternative label: bidragsgivare (institution) till koreografi @sv
broader: aggregaattiin osallinen yhteisö
definition: Aggregaattiin osallinen yhteisö, joka on luonut aggregaattiin sisältyvän koreografisen teoksen ekspression.
definition: Institution som bidragit till ett aggregat genom att skapa ett uttryck av ett koreografiskt verk som ingår i ett aggregat. @sv
in scheme: Metatietosanasto
preferred label: contributor corporate body of choreography @en
preferred label: koreograf (manifestation) @sv

liikkuvan kuvan värittäjä
type: Concept
source: Kansallinen RDA-termi
source: Nationell RDA-term @sv
created: 2024-12-18
modified: 2025-07-05
alternative label: liikkuvaan kuvaan osallinen värittäjä (yhteisö)
alternative label: färgläggare (institution) som är bidragsgivare till rörlig bild @sv
broader: liikkuvaan kuvaan osallinen yhteisö
definition: Aggregaattiin sisältyvän liikkuvan kuvan värityksen yhteisötekijä.
definition: Institution som färglagt rörlig bild som ingår i ett aggregat. @sv
in scheme: Metatietosanasto
preferred label: färgläggare av rörlig bild @sv

äänittäjä
type: Concept
source: RDA-termi
source: RDA-term @sv
created: 2024-12-18
modified: 2025-08-27
alternative label: äänittäjä (henkilö)
alternative label: inspelningstekniker (person) @sv
broader: ääniteknikko
definition: Henkilö, joka on ääniteknikko, joka osallistuu ekspression äänisisällön tekemiseen valvomalla äänityksen teknistä toteutusta. (RDA Registry)
definition: Person som är en ljudtekniker, som deltar i utförandet av ljudinnehållet i ett uttryck, genom att övervaka det tekniska utförandet av en ljudinspelning. @sv
in scheme: Metatietosanasto
preferred label: recording engineer person @en
preferred label: inspelningstekniker @sv

elokuvatuottaja
type: Concept
source: RDA-termi
source: RDA-term @sv
created: 2024-12-18
modified: 2025-05-27
alternative label: elokuvatuottaja (yhteisö)
alternative label: filmproducent (institution) @sv
broader: tuottaja
definition: Yhteisö, joka on tuottaja, joka on vastuussa suurimmasta osasta elokuvan tuotannon liiketoiminnasta. (RDA Registry)
definition: Institution som är en producent, som svarar för största delen av affärsverksamheten kring en filmproduktion. @sv
in scheme: Metatietosanasto
preferred label: film producer corporate body @en
preferred label: filmproducent @sv

kuvaaja
type: Concept
source: RDA-termi
source: RDA-term @sv
created: 2024-12-18
modified: 2025-07-04
alternative label: kuvaaja (yhteisö)
alternative label: filmfotograf (institution) @sv
broader: teoksen tekijä
definition: Yhteisö, joka tallentaa kuvia joko sähköisesti tai filmille tai videolle ja usein valitsee ja järjestää valaistuksen. (RDA Registry)
definition: Institution som spelar in bilder antingen digitalt, på film eller på video, och ofta väljer och arrangerar belysningen. @sv
in scheme: Metatietosanasto
preferred label: director corporate body of photography @en
preferred label: filmfotograf @sv
scope note: Elokuvan kuvaajaa kutsutaan myös elokuvaajaksi. (RDA Registry)

painaja
type: Concept
source: RDA-termi
source: RDA-term @sv
created: 2024-12-18
modified: 2025-08-15
alternative label: painaja (henkilö)
alternative label: tryckare (person) @sv
broader: valmistaja
definition: Henkilö, joka on vastuussa painetun tekstin, nuottiaineiston tai muun sisällön manifestaation valmistamisesta painolaatalta tai -levyltä. (RDA Registry)
definition: Person som svarar för tillverkningen av tryckt text, notmaterial eller något annat innehålls manifestation, med tryckplåt eller dylikt. @sv
in scheme: Metatietosanasto
preferred label: printer person @en
preferred label: tryckare @sv
scope note: Sisältää kirjan, sanomalehden, aikakauslehden, julisteen tai partituurin valmistuksen. (RDA Registry)
scope note: Omfattar tillverkning av böcker, dagstidningar, tidskrifter, planscher eller partitur. @sv

elokuvantekijä
type: Concept
source: RDA-termi
source: RDA-term @sv
created: 2024-12-18
modified: 2025-05-27
alternative label: elokuvantekijä (henkilö)
alternative label: filmskapare (person) @sv
broader: teoksen tekijä
definition: Henkilö, joka on vastuussa riippumattoman tai henkilökohtaisen elokuvan luomisesta. (RDA Registry)
definition: Person som svarar för skapandet av en självständig eller personlig film. @sv
in scheme: Metatietosanasto
preferred label: filmmaker person @en
preferred label: filmskapare @sv
scope note: Tekijä vastaa itse kaikilta osin elokuvan ideoinnista ja toteuttamisesta. (RDA Registry)
scope note: Skaparen svarar själv till alla delar för idén till och förverkligandet av filmen. @sv

käsikirjoittaja
type: Concept
source: Kansallinen RDA-termi
source: Nationell RDA-term @sv
created: 2024-12-18
modified: 2025-07-04
alternative label: liikkuvaan kuvaan osallinen käsikirjoittaja (yhteisö)
alternative label: manusförfattare (institution) som är bidragsgivare till rörlig bild @sv
broader: liikkuvaan kuvaan osallinen yhteisö
definition: Aggregaattiin sisältyvän käsikirjoituksen tai kohtauksen kirjoittanut yhteisö.
definition: Institution som skrivit ett manus eller en scen som ingår i ett aggregat. @sv
in scheme: Metatietosanasto
preferred label: manusförfattare @sv

kommentaattori
type: Concept
source: RDA-termi
source: RDA-term @sv
created: 2024-12-18
modified: 2025-07-03
alternative label: kommentaattori (yhteisö)
alternative label: kommentator (institution) @sv
broader: esittäjä
definition: Yhteisö, joka on esittäjä, joka osallistuu ekspression tekemiseen tulkitsemalla tai analysoimalla äänitteen, elokuvan tai muun audiovisuaalisen aineiston aihetta tai keskustelemalla siitä. (RDA Registry)
definition: Institution som är en framförare som deltar i skapandet av ett uttryck, genom att tolka, analysera eller diskutera ett ämne i en ljudupptagning, en film eller annat audiovisuellt material. @sv
in scheme: Metatietosanasto
preferred label: commentator corporate body @en
preferred label: kommentator @sv

graafinen suunnittelija
type: Concept
source: RDA-termi
source: RDA-term @sv
created: 2024-12-18
modified: 2025-06-11
alternative label: graafinen suunnittelija (henkilö)
alternative label: bokformgivare @sv
alternative label: grafisk formgivare (person) @sv
broader: aineiston tekijä
definition: Henkilö, joka on vastuussa manifestaation valmistamisesta vastaamalla kirjan graafisesta suunnittelusta, taitosta, materiaalien valinnasta ja käytettävistä valmistusmenetelmistä. (RDA Registry)
definition: Person som svarar för tillverkningen av en manifestation, genom att ansvara för grafisk formgivning, layout, val av material och tillverkningsmetoder för en bok. @sv
in scheme: Metatietosanasto
preferred label: book designer person @en
preferred label: grafisk formgivare @sv

sarjakuvantekijä
type: Concept
source: Kansallinen RDA-termi
source: Nationell RDA-term @sv
created: 2024-12-18
modified: 2025-08-19
alternative label: tekstiin osallinen sarjakuvantekijä (henkilö)
alternative label: serieskapare (person) som är bidragsgivare till text @sv
broader: tekstiin osallinen henkilö
definition: Aggregaattiin sisältyvän sarjakuvan henkilötekijä.
definition: Upphovsperson för tecknad serie som ingår i ett aggregat. @sv
in scheme: Metatietosanasto
preferred label: serieskapare @sv

kollotypian valmistaja
type: Concept
source: RDA-termi
source: RDA-term @sv
created: 2024-12-18
modified: 2025-07-03
alternative label: collotypist person @en
alternative label: kollotypian valmistaja (henkilö)
alternative label: framställare av ljustryck (person) @sv
broader: painolaatan valmistaja
definition: Henkilö, joka on vastuussa manifestaation valmistamisesta tekemällä vedoksia suoraan kovettuneelta gelatiinifilmiltä tai muulta materiaalilta, jossa on mustetta imeviä ja hylkiviä pintoja. (RDA Registry)
definition: Person som svarar för tillverkning av en manifestation, genom att göra fotografiska avtryck direkt från härdad gelatinfilm eller annat material med bläckmottagande och bläckavvisande ytor. @sv
in scheme: Metatietosanasto
preferred label: collotyper person @en
preferred label: framställare av ljustryck @sv

ohjelmoija
type: Concept
source: RDA-termi
source: RDA-term @sv
created: 2024-12-18
modified: 2025-08-15
alternative label: ohjelmoija (yhteisö)
alternative label: programmerare (institution) @sv
broader: teoksen tekijä
definition: Yhteisö, joka on vastuussa tietokoneohjelman luomisesta. (RDA Registry)
definition: Institution som svarar för skapandet av ett datorprogram. @sv
in scheme: Metatietosanasto
preferred label: programmer corporate body @en
preferred label: programmerare @sv

opettaja
type: Concept
source: RDA-termi
source: RDA-term @sv
created: 2024-12-18
modified: 2025-08-15
alternative label: opettaja (yhteisö)
alternative label: lärare (institution) @sv
broader: esittäjä
definition: Yhteisö, joka on esittäjä, joka osallistuu ekspression tekemiseen opettamalla tai pitämällä havaintoesityksen. (RDA Registry)
definition: Institution som är en framförare, som deltar i utförandet av ett uttryck, genom att undervisa eller hålla en demonstration. @sv
in scheme: Metatietosanasto
preferred label: instructor corporate body @en
preferred label: lärare @sv

kapellimestari
type: Concept
source: RDA-termi
source: RDA-term @sv
created: 2024-12-18
modified: 2025-07-02
alternative label: kapellimestari (yhteisö)
alternative label: kapellmästare (institution) @sv
broader: johtaja
definition: Yhteisö, joka on johtaja, joka osallistuu ekspression tekemiseen johtamalla soitinryhmää musiikki- tai näytelmäesityksessä. (RDA Registry)
definition: Aktör som är en dirigent som deltar i utförandet av ett uttryck, genom att leda en instrumentgrupp i en musik- eller dramaföreställning. @sv
in scheme: Metatietosanasto
preferred label: instrumental conductor corporate body @en
preferred label: kapellmästare @sv

järjestäjä
type: Concept
source: RDA-termi
source: RDA-term @sv
created: 2024-12-18
modified: 2025-11-26
alternative label: järjestäjä (yhteisö)
alternative label: arrangör av evenemang @sv
alternative label: evenemangsarrangör (institution) @sv
alternative label: mötesarrangör @sv
broader: teoksen tekijä
definition: Yhteisö, joka järjestää konferenssin, näyttelyn tai muun tapahtuman, joka antaa alun teokselle. (RDA Registry)
definition: Institution som ordnar en konferens, en utställning eller något annat evenemang som ger upphov till ett verk. @sv
in scheme: Metatietosanasto
preferred label: organizer corporate body @en
preferred label: evenemangsarrangör @sv

opinnäytteen tarkastaja
type: Concept
source: Kansallinen RDA-termi
source: Nationell RDA-term @sv
created: 2024-12-18
modified: 2025-08-15
alternative label: tekstiin osallinen opinnäytteen tarkastaja (henkilö)
alternative label: granskare av lärdomsprov (person) som är bidragsgivare till text @sv
broader: tekstiin osallinen henkilö
definition: Aggregaattiin sisältyvän opinnäytteen tarkastajaryhmän henkilöjäsen.
definition: Personmedlem i granskningsgrupp för lärdomsprov som ingår i ett aggregat. @sv
in scheme: Metatietosanasto
preferred label: granskare av lärdomsprov @sv

miksaaja
type: Concept
source: RDA-termi
source: RDA-term @sv
created: 2024-12-18
modified: 2025-08-14
alternative label: miksaaja (yhteisö)
alternative label: mixer (institution) @sv
broader: ääniteknikko
definition: Yhteisö, joka osallistuu ekspression äänisisällön tekemiseen käsittelemällä, miksaamalla ja yhdistelemällä useampia äänitteen raitoja. (RDA Registry)
definition: Institution som deltar i skapandet av ett uttrycks ljudinnehåll, genom att behandla, mixa och kombinera flera spår i en ljudinspelning. @sv
in scheme: Metatietosanasto
preferred label: mixing engineer corporate body @en
preferred label: mixer @sv
scope note: Ei koske uudelleenmiksauksia, jotka olennaisesti muuttavat alkuperäisen teoksen luonnetta ja sisältöä, mikä johtaa uuteen teokseen. (RDA Registry)
scope note: Gäller inte remixer som väsentligen ändrar det ursprungliga verkets karaktär och innehåll, vilket leder till ett nytt verk. @sv

miksaaja
type: Concept
source: Kansallinen RDA-termi
source: Nationell RDA-term @sv
created: 2024-12-18
modified: 2025-08-14
alternative label: musiikkiin osallinen miksaaja (yhteisö)
alternative label: mixer (institution) som är bidragsgivare till musik @sv
broader: musiikkiin osallinen yhteisö
definition: Aggregaattiin sisältyvässä musiikissa ääniraitoja käsittelevä, miksaava tai yhdistelevä yhteisö.
definition: Institution som behandlar, mixar och kombinerar ljudspår i musik som ingår i ett aggregat. @sv
in scheme: Metatietosanasto
preferred label: mixer @sv

puvustaja
type: Concept
source: RDA-termi
source: RDA-term @sv
created: 2024-12-18
modified: 2025-08-16
alternative label: puvustaja (yhteisö)
alternative label: kostymör (institution) @sv
broader: esitykseen osallinen yhteisö
definition: Yhteisö, joka osallistuu ekspression tekemiseen suunnittelemalla elokuvatuotannon tai musiikki- tai näytelmäesityksen puvustuksen. (RDA Registry)
definition: Institution som deltar i utförandet av ett uttryck, genom att planera kostymdesignen i en filmproduktion eller ett musikaliskt eller sceniskt framförande. @sv
in scheme: Metatietosanasto
preferred label: costume designer corporate body @en
preferred label: kostymör @sv

musiikkiohjelmoija
type: Concept
source: Kansallinen RDA-termi
source: Nationell RDA-term @sv
created: 2024-12-18
modified: 2025-08-14
alternative label: musiikkiin osallinen musiikkiohjelmoija (yhteisö)
alternative label: musikprogrammerare (institution) som är bidragsgivare till musik @sv
broader: musiikkiin osallinen yhteisö
definition: Aggregaattiin sisältyvään musiikkiin sähköisillä äänilaitteilla tai tietokoneohjelmilla ääniä tekevä yhteisö.
definition: Institution som skapar ljud i musik som ingår i ett aggregat, med hjälp av elektriska ljudenheter eller datorprogram. @sv
in scheme: Metatietosanasto
preferred label: musikprogrammerare @sv

kokoelman luetteloija
type: Concept
source: RDA-termi
source: RDA-term @sv
created: 2024-12-18
modified: 2025-07-03
alternative label: cataloguer person @en
alternative label: kokoelman luetteloija (henkilö)
alternative label: luetteloija (henkilö)
alternative label: katalogisatör (person) @sv
alternative label: samlingsregistrator (person) @sv
broader: kokoaja
definition: Henkilö, joka vastaa analyyttisen luettelon luomisesta. (RDA Registry)
definition: Person som svarar för skapandet av en analytisk katalog. @sv
in scheme: Metatietosanasto
preferred label: collection registrar person @en
preferred label: samlingsregistrator @sv

tutkija
type: Concept
source: Kansallinen RDA-termi
source: Nationell RDA-term @sv
created: 2024-12-18
modified: 2025-08-23
alternative label: tekstiin osallinen tutkija (yhteisö)
alternative label: forskare (institution) som är bidragsgivare till text @sv
broader: tekstiin osallinen yhteisö
definition: Aggregaattiin sisältyvän tutkimuksen yhteisötekijä.
definition: Upphovsinstitution till forskning som ingår i ett aggregat. @sv
in scheme: Metatietosanasto
preferred label: forskare @sv

valaja
type: Concept
source: RDA-termi
source: RDA-term @sv
created: 2024-12-18
modified: 2025-08-23
alternative label: valaja (henkilö)
alternative label: gjutare (person) @sv
broader: aineiston tekijä
definition: Henkilö, joka on vastuussa manifestaation valmistamisesta muovaamalla sulatettua tai nestemäistä ainetta muotin avulla. (RDA Registry)
definition: Person som svarar för tillverkningen av en manifestation, genom att forma smält eller flytande ämne med hjälp av en form. @sv
in scheme: Metatietosanasto
preferred label: caster person @en
preferred label: gjutare @sv

myyjä
type: Concept
source: RDA-termi
source: RDA-term @sv
created: 2024-12-18
modified: 2025-08-15
alternative label: myyjä (henkilö)
alternative label: försäljare @sv
alternative label: säljare (person) @sv
broader: aiempi omistaja
definition: Kappaleen aiempi henkilöomistaja, joka myy kappaleen toiselle omistajalle. (RDA Registry)
definition: Tidigare personägare till ett exemplar, som säljer ett exemplar till en annan ägare. @sv
in scheme: Metatietosanasto
preferred label: seller person @en
preferred label: säljare @sv

musiikin äänittäjä
type: Concept
source: Kansallinen RDA-termi
source: Nationell RDA-term @sv
created: 2024-12-18
modified: 2025-08-14
alternative label: musiikkiin osallinen äänittäjä (yhteisö)
alternative label: inspelningstekniker (institution) som är bidragsgivare till musik @sv
alternative label: ljudtekniker för musik @sv
broader: musiikkiin osallinen yhteisö
definition: Aggregaattiin sisältyvän äänityksen teknistä toteutusta valvova yhteisö.
definition: Institution som övervakar det tekniska förverkligandet av en ljudinspelning som ingår i ett aggregat. @sv
in scheme: Metatietosanasto
preferred label: inspelningstekniker för musik @sv

pöytäkirjan laatija
type: Concept
source: RDA-termi
source: RDA-term @sv
created: 2024-12-18
modified: 2025-08-16
alternative label: pöytäkirjan laatija (henkilö)
alternative label: protokollförare (person) @sv
broader: yhdistymään osallinen henkilö
definition: Henkilö, joka vastaa kokouksen pöytäkirjan laatimisesta. (RDA Registry)
definition: Person som svarar för sammanställandet av ett protokoll för ett möte. @sv
in scheme: Metatietosanasto
preferred label: minute taker person @en
preferred label: protokollförare @sv

radiotuottaja
type: Concept
source: RDA-termi
source: RDA-term @sv
created: 2024-12-18
modified: 2025-08-19
alternative label: radiotuottaja (yhteisö)
alternative label: radioproducent (institution) @sv
broader: tuottaja
definition: Yhteisö, joka on tuottaja, joka on vastuussa suurimmasta osasta radio-ohjelman liiketoiminnasta. (RDA Registry)
definition: Institution som är en producent, som svarar för största delen av affärsverksamheten kring ett radioprogram. @sv
in scheme: Metatietosanasto
preferred label: radio producer corporate body @en
preferred label: radioproducent @sv

musiikillinen johtaja
type: Concept
source: RDA-termi
source: RDA-term @sv
created: 2024-12-18
modified: 2025-08-14
alternative label: musiikillinen johtaja (henkilö)
alternative label: musikalisk ledare (person) @sv
broader: esitykseen osallinen henkilö
definition: Henkilö, joka osallistuu ekspression tekemiseen koordinoimalla säveltäjien, äänileikkaajien ja äänimiksaajien toimintaa elokuvatuotannossa tai musiikki- tai näytelmäesityksessä. (RDA Registry)
definition: Person som deltar i utförandet av ett uttryck, genom att koordinera kompositörers, ljudklippares och ljudmixares verksamhet i en filmproduktion eller i ett musikaliskt eller sceniskt uppförande. @sv
in scheme: Metatietosanasto
preferred label: musical director person @en
preferred label: musikalisk ledare @sv

käsikirjoittaja
type: Concept
source: RDA-termi
source: RDA-term @sv
created: 2024-12-18
modified: 2025-07-04
alternative label: käsikirjoittaja (yhteisö)
alternative label: manusförfattare (institution) @sv
broader: kirjoittaja
definition: Yhteisö, joka on käsikirjoituksen tai kohtauksen kirjoittaja. (RDA Registry)
definition: Institution som skrivit ett manus eller en scen. @sv
in scheme: Metatietosanasto
preferred label: screenwriter corporate body @en
preferred label: manusförfattare @sv

libretisti
type: Concept
source: Kansallinen RDA-termi
source: Nationell RDA-term @sv
created: 2024-12-18
modified: 2025-07-05
alternative label: musiikkiin osallinen libretisti (henkilö)
alternative label: librettist (person) som är bidragsgivare till musik @sv
broader: musiikkiin osallinen henkilö
definition: Aggregaattiin liittyvän musiikin tai koreografian, kuten oopperan, baletin tai muun musiikillisen näyttämöteoksen tai oratorion sanat kirjoittanut henkilö.
definition: Person som skrivit texten till ett musikaliskt eller koreografiskt verk, såsom en opera, en balett eller något annat musikaliskt sceniskt verk eller oratorium, som relaterar till ett aggregat. @sv
in scheme: Metatietosanasto
preferred label: librettist @sv

kääntäjä
type: Concept
source: Kansallinen RDA-termi
source: Nationell RDA-term @sv
created: 2024-12-18
modified: 2025-07-04
alternative label: tekstiin osallinen kääntäjä (henkilö)
alternative label: översättare (person) som är bidragsgivare till text @sv
broader: tekstiin osallinen henkilö
definition: Aggregaattiin sisältyvää tekstiä alkuperäisestä sisällöstä poikkeavaan kieleen kääntänyt henkilö. Kääntäjä voi myös kääntää kielisisältöä saman kielen eri aikakausien muotojen välillä.
definition: Person som översatt en text som ingår i ett aggregat, till ett språk som avviker från det ursprungliga innehållet. En översättare kan också översätta språkligt innehåll mellan olika former av samma språk från olika tidsperioder. @sv
in scheme: Metatietosanasto
preferred label: översättare @sv

ohjelmoija
type: Concept
source: Kansallinen RDA-termi
source: Nationell RDA-term @sv
created: 2024-12-18
modified: 2025-08-15
alternative label: digitaaliseen sisältöön osallinen ohjelmoija (henkilö)
alternative label: programmerare (person) som är bidragsgivare till digitalt innehåll @sv
broader: digitaaliseen sisältöön osallinen henkilö
definition: Aggregaattiin sisältyvän digitaalisen sisällön henkilötekijä.
definition: Upphovsperson till digitalt innehåll som ingår i ett aggregat. @sv
in scheme: Metatietosanasto
preferred label: programmerare @sv

kapellimestari
type: Concept
source: RDA-termi
source: RDA-term @sv
created: 2024-12-18
modified: 2025-07-02
alternative label: kapellimestari (henkilö)
alternative label: kapellmästare (person) @sv
broader: johtaja
definition: Henkilö, joka on johtaja, joka osallistuu ekspression tekemiseen johtamalla soitinryhmää musiikki- tai näytelmäesityksessä. (RDA Registry)
definition: Person som är en dirigent som deltar i utförandet av ett uttryck, genom att leda en instrumentgrupp i en musik- eller dramaföreställning. @sv
in scheme: Metatietosanasto
preferred label: instrumental conductor person @en
preferred label: kapellmästare @sv

soittaja
type: Concept
source: RDA-termi
source: RDA-term @sv
created: 2024-12-18
modified: 2025-08-19
alternative label: soittaja (henkilö)
alternative label: instrumentalist (person) @sv
broader: esittäjä
definition: Henkilö, joka on esittäjä, joka osallistuu ekspression tekemiseen soittamalla soitinta. (RDA Registry)
definition: Person som är en framförare, som deltar i utförandet av ett uttryck genom att spela ett instrument. @sv
in scheme: Metatietosanasto
preferred label: instrumentalist person @en
preferred label: instrumentalist @sv

koreografi
type: Concept
source: RDA-termi
source: RDA-term @sv
created: 2024-12-18
modified: 2025-07-04
alternative label: koreografi (henkilö)
alternative label: koreograf (person) @sv
broader: teoksen tekijä
definition: Henkilö, joka on vastuussa koreografisen teoksen luomisesta. (RDA Registry)
definition: Person som svarar för skapandet av ett koreografiskt verk. @sv
in scheme: Metatietosanasto
preferred label: choreographer person @en
preferred label: koreograf @sv

leikkaaja
type: Concept
source: Kansallinen RDA-termi
source: Nationell RDA-term @sv
created: 2024-12-18
modified: 2025-07-04
alternative label: liikkuvaan kuvaan osallinen leikkaaja (henkilö)
alternative label: klippare (person) som är bidragsgivare till rörlig bild @sv
broader: liikkuvaan kuvaan osallinen henkilö
definition: Aggregaattiin sisältyvän filmin, videon tai muiden liikkuvan kuvan formaattien kokoamisesta, järjestämisestä ja leikkauksesta, sekä kuvan että äänen osalta, vastaava henkilö.
definition: Person som svarar för samling, ordnande och klippning av film, video eller andra format för rörlig bild som ingår i ett aggregat, både beträffande bild och ljud. @sv
in scheme: Metatietosanasto
preferred label: klippare @sv

tuomioistuimen kirjuri
type: Concept
source: Kansallinen RDA-termi
source: Nationell RDA-term @sv
created: 2024-12-18
modified: 2025-08-23
alternative label: tekstiin osallinen tuomioistuimen kirjuri (henkilö)
alternative label: domstolssekreterare (person) som är bidragsgivare till text @sv
broader: tekstiin osallinen henkilö
definition: Aggregaattiin sisältyvän tuomioistuimen lausunnon julkaistavaksi valmisteleva henkilö.
definition: Person som förbereder en domstols utlåtande, som ingår i ett aggregat, för publicering. @sv
in scheme: Metatietosanasto
preferred label: domstolssekreterare @sv

illuminoinnin tekijä
type: Concept
source: RDA-termi
source: RDA-term @sv
created: 2024-12-18
modified: 2025-06-14
alternative label: illuminoinnin tekijä (henkilö)
alternative label: illuminator (person) @sv
alternative label: illuminatör @sv
broader: muokkaaja
definition: Henkilö, joka koristelee yksittäisen kappaleen käyttäen jalometalleja tai värejä, usein yksityiskohtaisissa kuvioissa tai motiiveissa. (RDA Registry)
definition: Person som dekorerar ett enskilt exemplar genom att använda ädelmetaller eller färger, ofta i detaljerade mönster eller motiv. @sv
in scheme: Metatietosanasto
preferred label: illuminator person @en
preferred label: illuminator @sv

teoksen omistuksen tekijä
type: Concept
source: RDA-termi
source: RDA-term @sv
created: 2024-12-18
modified: 2026-06-06
alternative label: omistuksen tekijä (henkilö)
alternative label: dedikationsförfattare (person) @sv
broader: teoksen tekijä
definition: Henkilö, joka nimittää teoksen tunnustukseksi siihen liittyvän toimijan innoituksesta tai tuesta. (RDA Registry)
definition: Person som dedicerar ett verk till erkännande för en relaterad aktörs inspiration eller stöd. @sv
in scheme: Metatietosanasto
preferred label: dedicator person @en
preferred label: verkets dedikationsförfattare @sv

äänituottaja
type: Concept
source: RDA-termi
source: RDA-term @sv
created: 2024-12-18
modified: 2025-08-27
alternative label: äänituottaja (henkilö)
alternative label: ljudproducent (person) @sv
broader: tuottaja
definition: Henkilö, joka on tuottaja, joka on vastuussa useimpien äänitteen liiketoiminnallisten tehtävien hoitamisesta. (RDA Registry)
definition: Person som är en producent, som svarar för skötseln av de flesta kommersiella uppgifterna kring en ljudinspelning. @sv
in scheme: Metatietosanasto
preferred label: audio producer person @en
preferred label: ljudproducent @sv

elokuvaohjaaja
type: Concept
source: RDA-termi
source: RDA-term @sv
created: 2024-12-18
modified: 2025-05-27
alternative label: elokuvaohjaaja (yhteisö)
alternative label: filmregissör (institution) @sv
broader: ohjaaja
definition: Yhteisö, joka on ohjaaja, joka on vastuussa elokuvatun esityksen yleisestä johtamisesta ja valvonnasta. (RDA Registry)
definition: Institution som är en regissör, som svarar för allmän ledning och övervakning av en filmad föreställning. @sv
in scheme: Metatietosanasto
preferred label: film director corporate body @en
preferred label: filmregissör @sv

elokuvatuottaja
type: Concept
source: Kansallinen RDA-termi
source: Nationell RDA-term @sv
created: 2024-12-18
modified: 2025-05-27
alternative label: liikkuvaan kuvaan osallinen elokuvatuottaja (yhteisö)
alternative label: filmproducent (institution) som är bidragsgivare till rörlig bild @sv
broader: liikkuvaan kuvaan osallinen yhteisö
definition: Aggregaattiin sisältyvän elokuvan tuotannon liiketoiminnasta ensisijaisesti vastaava yhteisö.
definition: Institution som i första hand svarar för affärsverksamheten kring produktionen av en film som ingår i ett aggregat. @sv
in scheme: Metatietosanasto
preferred label: filmproducent @sv

liikkuvan kuvan esittäjä
type: Concept
source: Kansallinen RDA-termi
source: Nationell RDA-term @sv
created: 2024-12-18
modified: 2025-07-05
alternative label: liikkuvaan kuvaan osallinen esittäjä (yhteisö)
alternative label: framförande institution som är bidragsgivare till rörlig bild @sv
broader: liikkuvaan kuvaan osallinen yhteisö
definition: Aggregaattiin sisältyvässä liikkuvassa kuvassa esiintyvä yhteisö.
definition: Institution som deltar i rörlig bild som ingår i ett aggregat. @sv
in scheme: Metatietosanasto
preferred label: framförande institution i rörlig bild @sv

ohjelmistokehittäjä
type: Concept
source: RDA-termi
source: RDA-term @sv
created: 2024-12-18
modified: 2025-08-15
alternative label: ohjelmistokehittäjä (yhteisö)
alternative label: programutvecklare (institution) @sv
broader: yhdistymään osallinen yhteisö
definition: Yhteisö, joka osallistuu ekspression tekemiseen tutkimalla, suunnittelemalla, toteuttamalla tai testaamalla ohjelmistoa. (RDA Registry)
definition: Institution som deltar i skapandet av ett uttryck, genom att undersöka, planera, förverkliga eller testa en programvara. @sv
in scheme: Metatietosanasto
preferred label: software developer corporate body @en
preferred label: programutvecklare @sv

teoksella kunnioitettu yhteisö
type: Concept
source: RDA-termi
source: RDA-term @sv
created: 2024-12-18
modified: 2025-08-22
alternative label: honoree corporate body of work @en
alternative label: festskriftsföremål @sv
broader: teokseen liittyvä yhteisö
definition: Yhteisö, jonka kunniaksi teos on tehty. (RDA Registry)
definition: Institution till vilkens ära ett verk har gjorts. @sv
in scheme: Metatietosanasto
preferred label: honouree corporate body of work @en
preferred label: verk tillägnat institutionen @sv

kuvanveistäjä
type: Concept
source: RDA-termi
source: RDA-term @sv
created: 2024-12-18
modified: 2025-07-04
alternative label: kuvanveistäjä (henkilö)
alternative label: skulptör (person) @sv
broader: taiteilija
definition: Henkilö, joka on taiteilija, joka on vastuussa kolmiulotteisen teoksen luomisesta muovaamalla, veistämällä tai vastaavalla tekniikalla. (RDA Registry)
definition: Person som är en konstnär som svarar för skapandet av ett tredimensionellt verk, genom att modellera, skära eller använda någon liknande teknik. @sv
in scheme: Metatietosanasto
preferred label: sculptor person @en
preferred label: skulptör @sv

televisio-ohjelman musiikin säveltäjä
type: Concept
source: Kansallinen RDA-termi
source: Nationell RDA-term @sv
created: 2024-12-18
modified: 2025-08-22
alternative label: televisio-ohjelman musiikin säveltäjä (yhteisö)
alternative label: kompositör (institution) av musik till tv-program @sv
broader: säveltäjä
definition: A corporate body who is responsible for creating a television program music work that complements a musical work. @en
definition: Yhteisö, joka on vastuussa televisio-ohjelmaa täydentävän musiikin luomisesta.
definition: Institution som svarar för skapandet av musik som kompletterar ett tv-program. @sv
in scheme: Metatietosanasto
preferred label: composer corporate body of television program music work @en
preferred label: kompositör av musik till tv-program @sv

graafinen suunnittelija
type: Concept
source: RDA-termi
source: RDA-term @sv
created: 2024-12-18
modified: 2025-06-11
alternative label: graafinen suunnittelija (yhteisö)
alternative label: bokformgivare @sv
alternative label: grafisk formgivare (institution) @sv
broader: aineiston tekijä
definition: Yhteisö, joka on vastuussa manifestaation valmistamisesta vastaamalla kirjan graafisesta suunnittelusta, taitosta, materiaalien valinnasta ja käytettävistä valmistusmenetelmistä. (RDA Registry)
definition: Institution som svarar för tillverkningen av en manifestation, genom att ansvara för grafisk formgivning, layout, val av material och tillverkningsmetoder för en bok. @sv
in scheme: Metatietosanasto
preferred label: book designer corporate body @en
preferred label: grafisk formgivare @sv

henkilön sponsoroima yhteisö
type: Concept
source: RDA-termi
source: RDA-term @sv
created: 2024-12-18
modified: 2025-01-11
alternative label: sponsor of @en
alternative label: sponsorina yhteisölle
alternative label: sponsor för institutionen @sv
broader: henkilöön liittyvä yhteisö
definition: Henkilön sponsoroima yhteisö. (RDA Registry)
definition: Institution som en person sponsrat. @sv
in scheme: Metatietosanasto
preferred label: sponsored corporate body of person @en
preferred label: institution sponsrad av person @sv

teoksen haastateltava
type: Concept
source: RDA-termi
source: RDA-term @sv
created: 2024-12-18
modified: 2025-08-22
alternative label: teoksen haastateltava (yhteisö)
alternative label: intervjuobjekt (institution) i verk @sv
broader: teoksen tekijä
definition: Yhteisö, joka on vastuussa teoksen luomisesta vastaamalla haastattelijalle, tavallisesti toimittajalle, mielipidetutkijalle tai jonkinlaiselle muulle toimijalle, joka kerää tietoja. (RDA Registry)
definition: Institution som svarar för skapandet av ett verk genom att svara en intervjuare, vanligen en journalist, opinionsmätare eller någon annan aktör, som samlar information. @sv
in scheme: Metatietosanasto
preferred label: interviewee corporate body of work @en
preferred label: intervjuobjekt i verk @sv

kadenssin säveltäjä
type: Concept
source: Kansallinen RDA-termi
source: Nationell RDA-term @sv
created: 2024-12-18
modified: 2025-07-02
alternative label: kadenssin (teos) säveltäjä (henkilö)
alternative label: kompositör (person) av kadens (verk) @sv
broader: säveltäjä
definition: A person who is responsible for creating a cadenza work that augments a musical work. @en
definition: Henkilö, joka on vastuussa musiikkiteosta laajentavan kadenssin luomisesta.
definition: Person som svarar för skapandet av en kadens som utvidgar ett musikverk. @sv
in scheme: Metatietosanasto
preferred label: composer person of cadenza work @en
preferred label: kompositör av kadens @sv

raportoija
type: Concept
source: Kansallinen RDA-termi
source: Nationell RDA-term @sv
created: 2024-12-18
modified: 2025-08-14
alternative label: tekstiin osallinen raportoija (henkilö)
alternative label: rapportör (person) som är bidragsgivare till text @sv
broader: tekstiin osallinen henkilö
definition: Aggregaattiin liittyvissä teksteissä kokouksista raportoiva henkilö.
definition: Person som rapporterar om möten i texter som relaterar till ett aggregat. @sv
in scheme: Metatietosanasto
preferred label: rapportör @sv

visuaalisten tehosteiden tekijä
type: Concept
source: Kansallinen RDA-termi
source: Nationell RDA-term @sv
created: 2024-12-18
modified: 2025-08-23
alternative label: liikkuvaan kuvaan osallinen visuaalisten tehosteiden tekijä (henkilö)
alternative label: skapare (person) av visuella effekter som är bidragsgivare till rörlig bild @sv
broader: liikkuvaan kuvaan osallinen henkilö
definition: Aggregaattiin sisältyvän liikkuvan kuvan visuaaliset tehosteet jälkituotantovaiheessa suunnitteleva ja tekevä henkilö.
definition: Person som planerar och utför visuella effekter i postproduktionsfasen av rörlig bild som ingår i ett aggregat. @sv
in scheme: Metatietosanasto
preferred label: skapare av visuella effekter @sv

soittaja
type: Concept
source: Kansallinen RDA-termi
source: Nationell RDA-term @sv
created: 2024-12-18
modified: 2025-08-19
alternative label: musiikkiin osallinen soittaja (yhteisö)
alternative label: instrumentalist (institution) som är bidragsgivare till musik @sv
broader: musiikkiin osallinen yhteisö
definition: Aggregaattiin sisältyvässä musiikissa soitinta soittava yhteisö.
definition: Institution som spelar ett instrument i musik som ingår i ett aggregat. @sv
in scheme: Metatietosanasto
preferred label: instrumentalist @sv

elokuvantekijä
type: Concept
source: Kansallinen RDA-termi
source: Nationell RDA-term @sv
created: 2024-12-18
modified: 2025-05-27
alternative label: liikkuvaan kuvaan osallinen elokuvantekijä (yhteisö)
alternative label: filmskapare (institution) som är bidragsgivare till rörlig bild @sv
broader: liikkuvaan kuvaan osallinen yhteisö
definition: Aggregaattiin sisältyvän elokuvan tekijä, joka vastaa itse koko elokuvan ideoinnista ja toteutuksesta.
definition: Skapare av film som ingår i ett aggregat, som själv svarar för idén till och förverkligandet av hela filmen. @sv
in scheme: Metatietosanasto
preferred label: filmskapare @sv

kokoelman muodostaja
type: Concept
source: RDA-termi
source: RDA-term @sv
created: 2024-12-18
modified: 2025-07-03
alternative label: kokoelman muodostaja (henkilö)
alternative label: samlare (person) @sv
broader: teoksen tekijä
definition: Henkilö, joka vastaa kokoelmateoksen luomisesta valitsemalla ja järjestämällä kappaleita, jotka edustavat muiden teosten ilmentymää. (RDA Registry)
definition: Person som svarar för skapandet av ett samlingsverk, genom att välja och ordna exemplar som representerar uttryck för andra verk. @sv
in scheme: Metatietosanasto
preferred label: collector person @en
preferred label: samlare @sv

myyjä
type: Concept
source: RDA-termi
source: RDA-term @sv
created: 2024-12-18
modified: 2025-08-21
alternative label: myyjä (yhteisö)
alternative label: försäljare @sv
alternative label: säljare (institution) @sv
broader: aiempi omistaja
definition: Kappaleen aiempi omistajayhteisö, joka myy kappaleen toiselle omistajalle. (RDA Registry)
definition: Tidigare ägarinstitution till ett exemplar, som säljer ett exemplar till en annan ägare. @sv
in scheme: Metatietosanasto
preferred label: seller corporate body @en
preferred label: säljare @sv

puheen äänittäjä
type: Concept
source: Kansallinen RDA-termi
source: Nationell RDA-term @sv
created: 2024-12-18
modified: 2025-08-16
alternative label: puheeseen osallinen äänittäjä (henkilö)
alternative label: inspelningstekniker (person) som är bidragsgivare till tal @sv
alternative label: ljudtekniker för tal @sv
broader: puheeseen osallinen henkilö
definition: Aggregaattiin sisältyvän puhesisällön äänittämisen teknistä toteutusta valvova henkilö.
definition: Person som övervakar det tekniska förverkligandet av ljudinspelning av ett talinnehåll, som ingår i ett aggregat. @sv
in scheme: Metatietosanasto
preferred label: inspelningstekniker för tal @sv

säveltäjä
type: Concept
source: Kansallinen RDA-termi
source: Nationell RDA-term @sv
created: 2024-12-18
modified: 2025-05-29
alternative label: musiikkiin osallinen säveltäjä (yhteisö)
alternative label: kompositör (institution) som är bidragsgivare till musik @sv
alternative label: tonsättare @sv
broader: musiikkiin osallinen yhteisö
definition: Aggregaattiin sisältyvän musiikin säveltänyt yhteisö.
definition: Institution som komponerat musik som ingår i ett aggregat. @sv
in scheme: Metatietosanasto
preferred label: kompositör @sv

näyttelijä
type: Concept
source: Kansallinen RDA-termi
source: Nationell RDA-term @sv
created: 2024-12-18
modified: 2025-08-15
alternative label: liikkuvaan kuvaan osallinen näyttelijä (henkilö)
alternative label: skådespelare (person) som är bidragsgivare till rörlig bild @sv
broader: liikkuvaan kuvaan osallinen henkilö
definition: Aggregaattiin sisältyvässä musiikki- tai näytelmäesityksessä näyttelevä henkilö.
definition: Person som skådespelar i ett musikaliskt eller sceniskt uppförande som ingår i ett aggregat. @sv
in scheme: Metatietosanasto
preferred label: skådespelare @sv

ääninäyttelijä
type: Concept
source: Kansallinen RDA-termi
source: Nationell RDA-term @sv
created: 2024-12-18
modified: 2025-08-27
alternative label: liikkuvaan kuvaan osallinen ääninäyttelijä (henkilö)
alternative label: röstskådespelare (person) som är bidragsgivare till rörlig bild @sv
broader: liikkuvaan kuvaan osallinen henkilö
definition: Aggregaattiin sisältyvään dubbaukseen, mainokseen, äänituotantoon tai elokuvan animoidulle hahmolle tms. äänensä antava henkilö.
definition: Person som ger sin röst åt en karaktär i dubbning, reklam, ljudproduktion eller animerad film etc. som ingår i ett aggregat. @sv
in scheme: Metatietosanasto
preferred label: röstskådespelare @sv

yhteisöä sponsoroiva toimija
type: Concept
source: RDA-termi
source: RDA-term @sv
created: 2024-12-18
modified: 2025-08-27
broader: yhteisöön liittyvä toimija
definition: Toimija, joka sponsoroi yhteisöä. (RDA Registry)
definition: Aktör som sponsrar en institution. @sv
in scheme: Metatietosanasto
preferred label: sponsoring agent of corporate body @en
preferred label: aktör som sponsrar institution @sv

kirjataiteilija
type: Concept
source: Kansallinen RDA-termi
source: Nationell RDA-term @sv
created: 2024-12-18
modified: 2025-07-03
alternative label: esineeseen osallinen kirjataiteilja (yhteisö)
alternative label: bokkonstnär (institution) som är bidragsgivare till föremål @sv
broader: esineeseen osallinen yhteisö
definition: Aggregaattiin liittyvää kirjataidesisältöä kirjan muotoa hyödyntämällä tai sen fyysistä rakennetta muuttamalla luonut yhteisö.
definition: Institution som skapat bokkonstnärligt innehåll som relaterar till ett aggregat, genom att utnyttja bokens form eller ändra dess fysiska struktur. @sv
in scheme: Metatietosanasto
preferred label: bokkonstnär @sv

keksijä
type: Concept
source: Kansallinen RDA-termi
source: Nationell RDA-term @sv
created: 2024-12-18
modified: 2025-07-03
alternative label: esineeseen osallinen keksijä (yhteisö)
alternative label: uppfinnare (institution) som är bidragsgivare till föremål @sv
broader: esineeseen osallinen yhteisö
definition: Aggregaattiin liittyvän uuden välineen tai menetelmän luonut yhteisö.
definition: Institution som skapat ett nytt redskap eller en ny metod som ingår i ett aggregat. @sv
in scheme: Metatietosanasto
preferred label: uppfinnare @sv

suvun yhteisöjäsen
type: Concept
source: RDA-termi
source: RDA-term @sv
created: 2024-12-18
modified: 2025-03-19
broader: sukuun liittyvä yhteisö
definition: Yhteisö, joka on suvun jäsen. (RDA Registry)
definition: Institution som tillhör en släkt. @sv
in scheme: Metatietosanasto
preferred label: corporate body member of family @en
preferred label: institutionsmedlem i släkten @sv

esineeseen osallinen toimija
type: Concept
source: RDA-termi
source: RDA-term @sv
created: 2024-12-18
modified: 2025-06-04
broader: aggregaattiin osallinen toimija
definition: Aggregaattiin osallinen toimija, joka on luonut aggregaattiin sisältyvän esineteoksen ekspression. (RDA Registry)
definition: Aktör som bidragit till ett aggregat, som skapat ett uttryck av ett föremålsverk som ingår i ett aggregat. @sv
in scheme: Metatietosanasto
preferred label: contributor agent of object @en
preferred label: bidragsgivare (aktör) till föremål @sv

versioon liittyvä yhteisö
type: Concept
source: RDA-termi
source: RDA-term @sv
created: 2024-12-18
modified: 2025-08-23
alternative label: ekspressioon liittyvä yhteisö
alternative label: institution relaterad till uttrycket @sv
definition: Yhteisö, joka liittyy ekspressioon. (RDA Registry)
definition: Institution som relaterar till ett uttryck. @sv
in scheme: Metatietosanasto
narrower: teoksen version tekijä
preferred label: related corporate body of expression @en
preferred label: institution relaterad till versionen @sv

stillkuvan arkkitehti
type: Concept
source: Kansallinen RDA-termi
source: Nationell RDA-term @sv
created: 2024-12-18
modified: 2025-08-21
alternative label: stillkuvaan osallinen arkkitehti (yhteisö)
alternative label: arkitekt (institution) som är bidragsgivare till stillbild @sv
broader: stillkuvaan osallinen yhteisö
definition: Aggregaattiin sisältyvään arkkitehtonisen stillkuvan / piirustuksen yhteisötekijä.
definition: Upphovsinstitution till arkitektonisk stillbild/ritning som ingår i ett verk. @sv
in scheme: Metatietosanasto
preferred label: arkitekt för stillbild @sv

tuotantosuunnittelija
type: Concept
source: Kansallinen RDA-termi
source: Nationell RDA-term @sv
created: 2024-12-18
modified: 2025-08-14
alternative label: liikkuvaan kuvaan osallinen tuotantosuunnittelija (yhteisö)
alternative label: produktionsdesigner (institution) som är bidragsgivare till rörlig bild @sv
broader: liikkuvaan kuvaan osallinen yhteisö
definition: Aggregaattiin liittyvän elokuvatuotannon visuaalisen kokonaisilmeen suunnitellut yhteisö.
definition: Institution som planerat det visuella helhetsuttrycket i en filmproduktion som relaterar till ett aggregat. @sv
in scheme: Metatietosanasto
preferred label: produktionsdesigner @sv

stillkuvan värittäjä
type: Concept
source: Kansallinen RDA-termi
source: Nationell RDA-term @sv
created: 2024-12-18
modified: 2025-08-21
alternative label: stillkuvaan osallinen värittäjä (henkilö)
alternative label: färgläggare (person) som är bidragsgivare till stillbild @sv
broader: stillkuvaan osallinen henkilö
definition: Aggregaattiin sisältyvän stillkuvan värityksen henkilötekijä.
definition: Upphovsperson till färgläggning av stillbild som ingår i ett aggregat. @sv
in scheme: Metatietosanasto
preferred label: färgläggare av stillbild @sv

lahjoittaja
type: Concept
source: RDA-termi
source: RDA-term @sv
created: 2024-12-18
modified: 2025-07-04
alternative label: lahjoittaja (henkilö)
alternative label: donator (person) @sv
broader: aiempi omistaja
definition: Kappaleen aiempi henkilöomistaja, joka lahjoittaa sen toiselle omistajalle. (RDA Registry)
definition: Tidigare personägare till ett exemplar, som donerar det till en annan ägare. @sv
in scheme: Metatietosanasto
preferred label: donor person @en
preferred label: donator @sv

tarkistaja
type: Concept
source: Kansallinen RDA-termi
source: Nationell RDA-term @sv
created: 2024-12-18
modified: 2026-05-26
alternative label: tekstiin osallinen tarkistaja (yhteisö)
alternative label: granskare (institution) som är bidragsgivare till text @sv
broader: tekstiin osallinen yhteisö
definition: Aggregaatin sisältöön muutoksia ehdottanut tai tehnyt yhteisö.
definition: Institution som föreslagit eller gjort ändringar i ett aggregats innehåll. @sv
in scheme: Metatietosanasto
preferred label: granskare @sv

teoksen sponsori
type: Concept
source: RDA-termi
source: RDA-term @sv
created: 2024-12-18
modified: 2025-08-23
alternative label: teoksen sponsori (henkilö)
alternative label: sponsor (person) av verk @sv
broader: teokseen liittyvä henkilö
definition: Henkilö, joka sponsoroi teosta. (RDA Registry)
definition: Person som sponsrar ett verk. @sv
in scheme: Metatietosanasto
preferred label: sponsoring person of work @en
preferred label: sponsor av verk @sv
scope note: Kattaa tutkimuksen rahoituksen ja teoksen perustana olevan tapahtuman sponsoroinnin. (RDA Registry)
scope note: Täcker finansiering av forskning och sponsring av evenemang som är grund för ett verk. @sv

puheen puhuja
type: Concept
source: Kansallinen RDA-termi
source: Nationell RDA-term @sv
created: 2024-12-18
modified: 2025-08-16
alternative label: puheeseen osallinen puhuja (henkilö)
alternative label: talare (person) som är bidragsgivare till tal @sv
broader: puheeseen osallinen henkilö
definition: Aggregaattiin sisältyvän puheen pitävä henkilö.
definition: Person som håller ett tal som ingår i ett aggregat. @sv
in scheme: Metatietosanasto
preferred label: talare i tal @sv

tutkimuksen ohjaaja
type: Concept
source: RDA-termi
source: RDA-term @sv
created: 2024-12-18
modified: 2025-08-23
broader: akateeminen ohjaaja
definition: Henkilö, joka on akateeminen ohjaaja, joka on vastuussa teokseen johtavan tutkimuksen neuvonnasta tai ohjaamisesta. (RDA Registry)
definition: Person som är en akademisk handledare, som svarar för rådgivning eller handledning av forskning som leder till ett verk. @sv
in scheme: Metatietosanasto
preferred label: research supervisor @en
preferred label: forskningshandledare @sv

suvun edeltäjä
type: Concept
source: RDA-termi
source: RDA-term @sv
created: 2024-12-18
modified: 2025-08-21
broader: sukuun liittyvä suku
definition: Suku, joka edeltää toista sukua. (RDA Registry)
definition: Släkt som föregår en annan släkt. @sv
in scheme: Metatietosanasto
preferred label: predecessor of family @en
preferred label: föregående släkt @sv

musiikillinen johtaja
type: Concept
source: Kansallinen RDA-termi
source: Nationell RDA-term @sv
created: 2024-12-18
modified: 2025-08-14
alternative label: liikkuvaan kuvaan osallinen musiikkijohtaja (henkilö)
alternative label: musikalisk ledare (person) som är bidragsgivare till rörlig bild @sv
broader: liikkuvaan kuvaan osallinen henkilö
definition: Aggregaattiin sisältyvässä elokuvatuotannossa, musiikki- tai näytelmäesityksessä säveltäjien, äänileikkaajien ja äänimiksaajien toimintaa koordinoiva henkilö.
definition: Person som koordinerar kompositörers, ljudklippares och ljudmixares verksamhet i en filmproduktion eller i ett musikaliskt eller sceniskt uppförande som ingår i ett aggregat. @sv
in scheme: Metatietosanasto
preferred label: musikalisk ledare @sv

libretisti
type: Concept
source: Kansallinen RDA-termi
source: Nationell RDA-term @sv
created: 2024-12-18
modified: 2025-07-05
alternative label: musiikkiin osallinen libretisti (yhteisö)
alternative label: librettist (institution) som är bidragsgivare till musik {@sv} @sv
broader: musiikkiin osallinen yhteisö
definition: Aggregaattiin liittyvän musiikin tai koreografian, kuten oopperan, baletin tai muun musiikillisen näyttämöteoksen tai oratorion sanat kirjoittanut yhteisö.
definition: Institution som skrivit texten till ett musikaliskt eller koreografiskt verk, såsom en opera, en balett eller något annat musikaliskt sceniskt verk eller oratorium, som relaterar till ett aggregat. @sv
in scheme: Metatietosanasto
preferred label: librettist @sv

musiikillinen johtaja
type: Concept
source: Kansallinen RDA-termi
source: Nationell RDA-term @sv
created: 2024-12-18
modified: 2025-08-14
alternative label: liikkuvaan kuvaan osallinen musiikkijohtaja (yhteisö)
alternative label: musikalisk ledare (institution) som är bidragsgivare till rörlig bild @sv
broader: liikkuvaan kuvaan osallinen yhteisö
definition: Aggregaattiin sisältyvässä elokuvatuotannossa, musiikki- tai näytelmäesityksessä säveltäjien, äänileikkaajien ja äänimiksaajien toimintaa koordinoiva yhteisö.
definition: Institution som koordinerar kompositörers, ljudklippares och ljudmixares verksamhet i en filmproduktion eller i ett musikaliskt eller sceniskt uppförande som ingår i ett aggregat. @sv
in scheme: Metatietosanasto
preferred label: musikalisk ledare @sv

keksijä
type: Concept
source: RDA-termi
source: RDA-term @sv
created: 2024-12-18
modified: 2025-07-03
alternative label: keksijä (henkilö)
alternative label: uppfinnare (person) @sv
broader: teoksen tekijä
definition: Henkilö, joka on vastuussa uuden välineen tai menetelmän luomisesta. (RDA Registry)
definition: Person som svarar för skapandet av ett nytt redskap eller en ny metod. @sv
in scheme: Metatietosanasto
preferred label: inventor person @en
preferred label: uppfinnare @sv

kommentaattori
type: Concept
source: RDA-termi
source: RDA-term @sv
created: 2024-12-18
modified: 2025-07-03
alternative label: kommentaattori (henkilö)
alternative label: kommentator (person) @sv
broader: esittäjä
definition: Henkilö, joka on esittäjä, joka osallistuu ekspression tekemiseen tulkitsemalla tai analysoimalla äänitteen, elokuvan tai muun audiovisuaalisen aineiston aihetta tai keskustelemalla siitä. (RDA Registry)
definition: Person som är en framförare som deltar i skapandet av ett uttryck, genom att tolka, analysera eller diskutera ett ämne i en ljudupptagning, en film eller annat audiovisuellt material. @sv
in scheme: Metatietosanasto
preferred label: commentator person @en
preferred label: kommentator @sv

pistekirjoituksen tekijä
type: Concept
source: RDA-termi
source: RDA-term @sv
created: 2024-12-18
modified: 2025-08-16
alternative label: pistekirjoituksen tekijä (yhteisö)
alternative label: punktskriftspräglare (institution) @sv
broader: valmistaja
definition: Yhteisö, joka on vastuussa manifestaation valmistamisesta tuottamalla pistekirjoitusmerkkejä piirtimen, erityistulostimen tai muun laitteen avulla. (RDA Registry)
definition: Institution som svarar för tillverkningen av en manifestation, genom att producera punktskriftstecken med hjälp av en penna, en speciell präglingsskrivare eller någon annan apparat. @sv
in scheme: Metatietosanasto
preferred label: braille embosser corporate body @en
preferred label: punktskriftspräglare @sv

kaivertaja
type: Concept
source: RDA-termi
source: RDA-term @sv
created: 2024-12-18
modified: 2025-07-02
alternative label: kaivertaja (yhteisö)
alternative label: gravör (institution) @sv
broader: kuvalaatan valmistaja
definition: Yhteisö, joka on vastuussa manifestaation valmistamisesata kaivertamalla kirjaimia, kuvioita tai muita merkkejä painamisessa käytettävälle pinnalle, kuten puu- tai metallipinnalle. (RDA Registry)
definition: Institution som svarar för tillverkningen av en manifestation, genom att gravera bokstäver, mönster eller andra tecken på en yta som används vid tryck, såsom en trä- eller metallyta. @sv
in scheme: Metatietosanasto
preferred label: engraver corporate body @en
preferred label: gravör @sv

pistekirjoituksen tekijä
type: Concept
source: RDA-termi
source: RDA-term @sv
created: 2024-12-18
modified: 2025-08-16
alternative label: pistekirjoituksen tekijä (henkilö)
alternative label: punktskriftspräglare (person) @sv
broader: valmistaja
definition: Henkilö, joka on vastuussa manifestaation valmistamisesta tuottamalla pistekirjoitusmerkkejä piirtimen, erityistulostimen tai muun laitteen avulla. (RDA Registry)
definition: Person som svarar för tillverkningen av en manifestation, genom att producera punktskriftstecken med hjälp av en penna, en speciell präglingsskrivare eller någon annan apparat. @sv
in scheme: Metatietosanasto
preferred label: braille embosser person @en
preferred label: punktskriftspräglare @sv

sensori
type: Concept
source: RDA-termi
source: RDA-term @sv
created: 2024-12-18
modified: 2025-08-19
alternative label: sensori (yhteisö)
alternative label: censor (institution) @sv
broader: tarkistaja
definition: Yhteisö, joka osallistuu ekspression tekemiseen tarkastamalla toisen ekspression sisältöä kiistanalaisen sisällön salaamiseksi moraalisin, poliittisin, sotilaallisin tai muin perustein, mutta jättäen alkuperäisen teoksen luonteen ja yleisen sisällön olennaisilta osiltaan muuttumattomaksi. (RDA Registry)
definition: Institution som deltar i utförandet av ett uttryck, genom att granska innehållet i ett annat uttryck för att dölja kontroversiellt innehåll på moraliska, politiska, militära eller andra grunder, men ändå låta det ursprungliga verkets karaktär och allmänna innehåll till sina väsentliga delar förbli oförändrat. @sv
in scheme: Metatietosanasto
preferred label: censor corporate body @en
preferred label: censor @sv
scope note: Ei koske laajaa muokkausta, joka johtaa uuden teoksen luomiseen. (RDA Registry)
scope note: Gäller inte omfattande redigering, som leder till skapandet av ett nytt verk. @sv

ääninäyttelijä
type: Concept
source: Kansallinen RDA-termi
source: Nationell RDA-term @sv
created: 2024-12-18
modified: 2025-08-27
alternative label: liikkuvaan kuvaan osallinen ääninäyttelijä (yhteisö)
alternative label: röstskådespelare (institution) som är bidragsgivare till rörlig bild @sv
broader: liikkuvaan kuvaan osallinen yhteisö
definition: Aggregaattiin sisältyvään dubbaukseen, mainokseen, äänituotantoon tai elokuvan animoidulle hahmolle tms. äänensä antava yhteisö.
definition: Institution som ger sin röst åt en karaktär i dubbning, reklam, ljudproduktion eller animerad film etc. som ingår i ett aggregat. @sv
in scheme: Metatietosanasto
preferred label: röstskådespelare @sv

versioon liittyvä henkilö
type: Concept
source: RDA-termi
source: RDA-term @sv
created: 2024-12-18
modified: 2025-08-23
alternative label: ekspressioon liittyvä henkilö
alternative label: person relaterad till uttrycket @sv
definition: Henkilö, joka liittyy ekspressioon. (RDA Registry)
definition: Person som relaterar till ett uttryck. @sv
in scheme: Metatietosanasto
narrower: teoksen version tekijä
preferred label: related person of expression @en
preferred label: person relaterad till versionen @sv

dubbausohjaaja
type: Concept
source: RDA-termi
source: RDA-term @sv
created: 2024-12-18
modified: 2025-05-27
alternative label: dubbausohjaaja (yhteisö)
alternative label: dubbningsregissör (institution) @sv
broader: esitykseen osallinen yhteisö
definition: Yhteisö, joka vastaa uuden dialogin tai muiden äänien lisäämisprosessin yleisestä johtamisesta ja valvonnasta ekspression ääniraidan täydentämiseksi. (RDA Registry)
definition: Institution som svarar för allmän ledning och övervakning av tillägget av ny dialog eller andra röster, för att komplettera ett uttrycks ljudspår. @sv
in scheme: Metatietosanasto
preferred label: dubbing director corporate body @en
preferred label: dubbningsregissör @sv

teoksen haastateltava
type: Concept
source: RDA-termi
source: RDA-term @sv
created: 2024-12-18
modified: 2025-08-22
alternative label: teoksen haastateltava (henkilö)
alternative label: intervjuobjekt (person) i verk @sv
broader: teoksen tekijä
definition: Henkilö, joka on vastuussa teoksen luomisesta vastaamalla haastattelijalle, tavallisesti toimittajalle, mielipidetutkijalle tai jonkinlaiselle muulle toimijalle, joka kerää tietoja. (RDA Registry)
definition: Person som svarar för skapandet av ett verk, genom att svara en intervjuare, vanligen en journalist, opinionsmätare eller någon annan aktör, som samlar information. @sv
in scheme: Metatietosanasto
preferred label: interviewee person of work @en
preferred label: intervjuobjekt i verk @sv

piirtäjä
type: Concept
source: Kansallinen RDA-termi
source: Nationell RDA-term @sv
created: 2024-12-18
modified: 2025-08-16
alternative label: esineeseen osallinen piirtäjä (yhteisö)
alternative label: ritare (institution) som är bidragsgivare till föremål @sv
broader: esineeseen osallinen yhteisö
definition: Aggregaattiin sisältyviä tarkkoja suunnitelmia tai piirroksia rakennuksista, laivoista, lentokoneista, laitteista, esineistä laatinut yhteisö.
definition: Institution som utarbetat precisa planer eller ritningar av byggnader, fartyg, flygplan, apparater eller föremål, som ingår i ett aggregat. @sv
in scheme: Metatietosanasto
preferred label: ritare @sv

tuomioistuimen kirjuri
type: Concept
source: RDA-termi
source: RDA-term @sv
created: 2024-12-18
modified: 2025-08-23
alternative label: tuomioistuimen kirjuri (yhteisö)
alternative label: domstolssekreterare (institution) @sv
broader: yhdistymään osallinen yhteisö
definition: Yhteisö, joka osallistuu teoksen ekspression tekemiseen valmistelemalla tuomioistuimen lausunnon julkaistavaksi. (RDA Registry)
definition: Institution som deltar i utförandet av ett verks uttryck, genom att förbereda en domstols utlåtande för publicering. @sv
in scheme: Metatietosanasto
preferred label: court reporter corporate body @en
preferred label: domstolssekreterare @sv

valosuunnittelija
type: Concept
source: Kansallinen RDA-termi
source: Nationell RDA-term @sv
created: 2024-12-18
modified: 2025-08-23
alternative label: liikkuvaan kuvaan osallinen valosuunnittelija (yhteisö)
alternative label: ljusdesigner (institution) som är bidragsgivare till rörlig bild @sv
alternative label: ljussättare @sv
broader: liikkuvaan kuvaan osallinen yhteisö
definition: Aggregaattiin sisältyviä valokomponentteja suunnitteleva ja tekevä yhteisö.
definition: Institution som planerar och skapar ljuskomponenter, som ingår i ett aggregat. @sv
in scheme: Metatietosanasto
preferred label: ljusdesigner @sv

tekstaaja
type: Concept
source: RDA-termi
source: RDA-term @sv
created: 2024-12-18
modified: 2025-08-22
alternative label: tekstaaja (henkilö)
alternative label: textare (person) @sv
broader: yhdistymään osallinen henkilö
definition: Henkilö, joka osallistuu sarjakuvan, sarjakuvaromaanin tms. ekspression tekemiseen piirtämällä tekstin ja graafiset äänitehosteet. (RDA Registry)
definition: Person som deltar i utförandet av ett uttryck av en tecknad serie, grafisk roman eller dylikt, genom att rita texten och grafiska ljudeffekter. @sv
in scheme: Metatietosanasto
preferred label: letterer person @en
preferred label: textare @sv

maisema-arkkitehti
type: Concept
source: RDA-termi
source: RDA-term @sv
created: 2024-12-18
modified: 2025-08-14
alternative label: maisema-arkkitehti (yhteisö)
alternative label: landskapsarkitekt (institution) @sv
broader: arkkitehti
definition: Yhteisö, joka on arkkitehti, joka on vastuussa maisemateosten luomisesta. (RDA Registry)
definition: Institution som är en arkitekt och svarar för skapandet av landskapsverk. @sv
in scheme: Metatietosanasto
preferred label: landscape architect corporate body @en
preferred label: landskapsarkitekt @sv

animaattori
type: Concept
source: Kansallinen RDA-termi
source: Nationell RDA-term @sv
created: 2024-12-18
modified: 2025-04-16
alternative label: liikkuvaan kuvaan osallinen animaattori (henkilö)
alternative label: animatör (person) som är bidragsgivare till rörlig bild @sv
broader: liikkuvaan kuvaan osallinen henkilö
definition: Aggregaattiin sisältyvän animaation tekijä eli näennäistä liikettä esineisiin tai piirroksiin tuottava henkilö.
definition: Skapare av animation, det vill säga person som ger skenbar rörelse åt föremål eller teckningar, som ingår i aggregat. @sv
in scheme: Metatietosanasto
preferred label: animatör @sv

puheen äänisuunnittelja
type: Concept
source: Kansallinen RDA-termi
source: Nationell RDA-term @sv
created: 2024-12-18
modified: 2025-08-16
alternative label: puheeseen osallinen äänisuunnittelija (yhteisö)
alternative label: ljuddesigner (institution) som är bidragsgivare till tal @sv
broader: puheeseen osallinen yhteisö
definition: Aggregaattiin sisältyvän puhesisällön äänikomponentteja suunnitteleva ja tekevä yhteisö.
definition: Institution som planerar och gör ljudkomponenter i ett talinnehåll som ingår i ett aggregat. @sv
in scheme: Metatietosanasto
preferred label: ljuddesigner för tal @sv

taltioija
type: Concept
source: RDA-termi
source: RDA-term @sv
created: 2024-12-18
modified: 2025-08-21
alternative label: taltioija (yhteisö)
alternative label: inspelande aktör (institution) @sv
broader: esitykseen osallinen yhteisö
definition: Yhteisö, joka osallistuu ekspression tekemiseen käyttämällä tallennuslaitetta äänen tai videon taltioimiseen tallennustilanteessa. (RDA Registry)
definition: Institution som deltar i utförandet av ett uttryck, genom att använda en inspelningsapparat för att lagra ljud eller video vid ett inspelningstillfälle. @sv
in scheme: Metatietosanasto
preferred label: recordist corporate body @en
preferred label: inspelande institution @sv
scope note: Sisältää luonnonäänten, musiikkiesitysten ja muiden tapahtumien kenttä-äänitykset. (RDA Registry)
scope note: Inbegriper fältinspelningar av naturljud, musikframföranden och andra evenemang. @sv

kommentaattori
type: Concept
source: RDA-termi
source: RDA-term @sv
created: 2016-01-08
modified: 2025-07-03
alternative label: commentator @en
alternative label: kommentaattori (toimija)
broader: esittäjä
definition: Toimija, joka on esittäjä, joka osallistuu ekspression tekemiseen tulkitsemalla tai analysoimalla äänitteen, elokuvan tai muun audiovisuaalisen aineiston aihetta tai keskustelemalla siitä. (RDA Registry)
definition: Aktör som är en framförare som deltar i skapandet av ett uttryck, genom att tolka, analysera eller diskutera ett ämne i en ljudupptagning, en film eller annat audiovisuellt material. @sv
in scheme: Metatietosanasto
preferred label: commentator agent @en
preferred label: kommentator @sv

maskeeraaja
type: Concept
source: RDA-termi
source: RDA-term @sv
created: 2024-12-18
modified: 2025-08-14
alternative label: maskeeraaja (henkilö)
alternative label: maskör (person) @sv
broader: esitykseen osallinen henkilö
definition: Henkilö, joka osallistuu ekspression tekemiseen vastaamalla elokuvan, musikaalin tai näyttämöteoksen maskeerauksesta. (RDA Registry)
definition: Person som deltar i utförandet av ett uttryck, genom att svara för maskering i en film, en musikal eller ett sceniskt verk. @sv
in scheme: Metatietosanasto
preferred label: makeup artist person @en
preferred label: maskör @sv

liikkuvan kuvan värittäjä
type: Concept
source: Kansallinen RDA-termi
source: Nationell RDA-term @sv
created: 2024-12-18
modified: 2025-07-05
alternative label: liikkuvaan kuvaan osallinen värittäjä (henkilö)
alternative label: färgläggare (person) som är bidragsgivare till rörlig bild @sv
broader: liikkuvaan kuvaan osallinen henkilö
definition: Aggregaattiin sisältyvän liikkuvan kuvan värityksen henkilötekijä.
definition: Person som färglagt rörlig bild som ingår i ett aggregat. @sv
in scheme: Metatietosanasto
preferred label: färgläggare av rörlig bild @sv

opettaja
type: Concept
source: Kansallinen RDA-termi
source: Nationell RDA-term @sv
created: 2024-12-18
modified: 2025-08-15
alternative label: liikkuvaan kuvaan osallinen opettaja (henkilö)
alternative label: lärare (person) som är bidragsgivare till rörlig bild @sv
broader: liikkuvaan kuvaan osallinen henkilö
definition: Aggregaattiin sisältyvässä AV-aineistossa opettava tai asiaa esittelevä henkilö.
definition: Person som undervisar eller förevisar en sak i AV-material som ingår i ett aggregat. @sv
in scheme: Metatietosanasto
preferred label: lärare @sv

elokuvantekijä
type: Concept
source: RDA-termi
source: RDA-term @sv
created: 2024-12-18
modified: 2025-05-27
alternative label: elokuvantekijä (yhteisö)
alternative label: filmskapare (institution) @sv
broader: teoksen tekijä
definition: Yhteisö, joka on vastuussa riippumattoman tai henkilökohtaisen elokuvan luomisesta. (RDA Registry)
definition: Institution som svarar för skapandet av en självständig eller personlig film. @sv
in scheme: Metatietosanasto
preferred label: filmmaker corporate body @en
preferred label: filmskapare @sv
scope note: Tekijä vastaa itse kaikilta osin elokuvan ideoinnista ja toteuttamisesta. (RDA Registry)
scope note: Skaparen svarar själv till alla delar för idén till och förverkligandet av filmen. @sv

pöytäkirjan laatija
type: Concept
source: Kansallinen RDA-termi
source: Nationell RDA-term @sv
created: 2024-12-18
modified: 2025-08-16
alternative label: tekstiin osallinen pöytäkirjan laatija (henkilö)
alternative label: protokollförare (person) som är bidragsgivare till text @sv
broader: tekstiin osallinen henkilö
definition: Aggregaattiin sisältyvän kokouspöytäkirjan laatinut henkilö.
definition: Person som sammanställt ett mötesprotokoll som ingår i ett aggregat. @sv
in scheme: Metatietosanasto
preferred label: protokollförare @sv

dubbausohjaaja
type: Concept
source: RDA-termi
source: RDA-term @sv
created: 2024-12-18
modified: 2025-05-27
alternative label: dubbausohjaaja (henkilö)
alternative label: dubbningsregissör (person) @sv
broader: esitykseen osallinen henkilö
definition: Henkilö, joka vastaa uuden dialogin tai muiden äänien lisäämisprosessin yleisestä johtamisesta ja valvonnasta ekspression ääniraidan täydentämiseksi. (RDA Registry)
definition: Person som svarar för allmän ledning och övervakning av tillägget av ny dialog eller andra röster, för att komplettera ett uttrycks ljudspår. @sv
in scheme: Metatietosanasto
preferred label: dubbing director person @en
preferred label: dubbningsregissör @sv

säveltäjä
type: Concept
source: Kansallinen RDA-termi
source: Nationell RDA-term @sv
created: 2024-12-18
modified: 2025-05-29
alternative label: musiikkiin osallinen säveltäjä (henkilö)
alternative label: kompositör (person) som är bidragsgivare till musik @sv
alternative label: tonsättare @sv
broader: musiikkiin osallinen henkilö
definition: Aggregaattiin sisältyvän musiikin säveltänyt henkilö.
definition: Person som komponerat musik som ingår i ett aggregat. @sv
in scheme: Metatietosanasto
preferred label: kompositör @sv

puheen äänittäjä
type: Concept
source: Kansallinen RDA-termi
source: Nationell RDA-term @sv
created: 2024-12-18
modified: 2025-08-16
alternative label: puheeseen osallinen äänittäjä (yhteisö)
alternative label: inspelningstekniker (institution) som är bidragsgivare till tal @sv
alternative label: ljudtekniker för tal @sv
broader: puheeseen osallinen yhteisö
definition: Aggregaattiin sisältyvän puhesisällön äänittämisen teknistä toteutusta valvova yhteisö.
definition: Institution som övervakar det tekniska förverkligandet av ljudinspelning av ett talinnehåll, som ingår i ett aggregat. @sv
in scheme: Metatietosanasto
preferred label: inspelningstekniker för tal @sv

juontaja
type: Concept
source: Kansallinen RDA-termi
source: Nationell RDA-term @sv
created: 2024-12-18
modified: 2025-07-01
alternative label: liikkuvaan kuvaan osallinen juontaja (henkilö)
alternative label: programledare (person) som är bidragsgivare till rörlig bild @sv
broader: liikkuvaan kuvaan osallinen henkilö
definition: Aggregaattiin sisältyvää ohjelmaa juontava henkilö.
definition: Person som leder ett program som ingår i ett aggregat. @sv
in scheme: Metatietosanasto
preferred label: programledare @sv

käsikirjoittaja
type: Concept
source: RDA-termi
source: RDA-term @sv
created: 2024-12-18
modified: 2025-07-04
alternative label: käsikirjoittaja (henkilö)
alternative label: manusförfattare (person) @sv
broader: kirjoittaja
definition: Henkilö, joka on käsikirjoituksen tai kohtauksen kirjoittaja. (RDA Registry)
definition: Person som skrivit ett manus eller en scen. @sv
in scheme: Metatietosanasto
preferred label: screenwriter person @en
preferred label: manusförfattare @sv

sanoittaja
type: Concept
source: Kansallinen RDA-termi
source: Nationell RDA-term @sv
created: 2024-12-18
modified: 2025-08-19
alternative label: musiikkiin osallinen sanoittaja (henkilö)
alternative label: författare till sångtext @sv
alternative label: sångtextförfattare (person) som är bidragsgivare till musik @sv
broader: musiikkiin osallinen henkilö
definition: Aggregaattiin sisältyvään populaarimusiikkiin kuuluvan laulun, mukaan lukien musikaalilaulun, sanat kirjoittanut henkilö.
definition: Person som är författare till ord i en sång, även en musikalsång, som hör till populärmusik som ingår i ett aggregat. @sv
in scheme: Metatietosanasto
preferred label: sångtextförfattare @sv

sensori
type: Concept
source: Kansallinen RDA-termi
source: Nationell RDA-term @sv
created: 2024-12-18
modified: 2025-08-19
alternative label: tekstiin osallinen sensori (henkilö)
alternative label: censor (person) som är bidragsgivare till text @sv
broader: tekstiin osallinen henkilö
definition: Aggregaattiin sisältyvää tekstiä kiistanalaisen sisällön salaamiseksi moraalisin, poliittisin, sotilaallisin tai muin perustein tarkastanut henkilö. Sensori tarkastaa sisältöä kiistanalaisen sisällön salaamiseksi moraalisin, poliittisin, sotilaallisin tai muin perustein. Alkuperäisen teoksen luonteen ja yleisen sisällön sensori jättää olennaisilta osiltaan muuttumattomaksi.
definition: Person som granskat text som ingår i ett aggregat, för att dölja kontroversiellt innehåll på moraliska, politiska, militära eller andra grunder. Censorn lämnar det ursprungliga verkets karaktär och allmänna innehåll till sina väsentliga delar oförändrat. @sv
in scheme: Metatietosanasto
preferred label: censor @sv

äänittäjä
type: Concept
source: RDA-termi
source: RDA-term @sv
created: 2024-12-18
modified: 2025-08-27
alternative label: äänittäjä (yhteisö)
alternative label: inspelningstekniker (institution) @sv
broader: ääniteknikko
definition: Yhteisö, joka on ääniteknikko, joka osallistuu ekspression äänisisällön tekemiseen valvomalla äänityksen teknistä toteutusta. (RDA Registry)
definition: Institution som är en ljudtekniker, som deltar i utförandet av ljudinnehållet i ett uttryck, genom att övervaka det tekniska utförandet av en ljudinspelning. @sv
in scheme: Metatietosanasto
preferred label: recording engineer corporate body @en
preferred label: inspelningstekniker @sv

liikkuvan kuvan äänisuunnittelija
type: Concept
source: Kansallinen RDA-termi
source: Nationell RDA-term @sv
created: 2024-12-18
modified: 2025-07-05
alternative label: liikkuvaan kuvaan osallinen äänisuunnittelija (yhteisö)
alternative label: ljuddesigner (institution) som är bidragsgivare till rörlig bild @sv
broader: liikkuvaan kuvaan osallinen yhteisö
definition: Aggregaattiin sisältyvän liikkuvan kuvan ääniä suunnitteleva ja tekevä yhteisö.
definition: Institution som planerat och utfört ljud i rörlig bild som ingår i ett aggregat. @sv
in scheme: Metatietosanasto
preferred label: ljuddesigner för rörlig bild @sv

liikkuvan kuvan tanssija
type: Concept
source: Kansallinen RDA-termi
source: Nationell RDA-term @sv
created: 2024-12-18
modified: 2025-07-05
alternative label: liikkuvaan kuvaan osallinen tanssija (yhteisö)
alternative label: dansare (institution) som är bidragsgivare till rörlig bild @sv
broader: liikkuvaan kuvaan osallinen yhteisö
definition: Yhteisö, joka tanssii aggregaattiin sisältyvässä liikkuvassa kuvassa.
definition: Institution som dansar i rörlig bild som ingår i ett aggregat. @sv
in scheme: Metatietosanasto
preferred label: dansare i rörlig bild @sv

panelisti
type: Concept
source: Kansallinen RDA-termi
source: Nationell RDA-term @sv
created: 2024-12-18
modified: 2025-08-16
alternative label: liikkuvaan kuvaan osallinen panelisti (yhteisö)
alternative label: deltagare (institution) i paneldiskussion som är bidragsgivare till rörlig bild @sv
alternative label: paneldeltagare @sv
broader: liikkuvaan kuvaan osallinen yhteisö
definition: Aggregaattiin sisältyvään keskusteluohjelmaan osallistuva yhteisö. Paneelikeskusteluissa käsitellään eri aiheita usein niitä tuntevien asiantuntijoiden kesken.
definition: Institution som deltar i ett diskussionsprogram som ingår i ett aggregat. I paneldiskussioner behandlas olika ämnen, ofta mellan experter i ämnena. @sv
in scheme: Metatietosanasto
preferred label: deltagare i paneldiskussion @sv

suvun seuraaja
type: Concept
source: RDA-termi
source: RDA-term @sv
created: 2024-12-18
modified: 2025-08-21
broader: sukuun liittyvä suku
definition: Suku, joka jatkaa tai seuraa toista sukua. (RDA Registry)
definition: Släkt som fortsätter eller följer på en annan släkt. @sv
in scheme: Metatietosanasto
preferred label: successor of family @en
preferred label: efterföljande släkt @sv

tallettaja
type: Concept
source: RDA-termi
source: RDA-term @sv
created: 2024-12-18
modified: 2025-08-21
alternative label: tallettaja (henkilö)
alternative label: deponent @sv
alternative label: deponerat av (person) @sv
broader: nykyinen omistaja
definition: Kappaleen nykyinen henkilöomistaja, joka tallettaa kappaleen toisen toimijan huostaan omistajuudesta luopumatta. (RDA Registry)
definition: Nuvarande ägarperson till ett exemplar, som förvarar exemplaret hos en annan aktör, utan att överlåta ägarskapet. @sv
in scheme: Metatietosanasto
preferred label: depositor person @en
preferred label: deponerat av @sv

johtaja
type: Concept
source: Kansallinen RDA-termi
source: Nationell RDA-term @sv
created: 2024-12-18
modified: 2025-07-01
alternative label: musiikkiin osallinen johtaja (henkilö)
alternative label: dirigent (person) som är bidragsgivare till musik @sv
broader: musiikkiin osallinen henkilö
definition: Aggregaattiin sisältyvän musiikkiesityksen tai näytelmän esiintyjäryhmää johtava henkilö.
definition: Person som dirigerar en uppträdande grupp i en musikföreställning eller ett skådespel. @sv
in scheme: Metatietosanasto
preferred label: dirigent @sv

etsaaja
type: Concept
source: RDA-termi
source: RDA-term @sv
created: 2024-12-18
modified: 2025-06-11
alternative label: etsaaja (yhteisö)
alternative label: etsare (institution) @sv
broader: kuvalaatan valmistaja
definition: Yhteisö, joka on vastuussa manifestaation valmistamisesta etsaamalla metallia, lasia tai muuta pintaa hapon tai muun syövyttävän aineen avulla. (RDA Registry)
definition: Institution som svarar för tillverkningen av en manifestation genom att etsa metall, glas eller någon annan yta med hjälp av syra eller något annat frätande ämne. @sv
in scheme: Metatietosanasto
preferred label: etcher corporate body @en
preferred label: etsare @sv

visuaalisten tehosteiden tekijä
type: Concept
source: RDA-termi
source: RDA-term @sv
created: 2024-12-18
modified: 2025-08-23
alternative label: visuaalisten tehosteiden tekijä (yhteisö)
alternative label: skapare (institution) av visuella effekter @sv
broader: esitykseen osallinen yhteisö
definition: Yhteisö, joka osallistuu liikkuvan kuvan teoksen ekspression tekemiseen suunnittelemalla ja luomalla visuaaliset tehosteet jälkituotantovaiheessa. (RDA Registry)
definition: Institution som deltar i utförandet av ett uttryck av ett verk med rörlig bild, genom att planera och skapa visuella effekter i postproduktionsfasen. @sv
in scheme: Metatietosanasto
preferred label: visual effects provider corporate body @en
preferred label: skapare av visuella effekter @sv

kalligrafi
type: Concept
source: RDA-termi
source: RDA-term @sv
created: 2024-12-18
modified: 2025-07-02
alternative label: kalligrafi (yhteisö)
alternative label: kalligraf (institution) @sv
broader: taiteilija
definition: Yhteisö, joka on taiteilija, joka on vastuussa kalligrafiasta, jossa pääpaino on käsin kirjoittamisen tai graafisen taiteen esteettisissä arvoissa, riippumatta siitä, onko sama yhteisö myös vastuussa kirjoitetusta tekstistä. (RDA Registry)
definition: Institution som är en konstnär som svarar för kalligrafi, i vilken huvudvikten ligger vid de estetiska värdena i handskrift eller grafisk konst, oberoende av om samma aktör också svarar för den skrivna texten. @sv
in scheme: Metatietosanasto
preferred label: calligrapher corporate body @en
preferred label: kalligraf @sv

musiikkiteoksen tekstin kirjoittaja
type: Concept
source: Kansallinen RDA-termi
source: Nationell RDA-term @sv
created: 2024-12-18
modified: 2025-05-29
alternative label: musiikkiteoksen tekstin kirjoittaja (yhteisö)
alternative label: författare (institution) till text i musikverk @sv
broader: kirjoittaja
definition: A corporate body who is responsible for writing a textual work that is basis of a non-dramatic musical work, other than an oratorio. @en
definition: Yhteisö, joka on ei-näytelmällisen musiikkiteoksen (muun kuin oratorion) pohjalla olevan tekstin kirjoittaja.
definition: Institution som är författare till en text som är grunden för ett icke-dramatiskt musikverk (annat än oratorium). @sv
in scheme: Metatietosanasto
preferred label: author corporate body of musical work @en
preferred label: författare till text i musikverk @sv

televisio-ohjaaja
type: Concept
source: Kansallinen RDA-termi
source: Nationell RDA-term @sv
created: 2024-12-18
modified: 2025-08-22
alternative label: liikkuvaan kuvaan osallinen televisio-ohjaaja (henkilö)
alternative label: tv-regissör (person) som är bidragsgivare till rörlig bild @sv
broader: liikkuvaan kuvaan osallinen henkilö
definition: Aggregaattiin sisältyvän TV-ohjelman yleisestä johtamisesta ja valvomisesta vastaava henkilö.
definition: Person som svarar för allmän ledning och övervakning av ett tv-program som ingår i ett aggregat. @sv
in scheme: Metatietosanasto
preferred label: tv-regissör @sv

kadenssin säveltäjä
type: Concept
source: Kansallinen RDA-termi
source: Nationell RDA-term @sv
created: 2024-12-18
modified: 2025-07-02
alternative label: kadenssin (teos) säveltäjä (yhteisö)
alternative label: kompositör (institution) av kadens (verk) @sv
broader: säveltäjä
definition: A corporate body who is responsible for creating a cadenza work that augments a musical work. @en
definition: Yhteisö, joka on vastuussa musiikkiteosta laajentavan kadenssin luomisesta.
definition: Institution som svarar för skapandet av en kadens som utvidgar ett musikverk. @sv
in scheme: Metatietosanasto
preferred label: composer corporate body of cadenza work @en
preferred label: kompositör av kadens @sv

kuvanveistäjä
type: Concept
source: RDA-termi
source: RDA-term @sv
created: 2024-12-18
modified: 2025-07-04
alternative label: kuvanveistäjä (yhteisö)
alternative label: skulptör (institution) @sv
broader: taiteilija
definition: Yhteisö, joka on taiteilija, joka on vastuussa kolmiulotteisen teoksen luomisesta muovaamalla, veistämällä tai vastaavalla tekniikalla. (RDA Registry)
definition: Institution som är en konstnär som svarar för skapandet av ett tredimensionellt verk, genom att modellera, skära eller använda någon liknande teknik. @sv
in scheme: Metatietosanasto
preferred label: sculptor corporate body @en
preferred label: skulptör @sv

yhteisön perustanut toimija
type: Concept
source: RDA-termi
source: RDA-term @sv
created: 2024-12-18
modified: 2025-08-27
broader: yhteisöön liittyvä toimija
definition: Toimija, joka perusti yhteisön. (RDA Registry)
definition: Aktör som grundat en institution. @sv
in scheme: Metatietosanasto
preferred label: founding agent of corporate body @en
preferred label: grundare (aktör) av institution @sv

tarkistaja
type: Concept
source: Kansallinen RDA-termi
source: Nationell RDA-term @sv
created: 2024-12-18
modified: 2026-05-26
alternative label: tekstiin osallinen tarkistaja (henkilö)
alternative label: granskare (person) som är bidragsgivare till text @sv
broader: tekstiin osallinen henkilö
definition: Aggregaattiin sisältöön muutoksia ehdottanut tai tehnyt henkilö.
definition: Person som föreslagit eller gjort ändringar i ett aggregats innehåll. @sv
in scheme: Metatietosanasto
preferred label: granskare @sv

lavastaja
type: Concept
source: Kansallinen RDA-termi
source: Nationell RDA-term @sv
created: 2024-12-18
modified: 2025-07-04
alternative label: liikkuvaan kuvaan osallinen lavastaja (yhteisö)
alternative label: scenograf (institution) som är bidragsgivare till rörlig bild @sv
broader: liikkuvaan kuvaan osallinen yhteisö
definition: Aggregaattiin sisältyvän elokuvan tuotannon lavasteiden rakentajia valvova yhteisö.
definition: Institution som övervakar byggare av kulisser i en filmproduktion som ingår i ett aggregat. @sv
in scheme: Metatietosanasto
preferred label: scenograf @sv

tekstaaja
type: Concept
source: Kansallinen RDA-termi
source: Nationell RDA-term @sv
created: 2024-12-18
modified: 2025-08-22
alternative label: tekstiin osallinen tekstaaja (yhteisö)
alternative label: textare (institution) som är bidragsgivare till text @sv
broader: tekstiin osallinen yhteisö
definition: Aggregaattiin sisältyvän sarjakuvasisällön tekstin ja graafiset äänitehosteet piirtävä yhteisö.
definition: Institution som ritar text och grafiska ljudeffekter i serieinnehåll som ingår i ett aggregat. @sv
in scheme: Metatietosanasto
preferred label: textare @sv

designer
type: Concept
source: RDA-termi
source: RDA-term @sv
created: 2024-12-18
modified: 2025-05-27
alternative label: designer (yhteisö)
alternative label: designer (institution) @sv
broader: teoksen tekijä
definition: Yhteisö, joka on vastuussa kohteen suunnittelusta tai muotoilusta. (RDA Registry)
definition: Institution som svarar för design och formgivning av ett objekt. @sv
in scheme: Metatietosanasto
preferred label: designer corporate body @en

ohjelmistokehittäjä
type: Concept
source: Kansallinen RDA-termi
source: Nationell RDA-term @sv
created: 2024-12-18
modified: 2025-08-14
alternative label: digitaaliseen sisältöön osallinen ohjelmistokehittäjä (yhteisö)
alternative label: programutvecklare (institution) som är bidragsgivare till digitalt innehåll @sv
broader: digitaaliseen sisältöön osallinen yhteisö
definition: Aggregaatin digitaaliseen sisältöön kuuluvan tietokoneohjelman yhteisötekijä.
definition: Upphovsinstitution till datorprogram som ingår i ett aggregats digitala innehåll. @sv
in scheme: Metatietosanasto
preferred label: programutvecklare @sv

kommentaattori
type: Concept
source: Kansallinen RDA-termi
source: Nationell RDA-term @sv
created: 2024-12-18
modified: 2025-07-03
alternative label: liikkuvaan kuvaan osallinen kommentaattori (henkilö)
alternative label: kommentator (person) som är bidragsgivare till rörlig bild @sv
broader: liikkuvaan kuvaan osallinen henkilö
definition: Aggregaattiin sisältyvän audiovisuaalisen aineiston aihetta tulkitseva, analysoiva tai keskustelussa käsittelevä henkilö.
definition: Person som tolkar, analyserar eller diskuterar ett ämne i audiovisuellt material som ingår i ett aggregat. @sv
in scheme: Metatietosanasto
preferred label: kommentator @sv

kirjoittaja
type: Concept
source: Kansallinen RDA-termi
source: Nationell RDA-term @sv
created: 2024-12-18
modified: 2025-07-03
alternative label: tekstiin osallinen kirjoittaja (yhteisö)
alternative label: författare (institution) som är bidragsgivare till text @sv
broader: tekstiin osallinen yhteisö
definition: Aggregaattiin sisältyvän tekstin kirjoittanut yhteisö. Määritelmä kattaa myös uuden sisällön luomisen toisen tekijän tekstiä mukailemalla, muokkaamalla tai sovittamalla, jos muutos on olennaisesti muuttanut alkuperäisen luonnetta ja sisältöä tai ilmaisutapaa.
definition: Institution som skrivit en text som ingår i ett aggregat. Innefattar även skapandet av nytt innehåll genom att omarbeta, redigera eller bearbeta text av en annan upphovsperson, såvida ändringen väsentligen har ändrat originalets karaktär och innehåll eller uttrycksform. @sv
in scheme: Metatietosanasto
preferred label: författare @sv

etsaaja
type: Concept
source: RDA-termi
source: RDA-term @sv
created: 2024-12-18
modified: 2025-06-11
alternative label: etsaaja (henkilö)
alternative label: etsare (person) @sv
broader: kuvalaatan valmistaja
definition: Henkilö, joka on vastuussa manifestaation valmistamisesta etsaamalla metallia, lasia tms. pintaa hapon tai muun syövyttävän aineen avulla. (RDA Registry)
definition: Person som svarar för tillverkningen av en manifestation genom att etsa metall, glas eller någon annan yta med hjälp av syra eller något annat frätande ämne. @sv
in scheme: Metatietosanasto
preferred label: etcher person @en
preferred label: etsare @sv

teoksen kartantekijä
type: Concept
source: RDA-termi
source: RDA-term @sv
created: 2016-01-08
modified: 2026-02-18
alternative label: teoksen kartantekijä (toimija)
alternative label: kartograf (aktör) för verk @sv
broader: teoksen tekijä
definition: Toimija, joka on vastuussa kartografisen teoksen luomisesta. (RDA Registry)
definition: Aktör som svarar för skapandet av ett kartografiskt verk. @sv
in scheme: Metatietosanasto
preferred label: cartographer agent of work @en
preferred label: kartograf för verk @sv

animaattori
type: Concept
source: Kansallinen RDA-termi
source: Nationell RDA-term @sv
created: 2024-12-18
modified: 2025-04-16
alternative label: liikkuvaan kuvaan osallinen animaattori (yhteisö)
alternative label: animatör (institution) som är bidragsgivare till rörlig bild @sv
broader: liikkuvaan kuvaan osallinen yhteisö
definition: Aggregaattiin sisältyvän animaation tekijä eli näennäistä liikettä esineisiin tai piirroksiin tuottava yhteisö.
definition: Skapare av animation, det vill säga institution som ger skenbar rörelse åt föremål eller teckningar, som ingår i aggregat. @sv
in scheme: Metatietosanasto
preferred label: animatör @sv

teoksen perustaja
type: Concept
source: RDA-termi
source: RDA-term @sv
created: 2024-12-18
modified: 2025-08-22
alternative label: teoksen perustaja (henkilö)
alternative label: grundare (person) av verk @sv
broader: teoksen tekijä
definition: Henkilö, joka on vastuussa diakronisen teoksen alullepanosta. (RDA Registry)
definition: Person som svarar för igångsättningen av ett diakroniskt verk. @sv
in scheme: Metatietosanasto
preferred label: founder person of work @en
preferred label: grundare av verk @sv

metatietokuvailu yhteisöstä
type: Concept
source: RDA-termi
source: RDA-term @sv
created: 2024-12-18
modified: 2025-08-14
broader: kuvaus yhteisöstä
definition: Metatietoteoksen kuvailema yhteisö. (RDA Registry)
definition: Institution som ett metadataverk beskriver. @sv
in scheme: Metatietosanasto
preferred label: metadata description of corporate body @en
preferred label: metadatabeskrivning av institutionen @sv

julkaisija
type: Concept
source: RDA-termi
source: RDA-term @sv
created: 2024-12-18
modified: 2025-07-01
alternative label: julkaisija (yhteisö)
alternative label: utgivare (institution) @sv
broader: teokseen liittyvä yhteisö
definition: Yhteisö, joka julkaisee teoksen. (RDA Registry)
definition: Institution som ger ut ett verk. @sv
in scheme: Metatietosanasto
preferred label: issuing corporate body @en
preferred label: utgivare @sv

teoksen valokuvaaja
type: Concept
source: RDA-termi
source: RDA-term @sv
created: 2024-12-18
modified: 2025-08-23
alternative label: teoksen valokuvaaja (henkilö)
alternative label: fotograf (person) till verk @sv
broader: teoksen tekijä
definition: Henkilö, joka on vastuussa valokuvateoksen luomisesta. (RDA Registry)
definition: Person som svarar för skapandet av ett fotografiskt verk. @sv
in scheme: Metatietosanasto
preferred label: photographer person of work @en
preferred label: fotograf till verk @sv

teoksen omistuksen tekijä
type: Concept
source: RDA-termi
source: RDA-term @sv
created: 2024-12-18
modified: 2026-06-06
alternative label: omistuksen tekijä (yhteisö)
alternative label: dedikationsförfattare (institution) @sv
broader: teoksen tekijä
definition: Yhteisö, joka nimittää teoksen tunnustukseksi siihen liittyvän toimijan innoituksesta tai tuesta. (RDA Registry)
definition: Institution som dedicerar ett verk till erkännande för en relaterad aktörs inspiration eller stöd. @sv
in scheme: Metatietosanasto
preferred label: dedicator corporate body @en
preferred label: verkets dedikationsförfattare @sv

stillkuvan värittäjä
type: Concept
source: Kansallinen RDA-termi
source: Nationell RDA-term @sv
created: 2024-12-18
modified: 2025-08-21
alternative label: stillkuvaan osallinen värittäjä (yhteisö)
alternative label: färgläggare (institution) som är bidragsgivare till stillbild @sv
broader: stillkuvaan osallinen yhteisö
definition: Aggregaattiin sisältyvän stillkuvan värityksen yhteisötekijä.
definition: Upphovsinstitution till färgläggning av stillbild som ingår i ett aggregat. @sv
in scheme: Metatietosanasto
preferred label: färgläggare av stillbild @sv

piirtäjä
type: Concept
source: RDA-termi
source: RDA-term @sv
created: 2024-12-18
modified: 2025-08-16
alternative label: piirtäjä (henkilö)
alternative label: ritare (person) @sv
broader: yhdistymään osallinen henkilö
definition: Henkilö, joka osallistuu arkkitehdin, suunnittelijan tai muun toimijan luoman ekspression tekemiseen tuottamalla tarkkoja suunnitelmia tai piirroksia rakennuksista, laivoista, lentokoneista, laitteista, esineistä tai muista luomuksista. (RDA Registry)
definition: Person som deltar i utförandet av ett uttryck skapat av en arkitekt, designer eller annan dylik aktör, genom att skapa precisa planer eller ritningar av byggnader, fartyg, flygplan, apparater, föremål eller andra kreationer. @sv
in scheme: Metatietosanasto
preferred label: draftsman person @en
preferred label: ritare @sv

käsikirjoittaja
type: Concept
source: Kansallinen RDA-termi
source: Nationell RDA-term @sv
created: 2024-12-18
modified: 2025-07-04
alternative label: liikkuvaan kuvaan osallinen käsikirjoittaja (henkilö)
alternative label: manusförfattare (person) som är bidragsgivare till rörlig bild @sv
broader: liikkuvaan kuvaan osallinen henkilö
definition: Aggregaattiin sisältyvän käsikirjoituksen tai kohtauksen kirjoittanut henkilö.
definition: Person som skrivit ett manus eller en scen som ingår i ett aggregat. @sv
in scheme: Metatietosanasto
preferred label: manusförfattare @sv

haastateltava
type: Concept
source: Kansallinen RDA-termi
source: Nationell RDA-term @sv
created: 2024-12-18
modified: 2025-06-13
alternative label: tekstiin osallinen teoksen haastateltava (yhteisö)
alternative label: intervjuobjekt (institution) som är bidragsgivare till text i verk @sv
broader: tekstiin osallinen yhteisö
definition: Aggregaattiin sisältyviä tietoja keräävälle haastattelijalle (tavallisesti toimittaja tai mielipidemittauksen tekijä) vastauksia antava yhteisö.
definition: Institution som ger svar åt en intervjuare (vanligen en journalist eller opinionsmätare), som samlar information som ingår i ett aggregat. @sv
in scheme: Metatietosanasto
preferred label: intervjuobjekt @sv

taiteilija
type: Concept
source: Kansallinen RDA-termi
source: Nationell RDA-term @sv
created: 2024-12-18
modified: 2025-08-21
alternative label: stillkuvaan osallinen taiteilija (henkilö)
alternative label: konstnär (person) som är bidragsgivare till stillbild @sv
broader: stillkuvaan osallinen henkilö
definition: Aggregaattiin sisältyvän alkuperäisen graafisen suunnitelman, piirroksen, maalauksen tms. henkilötekijä.
definition: Upphovsperson till en ursprunglig grafisk design, teckning, målning eller dylikt, som ingår i ett aggregat. @sv
in scheme: Metatietosanasto
preferred label: konstnär @sv

esittämisestä vastaava yhteisö
type: Concept
source: RDA-termi
source: RDA-term @sv
created: 2024-12-18
modified: 2025-06-11
broader: esittäjä
definition: Yhteisö, joka sisältyy merkintään "X esittää:" ekspression sisältävän manifestaation alku- tai lopputeksteissä ja joka liittyy todennäköisesti liikkuvan kuvan teoksen ekspression tuotantoon, rahoitukseen tai jakeluun jollakin tavoin. (RDA Registry)
definition: Institution som ingår i texten "X presenterar:" i för- och eftertexter i en manifestation som innehåller ett uttryck, och som troligtvis på något vis relaterar till produktion, finansiering eller distribution av ett uttryck för rörlig bild. @sv
in scheme: Metatietosanasto
preferred label: presenter corporate body @en
preferred label: ansvarig institution för framförande @sv

keksijä
type: Concept
source: RDA-termi
source: RDA-term @sv
created: 2024-12-18
modified: 2025-07-03
alternative label: keksijä (yhteisö)
alternative label: uppfinnare (institution) @sv
broader: teoksen tekijä
definition: Yhteisö, joka on vastuussa uuden välineen tai menetelmän luomisesta. (RDA Registry)
definition: Institution som svarar för skapandet av ett nytt redskap eller en ny metod. @sv
in scheme: Metatietosanasto
preferred label: inventor corporate body @en
preferred label: uppfinnare @sv

kokoelman luetteloija
type: Concept
source: RDA-termi
source: RDA-term @sv
created: 2024-12-18
modified: 2025-07-03
alternative label: cataloguer corporate body @en
alternative label: kokoelman luetteloija (yhteisö)
alternative label: luetteloija (yhteisö)
alternative label: katalogisatör (institution) @sv
alternative label: samlingsregistrator (institution) @sv
broader: kokoaja
definition: Yhteisö, joka vastaa analyyttisen luettelon luomisesta. (RDA Registry)
definition: Institution som svarar för skapandet av en analytisk katalog. @sv
in scheme: Metatietosanasto
preferred label: collection registrar corporate body @en
preferred label: samlingsregistrator @sv

esittäjä
type: Concept
source: Kansallinen RDA-termi
source: Nationell RDA-term @sv
created: 2025-03-25
modified: 2025-05-29
alternative label: esittäjä (yhteisö)
alternative label: framförare (institution) @sv
broader: aineistoon liittyvä yhteisö
definition: Nuottiaineistoon liittyvä esittäjä.
definition: Framförare i anslutning till notmaterial. @sv
in scheme: Metatietosanasto
preferred label: framförare @sv

teatterikriitikko
type: Concept
source: Kansallinen RDA-termi
source: Nationell RDA-term @sv
created: 2025-08-21
modified: 2026-06-06
alternative label: teatteriarvostelija
alternative label: teaterrecensent @sv
broader: kriitikko
in scheme: Metatietosanasto
preferred label: theatre critic @en
preferred label: teaterkritiker @sv

teorianoppaan tekijä
type: Concept
source: Kansallinen RDA-termi
source: Nationell RDA-term @sv
created: 2025-10-30
modified: 2025-12-06
broader: teoksen tekijä
definition: Henkilö, joka on vastuussa pääosin nuottiaineistoa sisältävän teorianoppaan laatimisesta.
definition: Person som svarar för sammanställandet av en teoribok som innehåller i huvudsak notmaterial. @sv
in scheme: Metatietosanasto
preferred label: författare till teoribok @sv
scope note: Teoksen tekijä.
scope note: Verkets skapare. @sv

johdannon kirjoittaja
type: Concept
source: Kansallinen RDA-termi
source: Nationell RDA-term @sv
created: 2026-02-18
modified: 2026-03-20
alternative label: tekstiin osallinen johdannon kirjoittaja (henkilö)
alternative label: författare till introduktion @sv
broader: oheistekstin kirjoittaja
definition: Aggregaattiin osallinen henkilö, joka on luonut aggregaattiin sisältyvän johdannon ekspression.
definition: Person som bidragit till ett aggregat, genom att skapa ett uttryck av en inledning som ingår i ett aggregat. @sv
in scheme: Metatietosanasto
preferred label: författare till inledning @sv

lisätyn tekstin kirjoittaja
type: Concept
source: Kansallinen RDA-termi
source: Nationell RDA-term @sv
created: 2026-02-18
modified: 2026-03-11
alternative label: tekstiin osallinen lisätyn tekstin kirjoittaja (yhteisö)
broader: oheistekstin kirjoittaja
definition: Aggregaattiin osallinen yhteisö, joka on luonut aggregaattiin sisältyvän lisätyn tekstin ekspression.
definition: Institution som bidragit till ett aggregat, genom att skapa ett uttryck av en tillagd text som ingår i ett aggregat. @sv
in scheme: Metatietosanasto
preferred label: författare till tillagd text @sv

esipuheen kirjoittaja
type: Concept
source: Kansallinen RDA-termi
source: Nationell RDA-term @sv
created: 2026-02-18
modified: 2026-03-11
alternative label: tekstiin osallinen esipuheen kirjoittaja (yhteisö)
alternative label: företalsförfattare @sv
broader: oheistekstin kirjoittaja
definition: Aggregaattiin osallinen yhteisö, joka on luonut aggregaattiin sisältyvän esipuheen ekspression.
definition: Institution som bidragit till ett aggregat, genom att skapa ett uttryck av ett företal som ingår i ett aggregat. @sv
in scheme: Metatietosanasto
preferred label: författare till företal @sv

loppusanojen kirjoittaja
type: Concept
source: Kansallinen RDA-termi
source: Nationell RDA-term @sv
created: 2026-02-18
modified: 2026-03-20
alternative label: tekstiin osallinen loppusanojen kirjoittaja (yhteisö)
alternative label: författare till efterord @sv
broader: oheistekstin kirjoittaja
definition: Aggregaattiin osallinen yhteisö, joka on luonut aggregaattiin sisältyvän loppusanojen ekspression.
definition: Institution som bidragit till ett aggregat, genom att skapa ett uttryck av ett slutord som ingår i ett aggregat. @sv
in scheme: Metatietosanasto
preferred label: författare till slutord @sv

alkusanojen kirjoittaja
type: Concept
source: Kansallinen RDA-termi
source: Nationell RDA-term @sv
created: 2026-02-18
modified: 2026-03-11
alternative label: tekstiin osallinen alkusanojen kirjoittaja (yhteisö)
alternative label: förordsförfattare @sv
broader: oheistekstin kirjoittaja
definition: Aggregaattiin osallinen yhteisö, joka on luonut aggregaattiin sisältyvän alkusanojen ekspression.
definition: Institution som bidragit till ett aggregat genom att skapa ett uttryck av förord som ingår i ett aggregat. @sv
in scheme: Metatietosanasto
preferred label: författare till förord @sv

kommentaarin kirjoittaja
type: Concept
source: Kansallinen RDA-termi
source: Nationell RDA-term @sv
created: 2026-02-18
modified: 2026-03-11
alternative label: tekstiin osallinen kommentaarin kirjoittaja (yhteisö)
broader: oheistekstin kirjoittaja
definition: Aggregaattiin osallinen yhteisö, joka on luonut aggregaattiin sisältyvän kommentaarin ekspression.
definition: Institution som bidragit till ett aggregat, genom att skapa ett uttryck av en kommentar som ingår i ett aggregat. @sv
in scheme: Metatietosanasto
preferred label: författare till kommentar @sv

jälkipuheen kirjoittaja
type: Concept
source: Kansallinen RDA-termi
source: Nationell RDA-term @sv
created: 2026-02-18
modified: 2026-03-11
alternative label: tekstiin osallinen jälkipuheen kirjoittaja (yhteisö)
broader: oheistekstin kirjoittaja
definition: Aggregaattiin osallinen yhteisö, joka on luonut aggregaattiin sisältyvän jälkipuheen ekspression.
definition: Institution som bidragit till ett aggregat, genom att skapa ett uttryck av ett eftertal som ingår i ett aggregat. @sv
in scheme: Metatietosanasto
preferred label: författare till eftertal @sv

johdannon kirjoittaja
type: Concept
source: Kansallinen RDA-termi
source: Nationell RDA-term @sv
created: 2026-02-18
modified: 2026-03-20
alternative label: tekstiin osallinen johdannon kirjoittaja (yhteisö)
alternative label: författare till introduktion @sv
broader: oheistekstin kirjoittaja
definition: Aggregaattiin osallinen yhteisö, joka on luonut aggregaattiin sisältyvän johdannon ekspression.
definition: Institution som bidragit till ett aggregat, genom att skapa ett uttryck av en inledning som ingår i ett aggregat. @sv
in scheme: Metatietosanasto
preferred label: författare till inledning @sv

alkusanojen kirjoittaja
type: Concept
source: Kansallinen RDA-termi
source: Nationell RDA-term @sv
created: 2026-02-18
modified: 2026-03-11
alternative label: tekstiin osallinen alkusanojen kirjoittaja (henkilö)
alternative label: förordsförfattare (person) @sv
broader: oheistekstin kirjoittaja
definition: Aggregaattiin osallinen henkilö, joka on luonut aggregaattiin sisältyvän alkusanojen ekspression.
definition: Person som bidragit till ett aggregat, genom att skapa ett uttryck av ett förord som ingår i ett aggregat. @sv
in scheme: Metatietosanasto
preferred label: författare till förord @sv

jälkipuheen kirjoittaja
type: Concept
source: Kansallinen RDA-termi
source: Nationell RDA-term @sv
created: 2026-02-18
modified: 2026-03-11
alternative label: tekstiin osallinen jälkipuheen kirjoittaja (henkilö)
broader: oheistekstin kirjoittaja
definition: Aggregaattiin osallinen henkilö, joka on luonut aggregaattiin sisältyvän jälkipuheen ekspression.
definition: Person som bidragit till ett aggregat, genom att skapa ett uttryck av ett eftertal som ingår i ett aggregat. @sv
in scheme: Metatietosanasto
preferred label: författare till eftertal @sv

kommentaarin kirjoittaja
type: Concept
source: Kansallinen RDA-termi
source: Nationell RDA-term @sv
created: 2026-02-18
modified: 2026-03-11
alternative label: tekstiin osallinen kommentaarin kirjoittaja (henkilö)
broader: oheistekstin kirjoittaja
definition: Aggregaattiin osallinen henkilö, joka on luonut aggregaattiin sisältyvän kommentaarin ekspression.
definition: Person som bidragit till ett aggregat, genom att skapa ett uttryck av en kommentar som ingår i ett aggregat. @sv
in scheme: Metatietosanasto
preferred label: författare till kommentar @sv

loppusanojen kirjoittaja
type: Concept
source: Kansallinen RDA-termi
source: Nationell RDA-term @sv
created: 2026-02-18
modified: 2026-03-20
alternative label: tekstiin osallinen loppusanojen kirjoittaja (henkilö)
alternative label: författare till efterord @sv
broader: oheistekstin kirjoittaja
definition: Aggregaattiin osallinen henkilö, joka on luonut aggregaattiin sisältyvän loppusanojen ekspression.
definition: Person som bidragit till ett aggregat, genom att skapa ett uttryck av ett slutord som ingår i ett aggregat. @sv
in scheme: Metatietosanasto
preferred label: författare till slutord @sv

esipuheen kirjoittaja
type: Concept
source: Kansallinen RDA-termi
source: Nationell RDA-term @sv
created: 2026-02-18
modified: 2026-03-11
alternative label: tekstiin osallinen esipuheen kirjoittaja (henkilö)
alternative label: företalsförfattare @sv
broader: oheistekstin kirjoittaja
definition: Aggregaattiin osallinen henkilö, joka on luonut aggregaattiin sisältyvän esipuheen ekspression.
definition: Person som bidragit till ett aggregat, genom att skapa ett uttryck av ett företal som ingår i ett aggregat. @sv
in scheme: Metatietosanasto
preferred label: författare till företal @sv

lisätyn tekstin kirjoittaja
type: Concept
source: Kansallinen RDA-termi
source: Nationell RDA-term @sv
created: 2026-02-18
modified: 2026-03-11
alternative label: tekstiin osallinen lisätyn tekstin kirjoittaja (henkilö)
broader: oheistekstin kirjoittaja
definition: Aggregaattiin osallinen henkilö, joka on luonut aggregaattiin sisältyvän lisätyn tekstin ekspression.
definition: Person som bidragit till ett aggregat, genom att skapa ett uttryck av en tillagd text som ingår i ett aggregat. @sv
in scheme: Metatietosanasto
preferred label: författare till tillagd text @sv

lisätyn sanoituksen kirjoittaja
type: Concept
source: Kansallinen RDA-termi
source: Nationell RDA-term @sv
created: 2026-03-03
modified: 2026-04-14
broader: sanoittaja
definition: Musiikkiteokseen lisättyjen sanojen kirjoittaja.
definition: Författare till text tillagd i ett musikverk. @sv
in scheme: Metatietosanasto
preferred label: författare till tillagd sångtext @sv

sävellyksen täydentäjä
type: Concept
source: Kansallinen RDA-termi
source: Nationell RDA-term @sv
created: 2026-03-03
modified: 2026-04-14
broader: säveltäjä
definition: Henkilö, joka säveltää uutta musiikkia täydentämään olemassa olevaa musiikkia.
definition: Person som komponerar ny musik för att komplettera redan befintlig musik. @sv
in scheme: Metatietosanasto
preferred label: kompletterare av komposition @sv

sävellyksen täydentäjä
type: Concept
source: Kansallinen RDA-termi
source: Nationell RDA-term @sv
created: 2026-03-03
modified: 2026-04-14
broader: säveltäjä
definition: Yhteisö, joka säveltää uutta musiikkia täydentämään olemassa olevaa musiikkia.
definition: Institution som komponerar ny musik för att komplettera redan befintlig musik. @sv
in scheme: Metatietosanasto
preferred label: kompletterare av komposition @sv

lisätyn sanoituksen kirjoittaja
type: Concept
source: Kansallinen RDA-termi
source: Nationell RDA-term @sv
created: 2026-03-03
modified: 2026-04-14
broader: sanoittaja
definition: Musiikkiteokseen lisättyjen sanojen kirjoittaja.
definition: Författare till text tillagd i ett musikverk. @sv
in scheme: Metatietosanasto
preferred label: författare till tillagd sångtext @sv

selkomukauttaja
type: Concept
source: Kansallinen RDA-termi
source: Nationell RDA-term @sv
created: 2026-03-10
modified: 2026-03-20
alternative label: selkomukauttaja (henkilö)
alternative label: bearbetare till lättläst (person) @sv
broader: teoksen version tekijä
definition: Henkilö, joka mukauttaa alunperin yleiskielellä olleen tekstin selkokielelle.
definition: Person som bearbetar en text som ursprungligen varit allmänspråklig till lättläst. @sv
in scheme: Metatietosanasto
preferred label: bearbetare till lättläst @sv

selkomukauttaja
type: Concept
source: Kansallinen RDA-termi
source: Nationell RDA-term @sv
created: 2026-03-10
modified: 2026-03-20
alternative label: selkomukauttaja (yhteisö)
alternative label: bearbetare till lättläst (institution) @sv
broader: teoksen version tekijä
definition: Yhteisö, joka mukauttaa alunperin yleiskielellä olleen tekstin selkokielelle.
definition: Institution som bearbetar en text som ursprungligen varit allmänspråklig till lättläst. @sv
in scheme: Metatietosanasto
preferred label: bearbetare till lättläst @sv

DVD-ROM-levy
type: Concept
source: Kansallinen RDA-termi
source: Nationell RDA-term @sv
created: 2016-01-08
modified: 2025-10-04
broader: DVD-levy
in scheme: Metatietosanasto
preferred label: DVD-ROM-skiva @sv

lausuja
type: Concept
source: Kansallinen RDA-termi
source: Nationell RDA-term @sv
created: 2016-01-08
modified: 2024-12-18
alternative label: lausuja (suhde)
alternative label: recit. (recitatör) @sv
alternative label: recitatör (relation) @sv
broader: esittäjä
definition: Kaunokirjallisen lyriikan esittäjä.
definition: Uppläsare av skönlitterär lyrik. @sv
in scheme: Metatietosanasto
preferred label: recitatör @sv

uudistettu painos teoksesta
type: Concept
source: Kansallinen RDA-termi
source: Nationell RDA-term @sv
created: 2016-01-08
modified: 2024-10-10
alternative label: förnyad upplaga av verket @sv
broader: johdannaisteoksen versio
example: Uudistettu painos teoksesta:
example: Reviderad upplaga av verket: @sv
in scheme: Metatietosanasto
preferred label: reviderad upplaga av verket @sv

säveltäjä
type: Concept
source: RDA-termi
source: RDA-term @sv
created: 2016-01-08
modified: 2025-05-29
alternative label: säv. (säveltäjä)
alternative label: säveltäjä (suhde)
alternative label: säveltäjä (toimija)
alternative label: komp. (kompositör) @sv
alternative label: kompositör (aktör) @sv
alternative label: kompositör (relation) @sv
alternative label: tonsättare @sv
broader: teoksen tekijä
definition: Toimija, joka on vastuussa musiikkiteoksen luomisesta. (RDA Registry)
definition: Aktör som svarar för skapandet av ett musikverk. @sv
in scheme: Metatietosanasto
preferred label: composer @en
preferred label: kompositör @sv
scope note: Kattaa selvän muunnoksen muodostamiseksi tehdyn toisen musiikkiteoksen mukaelman, teoksen parafraasin tai teoksen luomisen toisen säveltäjän yleisen tyylin mukaisesti tai toisen säveltäjän musiikkiin perustuvan teoksen luomisen. (RDA Registry)

vastaanottaja
type: Concept
source: RDA-termi
source: RDA-term @sv
created: 2016-01-08
modified: 2025-08-23
alternative label: addressee @en
alternative label: vastaanottaja (toimija)
alternative label: mottagare (aktör) @sv
broader: teokseen liittyvä toimija
definition: Toimija, jolle teos tai teoksen osa on osoitettu. (RDA Registry)
definition: Aktör till vilken ett verk eller en del av ett verk har riktats. @sv
in scheme: Metatietosanasto
preferred label: addressee agent @en
preferred label: mottagare @sv

elokuvaohjaaja
type: Concept
source: RDA-termi
source: RDA-term @sv
created: 2016-01-08
modified: 2025-05-27
alternative label: film director @en
alternative label: elokuvaohjaaja (suhde)
alternative label: elokuvaohjaaja (toimija)
alternative label: filmregissör (relation) @sv
broader: ohjaaja
definition: Toimija, joka on ohjaaja, joka on vastuussa elokuvatun esityksen yleisestä johtamisesta ja valvonnasta. (RDA Registry)
definition: Aktör som är en regissör, som svarar för allmän ledning och övervakning av en filmad föreställning. @sv
in scheme: Metatietosanasto
preferred label: film director agent @en
preferred label: filmregissör @sv

puvustaja
type: Concept
source: RDA-termi
source: RDA-term @sv
created: 2016-01-08
modified: 2025-08-16
alternative label: costume designer @en
alternative label: puvustaja (suhde)
alternative label: puvustaja (toimija)
alternative label: kostymör (aktör) @sv
alternative label: kostymör (relation) @sv
broader: esitykseen osallinen toimija
definition: Toimija, joka osallistuu ekspression tekemiseen suunnittelemalla elokuvatuotannon tai musiikki- tai näytelmäesityksen puvustuksen. (RDA Registry)
definition: Aktör som deltar i utförandet av ett uttryck, genom att planera kostymdesignen i en filmproduktion eller ett musikaliskt eller sceniskt framförande. @sv
in scheme: Metatietosanasto
preferred label: costume designer agent @en
preferred label: kostymör @sv

teoksen haastateltava
type: Concept
source: RDA-termi
source: RDA-term @sv
created: 2016-01-08
modified: 2025-08-22
alternative label: interviewee @en
alternative label: haastateltava
alternative label: teoksen haastateltava (toimija)
alternative label: intervjuad @sv
alternative label: intervjuobjekt @sv
alternative label: intervjuobjekt (aktör) i verk @sv
broader: teoksen tekijä
definition: Toimija, joka on vastuussa teoksen luomisesta vastaamalla haastattelijalle, tavallisesti toimittajalle, mielipidetutkijalle tai jonkinlaiselle muulle toimijalle, joka kerää tietoja. (RDA Registry)
definition: Aktör som svarar för skapandet av ett verk, genom att svara en intervjuare, vanligen en journalist, opinionsmätare eller som någon annan aktör, som samlar information. @sv
in scheme: Metatietosanasto
preferred label: interviewee agent of work @en
preferred label: intervjuobjekt i verk @sv

teoksen haastattelija
type: Concept
source: RDA-termi
source: RDA-term @sv
created: 2016-01-08
modified: 2026-03-28
alternative label: interviewer @en
alternative label: haastattelija (teos)
alternative label: teoksen haastattelija (toimija)
alternative label: intervjuare (aktör) i verk @sv
broader: teoksen tekijä
definition: Toimija, joka on vastuussa teoksen luomisesta toimimalla haastattelijana, toimittajana, mielipidetutkijana tai jonkinlaisena muuna toimijana, joka kerää tietoja. (RDA Registry)
definition: Aktör som svarar för skapandet av ett verk, genom att fungera som intervjuare, journalist, opinionsmätare eller någon annan aktör, som samlar information. @sv
in scheme: Metatietosanasto
preferred label: interviewer agent of work @en
preferred label: intervjuare i verk @sv

soittaja
type: Concept
source: RDA-termi
source: RDA-term @sv
created: 2016-01-08
modified: 2025-08-19
preferred label: instrumentalist @sv
alternative label: soittaja (suhde)
alternative label: soittaja (toimija)
alternative label: instrumentalist (aktör) @sv
alternative label: instrumentalist (relation) @sv
broader: esittäjä
definition: Toimija, joka on esittäjä, joka osallistuu ekspression tekemiseen soittamalla soitinta. (RDA Registry)
definition: Aktör som är en framförare, som deltar i utförandet av ett uttryck genom att spela ett instrument. @sv
in scheme: Metatietosanasto
preferred label: instrumentalist agent @en

käsikirjoittaja
type: Concept
source: RDA-termi
source: RDA-term @sv
created: 2016-01-08
modified: 2025-07-04
alternative label: screenwriter @en
alternative label: käsik. (käsikirjoittaja)
alternative label: käsikirjoittaja (suhde)
alternative label: käsikirjoittaja (toimija)
alternative label: manusförf. (manusförfattare) @sv
alternative label: manusförfattare (aktör) @sv
alternative label: manusförfattare (relation) @sv
broader: kirjoittaja
definition: Toimija, joka on käsikirjoituksen tai kohtauksen kirjoittaja. (RDA Registry)
definition: Aktör som skrivit ett manus eller en scen. @sv
in scheme: Metatietosanasto
preferred label: screenwriter agent @en
preferred label: manusförfattare @sv

CD-ROM-levy
type: Concept
source: Kansallinen RDA-termi
source: Nationell RDA-term @sv
created: 2016-01-08
modified: 2025-10-04
broader: CD-levy
in scheme: Metatietosanasto
preferred label: CD-ROM-skiva @sv

tutkimuslaitos
type: Concept
source: Kansallinen RDA-termi
source: Nationell RDA-term @sv
created: 2016-01-08
modified: 2024-05-24
alternative label: havaintoasema
alternative label: instituutti (tutkimuslaitos)
alternative label: koeasema
alternative label: laboratorio (tutkimuslaitos)
alternative label: observatorio
alternative label: tutkimusasema
alternative label: tutkimusinstituutti
alternative label: tutkimuskeskus
alternative label: forskningscentral @sv
alternative label: forskningscentrum @sv
alternative label: forskningsinstitut @sv
alternative label: försöksstation @sv
alternative label: institut (forskning) @sv
alternative label: laboratorium (forskningsinstitution) @sv
alternative label: observationsstation @sv
alternative label: observatorium @sv
example: Minerva (tutkimuslaitos)
example: Minerva (forskningsinstitution) @sv
in scheme: Metatietosanasto
preferred label: forskningsinstitution @sv
related: instituutti

elokuvatuottaja
type: Concept
source: RDA-termi
source: RDA-term @sv
created: 2016-01-08
modified: 2025-05-27
alternative label: film producer @en
alternative label: elokuvatuottaja (suhde)
alternative label: elokuvatuottaja (toimija)
alternative label: filmproducent (relation) @sv
alternative label: producent av film @sv
broader: tuottaja
definition: Toimija, joka on tuottaja, joka on vastuussa suurimmasta osasta elokuvan tuotannon liiketoiminnasta. (RDA Registry)
definition: Aktör som är en producent, som svarar för största delen av affärsverksamheten kring en filmproduktion. @sv
in scheme: Metatietosanasto
preferred label: film producer agent @en
preferred label: filmproducent @sv

radio-ohjaaja
type: Concept
source: RDA-termi
source: RDA-term @sv
created: 2016-01-08
modified: 2025-08-16
alternative label: radio director @en
alternative label: radio-ohjaaja (toimija)
alternative label: radio-ohjelman ohjaaja
alternative label: radioregissör (aktör) @sv
broader: ohjaaja
definition: Toimija, joka on ohjaaja, joka on vastuussa radio-ohjelman yleisestä johtamisesta ja valvonnasta. (RDA Registry)
definition: Aktör som är en regissör, som svarar för den allmänna ledningen och övervakningen av ett radioprogram. @sv
in scheme: Metatietosanasto
preferred label: radio director agent @en
preferred label: radioregissör @sv

työryhmä
type: Concept
source: Kansallinen RDA-termi
source: Nationell RDA-term @sv
created: 2016-01-08
modified: 2024-05-24
broader: toimielin
example: Cont Rideau (työryhmä)
example: Cont Rideau (arbetsgrupp) @sv
in scheme: Metatietosanasto
preferred label: arbetsgrupp @sv

uudistettu laitos teoksesta
type: Concept
source: Kansallinen RDA-termi
source: Nationell RDA-term @sv
created: 2016-01-08
modified: 2025-10-30
alternative label: förnyad upplaga av verket @sv
broader: johdannaisteoksen versio
example: Uudistettu laitos teoksesta:
example: Reviderad upplaga av verket: @sv
in scheme: Metatietosanasto
preferred label: reviderad upplaga av verket @sv

meedio
type: Concept
source: RDA-termi
source: RDA-term @sv
created: 2016-01-08
modified: 2025-08-28
broader: teoksen tekijä
definition: Henkilö, joka vakuuttaa olevansa viestintäkanava henkien maailmaan. (RDA Registry)
definition: Person som säger sig vara en kommunikationskanal till andarnas värld. @sv
in scheme: Metatietosanasto
preferred label: medium @en

teos omistettu
type: Concept
source: Kansallinen RDA-termi
source: Nationell RDA-term @sv
created: 2016-01-08
modified: 2024-12-18
broader: teoksen omistuksen kohde
definition: Teos on omistettu henkilölle.
definition: Verket har dedicerats till en person. @sv
in scheme: Metatietosanasto
preferred label: verket dedicerat till @sv

yhteisön perustanut henkilö
type: Concept
source: RDA-termi
source: RDA-term @sv
created: 2016-01-08
modified: 2025-08-27
alternative label: founder @en
alternative label: perustaja
alternative label: grundare @sv
broader: yhteisöön liittyvä henkilö
definition: Henkilö, joka perusti yhteisön. (RDA Registry)
definition: Person som grundat en institution. @sv
in scheme: Metatietosanasto
preferred label: founding person of corporate body @en
preferred label: grundare (person) av institution @sv

tuottaja (ekspressio)
type: Concept
source: Kansallinen RDA-termi
source: Nationell RDA-term @sv
created: 2016-01-08
modified: 2025-05-27
alternative label: taiteellinen tuottaja
alternative label: konstnärlig producent @sv
broader: esitykseen osallinen henkilö
definition: Henkilö, joka on vastuussa ekspression taiteellisen sisällön tuottamisesta (esim. äänitteen tuottaja).
definition: Person som svarar för produktionen av ett uttrycks konstnärliga innehåll (t.ex. producent för en ljudinspelning). @sv
in scheme: Metatietosanasto
preferred label: producent (uttryck) @sv

musiikillinen johtaja
type: Concept
source: RDA-termi
source: RDA-term @sv
created: 2016-01-08
modified: 2025-08-14
alternative label: musical director @en
alternative label: musiikillinen johtaja (toimija)
alternative label: musiikkijohtaja
alternative label: musikalisk ledare (aktör) @sv
broader: esitykseen osallinen toimija
definition: Toimija, joka osallistuu ekspression tekemiseen koordinoimalla säveltäjien, äänileikkaajien ja äänimiksaajien toimintaa elokuvatuotannossa tai musiikki- tai näytelmäesityksessä. (RDA Registry)
definition: Aktör som deltar i utförandet av ett uttryck, genom att koordinera kompositörers, ljudklippares och ljudmixares verksamhet i en filmproduktion eller i ett musikaliskt eller sceniskt uppförande. @sv
in scheme: Metatietosanasto
preferred label: musical director agent @en
preferred label: musikalisk ledare @sv

haastattelija (ekspressio)
type: Concept
source: RDA-termi
source: RDA-term @sv
created: 2016-01-08
modified: 2026-03-10
alternative label: interviewer (expression) @en
alternative label: ekspression haastattelija
alternative label: ekspression haastattelija (toimija)
alternative label: version haastattelija
alternative label: intervjuare i uttryck @sv
alternative label: intervjuare i uttryck (aktör) @sv
broader: esitykseen osallinen toimija
definition: Toimija, joka osallistuu ekspression tekemiseen toimimalla haastattelijana, toimittajana, mielipidetutkijana tai jonain muuna toimijana, joka kerää tietoja. (RDA Registry)
definition: Aktör som deltar i utförandet av ett uttryck, genom att fungera som intervjuare, journalist, opinionsmätare eller någon annan aktör som samlar in uppgifter. @sv
in scheme: Metatietosanasto
preferred label: interviewer agent of expression @en
preferred label: intervjuare (uttryck) @sv

elokuvantekijä
type: Concept
source: RDA-termi
source: RDA-term @sv
created: 2016-01-08
modified: 2025-05-27
alternative label: filmmaker @en
alternative label: elokuvan tekijä
alternative label: elokuvantekijä (toimija)
alternative label: filmens skapare @sv
alternative label: filmmakare @sv
broader: teoksen tekijä
definition: Toimija, joka on vastuussa riippumattoman tai henkilökohtaisen elokuvan luomisesta. (RDA Registry)
definition: Aktör som svarar för skapandet av en självständig eller personlig film. @sv
in scheme: Metatietosanasto
preferred label: filmmaker agent @en
preferred label: filmskapare @sv
scope note: Tekijä vastaa itse kaikilta osin elokuvan ideoinnista ja toteuttamisesta. (RDA Registry)
scope note: Skaparen svarar själv till alla delar för idén till och förverkligandet av filmen. @sv

lukija
type: Concept
source: Kansallinen RDA-termi
source: Nationell RDA-term @sv
created: 2016-01-08
modified: 2024-12-18
broader: esittäjä
definition: Liittää ekspression esittäjään, joka osallistuu teoksen ekspressioon lukemalla tekstin ääneen.
definition: Sammankopplar uttryck med en aktör som deltar i ett uttryck av ett verk, genom att läsa upp text högt. @sv
in scheme: Metatietosanasto
preferred label: uppläsare @sv

teoksen omistuksen kohde
type: Concept
source: RDA-termi
source: RDA-term @sv
created: 2016-01-08
modified: 2025-04-05
alternative label: dedicatee @en
alternative label: teoksen omistuksen kohde (toimija)
alternative label: teoksen omistuskirjoituksen kohde
alternative label: dedikationsmottagare @sv
alternative label: verket dedicerat till (aktör) @sv
broader: teokseen liittyvä toimija
definition: Toimija, jolle teos on omistettu. (RDA Registry)
definition: Aktör som tillägnats ett verk. @sv
in scheme: Metatietosanasto
preferred label: dedicatee agent of work @en
preferred label: verket dedicerat till @sv

kokoaja
type: Concept
source: RDA-termi
source: RDA-term @sv
created: 2016-01-08
modified: 2025-07-03
alternative label: compiler @en
alternative label: kok. (kokoaja)
alternative label: kokoaja (toimija)
alternative label: sammanställare (aktör) @sv
alternative label: utarb. (sammanställare) @sv
broader: koostaja
definition: Toimija, joka on vastuussa uuden teoksen, kuten bibliografian tai hakemiston luomisesta valitsemalla, järjestämällä, koostamalla ja toimittamalla dataa, informaatiota tms. (RDA Registry)
definition: Aktör som svarar för skapandet av ett nytt verk, såsom en bibliografi eller ett register, genom att välja, ordna, sammanställa och redigera data, information eller dylikt. @sv
in scheme: Metatietosanasto
narrower: kokoelman luetteloija
preferred label: compiler agent @en
preferred label: sammanställare @sv

yhtye
type: Concept
source: Kansallinen RDA-termi
source: Nationell RDA-term @sv
created: 2016-01-08
modified: 2024-05-24
alternative label: band @sv
alternative label: ensemble @sv
definition: Yleensä alle kymmenen muusikon esittäjäryhmä.
definition: Uppträdande grupp vanligtvis bestående av färre än tio musiker. @sv
example: Beatles (yhtye)
example: Beatles (musikgrupp) @sv
in scheme: Metatietosanasto
narrower: soitinyhtye
narrower: lauluyhtye
preferred label: musikgrupp @sv

sarjakuvaversio
type: Concept
source: RDA-termi
source: RDA-term @sv
created: 2016-01-08
modified: 2025-08-19
Vastavuoroinen suhde: sarjakuvaversio teoksesta
alternative label: sarjakuvaversio (teos)
alternative label: serieversion @sv
alternative label: tecknad serie-version (verk) @sv
broader: mukaelma
definition: Teos, joka on toiseen teokseen perustuva sarjakuvaromaani. (RDA Registry)
definition: Verk som är en grafisk roman som grundar sig på ett annat verk. @sv
in scheme: Metatietosanasto
preferred label: adapted as graphic novel work @en
preferred label: tecknad serie-version @sv

televisiosovitus teoksesta
type: Concept
source: RDA-termi
source: RDA-term @sv
created: 2016-01-08
modified: 2025-08-22
Vastavuoroinen suhde: televisiosovitus
alternative label: televisiosovituksen perustana
alternative label: televisiosovituksen perustana (teos)
alternative label: televisioversion perustana
alternative label: televisioversion perustana (teos)
alternative label: tv-bearbetning baserad på @sv
alternative label: tv-bearbetning baserad på (verk) @sv
alternative label: tv-version baserad på @sv
alternative label: tv-version baserad på (verk) @sv
broader: mukaelma teoksesta
definition: Teos, joka on sovitettu televisio-ohjelmaksi. (RDA Registry)
definition: Verk som har bearbetats till ett tv-program. @sv
in scheme: Metatietosanasto
preferred label: television adaptation of work @en
preferred label: tv-bearbetning av verket @sv

näyttelijä
type: Concept
source: RDA-termi
source: RDA-term @sv
created: 2016-01-08
modified: 2025-08-15
alternative label: actor @en
alternative label: näytt. (näyttelijä)
alternative label: näyttelijä (suhde)
alternative label: näyttelijä (toimija)
alternative label: skåd. (skådespelare) @sv
alternative label: skådespelare (aktör) @sv
alternative label: skådespelare (relation) @sv
broader: esittäjä
definition: Toimija, joka on esittäjä, joka osallistuu ekspression tekemiseen näyttelemällä musiikki- tai näytelmäesityksessä. (RDA Registry)
definition: Aktör som är en framförare som deltar i utförandet av ett uttryck, genom att skådespela i ett musikaliskt eller dramatiskt uppförande. @sv
in scheme: Metatietosanasto
narrower: ääninäyttelijä
preferred label: actor agent @en
preferred label: skådespelare @sv

aineiston digitoitu jäljenne
type: Concept
source: RDA-termi
source: RDA-term @sv
created: 2016-01-08
modified: 2025-02-21
Vastavuoroinen suhde: digitoitu aineisto
alternative label: electronic reproduction (manifestation) @en
alternative label: digitoitu jäljenne (manifestaatio)
alternative label: digitoitu manifestaatiosta
alternative label: manifestaation digitoitu jäljenne
alternative label: digital reproduktion (manifestation) @sv
alternative label: digital reproduktion av manifestationen @sv
alternative label: digitalisering av manifestation @sv
broader: aineiston jäljenne
definition: Digitaalisessa muodossa oleva manifestaatio, joka analogisen manifestaatio muunnoksen tulos. (RDA Registry)
definition: En manifestation i digital form, som är resultat av omvandlingen av en analog manifestation. @sv
in scheme: Metatietosanasto
preferred label: electronic reproduction of manifestation @en
preferred label: digital reproduktion av materialet @sv

sarjakuvantekijä
type: Concept
source: Kansallinen RDA-termi
source: Nationell RDA-term @sv
created: 2016-01-08
modified: 2025-01-08
broader: taiteilija
broader: kirjoittaja
definition: Liittää teoksen henkilöön, joka on vastuussa sarjakuvan kuvallisesta ja/tai kirjallisesta ilmaisusta.
definition: Sammankopplar verk med en person som ansvarar för en series visuella och/eller litterära framställning. @sv
in scheme: Metatietosanasto
preferred label: serieskapare @sv
scope note: Teoksen tekijä.
scope note: Verkets skapare. @sv

elokuvaversio teoksesta
type: Concept
source: RDA-termi
source: RDA-term @sv
created: 2016-01-08
modified: 2025-05-29
Vastavuoroinen suhde: elokuvaversio
alternative label: elokuvaversion perustana
alternative label: elokuvaversion perustana (teos)
alternative label: filmatisoinnin perustana
alternative label: filmatisoinnin perustana (teos)
alternative label: filmatisering baserad på @sv
alternative label: filmatisering baserad på (verk) @sv
alternative label: filmversion baserad på @sv
alternative label: filmversion baserad på (verk) @sv
broader: mukaelma teoksesta
definition: Teos, joka on sovitettu elokuvaksi. (RDA Registry)
definition: Verk som har omarbetats till film. @sv
in scheme: Metatietosanasto
preferred label: motion picture adaptation of work @en
preferred label: filmversion av verket @sv

musiikki elokuvaan
type: Concept
source: RDA-termi
source: RDA-term @sv
created: 2016-01-08
modified: 2025-08-14
Vastavuoroinen suhde: elokuvamusiikki
alternative label: musiikki elokuvaan (teos)
alternative label: musiikki elokuvasta
alternative label: musik från film @sv
alternative label: musik till filmen (verk) @sv
broader: musiikki teokseen
definition: Teos, joka on elokuva, jota musiikkiteos täydentää. (RDA Registry)
definition: Verk som är en film, som ett musikverk kompletterar. @sv
in scheme: Metatietosanasto
preferred label: music for motion picture work @en
preferred label: musik till filmen @sv

uusintapainos aineistosta
type: Concept
source: RDA-termi
source: RDA-term @sv
created: 2016-01-08
modified: 2025-08-23
Vastavuoroinen suhde: aineiston uusintapainos
alternative label: reprint of (manifestation) @en
alternative label: alkuperäinen painos
alternative label: uusintapainos manifestaatiosta
alternative label: nytryck av manifestationen @sv
alternative label: originalupplaga @sv
broader: jäljenne aineistosta
definition: Painetussa muodossa oleva manifestaatio, jota käytetään manifestaation uusintajulkaisun pohjana. (RDA Registry)
definition: Manifestation i tryckt form, som används som grund för ett återtryck av en manifestation. @sv
in scheme: Metatietosanasto
preferred label: reprint of manifestation of @en
preferred label: nytryck av materialet @sv

selkokielisen version perustana (teos)
type: Concept
source: Kansallinen RDA-termi
source: Nationell RDA-term @sv
created: 2016-01-08
modified: 2024-12-18
Vastavuoroinen suhde: selkokielinen versio (teos)
broader: mukaelma teoksesta
definition: Viittauksen kohde on teos, josta kuvailun kohteena oleva selkokielinen versio on tehty.
definition: Föremål för hänvisning är ett verk, utgående från vilket den lättlästa versionen som är föremål för beskrivning gjorts. @sv
in scheme: Metatietosanasto
preferred label: lättläst version baserad på (verk) @sv

uusintaproduktio teoksesta
type: Concept
source: RDA-termi
source: RDA-term @sv
created: 2016-01-08
modified: 2025-08-23
Vastavuoroinen suhde: uusintaproduktio
alternative label: uusintaproduktion perustana
alternative label: uusintaproduktion perustana (teos)
alternative label: nyproduktion baserad på @sv
alternative label: nyproduktion baserad på (verk) @sv
broader: muunnos tyylissä teoksesta
definition: Uuden elokuvan, televisio-ohjelman, radio-ohjelman tai videon perustana käytetty teos. (RDA Registry)
definition: Verk som använts som grund för en ny film, ett tv-program, ett radioprogram eller en video. @sv
in scheme: Metatietosanasto
preferred label: remake of work @en
preferred label: nyproduktion av verket @sv

sarjakuvaversio teoksesta
type: Concept
source: RDA-termi
source: RDA-term @sv
created: 2016-01-08
modified: 2025-08-19
Vastavuoroinen suhde: sarjakuvaversio
alternative label: sarjakuvaversion perustana
alternative label: sarjakuvaversion perustana (teos)
alternative label: serieversion av verket @sv
alternative label: tecknad serie-version baserad på @sv
alternative label: tecknad serie-version baserad på (verk) @sv
broader: mukaelma teoksesta
definition: Teos, joka on sovitettu sarjakuvaromaaniksi. (RDA Registry)
definition: Verk som har bearbetats till grafisk roman. @sv
in scheme: Metatietosanasto
preferred label: graphic novelization of work @en
preferred label: tecknad serie-version av verket @sv

uudistettu versio
type: Concept
source: RDA-termi
source: RDA-term @sv
created: 2016-01-08
modified: 2025-08-23
Vastavuoroinen suhde: uudistetun version perusta
alternative label: förnyad version @sv
broader: johdannaisversio
definition: Teoksen ekspressio, joka on päivitetty, korjattu tai laajennettu. (RDA Registry)
definition: Uttryck av verk, som är uppdaterat, korrigerat eller utvidgat. @sv
in scheme: Metatietosanasto
preferred label: revised as @en
preferred label: reviderad version @sv

lastenversion perustana (teos)
type: Concept
source: Kansallinen RDA-termi
source: Nationell RDA-term @sv
created: 2016-01-08
modified: 2024-12-18
Vastavuoroinen suhde: lastenversio (teos)
broader: mukaelma teoksesta
in scheme: Metatietosanasto
preferred label: barnversion baserad på (verk) @sv

painolaatan valmistaja
type: Concept
source: RDA-termi
source: RDA-term @sv
created: 2016-12-02
modified: 2025-08-15
alternative label: platemaker @en
alternative label: painolaatan valmistaja (toimija)
alternative label: tryckplåtstillverkare (aktör) @sv
broader: aineiston tekijä
definition: Toimija, joka on vastuussa manifestaation valmistamisesta valmistamalla painettujen kuvien tai tekstin valmistuksessa käytettäviä painolaattoja tai -levyjä. (RDA Registry)
definition: Aktör som svarar för tillverkningen av en manifestation, genom att tillverka tryckplåtar eller dylikt, för användning vid tillverkningen av tryckta bilder eller texter. @sv
in scheme: Metatietosanasto
narrower: kollotypian valmistaja
preferred label: platemaker agent @en
preferred label: tryckplåtstillverkare @sv

nykyinen omistaja
type: Concept
source: RDA-termi
source: RDA-term @sv
created: 2016-12-14
modified: 2025-08-15
alternative label: current owner @en
alternative label: nykyinen omistaja (toimija)
alternative label: nuvarande ägare (aktör) @sv
alternative label: ägare @sv
broader: omistaja
definition: Toimija, joka tällä hetkellä laillisesti omistaa kappaleen. (RDA Registry)
definition: Aktör som för tillfället juridiskt äger ett exemplar. @sv
in scheme: Metatietosanasto
narrower: tallettaja
preferred label: current owner agent @en
preferred label: nuvarande ägare @sv

liite
type: Concept
source: RDA-termi
source: RDA-term @sv
created: 2017-07-06
modified: 2025-07-05
Vastavuoroinen suhde: liitteenä aineistossa
broader: aineiston osa
definition: Manifestaatio, joka on erillinen osa toista manifestaatiota. (RDA Registry)
definition: Manifestation som är en skild del av en annan manifestation. @sv
in scheme: Metatietosanasto
preferred label: insert @en
preferred label: bilaga @sv
scope note: Liite käsittää esim. kartan tai kuvitus- tai mainosliitteen, joka ei ole kiinteä osa muuta manifestaatiota. (RDA Registry)
scope note: Innefattar t.ex. en kart-, illustrations- eller reklambilaga, som inte är en fast del av den övriga manifestationen. @sv

korvaa teoksen
type: Concept
source: RDA-termi
source: RDA-term @sv
created: 2018-08-28
modified: 2025-07-04
Vastavuoroinen suhde: korvaava teos
broader: edeltävä teos
definition: Teos, jonka sisällön toisen teoksen sisältö korvaa ja tekee vanhentuneeksi. (RDA Registry)
definition: Verk vars innehåll ett annat verks innehåll ersätter och gör föråldrat. @sv
in scheme: Metatietosanasto
preferred label: replacement of work @en
preferred label: ersätter verket @sv
scope note: Tämä elementti soveltuu yleensä staattiseen teokseen tai päivittyvään teokseen. (RDA Registry)
scope note: Detta element lämpar sig vanligen för ett statiskt eller integrerande verk. @sv

eronnut teoksesta
type: Concept
source: RDA-termi
source: RDA-term @sv
created: 2018-08-28
modified: 2025-06-04
Vastavuoroinen suhde: eronnut teokseksi
broader: edeltävä teos
definition: Teos, joka on jatkuva diakroninen teos, jonka osittaista sisältöä jatkaa toinen diakroninen teos. (RDA Registry)
definition: Verk som är ett kontinuerligt diakroniskt verk, vars partiella innehåll fortsättes av ett annat diakroniskt verk. @sv
in scheme: Metatietosanasto
preferred label: separated from work @en
preferred label: separerad från verket @sv
scope note: Tämä elementti soveltuu yleensä peräkkäisesti ilmestyvään teokseen. (RDA Registry)
scope note: Detta element lämpar sig vanligen för successivt utkommande verk. @sv

jakautunut teoksesta
type: Concept
source: RDA-termi
source: RDA-term @sv
created: 2018-08-28
modified: 2025-07-01
Vastavuoroinen suhde: jakautunut teokseen
alternative label: continuation in part of (work) @en
alternative label: jatkaa osittain teosta
alternative label: fortsätter delvis verket @sv
broader: edeltävä teos
definition: Teos, joka on valmis diakroninen teos, jonka osittaista sisältöä jatkaa toinen diakroninen teos. (RDA Registry)
definition: Verk som är ett färdigt diakroniskt verk, vars partiella innehåll fortsättes av ett annat diakroniskt verk. @sv
in scheme: Metatietosanasto
preferred label: split from work @en
preferred label: uppdelad från verket @sv
scope note: Tämä elementti soveltuu yleensä peräkkäisesti ilmestyvään teokseen. (RDA Registry)
scope note: Detta element lämpar sig vanligen för successivt utkommande verk. @sv

korvaa osittain teoksen
type: Concept
source: RDA-termi
source: RDA-term @sv
created: 2018-08-28
modified: 2025-07-04
Vastavuoroinen suhde: osittain korvattu teoksella
broader: edeltävä teos
definition: Teos, jonka sisällön toisen teoksen sisältö osittain korvaa ja tekee vanhentuneeksi. (RDA Registry)
definition: Verk vars innehåll ett annat verks innehåll delvis ersätter och gör föråldrat. @sv
in scheme: Metatietosanasto
preferred label: replacement in part of work @en
preferred label: ersätter delvis verket @sv
scope note: Tämä elementti soveltuu yleensä staattiseen teokseen tai päivittyvään teokseen. (RDA Registry)
scope note: Detta element lämpar sig vanligen för ett statiskt eller integrerande verk. @sv

esiosa
type: Concept
source: RDA-termi
source: RDA-term @sv
created: 2018-08-28
modified: 2025-12-19
Vastavuoroinen suhde: jatko-osa
preferred label: prequel @sv
alternative label: sequel to @en
alternative label: esiosa (teos)
alternative label: prequel (verk) @sv
broader: teokseen liittyvä teos
definition: Teos, joka laajentaa toisen teoksen kerrontaa ajassa taaksepäin. (RDA Registry)
definition: Verk som utvidgar ett annat verks berättelse bakåt i tiden. @sv
in scheme: Metatietosanasto
preferred label: prequel work @en

runomukaelma teoksesta
type: Concept
source: RDA-termi
source: RDA-term @sv
created: 2018-08-28
modified: 2025-08-19
Vastavuoroinen suhde: runomukaelma
alternative label: runomukaelman perustana
alternative label: runomukaelman perustana (teos)
alternative label: versbearbetning baserad på @sv
alternative label: versbearbetning baserad på (verk) @sv
broader: mukaelma teoksesta
definition: Teos, joka on sovitettu runomuotoiseksi kirjalliseksi tuotokseksi. (RDA Registry)
definition: Verk som har bearbetats till ett litterärt alster i versform. @sv
in scheme: Metatietosanasto
preferred label: verse adaptation of work @en
preferred label: versbearbetning av verket @sv

osittain sulautunut teos
type: Concept
source: RDA-termi
source: RDA-term @sv
created: 2018-08-28
modified: 2025-08-15
Vastavuoroinen suhde: sulautunut osittain teokseen
alternative label: teokseen osittain sulautunut
alternative label: delvis uppgått i verk @sv
alternative label: verk som uppgått delvis @sv
broader: edeltävä teos
definition: Teos, jonka osittainen sisältö on yhdistynyt toisen teoksen sisältöön. (RDA Registry)
definition: Verk vars innehåll delvis har införlivats i ett annat verks innehåll. @sv
in scheme: Metatietosanasto
preferred label: absorption in part of work @en
preferred label: delvis införlivat verk @sv

jatko-osa
type: Concept
source: RDA-termi
source: RDA-term @sv
created: 2018-08-28
modified: 2025-12-19
Vastavuoroinen suhde: esiosa
alternative label: prequel to @en
alternative label: sequel @en
alternative label: jatko-osa (teos)
alternative label: jatkuu teoksena
alternative label: fortsättningsdel @sv
alternative label: senare del @sv
alternative label: uppföljare (verk) @sv
broader: teokseen liittyvä teos
definition: Teos, joka laajentaa toisen teoksen kerrontaa ajassa eteenpäin. (RDA Registry)
definition: Verk som utvidgar ett annat verks berättande framåt i tiden. @sv
in scheme: Metatietosanasto
preferred label: sequel work @en
preferred label: uppföljare @sv

jatkoa versiolle
type: Concept
source: RDA-termi
source: RDA-term @sv
created: 2018-08-28
modified: 2025-07-01
Vastavuoroinen suhde: seuraaja
alternative label: edeltäjä
alternative label: edeltäjä (ekspressio)
alternative label: jatkoa ekspressiolle
alternative label: fortsättning på uttrycket @sv
alternative label: föregående (uttryck) @sv
broader: teoksen edeltävä versio
definition: Teoksen ekspressio, joka on valmis diakroninen teos, jonka sisältöä jatkaa toisen diakronisen teoksen ekspressio. (RDA Registry)
definition: Uttryck av verk som är ett färdigt diakroniskt verk, vars innehåll ett annat diakroniskt verks uttryck fortsätter. @sv
in scheme: Metatietosanasto
preferred label: continuation of expression @en
preferred label: fortsättning på versionen @sv
scope note: Tämä elementti soveltuu yleensä peräkkäisesti ilmestyvän teoksen ekspressioon. (RDA Registry)
scope note: Detta element lämpar sig vanligen för successivt utkommande uttryck. @sv

seuraaja
type: Concept
source: RDA-termi
source: RDA-term @sv
created: 2018-08-28
modified: 2025-08-19
Vastavuoroinen suhde: jatkoa versiolle
alternative label: seuraaja (ekspressio)
alternative label: fortsättes av (uttryck) @sv
broader: myöhempi teoksen versio
definition: Sellaisen teoksen ekspressio, joka on diakroninen teos, joka jatkaa toisen, valmiin diakronisen teoksen sisältöä. (RDA Registry)
definition: Uttryck av ett verk som är ett diakroniskt verk, som fortsätter innehållet i ett annat färdigt diakroniskt verk. @sv
in scheme: Metatietosanasto
preferred label: continued by expression @en
preferred label: fortsättes av @sv
scope note: Tämä elementti soveltuu yleensä peräkkäisesti ilmestyvän teoksen ekspressioon. (RDA Registry)
scope note: Detta element lämpar sig vanligen för successivt utkommande uttryck. @sv

teokseen yhdistyjä
type: Concept
source: RDA-termi
source: RDA-term @sv
created: 2018-08-29
modified: 2025-08-22
Vastavuoroinen suhde: yhdistynyt teokseksi
broader: edeltävä teos
definition: Teos, joka on yhdistynyt yhden tai useamman teoksen kanssa ja muodostanut uuden teoksen. (RDA Registry)
definition: Verk som sammanslagits med ett eller flera verk och bildat ett nytt verk. @sv
in scheme: Metatietosanasto
preferred label: merger of work @en
preferred label: sammanslagen med verket @sv

jakautunut teokseen
type: Concept
source: RDA-termi
source: RDA-term @sv
created: 2018-08-29
modified: 2025-07-01
Vastavuoroinen suhde: jakautunut teoksesta
alternative label: jakautumisen tulos
alternative label: jakautumisen tulos (teos)
alternative label: uppdelad på (verk) @sv
broader: myöhempi teos
definition: Teos, joka on diakroninen teos, joka jatkaa toisen, valmiin diakronisen teoksen osittaista sisältöä. (RDA Registry)
definition: Verk som är ett diakroniskt verk, som fortsätter det partiella innehållet i ett annat färdigt diakroniskt verk. @sv
in scheme: Metatietosanasto
preferred label: split into work @en
preferred label: uppdelad i verket @sv
scope note: Tämä elementti soveltuu yleensä peräkkäisesti ilmestyvään teokseen. (RDA Registry)
scope note: Detta element lämpar sig vanligen för successivt utkommande verk. @sv

sulautunut teos
type: Concept
source: RDA-termi
source: RDA-term @sv
created: 2018-08-29
modified: 2025-04-10
Vastavuoroinen suhde: sulautunut teokseen
alternative label: teokseen sulautunut
alternative label: uppgått i verk @sv
alternative label: verk som uppgått @sv
broader: edeltävä teos
definition: Teos, jonka sisältö on yhdistynyt toisen teoksen sisältöön. (RDA Registry)
definition: Verk vars innehåll har införlivats i ett annat verks innehåll. @sv
in scheme: Metatietosanasto
preferred label: absorption of work @en
preferred label: införlivat verk @sv

yhdistynyt teokseksi
type: Concept
source: RDA-termi
source: RDA-term @sv
created: 2018-09-07
modified: 2025-08-23
Vastavuoroinen suhde: teokseen yhdistyjä
broader: myöhempi teos
definition: Teos, joka on muodostunut kahden tai useamman teoksen yhdistymisestä. (RDA Registry)
definition: Verk som har bildats ur sammanslagningen av två eller flera verk. @sv
in scheme: Metatietosanasto
preferred label: merged to form work @en
preferred label: sammanslagen till verket @sv

sulautunut osittain teokseen
type: Concept
source: RDA-termi
source: RDA-term @sv
created: 2018-09-07
modified: 2025-08-21
Vastavuoroinen suhde: osittain sulautunut teos
alternative label: uppgått delvis i verket @sv
broader: myöhempi teos
definition: Teos, jonka sisältöön toisen teoksen osittainen sisältö on yhdistynyt. (RDA Registry)
definition: Verk med vars innehåll ett annat verks innehåll delvis har införlivats. @sv
in scheme: Metatietosanasto
preferred label: absorbed in part by work @en
preferred label: införlivat delvis i verket @sv

abstrakti
type: Concept
source: RDA-termi
source: RDA-term @sv
created: 2018-09-07
modified: 2025-01-03
Vastavuoroinen suhde: abstrakti teoksesta
alternative label: abstracted as work @en
alternative label: abstrakti (teos)
preferred label: abstract @en
alternative label: abstrakt (verk) @sv
broader: yhteenveto
definition: Teos, joka on teoksen objektiivinen yhteenveto. (RDA Registry)
definition: Verk som är en objektiv sammanfattning av ett verk. @sv
in scheme: Metatietosanasto
preferred label: abstrakt @sv

eronnut teokseksi
type: Concept
source: RDA-termi
source: RDA-term @sv
created: 2018-09-07
modified: 2025-06-04
Vastavuoroinen suhde: eronnut teoksesta
alternative label: continued in part by (work) @en
alternative label: jatkuu osittain teoksessa
alternative label: fortsättes delvis av verket @sv
alternative label: separerad till verket @sv
broader: myöhempi teos
definition: Teos, joka on diakroninen teos, joka jatkaa toisen diakronisen jatkuvan teoksen sisältöä osittain. (RDA Registry)
definition: Verk som är ett diakroniskt verk, som delvis fortsätter innehållet i ett annat diakroniskt kontinuerligt verk. @sv
in scheme: Metatietosanasto
preferred label: separated into work @en
preferred label: fortsätter delvis i verket @sv
scope note: Tämä elementti soveltuu yleensä peräkkäisesti ilmestyvään teokseen. (RDA Registry)
scope note: Detta element lämpar sig vanligen för successivt utkommande verk. @sv

osittain korvattu teoksella
type: Concept
source: RDA-termi
source: RDA-term @sv
created: 2018-09-07
modified: 2025-08-15
Vastavuoroinen suhde: korvaa osittain teoksen
broader: myöhempi teos
definition: Teos, jonka sisältö osittain korvaa ja tekee vanhentuneeksi toisen teoksen sisällön. (RDA Registry)
definition: Verk vars innehåll delvis ersätter ett annat verks innehåll, och gör det föråldrat. @sv
in scheme: Metatietosanasto
preferred label: replaced in part by work @en
preferred label: delvis ersatt av verket @sv
scope note: Tämä elementti soveltuu yleensä staattiseen teokseen tai päivittyvään teokseen. (RDA Registry)
scope note: Detta element lämpar sig vanligen för ett statiskt eller integrerande verk. @sv

musikaaliversio
type: Concept
source: RDA-termi
source: RDA-term @sv
created: 2018-09-07
modified: 2025-08-14
Vastavuoroinen suhde: musikaaliversio teoksesta
alternative label: adapted as musical theater work @en
alternative label: musikaaliversio (teos)
alternative label: sovitettu teoksen musikaaliversioksi
alternative label: bearbetad till musikalversion av verk @sv
alternative label: musikalversion (verk) @sv
broader: mukaelma
definition: Toiseen teokseen perustuva musikaaliteos. (RDA Registry)
definition: Musikalverk som grundar sig på ett annat verk. @sv
in scheme: Metatietosanasto
preferred label: adapted as musical theatre work @en
preferred label: musikalversion @sv

sulautunut teokseen
type: Concept
source: RDA-termi
source: RDA-term @sv
created: 2018-09-07
modified: 2025-08-21
Vastavuoroinen suhde: sulautunut teos
alternative label: uppgått i verket @sv
broader: myöhempi teos
definition: Teos, jonka sisältöön toisen teoksen sisältö on yhdistynyt. (RDA Registry)
definition: Verk med vars innehåll ett annat verks innehåll har införlivats. @sv
in scheme: Metatietosanasto
preferred label: absorbed by work @en
preferred label: införlivat i verket @sv

laajennelma
type: Concept
source: RDA-termi
source: RDA-term @sv
created: 2018-09-07
modified: 2025-07-04
Vastavuoroinen suhde: laajennettu versio teoksesta
alternative label: laajennelma (teos)
broader: johdannaisteos
definition: Teos, joka laajentaa toisen teoksen sisältöä. (RDA Registry)
definition: Verk som utvidgar innehållet i ett annat verk. @sv
in scheme: Metatietosanasto
preferred label: expanded as work @en
preferred label: utvidgat verk @sv

korvaava teos
type: Concept
source: RDA-termi
source: RDA-term @sv
created: 2018-09-07
modified: 2025-07-04
Vastavuoroinen suhde: korvaa teoksen
broader: myöhempi teos
definition: Teos, jonka sisältö korvaa ja tekee vanhentuneeksi toisen teoksen sisällön. (RDA Registry)
definition: Verk vars innehåll ett annat verks innehåll ersätter och gör föråldrat. @sv
in scheme: Metatietosanasto
preferred label: replaced by work @en
preferred label: ersättande verk @sv
scope note: Tämä elementti soveltuu yleensä staattiseen teokseen tai päivittyvään teokseen. (RDA Registry)
scope note: Detta element lämpar sig vanligen för ett statiskt eller integrerande verk. @sv

abstraktit (teos)
type: Concept
source: RDA-termi
source: RDA-term @sv
created: 2018-09-07
modified: 2026-05-26
Vastavuoroinen suhde: abstraktit teoksesta
alternative label: abstract @sv
alternative label: abstracter @sv
alternative label: abstrakter @sv
broader: johdannaisteos
definition: Teos, joka tiivistää toisen teoksen sisällön. (RDA Registry)
definition: Verk som sammanfattar innehållet i ett annat verk. @sv
in scheme: Metatietosanasto
preferred label: abstracted in work @en
preferred label: abstrakt (verk) @sv

parodia
type: Concept
source: RDA-termi
source: RDA-term @sv
created: 2018-09-07
modified: 2025-08-16
Vastavuoroinen suhde: parodia teoksesta
alternative label: parodia (teos)
alternative label: parodi (verk) @sv
broader: jäljitelmä
definition: Teos, joka jäljittelee toisen teoksen tyyliä tai sisältöä humoristisesti. (RDA Registry)
definition: Verk som imiterar ett annat verks stil eller innehåll humoristiskt. @sv
in scheme: Metatietosanasto
preferred label: parodied as work @en
preferred label: parodi @sv

lyhennelmä
type: Concept
source: RDA-termi
source: RDA-term @sv
created: 2018-09-07
modified: 2025-07-05
Vastavuoroinen suhde: lyhennelmä teoksesta
alternative label: lyhennelmä (teos)
alternative label: förkortning (verk) @sv
broader: johdannaisteos
definition: Teos, joka lyhentää siihen liittyvää teosta muuttamatta sen merkityssisältöä tai esitystyyliä. (RDA Registry)
definition: Verk som förkortar ett relaterat verk, utan att ändra dess betydelsemässiga innehåll eller presentationssätt. @sv
in scheme: Metatietosanasto
preferred label: abridged as work @en
preferred label: förkortning @sv

seuraaja
type: Concept
source: RDA-termi
source: RDA-term @sv
created: 2018-09-07
modified: 2025-08-19
Vastavuoroinen suhde: jatkoa teokselle
alternative label: seuraaja (teos)
alternative label: fortsättes av (verk) @sv
broader: myöhempi teos
definition: Teos, joka on diakroninen teos, joka jatkaa toisen, valmiin diakronisen teoksen sisältöä. (RDA Registry)
definition: Verk som är ett diakroniskt verk, som fortsätter innehållet i ett annat färdigt diakroniskt verk. @sv
in scheme: Metatietosanasto
preferred label: continued by work @en
preferred label: fortsättes av @sv
scope note: Tämä elementti soveltuu yleensä peräkkäisesti ilmestyvään teokseen. (RDA Registry)
scope note: Detta element lämpar sig vanligen för successivt utkommande verk. @sv

dramatisointi
type: Concept
source: RDA-termi
source: RDA-term @sv
created: 2018-09-07
modified: 2025-04-16
Vastavuoroinen suhde: dramatisointi teoksesta
alternative label: dramatisointi (teos)
alternative label: dramatisering (verk) @sv
broader: mukaelma
definition: Teos, joka on draamateos, joka on sovitettu toisesta teoksesta. (RDA Registry)
definition: Verk som är ett dramaverk, som omarbetats från ett annat verk. @sv
in scheme: Metatietosanasto
preferred label: dramatized as work @en
preferred label: dramatisering @sv

oopperasovitus
type: Concept
source: RDA-termi
source: RDA-term @sv
created: 2018-09-08
modified: 2025-08-15
Vastavuoroinen suhde: oopperasovitus teoksesta
alternative label: oopperasovitus (teos)
alternative label: operabearbetning (verk) @sv
broader: mukaelma
definition: Teos, joka on ooppera, joka perustuu toiseen teokseen. (RDA Registry)
definition: Verk som är en opera, som grundar sig på ett annat verk. @sv
in scheme: Metatietosanasto
preferred label: adapted as opera work @en
preferred label: operabearbetning @sv

oratoriosovitus
type: Concept
source: RDA-termi
source: RDA-term @sv
created: 2018-09-08
modified: 2025-08-15
Vastavuoroinen suhde: oratoriosovitus teoksesta
alternative label: oratoriosovitus (teos)
alternative label: oratoriebearbetning (verk) @sv
broader: mukaelma
definition: Teos, joka on oratorio, joka perustuu toiseen teokseen. (RDA Registry)
definition: Verk som är ett oratorium, som grundar sig på ett annat verk. @sv
in scheme: Metatietosanasto
preferred label: adapted as oratorio work @en
preferred label: oratoriebearbetning @sv

koulutoimenjohtaja
type: Concept
source: Kansallinen RDA-termi
source: YSO-termi
source: ALLFO-term @sv
source: Nationell RDA-term @sv
created: 2018-11-01
modified: 2024-08-27
alternative label: chief education officers @en
alternative label: heads of local education department @en
alternative label: koulutoimenjohtajat
alternative label: skoldirektörer @sv
broader: johtaja
in scheme: Metatietosanasto
narrower: sairaalanjohtaja
preferred label: chief education officer @en
preferred label: skoldirektör @sv

liikenneopettaja
type: Concept
source: Kansallinen RDA-termi
source: YSO-termi
source: ALLFO-term @sv
source: Nationell RDA-term @sv
created: 2018-11-01
modified: 2024-08-27
alternative label: driving instructors @en
alternative label: liikenneopettajat
broader: opettaja
in scheme: Metatietosanasto
narrower: matkanjohtaja
preferred label: driving instructor @en
preferred label: trafiklärare @sv

lapsityönohjaaja
type: Concept
source: Kansallinen RDA-termi
source: YSO-termi
source: ALLFO-term @sv
source: Nationell RDA-term @sv
created: 2018-11-01
modified: 2025-08-20
alternative label: child work leaders @en
alternative label: lapsityönohjaajat
alternative label: barnarbetsledare @sv
alternative label: ledare för barnverksamhet @sv
broader: ohjaaja (kasvatus ja opastus)
broader: kirkon työntekijä
in scheme: Metatietosanasto
preferred label: child work leader @en
preferred label: barnverksamhetsledare @sv

leipuri
type: Concept
source: Kansallinen RDA-termi
source: YSO-termi
source: ALLFO-term @sv
source: Nationell RDA-term @sv
created: 2018-11-01
modified: 2024-08-27
alternative label: bakers @en
alternative label: leipurit
in scheme: Metatietosanasto
narrower: kondiittori
narrower: leipurimestari
preferred label: baker @en
preferred label: bagare @sv

työnjohtaja
type: Concept
source: Kansallinen RDA-termi
source: YSO-termi
source: ALLFO-term @sv
source: Nationell RDA-term @sv
created: 2018-11-01
modified: 2025-08-20
alternative label: forepersons @en
alternative label: työnjohtajat
broader: johtaja
in scheme: Metatietosanasto
narrower: metsätyönjohtaja
preferred label: foreperson @en
preferred label: arbetsledare @sv

yhteiskunnallinen vaikuttaja
type: Concept
source: Kansallinen RDA-termi
source: YSO-termi
source: ALLFO-term @sv
source: Nationell RDA-term @sv
created: 2018-11-01
modified: 2024-08-27
alternative label: people with societal influence @en
alternative label: yhteiskunnalliset vaikuttajat
in scheme: Metatietosanasto
narrower: kulttuurivaikuttaja
narrower: urheiluvaikuttaja
preferred label: person with societal influence @en
preferred label: samhällspåverkare @sv

maanviljelijä
type: Concept
source: Kansallinen RDA-termi
source: YSO-termi
source: ALLFO-term @sv
source: Nationell RDA-term @sv
created: 2018-11-01
modified: 2024-08-27
alternative label: farmers @en
alternative label: maanviljelijät
alternative label: viljelijät
alternative label: lantbrukare @sv
alternative label: odlare @sv
broader: maatalousyrittäjä
in scheme: Metatietosanasto
narrower: pienviljelijä
preferred label: farmer @en
preferred label: jordbrukare @sv

kestävyysjuoksija
type: Concept
source: Kansallinen RDA-termi
source: YSO-termi
source: ALLFO-term @sv
source: Nationell RDA-term @sv
created: 2018-11-01
modified: 2024-08-27
alternative label: kestävyysjuoksijat
broader: juoksija
in scheme: Metatietosanasto
narrower: maratoonari
preferred label: långdistanslöpare @sv

kuvanveistäjä
type: Concept
source: Kansallinen RDA-termi
source: YSO-termi
source: ALLFO-term @sv
source: Nationell RDA-term @sv
created: 2018-11-01
modified: 2024-08-27
alternative label: kuvanveistäjä (ammatti)
alternative label: skulptör (yrke) @sv
broader: kuvataiteilija
in scheme: Metatietosanasto
narrower: markkinointisuunnittelija
preferred label: sculptor @en
preferred label: skulptör @sv

kaupallinen sihteeri
type: Concept
source: Kansallinen RDA-termi
source: YSO-termi
source: ALLFO-term @sv
source: Nationell RDA-term @sv
created: 2018-11-01
modified: 2024-08-27
alternative label: commercial secretaries @en
alternative label: kaupalliset sihteerit
broader: virkamies
broader: sihteeri
in scheme: Metatietosanasto
preferred label: commercial secretary @en
preferred label: handelssekreterare @sv

viulisti
type: Concept
source: Kansallinen RDA-termi
source: YSO-termi
source: ALLFO-term @sv
source: Nationell RDA-term @sv
created: 2018-11-01
modified: 2024-08-27
alternative label: violinists @en
alternative label: viulistit
alternative label: violaster @sv
alternative label: violinister @sv
broader: soittaja
in scheme: Metatietosanasto
narrower: konserttimestari
preferred label: violinist @en

sosiaalityöntekijä
type: Concept
source: Kansallinen RDA-termi
source: YSO-termi
source: ALLFO-term @sv
source: Nationell RDA-term @sv
created: 2018-11-01
modified: 2024-08-27
alternative label: social workers @en
alternative label: sosiaalityöntekijät
broader: työntekijä
in scheme: Metatietosanasto
narrower: sosiaaliterapeutti
preferred label: social worker @en
preferred label: socialarbetare @sv

teatterimuusikko
type: Concept
source: Kansallinen RDA-termi
source: YSO-termi
source: ALLFO-term @sv
source: Nationell RDA-term @sv
created: 2018-11-01
modified: 2024-08-27
alternative label: theatre musicians @en
alternative label: teatterimuusikot
broader: muusikko
broader: näyttämötaiteilija
in scheme: Metatietosanasto
preferred label: theatre musician @en
preferred label: teatermusiker @sv

uutispäällikkö
type: Concept
source: Kansallinen RDA-termi
source: YSO-termi
source: ALLFO-term @sv
source: Nationell RDA-term @sv
created: 2018-11-01
modified: 2024-08-27
alternative label: news editors @en
alternative label: uutispäälliköt
alternative label: nyhetschefer @sv
broader: päällikkö
broader: toimittaja
in scheme: Metatietosanasto
preferred label: news editor @en
preferred label: nyhetschef @sv

kaupunginjohtaja
type: Concept
source: Kansallinen RDA-termi
source: YSO-termi
source: ALLFO-term @sv
source: Nationell RDA-term @sv
created: 2018-11-01
modified: 2024-08-27
alternative label: kaupunginjohtaja (ammatti)
alternative label: stadsdirektör (yrke) @sv
broader: kuntajohtaja
in scheme: Metatietosanasto
narrower: apulaiskaupunginjohtaja
preferred label: stadsdirektör @sv

rautatieläinen
type: Concept
source: Kansallinen RDA-termi
source: YSO-termi
source: ALLFO-term @sv
source: Nationell RDA-term @sv
created: 2018-11-01
modified: 2024-08-27
alternative label: railway workers @en
alternative label: rautatieläiset
alternative label: järnvägsarbetare @sv
alternative label: järnvägsmän @sv
in scheme: Metatietosanasto
narrower: veturinkuljettaja
narrower: junamies
preferred label: railway worker @en
preferred label: järnvägare @sv

tulkki
type: Concept
source: Kansallinen RDA-termi
source: YSO-termi
source: ALLFO-term @sv
source: Nationell RDA-term @sv
created: 2018-11-01
modified: 2024-08-27
alternative label: interpreters @en
alternative label: tulkit
alternative label: tolkar @sv
in scheme: Metatietosanasto
narrower: puhevammaisten tulkki
narrower: viittomakielentulkki
preferred label: interpreter @en
preferred label: tolk @sv

lyömäsoittaja
type: Concept
source: Kansallinen RDA-termi
source: YSO-termi
source: ALLFO-term @sv
source: Nationell RDA-term @sv
created: 2018-11-01
modified: 2024-08-27
alternative label: percussionists @en
alternative label: lyömäsoittajat
alternative label: perkussionistit
alternative label: perkussionister @sv
broader: soittaja
in scheme: Metatietosanasto
narrower: rumpali
preferred label: percussionist @en
preferred label: slagverkare @sv

toimituspäällikkö
type: Concept
source: Kansallinen RDA-termi
source: YSO-termi
source: ALLFO-term @sv
source: Nationell RDA-term @sv
created: 2018-11-01
modified: 2024-08-27
alternative label: managing editors @en
alternative label: toimituspäälliköt
alternative label: redaktionschefer @sv
broader: päällikkö
broader: toimittaja
in scheme: Metatietosanasto
preferred label: managing editor @en
preferred label: redaktionschef @sv

luistelija
type: Concept
source: Kansallinen RDA-termi
source: YSO-termi
source: ALLFO-term @sv
source: Nationell RDA-term @sv
created: 2018-11-01
modified: 2024-08-27
alternative label: skaters @en
alternative label: luistelijat
alternative label: skridskoåkare @sv
broader: urheilija
in scheme: Metatietosanasto
narrower: pikaluistelija
preferred label: skater @en
preferred label: skrinnare @sv

kansleri
type: Concept
source: Kansallinen RDA-termi
source: YSO-termi
source: ALLFO-term @sv
source: Nationell RDA-term @sv
created: 2018-11-01
modified: 2024-08-27
alternative label: chancellors @en
alternative label: kanslerit
alternative label: kanslerer @sv
broader: virkamies
in scheme: Metatietosanasto
narrower: liittokansleri
preferred label: chancellor @en
preferred label: kansler @sv

ääniteknikko
type: Concept
source: Kansallinen RDA-termi
source: YSO-termi
source: ALLFO-term @sv
source: Nationell RDA-term @sv
created: 2018-11-01
modified: 2024-08-27
alternative label: sound engineers @en
alternative label: ääniteknikot
broader: teknikko
in scheme: Metatietosanasto
narrower: miksaaja
preferred label: sound engineer @en
preferred label: ljudtekniker @sv

kirkkomuusikko
type: Concept
source: Kansallinen RDA-termi
source: YSO-termi
source: ALLFO-term @sv
source: Nationell RDA-term @sv
created: 2018-11-01
modified: 2024-08-27
alternative label: church musicians @en
alternative label: kirkkomuusikot
broader: muusikko
in scheme: Metatietosanasto
narrower: kanttori
preferred label: church musician @en
preferred label: kyrkomusiker @sv

tekstiilitaiteilija
type: Concept
source: Kansallinen RDA-termi
source: YSO-termi
source: ALLFO-term @sv
source: Nationell RDA-term @sv
created: 2018-11-01
modified: 2024-08-27
alternative label: textile artists @en
alternative label: tekstiilitaiteilijat
alternative label: textilkonstnärer @sv
broader: taiteilija
broader: taidekäsityöläinen
in scheme: Metatietosanasto
preferred label: textile artist @en
preferred label: textilkonstnär @sv

elintarviketeknikko
type: Concept
source: Kansallinen RDA-termi
source: YSO-termi
source: ALLFO-term @sv
source: Nationell RDA-term @sv
created: 2018-11-01
modified: 2024-08-27
alternative label: food technician engineers @en
alternative label: elintarviketeknikot
broader: teknikko
in scheme: Metatietosanasto
narrower: meijeriteknikko
preferred label: food technician @en
preferred label: livsmedelstekniker @sv

piispa
type: Concept
source: Kansallinen RDA-termi
source: YSO-termi
source: ALLFO-term @sv
source: Nationell RDA-term @sv
created: 2018-11-01
modified: 2024-08-27
alternative label: bishops @en
alternative label: piispat
alternative label: biskopar @sv
broader: kirkon työntekijä
in scheme: Metatietosanasto
narrower: arkkipiispa
preferred label: bishop @en
preferred label: biskop @sv

veturinkuljettaja
type: Concept
source: Kansallinen RDA-termi
source: YSO-termi
source: ALLFO-term @sv
source: Nationell RDA-term @sv
created: 2018-11-01
modified: 2024-08-27
alternative label: locomotive engineers @en
alternative label: railway locomotive drivers @en
alternative label: veturimiehet
alternative label: veturinkuljettajat
alternative label: lokmän @sv
broader: rautatieläinen
broader: kuljettaja
in scheme: Metatietosanasto
preferred label: locomotive engineer @en
preferred label: lokförare @sv

kansansoittaja
type: Concept
source: Kansallinen RDA-termi
source: YSO-termi
source: ALLFO-term @sv
source: Nationell RDA-term @sv
created: 2018-11-01
modified: 2024-08-27
alternative label: kansanmuusikko
alternative label: pelimanni
alternative label: perinnemuusikko
broader: soittaja
broader: perinteentaitaja
in scheme: Metatietosanasto
preferred label: player of folk music @en
preferred label: spelman @sv

kansliapäällikkö
type: Concept
source: Kansallinen RDA-termi
source: YSO-termi
source: ALLFO-term @sv
source: Nationell RDA-term @sv
created: 2018-11-01
modified: 2024-08-27
alternative label: chief secretaries @en
alternative label: permanent under-secretaries of state @en
alternative label: kansliapäälliköt
alternative label: kanslichefer @sv
broader: päällikkö
broader: virkamies
in scheme: Metatietosanasto
preferred label: chief secretary @en
preferred label: kanslichef @sv

kouluttaja
type: Concept
source: Kansallinen RDA-termi
source: YSO-termi
source: ALLFO-term @sv
source: Nationell RDA-term @sv
created: 2018-11-01
modified: 2024-08-27
alternative label: trainers @en
alternative label: kouluttajat
in scheme: Metatietosanasto
narrower: aikuiskouluttaja
narrower: eläintenkouluttaja
preferred label: trainer (education) @en
preferred label: utbildare @sv

oikeusasiamies
type: Concept
source: Kansallinen RDA-termi
source: YSO-termi
source: ALLFO-term @sv
source: Nationell RDA-term @sv
created: 2018-11-01
modified: 2024-08-27
alternative label: parliamentary ombudsmen @en
alternative label: parliamentary ombudspersons @en
alternative label: oikeusasiamiehet
alternative label: justitieombudsmän @sv
broader: asiamies
in scheme: Metatietosanasto
narrower: eduskunnan oikeusasiamies
preferred label: parliamentary ombudsman @en
preferred label: justitieombudsman @sv

truveeri
type: Concept
source: Kansallinen RDA-termi
source: YSO-termi
source: ALLFO-term @sv
source: Nationell RDA-term @sv
created: 2018-11-01
modified: 2024-08-27
alternative label: trouvères @en
alternative label: truveerit
broader: muusikko
broader: runoilija
in scheme: Metatietosanasto
preferred label: trouvère @en
preferred label: trouverer @sv

ammatillinen opettaja
type: Concept
source: Kansallinen RDA-termi
source: YSO-termi
source: ALLFO-term @sv
source: Nationell RDA-term @sv
created: 2018-11-01
modified: 2024-08-27
alternative label: vocational teachers @en
alternative label: ammatilliset opettajat
alternative label: lärare för yrkesstudier @sv
alternative label: yrkespedagoger @sv
alternative label: yrkesskollärare @sv
broader: opettaja
in scheme: Metatietosanasto
narrower: ammatillisten opintojen opettaja
preferred label: vocational teacher @en
preferred label: yrkeslärare @sv

sotilaslentäjä
type: Concept
source: Kansallinen RDA-termi
source: YSO-termi
source: ALLFO-term @sv
source: Nationell RDA-term @sv
created: 2018-11-01
modified: 2024-08-27
alternative label: military air pilots @en
alternative label: military pilots @en
alternative label: hävittäjälentäjät
alternative label: sotilaslentäjät
alternative label: taistelulentäjät
alternative label: jaktflygare @sv
broader: lentäjä
in scheme: Metatietosanasto
narrower: lentomestari
preferred label: military pilot @en
preferred label: militärflygare @sv

minnelaulaja
type: Concept
source: Kansallinen RDA-termi
source: YSO-termi
source: ALLFO-term @sv
source: Nationell RDA-term @sv
created: 2018-11-01
modified: 2024-08-27
alternative label: minnesingers @en
alternative label: minnelaulajat
broader: muusikko
broader: runoilija
in scheme: Metatietosanasto
preferred label: minnesinger @en
preferred label: minnesångare @sv

sotilas
type: Concept
source: Kansallinen RDA-termi
source: YSO-termi
source: ALLFO-term @sv
source: Nationell RDA-term @sv
created: 2018-11-01
modified: 2024-08-27
alternative label: soldiers @en
alternative label: sotilaat
alternative label: soldater @sv
in scheme: Metatietosanasto
narrower: rauhanturvaaja
narrower: jääkäri
preferred label: soldier @en
preferred label: soldat @sv

keramiikkataiteilija
type: Concept
source: Kansallinen RDA-termi
source: YSO-termi
source: ALLFO-term @sv
source: Nationell RDA-term @sv
created: 2018-11-01
modified: 2024-08-27
alternative label: ceramic artists @en
alternative label: keraamikot
alternative label: keramiikkataiteilijat
broader: taiteilija
broader: taidekäsityöläinen
in scheme: Metatietosanasto
preferred label: ceramic artist @en
preferred label: keramiker @sv

juristi
type: Concept
source: Kansallinen RDA-termi
source: YSO-termi
source: ALLFO-term @sv
source: Nationell RDA-term @sv
created: 2018-11-01
modified: 2024-08-27
alternative label: lawyers @en
alternative label: juristit
alternative label: lakimiehet
alternative label: lakinaiset
alternative label: jurister @sv
in scheme: Metatietosanasto
narrower: asianajaja
narrower: tuomari (oikeus)
preferred label: lawyer @en
preferred label: jurist @sv

maalari
type: Concept
source: Kansallinen RDA-termi
source: YSO-termi
source: ALLFO-term @sv
source: Nationell RDA-term @sv
created: 2018-11-01
modified: 2024-08-27
alternative label: painters @en
alternative label: maalarit
alternative label: målare @sv
in scheme: Metatietosanasto
narrower: maalarimestari
narrower: automaalari
preferred label: painter (occupation) @en
preferred label: målare (hantverkare) @sv

palomies
type: Concept
source: Kansallinen RDA-termi
source: YSO-termi
source: ALLFO-term @sv
source: Nationell RDA-term @sv
created: 2018-11-01
modified: 2024-08-27
alternative label: fire fighters @en
alternative label: palomiehet
alternative label: brandmän @sv
in scheme: Metatietosanasto
narrower: palomestari
narrower: palopäällikkö
preferred label: fire fighter @en
preferred label: brandman @sv

liiketyöntekijä
type: Concept
source: Kansallinen RDA-termi
source: YSO-termi
source: ALLFO-term @sv
source: Nationell RDA-term @sv
created: 2018-11-01
modified: 2024-08-27
alternative label: business employees @en
alternative label: kaupan työntekijät
alternative label: liiketyöntekijät
alternative label: affärsanställda @sv
alternative label: handelsanställda @sv
broader: työntekijä
in scheme: Metatietosanasto
narrower: myyjä
preferred label: business employee @en
preferred label: handelsanställd @sv

kilpa-autoilija
type: Concept
source: Kansallinen RDA-termi
source: YSO-termi
source: ALLFO-term @sv
source: Nationell RDA-term @sv
created: 2018-11-01
modified: 2024-08-27
alternative label: race drivers @en
alternative label: racing drivers @en
alternative label: autourheilijat
alternative label: formulakuljettajat
alternative label: kilpa-autoilijat
alternative label: ralliautoilijat
alternative label: rallyförare @sv
broader: urheilija
in scheme: Metatietosanasto
narrower: kartanlukija
preferred label: race driver @en
preferred label: racerförare @sv

nuorisotyönohjaaja
type: Concept
source: Kansallinen RDA-termi
source: YSO-termi
source: ALLFO-term @sv
source: Nationell RDA-term @sv
created: 2018-11-01
modified: 2024-08-27
alternative label: church youth work leaders @en
alternative label: nuorisotyönohjaajat
alternative label: ledare för ungdomsverksamhet @sv
alternative label: ungdomsledare @sv
alternative label: ungdomsverksamhetsledare @sv
broader: ohjaaja (kasvatus ja opastus)
broader: kirkon työntekijä
in scheme: Metatietosanasto
preferred label: church youth work leader @en
preferred label: ungdomsarbetsledare @sv

kansanlaulaja
type: Concept
source: Kansallinen RDA-termi
source: YSO-termi
source: ALLFO-term @sv
source: Nationell RDA-term @sv
created: 2018-11-01
modified: 2024-08-27
alternative label: kansanmuusikko
broader: laulaja
broader: perinteentaitaja
in scheme: Metatietosanasto
preferred label: folk singer @en
preferred label: folksångare @sv

teollisuussihteeri
type: Concept
source: Kansallinen RDA-termi
source: YSO-termi
source: ALLFO-term @sv
source: Nationell RDA-term @sv
created: 2018-11-01
modified: 2024-08-27
alternative label: industrial secretaries @en
alternative label: teollisuussihteerit
broader: virkamies
broader: sihteeri
in scheme: Metatietosanasto
preferred label: industrial secretary @en
preferred label: industrisekreterare @sv

kirjapainotyöntekijä
type: Concept
source: Kansallinen RDA-termi
source: YSO-termi
source: ALLFO-term @sv
source: Nationell RDA-term @sv
created: 2018-11-01
modified: 2024-08-27
alternative label: printing trade workers @en
alternative label: kirjapainotyöntekijät
alternative label: grafiker @sv
broader: työntekijä
in scheme: Metatietosanasto
narrower: latoja
preferred label: printing house worker @en
preferred label: boktryckeriarbetare @sv

vartija
type: Concept
source: Kansallinen RDA-termi
source: YSO-termi
source: ALLFO-term @sv
source: Nationell RDA-term @sv
created: 2018-11-01
modified: 2024-08-27
alternative label: guards @en
alternative label: vartijat
in scheme: Metatietosanasto
narrower: museovartija
narrower: ratavartija
preferred label: guard @en
preferred label: väktare @sv

valtiosihteeri
type: Concept
source: Kansallinen RDA-termi
source: YSO-termi
source: ALLFO-term @sv
source: Nationell RDA-term @sv
created: 2018-11-01
modified: 2024-08-27
alternative label: secretaries of state @en
alternative label: state secretaries @en
alternative label: valtiosihteerit
broader: virkamies
broader: sihteeri
in scheme: Metatietosanasto
preferred label: state secretary @en
preferred label: statssekreterare @sv

taitoluistelija
type: Concept
source: Kansallinen RDA-termi
source: YSO-termi
source: ALLFO-term @sv
source: Nationell RDA-term @sv
created: 2018-11-01
modified: 2024-08-27
alternative label: figure skaters @en
alternative label: taitoluistelijat
broader: urheilija
in scheme: Metatietosanasto
narrower: jäätanssija
preferred label: figure skater @en
preferred label: konståkare @sv

katusoittaja
type: Concept
source: Kansallinen RDA-termi
source: YSO-termi
source: ALLFO-term @sv
source: Nationell RDA-term @sv
created: 2018-11-01
modified: 2024-08-27
alternative label: street musicians @en
alternative label: katusoittajat
alternative label: gatumusikanter @sv
broader: muusikko
broader: esittäjä
in scheme: Metatietosanasto
preferred label: street musician @en
preferred label: gatumusikant @sv

kansankirjailija
type: Concept
source: Kansallinen RDA-termi
source: YSO-termi
source: ALLFO-term @sv
source: Nationell RDA-term @sv
created: 2018-11-01
modified: 2024-08-27
alternative label: folk writers @en
alternative label: kansankirjailijat
alternative label: folkliga författare @sv
broader: kirjailija
in scheme: Metatietosanasto
narrower: rahvaanrunoilija
preferred label: folk writer @en
preferred label: folklig författare @sv

postivirkamies
type: Concept
source: Kansallinen RDA-termi
source: YSO-termi
source: ALLFO-term @sv
source: Nationell RDA-term @sv
created: 2018-11-01
modified: 2024-08-27
alternative label: postal officials @en
alternative label: postivirkamiehet
alternative label: posttjänstemän @sv
broader: virkamies
broader: postityöntekijä
in scheme: Metatietosanasto
preferred label: postal official @en
preferred label: posttjänsteman @sv

korutaiteilija
type: Concept
source: Kansallinen RDA-termi
source: YSO-termi
source: ALLFO-term @sv
source: Nationell RDA-term @sv
created: 2018-11-01
modified: 2024-08-27
alternative label: jewellery artists @en
alternative label: korutaiteilijat
alternative label: smyckekonstnärer @sv
alternative label: smyckeskonstnärer @sv
broader: taiteilija
broader: taidekäsityöläinen
in scheme: Metatietosanasto
preferred label: jewellery artist @en
preferred label: smyckekonstnär @sv

kanttori
type: Concept
source: Kansallinen RDA-termi
source: YSO-termi
source: ALLFO-term @sv
source: Nationell RDA-term @sv
created: 2018-11-01
modified: 2024-08-27
alternative label: cantors @en
alternative label: kanttori-urkurit
alternative label: kanttorit
alternative label: kantorer @sv
broader: kirkkomuusikko
broader: kirkon työntekijä
in scheme: Metatietosanasto
preferred label: cantor @en
preferred label: kantor @sv

kuoronjohtaja
type: Concept
source: Kansallinen RDA-termi
source: YSO-termi
source: ALLFO-term @sv
source: Nationell RDA-term @sv
created: 2018-11-01
modified: 2024-08-27
alternative label: kuoronjohtaja (ammatti)
alternative label: kördirigent (yrke) @sv
alternative label: körledare @sv
broader: muusikko
broader: esittäjä
in scheme: Metatietosanasto
preferred label: choirmaster @en
preferred label: kördirigent @sv

palopäällikkö
type: Concept
source: Kansallinen RDA-termi
source: YSO-termi
source: ALLFO-term @sv
source: Nationell RDA-term @sv
created: 2018-11-01
modified: 2024-08-27
alternative label: chief fire officers @en
alternative label: heads of fire department @en
alternative label: palopäälliköt
alternative label: brandchefer @sv
broader: päällikkö
broader: palomies
in scheme: Metatietosanasto
preferred label: head of fire department @en
preferred label: brandchef @sv

lähetyssihteeri
type: Concept
source: Kansallinen RDA-termi
source: YSO-termi
source: ALLFO-term @sv
source: Nationell RDA-term @sv
created: 2018-11-01
modified: 2024-08-27
alternative label: mission secretaries @en
alternative label: lähetyssihteerit
broader: sihteeri
broader: kirkon työntekijä
in scheme: Metatietosanasto
preferred label: mission secretary @en
preferred label: missionssekreterare @sv

soitinrakentaja
type: Concept
source: Kansallinen RDA-termi
source: YSO-termi
source: ALLFO-term @sv
source: Nationell RDA-term @sv
created: 2018-11-01
modified: 2024-08-27
alternative label: luthiers @en
alternative label: makers of musical instruments @en
alternative label: soitinrakentajat
alternative label: soittimentekijät
alternative label: soittimien rakentajat
in scheme: Metatietosanasto
narrower: viulunrakentaja
narrower: urkujenrakentaja
preferred label: maker of musical instruments @en
preferred label: instrumentbyggare @sv

peltiseppä
type: Concept
source: Kansallinen RDA-termi
source: YSO-termi
source: ALLFO-term @sv
source: Nationell RDA-term @sv
created: 2018-11-01
modified: 2024-08-27
alternative label: sheet metal workers @en
alternative label: peltisepät
broader: seppä
in scheme: Metatietosanasto
narrower: rakennuspeltiseppä
preferred label: sheet metal worker @en
preferred label: plåtslagare @sv

laulaja-lauluntekijä
type: Concept
source: Kansallinen RDA-termi
source: YSO-termi
source: ALLFO-term @sv
source: Nationell RDA-term @sv
created: 2018-11-01
modified: 2024-08-27
alternative label: singer-songwriters
alternative label: laulaja-lauluntekijät
alternative label: sångare-låtskrivare @sv
broader: laulaja
broader: säveltäjä
in scheme: Metatietosanasto
preferred label: singer-songwriter @en

lastentarhanopettaja
type: Concept
source: Kansallinen RDA-termi
source: YSO-termi
source: ALLFO-term @sv
source: Nationell RDA-term @sv
created: 2018-11-01
modified: 2024-08-27
alternative label: lastentarhanopettaja (ammatti)
alternative label: barnträdgårdslärare (yrke) @sv
broader: opettaja
in scheme: Metatietosanasto
narrower: erityislastentarhanopettaja
preferred label: kindergarten teacher @en
preferred label: barnträdgårdslärare @sv

kirurgi
type: Concept
source: Kansallinen RDA-termi
source: YSO-termi
source: ALLFO-term @sv
source: Nationell RDA-term @sv
created: 2018-11-01
modified: 2024-08-27
alternative label: surgeons @en
alternative label: kirurgit
alternative label: kirurger @sv
broader: lääkäri
in scheme: Metatietosanasto
narrower: lastenkirurgi
preferred label: surgeon @en
preferred label: kirurg @sv

tuomari (oikeus)
type: Concept
source: Kansallinen RDA-termi
source: YSO-termi
source: ALLFO-term @sv
source: Nationell RDA-term @sv
created: 2018-11-01
modified: 2024-08-27
alternative label: judges @en
alternative label: tuomarit
alternative label: domare @sv
broader: juristi
in scheme: Metatietosanasto
narrower: kihlakunnantuomari
preferred label: judge @en
preferred label: domare (juridik) @sv

lasitaiteilija
type: Concept
source: Kansallinen RDA-termi
source: YSO-termi
source: ALLFO-term @sv
source: Nationell RDA-term @sv
created: 2018-11-01
modified: 2024-08-27
alternative label: glass artists @en
alternative label: lasitaiteilijat
alternative label: glaskonstnärer @sv
broader: taiteilija
broader: taidekäsityöläinen
in scheme: Metatietosanasto
preferred label: glass artist @en
preferred label: glaskonstnär @sv

rahvaanrunoilija
type: Concept
source: Kansallinen RDA-termi
source: YSO-termi
source: ALLFO-term @sv
source: Nationell RDA-term @sv
created: 2018-11-01
modified: 2024-08-27
alternative label: poets of the common people @en
alternative label: kansanrunoilijat
alternative label: rahvaanrunoilijat
broader: kansankirjailija
broader: runoilija
in scheme: Metatietosanasto
preferred label: poet of the common people @en
preferred label: folkdiktare @sv

sotilaspappi
type: Concept
source: Kansallinen RDA-termi
source: YSO-termi
source: ALLFO-term @sv
source: Nationell RDA-term @sv
created: 2018-11-01
modified: 2024-08-27
alternative label: military chaplains @en
alternative label: sotilaspapit
alternative label: sotilaspastori
alternative label: sotilaspastorit
alternative label: militärpastor @sv
alternative label: militärpräster @sv
broader: sotilashenkilö
broader: pappi
in scheme: Metatietosanasto
preferred label: military chaplain @en
preferred label: militärpräst @sv

trubaduuri
type: Concept
source: Kansallinen RDA-termi
source: YSO-termi
source: ALLFO-term @sv
source: Nationell RDA-term @sv
created: 2018-11-01
modified: 2024-08-27
alternative label: troubadours @en
alternative label: trubaduurit
alternative label: trubadurer @sv
broader: muusikko
broader: runoilija
in scheme: Metatietosanasto
preferred label: troubadour @en
preferred label: trubadur @sv

teatteriohjaaja
type: Concept
source: Kansallinen RDA-termi
source: YSO-termi
source: ALLFO-term @sv
source: Nationell RDA-term @sv
created: 2018-11-01
modified: 2024-08-27
alternative label: theatre directors @en
alternative label: teatteriohjaajat
alternative label: teaterregissörer @sv
broader: näyttämötaiteilija
broader: ohjaaja (taiteet ja media)
in scheme: Metatietosanasto
preferred label: theatre director @en
preferred label: teaterregissör @sv

käsityönopettaja
type: Concept
source: Kansallinen RDA-termi
source: YSO-termi
source: ALLFO-term @sv
source: Nationell RDA-term @sv
created: 2018-11-01
modified: 2024-08-27
alternative label: handicrafts teacher @en
alternative label: käsityönopettaja (ammatti)
alternative label: slöjd- och textillärare (yrke) @sv
broader: aineenopettaja
in scheme: Metatietosanasto
narrower: tekstiilityöopettaja
preferred label: craft teacher @en
preferred label: slöjd- och textillärare @sv

professori
type: Concept
source: Kansallinen RDA-termi
source: YSO-termi
source: ALLFO-term @sv
source: Nationell RDA-term @sv
created: 2018-11-01
modified: 2024-08-27
alternative label: professori (ammatti)
alternative label: professor (yrke) @sv
in scheme: Metatietosanasto
narrower: taiteilijaprofessori
narrower: apulaisprofessori
preferred label: professor @sv

opinto-ohjaaja
type: Concept
source: Kansallinen RDA-termi
source: YSO-termi
source: ALLFO-term @sv
source: Nationell RDA-term @sv
created: 2018-11-01
modified: 2024-08-27
alternative label: opinto-ohjaaja (ammatti)
alternative label: studiehandledare (yrke) @sv
broader: ohjaaja (kasvatus ja opastus)
broader: opettaja
in scheme: Metatietosanasto
preferred label: study counsellor @en
preferred label: studiehandledare @sv

parafraasi
type: Concept
source: RDA-termi
source: RDA-term @sv
created: 2018-11-13
modified: 2025-08-16
Vastavuoroinen suhde: parafraasi teoksesta
alternative label: parafraasi (teos)
alternative label: parafras (verk) @sv
broader: muunnos tyylissä
definition: Teos, joka toisintaa toisen teoksen sisällön eri muodossa. (RDA Registry)
definition: Verk som återger ett annat verks innehåll i en annan form. @sv
in scheme: Metatietosanasto
preferred label: paraphrased as work @en
preferred label: parafras @sv

uusintaproduktio
type: Concept
source: RDA-termi
source: RDA-term @sv
created: 2018-11-13
modified: 2025-08-23
Vastavuoroinen suhde: uusintaproduktio teoksesta
alternative label: uusintaproduktio (teos)
alternative label: nyproduktion (verk) @sv
broader: muunnos tyylissä
definition: Teos, joka on uusi elokuva, radio-ohjelma, televisio-ohjelma tai video, joka perustuu aiempaan teokseen. (RDA Registry)
definition: Verk som är en ny film, ett radioprogram, ett tv-program eller en video, som grundar sig på ett tidigare verk. @sv
in scheme: Metatietosanasto
preferred label: remade as work @en
preferred label: nyproduktion @sv

runomukaelma
type: Concept
source: RDA-termi
source: RDA-term @sv
created: 2018-11-13
modified: 2025-08-19
Vastavuoroinen suhde: runomukaelma teoksesta
alternative label: runomukaelma (teos)
alternative label: versbearbetning (verk) @sv
broader: mukaelma
definition: Teos, joka on toisesta teoksesta runomuotoon sovitettu teos. (RDA Registry)
definition: Verk som är bearbetat till versform utgående från ett annat verk. @sv
in scheme: Metatietosanasto
preferred label: adapted in verse as work @en
preferred label: versbearbetning @sv

tekstiin perustuva musiikki
type: Concept
source: RDA-termi
source: RDA-term @sv
created: 2018-11-13
modified: 2025-08-22
Vastavuoroinen suhde: musiikkiteoksen teksti
alternative label: tekstiin perustuva musiikki (teos)
alternative label: musik baserad på texten (verk) @sv
broader: johdannaisteos
definition: Teos, joka on ei-näytelmällinen musiikkiteos (muu kuin oratorio), jonka teksti on peräisin toisesta teoksesta. (RDA Registry)
definition: Verk som är ett icke-dramatiskt musikverk (annat än oratorium) och vars text är från ett annat verk. @sv
in scheme: Metatietosanasto
preferred label: set to music as work @en
preferred label: musik baserad på texten @sv

videopelisovitus
type: Concept
source: RDA-termi
source: RDA-term @sv
created: 2018-11-13
modified: 2025-08-23
Vastavuoroinen suhde: videopelisovitus teoksesta
alternative label: videopelisovitus (teos)
alternative label: videospelsbearbetning (verk) @sv
broader: mukaelma
definition: Teos, joka on videopeli, joka perustuu toiseen teokseen. (RDA Registry)
definition: Verk som är ett videospel, som grundar sig på ett annat verk. @sv
in scheme: Metatietosanasto
preferred label: adapted as video game work @en
preferred label: videospelsbearbetning @sv

mukautettu lyhennelmä
type: Concept
source: RDA-termi
source: RDA-term @sv
created: 2018-11-13
modified: 2025-08-14
Vastavuoroinen suhde: mukautettu lyhennelmä teoksesta
alternative label: mukautettu lyhennelmä (teos)
alternative label: anpassad förkortning (verk) @sv
broader: johdannaisteos
definition: Teos, joka systemaattisesti, kokonaisuudessaan ja mukaillen tiivistää siihen liittyvän teoksen. (RDA Registry)
definition: Verk som systematiskt och i sin helhet anpassar och förkortar ett relaterat verk. @sv
in scheme: Metatietosanasto
preferred label: digested as work @en
preferred label: anpassad förkortning @sv

radiosovitus
type: Concept
source: RDA-termi
source: RDA-term @sv
created: 2018-11-13
modified: 2025-08-19
Vastavuoroinen suhde: radiosovitus teoksesta
alternative label: radiosovitus (teos)
alternative label: radiobearbetning (verk) @sv
broader: mukaelma
definition: Teos, joka on toiseen teokseen perustuva radio-ohjelma. (RDA Registry)
definition: Verk som är ett radioprogram som grundar sig på ett annat verk. @sv
in scheme: Metatietosanasto
preferred label: adapted as radio program work @en
preferred label: radiobearbetning @sv

vapaamuotoinen käännös
type: Concept
source: RDA-termi
source: RDA-term @sv
created: 2018-11-13
modified: 2025-08-23
Vastavuoroinen suhde: vapaa käännös teoksesta
alternative label: vapaamuotoinen käännös (teos)
alternative label: fri översättning (verk) @sv
broader: muunnos tyylissä
definition: Teos, joka on sekä toisen teoksen muokkaus että käännös toiselle kielelle. (RDA Registry)
definition: Verk som är både en bearbetning av ett annat verk och en översättning till ett annat språk. @sv
in scheme: Metatietosanasto
preferred label: freely translated as work @en
preferred label: fri översättning @sv

romaanimukaelma
type: Concept
source: RDA-termi
source: RDA-term @sv
created: 2018-11-13
modified: 2025-08-19
Vastavuoroinen suhde: romaanimukaelma teoksesta
alternative label: romaanimukaelma (teos)
alternative label: romanbearbetning (verk) @sv
broader: mukaelma
definition: Teos, joka on toisesta teoksesta sovitettu romaani. (RDA Registry)
definition: Verk som är en roman bearbetad utgående från ett annat verk. @sv
in scheme: Metatietosanasto
preferred label: adapted as novel work @en
preferred label: romanbearbetning @sv

televisiosovitus
type: Concept
source: RDA-termi
source: RDA-term @sv
created: 2018-11-13
modified: 2025-08-22
Vastavuoroinen suhde: televisiosovitus teoksesta
alternative label: televisiosovitus (teos)
alternative label: tv-bearbetning (verk) @sv
broader: mukaelma
definition: Teos, joka on televisio-ohjelma, joka perustuu toiseen teokseen. (RDA Registry)
definition: Verk som är ett tv-program, som grundar sig på ett annat verk. @sv
in scheme: Metatietosanasto
preferred label: adapted as television program work @en
preferred label: tv-bearbetning @sv

muuntelun tuloksena muodostunut teos
type: Concept
source: RDA-termi
source: RDA-term @sv
created: 2018-11-13
modified: 2025-08-15
Vastavuoroinen suhde: muunnelmien perustana oleva teos
alternative label: variaatio
alternative label: variaatio (teos)
alternative label: variation @sv
alternative label: variation (verk) @sv
broader: johdannaisteos
definition: Musiikkiteos, jonka melodinen, temaattinen tai harmoninen aines on otettu toisesta teoksesta erillisen, toistettavan ja muunneltavan teeman muodostamiseksi. (RDA Registry)
definition: Musikverk vars melodiska, tematiska eller harmoniska material har tagits ur ett annat verk för att bilda ett skilt, repeterbart och varierbart tema. @sv
in scheme: Metatietosanasto
preferred label: modified by variation as work @en
preferred label: modifierad genom variation som verk @sv

sovitettu televisiokäsikirjoitukseksi
type: Concept
source: RDA-termi
source: RDA-term @sv
created: 2018-11-13
modified: 2025-08-19
Vastavuoroinen suhde: televisiokäsikirjoituksen perustana oleva teos
alternative label: sovitettu televisiokäsikirjoitukseksi (teos)
alternative label: televisiokäsikirjoitus
alternative label: televisiokäsikirjoitus (teos)
alternative label: bearbetad till tv-manuskript (verk) @sv
alternative label: tv-manuskript @sv
alternative label: tv-manuskript (verk) @sv
broader: sovitettu käsikirjoitukseksi
definition: Teos, joka koostuu toiseen teokseen perustuvasta televisio-ohjelman käsikirjoituksesta. (RDA Registry)
definition: Verk som består av ett manuskript till ett tv-program som grundar sig på ett annat verk. @sv
in scheme: Metatietosanasto
preferred label: adapted as television screenplay work @en
preferred label: bearbetad till tv-manuskript @sv

sovitettu libretoksi
type: Concept
source: RDA-termi
source: RDA-term @sv
created: 2018-11-13
modified: 2025-08-19
Vastavuoroinen suhde: libreton perustana oleva teos
alternative label: sovitettu libretoksi (ekspressio)
alternative label: teokseen perustuva libretto
alternative label: bearbetad till libretto (uttryck) @sv
alternative label: libretto baserat på verk @sv
broader: mukaelma
definition: Teos, joka koostuu toiseen teokseen perustuvasta musiikki- tai koreografisen teoksen, kuten oopperan, baletin tai muun musiikillisen näyttämöteoksen tai oratorion tekstistä. (RDA Registry)
definition: Verk som består av en text till ett musikaliskt eller koreografiskt verk, såsom en opera, en balett eller något annat musikaliskt sceniskt verk eller ett oratorium, som grundar sig på ett annat verk. @sv
in scheme: Metatietosanasto
preferred label: adapted as libretto work @en
preferred label: bearbetad till libretto @sv

sovitettu radiokäsikirjoitukseksi
type: Concept
source: RDA-termi
source: RDA-term @sv
created: 2018-11-13
modified: 2025-08-19
Vastavuoroinen suhde: radiokäsikirjoituksen perustana oleva teos
alternative label: radiokäsikirjoitus
alternative label: radiokäsikirjoitus (teos)
alternative label: sovitettu radiokäsikirjoitukseksi (teos)
alternative label: bearbetad till radiomanuskript (verk) @sv
alternative label: radiomanuskript @sv
alternative label: radiomanuskript (verk) @sv
broader: mukaelma
definition: Teos, joka koostuu toiseen teokseen perustuvasta radio-ohjelman käsikirjoituksesta. (RDA Registry)
definition: Verk som består av ett manuskript till ett radioprogram som grundar sig på ett annat verk. @sv
in scheme: Metatietosanasto
preferred label: adapted as radio script work @en
preferred label: bearbetad till radiomanuskript @sv

sovitettu videokäsikirjoitukseksi
type: Concept
source: RDA-termi
source: RDA-term @sv
created: 2018-11-13
modified: 2025-08-19
Vastavuoroinen suhde: videokäsikirjoituksen perustana oleva teos
alternative label: sovitettu videokäsikirjoitukseksi (teos)
alternative label: videokäsikirjoitus
alternative label: videokäsikirjoitus (teos)
alternative label: bearbetad till videomanuskript (verk) @sv
alternative label: videomanuskript @sv
alternative label: videomanuskript (verk) @sv
broader: sovitettu käsikirjoitukseksi
definition: Teos, joka koostuu toiseen teokseen perustuvasta videokäsikirjoituksesta. (RDA Registry)
definition: Verk som består av ett videomanuskript som grundar sig på ett annat verk. @sv
in scheme: Metatietosanasto
preferred label: adapted as video screenplay work @en
preferred label: bearbetad till videomanuskript @sv

lastenversio (teos)
type: Concept
source: Kansallinen RDA-termi
source: Nationell RDA-term @sv
created: 2018-11-13
modified: 2024-12-18
Vastavuoroinen suhde: lastenversion perustana (teos)
broader: mukaelma
definition: Viittauksen kohde on kuvailun kohteena olevan teoksen lastenversio.
definition: Föremål för hänvisning är en barnversion av verket som är föremål för beskrivning. @sv
in scheme: Metatietosanasto
preferred label: barnversion (verk) @sv

videosovitus
type: Concept
source: RDA-termi
source: RDA-term @sv
created: 2018-11-13
modified: 2025-08-23
Vastavuoroinen suhde: videosovitus teoksesta
alternative label: videosovitus (teos)
alternative label: videobearbetning (verk) @sv
broader: mukaelma
definition: Teos, joka on video, joka perustuu toiseen teokseen. (RDA Registry)
definition: Verk som är en video, som grundar sig på ett annat verk. @sv
in scheme: Metatietosanasto
preferred label: adapted as video work @en
preferred label: videobearbetning @sv

sovitettu elokuvakäsikirjoitukseksi
type: Concept
source: RDA-termi
source: RDA-term @sv
created: 2018-11-13
modified: 2025-08-19
Vastavuoroinen suhde: elokuvakäsikirjoituksen perustana oleva teos
alternative label: elokuvakäsikirjoitus
alternative label: elokuvakäsikirjoitus (teos)
alternative label: sovitettu elokuvakäsikirjoitukseksi (teos)
alternative label: bearbetad till filmmanuskript (verk) @sv
alternative label: filmmanus (verk) @sv
alternative label: filmmanuskript (verk) @sv
broader: sovitettu käsikirjoitukseksi
definition: Teos, joka koostuu toiseen teokseen perustuvasta elokuvan käsikirjoituksesta. (RDA Registry)
definition: Verk som består av ett filmmanuskript, som grundar sig på ett annat verk. @sv
in scheme: Metatietosanasto
preferred label: adapted as motion picture screenplay work @en
preferred label: bearbetad till filmmanuskript @sv

selkokielinen versio (teos)
type: Concept
source: Kansallinen RDA-termi
source: Nationell RDA-term @sv
created: 2018-11-24
modified: 2024-12-18
Vastavuoroinen suhde: selkokielisen version perustana (teos)
broader: johdannaisteos
definition: Viittauksen kohde on kuvailun kohteena olevan teoksen selkokielinen versio.
definition: Föremål för hänvisning är en lättläst version av verket som är föremål för beskrivning. @sv
in scheme: Metatietosanasto
preferred label: lättläst version (verk) @sv

abstraktit teoksesta
type: Concept
source: RDA-termi
source: RDA-term @sv
created: 2018-11-24
modified: 2026-05-26
Vastavuoroinen suhde: abstraktit (teos)
alternative label: abstraktien perustana (teos)
alternative label: abstract av verket @sv
alternative label: abstracter av verket @sv
alternative label: abstrakten baserade på (verk) @sv
alternative label: abstrakter av verket @sv
broader: teoksen perustana
definition: Teos, jonka toinen teos on abstrahoinut. (RDA Registry)
definition: Verk som ett annat verk har sammanfattat. @sv
in scheme: Metatietosanasto
preferred label: abstracts for work @en
preferred label: abstrakt av verket @sv

abstrakti teoksesta
type: Concept
source: RDA-termi
source: RDA-term @sv
created: 2018-11-24
modified: 2025-04-15
Vastavuoroinen suhde: abstrakti
alternative label: abstraktin perustana
alternative label: abstraktin perustana (teos)
alternative label: abstract av verket @sv
alternative label: abstrakt baserat på (verk) @sv
broader: yhteenveto teoksesta
definition: Teos, joka on lyhennetty objektiivisella tavalla. (RDA Registry)
definition: Verk som har förkortats på ett objektivt sätt. @sv
in scheme: Metatietosanasto
preferred label: abstract of @en
preferred label: abstrakt av verket @sv

dramatisointi teoksesta
type: Concept
source: RDA-termi
source: RDA-term @sv
created: 2018-11-24
modified: 2025-04-16
Vastavuoroinen suhde: dramatisointi
alternative label: dramatisoinnin perustana
alternative label: dramatisoinnin perustana (teos)
alternative label: dramatisering baserad på @sv
alternative label: dramatisering baserad på (verk) @sv
broader: mukaelma teoksesta
definition: Teos, joka on sovitettu näytelmäksi. (RDA Registry)
definition: Verk som har omarbetats till skådespel. @sv
in scheme: Metatietosanasto
preferred label: dramatization of work @en
preferred label: dramatisering av verket @sv

elokuvakäsikirjoituksen perustana oleva teos
type: Concept
source: RDA-termi
source: RDA-term @sv
created: 2018-12-08
modified: 2025-05-29
Vastavuoroinen suhde: sovitettu elokuvakäsikirjoitukseksi
alternative label: elokuvakäsikirjoituksen perustana
alternative label: elokuvakäsikirjoituksen perustana (teos)
alternative label: filmmanus baserat på (verk) @sv
alternative label: filmmanuskript baserat på (verk) @sv
broader: käsikirjoituksen perustana oleva teos
definition: Teos, joka on sovitettu elokuvan käsikirjoitukseksi. (RDA Registry)
definition: Verk som har omarbetats till filmmanuskript. @sv
in scheme: Metatietosanasto
preferred label: motion picture screenplay based on work @en
preferred label: filmmanuskript baserat på verket @sv

radiokäsikirjoituksen perustana oleva teos
type: Concept
source: RDA-termi
source: RDA-term @sv
created: 2018-12-08
modified: 2025-08-19
Vastavuoroinen suhde: sovitettu radiokäsikirjoitukseksi
alternative label: radiokäsikirjoituksen perustana
alternative label: radiokäsikirjoituksen perustana (teos)
alternative label: radiomanuskript baserat på @sv
alternative label: radiomanuskript baserat på (verk) @sv
broader: mukaelma teoksesta
definition: Teos, joka on sovitettu radio-ohjelman käsikirjoitukseksi. (RDA Registry)
definition: Verk som har bearbetats till manuskript för ett radioprogram. @sv
in scheme: Metatietosanasto
preferred label: radio script based on work @en
preferred label: radiomanuskript baserat på verket @sv

videokäsikirjoituksen perustana oleva teos
type: Concept
source: RDA-termi
source: RDA-term @sv
created: 2018-12-08
modified: 2025-08-23
Vastavuoroinen suhde: sovitettu videokäsikirjoitukseksi
alternative label: videokäsikirjoituksen perustana
alternative label: videokäsikirjoituksen perustana (teos)
alternative label: videomanuskript baserat på @sv
alternative label: videomanuskript baserat på (verk) @sv
broader: käsikirjoituksen perustana oleva teos
definition: Teos, joka on sovitettu videon käsikirjoitukseksi. (RDA Registry)
definition: Verk som har bearbetats till manuskript för en video. @sv
in scheme: Metatietosanasto
preferred label: video screenplay based on work @en
preferred label: videomanuskript baserat på verket @sv

lyhennelmä teoksesta
type: Concept
source: RDA-termi
source: RDA-term @sv
created: 2018-12-08
modified: 2025-07-05
Vastavuoroinen suhde: lyhennelmä
alternative label: lyhennelmän perustana
alternative label: lyhennelmän perustana (teos)
alternative label: förkortning baserad på @sv
alternative label: förkortning baserad på (verk) @sv
broader: teoksen perustana
definition: Teos, jota on lyhennetty siihen liittyväksi teokseksi muuttamatta yleistä merkitystä tai esitystapaa. (RDA Registry)
definition: Verk som förkortats till ett relaterat verk utan att ändra dess allmänna betydelse eller presentationssätt. @sv
in scheme: Metatietosanasto
preferred label: abridgement of work @en
preferred label: förkortning av verket @sv

laajennettu versio teoksesta
type: Concept
source: RDA-termi
source: RDA-term @sv
created: 2018-12-08
modified: 2025-07-04
Vastavuoroinen suhde: laajennelma
alternative label: laajennelman perustana
alternative label: laajennelman perustana (teos)
alternative label: utvidgad version baserad på @sv
alternative label: utvidgad version baserad på (verk) @sv
broader: teoksen perustana
definition: Teos, jota on käytetty toisen teoksen sisältöä laajentavan johdannaisteoksen perustana. (RDA Registry)
definition: Verk som har använts som grund för ett härlett verk som utvidgar innehållet i ett annat verk. @sv
in scheme: Metatietosanasto
preferred label: expanded version of work @en
preferred label: utvidgad version av verket @sv

televisiokäsikirjoituksen perustana oleva teos
type: Concept
source: RDA-termi
source: RDA-term @sv
created: 2018-12-08
modified: 2025-08-22
Vastavuoroinen suhde: sovitettu televisiokäsikirjoitukseksi
alternative label: televisiokäsikirjoituksen perustana
alternative label: televisiokäsikirjoituksen perustana (teos)
alternative label: tv-manuskript baserat på @sv
alternative label: tv-manuskript baserat på (verk) @sv
broader: käsikirjoituksen perustana oleva teos
definition: Teos, joka on sovitettu televisio-ohjelman käsikirjoitukseksi. (RDA Registry)
definition: Verk som har bearbetats till manuskript för ett tv-program. @sv
in scheme: Metatietosanasto
preferred label: television screenplay based on work @en
preferred label: tv-manuskript baserat på verket @sv

radiosovitus teoksesta
type: Concept
source: RDA-termi
source: RDA-term @sv
created: 2018-12-08
modified: 2025-08-19
Vastavuoroinen suhde: radiosovitus
alternative label: radiosovituksen perustana
alternative label: radiosovituksen perustana (teos)
alternative label: radioversion perustana
alternative label: radioversion perustana (teos)
alternative label: radiobearbetning baserad på @sv
alternative label: radiobearbetning baserad på (verk) @sv
broader: mukaelma teoksesta
definition: Teos, joka on sovitettu radio-ohjelmaksi. (RDA Registry)
definition: Verk som har bearbetats till radioprogram. @sv
in scheme: Metatietosanasto
preferred label: radio adaptation of work @en
preferred label: radiobearbetning av verket @sv

koreografinen sovitus teoksesta
type: Concept
source: RDA-termi
source: RDA-term @sv
created: 2018-12-08
modified: 2025-07-04
Vastavuoroinen suhde: sovitettu koreografiaksi
alternative label: koreografian perustana
alternative label: koreografian perustana (teos)
alternative label: koreografi baserad på @sv
alternative label: koreografi baserad på (verk) @sv
broader: mukaelma teoksesta
definition: Teos, joka on sovitettu koreografiseksi teokseksi. (RDA Registry)
definition: Verk som har bearbetats till ett koreografiskt verk. @sv
in scheme: Metatietosanasto
preferred label: choreographic adaptation of work @en
preferred label: koreografisk bearbetning av verket @sv

libreton perustana oleva teos
type: Concept
source: RDA-termi
source: RDA-term @sv
created: 2018-12-08
modified: 2025-07-05
Vastavuoroinen suhde: sovitettu libretoksi
alternative label: libreton perustana
alternative label: libreton perustana (teos)
alternative label: libretto baserat på @sv
alternative label: libretto baserat på (verk) @sv
broader: mukaelma teoksesta
definition: Teos, johon musiikki- tai korografisen teoksen, kuten oopperan, baletin tai muun musiikillisen näyttämöteoksen tai oratorion teksti perustuu. (RDA Registry)
definition: Verk som en text till ett musikaliskt eller koreografiskt verk, såsom en opera, en balett eller något annat musikaliskt sceniskt verk eller oratorium grundar sig på. @sv
in scheme: Metatietosanasto
preferred label: libretto based on work @en
preferred label: libretto baserat på verket @sv

musikaaliversio teoksesta
type: Concept
source: RDA-termi
source: RDA-term @sv
created: 2018-12-08
modified: 2025-08-14
Vastavuoroinen suhde: musikaaliversio
alternative label: musical theater adaptation of work @en
alternative label: musikaaliversion perustana
alternative label: musikaaliversion perustana (teos)
alternative label: teoksen musikaaliversio
alternative label: musikalversion baserad på @sv
alternative label: musikalversion baserad på (verk) @sv
broader: mukaelma teoksesta
definition: Teos, joka on sovitettu musikaaliteokseksi. (RDA Registry)
definition: Verk som har bearbetats till musikalverk. @sv
in scheme: Metatietosanasto
preferred label: musical theatre adaptation of work @en
preferred label: musikalversion av verket @sv

videosovitus teoksesta
type: Concept
source: RDA-termi
source: RDA-term @sv
created: 2018-12-08
modified: 2025-08-23
Vastavuoroinen suhde: videosovitus
alternative label: videosovituksen perustana
alternative label: videosovituksen perustana (teos)
alternative label: videobearbetning baserad på @sv
alternative label: videobearbetning baserad på (verk) @sv
broader: mukaelma teoksesta
definition: Teos, joka on sovitettu videoksi. (RDA Registry)
definition: Verk som har omarbetats till video. @sv
in scheme: Metatietosanasto
preferred label: video adaptation of work @en
preferred label: videobearbetning av verket @sv

parodia teoksesta
type: Concept
source: RDA-termi
source: RDA-term @sv
created: 2018-12-08
modified: 2025-08-16
Vastavuoroinen suhde: parodia
alternative label: parodian perustana
alternative label: parodian perustana (teos)
alternative label: parodi baserad på @sv
alternative label: parodi baserad på (verk) @sv
broader: jäljitelmä teoksesta
definition: Teos, jonka tyyliä tai sisältöä jäljitellään humoristisesti. (RDA Registry)
definition: Verk vars stil eller innehåll imiteras humoristiskt. @sv
in scheme: Metatietosanasto
preferred label: parody of work @en
preferred label: parodi på verket @sv

oopperasovitus teoksesta
type: Concept
source: RDA-termi
source: RDA-term @sv
created: 2018-12-08
modified: 2025-08-15
Vastavuoroinen suhde: oopperasovitus
alternative label: oopperasovituksen perustana
alternative label: oopperasovituksen perustana (teos)
alternative label: operabearbetning baserad på (verk) @sv
broader: mukaelma teoksesta
definition: Teos, joka on sovitettu oopperaksi. (RDA Registry)
definition: Verk som har bearbetats till opera. @sv
in scheme: Metatietosanasto
preferred label: opera adaptation of work @en
preferred label: operabearbetning av verket @sv

oratoriosovitus teoksesta
type: Concept
source: RDA-termi
source: RDA-term @sv
created: 2018-12-08
modified: 2025-08-15
Vastavuoroinen suhde: oratoriosovitus
alternative label: oratoriosovituksen perustana
alternative label: oratoriosovituksen perustana (teos)
alternative label: oratoriebearbetning baserad på @sv
alternative label: oratoriebearbetning baserad på (verk) @sv
broader: mukaelma teoksesta
definition: Teos, joka on sovitettu oratorioksi. (RDA Registry)
definition: Verk som har bearbetats till oratorium. @sv
in scheme: Metatietosanasto
preferred label: oratorio adaptation of work @en
preferred label: oratoriebearbetning av verket @sv

videopelisovitus teoksesta
type: Concept
source: RDA-termi
source: RDA-term @sv
created: 2018-12-08
modified: 2025-08-23
Vastavuoroinen suhde: videopelisovitus
alternative label: videopelisovituksen perustana
alternative label: videopelisovituksen perustana (teos)
alternative label: videospelsbearbetning baserad på @sv
alternative label: videospelsbearbetning baserad på (verk) @sv
broader: mukaelma teoksesta
definition: Teos, joka on sovitettu videopeliksi. (RDA Registry)
definition: Verk som har bearbetats till videospel. @sv
in scheme: Metatietosanasto
preferred label: video game adaptation of work @en
preferred label: videospelsbearbetning av verket @sv

muistoteos
type: Concept
source: RDA-termi
source: RDA-term @sv
created: 2018-12-15
modified: 2025-08-14
Vastavuoroinen suhde: muistoteos teokselle
broader: teokseen liittyvä teos
definition: Teos, joka on luotu aiemman teoksen muistoksi. (RDA Registry)
definition: Verk som har skapats till minne av ett tidigare verk. @sv
in scheme: Metatietosanasto
preferred label: commemoration @en
preferred label: minnesverk @sv

mukautettu lyhennelmä teoksesta
type: Concept
source: RDA-termi
source: RDA-term @sv
created: 2018-12-15
modified: 2025-08-14
Vastavuoroinen suhde: mukautettu lyhennelmä
alternative label: mukautetun lyhennelmän perustana
alternative label: mukautetun lyhennelmän perustana (teos)
alternative label: anpassad förkortning baserad på @sv
alternative label: anpassad förkortning baserad på (verk) @sv
broader: teoksen perustana
definition: Teos, joka on siihen liittyvän teoksen systemaattinen ja kokonaisvaltainen tiivistelmä. (RDA Registry)
definition: Verk som är en systematisk och övergripande förkortning av ett relaterat verk. @sv
in scheme: Metatietosanasto
preferred label: digest of work @en
preferred label: anpassad förkortning av verket @sv

muunnelmien perustana oleva teos
type: Concept
source: RDA-termi
source: RDA-term @sv
created: 2018-12-15
modified: 2025-08-15
Vastavuoroinen suhde: muuntelun tuloksena muodostunut teos
alternative label: variaation perustana
alternative label: variaation perustana (teos)
alternative label: variation baserad på @sv
alternative label: variation baserad på (verk) @sv
broader: teoksen perustana
definition: Musiikkiteos, josta melodinen, temaattinen tai harmoninen aines on otettu erillisen, toistettavan ja muunneltavan teeman muodostamiseksi. (RDA Registry)
definition: Musikverk ur vilket melodiskt, tematiskt eller harmoniskt material har tagits för att bilda ett skilt, repeterbart och varierbart tema. @sv
in scheme: Metatietosanasto
preferred label: variations based on work @en
preferred label: variationer baserade på verket @sv

vapaa käännös teoksesta
type: Concept
source: RDA-termi
source: RDA-term @sv
created: 2018-12-15
modified: 2025-08-23
Vastavuoroinen suhde: vapaamuotoinen käännös
alternative label: vapaan käännöksen perustana
alternative label: vapaan käännöksen perustana (teos)
alternative label: fri översättning baserad på @sv
alternative label: fri översättning baserad på (verk) @sv
broader: muunnos tyylissä teoksesta
definition: Teos, joka on sekä sovitettu että käännetty toiselle kielelle. (RDA Registry)
definition: Verk som har både bearbetats och översatts till ett annat språk. @sv
in scheme: Metatietosanasto
preferred label: free translation of work @en
preferred label: fri översättning av verket @sv

osa teosta
type: Concept
source: RDA-termi
source: RDA-term @sv
created: 2018-12-15
modified: 2025-08-15
Vastavuoroinen suhde: teoksen osa
alternative label: contained in (work) @en
alternative label: sisältyy teokseen
alternative label: ingår i verk @sv
broader: teokseen liittyvä teos
definition: Teos, jolla on toinen teos itsenäisenä osana. (RDA Registry)
definition: Verk som har ett annat verk som en självständig del. @sv
in scheme: Metatietosanasto
preferred label: part of work @en
preferred label: del av verket @sv
scope note: Teoksen osaa pidetään olennaisena koko teokselle. (RDA Registry)
scope note: Verkets del anses väsentligt för hela verket. @sv

muistoteos teokselle
type: Concept
source: RDA-termi
source: RDA-term @sv
created: 2018-12-15
modified: 2025-08-14
Vastavuoroinen suhde: muistoteos
alternative label: muistoteoksen kohde
alternative label: föremål för minnesverk @sv
broader: teokseen liittyvä teos
definition: Teos, jonka muistona myöhempi teos on. (RDA Registry)
definition: Verk till vars minne ett senare verk gjorts. @sv
in scheme: Metatietosanasto
preferred label: commemoration of @en
preferred label: minnesverk för verket @sv

parafraasi teoksesta
type: Concept
source: RDA-termi
source: RDA-term @sv
created: 2018-12-15
modified: 2025-08-16
Vastavuoroinen suhde: parafraasi
alternative label: parafraasin perustana
alternative label: parafraasin perustana (teos)
alternative label: parafras baserad på @sv
alternative label: parafras baserad på (verk) @sv
broader: muunnos tyylissä teoksesta
definition: Teos, jota on käytetty toisen teoksen sisällön eri muodossa tapahtuvan toisintamisen perustana. (RDA Registry)
definition: Verk som har använts som grund för återgivning av ett annat verks innehåll i en annan form. @sv
in scheme: Metatietosanasto
preferred label: paraphrase of work @en
preferred label: parafras av verket @sv

pääsarja
type: Concept
source: RDA-termi
source: RDA-term @sv
created: 2018-12-15
modified: 2025-08-16
Vastavuoroinen suhde: alasarja
broader: innoittaja
definition: Teos, joka on peräkkäisesti ilmestyvä aggregoiva teos, joka vaikuttaa toisen peräkkäisesti ilmestyvän aggregoivan teoksen yleiseen toimituslinjaan, toiminta-alaan ja tyyliin. (RDA Registry)
definition: Verk som är ett successivt utkommande aggregerande verk, som påverkar den allmänna redaktionella linjen, verksamhetsfältet och stilen i ett annat successivt utkommande verk. @sv
in scheme: Metatietosanasto
preferred label: subseries of @en
preferred label: huvudserie @sv

musiikkiteoksen teksti
type: Concept
source: RDA-termi
source: RDA-term @sv
created: 2018-12-15
modified: 2025-08-14
Vastavuoroinen suhde: tekstiin perustuva musiikki
alternative label: musiikkiteoksen teksti (teos)
alternative label: text till musikverk (verk) @sv
broader: teoksen perustana
definition: Teos, joka on ei-näytelmällisen musiikkiteoksen (muun kuin oratorion) teksti. (RDA Registry)
definition: Verk som är text till ett icke-dramatiskt musikverk (annat än oratorium). @sv
in scheme: Metatietosanasto
preferred label: musical setting of work @en
preferred label: text till musikverk @sv

alasarja
type: Concept
source: RDA-termi
source: RDA-term @sv
created: 2018-12-18
modified: 2025-04-15
Vastavuoroinen suhde: pääsarja
broader: innoitus teokselle
definition: Teos, joka on peräkkäisesti ilmestyvä aggregoiva teos, johon vaikuttaa toisen peräkkäisesti ilmestyvän aggregoivan teoksen yleinen toimituslinja, toiminta-ala ja tyyli. (RDA Registry)
definition: Verk som är ett successivt utgivet aggregerande verk, som är påverkat av den allmänna redaktionella linjen, verksamhetsområdet och stilen för ett annat successivt utgivet aggregerande verk. @sv
in scheme: Metatietosanasto
preferred label: subseries @en
preferred label: underserie @sv

teoksen osa
type: Concept
source: RDA-termi
source: RDA-term @sv
created: 2018-12-18
modified: 2026-03-10
Vastavuoroinen suhde: osa teosta
alternative label: component part @en
alternative label: container of (work) @en
alternative label: sisältää (teos)
alternative label: innehåller (verk) @sv
broader: teokseen liittyvä teos
definition: Teos, joka on itsenäinen osa toista teosta. (RDA Registry)
definition: Verk som är en självständig del av ett annat verk. @sv
in scheme: Metatietosanasto
preferred label: part work @en
preferred label: del av verket @sv
scope note: Teoksen osaa pidetään olennaisena koko teokselle. (RDA Registry)
scope note: Verkets del anses väsentligt för hela verket. @sv

koreografia teokseen
type: Concept
source: RDA-termi
source: RDA-term @sv
created: 2018-12-21
modified: 2025-07-04
Vastavuoroinen suhde: koreografia
broader: täydentävä teos
definition: Teos, jota täydentää koreografinen teos. (RDA Registry)
definition: Verk som kompletterar ett koreografiskt verk. @sv
in scheme: Metatietosanasto
preferred label: choreography for work @en
preferred label: koreografi till verket @sv

koreografia
type: Concept
source: RDA-termi
source: RDA-term @sv
created: 2018-12-21
modified: 2025-07-04
Vastavuoroinen suhde: koreografia teokseen
alternative label: koreografia (teos)
alternative label: koreografi (verk) @sv
broader: täydentävä teos
definition: Teos, joka on koreografinen teos, joka täydentää teosta. (RDA Registry)
definition: Verk som är ett koreografiskt verk, som kompletterar ett verk. @sv
in scheme: Metatietosanasto
preferred label: choreography work @en
preferred label: koreografi @sv

lisäykset teokseen
type: Concept
source: RDA-termi
source: RDA-term @sv
created: 2019-01-04
modified: 2025-07-05
Vastavuoroinen suhde: lisäykset
broader: laajennus teokseen
definition: Teos, jonka sisältöä täydennetään suppealla sisällöllä siihen liittyvästä teoksesta. (RDA Registry)
definition: Verk vars innehåll kompletteras med kortfattat innehåll från ett relaterat verk. @sv
in scheme: Metatietosanasto
preferred label: addenda to work @en
preferred label: tillägg till verket @sv

televisio-ohjelman käsikirjoitus
type: Concept
source: RDA-termi
source: RDA-term @sv
created: 2019-01-04
modified: 2025-08-22
Vastavuoroinen suhde: käsikirjoitus televisio-ohjelmaan
alternative label: televisio-ohjelman käsikirjoitus (teos)
alternative label: manuskript till tv-program (verk) @sv
broader: käsikirjoitus
definition: Teos, joka on tekstiteos, joka täydentää teosta, joka on televisio-ohjelma. (RDA Registry)
definition: Verk som är ett textverk, som kompletterar ett verk som är ett tv-program. @sv
in scheme: Metatietosanasto
preferred label: television screenplay work @en
preferred label: manuskript till tv-program @sv

libretto
type: Concept
source: RDA-termi
source: RDA-term @sv
created: 2019-01-04
modified: 2025-07-05
Vastavuoroinen suhde: libretto teokseen
alternative label: libretto (teos)
alternative label: libretto (verk) @sv
broader: tekstiteos
definition: Teos, joka joka on tekstiteos, joka täydentää teosta, joka on musiikki- tai koreografinen teos, kuten ooppera, baletti tai muu musiikillinen näyttämöteos tai oratorio. (RDA Registry)
definition: Verk som är ett textverk som kompletterar ett verk som är ett musikaliskt eller koreografiskt verk, såsom en opera, en balett eller något annat musikaliskt sceniskt verk eller oratorium. @sv
in scheme: Metatietosanasto
preferred label: libretto work @en

radio-ohjelman käsikirjoitus
type: Concept
source: RDA-termi
source: RDA-term @sv
created: 2019-01-04
modified: 2025-08-19
Vastavuoroinen suhde: käsikirjoitus radio-ohjelmaan
alternative label: radio-ohjelman käsikirjoitus (teos)
alternative label: manuskript till radioprogram (verk) @sv
broader: tekstiteos
definition: Teos, joka on joka on tekstiteos, joka täydentää teosta, joka on radio-ohjelma. (RDA Registry)
definition: Verk som är ett textverk som kompletterar ett verk som är ett radioprogram. @sv
in scheme: Metatietosanasto
preferred label: radio script work @en
preferred label: manuskript till radioprogram @sv

libretto teokseen
type: Concept
source: RDA-termi
source: RDA-term @sv
created: 2019-01-04
modified: 2025-07-05
Vastavuoroinen suhde: libretto
broader: teksti teokseen
definition: Teos, joka on musiikki- tai koreografinen teos, kuten ooppera, baletti tai muu musiikillinen näyttämöteos tai oratorio, jota täydentää teos, joka on tekstiteos. (RDA Registry)
definition: Verk som är ett musikaliskt eller koreografiskt verk, såsom en opera, en balett eller något annat musikaliskt sceniskt verk eller oratorium, och som kompletteras av ett verk som är ett textverk. @sv
in scheme: Metatietosanasto
preferred label: libretto for work @en
preferred label: libretto till verket @sv

kuvitus teokseen
type: Concept
source: RDA-termi
source: RDA-term @sv
created: 2019-01-04
modified: 2025-07-04
Vastavuoroinen suhde: kuvitus
broader: laajennus teokseen
definition: Teos, jota on laajennettu sitä selittämään tai koristamaan suunnitellulla kuvasisällöllä. (RDA Registry)
definition: Verk som har utvidgats med bildinnehåll som är avsett att förklara eller dekorera det. @sv
in scheme: Metatietosanasto
preferred label: illustrations for work @en
preferred label: illustration till verket @sv

abstraktit ekspressiosta
type: Concept
source: RDA-termi
source: RDA-term @sv
created: 2019-01-04
modified: 2026-06-06
Vastavuoroinen suhde: abstraktit (ekspressio)
alternative label: abstraktien perustana (ekspressio)
alternative label: abstraktit versiosta
alternative label: abstract av versionen @sv
alternative label: abstracter av versionen @sv
alternative label: abstrakt av versionen @sv
alternative label: abstrakten baserade på (uttryck) @sv
alternative label: abstrakter av uttrycket @sv
alternative label: abstrakter av versionen @sv
broader: ekspression perustana
definition: Teoksen ekspressio, jonka sisällön tiivistelmä- ja indeksointipalvelu on abstrahoinut. (RDA Registry)
definition: Uttryck av verk, vars innehåll en sammanfattnings- eller indexeringstjänst har sammanfattat. @sv
in scheme: Metatietosanasto
preferred label: abstracts for expression @en
preferred label: abstrakt av uttrycket @sv

musiikki videoon
type: Concept
source: RDA-termi
source: RDA-term @sv
created: 2019-01-04
modified: 2025-08-14
Vastavuoroinen suhde: videon musiikki
alternative label: musiikki videoon (teos)
alternative label: musik till videon (verk) @sv
broader: musiikki teokseen
definition: Teos, joka on video, jota musiikkiteos täydentää. (RDA Registry)
definition: Verk som är en video, som ett musikverk kompletterar. @sv
in scheme: Metatietosanasto
preferred label: music for video work @en
preferred label: musik till videon @sv

radio-ohjelman musiikki
type: Concept
source: RDA-termi
source: RDA-term @sv
created: 2019-01-04
modified: 2025-08-19
Vastavuoroinen suhde: musiikki radio-ohjelmaan
alternative label: radio-ohjelman musiikki (teos)
alternative label: musik till radioprogrammet (verk) @sv
broader: musiikki
definition: Musiikkiteos, joka täydentää teosta, joka on radio-ohjelma. (RDA Registry)
definition: Musikverk som kompletterar ett verk som är ett radioprogram. @sv
in scheme: Metatietosanasto
preferred label: radio program music work @en
preferred label: musik till radioprogrammet @sv

videon musiikki
type: Concept
source: RDA-termi
source: RDA-term @sv
created: 2019-01-04
modified: 2025-08-23
Vastavuoroinen suhde: musiikki videoon
alternative label: videon musiikki (teos)
alternative label: videomusik (verk) @sv
broader: musiikki
definition: Musiikkiteos, joka täydentää teosta, joka on video. (RDA Registry)
definition: Musikverk som kompletterar ett verk som är en video. @sv
in scheme: Metatietosanasto
preferred label: video music work @en
preferred label: videomusik @sv

käsikirjoitus radio-ohjelmaan
type: Concept
source: RDA-termi
source: RDA-term @sv
created: 2019-01-04
modified: 2025-07-04
Vastavuoroinen suhde: radio-ohjelman käsikirjoitus
alternative label: käsikirjoitus radio-ohjelmaan (teos)
alternative label: manuskript till radioprogrammet (verk) @sv
broader: teksti teokseen
definition: Teos, joka on radio-ohjelma, jota täydentää tekstiteos. (RDA Registry)
definition: Verk som är ett radioprogram som ett textverk kompletterar. @sv
in scheme: Metatietosanasto
preferred label: script for radio program work @en
preferred label: manuskript till radioprogrammet @sv

näytelmämusiikki
type: Concept
source: RDA-termi
source: RDA-term @sv
created: 2019-01-04
modified: 2025-08-15
Vastavuoroinen suhde: näytelmämusiikki teokseen
alternative label: näytelmämusiikki (teos)
alternative label: skådespelsmusik (verk) @sv
broader: musiikki
definition: Liittää teoksen musiikkiteokseen, joka täydentää teosta, joka on näytelmä tai muu näyttämöteos, joka toteutuu puheena. (RDA Registry)
definition: Sammankopplar ett verk med ett musikverk, som kompletterar ett verk som är ett skådespel eller ett annat sceniskt verk som förverkligas som tal. @sv
in scheme: Metatietosanasto
preferred label: incidental music work @en
preferred label: skådespelsmusik @sv

musiikki televisio-ohjelmaan
type: Concept
source: RDA-termi
source: RDA-term @sv
created: 2019-01-04
modified: 2025-08-14
Vastavuoroinen suhde: televisio-ohjelman musiikki
alternative label: musiikki televisio-ohjelmaan (teos)
alternative label: musik till tv-programmet (verk) @sv
broader: musiikki teokseen
definition: Teos, joka on televisio-ohjelma, jota musiikkiteos täydentää. (RDA Registry)
definition: Verk som är ett tv-program, som ett musikverk kompletterar. @sv
in scheme: Metatietosanasto
preferred label: music for television program work @en
preferred label: musik till tv-programmet @sv

kadenssi teokseen
type: Concept
source: RDA-termi
source: RDA-term @sv
created: 2019-01-04
modified: 2025-07-02
Vastavuoroinen suhde: kadenssi
alternative label: kadenssi sävellykseen
alternative label: kadenssi sävellykseen (teos)
alternative label: kadens till kompositionen @sv
alternative label: kadens till kompositionen (verk) @sv
broader: laajennus teokseen
definition: Musiikkiteos, kuten konsertto, johon on lisätty musiikkiteos, joka on solistille tarkoitettu koristeellinen osa samalta tai eri säveltäjältä. (RDA Registry)
definition: Musikverk, såsom en konsert, till vilken lagts till ett musikverk som är en dekorativ del för en solist, av samma eller en annan kompositör. @sv
in scheme: Metatietosanasto
preferred label: cadenza composed for work @en
preferred label: kadens till verket @sv

opas
type: Concept
source: RDA-termi
source: RDA-term @sv
created: 2019-01-04
modified: 2025-08-15
Vastavuoroinen suhde: opas teokseen
alternative label: opas (teos)
alternative label: guide (verk) @sv
broader: laajennettu teoksella
definition: Teos, joka opastaa käyttäjää vallitsevan teoksen käytössä huomautusten, harjoitusten, kysymysten ja vastausten, harjoitus- tai oppimateriaalin tms. avulla. (RDA Registry)
definition: Verk som handleder användare i användningen av ett verk med hjälp av anmärkningar, övningar, frågor och svar, läromedel eller dylikt. @sv
in scheme: Metatietosanasto
preferred label: guide work @en
preferred label: guide @sv

käsikirjoitus televisio-ohjelmaan
type: Concept
source: RDA-termi
source: RDA-term @sv
created: 2019-01-04
modified: 2025-07-04
Vastavuoroinen suhde: televisio-ohjelman käsikirjoitus
alternative label: käsikirjoitus televisio-ohjelmaan (teos)
alternative label: manuskript till tv-programmet (verk) @sv
broader: käsikirjoitus teokseen
definition: Teos, joka on televisio-ohjelma, jota täydentää tekstiteos. (RDA Registry)
definition: Verk som är ett tv-program som ett textverk kompletterar. @sv
in scheme: Metatietosanasto
preferred label: screenplay for television program work @en
preferred label: manuskript till tv-programmet @sv

elokuvan käsikirjoitus
type: Concept
source: RDA-termi
source: RDA-term @sv
created: 2019-01-04
modified: 2025-05-27
Vastavuoroinen suhde: käsikirjoitus elokuvaan
alternative label: elokuvan käsikirjoitus (teos)
alternative label: filmmanuskript (verk) @sv
broader: käsikirjoitus
definition: Teos, joka on tekstiteos, joka täydentää teosta, joka on elokuva. (RDA Registry)
definition: Verk som är ett textverk, som kompletterar ett verk som är film. @sv
in scheme: Metatietosanasto
preferred label: motion picture screenplay work @en
preferred label: filmmanuskript @sv

suplementti teokseen
type: Concept
source: RDA-termi
source: RDA-term @sv
created: 2019-01-04
modified: 2025-08-21
Vastavuoroinen suhde: suplementti
broader: laajennus teokseen
definition: Teos, jota päivittää tai muutoin täydentää laajentava teos. (RDA Registry)
definition: Verk som uppdateras eller i övrigt kompletteras av ett utvidgande verk. @sv
in scheme: Metatietosanasto
preferred label: supplement to work @en
preferred label: supplement till verket @sv

musiikki radio-ohjelmaan
type: Concept
source: RDA-termi
source: RDA-term @sv
created: 2019-01-04
modified: 2025-08-14
Vastavuoroinen suhde: radio-ohjelman musiikki
alternative label: musiikki radio-ohjelmaan (teos)
alternative label: musik till radioprogrammet (verk) @sv
broader: musiikki teokseen
definition: Teos, joka on radio-ohjelma, jota musiikkiteos täydentää. (RDA Registry)
definition: Verk som är ett radioprogram, som ett musikverk kompletterar. @sv
in scheme: Metatietosanasto
preferred label: music for radio program work @en
preferred label: musik till radioprogrammet @sv

liite
type: Concept
source: RDA-termi
source: RDA-term @sv
created: 2019-01-04
modified: 2025-07-05
Vastavuoroinen suhde: liite teokseen
alternative label: liite (teos)
alternative label: bilaga (verk) @sv
broader: laajennettu teoksella
definition: Teos, jonka sisältö laajentaa siihen liittyvää teosta. (RDA Registry)
definition: Verk vars innehåll utvidgar ett relaterat verk. @sv
in scheme: Metatietosanasto
preferred label: appendix work @en
preferred label: bilaga @sv
scope note: Sisältää viiteluettelot, tilastotaulut ja selitykset, jotka eivät ole välttämättömiä sisällön täydellisyydelle. (RDA Registry)
scope note: Innefattar referensförteckningar, statistiktabeller och förklaringar, som inte är nödvändiga för att innehållet ska vara fullständigt. @sv

liite teokseen
type: Concept
source: RDA-termi
source: RDA-term @sv
created: 2019-01-04
modified: 2025-07-05
Vastavuoroinen suhde: liite
broader: laajennus teokseen
definition: Teos, jonka sisältöä on laajennettu siihen liittyvän teoksen ekspression sisällöllä. (RDA Registry)
definition: Verk vars innehåll har utvidgats med innehåll från ett relaterat verks uttryck. @sv
in scheme: Metatietosanasto
preferred label: appendix to work @en
preferred label: bilaga till verket @sv
scope note: Kattaa viitelistat, tilastolliset taulukot ja selitykset, jotka eivät ole välttämättömiä, jotta sisältö olisi täydellinen. (RDA Registry)
scope note: Innefattar referenslistor, statistiktabeller och förklaringar, som inte är nödvändiga för att innehållet ska vara fullständigt. @sv

painovirheluettelo
type: Concept
source: RDA-termi
source: RDA-term @sv
created: 2019-01-04
modified: 2025-08-15
Vastavuoroinen suhde: painovirheluettelo teokseen
alternative label: korjattu teos
alternative label: painovirheluettelo (teos)
alternative label: erratalista (verk) @sv
alternative label: korrigerat verk @sv
broader: laajennettu teoksella
definition: Teos, joka koostuu julkaisemisen jälkeen löytyneistä virheistä ja niiden korjauksista. (RDA Registry)
definition: Verk som består av fel och korrigeringar av dessa, som upptäckts efter utgivning. @sv
in scheme: Metatietosanasto
preferred label: errata work @en
preferred label: erratalista @sv

käsikirjoitus videoon
type: Concept
source: RDA-termi
source: RDA-term @sv
created: 2019-01-04
modified: 2025-07-04
Vastavuoroinen suhde: videon käsikirjoitus
alternative label: käsikirjoitus videoon (teos)
alternative label: manuskript till videon (verk) @sv
broader: käsikirjoitus teokseen
definition: Teos, joka on video, jota täydentää tekstiteos. (RDA Registry)
definition: Verk som är en video som ett textverk kompletterar. @sv
in scheme: Metatietosanasto
preferred label: screenplay for video work @en
preferred label: manuskript till videon @sv

suplementti
type: Concept
source: RDA-termi
source: RDA-term @sv
created: 2019-01-04
modified: 2025-08-21
Vastavuoroinen suhde: suplementti teokseen
alternative label: suplementti (teos)
alternative label: supplement (verk) @sv
broader: laajennettu teoksella
definition: Teos, joka päivittää tai muuten täydentää pääteosta. (RDA Registry)
definition: Verk som uppdaterar eller i övrigt kompletterar ett huvudsakligt verk. @sv
in scheme: Metatietosanasto
preferred label: supplement work @en
preferred label: supplement @sv

kuvitus
type: Concept
source: RDA-termi
source: RDA-term @sv
created: 2019-01-04
modified: 2025-07-04
Vastavuoroinen suhde: kuvitus teokseen
alternative label: kuvitus (teos)
alternative label: illustration (verk) @sv
broader: laajennettu teoksella
definition: Teos, joka koostuu laajennettavaa teosta selittävästä ja koristavasta kuvamateriaalista. (RDA Registry)
definition: Verk som består av bildmaterial som förklarar och dekorerar ett utvidgat verk. @sv
in scheme: Metatietosanasto
preferred label: illustrations work @en
preferred label: illustration @sv

televisio-ohjelman musiikki
type: Concept
source: RDA-termi
source: RDA-term @sv
created: 2019-01-04
modified: 2025-08-22
Vastavuoroinen suhde: musiikki televisio-ohjelmaan
alternative label: televisio-ohjelman musiikki (teos)
alternative label: musik (verk) till tv-programmet @sv
broader: musiikki
definition: Musiikkiteos, joka täydentää teosta, joka on televisio-ohjelma. (RDA Registry)
definition: Musikverk som kompletterar ett verk, som är ett tv-program. @sv
in scheme: Metatietosanasto
preferred label: television program music work @en
preferred label: musik till tv-programmet @sv

käsikirjoitus elokuvaan
type: Concept
source: RDA-termi
source: RDA-term @sv
created: 2019-01-04
modified: 2025-07-04
Vastavuoroinen suhde: elokuvan käsikirjoitus
alternative label: käsikirjoitus elokuvaan (teos)
alternative label: manuskript till filmen (verk) @sv
broader: käsikirjoitus teokseen
definition: Teos, joka on elokuva, jota täydentää tekstiteos. (RDA Registry)
definition: Verk som är en film som kompletterar ett textverk. @sv
in scheme: Metatietosanasto
preferred label: screenplay for motion picture work @en
preferred label: manuskript till filmen @sv

elokuvamusiikki
type: Concept
source: RDA-termi
source: RDA-term @sv
created: 2019-01-04
modified: 2025-01-10
Vastavuoroinen suhde: musiikki elokuvaan
alternative label: elokuvamusiikki (teos)
alternative label: filmmusik (verk) @sv
broader: musiikki
definition: Musiikkiteos, joka täydentää teosta, joka on elokuva. (RDA Registry)
definition: Musikverk som kompletterar ett verk som är en film. @sv
in scheme: Metatietosanasto
preferred label: motion picture music work @en
preferred label: filmmusik @sv

lisäykset
type: Concept
source: RDA-termi
source: RDA-term @sv
created: 2019-01-04
modified: 2025-07-05
Vastavuoroinen suhde: lisäykset teokseen
alternative label: lisäykset (teos)
alternative label: tillägg (verk) @sv
broader: laajennettu teoksella
definition: Teos, joka koostuu suppeasta sisällöstä, joka on olennainen siihen liittyvän teoksen kokonaisuudelle. (RDA Registry)
definition: Verk som består av kortfattat innehåll, som är väsentligt för helheten i ett relaterat verk. @sv
in scheme: Metatietosanasto
preferred label: addenda work @en
preferred label: tillägg @sv

videon käsikirjoitus
type: Concept
source: RDA-termi
source: RDA-term @sv
created: 2019-01-04
modified: 2025-08-23
Vastavuoroinen suhde: käsikirjoitus videoon
alternative label: videon käsikirjoitus (teos)
alternative label: manuskript till video (verk) @sv
broader: käsikirjoitus
definition: Teos, joka on tekstiteos, joka täydentää teosta, joka on video. (RDA Registry)
definition: Verk som är ett textverk, som kompletterar ett verk som är en video. @sv
in scheme: Metatietosanasto
preferred label: video screenplay work @en
preferred label: manuskript till video @sv

opas teokseen
type: Concept
source: RDA-termi
source: RDA-term @sv
created: 2019-01-04
modified: 2025-08-15
Vastavuoroinen suhde: opas
broader: laajennus teokseen
definition: Teos, jota laajentaa siihen liittyvä teos, joka koostuu pääteoksen käyttäjää auttavasta materiaalista, kuten muistiinpanoista, opiskelumateriaaleista, harjoituksista, tehtävistä, kysymyksistä ja vastauksista, opettajan ja oppilaan aineistoista tms. (RDA Registry)
definition: Verk som utvidgas av ett relaterat verk, som består av material som hjälper användare av ett huvudsakligt verk, såsom anteckningar, studiematerial, övningar, uppgifter, frågor och svar, material för lärare eller studerande etc. @sv
in scheme: Metatietosanasto
preferred label: guide to work @en
preferred label: guide till verket @sv

kadenssi
type: Concept
source: RDA-termi
source: RDA-term @sv
created: 2019-01-04
modified: 2025-07-02
Vastavuoroinen suhde: kadenssi teokseen
alternative label: kadenssi (teos)
alternative label: kadens (verk) @sv
broader: laajennettu teoksella
definition: Musiikkiteos, joka on solistille tarkoitettu koristeellinen osa ja on lisätty saman tai eri säveltäjän musiikkiteokseen, kuten konserttoon. (RDA Registry)
definition: Musikverk som är en dekorativ del avsedd för en solist och som har lagts till ett musikverk, såsom en konsert, av samma eller olika kompositörer. @sv
in scheme: Metatietosanasto
preferred label: cadenza work @en
preferred label: kadens @sv

näytelmämusiikki teokseen
type: Concept
source: RDA-termi
source: RDA-term @sv
created: 2019-01-04
modified: 2025-08-15
Vastavuoroinen suhde: näytelmämusiikki
alternative label: näytelmämusiikki näyttämöteokseen
alternative label: skådespelsmusik till det sceniska verket @sv
broader: musiikki teokseen
definition: Teos, joka on näytelmä tai muu näyttämöteos, joka toteutuu puheena ja jota on täydennetty musiikkiteoksella. (RDA Registry)
definition: Verk som är ett skådespel eller något annat sceniskt verk, som förverkligas som tal och som har kompletterats med ett musikverk. @sv
in scheme: Metatietosanasto
preferred label: incidental music for work @en
preferred label: skådespelsmusik till verket @sv

painovirheluettelo teokseen
type: Concept
source: RDA-termi
source: RDA-term @sv
created: 2019-01-04
modified: 2025-08-15
Vastavuoroinen suhde: painovirheluettelo
alternative label: korjaukset teokseen
alternative label: rättelser till verket @sv
broader: laajennus teokseen
definition: Teos, jota on laajennettu teoksen julkaisemisen jälkeen löytyneiden virheiden luettelolla ja niiden korjauksilla. (RDA Registry)
definition: Verk som har utvidgats med en förteckning över fel som upptäckts efter utgivning, och korrigeringar av dessa. @sv
in scheme: Metatietosanasto
preferred label: errata to work @en
preferred label: erratalista till verket @sv

vapaa käännös versiosta
type: Concept
source: RDA-termi
source: RDA-term @sv
created: 2019-01-05
modified: 2025-08-23
Vastavuoroinen suhde: vapaamuotoinen käännös
alternative label: vapaa käännös ekspressiosta
alternative label: vapaan käännöksen perustana
alternative label: vapaan käännöksen perustana (ekspressio)
alternative label: fri översättning av uttrycket @sv
alternative label: fri översättning baserad på @sv
alternative label: fri översättning baserad på (uttryck) @sv
broader: ekspression perustana
definition: Teoksen ekspressio, joka on sovitettu ja käännetty toiselle kielelle. (RDA Registry)
definition: Uttryck av verk, som har bearbetats och översatts till ett annat språk. @sv
in scheme: Metatietosanasto
preferred label: free translation of expression @en
preferred label: fri översättning av versionen @sv

mukautettu lyhennelmä versiosta
type: Concept
source: RDA-termi
source: RDA-term @sv
created: 2019-01-05
modified: 2025-08-14
Vastavuoroinen suhde: mukautettu lyhennelmä
alternative label: mukautettu lyhennelmä ekspressiosta
alternative label: mukautetun lyhennelmän perustana
alternative label: mukautetun lyhennelmän perustana (ekspressio)
alternative label: anpassad förkortning av uttrycket @sv
alternative label: anpassad förkortning baserad på @sv
alternative label: anpassad förkortning baserad på (uttryck) @sv
broader: ekspression perustana
definition: Teoksen ekspressio, joka on systemaattisesti, kokonaisuudessaan ja mukaillen tiivistetty. (RDA Registry)
definition: Uttryck av verk, som systematiskt och i sin helhet har anpassats och förkortats. @sv
in scheme: Metatietosanasto
preferred label: digest of expression @en
preferred label: anpassad förkortning av versionen @sv

parafraasi versiosta
type: Concept
source: RDA-termi
source: RDA-term @sv
created: 2019-01-05
modified: 2025-08-16
Vastavuoroinen suhde: parafraasi
alternative label: parafraasi ekspressiosta
alternative label: parafraasin perustana
alternative label: parafraasin perustana (ekspressio)
alternative label: parafras av uttrycket @sv
alternative label: parafras baserad på @sv
alternative label: parafras baserad på (uttryck) @sv
broader: ekspression perustana
definition: Teoksen ekspressio, jota on käytetty toisen teoksen ekspression sisällön eri muodossa tapahtuvan toisintamisen perustana. (RDA Registry)
definition: Uttryck av verk som har använts som grund för återgivning av innehållet i ett annat verks uttryck, i en annan form. @sv
in scheme: Metatietosanasto
preferred label: paraphrase of expression @en
preferred label: parafras av versionen @sv

musiikkiteoksen teksti
type: Concept
source: RDA-termi
source: RDA-term @sv
created: 2019-01-05
modified: 2025-08-14
Vastavuoroinen suhde: tekstiin perustuva musiikki
alternative label: musiikkiteoksen teksti (ekspressio)
alternative label: text till musikverk (uttryck) @sv
broader: ekspression perustana
definition: Teoksen ekspressio, joka on ei-näytelmällisen musiikkiteoksen (muun kuin oratorion) teksti. (RDA Registry)
definition: Uttryck av verk, som är text till ett icke-dramatiskt musikverk (annat än oratorium). @sv
in scheme: Metatietosanasto
preferred label: musical setting of expression @en
preferred label: text till musikverk @sv

uusintaproduktio versiosta
type: Concept
source: RDA-termi
source: RDA-term @sv
created: 2019-01-05
modified: 2025-08-23
Vastavuoroinen suhde: uusintaproduktio
alternative label: uusintaproduktio ekspressiosta
alternative label: uusintaproduktion perustana
alternative label: uusintaproduktion perustana (ekspressio)
alternative label: nyproduktion av uttrycket @sv
alternative label: nyproduktion baserad på @sv
alternative label: nyproduktion baserad på (uttryck) @sv
broader: ekspression perustana
definition: Teoksen ekspressio, jota on käytetty uuden elokuvan, televisio-ohjelman, radio-ohjelman tai videon perustana. (RDA Registry)
definition: Uttryck av verk som använts som grund för en ny film, ett tv-program, ett radioprogram eller en video. @sv
in scheme: Metatietosanasto
preferred label: remake of expression @en
preferred label: nyproduktion av versionen @sv

sovituksen perusta
type: Concept
source: RDA-termi
source: RDA-term @sv
created: 2019-01-05
modified: 2025-08-19
Vastavuoroinen suhde: sovitus
alternative label: sovituksen perustana
alternative label: arrangemang baserat på @sv
alternative label: bearbetning av @sv
broader: lähdeversio
definition: Musiikkiteoksen ekspressio, joka on muokattu alkuperäisestä poikkeavalle esityskokoonpanolle olevaksi sävellykseksi. (RDA Registry)
definition: Uttryck av musikverk, som har omarbetats till en komposition för en musikalisk besättning som avviker från originalets. @sv
in scheme: Metatietosanasto
preferred label: arrangement of @en
preferred label: arrangemang av @sv
scope note: Tätä elementtiä sovelletaan teoksen muunnoksiin, joissa on sama esityskokoonpano tms. ja jotka säilyttävät alkuperäisen sävellyksen musiikillisen pääsisällön oleellisin osin muuttumattomana. Elementti ei kata pääsisältöön kohdistuvia muunnoksia, joista syntyy uusi musiikkiteos. (RDA Registry)
scope note: Detta element tillämpas på varianter av verk, i vilka den musikaliska besättningen eller dylikt är samma och i vilka kompositionens musikaliska huvudsakliga innehåll till sina väsentliga delar har bevarats oförändrat. Elementet gäller inte ändringar beträffande det huvudsakliga innehållet, ur vilka ett nytt musikverk uppkommer. @sv

uudistetun version perusta
type: Concept
source: RDA-termi
source: RDA-term @sv
created: 2019-01-05
modified: 2025-08-23
Vastavuoroinen suhde: uudistettu versio
alternative label: uudistetun version perustana
alternative label: reviderad version av @sv
broader: lähdeversio
definition: Teoksen ekspressio, jota on käytetty päivitetyn, korjatun tai laajennetun version perustana. (RDA Registry)
definition: Uttryck av verk, som har använts som grund för en uppdaterad, korrigerad eller utvidgad version. @sv
in scheme: Metatietosanasto
preferred label: revision of @en
preferred label: reviderad version baserad på @sv

parodia versiosta
type: Concept
source: RDA-termi
source: RDA-term @sv
created: 2019-01-05
modified: 2025-08-16
Vastavuoroinen suhde: parodia
alternative label: parodia ekspressiosta
alternative label: parodian perustana
alternative label: parodian perustana (ekspressio)
alternative label: parodi baserad på @sv
alternative label: parodi baserad på (uttryck) @sv
alternative label: parodi på uttrycket @sv
broader: jäljitelmä versiosta
definition: Teoksen ekspressio, jonka tyyliä tai sisältöä jäljitellään humoristisesti. (RDA Registry)
definition: Uttryck av verk vars stil eller innehåll imiteras humoristiskt. @sv
in scheme: Metatietosanasto
preferred label: parody of expression @en
preferred label: parodi på versionen @sv

variaation perustana oleva versio
type: Concept
source: RDA-termi
source: RDA-term @sv
created: 2019-01-05
modified: 2025-08-23
Vastavuoroinen suhde: variaatio
alternative label: variaation perustana
alternative label: variaation perustana (ekspressio)
alternative label: variaation perustana oleva ekspressio
alternative label: variation baserad på @sv
alternative label: variation baserad på (uttryck) @sv
alternative label: variation baserad på uttrycket @sv
broader: ekspression perustana
definition: Musiikkiteoksen ekspressio, josta melodinen, temaattinen tai harmoninen aines on otettu erillisen, toistettavan ja muunneltavan teeman muodostamiseksi. (RDA Registry)
definition: Uttryck av musikverk, ur vilket ett melodiskt, tematiskt eller harmoniskt material har tagits för att bilda ett fristående, återgivbart och varierat tema. @sv
in scheme: Metatietosanasto
preferred label: variations based on expression @en
preferred label: variation baserad på versionen @sv

laajennettu versio versiosta
type: Concept
source: RDA-termi
source: RDA-term @sv
created: 2019-01-05
modified: 2025-07-04
Vastavuoroinen suhde: laajennelma
alternative label: laajennelman perustana
alternative label: laajennelman perustana (ekspressio)
alternative label: laajennettu versio ekspressiosta
alternative label: utvidgad version av uttrycket @sv
alternative label: utvidgad version baserad på @sv
alternative label: utvidgad version baserad på (uttryck) @sv
broader: ekspression perustana
definition: Teoksen ekspressio, jota on käytetty toisen teoksen ekspression sisältöä laajentavan johdannaisteoksen perustana. (RDA Registry)
definition: Uttryck av verk som har använts som grund för ett härlett verk som utvidgar innehållet i ett annat verks uttryck. @sv
in scheme: Metatietosanasto
preferred label: expanded version of expression @en
preferred label: utvidgad version av versionen @sv

lyhennelmä versiosta
type: Concept
source: RDA-termi
source: RDA-term @sv
created: 2019-01-05
modified: 2025-07-05
Vastavuoroinen suhde: lyhennelmä
alternative label: lyhennelmä ekspressiosta
alternative label: lyhennelmän perustana
alternative label: lyhennelmän perustana (ekspressio)
alternative label: förkortning av uttrycket @sv
alternative label: förkortning baserad på @sv
alternative label: förkortning baserad på (uttryck) @sv
broader: ekspression perustana
definition: Teoksen ekspressio, jota on lyhennetty siihen liittyvän teoksen ekspressioksi muuttamatta yleistä merkitystä tai esitystapaa. (RDA Registry)
definition: Uttryck av verk som förkortats till ett relaterat verks uttryck utan att ändra dess allmänna betydelse eller presentationssätt. @sv
in scheme: Metatietosanasto
preferred label: abridgement of expression @en
preferred label: förkortning av versionen @sv

sovitettu koreografiaksi
type: Concept
source: RDA-termi
source: RDA-term @sv
created: 2019-01-12
modified: 2025-08-19
Vastavuoroinen suhde: koreografinen sovitus teoksesta
alternative label: sovitettu koreografiaksi (teos)
alternative label: teokseen perustuva koreografia
alternative label: teokseen pohjautuva koreografia
alternative label: bearbetad till koreografi (verk) @sv
alternative label: koreografi baserad på verk @sv
broader: mukaelma
definition: Teos, joka on toiseen teokseen perustuva koreografinen teos. (RDA Registry)
definition: Verk som är ett koreografiskt verk som grundar sig på ett annat verk. @sv
in scheme: Metatietosanasto
preferred label: adapted as choreography work @en
preferred label: bearbetad till koreografi @sv

lauluntekijä
type: Concept
source: Kansallinen RDA-termi
source: Nationell RDA-term @sv
created: 2019-02-07
modified: 2023-05-17
broader: säveltäjä
broader: sanoittaja
in scheme: Metatietosanasto
preferred label: songwriter @en
preferred label: låtskrivare @sv

intertekstuaalisen viittauksen perustana (teos)
type: Concept
source: Kansallinen RDA-termi
source: Nationell RDA-term @sv
created: 2019-09-17
modified: 2024-12-18
Vastavuoroinen suhde: intertekstuaalinen suhde (teos)
alternative label: intertextuell hänvisning baserad på (verk) @sv
broader: teoksen perustana
in scheme: Metatietosanasto
preferred label: intertextuell referens baserad på (verk) @sv

intertekstuaalinen suhde (teos)
type: Concept
source: Kansallinen RDA-termi
source: Nationell RDA-term @sv
created: 2019-09-18
modified: 2024-12-18
Vastavuoroinen suhde: intertekstuaalisen viittauksen perustana (teos)
broader: johdannaisteos
in scheme: Metatietosanasto
preferred label: intertextuell relation (verk) @sv

version osa
type: Concept
source: RDA-termi
source: RDA-term @sv
created: 2019-12-21
modified: 2026-05-20
Vastavuoroinen suhde: osa teoksen versiosta
alternative label: container of (expression) @en
alternative label: ekspression osa
alternative label: del av uttrycket @sv
broader: versioon liittyvä versio
definition: Ekspressio, joka on itsenäinen osa toista ekspressiota. (RDA Registry)
definition: Uttryck som är en självständig del av ett annat uttryck. @sv
in scheme: Metatietosanasto
preferred label: part expression @en
preferred label: del av versionen @sv

osa teoksen versiosta
type: Concept
source: RDA-termi
source: RDA-term @sv
created: 2019-12-21
modified: 2025-08-15
Vastavuoroinen suhde: version osa
alternative label: contained in (expression) @en
alternative label: osa ekspressiosta
alternative label: sisältyy ekspressioon
alternative label: del av uttrycket @sv
alternative label: ingår i uttryck @sv
broader: versioon liittyvä versio
definition: Ekspressio, jolla on toinen ekspressio erillisenä osana. (RDA Registry)
definition: Uttryck som har ett annat uttryck som en skild del. @sv
in scheme: Metatietosanasto
preferred label: part of expression @en
preferred label: del av versionen @sv

dramatisointi versiosta
type: Concept
source: RDA-termi
source: RDA-term @sv
created: 2020-03-07
modified: 2025-04-16
Vastavuoroinen suhde: dramatisointi
alternative label: dramatisoinnin perustana
alternative label: dramatisoinnin perustana (ekspressio)
alternative label: dramatisointi ekspressiosta
alternative label: dramatisering av uttrycket @sv
alternative label: dramatisering baserad på @sv
alternative label: dramatisering baserad på (uttryck) @sv
broader: mukaelma versiosta
definition: Teoksen ekspressio, joka on sovitettu näytelmäksi. (RDA Registry)
definition: Uttryck av verk som har omarbetats till skådespel. @sv
in scheme: Metatietosanasto
preferred label: dramatization of expression @en
preferred label: dramatisering av versionen @sv

runomukaelma versiosta
type: Concept
source: RDA-termi
source: RDA-term @sv
created: 2020-03-07
modified: 2025-08-19
Vastavuoroinen suhde: runomukaelma
alternative label: runomukaelma ekspressiosta
alternative label: runomukaelman perustana
alternative label: runomukaelman perustana (ekspressio)
alternative label: versbearbetning av uttrycket @sv
alternative label: versbearbetning baserad på @sv
alternative label: versbearbetning baserad på (uttryck) @sv
broader: mukaelma versiosta
definition: Teoksen ekspressio, joka on sovitettu runomuotoiseksi kirjalliseksi tuotokseksi. (RDA Registry)
definition: Uttryck av verk som har bearbetats till ett litterärt alster i versform. @sv
in scheme: Metatietosanasto
preferred label: verse adaptation of expression @en
preferred label: versbearbetning av versionen @sv

sarjakuvaversio versiosta
type: Concept
source: RDA-termi
source: RDA-term @sv
created: 2020-03-07
modified: 2025-08-19
Vastavuoroinen suhde: sarjakuvaversio
alternative label: sarjakuvaversio ekspressiosta
alternative label: sarjakuvaversion perustana
alternative label: sarjakuvaversion perustana (ekspressio)
alternative label: serieversion av versionen @sv
alternative label: tecknad serie-version av uttrycket @sv
alternative label: tecknad serie-version baserad på @sv
alternative label: tecknad serie-version baserad på (uttryck) @sv
broader: mukaelma versiosta
definition: Teoksen ekspressio, joka on sovitettu sarjakuvaromaaniksi. (RDA Registry)
definition: Uttryck av verk som har bearbetats till grafisk roman. @sv
in scheme: Metatietosanasto
preferred label: graphic novelization of expression @en
preferred label: tecknad serie-version av versionen @sv

oratoriosovitus versiosta
type: Concept
source: RDA-termi
source: RDA-term @sv
created: 2020-03-07
modified: 2025-08-15
Vastavuoroinen suhde: oratoriosovitus
alternative label: oratoriosovituksen perustana
alternative label: oratoriosovituksen perustana (ekspressio)
alternative label: oratoriosovitus ekspressiosta
alternative label: oratoriebearbetning av uttrycket @sv
alternative label: oratoriebearbetning baserad på @sv
alternative label: oratoriebearbetning baserad på (uttryck) @sv
broader: mukaelma versiosta
definition: Teoksen ekspressio, joka on sovitettu oratorioksi. (RDA Registry)
definition: Uttryck av verk som har bearbetats till oratorium. @sv
in scheme: Metatietosanasto
preferred label: oratorio adaptation of expression @en
preferred label: oratoriebearbetning av versionen @sv

elokuvaversio versiosta
type: Concept
source: RDA-termi
source: RDA-term @sv
created: 2020-03-07
modified: 2025-05-29
Vastavuoroinen suhde: elokuvaversio
alternative label: elokuvaversio ekspressiosta
alternative label: elokuvaversion perustana
alternative label: elokuvaversion perustana (ekspressio)
alternative label: filmversion av uttrycket @sv
alternative label: filmversion baserad på @sv
alternative label: filmversion baserad på (uttryck) @sv
broader: mukaelma versiosta
definition: Teoksen ekspressio, joka on sovitettu elokuvaksi. (RDA Registry)
definition: Uttryck av verk, som har omarbetats till film. @sv
in scheme: Metatietosanasto
preferred label: motion picture adaptation of expression @en
preferred label: filmversion av versionen @sv

elokuvakäsikirjoituksen perustana oleva versio
type: Concept
source: RDA-termi
source: RDA-term @sv
created: 2020-03-07
modified: 2025-05-29
Vastavuoroinen suhde: sovitettu elokuvakäsikirjoitukseksi
alternative label: elokuvakäsikirjoituksen perustana
alternative label: elokuvakäsikirjoituksen perustana (ekspressio)
alternative label: elokuvakäsikirjoituksen perustana oleva ekspressio
alternative label: filmmanuskript baserat på @sv
alternative label: filmmanuskript baserat på (uttryck) @sv
alternative label: filmmanuskript baserat på uttrycket @sv
broader: käsikirjoituksen perustana oleva versio
definition: Teoksen ekspressio, joka on sovitettu elokuvan käsikirjoitukseksi. (RDA Registry)
definition: Uttryck av verk, som har omarbetats till filmmanuskript. @sv
in scheme: Metatietosanasto
preferred label: motion picture screenplay based on expression @en
preferred label: filmmanuskript baserat på versionen @sv

radiosovitus versiosta
type: Concept
source: RDA-termi
source: RDA-term @sv
created: 2020-03-07
modified: 2025-08-19
Vastavuoroinen suhde: radiosovitus
alternative label: radiosovituksen perustana
alternative label: radiosovituksen perustana (ekspressio)
alternative label: radiosovitus ekspressiosta
alternative label: radiobearbetning av uttrycket @sv
alternative label: radiobearbetning baserad på @sv
alternative label: radiobearbetning baserad på (uttryck) @sv
broader: mukaelma versiosta
definition: Teoksen ekspressio, joka on sovitettu radio-ohjelmaksi. (RDA Registry)
definition: Uttryck av verk som har bearbetats till radioprogram. @sv
in scheme: Metatietosanasto
preferred label: radio adaptation of expression @en
preferred label: radiobearbetning av versionen @sv

romaanimukaelma versiosta
type: Concept
source: RDA-termi
source: RDA-term @sv
created: 2020-03-07
modified: 2025-08-19
Vastavuoroinen suhde: romaanimukaelma
alternative label: romaanimukaelma ekspressiosta
alternative label: romaanimukaelman perustana
alternative label: romaanimukaelman perustana (ekspressio)
alternative label: romanbearbetning av uttrycket @sv
alternative label: romanbearbetning baserad på @sv
alternative label: romanbearbetning baserad på (uttryck) @sv
broader: mukaelma versiosta
definition: Teoksen ekspressio, joka on sovitettu romaaniksi. (RDA Registry)
definition: Uttryck av verk som har bearbetats till en roman. @sv
in scheme: Metatietosanasto
preferred label: novelization of expression @en
preferred label: romanbearbetning av versionen @sv

videosovitus versiosta
type: Concept
source: RDA-termi
source: RDA-term @sv
created: 2020-03-07
modified: 2025-08-23
Vastavuoroinen suhde: videosovitus
alternative label: videosovituksen perustana
alternative label: videosovituksen perustana (ekspressio)
alternative label: videosovitus ekspressiosta
alternative label: videobearbetning av uttrycket @sv
alternative label: videobearbetning baserad på @sv
alternative label: videobearbetning baserad på (uttryck) @sv
broader: mukaelma versiosta
definition: Teoksen ekspressio, joka on sovitettu videoksi. (RDA Registry)
definition: Uttryck av verk, som har omarbetats till video. @sv
in scheme: Metatietosanasto
preferred label: video adaptation of expression @en
preferred label: videobearbetning av versionen @sv

radiokäsikirjoituksen perustana oleva versio
type: Concept
source: RDA-termi
source: RDA-term @sv
created: 2020-03-07
modified: 2025-08-19
Vastavuoroinen suhde: sovitettu radiokäsikirjoitukseksi
alternative label: radiokäsikirjoituksen perustana
alternative label: radiokäsikirjoituksen perustana (ekspressio)
alternative label: radiokäsikirjoituksen perustana oleva ekspressio
alternative label: radiomanuskript baserat på @sv
alternative label: radiomanuskript baserat på (uttryck) @sv
alternative label: radiomanuskript baserat på uttrycket @sv
broader: mukaelma versiosta
definition: Teoksen ekspressio, joka on sovitettu radio-ohjelman käsikirjoitukseksi. (RDA Registry)
definition: Uttryck av verk som har bearbetats till manuskript för ett radioprogram. @sv
in scheme: Metatietosanasto
preferred label: radio script based on expression @en
preferred label: radiomanuskript baserat på versionen @sv

dubattu versio
type: Concept
source: RDA-termi
source: RDA-term @sv
created: 2020-03-07
modified: 2025-05-27
Vastavuoroinen suhde: dubatun version perusta
broader: käännös
definition: Elokuvateoksen ekspressio, jossa alkuperäisteoksen puhuttu dialogi on käännetty toiselle kielelle. (RDA Registry)
definition: Uttryck av filmverk, i vilket originalverkets talade dialog har översatts till ett annat språk. @sv
in scheme: Metatietosanasto
preferred label: dubbed version @en
preferred label: dubbad version @sv

oopperasovitus versiosta
type: Concept
source: RDA-termi
source: RDA-term @sv
created: 2020-03-07
modified: 2025-08-15
Vastavuoroinen suhde: oopperasovitus
alternative label: oopperasovituksen perustana
alternative label: oopperasovituksen perustana (ekspressio)
alternative label: oopperasovitus ekspressiosta
alternative label: operabearbetning av uttrycket @sv
alternative label: operabearbetning baserad på @sv
alternative label: operabearbetning baserad på (uttryck) @sv
broader: mukaelma versiosta
definition: Teoksen ekspressio, joka on sovitettu oopperaksi. (RDA Registry)
definition: Uttryck av verk som har bearbetats till opera. @sv
in scheme: Metatietosanasto
preferred label: opera adaptation of expression @en
preferred label: operabearbetning av versionen @sv

parodia
type: Concept
source: RDA-termi
source: RDA-term @sv
created: 2020-03-07
modified: 2025-08-16
Vastavuoroinen suhde: parodia versiosta
alternative label: parodia (ekspressio)
alternative label: parodi (uttryck) @sv
broader: jäljitelmä
definition: Teoksen ekspressio, joka jäljittelee toisen teoksen ekspression tyyliä tai sisältöä humoristisesti. (RDA Registry)
definition: Uttryck av verk som imiterar ett annat verks uttrycks stil eller innehåll humoristiskt. @sv
in scheme: Metatietosanasto
preferred label: parodied as expression @en
preferred label: parodi @sv

videokäsikirjoituksen perustana oleva versio
type: Concept
source: RDA-termi
source: RDA-term @sv
created: 2020-03-07
modified: 2025-08-23
Vastavuoroinen suhde: sovitettu videokäsikirjoitukseksi
alternative label: videokäsikirjoituksen perustana
alternative label: videokäsikirjoituksen perustana (ekspressio)
alternative label: videokäsikirjoituksen perustana oleva ekspressio
alternative label: videomanuskript baserat på @sv
alternative label: videomanuskript baserat på (uttryck) @sv
alternative label: videomanuskript baserat på uttrycket @sv
broader: käsikirjoituksen perustana oleva versio
definition: Teoksen ekspressio, joka on sovitettu videon käsikirjoitukseksi. (RDA Registry)
definition: Uttryck av verk som har bearbetats till manuskript för en video. @sv
in scheme: Metatietosanasto
preferred label: video screenplay based on expression @en
preferred label: videomanuskript baserat på versionen @sv

abstraktit (ekspressio)
type: Concept
source: RDA-termi
source: RDA-term @sv
created: 2020-03-07
modified: 2026-06-06
Vastavuoroinen suhde: abstraktit ekspressiosta
alternative label: abstract @sv
alternative label: abstracter @sv
alternative label: abstrakter @sv
broader: johdannaisteoksen versio
definition: Teoksen ekspressio, joka on tiivistelmä- ja indeksointipalvelu, joka sisältää toisen ekspression sisällön abstraktit. (RDA Registry)
definition: Uttryck av verk, som är en sammanfattnings- eller indexeringstjänst, som innehåller abstrakt av ett annat uttrycks innehåll. @sv
in scheme: Metatietosanasto
preferred label: abstracted in expression @en
preferred label: abstrakt (uttryck) @sv

dubatun version perusta
type: Concept
source: RDA-termi
source: RDA-term @sv
created: 2020-03-07
modified: 2025-05-27
Vastavuoroinen suhde: dubattu versio
alternative label: dubatun version perustana
alternative label: dubbad version baserad på @sv
broader: käännöksen perusta
definition: Elokuvateoksen ekspressio, josta puhuttu dialogi on käännetty alkuperäisteoksesta poikkeavalle kielelle (RDA Registry)
definition: Uttryck av filmverk, ur vilket den talade dialogen har översatts till ett annat språk än originalverkets. @sv
in scheme: Metatietosanasto
preferred label: dubbed version of @en
preferred label: dubbad version av @sv

televisiosovitus versiosta
type: Concept
source: RDA-termi
source: RDA-term @sv
created: 2020-03-07
modified: 2025-08-22
Vastavuoroinen suhde: televisiosovitus
alternative label: televisiosovituksen perustana
alternative label: televisiosovituksen perustana (ekspressio)
alternative label: televisiosovitus ekspressiosta
alternative label: tv-bearbetning av uttrycket @sv
alternative label: tv-bearbetning baserad på @sv
alternative label: tv-bearbetning baserad på (uttryck) @sv
broader: mukaelma versiosta
definition: Teoksen ekspressio, joka on sovitettu televisio-ohjelmaksi. (RDA Registry)
definition: Uttryck av verk som har bearbetats till ett tv-program. @sv
in scheme: Metatietosanasto
preferred label: television adaptation of expression @en
preferred label: tv-bearbetning av versionen @sv

televisiokäsikirjoituksen perustana oleva versio
type: Concept
source: RDA-termi
source: RDA-term @sv
created: 2020-03-07
modified: 2025-08-22
Vastavuoroinen suhde: sovitettu televisiokäsikirjoitukseksi
alternative label: televisiokäsikirjoituksen perustana
alternative label: televisiokäsikirjoituksen perustana (ekspressio)
alternative label: televisiokäsikirjoituksen perustana oleva ekspressio
alternative label: tv-manuskript baserat på @sv
alternative label: tv-manuskript baserat på (uttryck) @sv
alternative label: tv-manuskript baserat på uttrycket @sv
broader: käsikirjoituksen perustana oleva versio
definition: Teoksen ekspressio, joka on sovitettu televisio-ohjelman käsikirjoitukseksi. (RDA Registry)
definition: Uttryck av verk som har bearbetats till manuskript för ett tv-program. @sv
in scheme: Metatietosanasto
preferred label: television screenplay based on expression @en
preferred label: tv-manuskript baserat på versionen @sv

libreton perustana oleva versio
type: Concept
source: RDA-termi
source: RDA-term @sv
created: 2020-03-07
modified: 2025-07-05
Vastavuoroinen suhde: teoksen versio sovitettu libretoksi
alternative label: libreton perustana
alternative label: libreton perustana (ekspressio)
alternative label: libreton perustana oleva ekspressio
alternative label: libretto baserat på @sv
alternative label: libretto baserat på (uttryck) @sv
alternative label: libretto baserat på uttrycket @sv
broader: mukaelma versiosta
definition: Teoksen ekspressio, jota on käytetty oopperan, muun musiikillisen näyttämöteoksen tai oratorion tekstin perustana. (RDA Registry)
definition: Uttryck av verk som har använts som grund för en text i en opera, något annat musikaliskt sceniskt verk eller ett oratorium. @sv
in scheme: Metatietosanasto
preferred label: libretto based on expression @en
preferred label: libretto baserat på versionen @sv

musikaaliversio versiosta
type: Concept
source: RDA-termi
source: RDA-term @sv
created: 2020-03-07
modified: 2025-08-14
Vastavuoroinen suhde: musikaaliversio
alternative label: musical theater adaptation of expression @en
alternative label: ekspression musikaaliversio
alternative label: musikaaliversio ekspressiosta
alternative label: musikaaliversion perustana
alternative label: musikaaliversion perustana (ekspressio)
alternative label: musikalversion av uttrycket @sv
alternative label: musikalversion baserad på @sv
alternative label: musikalversion baserad på (uttryck) @sv
broader: mukaelma versiosta
definition: Teoksen ekspressio, joka on sovitettu musikaaliteokseksi. (RDA Registry)
definition: Uttryck av verk, som har bearbetats till musikalverk. @sv
in scheme: Metatietosanasto
preferred label: musical theatre adaptation of expression @en
preferred label: musikalversion av versionen @sv

koreografinen sovitus versiosta
type: Concept
source: RDA-termi
source: RDA-term @sv
created: 2020-03-07
modified: 2025-07-04
Vastavuoroinen suhde: teoksen versio sovitettu koreografiaksi
alternative label: koreografian perustana
alternative label: koreografian perustana (ekspressio)
alternative label: koreografinen sovitus ekspressiosta
alternative label: koreografi baserad på @sv
alternative label: koreografi baserad på (uttryck) @sv
alternative label: koreografisk bearbetning av uttrycket @sv
broader: mukaelma versiosta
definition: Teoksen ekspressio, joka on sovitettu teokseksi, joka koostuu liikkeestä. (RDA Registry)
definition: Uttryck av verk som har bearbetats till ett verk som består av rörelse. @sv
in scheme: Metatietosanasto
preferred label: choreographic adaptation of expression @en
preferred label: koreografisk bearbetning av versionen @sv

laajennelma
type: Concept
source: RDA-termi
source: RDA-term @sv
created: 2020-04-02
modified: 2025-07-04
Vastavuoroinen suhde: laajennettu versio versiosta
alternative label: laajennelma (ekspressio)
alternative label: utvidgad version (uttryck) @sv
broader: johdannaisteoksen versio
definition: Teoksen ekspressio, joka laajentaa toisen teoksen ekspression sisältöä. (RDA Registry)
definition: Uttryck av verk som utvidgar innehållet i ett annat verks uttryck. @sv
in scheme: Metatietosanasto
preferred label: expanded as expression @en
preferred label: utvidgad version @sv

dramatisointi
type: Concept
source: RDA-termi
source: RDA-term @sv
created: 2020-04-02
modified: 2025-04-16
Vastavuoroinen suhde: dramatisointi versiosta
alternative label: dramatisointi (ekspressio)
alternative label: dramatisering (uttryck) @sv
broader: mukaelma
definition: Draamateoksen ekspressio, joka on sovitettu toisen teoksen ekspressiosta. (RDA Registry)
definition: Uttryck av dramaverk, som omarbetats från ett annat verks uttryck. @sv
in scheme: Metatietosanasto
preferred label: dramatized as expression @en
preferred label: dramatisering @sv

sovitettu televisiokäsikirjoitukseksi
type: Concept
source: RDA-termi
source: RDA-term @sv
created: 2020-04-02
modified: 2025-08-19
Vastavuoroinen suhde: televisiokäsikirjoituksen perustana oleva versio
alternative label: sovitettu televisiokäsikirjoitukseksi (ekspressio)
alternative label: televisiokäsikirjoitus
alternative label: televisiokäsikirjoitus (ekspressio)
alternative label: bearbetad till tv-manuskript (uttryck) @sv
alternative label: tv-manuskript @sv
alternative label: tv-manuskript (uttryck) @sv
broader: teoksen versio sovitettu käsikirjoitukseksi
definition: Teoksen ekspressio, joka koostuu toisen teoksen ekspressioon perustuvasta televisio-ohjelman käsikirjoituksesta. (RDA Registry)
definition: Uttryck av verk som består av ett manuskript till ett tv-program som grundar sig på ett annat verks uttryck. @sv
in scheme: Metatietosanasto
preferred label: adapted as television screenplay expression @en
preferred label: bearbetad till tv-manuskript @sv

sovitettu elokuvakäsikirjoitukseksi
type: Concept
source: RDA-termi
source: RDA-term @sv
created: 2020-04-02
modified: 2025-08-19
Vastavuoroinen suhde: elokuvakäsikirjoituksen perustana oleva versio
alternative label: elokuvakäsikirjoitus
alternative label: elokuvakäsikirjoitus (ekspressio)
alternative label: sovitettu elokuvakäsikirjoitukseksi (ekspressio)
alternative label: bearbetad till filmmanuskript (uttryck) @sv
alternative label: filmmanuskript (uttryck) @sv
broader: teoksen versio sovitettu käsikirjoitukseksi
definition: Teoksen ekspressio, joka koostuu toisen teoksen ekspressioon perustuvasta liikkuvan kuvan teoksen käsikirjoituksesta. (RDA Registry)
definition: Uttryck av verk som består av ett manuskript till ett verk med rörlig bild, som grundar sig på ett annat verks uttryck. @sv
in scheme: Metatietosanasto
preferred label: adapted as motion picture screenplay expression @en
preferred label: bearbetad till filmmanuskript @sv

teoksen versio sovitettu libretoksi
type: Concept
source: RDA-termi
source: RDA-term @sv
created: 2020-04-02
modified: 2025-08-23
Vastavuoroinen suhde: libreton perustana oleva versio
alternative label: ekspressioon perustuva libretto
alternative label: sovitettu libretoksi
alternative label: sovitettu libretoksi (ekspressio)
alternative label: bearbetad till libretto @sv
alternative label: bearbetad till libretto (uttryck) @sv
alternative label: libretto baserat på uttryck @sv
broader: mukaelma
definition: Teoksen ekspressio, joka koostuu toisen teoksen ekspressioon perustuvasta oopperan, muun musiikillisen näyttämöteoksen tai oratorion tekstistä. (RDA Registry)
definition: Uttryck av verk, som består av en text till en opera, något annat musikaliskt sceniskt verk eller ett oratorium, som grundar sig på ett annat verks uttryck. @sv
in scheme: Metatietosanasto
preferred label: adapted as libretto expression @en
preferred label: version bearbetad till libretto @sv

teoksen versio sovitettu koreografiaksi
type: Concept
source: RDA-termi
source: RDA-term @sv
created: 2020-04-02
modified: 2025-08-23
Vastavuoroinen suhde: koreografinen sovitus versiosta
alternative label: ekspressioon pohjautuva koreografia
alternative label: sovitettu koreografiaksi
alternative label: sovitettu koreografiaksi (ekspressio)
alternative label: bearbetad till koreografi @sv
alternative label: bearbetad till koreografi (uttryck) @sv
alternative label: koreografi baserad på uttryck @sv
broader: mukaelma
definition: Teoksen ekspressio, joka koostuu toisen teoksen ekspressioon perustuvasta liikkeestä. (RDA Registry)
definition: Uttryck av verk, som består av rörelse som grundar sig på ett annat verks uttryck. @sv
in scheme: Metatietosanasto
preferred label: adapted as choreography expression @en
preferred label: version bearbetad till koreografi @sv

sovitettu videokäsikirjoitukseksi
type: Concept
source: RDA-termi
source: RDA-term @sv
created: 2020-04-02
modified: 2025-08-19
Vastavuoroinen suhde: videokäsikirjoituksen perustana oleva versio
alternative label: sovitettu videokäsikirjoitukseksi (ekspressio)
alternative label: videokäsikirjoitus
alternative label: videokäsikirjoitus (ekspressio)
alternative label: beabetad till videomanuskript (uttryck) @sv
alternative label: videomanuskript @sv
alternative label: videomanuskript (uttryck) @sv
broader: teoksen versio sovitettu käsikirjoitukseksi
definition: Teoksen ekspressio, joka koostuu toisen teoksen ekspressioon perustuvasta videon käsikirjoituksesta. (RDA Registry)
definition: Uttryck av verk som består av ett manuskript till en video, som grundar sig på ett annat verks uttryck. @sv
in scheme: Metatietosanasto
preferred label: adapted as video screenplay expression @en
preferred label: beabetad till videomanuskript @sv

elokuvaversio
type: Concept
source: RDA-termi
source: RDA-term @sv
created: 2020-04-04
modified: 2025-05-29
Vastavuoroinen suhde: elokuvaversio versiosta
alternative label: elokuvaversio (ekspressio)
alternative label: filmversion (uttryck) @sv
broader: mukaelma
definition: Liikkuvan kuvan teoksen ekspressio, joka perustuu toisen teoksen ekspressioon. (RDA Registry)
definition: Uttryck av ett verk med rörlig bild, som grundar sig på ett annat verks uttryck. @sv
in scheme: Metatietosanasto
preferred label: adapted as motion picture expression @en
preferred label: filmversion @sv

romaanimukaelma
type: Concept
source: RDA-termi
source: RDA-term @sv
created: 2020-04-17
modified: 2025-08-19
Vastavuoroinen suhde: romaanimukaelma versiosta
alternative label: romaanimukaelma (ekspressio)
alternative label: romanbearbetning (uttryck) @sv
broader: mukaelma
definition: Romaanin ekspressio, joka on sovitettu toisen teoksen ekspressiosta. (RDA Registry)
definition: Uttryck av roman som har bearbetats utgående från ett annat verks uttryck. @sv
in scheme: Metatietosanasto
preferred label: adapted as novel expression @en
preferred label: romanbearbetning @sv

oopperasovitus
type: Concept
source: RDA-termi
source: RDA-term @sv
created: 2020-04-17
modified: 2025-08-15
Vastavuoroinen suhde: oopperasovitus versiosta
alternative label: oopperasovitus (ekspressio)
alternative label: operabearbetning (uttryck) @sv
broader: mukaelma
definition: Toisen teoksen ekspressioon perustuva oopperan ekspressio. (RDA Registry)
definition: Uttryck av opera som grundar sig på ett annat verks uttryck. @sv
in scheme: Metatietosanasto
preferred label: adapted as opera expression @en
preferred label: operabearbetning @sv

runomukaelma
type: Concept
source: RDA-termi
source: RDA-term @sv
created: 2020-04-17
modified: 2025-08-19
Vastavuoroinen suhde: runomukaelma versiosta
alternative label: runomukaelma (ekspressio)
alternative label: versbearbetning (uttryck) @sv
broader: mukaelma
definition: Runomuodossa oleva ekspressio, joka on sovitettu toisen teoksen ekspressiosta. (RDA Registry)
definition: Uttryck i versform, som är bearbetat utifrån ett annat verks uttryck. @sv
in scheme: Metatietosanasto
preferred label: adapted in verse as expression @en
preferred label: versbearbetning @sv

radiosovitus
type: Concept
source: RDA-termi
source: RDA-term @sv
created: 2020-04-17
modified: 2025-08-19
Vastavuoroinen suhde: radiosovitus versiosta
alternative label: radiosovitus (ekspressio)
alternative label: radiobearbetning (uttryck) @sv
broader: mukaelma
definition: Radio-ohjelman ekspressio, joka perustuu toisen teoksen ekspressioon. (RDA Registry)
definition: Uttryck av radioprogram, som grundar sig på ett annat verks uttryck. @sv
in scheme: Metatietosanasto
preferred label: adapted as radio program expression @en
preferred label: radiobearbetning @sv

sovitus
type: Concept
source: RDA-termi
source: RDA-term @sv
created: 2020-04-17
modified: 2025-08-19
Vastavuoroinen suhde: sovituksen perusta
broader: johdannaisversio
definition: Musiikkiteoksen ekspressio, joka muokkaa sävellystä esityskokoonpanolle, joka poikkeaa siitä, mille teos alun perin tarkoitettiin. (RDA Registry)
definition: Uttryck av musikverk, som omarbetar en komposition för en musikalisk besättning som avviker från den som ursprungligen avsågs för verket. @sv
in scheme: Metatietosanasto
preferred label: arranged as @en
preferred label: arrangerad som @sv
scope note: Tätä elementtiä sovelletaan teoksen muunnoksiin, joissa on sama esityskokoonpano tms. ja jotka säilyttävät alkuperäisen sävellyksen musiikillisen pääsisällön oleellisin osin muuttumattomana. Elementti ei kata pääsisältöön kohdistuvia muunnoksia, joista syntyy uusi musiikkiteos. (RDA Registry)
scope note: Detta element tillämpas på varianter av verk, i vilka den musikaliska besättningen eller dylikt är samma och i vilka kompositionens musikaliska huvudsakliga innehåll till sina väsentliga delar har bevarats oförändrat. Elementet gäller inte ändringar beträffande det huvudsakliga innehållet, ur vilka ett nytt musikverk uppkommer. @sv

videosovitus
type: Concept
source: RDA-termi
source: RDA-term @sv
created: 2020-04-17
modified: 2025-08-23
Vastavuoroinen suhde: videosovitus versiosta
alternative label: videosovitus (ekspressio)
alternative label: videobearbetning (uttryck) @sv
broader: mukaelma
definition: Videon ekspressio, joka perustuu toisen teoksen ekspressioon. (RDA Registry)
definition: Uttryck av video, som grundar sig på ett annat verks uttryck. @sv
in scheme: Metatietosanasto
preferred label: adapted as video expression @en
preferred label: videobearbetning @sv

variaatio
type: Concept
source: RDA-termi
source: RDA-term @sv
created: 2020-04-17
modified: 2025-08-23
Vastavuoroinen suhde: variaation perustana oleva versio
alternative label: variaatio (ekspressio)
alternative label: variation (uttryck) @sv
broader: johdannaisteoksen versio
definition: Musiikkiteoksen ekspressio, jossa toisen teoksen ekspressiosta otettu melodinen, temaattinen tai harmoninen aines muodostaa erillisen teeman, jota toistetaan muunnellen yhden tai useamman kerran. (RDA Registry)
definition: Uttryck av musikverk, i vilket ett melodiskt, tematiskt eller harmoniskt material, taget ur ett annat verks uttryck, bildar ett fristående tema som återges varierat en eller flera gånger. @sv
in scheme: Metatietosanasto
preferred label: modified by variation as expression @en
preferred label: variation @sv

sovitettu radiokäsikirjoitukseksi
type: Concept
source: RDA-termi
source: RDA-term @sv
created: 2020-04-17
modified: 2025-08-19
Vastavuoroinen suhde: radiokäsikirjoituksen perustana oleva versio
alternative label: radiokäsikirjoitus
alternative label: radiokäsikirjoitus (ekspressio)
alternative label: sovitettu radiokäsikirjoitukseksi (ekspressio)
alternative label: bearbetad till radiomanuskript (uttryck) @sv
alternative label: radiomanuskript @sv
alternative label: radiomanuskript (uttryck) @sv
broader: mukaelma
definition: Teoksen ekspressio, joka koostuu toisen teoksen ekspressioon perustuvasta radio-ohjelman käsikirjoituksesta. (RDA Registry)
definition: Uttryck av verk som består av ett manuskript till ett radioprogram som grundar sig på ett annat verks uttryck. @sv
in scheme: Metatietosanasto
preferred label: adapted as radio script expression @en
preferred label: bearbetad till radiomanuskript @sv

musikaaliversio
type: Concept
source: RDA-termi
source: RDA-term @sv
created: 2020-04-17
modified: 2025-08-14
Vastavuoroinen suhde: musikaaliversio versiosta
alternative label: adapted as musical theater expression @en
alternative label: musikaaliversio (ekspressio)
alternative label: sovitettu ekspression musikaaliversioksi
alternative label: bearbetad till musikalversion av uttryck @sv
alternative label: musikalversion (uttryck) @sv
broader: mukaelma
definition: Musikaaliteoksen ekspressio, joka perustuu toisen teoksen ekspressioon. (RDA Registry)
definition: Uttryck av musikalverk som grundar sig på ett annat verks uttryck. @sv
in scheme: Metatietosanasto
preferred label: adapted as musical theatre expression @en
preferred label: musikalversion @sv

tekstiin perustuva musiikki
type: Concept
source: RDA-termi
source: RDA-term @sv
created: 2020-04-17
modified: 2025-08-22
Vastavuoroinen suhde: musiikkiteoksen teksti
alternative label: tekstiin perustuva musiikki (ekspressio)
alternative label: musik baserad på texten (uttryck) @sv
broader: johdannaisteoksen versio
definition: Ei-näytelmällisen musiikkiteoksen (muun kuin oratorion) ekspressio, jonka teksti on peräisin toisen teoksen ekspressiosta. (RDA Registry)
definition: Uttryck av ett icke-dramatiskt musikverk (annat än oratorium), vars text är från ett annat verk. @sv
in scheme: Metatietosanasto
preferred label: set to music as expression @en
preferred label: musik baserad på texten @sv

vapaamuotoinen käännös
type: Concept
source: RDA-termi
source: RDA-term @sv
created: 2020-04-17
modified: 2025-08-23
Vastavuoroinen suhde: vapaa käännös versiosta
alternative label: vapaamuotoinen käännös (ekspressio)
alternative label: fri översättning (uttryck) @sv
broader: johdannaisteoksen versio
definition: Teoksen ekspressio, joka on sekä toisen teoksen ekspression mukaelma että käännös toiselle kielelle. (RDA Registry)
definition: Uttryck av verk, som är både en bearbetning av ett annat verks uttryck och en översättning till ett annat språk. @sv
in scheme: Metatietosanasto
preferred label: freely translated as expression @en
preferred label: fri översättning @sv

sarjakuvaversio
type: Concept
source: RDA-termi
source: RDA-term @sv
created: 2020-04-17
modified: 2025-08-19
Vastavuoroinen suhde: sarjakuvaversio versiosta
alternative label: sarjakuvaversio (ekspressio)
alternative label: serieversion @sv
alternative label: tecknad serie-version (uttryck) @sv
broader: mukaelma
definition: Sarjakuvaromaanin ekspressio, joka perustuu toisen teoksen ekspressioon. (RDA Registry)
definition: Uttryck av grafisk roman, som grundar sig på ett annat verks uttryck. @sv
in scheme: Metatietosanasto
preferred label: adapted as graphic novel expression @en
preferred label: tecknad serie-version @sv

mukautettu lyhennelmä
type: Concept
source: RDA-termi
source: RDA-term @sv
created: 2020-04-17
modified: 2025-08-14
Vastavuoroinen suhde: mukautettu lyhennelmä versiosta
alternative label: mukautettu lyhennelmä (ekspressio)
alternative label: anpassad förkortning (uttryck) @sv
broader: johdannaisteoksen versio
definition: Teoksen ekspressio, joka systemaattisesti ja kokonaisuudessaan tiivistää toisen teoksen ekspression. (RDA Registry)
definition: Uttryck av verk som systematiskt och i sin helhet anpassar och förkortar ett annat verks uttryck. @sv
in scheme: Metatietosanasto
preferred label: digested as expression @en
preferred label: anpassad förkortning @sv

televisiosovitus
type: Concept
source: RDA-termi
source: RDA-term @sv
created: 2020-04-17
modified: 2025-08-22
Vastavuoroinen suhde: televisiosovitus versiosta
alternative label: televisiosovitus (ekspressio)
alternative label: tv-bearbetning (uttryck) @sv
broader: mukaelma
definition: Televisio-ohjelman ekspressio, joka perustuu toisen teoksen ekspressioon. (RDA Registry)
definition: Uttryck av tv-program, som grundar sig på ett annat verks uttryck. @sv
in scheme: Metatietosanasto
preferred label: adapted as television program expression @en
preferred label: tv-bearbetning @sv

oratoriosovitus
type: Concept
source: RDA-termi
source: RDA-term @sv
created: 2020-04-17
modified: 2025-08-15
Vastavuoroinen suhde: oratoriosovitus versiosta
alternative label: oratoriosovitus (ekspressio)
alternative label: oratoriebearbetning (uttryck) @sv
broader: mukaelma
definition: Toisen teoksen ekspressioon perustuva oratorion ekspressio. (RDA Registry)
definition: Uttryck av oratorium som grundar sig på ett annat verks uttryck. @sv
in scheme: Metatietosanasto
preferred label: adapted as oratorio expression @en
preferred label: oratoriebearbetning @sv

koreografia
type: Concept
source: RDA-termi
source: RDA-term @sv
created: 2020-04-17
modified: 2025-07-04
Vastavuoroinen suhde: koreografia teoksen versioon
alternative label: koreografia (ekspressio)
alternative label: koreografi (uttryck) @sv
broader: täydentävä teoksen versio
definition: Teoksen ekspressio, joka antaa koreografian käytettäväksi siihen liittyvässä ekspressiossa. (RDA Registry)
definition: Uttryck av verk som ger en koreografi för användning i ett relaterat uttryck. @sv
in scheme: Metatietosanasto
preferred label: choreography expression @en
preferred label: koreografi @sv

lyhennelmä
type: Concept
source: RDA-termi
source: RDA-term @sv
created: 2020-04-17
modified: 2025-07-05
Vastavuoroinen suhde: lyhennelmä versiosta
alternative label: lyhennelmä (ekspressio)
alternative label: förkortning (uttryck) @sv
broader: johdannaisteoksen versio
definition: Teoksen ekspressio, joka lyhentää siihen liittyvän teoksen ekspressiota muuttamatta sen merkityssisältöä tai esitystyyliä. (RDA Registry)
definition: Uttryck av verk som förkortar ett relaterat verks uttryck, utan att ändra dess betydelsemässiga innehåll eller presentationssätt. @sv
in scheme: Metatietosanasto
preferred label: abridged as expression @en
preferred label: förkortning @sv

parafraasi
type: Concept
source: RDA-termi
source: RDA-term @sv
created: 2020-04-17
modified: 2025-08-16
Vastavuoroinen suhde: parafraasi versiosta
alternative label: parafraasi (ekspressio)
alternative label: parafras (uttryck) @sv
broader: johdannaisteoksen versio
definition: Teoksen ekspressio, joka toisintaa toisen teoksen ekspression sisällön eri muodossa. (RDA Registry)
definition: Uttryck av verk som återger ett annat verks uttrycks innehåll i en annan form. @sv
in scheme: Metatietosanasto
preferred label: paraphrased as expression @en
preferred label: parafras @sv

uusintaproduktio
type: Concept
source: RDA-termi
source: RDA-term @sv
created: 2020-04-17
modified: 2025-08-23
Vastavuoroinen suhde: uusintaproduktio versiosta
alternative label: uusintaproduktio (ekspressio)
alternative label: nyproduktion (uttryck) @sv
broader: johdannaisteoksen versio
definition: Uuden elokuvan, radio-ohjelman, televisio-ohjelman tai videon ekspressio, joka perustuu aiempaan teokseen. (RDA Registry)
definition: Nytt uttryck av en film, ett radioprogram, ett tv-program eller en video, som grundar sig på ett tidigare verk. @sv
in scheme: Metatietosanasto
preferred label: remade as expression @en
preferred label: nyproduktion @sv

radio-ohjelman käsikirjoitus
type: Concept
source: RDA-termi
source: RDA-term @sv
created: 2020-04-17
modified: 2025-08-19
Vastavuoroinen suhde: käsikirjoitus radio-ohjelmaan
alternative label: radio-ohjelman käsikirjoitus (ekspressio)
alternative label: manuskript till radioprogram (uttryck) @sv
broader: täydentävä teoksen versio
definition: Teoksen ekspressio, joka on radio-ohjelman käsikirjoitus. (RDA Registry)
definition: Uttryck av verk som är ett manuskript till ett radioprogram. @sv
in scheme: Metatietosanasto
preferred label: radio script expression @en
preferred label: manuskript till radioprogram @sv

käsikirjoitus radio-ohjelmaan
type: Concept
source: RDA-termi
source: RDA-term @sv
created: 2020-04-17
modified: 2025-07-04
Vastavuoroinen suhde: radio-ohjelman käsikirjoitus
alternative label: käsikirjoitus radio-ohjelmaan (ekspressio)
alternative label: manuskript till radioprogrammet (uttryck) @sv
broader: täydentävä teoksen versio
definition: Teoksen ekspressio, joka käyttää tekstiä radio-ohjelman käsikirjoituksena. (RDA Registry)
definition: Uttryck av verk som använder en text som radiomanuskript. @sv
in scheme: Metatietosanasto
preferred label: script for radio program expression @en
preferred label: manuskript till radioprogrammet @sv

opas teoksen versioon
type: Concept
source: RDA-termi
source: RDA-term @sv
created: 2020-04-17
modified: 2025-08-15
Vastavuoroinen suhde: opas
alternative label: opas ekspressioon
alternative label: guide till uttrycket @sv
broader: laajennus teoksen versioon
definition: Teoksen ekspressio, jota laajentaa siihen liittyvä teos, joka koostuu pääteoksen käyttäjää auttavasta aineistosta kuten muistiinpanoista, opiskelumateriaaleista, harjoituksista, tehtävistä, kysymyksistä ja vastauksista tai muista opettajan tai opiskelijan aineistoista. (RDA Registry)
definition: Uttryck av verk som utvidgas av ett relaterat verk, som består av material som hjälper användare av ett huvudsakligt verk, såsom anteckningar, studiematerial, övningar, uppgifter, frågor och svar, eller andra material för lärare eller studerande. @sv
in scheme: Metatietosanasto
preferred label: guide to expression @en
preferred label: guide till versionen @sv

säilytyskopio (manifestaatio)
type: Concept
source: RDA-termi
source: RDA-term @sv
created: 2020-04-17
modified: 2026-06-06
Vastavuoroinen suhde: säilytyskopio manifestaatiosta
alternative label: preservation facsimile (manifestation) @en
alternative label: aineiston säilytyskopio
alternative label: manifestaation säilytyskopio
alternative label: arkivbeständig kopia av manifestationen @sv
alternative label: arkivbeständig kopia av materialet @sv
broader: näköispainos (manifestaatio)
definition: Manifestaatio, joka koostuu arkistokelpoisesta materiaalista (esim. arkistopaperista) valmistetusta täsmällisestä jäljennöksestä. (RDA Registry)
definition: Manifestation som består av en exakt reproduktion tillverkad på arkivbeständigt material (t.ex. arkivpapper). @sv
in scheme: Metatietosanasto
preferred label: preservation facsimile of manifestation @en
preferred label: arkivbeständig kopia (manifestation) @sv

musiikki televisio-ohjelmaan
type: Concept
source: RDA-termi
source: RDA-term @sv
created: 2020-04-17
modified: 2025-08-14
Vastavuoroinen suhde: televisio-ohjelman musiikki
alternative label: musiikki televisio-ohjelmaan (ekspressio)
alternative label: musik till tv-programmet (uttryck) @sv
broader: musiikki teoksen versioon
definition: Teoksen ekspressio, joka käyttää musiikkiteosta televisio-ohjelmassa. (RDA Registry)
definition: Uttryck av verk, som använder ett musikverk i ett tv-program. @sv
in scheme: Metatietosanasto
preferred label: music for television program expression @en
preferred label: musik till tv-programmet @sv

suplementti
type: Concept
source: RDA-termi
source: RDA-term @sv
created: 2020-04-17
modified: 2025-08-21
Vastavuoroinen suhde: suplementti teoksen versioon
alternative label: suplementti (ekspressio)
alternative label: supplement (uttryck) @sv
broader: laajennettu versiolla
definition: Teoksen ekspressio, joka päivittää tai muuten täydentää vallitsevaa ekspressiota. (RDA Registry)
definition: Uttryck av verk, som uppdaterar eller i övrigt kompletterar ett huvudsakligt uttryck. @sv
in scheme: Metatietosanasto
preferred label: supplement expression @en
preferred label: supplement @sv

televisio-ohjelman musiikki
type: Concept
source: RDA-termi
source: RDA-term @sv
created: 2020-04-17
modified: 2025-08-22
Vastavuoroinen suhde: musiikki televisio-ohjelmaan
alternative label: televisio-ohjelman musiikki (ekspressio)
alternative label: musik till tv-programmet (uttryck) @sv
broader: musiikki
definition: Musiikkiteoksen ekspressio, jota käytetään televisio-ohjelmassa. (RDA Registry)
definition: Uttryck av musikverk, som används i ett tv-program. @sv
in scheme: Metatietosanasto
preferred label: television program music expression @en
preferred label: musik till tv-programmet @sv

videon musiikki
type: Concept
source: RDA-termi
source: RDA-term @sv
created: 2020-04-17
modified: 2025-08-23
Vastavuoroinen suhde: musiikki videoon
alternative label: videon musiikki (ekspressio)
alternative label: videomusik (uttryck) @sv
broader: musiikki
definition: Musiikkiteoksen ekspressio, jota käytetään videossa. (RDA Registry)
definition: Uttryck av musikverk som används i en video. @sv
in scheme: Metatietosanasto
preferred label: video music expression @en
preferred label: videomusik @sv

musiikki elokuvaan
type: Concept
source: RDA-termi
source: RDA-term @sv
created: 2020-04-17
modified: 2025-08-14
Vastavuoroinen suhde: elokuvamusiikki
alternative label: musiikki elokuvaan (ekspressio)
alternative label: musik till filmen (uttryck) @sv
broader: musiikki teoksen versioon
definition: Teoksen ekspressio, joka käyttää musiikkiteosta elokuvassa. (RDA Registry)
definition: Uttryck av verk, som använder ett musikverk i en film. @sv
in scheme: Metatietosanasto
preferred label: music for motion picture expression @en
preferred label: musik till filmen @sv

suplementti teoksen versioon
type: Concept
source: RDA-termi
source: RDA-term @sv
created: 2020-04-17
modified: 2025-08-21
Vastavuoroinen suhde: suplementti
alternative label: suplementti ekspressioon
alternative label: supplement till uttrycket @sv
broader: laajennus teoksen versioon
definition: Teoksen ekspressio, jota päivittää tai muutoin täydentää laajentava ekspressio. (RDA Registry)
definition: Uttryck av verk, som uppdateras eller i övrigt kompletteras av ett utvidgande uttryck. @sv
in scheme: Metatietosanasto
preferred label: supplement to expression @en
preferred label: supplement till versionen @sv

digitoitu aineisto
type: Concept
source: RDA-termi
source: RDA-term @sv
created: 2020-04-17
modified: 2025-04-16
Vastavuoroinen suhde: aineiston digitoitu jäljenne
alternative label: electronic reproduction of (manifestation) @en
alternative label: digitoitu manifestaatio
alternative label: digitoitu manifestaatiosta
alternative label: digitoituna
alternative label: digitoituna (manifestaatio)
alternative label: digitaliserad (manifestation) @sv
alternative label: digitaliserad manifestation @sv
alternative label: digitiserat material @sv
broader: jäljenne aineistosta
definition: Analogisessa muodossa oleva manifestaatio, joka on muunnettu digitaaliseen muotoon. (RDA Registry)
definition: Manifestation i analogt format, som överförts till digitalt format. @sv
in scheme: Metatietosanasto
preferred label: electronic reproduction of manifestation of @en
preferred label: digitaliserat material @sv

jakautunut versioon
type: Concept
source: RDA-termi
source: RDA-term @sv
created: 2020-04-17
modified: 2025-07-01
Vastavuoroinen suhde: jakautunut teoksen versiosta
alternative label: jakautumisen tulos
alternative label: jakautumisen tulos (ekspressio)
alternative label: jakautunut ekspressioon
alternative label: uppdelad i uttrycket @sv
alternative label: uppdelad på @sv
alternative label: uppdelad på (uttryck) @sv
broader: myöhempi teoksen versio
definition: Sellaisen teoksen ekspressio, joka on diakroninen teos, joka jatkaa toisen, valmiin diakronisen teoksen osittaista sisältöä. (RDA Registry)
definition: Uttryck av ett sådant verk som är ett diakroniskt verk, som fortsätter det partiella innehållet i ett annat, färdigt diakroniskt verk. @sv
in scheme: Metatietosanasto
preferred label: split into expression @en
preferred label: uppdelad i versionen @sv
scope note: Tämä elementti soveltuu yleensä peräkkäisesti ilmestyvän teoksen ekspressioon. (RDA Registry)
scope note: Detta element lämpar sig vanligen för successivt utkommande uttryck. @sv

videon käsikirjoitus
type: Concept
source: RDA-termi
source: RDA-term @sv
created: 2020-04-17
modified: 2025-08-23
Vastavuoroinen suhde: käsikirjoitus videoon
alternative label: videon käsikirjoitus (ekspressio)
alternative label: manuskript till video (uttryck) @sv
broader: käsikirjoitus
definition: Teoksen ekspressio, joka on videon käsikirjoitus. (RDA Registry)
definition: Uttryck av verk som är manuskript till en video. @sv
in scheme: Metatietosanasto
preferred label: video screenplay expression @en
preferred label: manuskript till video @sv

liite
type: Concept
source: RDA-termi
source: RDA-term @sv
created: 2020-04-17
modified: 2025-07-05
Vastavuoroinen suhde: liite teoksen versioon
alternative label: liite (ekspressio)
alternative label: bilaga (uttryck) @sv
broader: laajennettu versiolla
definition: Teoksen ekspressio, jonka sisältö laajentaa siihen liittyvän teoksen ekspressiota. (RDA Registry)
definition: Uttryck av verk vars innehåll utvidgar ett relaterat verks uttryck. @sv
in scheme: Metatietosanasto
preferred label: appendix expression @en
preferred label: bilaga @sv
scope note: Sisältää viiteluettelot, tilastotaulut ja selitykset, jotka eivät ole välttämättömiä sisällön täydellisyydelle. (RDA Registry)
scope note: Innefattar referensförteckningar, statistiktabeller och förklaringar, som inte är nödvändiga för att innehållet ska vara fullständigt. @sv

osittain korvattu versiolla
type: Concept
source: RDA-termi
source: RDA-term @sv
created: 2020-04-17
modified: 2025-08-15
Vastavuoroinen suhde: korvaa osittain teoksen version
alternative label: osittain korvattu ekspressiolla
alternative label: delvis ersatt av uttrycket @sv
broader: myöhempi teoksen versio
definition: Teoksen ekspressio, jonka sisältö osittain korvaa ja tekee vanhentuneeksi toisen teoksen ekspression sisällön. (RDA Registry)
definition: Uttryck av verk, vars innehåll delvis ersätter innehållet i ett annat verks uttryck, och gör det föråldrat. @sv
in scheme: Metatietosanasto
preferred label: replaced in part by expression @en
preferred label: delvis ersatt av versionen @sv
scope note: Tämä elementti soveltuu yleensä staattisen teoksen ekspressioon. (RDA Registry)
scope note: Detta element lämpar sig vanligen för ett statiskt verks uttryck. @sv

liite teoksen versioon
type: Concept
source: RDA-termi
source: RDA-term @sv
created: 2020-04-17
modified: 2025-07-05
Vastavuoroinen suhde: liite
alternative label: liite ekspressioon
alternative label: bilaga till uttrycket @sv
broader: laajennus teoksen versioon
definition: Teoksen ekspressio, jonka sisältöä on laajennettu siihen liittyvän teoksen ekspression sisällöllä. (RDA Registry)
definition: Uttryck av verk vars innehåll har utvidgats med innehåll från ett relaterat verks uttryck. @sv
in scheme: Metatietosanasto
preferred label: appendix to expression @en
preferred label: bilaga till versionen @sv
scope note: Sisältää viitelistat, tilastolliset taulukot ja selitykset, jotka eivät ole välttämättömiä, jotta sisältö olisi täydellinen. (RDA Registry)
scope note: Innefattar referenslistor, statistiktabeller och förklaringar, som inte är nödvändiga för att innehållet ska vara fullständigt. @sv

näköispainos sisältyy aineistoon
type: Concept
source: RDA-termi
source: RDA-term @sv
created: 2020-04-17
modified: 2025-08-15
Vastavuoroinen suhde: näköispainososa
alternative label: facsimile contained in @en
alternative label: näköispainos sisältyy manifestaatioon
alternative label: faksimil ingår i manifestationen @sv
broader: osa aineistoa
definition: Manifestaatio, jonka osa on täsmällinen jäljennös toisesta manifestaatiosta. (RDA Registry)
definition: Manifestation vars del är en exakt reproduktion av en annan manifestation. @sv
in scheme: Metatietosanasto
preferred label: facsimile part of @en
preferred label: faksimil ingår i materialet @sv

lisäykset teoksen versioon
type: Concept
source: RDA-termi
source: RDA-term @sv
created: 2020-04-17
modified: 2025-07-05
Vastavuoroinen suhde: lisäykset
alternative label: lisäykset ekspressioon
alternative label: tillägg till uttrycket @sv
broader: laajennus teoksen versioon
definition: Teoksen ekspressio, jonka sisältöä täydennetään suppealla sisällöllä siihen liittyvän teoksen ekspressiosta. (RDA Registry)
definition: Uttryck av verk vars innehåll kompletteras med kortfattat innehåll från ett relaterat verks uttryck. @sv
in scheme: Metatietosanasto
preferred label: addenda to expression @en
preferred label: tillägg till versionen @sv

näköispainososa
type: Concept
source: RDA-termi
source: RDA-term @sv
created: 2020-04-17
modified: 2025-08-15
Vastavuoroinen suhde: näköispainos sisältyy aineistoon
alternative label: facsimile container of @en
alternative label: sisältää näköispainoksen
alternative label: innehåller faksimil @sv
broader: aineiston osa
definition: Manifestaation täsmällinen jäljennös, joka on toisen manifestaation osana. (RDA Registry)
definition: Exakt reproduktion av en manifestation, som är en del av en annan manifestation. @sv
in scheme: Metatietosanasto
preferred label: facsimile part @en
preferred label: faksimildel @sv

konkordanssihakemisto
type: Concept
source: RDA-termi
source: RDA-term @sv
created: 2020-04-17
modified: 2025-07-03
Vastavuoroinen suhde: konkordanssihakemisto versioon
alternative label: konkordanssihakemisto (ekspressio)
alternative label: konkordans (uttryck) @sv
broader: ekspression perustana
definition: Teoksen ekspressio, joka koostuu kaikkien tai valikoitujen tekstiteoksen toteutuksessa esiintyvien sanojen hakemistosta. (RDA Registry)
definition: Uttryck av verk som består av ett register över alla eller utvalda ord som förekommer i förverkligandet av ett textverk. @sv
in scheme: Metatietosanasto
preferred label: concordance expression @en
preferred label: konkordans @sv

eronnut teoksen versioksi
type: Concept
source: RDA-termi
source: RDA-term @sv
created: 2020-04-17
modified: 2025-06-04
Vastavuoroinen suhde: eronnut teoksen versiosta
alternative label: continued in part by (expression) @en
alternative label: jatkuu osittain ekspressiossa
alternative label: fortsätter delvis i uttrycket @sv
alternative label: fortsätter delvis i verkets version @sv
broader: myöhempi teoksen versio
definition: Sellaisen teoksen ekspressio, joka on diakroninen teos, joka jatkaa toisen diakronisen jatkuvan teoksen sisältöä osittain. (RDA Registry)
definition: Uttryck av ett sådant verk som är ett diakroniskt verk, som delvis fortsätter innehållet i ett annat diakroniskt kontinuerligt verk. @sv
in scheme: Metatietosanasto
preferred label: separated into expression @en
preferred label: fortsätter delvis i versionen @sv
scope note: Tämä elementti soveltuu yleensä peräkkäisesti ilmestyvän teoksen ekspressioon. (RDA Registry)
scope note: Detta element lämpar sig vanligen för successivt utkommande uttryck. @sv

eronnut teoksen versiosta
type: Concept
source: RDA-termi
source: RDA-term @sv
created: 2020-04-17
modified: 2025-06-04
Vastavuoroinen suhde: eronnut teoksen versioksi
alternative label: eronnut ekspressiosta
alternative label: separerad från uttrycket @sv
alternative label: separerad från verkets version @sv
broader: teoksen edeltävä versio
definition: Sellaisen teoksen ekspressio, joka on diakroninen teos, jonka osittaista sisältöä jatkaa toisen diakronisen teoksen ekspressio. (RDA Registry)
definition: Uttryck av ett sådant verk som är ett diakroniskt verk, vars partiella innehåll fortsättes av ett uttryck av ett annat diakroniskt verk. @sv
in scheme: Metatietosanasto
preferred label: separated from expression @en
preferred label: separerad från versionen @sv
scope note: Tämä elementti soveltuu yleensä peräkkäisesti ilmestyvän teoksen ekspressioon. (RDA Registry)
scope note: Detta element lämpar sig vanligen för successivt utkommande uttryck. @sv

radio-ohjelman musiikki
type: Concept
source: RDA-termi
source: RDA-term @sv
created: 2020-04-17
modified: 2025-08-19
Vastavuoroinen suhde: musiikki radio-ohjelmaan
alternative label: radio-ohjelman musiikki (ekspressio)
alternative label: radiomusiikki
alternative label: radiomusiikki (ekspressio)
alternative label: musik till radioprogrammet (uttryck) @sv
alternative label: radiomusik @sv
alternative label: radiomusik (uttryck) @sv
broader: musiikki
definition: Musiikkiteoksen ekspressio, jota käytetään radio-ohjelmassa. (RDA Registry)
definition: Uttryck av musikverk som används i ett radioprogram. @sv
in scheme: Metatietosanasto
preferred label: radio program music expression @en
preferred label: musik till radioprogrammet @sv

teoksen version painovirheluettelo
type: Concept
source: RDA-termi
source: RDA-term @sv
created: 2020-04-17
modified: 2025-08-23
Vastavuoroinen suhde: painovirheluettelo teoksen versioon
alternative label: korjattu ekspressio
alternative label: painovirheluettelo
alternative label: painovirheluettelo (ekspressio)
alternative label: erratalista @sv
alternative label: erratalista (uttryck) @sv
alternative label: korrigerat uttryck @sv
broader: laajennettu versiolla
definition: Teoksen ekspressio, joka koostuu pääteoksen julkaisemisen jälkeen löytyneistä virheistä ja niiden korjauksista. (RDA Registry)
definition: Uttryck av verk, som består av fel som hittats efter utgivningen av ett huvudsakligt verk, och rättelser av dessa. @sv
in scheme: Metatietosanasto
preferred label: errata expression @en
preferred label: erratalista till versionen @sv

libretto versioon
type: Concept
source: RDA-termi
source: RDA-term @sv
created: 2020-04-17
modified: 2025-07-05
Vastavuoroinen suhde: libretto
alternative label: libretto ekspressioon
alternative label: libretto till uttrycket @sv
broader: täydentävä teoksen versio
definition: Musiikkiteoksen, kuten oopperan tai muun musiikillisen näyttämöteoksen tai oratorion, ekspressio, jossa käytetään siihen liittyvän teoksen tekstiä. (RDA Registry)
definition: Uttryck av ett musikverk, såsom en opera eller något annat musikaliskt sceniskt verk eller oratorium, i vilket ett relaterat verks text används. @sv
in scheme: Metatietosanasto
preferred label: libretto for expression @en
preferred label: libretto till versionen @sv

konvertoinnin tulos
type: Concept
source: RDA-termi
source: RDA-term @sv
created: 2020-04-17
modified: 2025-07-04
Vastavuoroinen suhde: konvertoitu aineisto
alternative label: digital transfer (manifestation) @en
alternative label: konvertoinnin tulos (manifestaatio)
alternative label: konvertoitu
alternative label: konvertoitu (manifestaatio)
alternative label: konverterad (manifestation) @sv
broader: aineiston jäljenne
definition: Digitaalisessa muodossa oleva manifestaatio, joka on tulosta toisessa digitaalisessa muodossa olevan manifestaation muunnoksesta. (RDA Registry)
definition: Manifestation i digital form, som är resultat av en konvertering av en manifestation i en annan digital form. @sv
in scheme: Metatietosanasto
preferred label: digital transfer of manifestation @en
preferred label: konverterad @sv

aineiston uusintapainos
type: Concept
source: RDA-termi
source: RDA-term @sv
created: 2020-04-17
modified: 2025-04-15
Vastavuoroinen suhde: uusintapainos aineistosta
alternative label: manifestaation uusintapainos
alternative label: uusintapainos
alternative label: nytryck @sv
alternative label: nytryck av manifestationen @sv
broader: aineiston jäljenne
definition: Uusintajulkaisu toisesta painetusta manifestaatiosta. (RDA Registry)
definition: Nyutgivning av en annan tryckt manifestation. @sv
in scheme: Metatietosanasto
preferred label: reprinted as manifestation @en
preferred label: nytryck av materialet @sv

konvertoitu aineisto
type: Concept
source: RDA-termi
source: RDA-term @sv
created: 2020-04-17
modified: 2025-07-04
Vastavuoroinen suhde: konvertoinnin tulos
alternative label: digital transfer of (manifestation) @en
alternative label: konvertoitu manifestaatio
alternative label: konvertoitu manifestaatiosta
alternative label: konvertoituna
alternative label: konvertoituna (manifestaatio)
alternative label: konverterad manifestation @sv
alternative label: konverterat från manifestationen @sv
alternative label: som konverterad (manifestation) @sv
broader: jäljenne aineistosta
definition: Digitaalisessa muodossa olevaan manifestaatio, joka muunnetaan toiseen digitaaliseen muotoon. (RDA Registry)
definition: Manifestation i digital form, som konverteras till en annan digital form. @sv
in scheme: Metatietosanasto
preferred label: digital transfer of manifestation of @en
preferred label: konverterat material @sv

säilytyskopio manifestaatiosta
type: Concept
source: RDA-termi
source: RDA-term @sv
created: 2020-04-17
modified: 2026-06-06
Vastavuoroinen suhde: säilytyskopio (manifestaatio)
alternative label: säilytyskopio aineistosta
alternative label: arkivbeständig kopia av materialet @sv
broader: näköispainos manifestaatiosta
definition: Manifestaatio, jota on käytetty täsmällisen ja arkistokelpoisen jäljennöksen pohjana. Jäljennöksen valmistuksessa on käytetty arkistokelpoista materiaalia, esim. arkistopaperia. (RDA Registry)
definition: Manifestation som använts som grund för en exakt och arkivbeständig reproduktion. Vid reproduktionens tillverkning har arkivbeständigt material, t.ex. arkivpapper, använts. @sv
in scheme: Metatietosanasto
preferred label: preservation facsimile of manifestation of @en
preferred label: arkivbeständig kopia av manifestationen @sv

elokuvan käsikirjoitus
type: Concept
source: RDA-termi
source: RDA-term @sv
created: 2020-04-17
modified: 2025-05-27
Vastavuoroinen suhde: käsikirjoitus elokuvaan
alternative label: elokuvan käsikirjoitus (ekspressio)
alternative label: filmmanuskript (uttryck) @sv
broader: käsikirjoitus
definition: Teoksen ekspressio, joka on elokuvan käsikirjoitus. (RDA Registry)
definition: Uttryck av verk som är filmmanuskript. @sv
in scheme: Metatietosanasto
preferred label: motion picture screenplay expression @en
preferred label: filmmanuskript @sv

koreografia teoksen versioon
type: Concept
source: RDA-termi
source: RDA-term @sv
created: 2020-04-17
modified: 2025-07-04
Vastavuoroinen suhde: koreografia
alternative label: koreografia ekspressioon
alternative label: koreografi till uttrycket @sv
alternative label: koreografi till verkets version @sv
broader: täydentävä teoksen versio
definition: Teoksen ekspressio, joka käyttää siihen liittyvän ekspression koreografiaa. (RDA Registry)
definition: Uttryck av verk som använder koreografi ur ett relaterat uttryck. @sv
in scheme: Metatietosanasto
preferred label: choreography for expression @en
preferred label: koreografi till versionen @sv

käsikirjoitus videoon
type: Concept
source: RDA-termi
source: RDA-term @sv
created: 2020-04-17
modified: 2025-07-04
Vastavuoroinen suhde: videon käsikirjoitus
alternative label: käsikirjoitus videoon (ekspressio)
alternative label: manuskript till videon (uttryck) @sv
broader: käsikirjoitus teoksen versioon
definition: Teoksen ekspressio, joka käyttää tekstiä videon käsikirjoituksena. (RDA Registry)
definition: Uttryck av verk som använder en text som videomanuskript. @sv
in scheme: Metatietosanasto
preferred label: screenplay for video expression @en
preferred label: manuskript till videon @sv

käsikirjoitus elokuvaan
type: Concept
source: RDA-termi
source: RDA-term @sv
created: 2020-04-17
modified: 2025-07-04
Vastavuoroinen suhde: elokuvan käsikirjoitus
alternative label: käsikirjoitus elokuvaan (ekspressio)
alternative label: manuskript till filmen (uttryck) @sv
broader: käsikirjoitus teoksen versioon
definition: Teoksen ekspressio, joka käyttää tekstiä elokuvan käsikirjoituksena. (RDA Registry)
definition: Uttryck av verk som använder en text som filmmanuskript. @sv
in scheme: Metatietosanasto
preferred label: screenplay for motion picture expression @en
preferred label: manuskript till filmen @sv

elokuvamusiikki
type: Concept
source: RDA-termi
source: RDA-term @sv
created: 2020-04-17
modified: 2025-05-27
Vastavuoroinen suhde: musiikki elokuvaan
alternative label: elokuvamusiikki (ekspressio)
alternative label: filmmusik (uttryck) @sv
broader: musiikki
definition: Musiikkiteoksen ekspressio, jota käytetään elokuvassa. (RDA Registry)
definition: Uttryck av musikverk, som används i en film. @sv
in scheme: Metatietosanasto
preferred label: motion picture music expression @en
preferred label: filmmusik @sv

painovirheluettelo teoksen versioon
type: Concept
source: RDA-termi
source: RDA-term @sv
created: 2020-04-17
modified: 2025-08-15
Vastavuoroinen suhde: teoksen version painovirheluettelo
alternative label: korjaukset ekspressioon
alternative label: painovirheluettelo ekspressioon
alternative label: erratalista till uttrycket @sv
alternative label: rättelser till uttrycket @sv
broader: laajennus teoksen versioon
definition: Teoksen ekspressio, jota on laajennettu teoksen julkaisemisen jälkeen löytyneiden virheiden luettelolla ja niiden korjauksilla. (RDA Registry)
definition: Uttryck av verk som har utvidgats med en förteckning över fel som upptäckts efter utgivning, och korrigeringar av dessa. @sv
in scheme: Metatietosanasto
preferred label: errata to expression @en
preferred label: erratalista till versionen @sv

kadenssi
type: Concept
source: RDA-termi
source: RDA-term @sv
created: 2020-04-17
modified: 2025-07-02
Vastavuoroinen suhde: kadenssi versioon
alternative label: kadenssi (ekspressio)
alternative label: kadens (uttryck) @sv
broader: laajennettu versiolla
definition: Musiikkiteoksen ekspressio, joka koostuu solistille tarkoitetusta koristeellisesta osasta ja on lisätty saman tai eri säveltäjän musiikkiteoksen, kuten konserton, ekspressioon. (RDA Registry)
definition: Uttryck av musikverk som består av en dekorativ del avsedd för en solist och som har lagts till ett musikverks uttryck, såsom en konsert, av samma eller olika kompositörer. @sv
in scheme: Metatietosanasto
preferred label: cadenza expression @en
preferred label: kadens @sv

kuvitus
type: Concept
source: RDA-termi
source: RDA-term @sv
created: 2020-04-17
modified: 2025-07-04
Vastavuoroinen suhde: kuvitus teoksen versioon
alternative label: kuvitus (ekspressio)
alternative label: illustration (uttryck) @sv
broader: laajennettu versiolla
definition: Teoksen ekspressio, joka koostuu laajennettavaa ekspressiota selittävästä ja koristavasta kuvamateriaalista. (RDA Registry)
definition: Uttryck av verk som består av bildmaterial som förklarar och dekorerar ett utvidgat uttryck. @sv
in scheme: Metatietosanasto
preferred label: illustrations expression @en
preferred label: illustration @sv

näytelmämusiikki versioon
type: Concept
source: RDA-termi
source: RDA-term @sv
created: 2020-04-17
modified: 2025-08-15
Vastavuoroinen suhde: näytelmämusiikki
alternative label: näytelmämusiikki ekspressioon
alternative label: näytelmämusiikki näyttämöekspressioon
alternative label: skådespelsmusik till det sceniska uttrycket @sv
alternative label: skådespelsmusik till uttrycket @sv
broader: musiikki teoksen versioon
definition: Teoksen, kuten näytelmän tai muun puhutun näyttämöteoksen, ekspressio, joka käyttää musiikkiteosta näytelmämusiikkina. (RDA Registry)
definition: Uttryck av ett verk, såsom ett skådespel eller något annat talat sceniskt verk, som använder ett musikverk som skådespelsmusik. @sv
in scheme: Metatietosanasto
preferred label: incidental music for expression @en
preferred label: skådespelsmusik till versionen @sv

teoksen versioon yhdistyjä
type: Concept
source: RDA-termi
source: RDA-term @sv
created: 2020-04-17
modified: 2025-08-23
Vastavuoroinen suhde: yhdistynyt teoksen versioksi
alternative label: ekspressioon yhdistyjä
alternative label: sammanslagen med uttrycket @sv
broader: teoksen edeltävä versio
definition: Teoksen ekspressio, joka on yhdistynyt yhden tai useamman ekspression kanssa ja muodostanut uuden ekspression. (RDA Registry)
definition: Uttryck av verk, som har sammanslagits med ett eller flera uttryck och bildat ett nytt uttryck. @sv
in scheme: Metatietosanasto
preferred label: merger of expression @en
preferred label: sammanslagen med versionen @sv

sulautunut teoksen versioon
type: Concept
source: RDA-termi
source: RDA-term @sv
created: 2020-04-17
modified: 2025-08-21
Vastavuoroinen suhde: sulautunut teoksen versio
alternative label: sulautunut ekspressioon
alternative label: införlivat i uttrycket @sv
alternative label: uppgått i versionen @sv
broader: myöhempi teoksen versio
definition: Teoksen ekspressio, jonka sisältöön toisen teoksen ekspression sisältö on yhdistynyt. (RDA Registry)
definition: Uttryck av verk, med vars innehåll ett annat verks uttrycks innehåll har införlivats. @sv
in scheme: Metatietosanasto
preferred label: absorbed by expression @en
preferred label: införlivat i versionen @sv

näytelmämusiikki
type: Concept
source: RDA-termi
source: RDA-term @sv
created: 2020-04-17
modified: 2025-08-15
Vastavuoroinen suhde: näytelmämusiikki versioon
alternative label: näytelmämusiikki (ekspressio)
alternative label: skådespelsmusik (uttryck) @sv
broader: musiikki
definition: Musiikkiteoksen ekspressio, joka toimii näytelmän tai muun puhutun näyttämöteoksen näytelmämusiikkina. (RDA Registry)
definition: Uttryck av musikverk, som fungerar som skådespelsmusik till ett skådespel eller något annat talat sceniskt verk. @sv
in scheme: Metatietosanasto
preferred label: incidental music expression @en
preferred label: skådespelsmusik @sv

yhdistynyt teoksen versioksi
type: Concept
source: RDA-termi
source: RDA-term @sv
created: 2020-04-17
modified: 2025-08-23
Vastavuoroinen suhde: teoksen versioon yhdistyjä
alternative label: yhdistynyt ekspressioksi
alternative label: sammanslagen till uttrycket @sv
broader: myöhempi teoksen versio
definition: Teoksen ekspressio, joka on muodostunut kahden tai useamman ekspression yhdistymisestä. (RDA Registry)
definition: Uttryck av verk, som har bildats ur sammanslagningen av två eller flera uttryck. @sv
in scheme: Metatietosanasto
preferred label: merged to form expression @en
preferred label: sammanslagen till versionen @sv

sisältää kappaleen
type: Concept
source: RDA-termi
source: RDA-term @sv
created: 2020-04-17
modified: 2025-08-19
Vastavuoroinen suhde: sisältyy kappaleeseen
broader: kappaleeseen liittyvä kappale
definition: Kappale, joka on itsenäinen osa laajempaa kappaletta. (RDA Registry)
definition: Exemplar som är en självständig del av ett mera omfattande exemplar. @sv
in scheme: Metatietosanasto
preferred label: container of item @en
preferred label: innehåller exemplaret @sv

korvaa osittain teoksen version
type: Concept
source: RDA-termi
source: RDA-term @sv
created: 2020-04-17
modified: 2025-07-04
Vastavuoroinen suhde: osittain korvattu versiolla
alternative label: korvaa osittain ekspression
alternative label: ersätter delvis uttrycket @sv
broader: teoksen edeltävä versio
definition: Teoksen ekspressio, jonka sisällön toisen teoksen ekspression sisältö osittain korvaa ja tekee vanhentuneeksi. (RDA Registry)
definition: Uttryck av verk vars innehåll ett annat verks innehåll delvis ersätter och gör föråldrat. @sv
in scheme: Metatietosanasto
preferred label: replacement in part of expression @en
preferred label: ersätter delvis versionen @sv
scope note: Tämä elementti soveltuu yleensä staattisen teoksen ekspressioon. (RDA Registry)
scope note: Detta element lämpar sig vanligen för uttryck av ett statiskt verk. @sv

opas
type: Concept
source: RDA-termi
source: RDA-term @sv
created: 2020-04-17
modified: 2025-08-15
Vastavuoroinen suhde: opas teoksen versioon
alternative label: opas (ekspressio)
alternative label: guide (uttryck) @sv
broader: laajennettu versiolla
definition: Teoksen ekspressio, joka opastaa käyttäjää vallitsevan teoksen käytössä muistiinpanojen, opiskelumateriaalien, harjoitusten, tehtävien, kysymysten ja vastausten tai muiden opettajan tai opiskelijan aineistojen avulla. (RDA Registry)
definition: Uttryck av verk som handleder användare i användningen av ett verk med hjälp av anteckningar, studiematerial, övningar, uppgifter, frågor och svar eller andra material för lärare eller studerande. @sv
in scheme: Metatietosanasto
preferred label: guide expression @en
preferred label: guide @sv

libretto
type: Concept
source: RDA-termi
source: RDA-term @sv
created: 2020-04-17
modified: 2025-07-05
Vastavuoroinen suhde: libretto versioon
alternative label: libretto (ekspressio)
alternative label: libretto (uttryck) @sv
broader: täydentävä teoksen versio
definition: Teoksen ekspressio, joka on oopperan, muun musiikillisen näyttämöteoksen tai oratorion teksti. (RDA Registry)
definition: Uttryck av verk som är en text till en opera, något annat musikaliskt sceniskt verk eller ett oratorium. @sv
in scheme: Metatietosanasto
preferred label: libretto expression @en

musiikki radio-ohjelmaan
type: Concept
source: RDA-termi
source: RDA-term @sv
created: 2020-04-17
modified: 2025-08-14
Vastavuoroinen suhde: radio-ohjelman musiikki
alternative label: musiikki radio-ohjelmaan (ekspressio)
alternative label: musik till radioprogrammet (uttryck) @sv
broader: musiikki teoksen versioon
definition: Teoksen ekspressio, joka käyttää musiikkiteosta radio-ohjelmassa. (RDA Registry)
definition: Uttryck av verk, som använder ett musikverk i ett radioprogram. @sv
in scheme: Metatietosanasto
preferred label: music for radio program expression @en
preferred label: musik till radioprogrammet @sv

televisio-ohjelman käsikirjoitus
type: Concept
source: RDA-termi
source: RDA-term @sv
created: 2020-04-17
modified: 2025-08-22
Vastavuoroinen suhde: käsikirjoitus televisio-ohjelmaan
alternative label: televisio-ohjelman käsikirjoitus (ekspressio)
alternative label: manuskript till tv-program (uttryck) @sv
broader: käsikirjoitus
definition: Teoksen ekspressio, joka on televisio-ohjelman käsikirjoitus. (RDA Registry)
definition: Uttryck av verk som är manuskript till ett tv-program. @sv
in scheme: Metatietosanasto
preferred label: television screenplay expression @en
preferred label: manuskript till tv-program @sv

käsikirjoitus televisio-ohjelmaan
type: Concept
source: RDA-termi
source: RDA-term @sv
created: 2020-04-17
modified: 2025-07-04
Vastavuoroinen suhde: televisio-ohjelman käsikirjoitus
alternative label: käsikirjoitus televisio-ohjelmaan (ekspressio)
alternative label: manuskript till tv-programmet (uttryck) @sv
broader: käsikirjoitus teoksen versioon
definition: Teoksen ekspressio, joka käyttää tekstiä televisio-ohjelman käsikirjoituksena. (RDA Registry)
definition: Uttryck av verk, som använder en text som tv-manuskript. @sv
in scheme: Metatietosanasto
preferred label: screenplay for television program expression @en
preferred label: manuskript till tv-programmet @sv

korvaa version
type: Concept
source: RDA-termi
source: RDA-term @sv
created: 2020-04-17
modified: 2025-07-04
Vastavuoroinen suhde: korvaava teoksen versio
alternative label: korvaa ekspression
alternative label: ersätter uttrycket @sv
broader: teoksen edeltävä versio
definition: Teoksen ekspressio, jonka sisällön toisen teoksen ekspression sisältö korvaa ja tekee vanhentuneeksi. (RDA Registry)
definition: Uttryck av verk vars innehåll ett annat verks uttrycks innehåll ersätter och gör föråldrat. @sv
in scheme: Metatietosanasto
preferred label: replacement of expression @en
preferred label: ersätter versionen @sv
scope note: Tämä elementti soveltuu yleensä staattisen teoksen tai päivittyvän teoksen ekspressioon. (RDA Registry)
scope note: Detta element lämpar sig vanligen för uttryck av ett statiskt eller integrerande verk. @sv

mukana ilmestynyt aineisto
type: Concept
source: RDA-termi
source: RDA-term @sv
created: 2020-04-17
modified: 2025-08-14
alternative label: accompanying expression relationship @en
alternative label: accompanying manifestation relationship @en
alternative label: accompanying work relationship @en
alternative label: ilmestynyt yhdessä
alternative label: ilmestynyt yhdessä (manifestaatio)
alternative label: mukana ilmestynyt manifestaatio
alternative label: utgiven tillsammans (manifestation) @sv
alternative label: utkommen tillsammans med manifestationen @sv
broader: aineistoon liittyvä aineisto
definition: Manifestaatio, joka on osa samaa manifestaatiota kuin toinen manifestaation osa. (RDA Registry)
definition: Manifestation som är en del av samma manifestation som en annan del av en manifestation. @sv
in scheme: Metatietosanasto
narrower: tallenteella myös
preferred label: accompanied by manifestation @en
preferred label: utkommen tillsammans med materialet @sv

osittain sulautunut teoksen versio
type: Concept
source: RDA-termi
source: RDA-term @sv
created: 2020-04-17
modified: 2025-08-15
Vastavuoroinen suhde: sulautunut osittain teoksen versioon
alternative label: ekspressioon osittain sulautunut
alternative label: osittain sulautunut ekspressio
alternative label: delvis införlivat uttryck @sv
alternative label: delvis uppgått i uttryck @sv
alternative label: uttryck som delvis uppgått @sv
alternative label: version som delvis uppgått @sv
broader: teoksen edeltävä versio
definition: Teoksen ekspressio, jonka osittainen sisältö on yhdistynyt toisen teoksen ekspression sisältöön. (RDA Registry)
definition: Uttryck av verk, vars innehåll delvis har införlivats i ett annat verks uttrycks innehåll. @sv
in scheme: Metatietosanasto
preferred label: absorption in part of expression @en
preferred label: delvis införlivad version @sv

lisäykset
type: Concept
source: RDA-termi
source: RDA-term @sv
created: 2020-04-17
modified: 2025-07-05
Vastavuoroinen suhde: lisäykset teoksen versioon
alternative label: lisäykset (ekspressio)
alternative label: tillägg (uttryck) @sv
broader: laajennettu versiolla
definition: Teoksen ekspressio, joka koostuu suppeasta sisällöstä, joka on olennainen siihen liittyvän teoksen kokonaisuudelle. (RDA Registry)
definition: Uttryck av verk som består av kortfattat innehåll, som är väsentligt för helheten i ett relaterat verk. @sv
in scheme: Metatietosanasto
preferred label: addenda expression @en
preferred label: tillägg @sv

kuvitus teoksen versioon
type: Concept
source: RDA-termi
source: RDA-term @sv
created: 2020-04-17
modified: 2025-07-04
Vastavuoroinen suhde: kuvitus
alternative label: kuvitus ekspressioon
alternative label: illustration till uttrycket @sv
broader: laajennus teoksen versioon
definition: Teoksen ekspressio, jota on laajennettu sitä selittämään tai koristamaan suunnitellulla kuvasisällöllä. (RDA Registry)
definition: Uttryck av verk, som har utvidgats med bildinnehåll som är avsett att förklara eller dekorera det. @sv
in scheme: Metatietosanasto
preferred label: illustrations for expression @en
preferred label: illustration till versionen @sv

jakautunut teoksen versiosta
type: Concept
source: RDA-termi
source: RDA-term @sv
created: 2020-04-17
modified: 2025-07-01
Vastavuoroinen suhde: jakautunut versioon
alternative label: continuation in part of (expression) @en
alternative label: jakautunut ekspressiosta
alternative label: jatkaa osittain ekspressiota
alternative label: fortsätter delvis uttrycket @sv
alternative label: uppdelad från uttrycket @sv
alternative label: uppdelad från verkets version @sv
broader: teoksen edeltävä versio
definition: Sellaisen teoksen ekspressio, joka on valmis diakroninen teos, jonka osittaista sisältöä jatkaa toisen diakronisen teoksen ekspressio. (RDA Registry)
definition: Uttryck av ett sådant verk, som är ett färdigt diakroniskt verk, vars partiella innehåll fortsättes av ett annat diakroniskt verks uttryck. @sv
in scheme: Metatietosanasto
preferred label: split from expression @en
preferred label: uppdelad från versionen @sv
scope note: Tämä elementti soveltuu yleensä peräkkäisesti ilmestyvän teoksen ekspressioon. (RDA Registry)
scope note: Detta element lämpar sig vanligen för successivt utkommande uttryck. @sv

musiikki videoon
type: Concept
source: RDA-termi
source: RDA-term @sv
created: 2020-04-17
modified: 2025-08-14
Vastavuoroinen suhde: videon musiikki
alternative label: musiikki videoon (ekspressio)
alternative label: musik till videon (uttryck) @sv
broader: musiikki teoksen versioon
definition: Teoksen ekspressio, joka käyttää musiikkiteosta videossa. (RDA Registry)
definition: Uttryck av verk, som använder ett musikverk i en video. @sv
in scheme: Metatietosanasto
preferred label: music for video expression @en
preferred label: musik till videon @sv

konkordanssihakemisto versioon
type: Concept
source: RDA-termi
source: RDA-term @sv
created: 2020-04-17
modified: 2025-07-03
Vastavuoroinen suhde: konkordanssihakemisto
alternative label: konkordanssihakemisto ekspressioon
alternative label: konkordans till uttrycket @sv
broader: johdannaisteoksen versio
definition: Teoksen ekspressio, jota on käytetty tekstiteoksen toteutuksessa esiintyvien kaikkien tai valikoitujen sanojen hakemiston perustana. (RDA Registry)
definition: Uttryck av verk använt som grund för ett register över alla eller utvalda ord som förekommer i förverkligandet av ett textverk. @sv
in scheme: Metatietosanasto
preferred label: concordance to expression @en
preferred label: konkordans till versionen @sv

sulautunut teoksen versio
type: Concept
source: RDA-termi
source: RDA-term @sv
created: 2020-04-17
modified: 2025-08-21
Vastavuoroinen suhde: sulautunut teoksen versioon
alternative label: ekspressioon sulautunut
alternative label: sulautunut ekspressio
alternative label: införlivat uttryck @sv
alternative label: uppgått i uttryck @sv
alternative label: version som uppgått @sv
broader: teoksen edeltävä versio
definition: Teoksen ekspressio, jonka sisältö on yhdistynyt toisen teoksen ekspression sisältöön. (RDA Registry)
definition: Uttryck av verk, med vars innehåll ett annat verks uttrycks innehåll har införlivats. @sv
in scheme: Metatietosanasto
preferred label: absorption of expression @en
preferred label: införlivad version @sv

sisältyy kappaleeseen
type: Concept
source: RDA-termi
source: RDA-term @sv
created: 2020-04-17
modified: 2025-08-19
Vastavuoroinen suhde: sisältää kappaleen
broader: kappaleeseen liittyvä kappale
definition: Kappale, joka on laajempi kappale, jonka itsenäinen osa kappale on. (RDA Registry)
definition: Exemplar som är ett mera omfattande exemplar, som ett exemplar är en självständig del av. @sv
in scheme: Metatietosanasto
preferred label: contained in item @en
preferred label: ingår i exemplaret @sv

korvaava teoksen versio
type: Concept
source: RDA-termi
source: RDA-term @sv
created: 2020-04-17
modified: 2025-07-04
Vastavuoroinen suhde: korvaa version
alternative label: korvaava ekspressio
alternative label: ersättande uttryck @sv
broader: myöhempi teoksen versio
definition: Teoksen ekspressio, jonka sisältö korvaa ja tekee vanhentuneeksi toisen teoksen ekspression sisällön. (RDA Registry)
definition: Uttryck av verk vars innehåll ett annat verks uttrycks innehåll ersätter och gör föråldrat. @sv
in scheme: Metatietosanasto
preferred label: replaced by expression @en
preferred label: ersättande version @sv
scope note: Tämä elementti soveltuu yleensä staattisen teoksen tai päivittyvän teoksen ekspressioon. (RDA Registry)
scope note: Detta element lämpar sig vanligen för uttryck av ett statiskt eller integrerande verk. @sv

kadenssi versioon
type: Concept
source: RDA-termi
source: RDA-term @sv
created: 2020-04-17
modified: 2025-07-02
Vastavuoroinen suhde: kadenssi
alternative label: kadenssi ekspressioon
alternative label: kadenssi sävellykseen
alternative label: kadenssi sävellykseen (ekspressio)
alternative label: kadens till kompositionen @sv
alternative label: kadens till kompositionen (uttryck) @sv
alternative label: kadens till uttrycket @sv
broader: laajennus teoksen versioon
definition: Musiikkiteoksen, kuten konserton, ekspressio, johon on lisätty musiikkiteoksen ekspressio, joka on solistille tarkoitettu koristeellinen osa samalta tai eri säveltäjältä. (RDA Registry)
definition: Uttryck av musikverk, såsom en konsert, till vilken lagts till ett musikverks uttryck som är en dekorativ del för en solist, av samma eller en annan kompositör. @sv
in scheme: Metatietosanasto
preferred label: cadenza composed for expression @en
preferred label: kadens till versionen @sv

peli
type: Concept
source: RDA-termi
source: RDA-term @sv
created: 2016-01-08
modified: 2023-05-17
definition: Laajuuden yksikkö, kolmiulotteisia objekteja sisältävä kokonaisuus, jota on tarkoitettu käytettäväksi sovittujen sääntöjen mukaisesti leikeissä opetuksessa, huviksi tai terapiassa.
definition: Enhet, helhet bestående av tredimensionella föremål, avsedd att användas enligt överenskomna regler i lekar, undervisning, som förströelse eller som terapi. @sv
example: MARC 21: 300## ‡a 1 peli (useita osia kotelossa) ‡c 13 x 18 x 4 cm + ‡e 2 taitelehteä (16 x 12 cm)
example: MARC 21: 300## ‡a 9 peliä (useita osia) + ‡e Opettajan info (23 sivua : kuvitettu)
example: MARC 21: 300## ‡a 1 spel (flera delar i fodral) ‡c 13 x 18 x 4 cm + ‡e 2 foldrar (16 x 12 cm) @sv
example: MARC 21: 300## ‡a 9 spel (flera delar) + ‡e Lärarens info (23 sidor : illustrationer) @sv
in scheme: Metatietosanasto
narrower: lautapeli
narrower: palapeli
preferred label: game @en
preferred label: spel @sv

henkilöjäsen yhteisössä
type: Concept
source: RDA-termi
source: RDA-term @sv
created: 2020-05-07
modified: 2025-01-11
alternative label: affiliation @en
alternative label: corporate body @en
alternative label: yhteisö
alternative label: yhteisön henkilöjäsen yhteisössä
alternative label: institution @sv
broader: henkilöön liittyvä yhteisö
definition: Yhteisö, jossa henkilö on jäsenenä. (RDA Registry)
definition: Institution i vilken en person är medlem. @sv
in scheme: Metatietosanasto
narrower: työnantaja
preferred label: person member of corporate body of @en
preferred label: personmedlem i institutionen @sv

intertekstuaalisen viittauksen perustana (ekspressio)
type: Concept
source: Kansallinen RDA-termi
source: Nationell RDA-term @sv
created: 2020-09-30
modified: 2024-12-18
Vastavuoroinen suhde: intertekstuaalinen suhde (ekspressio)
alternative label: intertextuell hänvisning baserad på (uttryck) @sv
broader: ekspression perustana
in scheme: Metatietosanasto
preferred label: intertextuell referens baserad på (uttryck) @sv

intertekstuaalinen suhde (ekspressio)
type: Concept
source: Kansallinen RDA-termi
source: Nationell RDA-term @sv
created: 2020-09-30
modified: 2024-12-18
Vastavuoroinen suhde: intertekstuaalisen viittauksen perustana (ekspressio)
broader: johdannaisteoksen versio
example: MARC 21 -formaatissa: 700 1# ‡i Intertekstuaalinen suhde (ekspressio): ‡a Perec, Georges. ‡t Talvinen matka, ‡l suomi.
example: I MARC 21 -formatet: 700 1# ‡i Intertextuell relation (uttryck): ‡a Perec, Georges. ‡t Talvinen matka, ‡l finska. @sv
in scheme: Metatietosanasto
preferred label: intertextuell relation (uttryck) @sv

täti
type: Concept
source: AgRelOn, an Agent Relationship Ontology
source: Kansallinen RDA-termi
source: Nationell RDA-term @sv
created: 2021-01-27
modified: 2025-08-28
alternative label: isän sisko
alternative label: vanhemman sisar
alternative label: äidin sisko
alternative label: faster @sv
alternative label: faster eller moster @sv
alternative label: förälders syster @sv
alternative label: moster @sv
broader: vanhemman sisarus
definition: Kuvailtavan henkilön vanhemman sisar.
definition: Syster till en beskriven persons förälder. @sv
in scheme: Metatietosanasto
preferred label: has parent's sister @en
preferred label: faster/moster @sv
related: setä

mesenaattina
type: Concept
source: AgRelOn, an Agent Relationship Ontology
source: Kansallinen RDA-termi
source: Nationell RDA-term @sv
created: 2021-01-27
modified: 2025-08-28
Vastavuoroinen suhde: mesenaatti
broader: henkilöön liittyvä henkilö
definition: Henkilö (esim. taiteilija), jota kuvailtava henkilö tukee tai suosii.
definition: Person (t.ex. en konstnär) som stöds eller gynnas av en beskriven person. @sv
in scheme: Metatietosanasto
preferred label: is patron of @en
preferred label: mecenat för @sv

kihlattu
type: Concept
source: AgRelOn, an Agent Relationship Ontology
source: Kansallinen RDA-termi
source: Nationell RDA-term @sv
created: 2021-01-27
modified: 2025-08-28
alternative label: morsian
alternative label: sulhanen
alternative label: fästman @sv
alternative label: fästmö @sv
broader: henkilöön liittyvä henkilö
definition: Henkilö, jonka kanssa kuvailtava henkilö on kihloissa.
definition: Person med vilken en beskriven person är förlovad. @sv
in scheme: Metatietosanasto
preferred label: has fiancee or fiance @en
preferred label: förlovad @sv

biologinen vanhempi
type: Concept
source: AgRelOn, an Agent Relationship Ontology
source: Kansallinen RDA-termi
source: Nationell RDA-term @sv
created: 2021-01-27
modified: 2025-08-28
Vastavuoroinen suhde: biologinen lapsi
broader: henkilöön liittyvä henkilö
definition: Kuvailtavan henkilön biologinen äiti tai isä.
definition: Biologisk moder eller fader till en beskriven person. @sv
in scheme: Metatietosanasto
preferred label: has biological parent @en
preferred label: biologisk förälder @sv

vaikuttaja
type: Concept
source: AgRelOn, an Agent Relationship Ontology
source: Kansallinen RDA-termi
source: Nationell RDA-term @sv
created: 2021-01-27
modified: 2025-08-23
Vastavuoroinen suhde: vaikuttajana
broader: henkilöön liittyvä henkilö
definition: Henkilö, joka vaikuttaa kuvailtavaan henkilöön.
definition: Person som påverkar en beskriven person. @sv
in scheme: Metatietosanasto
preferred label: has influence on @en
preferred label: påverkare @sv

biologinen lapsi
type: Concept
source: AgRelOn, an Agent Relationship Ontology
source: Kansallinen RDA-termi
source: Nationell RDA-term @sv
created: 2021-01-27
modified: 2025-08-28
Vastavuoroinen suhde: biologinen vanhempi
broader: henkilöön liittyvä henkilö
definition: Henkilö, jonka biologinen vanhempi kuvailtava henkilö on.
definition: Person vars biologiska förälder en beskriven person är. @sv
in scheme: Metatietosanasto
preferred label: has biological child @en
preferred label: biologiskt barn @sv

lapsi
type: Concept
source: AgRelOn, an Agent Relationship Ontology
source: Kansallinen RDA-termi
source: Nationell RDA-term @sv
created: 2021-01-27
modified: 2025-08-28
Vastavuoroinen suhde: vanhempi
broader: henkilöön liittyvä henkilö
definition: Kuvailtavan henkilön lapsi.
definition: Barn till en beskriven person. @sv
in scheme: Metatietosanasto
preferred label: has child @en
preferred label: barn @sv

meediona
type: Concept
source: AgRelOn, an Agent Relationship Ontology
source: Kansallinen RDA-termi
source: Nationell RDA-term @sv
created: 2021-01-27
modified: 2025-08-28
Vastavuoroinen suhde: meedio
broader: henkilöön liittyvä henkilö
definition: Kohde, jolta välittäjä tai meedio ottaa vastaan viestejä - eli henkilö tai hengellinen entiteetti, kuten kuollut henkilö, henkiolento tai enkeli, jolle kuvailtava henkilö tai hengellinen entiteetti toimii välittäjänä tai meediona.
definition: Person eller andlig entitet, såsom en avliden person, en andevarelse eller en ängel, från vilken en beskriven person eller andlig entitet som medium tar emot meddelanden eller fungerar som förmedlare. @sv
in scheme: Metatietosanasto
preferred label: is channel of @en
preferred label: medium för @sv

avioton lapsi
type: Concept
source: AgRelOn, an Agent Relationship Ontology
source: Kansallinen RDA-termi
source: Nationell RDA-term @sv
created: 2021-01-27
modified: 2025-08-28
Vastavuoroinen suhde: naimaton vanhempi
alternative label: has illegitimate child @en
alternative label: au-lapsi
alternative label: barn fött utom äktenskapet @sv
alternative label: barn utom äktenskap @sv
alternative label: oäkta barn @sv
alternative label: uä-barn @sv
broader: henkilöön liittyvä henkilö
definition: Kuvailtavan henkilön biologinen lapsi, jonka toisen vanhemman kanssa kuvailtava henkilö ei ollut lapsen syntyessä avioliitossa.
definition: En beskriven persons biologiska barn, med vars andra förälder den beskrivna personen inte var gift vid barnets födelse. @sv
in scheme: Metatietosanasto
preferred label: has natural child @en
preferred label: utomäktenskapligt barn @sv

lapsen puoliso
type: Concept
source: AgRelOn, an Agent Relationship Ontology
source: Kansallinen RDA-termi
source: Nationell RDA-term @sv
created: 2021-01-27
modified: 2025-08-28
Vastavuoroinen suhde: appivanhempi
alternative label: miniä
alternative label: vävy
alternative label: barns maka @sv
alternative label: barns make @sv
alternative label: svärdotter @sv
alternative label: svärson @sv
broader: henkilöön liittyvä henkilö
definition: Kuvailtavan henkilön lapsen kanssa avioliitossa oleva henkilö.
definition: Person som är gift med ett barn till en beskriven person. @sv
in scheme: Metatietosanasto
preferred label: has child-in-law @en
preferred label: barns partner @sv

johtajana
type: Concept
source: AgRelOn, an Agent Relationship Ontology
source: Kansallinen RDA-termi
source: Nationell RDA-term @sv
created: 2021-01-27
modified: 2025-07-01
Vastavuoroinen suhde: johtaja
broader: henkilöön liittyvä yhteisö
definition: Yhteisö, jota kuvailtava henkilö johtaa.
definition: Institution som en beskriven person leder. @sv
in scheme: Metatietosanasto
preferred label: is chief of @en
preferred label: chef för @sv

kummi
type: Concept
source: AgRelOn, an Agent Relationship Ontology
source: Kansallinen RDA-termi
source: Nationell RDA-term @sv
created: 2021-01-27
modified: 2025-08-28
Vastavuoroinen suhde: kummilapsi
alternative label: kummisetä
alternative label: kummitäti
alternative label: gudfader @sv
alternative label: gudfar @sv
alternative label: gudförälder @sv
alternative label: gudmoder @sv
alternative label: gudmor @sv
broader: henkilöön liittyvä henkilö
definition: Kuvailtavan henkilön kasteensa yhteydessä saama kummi.
definition: Fadder som en beskriven person fått i samband med dop. @sv
in scheme: Metatietosanasto
preferred label: has godparent @en
preferred label: fadder @sv

liittyy ryhmään
type: Concept
source: AgRelOn, an Agent Relationship Ontology
source: Kansallinen RDA-termi
source: Nationell RDA-term @sv
created: 2021-01-27
modified: 2025-08-28
Vastavuoroinen suhde: liittyy ryhmään
broader: yhteisöön liittyvä henkilö
definition: Henkilö, joka liittyy kuvailtavaan yhteisöön.
definition: Person som relaterar till en beskriven institution. @sv
in scheme: Metatietosanasto
preferred label: has group affiliation @en
preferred label: relaterad till grupp @sv

johtaja
type: Concept
source: AgRelOn, an Agent Relationship Ontology
source: Kansallinen RDA-termi
source: Nationell RDA-term @sv
created: 2021-01-27
modified: 2025-07-01
Vastavuoroinen suhde: johtajana
alternative label: ledare @sv
broader: yhteisöön liittyvä henkilö
definition: Henkilö, joka on johtajana kuvailtavassa yhteisössä.
definition: Person som är chef i en beskriven institution. @sv
in scheme: Metatietosanasto
preferred label: has chief @en
preferred label: chef @sv

naimaton vanhempi
type: Concept
source: AgRelOn, an Agent Relationship Ontology
source: Kansallinen RDA-termi
source: Nationell RDA-term @sv
created: 2021-01-27
modified: 2025-08-28
Vastavuoroinen suhde: avioton lapsi
alternative label: has single mother @en
alternative label: has unmarried father @en
alternative label: has unmarried mother @en
alternative label: au-isä
alternative label: au-äiti
alternative label: naimaton isä
alternative label: naimaton äiti
alternative label: ogift fader @sv
alternative label: ogift mamma @sv
alternative label: ogift moder @sv
alternative label: ogift pappa @sv
broader: henkilöön liittyvä henkilö
definition: Kuvailtavan henkilön biologinen vanhempi, kun biologiset vanhemmat eivät olleet avioliitossa lapsen syntyessä.
definition: Biologisk förälder till en beskriven person, då de biologiska föräldrarna inte varit gifta vid barnets födelse. @sv
in scheme: Metatietosanasto
preferred label: has unmarried parent @en
preferred label: ogift förälder @sv

murhaaja
type: Concept
source: AgRelOn, an Agent Relationship Ontology
source: Kansallinen RDA-termi
source: Nationell RDA-term @sv
created: 2021-01-27
modified: 2025-08-28
Vastavuoroinen suhde: murhattu
broader: henkilöön liittyvä henkilö
definition: Kuvailtavan henkilön murhannut henkilö.
definition: Person som har mördat en beskriven person. @sv
in scheme: Metatietosanasto
preferred label: has murderer @en
preferred label: mördare @sv

äitipuoli
type: Concept
source: AgRelOn, an Agent Relationship Ontology
source: Kansallinen RDA-termi
source: Nationell RDA-term @sv
created: 2021-01-27
modified: 2025-08-28
alternative label: styvmamma @sv
alternative label: styvmoder @sv
broader: henkilöön liittyvä henkilö
definition: Nainen, jonka kanssa kuvailtavan henkilön biologinen vanhempi on avio- tai avoliitossa.
definition: Kvinna med vilken en beskriven persons biologiska förälder är gift eller sambo. @sv
in scheme: Metatietosanasto
preferred label: has stepmother @en
preferred label: styvmor @sv
related: isäpuoli

puolisisarus
type: Concept
source: AgRelOn, an Agent Relationship Ontology
source: Kansallinen RDA-termi
source: Nationell RDA-term @sv
created: 2021-01-27
modified: 2025-08-28
alternative label: sisarpuoli
alternative label: velipuoli
alternative label: halvbror @sv
alternative label: halvsyster @sv
broader: henkilöön liittyvä henkilö
definition: Kuvailtavan henkilön sisarus, sisaruksilla on vain yksi yhteinen biologinen vanhempi.
definition: Syskon till en beskriven person, då syskonen har bara en gemensam biologisk förälder. @sv
in scheme: Metatietosanasto
preferred label: has half sibling @en
preferred label: halvsyskon @sv

meedio
type: Concept
source: AgRelOn, an Agent Relationship Ontology
source: Kansallinen RDA-termi
source: Nationell RDA-term @sv
created: 2021-01-27
modified: 2025-08-28
Vastavuoroinen suhde: meediona
broader: henkilöön liittyvä henkilö
definition: Psyykikko tai meedio - henkilö tai spirituaalinen entiteetti - joka toimii kanavana kuvailtavalle henkilölle tai spirituaaliselle entiteetille, kuten kuolleelle henkilölle, hengelle tai enkelille.
definition: Person eller andlig entitet, som fungerar som kanal för en beskriven person eller andlig entitet, såsom en avliden person, en ande eller en ängel. @sv
in scheme: Metatietosanasto
preferred label: has channel @en
preferred label: medium @sv

biologinen sisarus
type: Concept
source: AgRelOn, an Agent Relationship Ontology
source: Kansallinen RDA-termi
source: Nationell RDA-term @sv
created: 2021-01-27
modified: 2025-08-28
broader: henkilöön liittyvä henkilö
definition: Kuvailtavan henkilön sisarus, jolla on samat biologiset vanhemmat kuin hänellä.
definition: En beskriven persons syskon, som har samma biologiska föräldrar som personen. @sv
in scheme: Metatietosanasto
preferred label: has biological sibling @en
preferred label: biologiskt syskon @sv

adoptiovanhempi
type: Concept
source: AgRelOn, an Agent Relationship Ontology
source: Kansallinen RDA-termi
source: Nationell RDA-term @sv
created: 2021-01-27
modified: 2025-08-28
Vastavuoroinen suhde: adoptiolapsi
broader: henkilöön liittyvä henkilö
definition: Kuvailtavan henkilön adoptoinut henkilö.
definition: Person som adopterat en beskriven person. @sv
in scheme: Metatietosanasto
preferred label: has adoptive parent @en
preferred label: adoptivförälder @sv

kummilapsi
type: Concept
source: AgRelOn, an Agent Relationship Ontology
source: Kansallinen RDA-termi
source: Nationell RDA-term @sv
created: 2021-01-27
modified: 2025-08-28
Vastavuoroinen suhde: kummi
broader: henkilöön liittyvä henkilö
definition: Kuvailtavan henkilön kummilapseksi tämän kasteen yhteydessä saama henkilö.
definition: Person som en beskriven person fått till gudbarn i samband med dop. @sv
in scheme: Metatietosanasto
preferred label: has godchild @en
preferred label: gudbarn @sv

vanhempi
type: Concept
source: AgRelOn, an Agent Relationship Ontology
source: Kansallinen RDA-termi
source: Nationell RDA-term @sv
created: 2021-01-27
modified: 2025-08-28
Vastavuoroinen suhde: lapsi
broader: henkilöön liittyvä henkilö
definition: Kuvailtavan henkilön vanhempi, riippumatta biologisesta sukulaisuudesta.
definition: Förälder till en beskriven person, oberoende biologiskt släktskap. @sv
in scheme: Metatietosanasto
preferred label: has parent @en
preferred label: förälder @sv

kasvattilapsi
type: Concept
source: AgRelOn, an Agent Relationship Ontology
source: Kansallinen RDA-termi
source: Nationell RDA-term @sv
created: 2021-01-27
modified: 2025-08-28
Vastavuoroinen suhde: kasvattivanhempi
broader: henkilöön liittyvä henkilö
definition: Kuvailtavan henkilön kasvattama lapsi, joka ei ole hänen biologinen lapsensa.
definition: Barn som en beskriven person fostrat, men som inte är personens biologiska barn. @sv
in scheme: Metatietosanasto
preferred label: has foster child @en
preferred label: fosterbarn @sv

eno
type: Concept
source: Kansallinen RDA-termi
source: Nationell RDA-term @sv
created: 2021-01-27
modified: 2025-08-28
alternative label: äidin veli
broader: vanhemman sisarus
definition: Henkilön (subjekti) äidin veli (objekti).
definition: Morbror till en person. @sv
in scheme: Metatietosanasto
preferred label: has maternal uncle @en
preferred label: morbror @sv
related: setä

kasvattivanhempi
type: Concept
source: AgRelOn, an Agent Relationship Ontology
source: Kansallinen RDA-termi
source: Nationell RDA-term @sv
created: 2021-01-27
modified: 2025-08-28
Vastavuoroinen suhde: kasvattilapsi
broader: henkilöön liittyvä henkilö
definition: Kuvailtavan henkilön kasvattanut henkilö, joka ei ole tämän biologinen vanhempi.
definition: Person som fostrat en beskriven person, som inte är dennas biologiska förälder. @sv
in scheme: Metatietosanasto
preferred label: has foster parent @en
preferred label: fosterförälder @sv

appivanhempi
type: Concept
source: AgRelOn, an Agent Relationship Ontology
source: Kansallinen RDA-termi
source: Nationell RDA-term @sv
created: 2021-01-27
modified: 2025-08-28
Vastavuoroinen suhde: lapsen puoliso
alternative label: anoppi
alternative label: appi
alternative label: puolison isä
alternative label: puolison äiti
alternative label: svärfader @sv
alternative label: svärfar @sv
alternative label: svärmoder @sv
alternative label: svärmor @sv
broader: henkilöön liittyvä henkilö
definition: Kuvailtavan henkilön puolison vanhempi.
definition: Förälder till en partner till en beskriven person. @sv
in scheme: Metatietosanasto
preferred label: has parent-in-law @en
preferred label: svärförälder @sv

isovanhempi
type: Concept
source: AgRelOn, an Agent Relationship Ontology
source: Kansallinen RDA-termi
source: Nationell RDA-term @sv
created: 2021-01-27
modified: 2025-08-28
Vastavuoroinen suhde: lapsenlapsi
alternative label: isoisä
alternative label: isoäiti
alternative label: far- eller morförälder @sv
alternative label: farförälder @sv
alternative label: mor- eller farförälder @sv
alternative label: morförälder @sv
broader: henkilöön liittyvä henkilö
definition: Kuvailtavan henkilön isoisä tai isoäiti. Voi olla myös adoptio-, kasvatti- tai ottovanhemman isä tai äiti.
definition: Farfar, morfar, farmor eller mormor till en beskriven person. Kan även vara fader eller moder till en adoptions- eller fosterförälder. @sv
in scheme: Metatietosanasto
preferred label: has grandparent @en
preferred label: farförälder/morförälder @sv

serkku
type: Concept
source: AgRelOn, an Agent Relationship Ontology
source: Kansallinen RDA-termi
source: Nationell RDA-term @sv
created: 2021-01-27
modified: 2025-08-28
broader: henkilöön liittyvä henkilö
definition: Kuvailtavan henkilön serkku.
definition: Kusin till en beskriven person. @sv
in scheme: Metatietosanasto
preferred label: has cousin @en
preferred label: kusin @sv

vaikuttajana
type: Concept
source: AgRelOn, an Agent Relationship Ontology
source: Kansallinen RDA-termi
source: Nationell RDA-term @sv
created: 2021-01-27
modified: 2025-08-23
Vastavuoroinen suhde: vaikuttaja
broader: henkilöön liittyvä henkilö
definition: Henkilö, johon kuvailtava henkilö vaikuttaa.
definition: Person, som en beskriven person påverkar. @sv
in scheme: Metatietosanasto
preferred label: is influenced by @en
preferred label: påverkad av @sv

muusana
type: Concept
source: AgRelOn, an Agent Relationship Ontology
source: Kansallinen RDA-termi
source: Nationell RDA-term @sv
created: 2021-01-27
modified: 2025-08-28
Vastavuoroinen suhde: muusa
broader: henkilöön liittyvä henkilö
definition: Henkilö, jonka taiteellista työtä kuvailtava henkilö inspiroi.
definition: Person vars konstnärliga arbete en beskriven person inspirerar. @sv
in scheme: Metatietosanasto
preferred label: is muse of @en
preferred label: musa för @sv

muusa
type: Concept
source: AgRelOn, an Agent Relationship Ontology
source: Kansallinen RDA-termi
source: Nationell RDA-term @sv
created: 2021-01-27
modified: 2025-08-28
Vastavuoroinen suhde: muusana
broader: henkilöön liittyvä henkilö
definition: Henkilö, joka inspiroi kuvailtavaa henkilöä taiteellisessa työssä.
definition: Person som inspirerar en beskriven person i konstnärligt arbete. @sv
in scheme: Metatietosanasto
preferred label: has muse @en
preferred label: musa @sv

isäpuoli
type: Concept
source: AgRelOn, an Agent Relationship Ontology
source: Kansallinen RDA-termi
source: Nationell RDA-term @sv
created: 2021-01-27
modified: 2025-08-28
alternative label: styvfader @sv
alternative label: styvpappa @sv
broader: henkilöön liittyvä henkilö
definition: Mies, jonka kanssa kuvailtavan henkilön biologinen vanhempi on avio- tai avoliitossa.
definition: Man med vilken en beskriven persons biologiska förälder är i äktenskap eller samboförhållande. @sv
in scheme: Metatietosanasto
preferred label: has stepfather @en
preferred label: styvfar @sv
related: äitipuoli

lapsenlapsi
type: Concept
source: AgRelOn, an Agent Relationship Ontology
source: Kansallinen RDA-termi
source: Nationell RDA-term @sv
created: 2021-01-27
modified: 2025-08-28
Vastavuoroinen suhde: isovanhempi
alternative label: pojanpoika
alternative label: pojantytär
alternative label: tyttärenpoika
alternative label: tyttärentytär
alternative label: dotterdotter @sv
alternative label: dotterson @sv
alternative label: sondotter @sv
alternative label: sonson @sv
broader: henkilöön liittyvä henkilö
definition: Kuvailtavan henkilön lapsen lapsi.
definition: Barnbarn till en beskriven person. @sv
in scheme: Metatietosanasto
preferred label: has grandchild @en
preferred label: barnbarn @sv

adoptiolapsi
type: Concept
source: AgRelOn, an Agent Relationship Ontology
source: Kansallinen RDA-termi
source: Nationell RDA-term @sv
created: 2021-01-27
modified: 2025-08-28
Vastavuoroinen suhde: adoptiovanhempi
alternative label: ottolapsi
alternative label: adopterat barn @sv
broader: henkilöön liittyvä henkilö
definition: Kuvailtavan henkilön adoptoima henkilö.
definition: Person som adopterats av en beskriven person. @sv
in scheme: Metatietosanasto
preferred label: has adoptive child @en
preferred label: adoptivbarn @sv

murhattu
type: Concept
source: AgRelOn, an Agent Relationship Ontology
source: Kansallinen RDA-termi
source: Nationell RDA-term @sv
created: 2021-01-27
modified: 2025-08-28
Vastavuoroinen suhde: murhaaja
alternative label: mördad @sv
broader: henkilöön liittyvä henkilö
definition: Henkilö, jonka kuvailtava henkilö on murhannut.
definition: Person som en beskriven person har mördat. @sv
in scheme: Metatietosanasto
preferred label: has murder victim @en
preferred label: mordoffer @sv

mesenaatti
type: Concept
source: AgRelOn, an Agent Relationship Ontology
source: Kansallinen RDA-termi
source: Nationell RDA-term @sv
created: 2021-01-27
modified: 2025-08-28
Vastavuoroinen suhde: mesenaattina
broader: henkilöön liittyvä henkilö
definition: Henkilö, joka tukee tai suosii kuvailtavaa henkilöä (esim. taiteilijaa).
definition: Person som stöder eller gynnar en beskriven person (t.ex. en konstnär). @sv
in scheme: Metatietosanasto
preferred label: has patron @en
preferred label: mecenat @sv

yhdistys (julkisoikeudellinen)
type: Concept
source: Kansallinen RDA-termi
source: Nationell RDA-term @sv
created: 2021-04-20
modified: 2024-05-24
alternative label: julkisoikeudellinen yhdistys
alternative label: kalatalousalue
alternative label: kauppakamari
alternative label: metsänhoitoyhdistys
alternative label: opiskelijakunta
alternative label: oppilaskunta
alternative label: osakunta
alternative label: paliskunta
alternative label: riistanhoitoyhdistys
alternative label: uittoyhdistys
alternative label: elevkår @sv
alternative label: fiskeriområde @sv
alternative label: flottningsförening @sv
alternative label: forstförening @sv
alternative label: handelskammare @sv
alternative label: jaktvårdsförening @sv
alternative label: nation @sv
alternative label: offentligrättslig förening @sv
alternative label: renbeteslag @sv
alternative label: skogsvårdsförening @sv
alternative label: studentkår @sv
alternative label: viltvårdsförening @sv
definition: Julkisoikeudelliset yhdistykset ovat yhdistyksiä, joiden toiminta perustuu erityiseen lakiin tai asetukseen. Tällaisilla yhdistyksillä voi olla julkisoikeudellisia hallintotehtäviä, kuten lupa-asioiden hoitoa, kurinpitovaltaa tai valvontavaltaa. (Wikipedia.)
definition: Offentligrättsliga föreningar är föreningar vars verksamhet grundar sig på lag eller förordning. Sådana föreningar kan ha offentligrättsliga förvaltningsuppgifter, såsom skötsel av tillståndsärenden, disciplinär makt eller övervakningsbefogenhet. @sv
example: Suomen Punainen Risti
example: Finlands röda kors @sv
in scheme: Metatietosanasto
preferred label: förening (offentligrättslig) @sv
related: järjestö
related: yhdistys (rekisteröity)

sairaala
type: Concept
source: Kansallinen RDA-termi
source: Nationell RDA-term @sv
created: 2021-04-20
modified: 2024-05-24
alternative label: lasarett @sv
in scheme: Metatietosanasto
narrower: sotasairaala
preferred label: sjukhus @sv
related: terveydenhuoltolaitos

liikelaitos
type: Concept
source: Kansallinen RDA-termi
source: Nationell RDA-term @sv
created: 2021-04-20
modified: 2024-05-24
alternative label: julkinen liikelaitos
alternative label: offentligt affärsverk @sv
definition: Julkisen elimen omistama liiketoimintaa harjoittava organisaatio (Wikipedia).
definition: Organisation ägd av ett offentligt organ som utövar affärsverksamhet. @sv
in scheme: Metatietosanasto
narrower: kunnallinen liikelaitos
narrower: valtion liikelaitos
preferred label: affärsverk @sv

terveydenhuoltolaitos
type: Concept
source: Kansallinen RDA-termi
source: Nationell RDA-term @sv
created: 2021-04-20
modified: 2024-05-24
alternative label: ambulanssi
alternative label: hammashoitola
alternative label: hoitolaitos
alternative label: kuntoutuslaitos
alternative label: neuvola
alternative label: parantola
alternative label: polikliniikka
alternative label: saattokoti
alternative label: terveyskeskus
alternative label: ambulans @sv
alternative label: hospice @sv
alternative label: hospis @sv
alternative label: hälso- och sjukvårdsinrättning @sv
alternative label: hälsocentral @sv
alternative label: hälsovårdscentral @sv
alternative label: poliklinik @sv
alternative label: rehabiliteringsinrättning @sv
alternative label: rådgivningsbyrå @sv
alternative label: sanatorium @sv
alternative label: tandvårdsklinik @sv
alternative label: vårdanstalt @sv
alternative label: vårdcentral @sv
alternative label: vårdinrättning @sv
alternative label: vårdinstitution @sv
definition: Terveydenhuoltopalveluja tarjoava laitos.
definition: Inrättning som ger hälso- och sjukvårdsservice. @sv
in scheme: Metatietosanasto
preferred label: hälsovårdsinrättning @sv
related: sairaala
related: laboratorio
scope note: Sairaaloille ja laboratorioille erilliset yhteisötyypit.
scope note: För sjukhus och laboratorier finns skilda institutionstyper. @sv

kuntayhtymä
type: Concept
source: Kansallinen RDA-termi
source: Nationell RDA-term @sv
created: 2021-04-20
modified: 2024-05-24
alternative label: erityishuoltopiiri
alternative label: kansanterveystyön kuntayhtymä
alternative label: koulutuskuntayhtymä
alternative label: kuntainliitto
alternative label: maakuntaliitto
alternative label: sairaanhoitopiiri
alternative label: seutukaavaliitto
alternative label: sosiaali- ja terveyskuntayhtymä
alternative label: kommunalförbund @sv
alternative label: landskapsförbund @sv
alternative label: regionplaneförbund @sv
alternative label: samkommun för social- och hälsovård @sv
alternative label: sjukvårdsdistrikt @sv
alternative label: specialomsorgsdistrikt @sv
definition: Kuntien muodostama yhteenliittymä, joka hoitaa määrättyjen toimien tehtäviä siihen liittyneiden kuntien puolesta.
definition: Sammanslutning bildad av kommuner, som sköter bestämda uppgifter för kommunerna som är inkluderade. @sv
in scheme: Metatietosanasto
preferred label: samkommun @sv
related: kunta (hallintoalue)
related: seutukunta

sulautunut osittain teoksen versioon
type: Concept
source: RDA-termi
source: RDA-term @sv
created: 2021-09-23
modified: 2025-08-21
Vastavuoroinen suhde: osittain sulautunut teoksen versio
alternative label: sulautunut osittain ekspressioon
alternative label: införlivat delvis i uttrycket @sv
alternative label: uppgått delvis i uttrycket @sv
alternative label: uppgått delvis i versionen @sv
broader: myöhempi teoksen versio
definition: Teoksen ekspressio, jonka sisältöön toisen teoksen ekspression osittainen sisältö on yhdistynyt. (RDA Registry)
definition: Uttryck av verk, med vars innehåll ett annat verks uttrycks innehåll delvis har införlivats. @sv
in scheme: Metatietosanasto
preferred label: absorbed in part by expression @en
preferred label: införlivat delvis i versionen @sv

kihlakunta
type: Concept
source: Kansallinen RDA-termi
source: Nationell RDA-term @sv
created: 2021-12-08
modified: 2025-08-29
definition: Paikallishallinnon yksikkö tai sen toimialue, jota kutsutaan kihlakunnaksi.
definition: Enhet eller verksamhetsområde för lokalförvaltning, som kallas härad. @sv
example: Ilomantsin kihlakunta; Karjalan ylinen kihlakunta; Sodankylän kihlakunnanvirasto
example: Ilomants härad; Karelens övre härad; Sodankylä häradsämbete @sv
in scheme: Metatietosanasto
preferred label: härad @sv
related: kunta (hallintoalue)
related: alue (hallintoalue)
scope note: Kruununvoudista ja henkikirjoittajasta, joiden virkapiirinä on ollut kihlakunta, käytä yhteisön kategorian historiallisia termejä kruununvouti (viranomainen) ja henkikirjoittaja (viranomainen).
scope note: Om kronofogde och häradsskrivare, vilkas ämbetsområde en härad har varit, används de historiska termerna kronofogde (myndighet) och häradsskrivare (myndighet) som kategori av institution. @sv

ammattialajärjestöt
type: Concept
source: Kansallinen RDA-termi
source: Nationell RDA-term @sv
created: 2022-03-15
modified: 2026-05-06
alternative label: yrkessammanslutningar @sv
broader: järjestötoiminta
definition: Tietyn ammatin, tieteenalan tai teknisen alan asioita ajavat etujärjestöt.
definition: Intresseorganisationer för vissa yrken, vetenskapsgrenar eller tekniska branscher. @sv
in scheme: Metatietosanasto
preferred label: branschorganisationer @sv
related: ammattiyhdistykset

kulttuurijärjestöt
type: Concept
source: Kansallinen RDA-termi
source: Nationell RDA-term @sv
created: 2022-03-15
modified: 2026-05-06
alternative label: kansansivistysjärjestöt
alternative label: kulttuurisäätiöt
alternative label: kulttuuriyhdistykset
alternative label: lukuseurat
alternative label: sivistysseurat
alternative label: taidesäätiöt
alternative label: taideyhdistykset
alternative label: taiteilijaseurat
alternative label: bildningssällskap @sv
alternative label: folkbildningsorganisationer @sv
alternative label: konstföreningar @sv
alternative label: konstnärsföreningar @sv
alternative label: konststiftelser @sv
alternative label: kulturföreningar @sv
alternative label: kulturstiftelser @sv
alternative label: läsesällskap @sv
broader: järjestötoiminta
definition: Kulttuuri- ja sivistys- ja opintotoimintaa harjoittavat järjestöt.
definition: Organisationer som utövar kultur-, bildnings- och studieverksamhet. @sv
in scheme: Metatietosanasto
preferred label: kulturorganisationer @sv
related: harrastusjärjestöt

liikuntajärjestöt
type: Concept
source: Kansallinen RDA-termi
source: Nationell RDA-term @sv
created: 2022-03-15
modified: 2026-05-06
alternative label: liikuntasäätiöt
alternative label: urheilujärjestöt
alternative label: idrottsstiftelser @sv
alternative label: sportorganisationer @sv
broader: järjestötoiminta
definition: Urheilu- ja liikuntatoimintaa tarjoavat ja edistävät järjestöt.
definition: Organisationer som erbjuder och främjar sport- och idrottsverksamhet. @sv
in scheme: Metatietosanasto
preferred label: idrottsorganisationer @sv
related: harrastusjärjestöt

ammattiyhdistykset
type: Concept
source: Kansallinen RDA-termi
source: Nationell RDA-term @sv
created: 2022-03-15
modified: 2026-05-06
alternative label: ammatilliset keskusjärjestöt
alternative label: ammattijärjestöt
alternative label: ammattiliitot
alternative label: ammattiosastot
alternative label: fackavdelningar @sv
alternative label: fackförbund @sv
alternative label: fackliga centralorganisationer @sv
alternative label: fackorganisationer @sv
broader: järjestötoiminta
definition: Ammatin, alueen tai organisaatiorakenteen perusteella järjestäytyneet, jäsentensä palkkausta, työsuhteita ja työoloja ajavat työntekijäjärjestöt.
definition: Arbetstagarorganisationer som driver intressen gällande avlöning, anställning och arbetsförhållanden, för medlemmar organiserade utgående från yrke, område eller organisationsstruktur. @sv
in scheme: Metatietosanasto
preferred label: fackföreningar @sv
related: ammattialajärjestöt

kotiseutuyhdistykset
type: Concept
source: Kansallinen RDA-termi
source: Nationell RDA-term @sv
created: 2022-03-15
modified: 2026-05-06
alternative label: kyläyhdistykset
alternative label: perinnejärjestöt
alternative label: byaföreningar @sv
alternative label: byföreningar @sv
alternative label: traditionsföreningar @sv
broader: järjestötoiminta
definition: Paikallista tai alueellista perinne- ja kulttuuritoimintaa harjoittavat järjestöt.
definition: Organisationer som utövar lokal eller regional traditions- och kulturverksamhet. @sv
in scheme: Metatietosanasto
preferred label: hembygdsföreningar @sv
related: harrastusjärjestöt

sukuseurat
type: Concept
source: Kansallinen RDA-termi
source: Nationell RDA-term @sv
created: 2022-03-15
modified: 2026-05-06
alternative label: släktsällskap @sv
broader: järjestötoiminta
definition: Sukututkimusta edistävät sekä sukuperinnettä ja suvun yhteenkuuluvuutta ylläpitävät järjestöt.
definition: Organisationer som främjar släktforskning och upprätthåller släkttradition och -samhörighet. @sv
in scheme: Metatietosanasto
preferred label: släktföreningar @sv
related: harrastusjärjestöt

nuotti
type: Concept
created: 2023-01-21
modified: 2023-05-05
alternative label: musiknot @sv
in scheme: Metatietosanasto
narrower: nuottijulkaisu
narrower: nuottikäsikirjoitus
preferred label: not @sv

vaikuttaja
type: Concept
source: AgRelOn, an Agent Relationship Ontology
source: Kansallinen RDA-termi
source: Nationell RDA-term @sv
created: 2024-10-03
modified: 2025-08-23
Vastavuoroinen suhde: vaikuttajana
broader: yhteisöön liittyvä yhteisö
definition: Yhteisö, joka vaikuttaa kuvailtavaan yhteisöön.
definition: Institution som påverkar en beskriven institution. @sv
in scheme: Metatietosanasto
preferred label: has influence on @en
preferred label: påverkare @sv

liittyy ryhmään
type: Concept
source: AgRelOn, an Agent Relationship Ontology
source: Kansallinen RDA-termi
source: Nationell RDA-term @sv
created: 2024-10-03
modified: 2025-08-28
Vastavuoroinen suhde: liittyy ryhmään
broader: henkilöön liittyvä yhteisö
definition: Yhteisö, johon kuvailtava henkilö liittyy.
definition: Institution som en beskriven person relaterar till. @sv
in scheme: Metatietosanasto
preferred label: has group affiliation @en
preferred label: relaterad till grupp @sv

muusana
type: Concept
source: AgRelOn, an Agent Relationship Ontology
source: Kansallinen RDA-termi
source: Nationell RDA-term @sv
created: 2024-10-03
modified: 2025-08-28
Vastavuoroinen suhde: muusa
broader: henkilöön liittyvä yhteisö
definition: Yhteisö, jonka taiteellista työtä kuvailtava henkilö inspiroi.
definition: Institution, vars konstnärliga arbete en beskriven person inspirerar. @sv
in scheme: Metatietosanasto
preferred label: is muse of @en
preferred label: musa för @sv

mesenaattina
type: Concept
source: AgRelOn, an Agent Relationship Ontology
source: Kansallinen RDA-termi
source: Nationell RDA-term @sv
created: 2024-10-03
modified: 2025-08-28
Vastavuoroinen suhde: mesenaatti
broader: henkilöön liittyvä yhteisö
definition: Yhteisö (esim. taiteilijaryhmä), jota kuvailtava henkilö tukee tai suosii.
definition: Institution (t.ex. en konstnärsgrupp) som stöds eller gynnas av en beskriven person. @sv
in scheme: Metatietosanasto
preferred label: is patron of @en
preferred label: mecenat för @sv

muusa
type: Concept
source: AgRelOn, an Agent Relationship Ontology
source: Kansallinen RDA-termi
source: Nationell RDA-term @sv
created: 2024-10-03
modified: 2025-08-28
Vastavuoroinen suhde: muusana
broader: yhteisöön liittyvä henkilö
definition: Henkilö, joka inspiroi kuvailtavaa yhteisöä taiteellisessa työssä.
definition: Person som inspirerar en beskriven institution i konstnärligt arbete. @sv
in scheme: Metatietosanasto
preferred label: has muse @en
preferred label: musa @sv

mesenaatti
type: Concept
source: AgRelOn, an Agent Relationship Ontology
source: Kansallinen RDA-termi
source: Nationell RDA-term @sv
created: 2024-10-03
modified: 2025-08-28
Vastavuoroinen suhde: mesenaattina
broader: henkilöön liittyvä yhteisö
definition: Yhteisö, joka tukee tai suosii kuvailtavaa henkilöä (esim. taiteilijaa).
definition: Institution som stöder eller gynnar en beskriven person (t.ex. en konstnär). @sv
in scheme: Metatietosanasto
preferred label: has patron @en
preferred label: mecenat @sv

vaikuttajana
type: Concept
source: AgRelOn, an Agent Relationship Ontology
source: Kansallinen RDA-termi
source: Nationell RDA-term @sv
created: 2024-10-03
modified: 2025-08-23
Vastavuoroinen suhde: vaikuttaja
broader: yhteisöön liittyvä yhteisö
definition: Yhteisö, joka vaikuttaa kuvailtavaan yhteisöön.
definition: Institution, som påverkar en beskriven institution. @sv
in scheme: Metatietosanasto
preferred label: is influenced by @en
preferred label: påverkad av @sv

alakokoelma kokoelmassa
type: Concept
source: RDA-termi
source: RDA-term @sv
created: 2024-12-18
modified: 2025-04-15
Vastavuoroinen suhde: alakokoelma
broader: osa aineistoa
definition: Kokoelmateoksen manifestaatio, joka sisältyy toisen kokoelmateoksen manifestaatioon erillisenä osana. (RDA Registry)
definition: Manifestation av samlingsverk, som ingår som en separat del av en manifestation av ett annat samlingsverk. @sv
in scheme: Metatietosanasto
preferred label: subcollection of @en
preferred label: delsamling i samlingen @sv

konvertoinnin tulos
type: Concept
source: RDA-termi
source: RDA-term @sv
created: 2024-12-18
modified: 2025-07-04
Vastavuoroinen suhde: konvertoitu kappale
alternative label: digital transfer (item) @en
alternative label: konvertoinnin tulos (kappale)
alternative label: konverterad (exemplar) @sv
broader: kappaleen jäljenne
definition: Digitaalisessa muodossa oleva manifestaatio, joka on tulosta toisessa digitaalisessa muodossa olevan kappaleen muunnoksesta. (RDA Registry)
definition: Manifestation i digital form, som är resultat av en konvertering av en manifestation i en annan digital form. @sv
in scheme: Metatietosanasto
preferred label: digital transfer of item @en
preferred label: konverterad @sv

arkkitehti
type: Concept
source: RDA-termi
source: RDA-term @sv
created: 2024-12-18
modified: 2025-04-16
alternative label: arkkitehti (henkilö)
alternative label: arkitekt (person) @sv
broader: teoksen tekijä
definition: Henkilö, joka on vastuussa arkkitehtisuunnitelman luomisesta, mukaan lukien kuvaesityksestä, jonka tarkoitus on näyttää, miltä rakennus tai muu rakennelma näyttää valmiina. (RDA Registry)
definition: Person som ansvarar för skapandet av en arkitektplan, inklusive en bildpresentation över hur en byggnad eller en annan konstruktion ska se ut när den är färdig. @sv
in scheme: Metatietosanasto
narrower: maisema-arkkitehti
preferred label: architect person @en
preferred label: arkitekt @sv

jakelija
type: Concept
source: RDA-termi
source: RDA-term @sv
created: 2024-12-18
modified: 2025-07-01
alternative label: jakelija (henkilö)
alternative label: distributör (person) @sv
broader: aineistoon liittyvä henkilö
definition: Henkilö, joka on vastuussa julkaistun manifestaation jakelusta. (RDA Registry)
definition: Person som svarar för distributionen av en publicerad manifestation. @sv
in scheme: Metatietosanasto
narrower: elokuvan jakelija
preferred label: distributor person @en
preferred label: distributör @sv

kartantekijä
type: Concept
source: RDA-termi
source: RDA-term @sv
created: 2024-12-18
modified: 2025-07-03
alternative label: kartografiaan osallinen yhteisö
alternative label: bidragsgivare (institution) till kartografi @sv
broader: aggregaattiin osallinen yhteisö
definition: Aggregaattiin osallinen yhteisö, joka on luonut aggregaattiin sisältyvän kartografisen teoksen ekspression.
definition: Institution som bidragit till ett aggregat, genom att skapa ett uttryck av ett kartografiskt verk som ingår i ett aggregat. @sv
in scheme: Metatietosanasto
narrower: maanmittari
preferred label: contributor corporate body of cartography @en
preferred label: kartograf @sv

versiota metatiedoilla kuvaileva teos
type: Concept
source: RDA-termi
source: RDA-term @sv
created: 2024-12-18
modified: 2025-02-21
Vastavuoroinen suhde: metatietokuvailu versiosta
alternative label: ekspressiota metatiedoilla kuvaileva teos
alternative label: verk som beskriver uttrycket med metadata @sv
broader: versiota kuvaava teos
definition: Teos, joka on ekspression metatietoteos. (RDA Registry)
definition: Verk som är ett uttrycks metadataverk. @sv
in scheme: Metatietosanasto
preferred label: expression described with metadata by @en
preferred label: verk som beskriver versionen med metadata @sv

nykyinen omistaja
type: Concept
source: RDA-termi
source: RDA-term @sv
created: 2024-12-18
modified: 2025-08-15
alternative label: nykyinen omistaja (henkilö)
alternative label: nuvarande ägare (person) @sv
broader: omistaja
definition: Henkilö, joka tällä hetkellä laillisesti omistaa kappaleen. (RDA Registry)
definition: Person som för tillfället juridiskt äger ett exemplar. @sv
in scheme: Metatietosanasto
narrower: tallettaja
preferred label: current owner person @en
preferred label: nuvarande ägare @sv

esiosa (ekspressio)
type: Concept
source: RDA-termi
source: RDA-term @sv
created: 2024-12-18
modified: 2026-02-27
Vastavuoroinen suhde: jatko-osa (ekspressio)
broader: teoksen edeltävä versio
definition: Teoksen ekspressio, joka laajentaa toisen teoksen ekspression kerrontaa ajassa taaksepäin. (RDA Registry)
definition: Uttryck av verk, som utvidgar ett annat verks uttrycks berättelse bakåt i tiden. @sv
in scheme: Metatietosanasto
preferred label: prequel expression @en
preferred label: prequel (uttryck) @sv

alueversio
type: Concept
source: RDA-termi
source: RDA-term @sv
created: 2024-12-18
modified: 2025-04-15
Vastavuoroinen suhde: alueversio teoksesta
broader: muunnos yleisössä
definition: Teos, joka on luotu muuttamalla teoksen alueyleisöä. (RDA Registry)
definition: Verk som har skapats genom att ändra den regionala målgruppen för ett verk. @sv
in scheme: Metatietosanasto
preferred label: regional version @en

sukuhaara suvussa
type: Concept
source: RDA-termi
source: RDA-term @sv
created: 2024-12-18
modified: 2025-03-19
alternative label: suvun jäsen suvussa
alternative label: släktmedlem i släkten @sv
broader: sukuun liittyvä suku
definition: Suku, jonka jäsen suku on. (RDA Registry)
definition: Släkt som en släkt tillhör. @sv
in scheme: Metatietosanasto
narrower: suvun kantasuku
preferred label: family member of family of @en
preferred label: släktgren i släkten @sv

kokoelman kappale
type: Concept
source: RDA-termi
source: RDA-term @sv
created: 2024-12-18
modified: 2025-07-03
Vastavuoroinen suhde: kappale kokoelmassa
broader: aineistoon liittyvä kappale
definition: Kappale, joka sisältyy kokoelmateoksen manifestaatioon. (RDA Registry)
definition: Exemplar som ingår i ett samlingsverks manifestation. @sv
in scheme: Metatietosanasto
preferred label: holding @en
preferred label: exemplar i samling @sv

sisältyy aineistoon
type: Concept
source: RDA-termi
source: RDA-term @sv
created: 2024-12-18
modified: 2025-08-21
Vastavuoroinen suhde: sisältää (ekspressio)
alternative label: ekspression manifestaatio
alternative label: manifestation av uttryck @sv
broader: versioon liittyvä manifestaatio
definition: Manifestaatio, joka on ekspression fyysinen ilmentymä. (RDA Registry)
definition: Manifestation som är en fysisk manifestation av ett uttryck. @sv
in scheme: Metatietosanasto
preferred label: manifestation of expression @en
preferred label: ingår i materialet @sv

aggregoija
type: Concept
source: RDA-termi
source: RDA-term @sv
created: 2024-12-18
modified: 2025-04-15
Vastavuoroinen suhde: aggregoi version
broader: versioon liittyvä versio
definition: Ekspressio, joka aggregoi ekspression osaksi aggregoivan ekspression suunnitelmaa. (RDA Registry)
definition: Uttryck som aggregerar ett uttryck till del av planen för ett aggregerande uttryck. @sv
in scheme: Metatietosanasto
preferred label: aggregated by @en
preferred label: aggregator @sv

aggregoi version
type: Concept
source: RDA-termi
source: RDA-term @sv
created: 2024-12-18
modified: 2025-04-15
Vastavuoroinen suhde: aggregoija
alternative label: aggregoi ekspression
alternative label: aggregerar uttrycket @sv
broader: versioon liittyvä versio
definition: Ekspressio, joka on valittu osaksi aggregoivan ekspression suunnitelmaa. (RDA Registry)
definition: Uttryck som har valts till del av planen för ett aggregerande uttryck. @sv
in scheme: Metatietosanasto
preferred label: aggregates @en
preferred label: aggregerar versionen @sv

aineiston sidos
type: Concept
source: RDA-termi
source: RDA-term @sv
created: 2024-12-18
modified: 2025-04-15
Vastavuoroinen suhde: aineiston sidos aineistosta
alternative label: manifestaation sidos
alternative label: bindning av manifestationen @sv
broader: aineistoon liittyvä teos
definition: Teos, joka on manifestaation sidos. (RDA Registry)
definition: Verk som är ett band av en manifestation. @sv
in scheme: Metatietosanasto
preferred label: binding of manifestation @en
preferred label: bindning av materialet @sv

aineiston sidos aineistosta
type: Concept
source: RDA-termi
source: RDA-term @sv
created: 2024-12-18
modified: 2025-04-15
Vastavuoroinen suhde: aineiston sidos
alternative label: manifestaation sidos manifestaatiosta
alternative label: bindning av manifestationen @sv
broader: teokseen liittyvä aineisto
definition: Manifestaatio, joka on sidottu. (RDA Registry)
definition: Manifestation som är bunden. @sv
in scheme: Metatietosanasto
preferred label: binding of manifestation of @en
preferred label: bindning av materialet @sv

teoksen kommentaari
type: Concept
source: RDA-termi
source: RDA-term @sv
created: 2024-12-18
modified: 2025-08-22
Vastavuoroinen suhde: kommentaari teoksesta
alternative label: commentary in (work) @en
alternative label: kommentaari teoksessa
alternative label: kommentar i verket @sv
broader: teosta kuvaava teos
definition: Teos, joka on joukko selittäviä tai kriittisiä huomautuksia teoksesta. (RDA Registry)
definition: Verk som är en mängd förklarande eller kritiska anmärkningar om ett verk. @sv
in scheme: Metatietosanasto
preferred label: work commentary in @en
preferred label: kommentar till verket i @sv

kommentaari teoksesta
type: Concept
source: RDA-termi
source: RDA-term @sv
created: 2024-12-18
modified: 2025-07-03
Vastavuoroinen suhde: teoksen kommentaari
broader: kuvaus teoksesta
definition: Selittävien tai kriittisten huomautusten joukon perustana käytetty teos. (RDA Registry)
definition: Verk som använts som grund för en samling förklarande eller kritiska anmärkningar. @sv
in scheme: Metatietosanasto
preferred label: commentary on work @en
preferred label: kommentar till verket @sv

jatko-osa (ekspressio)
type: Concept
source: RDA-termi
source: RDA-term @sv
created: 2024-12-18
modified: 2026-02-27
Vastavuoroinen suhde: esiosa (ekspressio)
broader: myöhempi teoksen versio
definition: Teoksen ekspressio, joka laajentaa toisen teoksen ekspression kerrontaa ajassa eteenpäin. (RDA Registry)
definition: Uttryck av verk som utvidgar ett annat verks uttrycks berättande framåt i tiden. @sv
in scheme: Metatietosanasto
preferred label: sequel expression @en
preferred label: uppföljare (uttryck) @sv

konkordanssihakemisto versiolle
type: Concept
source: RDA-termi
source: RDA-term @sv
created: 2024-12-18
modified: 2025-07-03
Vastavuoroinen suhde: konkordanssihakemisto
alternative label: konkordanssihakemisto (teos) ekspressiolle
alternative label: konkordanssihakemisto ekspressiolle
alternative label: konkordans (verk) till uttrycket @sv
alternative label: konkordans till uttrycket @sv
broader: teokseen liittyvä versio
definition: Kaikkien tai valikoitujen ekspressiossa esiintyvien sanojen systemaattisen oppaan perustana olevan tekstiteoksen ekspressio. (RDA Registry)
definition: Uttryck av textverk som är grund för en systematisk guide över alla eller utvalda ord som förekommer i ett uttryck. @sv
in scheme: Metatietosanasto
preferred label: concordance work for @en
preferred label: konkordans till versionen @sv

mesenaatti
type: Concept
source: AgRelOn, an Agent Relationship Ontology
source: Kansallinen RDA-termi
source: Nationell RDA-term @sv
created: 2024-12-18
modified: 2025-08-28
Vastavuoroinen suhde: mesenaattina
broader: yhteisöön liittyvä henkilö
definition: Henkilö, joka tukee tai suosii kuvailtavaa yhteisöä (esim. taiteilijaryhmää).
definition: Person som stöder eller gynnar en beskriven institution (t.ex. en konstnärsgrupp). @sv
in scheme: Metatietosanasto
preferred label: has patron @en
preferred label: mecenat @sv

kappaleen sidos kappaleesta
type: Concept
source: RDA-termi
source: RDA-term @sv
created: 2024-12-18
modified: 2025-07-03
Vastavuoroinen suhde: kappaleen sidos
broader: teokseen liittyvä kappale
definition: Kappale, joka on sidottu. (RDA Registry)
definition: Exemplar som är inbundet. @sv
in scheme: Metatietosanasto
preferred label: binding of item of @en
preferred label: bindning av exemplaret @sv

kommentaari aineistosta
type: Concept
source: RDA-termi
source: RDA-term @sv
created: 2024-12-18
modified: 2025-07-03
Vastavuoroinen suhde: aineiston kommentaari
alternative label: kommentaari manifestaatiosta
alternative label: kommentar till manifestationen @sv
broader: kuvaus aineistosta
definition: Selittävien tai kriittisten huomautusten joukon perustana käytetty manifestaatio. (RDA Registry)
definition: Manifestation som använts som grund för en samling förklarande eller kritiska anmärkningar. @sv
in scheme: Metatietosanasto
preferred label: commentary on manifestation @en
preferred label: kommentar till materialet @sv

kappaleen kommentaari
type: Concept
source: RDA-termi
source: RDA-term @sv
created: 2024-12-18
modified: 2025-07-03
Vastavuoroinen suhde: kommentaari kappaleesta
alternative label: commentary in (item) @en
broader: kappaletta kuvaava teos
definition: Teos, joka on selittävä tai kriittinen huomautus kappaleesta. (RDA Registry)
definition: Verk som är en förklarande eller kritisk anmärkning om ett exemplar. @sv
in scheme: Metatietosanasto
preferred label: item commentary in @en
preferred label: kommentar till exemplaret i @sv

kartantekijä
type: Concept
source: RDA-termi
source: RDA-term @sv
created: 2024-12-18
modified: 2026-02-18
alternative label: cartographer (expression) @en
alternative label: kartografi (ekspressio)
alternative label: kartografiaan osallinen toimija
alternative label: bidragsgivare (aktör) till kartografi @sv
alternative label: kartograf (uttryck) @sv
broader: aggregaattiin osallinen toimija
definition: Aggregaattiin osallinen toimija, joka on luonut aggregaattiin sisältyvän kartografisen teoksen ekspression. (RDA Registry)
definition: Aktör som bidragit till ett aggregat, genom att skapa ett uttryck av ett kartografiskt verk som ingår i ett aggregat. @sv
in scheme: Metatietosanasto
narrower: maanmittari
preferred label: contributor agent of cartography @en
preferred label: kartograf @sv

kappaleen digitoitu jäljenne
type: Concept
source: RDA-termi
source: RDA-term @sv
created: 2024-12-18
modified: 2025-02-21
Vastavuoroinen suhde: digitoitu kappaleesta
alternative label: electronic reproduction (item) @en
alternative label: digitoitu jäljenne (kappale)
alternative label: digital reporduktion (exemplar) @sv
alternative label: digitalisering (exemplar) @sv
broader: kappaleen jäljenne
definition: Digitaalisessa muodossa oleva manifestaatio, joka analogisen kappaleen muunnoksen tulos. (RDA Registry)
definition: En manifestation i digital form, som är resultat av omvandlingen av ett analogt exemplar. @sv
in scheme: Metatietosanasto
preferred label: electronic reproduction of item @en
preferred label: digital reproduktion av exemplaret @sv

digitoitu kappaleesta
type: Concept
source: RDA-termi
source: RDA-term @sv
created: 2024-12-18
modified: 2026-03-20
Vastavuoroinen suhde: kappaleen digitoitu jäljenne
alternative label: digitaliserat exemplar @sv
alternative label: digitiserat exemplar @sv
broader: jäljenne kappaleesta
definition: Analogisessa muodossa oleva kappale, joka muunnetaan digitaaliseksi manifestaatioksi. (RDA Registry)
definition: Exemplar i analogt format, som omvandlats till en digital manifestation. @sv
in scheme: Metatietosanasto
preferred label: electronic reproduction of item of @en
preferred label: digitalisering av exemplaret @sv

sanoitusteos
type: Concept
source: RDA-termi
source: RDA-term @sv
created: 2024-12-18
modified: 2025-08-19
Vastavuoroinen suhde: sanoitus teokseen
broader: tekstiteos
definition: Teos, joka on tekstiteos, joka täydentää musiikkiteosta. (RDA Registry)
definition: Verk som är ett textverk som kompletterar ett musikverk. @sv
in scheme: Metatietosanasto
preferred label: lyrics work @en
preferred label: sångtextverk @sv
scope note: Sanoitus ei kata oopperan tai muun musiikillisen näyttämöteoksen tai oratorion tekstiä. (RDA Registry)
scope note: Omfattar inte text till opera, något annat musikaliskt sceniskt verk eller oratorium. @sv

kieliversio teoksesta
type: Concept
source: RDA-termi
source: RDA-term @sv
created: 2024-12-18
modified: 2025-07-03
Vastavuoroinen suhde: kieliversio
broader: muunnos yleisössä teoksesta
definition: Teos, jolla on kieliyleisö, jota on muutettu teoksen luomiseksi. (RDA Registry)
definition: Verk med en språklig målgrupp som har ändrats för att skapa ett verk. @sv
in scheme: Metatietosanasto
preferred label: language version of @en
preferred label: språkversion av verket @sv

staattinen versio
type: Concept
source: RDA-termi
source: RDA-term @sv
created: 2024-12-18
modified: 2025-08-21
Vastavuoroinen suhde: staattinen versio teoksesta
broader: muunnos laajennussuunnitelmassa
definition: Teos, joka on luotu muuttamalla teoksen laajennussuunnitelmaa päivittyvästä staattiseksi. (RDA Registry)
definition: Verk som har skapats genom att ändra utgivningsplanen för ett verk från integrerande till statisk. @sv
in scheme: Metatietosanasto
preferred label: static version @en
preferred label: statisk version @sv

kokoaja
type: Concept
source: RDA-termi
source: RDA-term @sv
created: 2024-12-18
modified: 2025-07-03
alternative label: kokoaja (yhteisö)
alternative label: sammanställare (institution) @sv
broader: koostaja
definition: Yhteisö, joka on vastuussa uuden teoksen, kuten bibliografian tai hakemiston luomisesta valitsemalla, järjestämällä, koostamalla ja toimittamalla dataa, informaatiota tms. (RDA Registry)
definition: Institution som svarar för skapandet av ett nytt verk, såsom en bibliografi eller ett register, genom att välja, ordna, sammanställa och redigera data, information eller dylikt. @sv
in scheme: Metatietosanasto
narrower: kokoelman luetteloija
preferred label: compiler corporate body @en
preferred label: sammanställare @sv
scope note: Ei kata teoksen ekspression sisällön muokkaamista tai selkeyttämistä eikä teosten tai teosten osien valitsemista ja kokoamista yhteen. (RDA Registry)
scope note: Omfattar inte redigering eller förtydligande av innehållet i ett verks uttryck, eller val och hopsamling av verk eller del av verk. @sv

koostaja
type: Concept
source: RDA-termi
source: RDA-term @sv
created: 2024-12-18
modified: 2025-07-04
alternative label: aggregaattori (yhteisö)
alternative label: aggregerad av (institution) @sv
broader: teoksen tekijä
definition: Yhteisö, joka on vastuussa aggregoivan teoksen luomisesta valitsemalla ja järjestämällä muiden teosten ekspressioita. (RDA Registry)
definition: Institution som svarar för skapandet av ett aggregerande verk, genom att välja och ordna uttryck av andra verk. @sv
in scheme: Metatietosanasto
narrower: kokoaja
preferred label: aggregator corporate body @en
preferred label: aggregerad av @sv

sarjaversio
type: Concept
source: RDA-termi
source: RDA-term @sv
created: 2024-12-18
modified: 2025-08-19
Vastavuoroinen suhde: sarjaversio teoksesta
broader: muunnos laajennussuunnitelmassa
definition: Teos, joka on luotu muuttamalla teoksen laajennussuunnitelmaa staattisesta peräkkäiseksi. (RDA Registry)
definition: Verk som har skapats genom att ändra utvidgningsplanen för ett verk från statisk till successiv. @sv
in scheme: Metatietosanasto
preferred label: serialized version @en
preferred label: seriell version @sv

alakokoelma
type: Concept
source: RDA-termi
source: RDA-term @sv
created: 2024-12-18
modified: 2025-04-15
Vastavuoroinen suhde: alakokoelma kokoelmassa
broader: aineiston osa
definition: Kokoelmateoksen manifestaatio, joka on toisen kokoelmateoksen manifestaation erillinen osa. (RDA Registry)
definition: Manifestation av samlingsverk, som är en separat del av en manifestation av ett samlingsverk. @sv
in scheme: Metatietosanasto
preferred label: subcollection @en
preferred label: delsamling @sv

erikoisnumero teokselle
type: Concept
source: RDA-termi
source: RDA-term @sv
created: 2024-12-18
modified: 2025-06-04
Vastavuoroinen suhde: erikoisnumero
broader: numero teoksessa
definition: Teos, jolla on numero, joka on omistettu tietylle aiheelle. (RDA Registry)
definition: Verk som har ett nummer, som är tillägnat ett visst ämne. @sv
in scheme: Metatietosanasto
preferred label: special issue of @en
preferred label: specialnummer av verket @sv

kartantekijä
type: Concept
source: RDA-termi
source: RDA-term @sv
created: 2024-12-18
modified: 2025-07-03
alternative label: kartografiaan osallinen henkilö
alternative label: bidragsgivare (person) till kartografi @sv
broader: aggregaattiin osallinen henkilö
definition: Aggregaattiin osallinen henkilö, joka on luonut aggregaattiin sisältyvän kartografisen teoksen ekspression.
definition: Person som bidragit till ett aggregat, genom att skapa ett uttryck av ett kartografiskt verk som ingår i ett aggregat. @sv
in scheme: Metatietosanasto
narrower: maanmittari
preferred label: contributor person of cartography @en
preferred label: kartograf @sv

aiheena oleva yhteisö
type: Concept
source: RDA-termi
source: RDA-term @sv
created: 2024-12-18
modified: 2025-02-21
broader: teokseen liittyvä yhteisö
definition: Yhteisö, jota teos koskee. (RDA Registry)
definition: Institution som ett verk handlar om. @sv
in scheme: Metatietosanasto
narrower: kuvaus yhteisöstä
preferred label: subject corporate body @en
preferred label: behandlad institution @sv

teoksen omistuksen kohde
type: Concept
source: RDA-termi
source: RDA-term @sv
created: 2024-12-18
modified: 2025-08-22
alternative label: teoksen omistuksen kohde (yhteisö)
alternative label: dedikationsmottagare @sv
alternative label: verket dedicerat till (institution) @sv
broader: teokseen liittyvä yhteisö
definition: Yhteisö, jolle teos on omistettu. (RDA Registry)
definition: Institution som ett verk tillägnats. @sv
in scheme: Metatietosanasto
narrower: teos omistettu
preferred label: dedicatee corporate body of work @en
preferred label: verket dedicerat till @sv

teoksen arvostelu
type: Concept
source: RDA-termi
source: RDA-term @sv
created: 2024-12-18
modified: 2025-08-22
Vastavuoroinen suhde: arvostelu teoksesta
alternative label: reviewed in (work) @en
alternative label: arvosteltu teoksessa
alternative label: recenserad i verket @sv
broader: teoksen arviointi
definition: Teos, joka on teoksen lyhyt arviointi. (RDA Registry)
definition: Verk som är en kort recension av ett verk. @sv
in scheme: Metatietosanasto
preferred label: work reviewed by @en
preferred label: recension av verket i @sv

sisältää (teos)
type: Concept
source: RDA-termi
source: RDA-term @sv
created: 2024-12-18
modified: 2026-05-20
Vastavuoroinen suhde: sisältyy aineistoon
alternative label: manifestaatioon sisältyvä teos
alternative label: verk som ingår i manifestation @sv
broader: aineistoon liittyvä teos
definition: Teos, joka sisältyy manifestaatioon. (RDA Registry)
definition: Verk som ingår i en manifestation. @sv
in scheme: Metatietosanasto
preferred label: work manifested @en
preferred label: innehåller (verk) @sv

vaikuttajana
type: Concept
source: AgRelOn, an Agent Relationship Ontology
source: Kansallinen RDA-termi
source: Nationell RDA-term @sv
created: 2024-12-18
modified: 2025-08-23
Vastavuoroinen suhde: vaikuttaja
broader: henkilöön liittyvä yhteisö
definition: Yhteisö, johon kuvailtava henkilö vaikuttaa.
definition: Institution som en beskriven person påverkar. @sv
in scheme: Metatietosanasto
preferred label: is influenced by @en
preferred label: påverkad av @sv

teos
type: Concept
source: RDA-termi
source: RDA-term @sv
created: 2024-12-18
modified: 2025-08-23
Vastavuoroinen suhde: teoksen versio
alternative label: ekspression toteuttama teos
alternative label: verk förverkligat i uttryck @sv
broader: versioon liittyvä teos
definition: Teos, joka toteutuu ekspression kautta. (RDA Registry)
definition: Verk som förverkligas genom ett uttryck. @sv
in scheme: Metatietosanasto
preferred label: work expressed @en
preferred label: verk @sv

kritiikki versiosta
type: Concept
source: RDA-termi
source: RDA-term @sv
created: 2024-12-18
modified: 2025-07-04
Vastavuoroinen suhde: version kritiikki
alternative label: kritiikki ekspressiosta
alternative label: kritik av uttrycket @sv
broader: arviointi versiosta
definition: Ekspressio, johon kriittinen arviointi perustuu. (RDA Registry)
definition: Uttryck som en kritisk bedömning grundar sig på. @sv
in scheme: Metatietosanasto
preferred label: critique of expression @en
preferred label: kritik av versionen @sv

version kritiikki
type: Concept
source: RDA-termi
source: RDA-term @sv
created: 2024-12-18
modified: 2025-08-23
Vastavuoroinen suhde: kritiikki versiosta
alternative label: critiqued in (expression) @en
alternative label: ekspression kritiikki
alternative label: kritisoitu teoksessa (ekspressio)
alternative label: kritik av uttrycket i @sv
alternative label: kritiserad i verket (uttryck) @sv
broader: version arviointi
definition: Teos, joka on ekspression kriittinen arviointi. (RDA Registry)
definition: Verk som är en kritisk utvärdering av ett uttryck. @sv
in scheme: Metatietosanasto
preferred label: expression critiqued by @en
preferred label: kritik av versionen i @sv

hierarkkinen luettelo aineistolle
type: Concept
source: RDA-termi
source: RDA-term @sv
created: 2024-12-18
modified: 2025-08-28
Vastavuoroinen suhde: hierarkkinen luettelo
alternative label: finding aid of, hierarchic @en
alternative label: hierarkkinen luettelo manifestaatiolle
alternative label: luettelo manifestaatiolle, hierarkkinen
alternative label: hierarkisk förteckning till manifestationen @sv
broader: luettelo aineistolle
definition: Manifestaatio, joka on kokoelmamanifestaatio, jolla on siihen kuuluvia alakokoelmia ja kappaleita koskeva metatietokokonaisuus. (RDA Registry)
definition: Manifestation som är en samlingsmanifestation och som har en metadatahelhet som rör delsamlingar och exemplar som ingår i den. @sv
in scheme: Metatietosanasto
preferred label: hierarchic finding aid of @en
preferred label: hierarkisk förteckning till materialet @sv
scope note: Kokoelmaan kuuluu arkistokokoelma. (RDA Registry)
scope note: Till samling hör en arkivsamling. @sv

kuvaus toimijasta
type: Concept
source: RDA-termi
source: RDA-term @sv
created: 2024-12-18
modified: 2025-07-04
broader: aiheena oleva toimija
definition: Toimija, jota teos kuvaa. (RDA Registry)
definition: Aktör som ett verk beskriver. @sv
in scheme: Metatietosanasto
narrower: metatietokuvailu toimijasta
preferred label: description of agent @en
preferred label: beskrivning av aktören @sv

tallenneversio
type: Concept
source: RDA-termi
source: RDA-term @sv
created: 2024-12-18
modified: 2025-08-21
Vastavuoroinen suhde: tallenneversio teoksesta
broader: muunnos yleisössä
definition: Teos, joka on luotu muuttamalla teoksen tallennetta. (RDA Registry)
definition: Verk som har skapats genom att ändra bärare av ett verk. @sv
in scheme: Metatietosanasto
preferred label: carrier version @en
preferred label: bärarversion @sv

analyysi kappaleesta
type: Concept
source: RDA-termi
source: RDA-term @sv
created: 2024-12-18
modified: 2025-04-15
Vastavuoroinen suhde: kappaleen analyysi
broader: kuvaus kappaleesta
definition: Kappale, jonka rakennetta teos kuvaa. (RDA Registry)
definition: Exemplar, vars struktur ett verk beskriver. @sv
in scheme: Metatietosanasto
preferred label: analysis of item @en
preferred label: analys av exemplaret @sv

kappaleen säilytyskopio
type: Concept
source: RDA-termi
source: RDA-term @sv
created: 2024-12-18
modified: 2025-07-03
Vastavuoroinen suhde: säilytyskopio kappaleesta
alternative label: preservation facsimile (item) @en
alternative label: säilytyskopio (kappale)
alternative label: arkivbeständig kopia (exemplar) @sv
broader: kappaleen näköispainos
definition: Manifestaatio, joka koostuu kappaleen täsmällisestä jäljennöksestä. Jäljennöksen valmistuksessa on käytetty arkistokelpoista materiaalia, esim. arkistopaperia. (RDA Registry)
definition: Manifestation som består av en exakt reproduktion av ett exemplar. Reproduktionen har tillverkats med arkivbeständigt material, t.ex. arkivpapper. @sv
in scheme: Metatietosanasto
preferred label: preservation facsimile of item @en
preferred label: arkivbeständig kopia av exemplaret @sv

puhe teokseen
type: Concept
source: RDA-termi
source: RDA-term @sv
created: 2024-12-18
modified: 2025-03-18
Vastavuoroinen suhde: puheteos
broader: täydentävä teos
definition: Teos, jota täydentää puheteos. (RDA Registry)
definition: Verk som ett talverk kompletterar. @sv
in scheme: Metatietosanasto
preferred label: spoken word for work @en
preferred label: tal till verket @sv

aiheena oleva toimija
type: Concept
source: RDA-termi
source: RDA-term @sv
created: 2024-12-18
modified: 2025-02-21
alternative label: behandlad agent @sv
broader: teokseen liittyvä toimija
definition: Toimija, jota teos koskee. (RDA Registry)
definition: Aktör som ett verk handlar om. @sv
in scheme: Metatietosanasto
narrower: kuvaus toimijasta
preferred label: subject agent @en
preferred label: behandlad aktör @sv

sanoittaja
type: Concept
source: RDA-termi
source: RDA-term @sv
created: 2024-12-18
modified: 2026-03-03
alternative label: sanoittaja (yhteisö)
alternative label: författare till sångtext @sv
alternative label: sångtextförfattare (institution) @sv
broader: kirjoittaja
definition: Yhteisö, joka on populaarimusiikkiin kuuluvan laulun, mukaan lukien musikaalilaulun, sanojen kirjoittaja. (RDA Registry)
definition: Institution som är författare till ord i en sång, även en musikalsång, som hör till populärmusik. @sv
in scheme: Metatietosanasto
narrower: lisätyn sanoituksen kirjoittaja
preferred label: lyricist corporate body @en
preferred label: sångtextförfattare @sv
scope note: Ei kata pelkän musikaalin dialogin kirjoittajaa. (RDA Registry)
scope note: Gäller inte författare till endast dialog i en musikal. @sv

kappaleen analyysi
type: Concept
source: RDA-termi
source: RDA-term @sv
created: 2024-12-18
modified: 2025-07-03
Vastavuoroinen suhde: analyysi kappaleesta
alternative label: analysed in (item) @en
broader: kappaletta kuvaava teos
definition: Teos, joka kuvailee kappaleen rakennetta ja kokoonpanoa. (RDA Registry)
definition: Verk som beskriver ett exemplars struktur och sammansättning. @sv
in scheme: Metatietosanasto
preferred label: item analysed in @en
preferred label: analys av exemplaret i @sv

staattinen versio teoksesta
type: Concept
source: RDA-termi
source: RDA-term @sv
created: 2024-12-18
modified: 2025-08-21
Vastavuoroinen suhde: staattinen versio
broader: muunnos laajennussuunnitelmassa teoksesta
definition: Teos, jolla on laajennussuunnitelma, joka on muutettu staattisesta päivittyväksi teoksen luomiseksi. (RDA Registry)
definition: Verk med en utgivningsplan, som har ändrats från statisk till integrerande för att skapa ett verk. @sv
in scheme: Metatietosanasto
preferred label: static version of @en
preferred label: statisk version av verket @sv

vaikuttaja
type: Concept
source: AgRelOn, an Agent Relationship Ontology
source: Kansallinen RDA-termi
source: Nationell RDA-term @sv
created: 2024-12-18
modified: 2025-08-23
Vastavuoroinen suhde: vaikuttajana
broader: yhteisöön liittyvä henkilö
definition: Henkilö, joka vaikuttaa kuvailtavaan yhteisöön.
definition: Person som påverkar en beskriven institution. @sv
in scheme: Metatietosanasto
preferred label: has influence on @en
preferred label: påverkare @sv

vaikuttaja
type: Concept
source: AgRelOn, an Agent Relationship Ontology
source: Kansallinen RDA-termi
source: Nationell RDA-term @sv
created: 2024-12-18
modified: 2025-08-23
Vastavuoroinen suhde: vaikuttajana
broader: henkilöön liittyvä yhteisö
definition: Yhteisö, joka vaikuttaa kuvailtavaan henkilöön.
definition: Institution som påverkar en beskriven person. @sv
in scheme: Metatietosanasto
preferred label: has influence on @en
preferred label: påverkare @sv

vaikuttajana
type: Concept
source: AgRelOn, an Agent Relationship Ontology
source: Kansallinen RDA-termi
source: Nationell RDA-term @sv
created: 2024-12-18
modified: 2025-08-23
Vastavuoroinen suhde: vaikuttaja
broader: yhteisöön liittyvä henkilö
definition: Henkilö, joka vaikuttaa kuvailtavaan yhteisöön.
definition: Person som påverkar en beskriven institution. @sv
in scheme: Metatietosanasto
preferred label: is influenced by @en
preferred label: påverkad av @sv

metatietokuvailu kappaleesta
type: Concept
source: RDA-termi
source: RDA-term @sv
created: 2024-12-18
modified: 2025-08-14
Vastavuoroinen suhde: kappaletta metatiedoilla kuvaileva teos
broader: kuvaus kappaleesta
definition: Metatietoteoksen kuvailema kappale. (RDA Registry)
definition: Exemplar som ett metadataverk beskriver. @sv
in scheme: Metatietosanasto
preferred label: metadata description of item @en
preferred label: metadatabeskrivning av exemplaret @sv

ääni teokseen
type: Concept
source: RDA-termi
source: RDA-term @sv
created: 2024-12-18
modified: 2025-08-27
Vastavuoroinen suhde: ääniteos
broader: täydentävä teos
definition: Teos, jota täydentää teos, joka toteutuu äänenä. (RDA Registry)
definition: Verk som kompletteras av ett verk, som förverkligas som ljud. @sv
in scheme: Metatietosanasto
preferred label: sounds for work @en
preferred label: ljud till verket @sv

arvostelu teoksesta
type: Concept
source: RDA-termi
source: RDA-term @sv
created: 2024-12-18
modified: 2025-04-16
Vastavuoroinen suhde: teoksen arvostelu
broader: arviointi teoksesta
definition: Teoksen lyhyen arvioinnin perustana käytetty teos. (RDA Registry)
definition: Verk som använts som grund för en kort bedömning. @sv
in scheme: Metatietosanasto
preferred label: review of work @en
preferred label: recension av verket @sv

hierarkkinen luettelo
type: Concept
source: RDA-termi
source: RDA-term @sv
created: 2024-12-18
modified: 2025-06-14
Vastavuoroinen suhde: hierarkkinen luettelo aineistolle
alternative label: finding aid, hierarchic @en
alternative label: luettelo, hierarkkinen
alternative label: förteckning, hierarkisk @sv
broader: luettelo
definition: Teos, joka kokoelmamanifestaatioon sisältyvien alakokoelmien ja kappaleiden metatietokokonaisuus. (RDA Registry)
definition: Verk som är en metadatahelhet för delsamlingar och exemplar som ingår i en samlingsmanifestation. @sv
in scheme: Metatietosanasto
preferred label: hierarchic finding aid @en
preferred label: hierarkisk förteckning @sv
scope note: Kokoelma sisältää arkistokokoelman. (RDA Registry)
scope note: Samling inbegriper arkivsamling. @sv

edustava versio teokselle
type: Concept
source: RDA-termi
source: RDA-term @sv
created: 2024-12-18
modified: 2025-05-27
Vastavuoroinen suhde: edustava versio
alternative label: edustava ekspressio teokselle
alternative label: representativt uttryck för verket @sv
broader: versioon liittyvä teos
definition: Teos, jonka tietojen identifioinnin kanonisena lähteenä ekspressiota pidetään. (RDA Registry)
definition: Verk, för vars uppgifter ett uttryck anses vara kanonisk källa för identifiering. @sv
in scheme: Metatietosanasto
preferred label: representative expression of @en
preferred label: representativ version för verket @sv

version arvostelu
type: Concept
source: RDA-termi
source: RDA-term @sv
created: 2024-12-18
modified: 2025-08-23
Vastavuoroinen suhde: arvostelu versiosta
alternative label: reviewed in (expression) @en
alternative label: arvosteltu teoksessa (ekspressio)
alternative label: ekspression arvostelu
alternative label: analyserad i verket (uttryck) @sv
alternative label: recension av uttrycket i @sv
broader: version arviointi
definition: Teos, joka on ekspression lyhyt arviointi. (RDA Registry)
definition: Verk som är en kort recension av ett uttryck. @sv
in scheme: Metatietosanasto
preferred label: expression reviewed by @en
preferred label: recension av versionen i @sv

arvostelu aineistosta
type: Concept
source: RDA-termi
source: RDA-term @sv
created: 2024-12-18
modified: 2025-04-16
Vastavuoroinen suhde: aineiston arvostelu
alternative label: arvostelu manifestaatiosta
alternative label: recension av manifestationen @sv
broader: arviointi aineistosta
definition: Lyhyen arvioinnin perustana käytetty manifestaatio. (RDA Registry)
definition: Manifestation som använts som grund för en kort bedömning. @sv
in scheme: Metatietosanasto
preferred label: review of manifestation @en
preferred label: recension av materialet @sv

kappaleen edustama aineisto
type: Concept
source: RDA-termi
source: RDA-term @sv
created: 2024-12-18
modified: 2025-07-03
Vastavuoroinen suhde: aineiston kappale
alternative label: kappaleen edustama manifestaatio
alternative label: manifestation som exemplaret representerar @sv
broader: kappaleeseen liittyvä aineisto
definition: Manifestaatio, jota kappale edustaa. (RDA Registry)
definition: Manifestation som ett exemplar representerar. @sv
in scheme: Metatietosanasto
preferred label: manifestation exemplified @en
preferred label: material som exemplaret representerar @sv

suvun sukuhaara
type: Concept
source: RDA-termi
source: RDA-term @sv
created: 2024-12-18
modified: 2025-08-21
alternative label: suvun jäsen (suku)
alternative label: medlem (släkt) i släkt @sv
broader: sukuun liittyvä suku
definition: Suku, joka on suvun jäsen. (RDA Registry)
definition: Släkt som är medlem i en släkt. @sv
in scheme: Metatietosanasto
narrower: suvusta polveutuva suku
preferred label: family member of family @en
preferred label: släktgren i släkt @sv

toimittaja
type: Concept
source: RDA-termi
source: RDA-term @sv
created: 2024-12-18
modified: 2025-08-23
alternative label: editor person of text @en
alternative label: tekstin toimittaja (henkilö)
alternative label: toimittaja (henkilö)
alternative label: redaktör (person) @sv
alternative label: redaktör (person) för text @sv
broader: yhdistymään osallinen henkilö
definition: Henkilö, joka osallistuu ekspression tekemiseen tarkistamalla muiden toimijoiden luomaa sisältöä julkaisu- tai muiden käyttöstandardien saavuttamiseksi. (RDA Registry)
definition: Person som deltar i utförandet av ett uttryck, genom att justera innehåll som skapats av andra aktörer, för att uppfylla utgivnings- och andra bruksstandarder. @sv
in scheme: Metatietosanasto
narrower: päätoimittaja
preferred label: editor person @en
preferred label: redaktör @sv
scope note: Sisältöön kuuluvat liikenotaatio, nuottikirjoitus, taktiili liikenotaatio, taktiili nuottikirjoitus, taktiili teksti ja teksti. (RDA Registry)
scope note: Till innehåll hör rörelsenotation, taktil rörelsenotation, taktil musiknotation, taktil text och text. @sv

teoksen analyysi
type: Concept
source: RDA-termi
source: RDA-term @sv
created: 2024-12-18
modified: 2025-08-22
Vastavuoroinen suhde: analyysi teoksesta
alternative label: analysed in (work) @en
alternative label: analysoitu teoksessa
alternative label: analyserad i verket @sv
broader: teosta kuvaava teos
definition: Teos, joka kuvaa toisen teoksen rakennetta ja koostumusta. (RDA Registry)
definition: Verk som beskriver ett annat verks struktur och sammansättning. @sv
in scheme: Metatietosanasto
preferred label: work analysed in @en
preferred label: analys av verket i @sv

käytetty lähde
type: Concept
source: RDA-termi
source: RDA-term @sv
created: 2024-12-18
modified: 2025-07-04
Vastavuoroinen suhde: käytetty lähde metatietoteoksessa
broader: teokseen liittyvä aineisto
definition: Manifestaatio, jossa on metatietoteoksessa käytettäviä tietoja. (RDA Registry)
definition: Manifestation som innehåller uppgifter som används i ett metadataverk. @sv
in scheme: Metatietosanasto
preferred label: source consulted @en
preferred label: konsulterad källa @sv

aineiston analyysi
type: Concept
source: RDA-termi
source: RDA-term @sv
created: 2024-12-18
modified: 2025-01-03
Vastavuoroinen suhde: analyysi aineistosta
alternative label: analysed in (manifestation) @en
alternative label: manifestaation analyysi
alternative label: analys av manifestationen i @sv
broader: aineistoa kuvaava teos
definition: Teos, joka kuvaa manifestaation rakennetta ja luonnetta. (RDA Registry)
definition: Verk som beskriver en manifestations struktur och karaktär. @sv
in scheme: Metatietosanasto
preferred label: manifestation analysed in @en
preferred label: analys av materialet i @sv

sisältää (ekspressio)
type: Concept
source: RDA-termi
source: RDA-term @sv
created: 2024-12-18
modified: 2026-05-20
Vastavuoroinen suhde: sisältyy aineistoon
alternative label: manifestaatioon sisältyvä ekspressio
alternative label: uttryck som ingår i manifestation @sv
broader: aineistoon liittyvä versio
definition: Ekspressio, joka sisältyy manifestaatioon. (RDA Registry)
definition: Uttryck som ingår i en manifestation. @sv
in scheme: Metatietosanasto
preferred label: expression manifested @en
preferred label: innehåller (uttryck) @sv

tallenneversio teoksesta
type: Concept
source: RDA-termi
source: RDA-term @sv
created: 2024-12-18
modified: 2025-08-21
Vastavuoroinen suhde: tallenneversio
broader: muunnos yleisössä teoksesta
definition: Teos, jolla on tallenne, jota on muutettu teoksen luomiseksi. (RDA Registry)
definition: Verk med en bärare som ändrats för att skapa ett verk. @sv
in scheme: Metatietosanasto
preferred label: carrier version of @en
preferred label: bärarversion av verket @sv

metatietokuvailu versiosta
type: Concept
source: RDA-termi
source: RDA-term @sv
created: 2024-12-18
modified: 2025-08-14
Vastavuoroinen suhde: versiota metatiedoilla kuvaileva teos
alternative label: metatietokuvailu ekspressiosta
alternative label: metadatabeskrivning av uttrycket @sv
broader: kuvaus versiosta
definition: Metatietoteoksen kuvailema ekspressio. (RDA Registry)
definition: Uttryck som ett metadataverk beskriver. @sv
in scheme: Metatietosanasto
preferred label: metadata description of expression @en
preferred label: metadatabeskrivning av versionen @sv

ääniteos
type: Concept
source: RDA-termi
source: RDA-term @sv
created: 2024-12-18
modified: 2025-08-27
Vastavuoroinen suhde: ääni teokseen
broader: täydentävä teos
definition: Teos, joka toteutuu äänenä ja joka täydentää teosta. (RDA Registry)
definition: Verk som förverkligas som ljud och kompletterar ett verk. @sv
in scheme: Metatietosanasto
preferred label: sounds work @en
preferred label: ljudverk @sv

mesenaattina
type: Concept
source: AgRelOn, an Agent Relationship Ontology
source: Kansallinen RDA-termi
source: Nationell RDA-term @sv
created: 2024-12-18
modified: 2025-08-28
Vastavuoroinen suhde: mesenaatti
broader: yhteisöön liittyvä henkilö
definition: Henkilö (esim. taiteilija), jota kuvailtava yhteisö tukee tai suosii.
definition: Person (t.ex. en konstnär) som stöds eller gynnas av en beskriven institution. @sv
in scheme: Metatietosanasto
preferred label: is patron of @en
preferred label: mecenat för @sv

näyttelijä
type: Concept
source: RDA-termi
source: RDA-term @sv
created: 2024-12-18
modified: 2025-08-15
alternative label: näyttelijä (henkilö)
alternative label: skådespelare (person) @sv
broader: esittäjä
definition: Henkilö, joka on esittäjä, joka osallistuu ekspression tekemiseen näyttelemällä musiikki- tai näytelmäesityksessä. (RDA Registry)
definition: Person som är en framförare som bidrar till utförandet av ett uttryck, genom att skådespela i ett musikaliskt eller sceniskt uppförande. @sv
in scheme: Metatietosanasto
narrower: ääninäyttelijä
preferred label: actor person @en
preferred label: skådespelare @sv

peräkkäisversio teoksesta
type: Concept
source: RDA-termi
source: RDA-term @sv
created: 2024-12-18
modified: 2025-08-16
Vastavuoroinen suhde: peräkkäisversio
broader: muunnos laajennussuunnitelmassa teoksesta
definition: Teos, jolla on laajennussuunnitelma, jota on muutettu peräkkäisestä päivittyväksi teoksen luomiseksi. (RDA Registry)
definition: Verk med en utvidgningsplan som har ändrats från successiv till integrerande för att skapa ett verk. @sv
in scheme: Metatietosanasto
preferred label: sequential version of @en
preferred label: successiv version av verket @sv

arvostelu versiosta
type: Concept
source: RDA-termi
source: RDA-term @sv
created: 2024-12-18
modified: 2025-03-22
Vastavuoroinen suhde: version arvostelu
alternative label: arvostelu ekspressiosta
alternative label: recension av uttrycket @sv
broader: arviointi versiosta
definition: Ekspressio, jota on käytetty lyhyen arvioinnin perustana. (RDA Registry)
definition: Uttryck som använts för en kort bedömning. @sv
in scheme: Metatietosanasto
preferred label: review of expression @en
preferred label: recension av versionen @sv

alueversio teoksesta
type: Concept
source: RDA-termi
source: RDA-term @sv
created: 2024-12-18
modified: 2025-04-15
Vastavuoroinen suhde: alueversio
broader: muunnos yleisössä teoksesta
definition: Teos, jolla on alueyleisö, jota on muutettu teoksen luomiseksi. (RDA Registry)
definition: Verk med en regional målgrupp, som har ändrats för att skapa ett verk. @sv
in scheme: Metatietosanasto
preferred label: regional version of @en
preferred label: regional version av verket @sv

painolaatan valmistaja
type: Concept
source: RDA-termi
source: RDA-term @sv
created: 2024-12-18
modified: 2025-08-15
alternative label: painolaatan valmistaja (yhteisö)
alternative label: tryckplåtstillverkare (institution) @sv
broader: aineiston tekijä
definition: Yhteisö, joka on vastuussa manifestaation valmistamisesta valmistamalla painettujen kuvien tai tekstin valmistuksessa käytettäviä painolaattoja tai -levyjä. (RDA Registry)
definition: Institution som svarar för tillverkningen av en manifestation, genom att tillverka tryckplåtar eller dylikt, för användning vid tillverkningen av tryckta bilder eller texter. @sv
in scheme: Metatietosanasto
narrower: kollotypian valmistaja
preferred label: platemaker corporate body @en
preferred label: tryckplåtstillverkare @sv

mesenaatti
type: Concept
source: AgRelOn, an Agent Relationship Ontology
source: Kansallinen RDA-termi
source: Nationell RDA-term @sv
created: 2024-12-18
modified: 2025-08-28
Vastavuoroinen suhde: mesenaattina
broader: yhteisöön liittyvä yhteisö
definition: Yhteisö, joka tukee tai suosii kuvailtavaa yhteisöä (esim. taiteilijaryhmää).
definition: Institution som stöder eller gynnar en beskriven institution (t.ex. en konstnärsgrupp). @sv
in scheme: Metatietosanasto
preferred label: has patron @en
preferred label: mecenat @sv

kuvaus henkilöstä
type: Concept
source: RDA-termi
source: RDA-term @sv
created: 2024-12-18
modified: 2025-07-04
broader: aiheena oleva henkilö
definition: Henkilö, jota teos kuvaa. (RDA Registry)
definition: Person som ett verk beskriver. @sv
in scheme: Metatietosanasto
narrower: metatietokuvailu henkilöstä
preferred label: description of person @en
preferred label: beskrivning av personen @sv

kuvaus yhteisöstä
type: Concept
source: RDA-termi
source: RDA-term @sv
created: 2024-12-18
modified: 2025-07-04
broader: aiheena oleva yhteisö
definition: Yhteisö, jota teos kuvaa. (RDA Registry)
definition: Institution som ett verk beskriver. @sv
in scheme: Metatietosanasto
narrower: metatietokuvailu yhteisöstä
preferred label: description of corporate body @en
preferred label: beskrivning av institutionen @sv

kappale kokoelmassa
type: Concept
source: RDA-termi
source: RDA-term @sv
created: 2024-12-18
modified: 2025-07-03
Vastavuoroinen suhde: kokoelman kappale
broader: kappaleeseen liittyvä aineisto
definition: Kokoelmateoksen manifestaatio, joka sisältää kappaleen. (RDA Registry)
definition: Manifestation av samlingsverk som innehåller ett exemplar. @sv
in scheme: Metatietosanasto
preferred label: holding of @en
preferred label: exemplar i samlingen @sv

analyysi teoksesta
type: Concept
source: RDA-termi
source: RDA-term @sv
created: 2024-12-18
modified: 2025-04-15
Vastavuoroinen suhde: teoksen analyysi
broader: kuvaus teoksesta
definition: Teos, jonka rakennetta kuvaa toinen teos. (RDA Registry)
definition: Verk, vars struktur ett annat verk beskriver. @sv
in scheme: Metatietosanasto
preferred label: analysis of work @en
preferred label: analys av verket @sv

analyysi versiosta
type: Concept
source: RDA-termi
source: RDA-term @sv
created: 2024-12-18
modified: 2025-04-15
Vastavuoroinen suhde: version analyysi
alternative label: analyysi ekspressiosta
alternative label: analys av uttrycket @sv
broader: kuvaus versiosta
definition: Ekspressio, jonka osia ja niiden välisiä suhteita on tutkittu analyyttisesti. (RDA Registry)
definition: Uttryck, vars delar har undersökts analytiskt. @sv
in scheme: Metatietosanasto
preferred label: analysis of expression @en
preferred label: analys av versionen @sv

aineistoon liittyvä versio
type: Concept
source: RDA-termi
source: RDA-term @sv
created: 2024-12-18
modified: 2025-04-15
Vastavuoroinen suhde: versioon liittyvä manifestaatio
alternative label: manifestaatioon liittyvä ekspressio
alternative label: uttryck relaterat till manifestationen @sv
definition: Ekspressio, joka liittyy manifestaatioon. (RDA Registry)
definition: Uttryck som relaterar till en manifestation. @sv
in scheme: Metatietosanasto
narrower: sisältää (ekspressio)
preferred label: related expression of manifestation @en
preferred label: version relaterad till materialet @sv

kokoaja
type: Concept
source: RDA-termi
source: RDA-term @sv
created: 2024-12-18
modified: 2025-07-03
alternative label: kokoaja (henkilö)
alternative label: sammanställare (person) @sv
broader: koostaja
definition: Henkilö, joka on vastuussa uuden teoksen, kuten bibliografian tai hakemiston luomisesta valitsemalla, järjestämällä, koostamalla ja toimittamalla dataa, informaatiota tms. (RDA Registry)
definition: Person som svarar för skapandet av ett nytt verk, såsom en bibliografi eller ett register, genom att välja, ordna, sammanställa och redigera data, information eller dylikt. @sv
in scheme: Metatietosanasto
narrower: kokoelman luetteloija
preferred label: compiler person @en
preferred label: sammanställare @sv
scope note: Ei kata teoksen ekspression sisällön muokkaamista tai selkeyttämistä eikä teosten tai teosten osien valitsemista ja kokoamista yhteen. (RDA Registry)
scope note: Omfattar inte redigering eller förtydligande av innehållet i ett verks uttryck, eller val och hopsamling av verk eller del av verk. @sv

hakemisto aineistolle
type: Concept
source: RDA-termi
source: RDA-term @sv
created: 2024-12-18
modified: 2025-06-13
Vastavuoroinen suhde: hakemisto
alternative label: hakemisto manifestaatiolle
alternative label: index till materialet @sv
alternative label: register till manifestationen @sv
broader: teokseen liittyvä aineisto
definition: Manifestaation sisällön systemaattisen oppaan perustana olevan tekstiteoksen manifestaatio. (RDA Registry)
definition: Manifestation av textverk som är grund för en systematisk vägledning till innehållet i en manifestation. @sv
in scheme: Metatietosanasto
preferred label: index for @en
preferred label: register till materialet @sv

koostaja
type: Concept
source: RDA-termi
source: RDA-term @sv
created: 2024-12-18
modified: 2025-07-04
alternative label: aggregator @en
alternative label: aggregaattori
alternative label: aggregaattori (toimija)
alternative label: aggregerad av (aktör) @sv
broader: teoksen tekijä
definition: Toimija, joka on vastuussa aggregoivan teoksen luomisesta valitsemalla ja järjestämällä muiden teosten ekspressioita. (RDA Registry)
definition: Aktör som svarar för skapandet av ett aggregerande verk, genom att välja och ordna uttryck av andra verk. @sv
in scheme: Metatietosanasto
narrower: kokoaja
preferred label: aggregator agent @en
preferred label: aggregerad av @sv

edustava versio
type: Concept
source: RDA-termi
source: RDA-term @sv
created: 2024-12-18
modified: 2025-05-27
Vastavuoroinen suhde: edustava versio teokselle
alternative label: edustava ekspressio
alternative label: representativt uttryck @sv
broader: teoksen versio
definition: Ekspressio, jota pidetään kanonisena tietolähteenä teoksen identifioinnissa. (RDA Registry)
definition: Uttryck som anses vara kanonisk informationskälla vid identifieringen av ett verk. @sv
in scheme: Metatietosanasto
preferred label: representative expression @en
preferred label: representativ version @sv

version kommentaari
type: Concept
source: RDA-termi
source: RDA-term @sv
created: 2024-12-18
modified: 2025-08-23
Vastavuoroinen suhde: kommentaari versiosta
alternative label: commentary in (expression) @en
alternative label: ekspression kommentaari
alternative label: kommentaari teoksessa (ekspressio)
alternative label: kommentar i verket (uttryck) @sv
alternative label: kommentar till uttrycket i @sv
broader: versiota kuvaava teos
definition: Teos, joka on joukko selittäviä tai kriittisiä huomautuksia ekspressiosta. (RDA Registry)
definition: Verk som är en mängd förklarande eller kritiska anmärkningar om ett uttryck. @sv
in scheme: Metatietosanasto
preferred label: expression commentary in @en
preferred label: kommentar till versionen i @sv

kommentaari versiosta
type: Concept
source: RDA-termi
source: RDA-term @sv
created: 2024-12-18
modified: 2025-07-03
Vastavuoroinen suhde: version kommentaari
alternative label: kommentaari ekspressiosta
alternative label: kommentar till uttrycket @sv
broader: kuvaus versiosta
definition: Selittävien tai kriittisten huomautusten joukon perustana käytetty ekspressio. (RDA Registry)
definition: Uttryck som använts som grund för en samling förklarande eller kritiska anmärkningar. @sv
in scheme: Metatietosanasto
preferred label: commentary on expression @en
preferred label: kommentar till versionen @sv

mesenaattina
type: Concept
source: AgRelOn, an Agent Relationship Ontology
source: Kansallinen RDA-termi
source: Nationell RDA-term @sv
created: 2024-12-18
modified: 2025-08-28
Vastavuoroinen suhde: mesenaatti
broader: yhteisöön liittyvä yhteisö
definition: Yhteisö (esim. taiteilijaryhmä), jota kuvailtava yhteisö tukee tai suosii.
definition: Institution (t.ex. en konstnärsgrupp) som stöds eller gynnas av en beskriven institution. @sv
in scheme: Metatietosanasto
preferred label: is patron of @en
preferred label: mecenat för @sv

sisältyy aineistoon
type: Concept
source: RDA-termi
source: RDA-term @sv
created: 2024-12-18
modified: 2025-08-21
Vastavuoroinen suhde: sisältää (teos)
alternative label: teoksen manifestaatio
alternative label: manifestation av verk @sv
broader: teokseen liittyvä aineisto
definition: Manifestaatio, joka on teoksen fyysinen ilmentymä. (RDA Registry)
definition: Manifestation som är en fysisk manifestation av ett verk. @sv
in scheme: Metatietosanasto
preferred label: manifestation of work @en
preferred label: ingår i materialet @sv

konvertoitu kappale
type: Concept
source: RDA-termi
source: RDA-term @sv
created: 2024-12-18
modified: 2025-07-04
Vastavuoroinen suhde: konvertoinnin tulos
alternative label: digital transfer of (item) @en
alternative label: konvertoitu kappaleesta
alternative label: konverterat från exemplaret @sv
broader: jäljenne kappaleesta
definition: Digitaalisessa muodossa oleva kappale, joka muunnetaan toisessa digitaalisessa muodossa olevaksi manifestaatioksi. (RDA Registry)
definition: Exemplar i digital form, som konverteras till en manifestation i en annan digital form. @sv
in scheme: Metatietosanasto
preferred label: digital transfer of item of @en
preferred label: konverterat exemplar @sv

kritiikki teoksesta
type: Concept
source: RDA-termi
source: RDA-term @sv
created: 2024-12-18
modified: 2025-07-04
Vastavuoroinen suhde: teoksen kritiikki
broader: arviointi teoksesta
definition: Teos, johon kriittinen arviointi perustuu. (RDA Registry)
definition: Verk som en kritisk bedömning grundar sig på. @sv
in scheme: Metatietosanasto
preferred label: critique of work @en
preferred label: kritik av verket @sv

analyysi aineistosta
type: Concept
source: RDA-termi
source: RDA-term @sv
created: 2024-12-18
modified: 2025-04-15
Vastavuoroinen suhde: aineiston analyysi
alternative label: analyysi manifestaatiosta
alternative label: analys av manifestationen @sv
broader: kuvaus aineistosta
definition: Manifestaatio, jonka rakennetta teos kuvaa. (RDA Registry)
definition: Manifestation, vars struktur ett verk beskriver. @sv
in scheme: Metatietosanasto
preferred label: analysis of manifestation @en
preferred label: analys av materialet @sv

elokuvaversio
type: Concept
source: RDA-termi
source: RDA-term @sv
created: 2016-01-08
modified: 2025-05-29
Vastavuoroinen suhde: elokuvaversio teoksesta
alternative label: elokuvaversio (teos)
alternative label: filmatisointi
alternative label: filmatisointi (teos)
alternative label: filmatisering @sv
alternative label: filmatisering (verk) @sv
alternative label: filmversion (verk) @sv
broader: mukaelma
definition: Elokuvateos, joka perustuu toiseen teokseen. (RDA Registry)
definition: Filmverk som grundar sig på ett annat verk. @sv
in scheme: Metatietosanasto
preferred label: adapted as motion picture work @en
preferred label: filmversion @sv

jakelija
type: Concept
source: RDA-termi
source: RDA-term @sv
created: 2024-12-18
modified: 2025-07-01
alternative label: jakelija (yhteisö)
alternative label: distributör (institution) @sv
broader: aineistoon liittyvä yhteisö
definition: Yhteisö, joka on vastuussa julkaistun manifestaation jakelusta. (RDA Registry)
definition: Institution som svarar för distributionen av en publicerad manifestation. @sv
in scheme: Metatietosanasto
narrower: elokuvan jakelija
preferred label: distributor corporate body @en
preferred label: distributör @sv

aiheena oleva henkilö
type: Concept
source: RDA-termi
source: RDA-term @sv
created: 2024-12-18
modified: 2025-02-21
broader: teokseen liittyvä henkilö
definition: Henkilö, jota teos koskee. (RDA Registry)
definition: Person som ett verk handlar om. @sv
in scheme: Metatietosanasto
narrower: kuvaus henkilöstä
preferred label: subject person @en
preferred label: behandlad person @sv

puheteos
type: Concept
source: RDA-termi
source: RDA-term @sv
created: 2024-12-18
modified: 2025-03-18
Vastavuoroinen suhde: puhe teokseen
broader: täydentävä teos
definition: Teos, joka on puheteos ja joka täydentää teosta. (RDA Registry)
definition: Verk som är ett talverk och som kompletterar ett verk. @sv
in scheme: Metatietosanasto
preferred label: spoken word work @en
preferred label: talverk @sv

aineiston arvostelu
type: Concept
source: RDA-termi
source: RDA-term @sv
created: 2024-12-18
modified: 2025-01-03
Vastavuoroinen suhde: arvostelu aineistosta
alternative label: reviewed in (manifestation) @en
alternative label: manifestaation arvostelu
alternative label: recension av manifestation i @sv
broader: aineiston arviointi
definition: Teos, joka on lyhyt arvostelu manifestaatiosta. (RDA Registry)
definition: Verk som är en kort bedömning av en manifestation. @sv
in scheme: Metatietosanasto
preferred label: manifestation reviewed by @en
preferred label: recension av materialet i @sv

hakemisto
type: Concept
source: RDA-termi
source: RDA-term @sv
created: 2024-12-18
modified: 2025-06-13
Vastavuoroinen suhde: hakemisto aineistolle
preferred label: index @en
broader: aineistoon liittyvä teos
definition: Teos, joka on systemaattinen opas tekstiteoksen sisältävän manifestaation sisältöön. (RDA Registry)
definition: Verk som är en systematisk vägledning till innehållet i ett textverk som ingår i en manifestation. @sv
in scheme: Metatietosanasto
preferred label: register @sv

painolaatan valmistaja
type: Concept
source: RDA-termi
source: RDA-term @sv
created: 2024-12-18
modified: 2025-08-15
alternative label: painolaatan valmistaja (henkilö)
alternative label: tryckplåtstillverkare (person) @sv
broader: aineiston tekijä
definition: Henkilö, joka on vastuussa manifestaation valmistamisesta valmistamalla painettujen kuvien tai tekstin valmistuksessa käytettäviä painolaattoja tai -levyjä. (RDA Registry)
definition: Person som svarar för tillverkningen av en manifestation, genom att tillverka tryckplåtar eller dylikt, för användning vid tillverkningen av tryckta bilder eller texter. @sv
in scheme: Metatietosanasto
narrower: kollotypian valmistaja
preferred label: platemaker person @en
preferred label: tryckplåtstillverkare @sv

käytetty lähde metatietoteoksessa
type: Concept
source: RDA-termi
source: RDA-term @sv
created: 2024-12-18
modified: 2025-07-04
Vastavuoroinen suhde: käytetty lähde
broader: aineistoon liittyvä teos
definition: Metatietoteos, jonka todisteena manifestaatio on. (RDA Registry)
definition: Metadataverk som en manifestation ger bevis för. @sv
in scheme: Metatietosanasto
preferred label: source consulted of @en
preferred label: konsulterad källa i metadataverket @sv

murhaaja
type: Concept
source: AgRelOn, an Agent Relationship Ontology
source: Kansallinen RDA-termi
source: Nationell RDA-term @sv
created: 2024-12-18
modified: 2025-08-28
Vastavuoroinen suhde: murhattu
broader: henkilöön liittyvä yhteisö
definition: Kuvailtavan henkilön murhannut yhteisö.
definition: Institution som har mördat en beskriven person. @sv
in scheme: Metatietosanasto
preferred label: has murderer @en
preferred label: mördare @sv

näyttelijä
type: Concept
source: RDA-termi
source: RDA-term @sv
created: 2024-12-18
modified: 2025-08-15
alternative label: näyttelijä (yhteisö)
alternative label: skådespelare (institution) @sv
broader: esittäjä
definition: Yhteisö, joka on esittäjä, joka osallistuu ekspression tekemiseen näyttelemällä musiikki- tai näytelmäesityksessä. (RDA Registry)
definition: Institution som är en framförare som bidrar till utförandet av ett uttryck, genom att skådespela i ett musikaliskt eller sceniskt uppförande. @sv
in scheme: Metatietosanasto
narrower: ääninäyttelijä
preferred label: actor corporate body @en
preferred label: skådespelare @sv

versioon liittyvä manifestaatio
type: Concept
source: RDA-termi
source: RDA-term @sv
created: 2024-12-18
modified: 2025-08-23
Vastavuoroinen suhde: aineistoon liittyvä versio
alternative label: ekspressioon liittyvä manifestaatio
alternative label: manifestation relaterad till uttrycket @sv
definition: Manifestaatio, joka liittyy ekspressioon. (RDA Registry)
definition: Manifestation som relaterar till ett uttryck. @sv
in scheme: Metatietosanasto
narrower: sisältyy aineistoon
preferred label: related manifestation of expression @en
preferred label: manifestation relaterad till versionen @sv

konkordanssihakemisto
type: Concept
source: RDA-termi
source: RDA-term @sv
created: 2024-12-18
modified: 2025-07-03
Vastavuoroinen suhde: konkordanssihakemisto versiolle
alternative label: konkordanssihakemisto (teos)
alternative label: konkordans (verk) @sv
broader: versioon liittyvä teos
definition: Teos, joka on tekstiteoksen toteuttavassa ekspressiossa esiintyvien kaikkien tai valikoitujen sanojen systemaattinen opas. (RDA Registry)
definition: Verk som är en systematisk guide över alla eller utvalda ord som förekommer i ett uttryck som förverkligar ett textverk. @sv
in scheme: Metatietosanasto
preferred label: concordance work @en
preferred label: konkordans @sv

kieliversio
type: Concept
source: RDA-termi
source: RDA-term @sv
created: 2024-12-18
modified: 2025-07-03
Vastavuoroinen suhde: kieliversio teoksesta
broader: muunnos yleisössä
definition: Teos, joka on luotu muuttamalla teoksen kieliyleisöä. (RDA Registry)
definition: Verk som har skapats genom att ändra den språkliga målgruppen för ett verk. @sv
in scheme: Metatietosanasto
preferred label: language version @en
preferred label: språkversion @sv

aineiston kritiikki
type: Concept
source: RDA-termi
source: RDA-term @sv
created: 2024-12-18
modified: 2025-01-03
Vastavuoroinen suhde: kritiikki aineistosta
alternative label: critiqued in (manifestation) @en
alternative label: manifestaation kritiikki
alternative label: kritik av manifestationen i @sv
broader: aineiston arviointi
definition: Teos, joka on kriittinen arviointi manifestaatiosta. (RDA Registry)
definition: Verk som är en kritisk bedömning av en manifestation. @sv
in scheme: Metatietosanasto
preferred label: manifestation critiqued by @en
preferred label: kritik av materialet i @sv

nykyinen omistaja
type: Concept
source: RDA-termi
source: RDA-term @sv
created: 2024-12-18
modified: 2025-08-15
alternative label: nykyinen omistaja (yhteisö)
alternative label: nuvarande ägare (institution) @sv
broader: omistaja
definition: Yhteisö, joka tällä hetkellä laillisesti omistaa kappaleen. (RDA Registry)
definition: Institution som för tillfället juridiskt äger ett exemplar. @sv
in scheme: Metatietosanasto
narrower: tallettaja
preferred label: current owner corporate body @en
preferred label: nuvarande ägare @sv

erikoisnumero
type: Concept
source: RDA-termi
source: RDA-term @sv
created: 2024-12-18
modified: 2025-06-04
Vastavuoroinen suhde: erikoisnumero teokselle
broader: numero
definition: Teos, joka on numero, joka on omistettu tietylle aiheelle. (RDA Registry)
definition: Verk som är ett nummer, som är tillägnat ett visst ämne. @sv
in scheme: Metatietosanasto
preferred label: special issue @en
preferred label: specialnummer @sv

kappaletta metatiedoilla kuvaileva teos
type: Concept
source: RDA-termi
source: RDA-term @sv
created: 2024-12-18
modified: 2025-07-03
Vastavuoroinen suhde: metatietokuvailu kappaleesta
broader: kappaletta kuvaava teos
definition: Teos, joka on kappaleen metatietoteos. (RDA Registry)
definition: Verk som är ett metadataverk för ett exemplar. @sv
in scheme: Metatietosanasto
preferred label: item described with metadata by @en
preferred label: verk som beskriver exemplaret med metadata @sv

arkkitehti
type: Concept
source: RDA-termi
source: RDA-term @sv
created: 2024-12-18
modified: 2025-04-16
alternative label: arkkitehti (yhteisö)
alternative label: arkitekt (institution) @sv
broader: teoksen tekijä
definition: Yhteisö, joka on vastuussa arkkitehtisuunnitelman luomisesta, mukaan lukien kuvaesityksestä, jonka tarkoitus on näyttää, miltä rakennus tai muu rakennelma näyttää valmiina. (RDA Registry)
definition: Institution som ansvarar för skapandet av en arkitektplan, inklusive en bildpresentation över hur en byggnad eller en annan konstruktion ska se ut när den är färdig. @sv
in scheme: Metatietosanasto
narrower: maisema-arkkitehti
preferred label: architect corporate body @en
preferred label: arkitekt @sv

koostaja
type: Concept
source: RDA-termi
source: RDA-term @sv
created: 2024-12-18
modified: 2025-07-04
alternative label: aggregaattori (henkilö)
alternative label: aggregerad av (person) @sv
broader: teoksen tekijä
definition: Henkilö, joka on vastuussa aggregoivan teoksen luomisesta valitsemalla ja järjestämällä muiden teosten ekspressioita. (RDA Registry)
definition: Person som svarar för skapandet av ett aggregerande verk, genom att välja och ordna uttryck av andra verk. @sv
in scheme: Metatietosanasto
narrower: kokoaja
preferred label: aggregator person @en
preferred label: aggregerad av @sv

kappaleen sidos
type: Concept
source: RDA-termi
source: RDA-term @sv
created: 2024-12-18
modified: 2025-07-03
Vastavuoroinen suhde: kappaleen sidos kappaleesta
broader: kappaleeseen liittyvä teos
definition: Teos, joka on kappaleen sidos. (RDA Registry)
definition: Verk som är en bindning av ett exemplar. @sv
in scheme: Metatietosanasto
preferred label: binding of item @en
preferred label: bindning av exemplaret @sv

kustantaja
type: Concept
source: RDA-termi
source: RDA-term @sv
created: 2024-12-18
modified: 2025-07-04
alternative label: kustantaja (henkilö)
alternative label: förläggare @sv
alternative label: utgivare (person) @sv
broader: aineiston tekijä
definition: Henkilö, joka on vastuussa julkaistun manifestaation kustantamisesta, julkaisemisesta tai ilmestymisestä. (RDA Registry)
definition: Person som svarar för förläggande, utgivning eller utkommande av en publicerad manifestation. @sv
in scheme: Metatietosanasto
narrower: lähetyksestä vastaava henkilö
preferred label: publisher person @en
preferred label: utgivare @sv

sanoittaja
type: Concept
source: RDA-termi
source: RDA-term @sv
created: 2024-12-18
modified: 2026-03-03
alternative label: sanoittaja (henkilö)
alternative label: författare till sångtext @sv
alternative label: sångtextförfattare (person) @sv
broader: kirjoittaja
definition: Henkilö, joka on populaarimusiikkiin kuuluvan laulun, mukaan lukien musikaalilaulun, sanojen kirjoittaja. (RDA Registry)
definition: Person som är författare till ord i en sång, även en musikalsång, som hör till populärmusik. @sv
in scheme: Metatietosanasto
narrower: lisätyn sanoituksen kirjoittaja
preferred label: lyricist person @en
preferred label: sångtextförfattare @sv
scope note: Ei kata pelkän musikaalin dialogin kirjoittajaa. (RDA Registry)
scope note: Gäller inte författare till endast dialog i en musikal. @sv

sarjaversio teoksesta
type: Concept
source: RDA-termi
source: RDA-term @sv
created: 2024-12-18
modified: 2025-08-19
Vastavuoroinen suhde: sarjaversio
broader: muunnos laajennussuunnitelmassa teoksesta
definition: Teos, jolla on laajennussuunnitelma, joka on muutettu peräkkäisestä staattiseksi teoksen luomiseksi. (RDA Registry)
definition: Verk med en utvidgningsplan som har ändrats från successiv till statisk, för att skapa ett nytt verk. @sv
in scheme: Metatietosanasto
preferred label: serialized version of @en
preferred label: seriell version av verket @sv

aineiston kommentaari
type: Concept
source: RDA-termi
source: RDA-term @sv
created: 2024-12-18
modified: 2025-04-15
Vastavuoroinen suhde: kommentaari aineistosta
alternative label: commentary in (manifestation) @en
alternative label: manifestaation kommentaari
alternative label: kommentar till manifestationen i @sv
broader: aineistoa kuvaava teos
definition: Teos, joka on manifestaatiota selittävien tai kritisoivien huomautusten joukko. (RDA Registry)
definition: Verk som är en uppsättning förklarande eller kritiska anmärkningar om en manifestation. @sv
in scheme: Metatietosanasto
preferred label: manifestation commentary in @en
preferred label: kommentar till materialet i @sv

aineistossa toisen kappaleen kanssa
type: Concept
source: RDA-termi
source: RDA-term @sv
created: 2024-12-18
modified: 2025-04-15
alternative label: manifestaatiossa toisen kappaleen kanssa
alternative label: i manifestationen med ett annat exemplar @sv
broader: kappaleeseen liittyvä kappale
definition: Kappale, joka on jäljenteenä samassa manifestaatiossa kuin toinen kappale. (RDA Registry)
definition: Exemplar som reproducerats i samma manifestation som ett annat exemplar. @sv
in scheme: Metatietosanasto
preferred label: on manifestation with @en
preferred label: i materialet med ett annat exemplar @sv

kokoelmaluettelo
type: Concept
source: RDA-termi
source: RDA-term @sv
created: 2024-12-18
modified: 2025-07-03
Vastavuoroinen suhde: kokoelmaluettelo aineistolle
alternative label: analytic finding aid @en
alternative label: finding aid, analytic @en
alternative label: analyyttinen luettelo
alternative label: luettelo, analyyttinen
alternative label: analytisk katalog @sv
alternative label: katalog, analytisk @sv
broader: luettelo
definition: Teos, joka on kokoelmamanifestaation sisältämien kappaleiden metatietokokonaisuus. (RDA Registry)
definition: Verk som är en metadatahelhet för exemplar som ingår i en samlingsmanifestation. @sv
in scheme: Metatietosanasto
preferred label: catalogue @en
preferred label: samlingskatalog @sv

kokoelmaluettelo aineistolle
type: Concept
source: RDA-termi
source: RDA-term @sv
created: 2024-12-18
modified: 2025-07-03
Vastavuoroinen suhde: kokoelmaluettelo
alternative label: analytic finding aid of @en
alternative label: finding aid of, analytic @en
alternative label: analyyttinen luettelo manifestaatiolle
alternative label: kokoelmaluettelo manifestaatiolle
alternative label: luettelo manifestaatiolle, analyyttinen
alternative label: analytisk katalog för manifestationen @sv
alternative label: katalog för manifestationen, analytisk @sv
alternative label: samlingskatalog för manifestationen @sv
broader: luettelo aineistolle
definition: Manifestaatio, joka on kokoelmamanifestaatio, jolla on siihen kuuluvia kappaleita koskeva metatietokokonaisuus. (RDA Registry)
definition: Manifestation som är en samlingsmanifestation, som har en metadatahelhet som rör exemplar som hör till den. @sv
in scheme: Metatietosanasto
preferred label: catalogue of @en
preferred label: samlingskatalog för materialet @sv

version analyysi
type: Concept
source: RDA-termi
source: RDA-term @sv
created: 2024-12-18
modified: 2025-08-23
Vastavuoroinen suhde: analyysi versiosta
alternative label: analysed in (expression) @en
alternative label: analysoitu teoksessa (ekspressio)
alternative label: ekspression analyysi
alternative label: analys av uttrycket i @sv
alternative label: analyserad i verket (uttryck) @sv
broader: versiota kuvaava teos
definition: Teos, joka kuvaa toisen teoksen ekspression rakennetta ja koostumusta. (RDA Registry)
definition: Verk som beskriver ett annat verks uttrycks struktur och uppbyggnad. @sv
in scheme: Metatietosanasto
preferred label: expression analysed in @en
preferred label: analys av versionen i @sv

teoksen kritiikki
type: Concept
source: RDA-termi
source: RDA-term @sv
created: 2024-12-18
modified: 2025-08-22
Vastavuoroinen suhde: kritiikki teoksesta
alternative label: critiqued in (work) @en
alternative label: kritisoitu teoksessa
alternative label: kritiserad i verket @sv
broader: teoksen arviointi
definition: Teos, joka on teoksen kriittinen arviointi. (RDA Registry)
definition: Verk som är en kritisk utvärdering av ett verk. @sv
in scheme: Metatietosanasto
preferred label: work critiqued by @en
preferred label: kritik av verket i @sv

aineiston kappale
type: Concept
source: RDA-termi
source: RDA-term @sv
created: 2024-12-18
modified: 2025-01-03
Vastavuoroinen suhde: kappaleen edustama aineisto
alternative label: manifestaation kappale
alternative label: exemplar av manifestation @sv
broader: aineistoon liittyvä kappale
definition: Manifestaation yksittäinen toteutuma. (RDA Registry)
definition: Ett enskilt förverkligande av en manifestation. @sv
in scheme: Metatietosanasto
preferred label: exemplar of manifestation @en
preferred label: exemplar av materialet @sv

metatietokuvailu teoksesta
type: Concept
source: RDA-termi
source: RDA-term @sv
created: 2024-12-18
modified: 2025-08-14
Vastavuoroinen suhde: teosta metatiedoilla kuvaileva teos
broader: kuvaus teoksesta
definition: Metatietoteoksen kuvailema teos. (RDA Registry)
definition: Verk som ett metadataverk beskriver. @sv
in scheme: Metatietosanasto
preferred label: metadata description of work @en
preferred label: metadatabeskrivning av verket @sv

peräkkäisversio
type: Concept
source: RDA-termi
source: RDA-term @sv
created: 2024-12-18
modified: 2025-08-16
Vastavuoroinen suhde: peräkkäisversio teoksesta
broader: muunnos laajennussuunnitelmassa
definition: Teos, joka on luotu muuttamalla teoksen laajennussuunnitelmaa päivittyvästä peräkkäiseksi. (RDA Registry)
definition: Verk som har skapats genom att ändra utvidgningsplanen för ett verk, från integrerande till successiv. @sv
in scheme: Metatietosanasto
preferred label: sequential version @en
preferred label: successiv version @sv

sanoitus teokseen
type: Concept
source: RDA-termi
source: RDA-term @sv
created: 2024-12-18
modified: 2025-08-19
Vastavuoroinen suhde: sanoitusteos
broader: teksti teokseen
definition: Musiikkiteos, jota tekstiteos täydentää. (RDA Registry)
definition: Musikverk som kompletteras av ett textverk. @sv
in scheme: Metatietosanasto
preferred label: lyrics for work @en
preferred label: sångtext till verket @sv
scope note: Sanoitus ei kata oopperan tai muun musiikillisen näyttämöteoksen tai oratorion tekstiä. (RDA Registry)
scope note: Omfattar inte text till opera, något annat musikaliskt sceniskt verk eller oratorium. @sv

yhdistys (rekisteröity)
type: Concept
source: Kansallinen RDA-termi
source: Nationell RDA-term @sv
created: 2016-01-08
modified: 2024-05-24
alternative label: kerho (rekisteröity)
alternative label: kilta (rekisteröity ainejärjestö)
alternative label: kirjallisuuspiiri (rekisteröity)
alternative label: metsästysseura (rekisteröity)
alternative label: nuorisoseura (rekisteröity)
alternative label: rekisteröity yhdistys
alternative label: salaseura (rekisteröity)
alternative label: seura (rekisteröity yhdistys)
alternative label: sukuseura (rekisteröity)
alternative label: gille (registrerad ämnesförening) @sv
alternative label: hemligt sällskap (registrerat) @sv
alternative label: idrottsförening (registrerad) @sv
alternative label: jaktförening (registrerad) @sv
alternative label: klubb (registrerad) @sv
alternative label: litteraturcirkel (registrerad) @sv
alternative label: registrerad förening @sv
alternative label: släktförening (registrerad) @sv
alternative label: sällskap (registrerad förening) @sv
alternative label: ungdomsförening (registrerad) @sv
definition: Rekisteröidyt yhdistykset, jotka noudattavat yhdistyslakia.
definition: Registrerade föreningar som följer föreningslagen. @sv
in scheme: Metatietosanasto
preferred label: förening (registrerad) @sv
related: järjestö
related: yhdistys (julkisoikeudellinen)

murhattu
type: Concept
source: AgRelOn, an Agent Relationship Ontology
source: Kansallinen RDA-termi
source: Nationell RDA-term @sv
created: 2024-12-18
modified: 2025-08-28
Vastavuoroinen suhde: murhaaja
alternative label: mördad @sv
broader: yhteisöön liittyvä henkilö
definition: Henkilö, jonka kuvailtava yhteisö on murhannut.
definition: Person som en beskriven institution har mördat. @sv
in scheme: Metatietosanasto
preferred label: has murder victim @en
preferred label: mordoffer @sv

säilytyskopio kappaleesta
type: Concept
source: RDA-termi
source: RDA-term @sv
created: 2024-12-18
modified: 2025-08-21
Vastavuoroinen suhde: kappaleen säilytyskopio
broader: näköispainos kappaleesta
definition: Kappale, jota on käytetty täsmällisen ja arkistokelpoisen jäljennöksen pohjana. Jäljennöksen valmistuksessa on käytetty arkistokelpoista materiaalia, esim. arkistopaperia. (RDA Registry)
definition: Exemplar som använts som grund för en exakt och arkivbeständig reproduktion. Vid reproduktionens tillverkning har arkivbeständigt material, t.ex. arkivpapper, använts. @sv
in scheme: Metatietosanasto
preferred label: preservation facsimile of item of @en
preferred label: arkivbeständig kopia av exemplaret @sv

kritiikki aineistosta
type: Concept
source: RDA-termi
source: RDA-term @sv
created: 2024-12-18
modified: 2025-07-04
Vastavuoroinen suhde: aineiston kritiikki
alternative label: kritiikki manifestaatiosta
alternative label: kritik av manifestationen @sv
broader: arviointi aineistosta
definition: Manifestaatio, johon kriittinen arviointi perustuu. (RDA Registry)
definition: Manifestation som en kritisk bedömning grundar sig på. @sv
in scheme: Metatietosanasto
preferred label: critique of manifestation @en
preferred label: kritik av materialet @sv

kappaleen uusintapainos
type: Concept
source: RDA-termi
source: RDA-term @sv
created: 2024-12-18
modified: 2025-07-03
Vastavuoroinen suhde: uusintapainos kappaleesta
broader: kappaleen jäljenne
definition: Manifestaatio, joka on uusintajulkaisu toista painettua manifestaatiota edustavasta kappaleesta. (RDA Registry)
definition: Manifestation som är en återpublikation av ett exemplar som representerar en annan tryckt manifestation. @sv
in scheme: Metatietosanasto
preferred label: reprinted as item @en
preferred label: nytryck av exemplaret @sv

uusintapainos kappaleesta
type: Concept
source: RDA-termi
source: RDA-term @sv
created: 2024-12-18
modified: 2025-08-23
Vastavuoroinen suhde: kappaleen uusintapainos
alternative label: reprint of (item) @en
broader: jäljenne kappaleesta
definition: Painettua manifestaatiota edustava kappale, jota käytetään manifestaation uusintajulkaisun pohjana. (RDA Registry)
definition: Exemplar som representerar en tryckt manifestation och som används som grund för ett återtryck av en manifestation. @sv
in scheme: Metatietosanasto
preferred label: reprint of item of @en
preferred label: nytryck av exemplaret @sv

teosta metatiedoilla kuvaileva teos
type: Concept
source: RDA-termi
source: RDA-term @sv
created: 2024-12-18
modified: 2025-08-23
Vastavuoroinen suhde: metatietokuvailu teoksesta
broader: teosta kuvaava teos
definition: Teos, joka on teoksen metatietoteos. (RDA Registry)
definition: Verk som är ett metadataverk för ett verk. @sv
in scheme: Metatietosanasto
preferred label: work described with metadata by @en
preferred label: verk som beskriver verket med metadata @sv

yhteisöön liittyvä toimija
type: Concept
source: RDA-termi
source: RDA-term @sv
created: 2024-12-18
modified: 2025-08-27
definition: Toimija, joka liittyy yhteisöön. (RDA Registry)
definition: Aktör som relaterar till en institution. @sv
in scheme: Metatietosanasto
narrower: yhteisöä sponsoroiva toimija
narrower: yhteisön perustanut toimija
preferred label: related agent of corporate body @en
preferred label: aktör relaterad till institutionen @sv

teoksen omistuksen kohde
type: Concept
source: RDA-termi
source: RDA-term @sv
created: 2024-12-18
modified: 2025-08-22
alternative label: teoksen omistuksen kohde (henkilö)
alternative label: dedikationsmottagare @sv
alternative label: verket dedicerat till (person) @sv
broader: teokseen liittyvä henkilö
definition: Henkilö, jolle teos on omistettu. (RDA Registry)
definition: Person som ett verk tillägnats. @sv
in scheme: Metatietosanasto
narrower: teos omistettu
preferred label: dedicatee person of work @en
preferred label: verket dedicerat till @sv

kustantaja
type: Concept
source: RDA-termi
source: RDA-term @sv
created: 2024-12-18
modified: 2025-07-04
alternative label: kustantaja (yhteisö)
alternative label: förläggare @sv
alternative label: utgivare (institution) @sv
broader: aineiston tekijä
definition: Yhteisö, joka on vastuussa julkaistun manifestaation kustantamisesta, julkaisemisesta tai ilmestymisestä. (RDA Registry)
definition: Institution som svarar för förläggande, utgivning eller utkommande av en publicerad manifestation. @sv
in scheme: Metatietosanasto
narrower: lähetyksestä vastaava yhteisö
preferred label: publisher corporate body @en
preferred label: utgivare @sv

kommentaari kappaleesta
type: Concept
source: RDA-termi
source: RDA-term @sv
created: 2024-12-18
modified: 2025-07-03
Vastavuoroinen suhde: kappaleen kommentaari
broader: kuvaus kappaleesta
definition: Selittävien tai kriittisten huomautusten joukon perustana käytetty kappale. (RDA Registry)
definition: Exemplar som använts som grund för en samling förklarande eller kritiska anmärkningar. @sv
in scheme: Metatietosanasto
preferred label: commentary on item @en
preferred label: kommentar till exemplaret @sv

uudelleenmiksaus
type: Concept
source: Kansallinen RDA-termi
source: Nationell RDA-term @sv
created: 2025-11-25
modified: 2025-12-06
Vastavuoroinen suhde: uudelleenmiksaus teoksesta
broader: mukaelma
definition: Teos, joka muokkaa toista teosta manipuloimalla, yhdistelemällä, sekoittamalla ja uudelleen tuottamalla aiemmin äänitettyjä ääniä.
definition: Verk som bearbetar ett annat verk genom att manipulera, kombinera, blanda och återproducera tidigare inspelade ljud. @sv
in scheme: Metatietosanasto
preferred label: remix @sv

uudelleenmiksaus teoksesta
type: Concept
source: Kansallinen RDA-termi
source: Nationell RDA-term @sv
created: 2025-11-25
modified: 2025-12-06
Vastavuoroinen suhde: uudelleenmiksaus
broader: mukaelma teoksesta
definition: Teos, jota on muokattu manipuloimalla, yhdistelemällä, sekoittamalla ja uudelleen tuottamalla aiemmin äänitettyjä ääniä.
definition: Verk som bearbetats genom att manipulera, kombinera, blanda och återproducera tidigare inspelade ljud. @sv
in scheme: Metatietosanasto
preferred label: remix av verket @sv

romaanimukaelma teoksesta
type: Concept
source: RDA-termi
source: RDA-term @sv
created: 2016-01-08
modified: 2025-08-19
Vastavuoroinen suhde: romaanimukaelma
alternative label: romaanimukaelman perustana
alternative label: romaanimukaelman perustana (teos)
alternative label: romanbearbetning baserad på @sv
alternative label: romanbearbetning baserad på (verk) @sv
broader: mukaelma teoksesta
definition: Teos, joka on sovitettu romaaniksi. (RDA Registry)
definition: Verk som har bearbetats till en roman. @sv
in scheme: Metatietosanasto
preferred label: novelization of work @en
preferred label: romanbearbetning av verket @sv

kustantaja
type: Concept
source: RDA-termi
source: RDA-term @sv
created: 2016-01-08
modified: 2025-07-04
alternative label: publisher @en
alternative label: kustantaja (suhde)
alternative label: kustantaja (toimija)
alternative label: förlag @sv
alternative label: förläggare @sv
alternative label: utgivare (aktör) @sv
alternative label: utgivare (relation) @sv
broader: aineiston tekijä
definition: Toimija, joka on vastuussa julkaistun manifestaation kustantamisesta, julkaisemisesta tai ilmestymisestä. (RDA Registry)
definition: Aktör som svarar för förläggande, utgivning eller utkommande av en publicerad manifestation. @sv
in scheme: Metatietosanasto
narrower: lähetyksestä vastaava toimija
preferred label: publisher agent @en
preferred label: utgivare @sv

arkkitehti
type: Concept
source: RDA-termi
source: RDA-term @sv
created: 2016-01-08
modified: 2025-04-16
alternative label: architect @en
alternative label: arkkitehti (suhde)
alternative label: arkkitehti (toimija)
alternative label: arkitekt (aktör) @sv
alternative label: arkitekt (relation) @sv
broader: teoksen tekijä
definition: Toimija, joka on vastuussa arkkitehtisuunnitelman luomisesta, mukaan lukien kuvaesityksestä, jonka tarkoitus on näyttää, miltä rakennus tai muu rakennelma näyttää valmiina. (RDA Registry)
definition: Aktör som ansvarar för skapandet av en arkitektplan, inklusive en bildpresentation över hur en byggnad eller en annan konstruktion ska se ut när den är färdig. @sv
in scheme: Metatietosanasto
narrower: maisema-arkkitehti
preferred label: architect agent @en
preferred label: arkitekt @sv

yhteisön henkilöjäsen
type: Concept
source: RDA-termi
source: RDA-term @sv
created: 2016-01-08
modified: 2025-08-27
alternative label: affiliation of @en
alternative label: member @en
alternative label: medlem @sv
broader: yhteisöön liittyvä henkilö
definition: Henkilö, joka on yhteisön jäsen. (RDA Registry)
definition: Person som är medlem i en institution. @sv
in scheme: Metatietosanasto
narrower: työntekijä
preferred label: person member of corporate body @en
preferred label: personmedlem i institution @sv

jakelija
type: Concept
source: RDA-termi
source: RDA-term @sv
created: 2016-01-08
modified: 2025-07-01
alternative label: distributor @en
alternative label: jakaja
alternative label: jakelija (toimija)
alternative label: distributör (aktör) @sv
broader: aineistoon liittyvä toimija
definition: Toimija, joka on vastuussa julkaistun manifestaation jakelusta. (RDA Registry)
definition: Aktör som svarar för distributionen av en publicerad manifestation. @sv
in scheme: Metatietosanasto
narrower: elokuvan jakelija
preferred label: distributor agent @en
preferred label: distributör @sv

jatkoa teokselle
type: Concept
source: RDA-termi
source: RDA-term @sv
created: 2016-01-08
modified: 2025-07-01
Vastavuoroinen suhde: seuraaja
alternative label: edeltäjä
alternative label: edeltäjä (teos)
alternative label: föregående (verk) @sv
broader: edeltävä teos
definition: Teos, joka on valmis diakroninen teos, jonka sisältöä jatkaa toinen diakroninen teoso. (RDA Registry)
definition: Verk som är ett färdigt diakroniskt verk, vars innehåll ett annat diakroniskt verk fortsätter. @sv
in scheme: Metatietosanasto
preferred label: continuation of work @en
preferred label: fortsättning på verket @sv
scope note: Tämä elementti soveltuu yleensä peräkkäisesti ilmestyvään teokseen. (RDA Registry)
scope note: Detta element lämpar sig vanligen för successivt utkommande verk. @sv

valmistaja
type: Concept
source: RDA-termi
source: RDA-term @sv
created: 2016-01-08
modified: 2025-08-23
alternative label: manufacturer @en
alternative label: valmistaja (toimija)
alternative label: tillverkare (aktör) @sv
broader: aineiston tekijä
definition: Toimija, joka on vastuussa julkaistun manifestaation painamisesta, monistamisesta, kirjasinten valamisesta tai muusta valmistustavasta. (RDA Registry)
definition: Aktör som svarar för tryckningen, mångfaldigandet, gjutandet av typer eller något annat framställningssätt för en utgiven manifestation. @sv
in scheme: Metatietosanasto
narrower: pistekirjoituksen tekijä
narrower: painaja
preferred label: manufacturer agent @en
preferred label: tillverkare @sv

ääniteknikko
type: Concept
source: RDA-termi
source: RDA-term @sv
created: 2016-01-08
modified: 2025-08-27
alternative label: audio engineer @en
alternative label: ääniteknikko (toimija)
alternative label: ljudtekniker (aktör) @sv
broader: esitykseen osallinen toimija
definition: Toimija, joka osallistuu ekspression tekemiseen huolehtimalla äänen teknisistä näkökohdista äänitys-, miksaus- ja äänentoistoprosessien aikana. (RDA Registry)
definition: Aktör som deltar i utförandet av ett uttryck, genom att sköta de tekniska aspekterna på ljud under inspelnings-, mixnings- och ljudåtergivningsprocesser. @sv
in scheme: Metatietosanasto
narrower: miksaaja
narrower: äänittäjä
preferred label: audio engineer agent @en
preferred label: ljudtekniker @sv

johtaja
type: Concept
source: RDA-termi
source: RDA-term @sv
created: 2016-01-08
modified: 2025-07-01
alternative label: conductor @en
alternative label: joht. (johtaja)
alternative label: johtaja (suhde)
alternative label: johtaja (toimija)
alternative label: dir. (dirigent) @sv
alternative label: dirigent (aktör) @sv
alternative label: dirigent (relation) @sv
broader: esittäjä
definition: Toimija, joka on esittäjä, joka osallistuu musiikkiteoksen ekspression tekemiseen johtamalla esiintyjäryhmää musiikki- tai näytelmäesityksessä. (RDA Registry)
definition: Aktör som är en framförare som deltar i utförandet av ett musikverks uttryck, genom att dirigera en uppträdande grupp i en musik- eller dramaföreställning. @sv
in scheme: Metatietosanasto
narrower: kapellimestari
narrower: kuoronjohtaja
preferred label: conductor agent @en
preferred label: dirigent @sv

aiempi omistaja
type: Concept
source: RDA-termi
source: RDA-term @sv
created: 2016-12-02
modified: 2025-01-03
alternative label: former owner @en
alternative label: aiempi omistaja (toimija)
alternative label: aikaisempi omistaja
alternative label: tidigare ägare (aktör) @sv
broader: omistaja
definition: Toimija, joka on aiemmin laillisesti omistanut kappaleen. (RDA Registry)
definition: Aktör som tidigare juridiskt ägt ett exemplar. @sv
in scheme: Metatietosanasto
narrower: lahjoittaja
narrower: myyjä
preferred label: former owner agent @en
preferred label: tidigare ägare @sv

jäljitelmä
type: Concept
source: RDA-termi
source: RDA-term @sv
created: 2018-09-07
modified: 2025-07-02
Vastavuoroinen suhde: jäljitelmä teoksesta
alternative label: jäljitelmä (teos)
alternative label: imitation (verk) @sv
broader: muunnos tyylissä
definition: Teos, joka jäljittelee toisen teoksen tyyliä tai sisältöä. (RDA Registry)
definition: Verk som imiterar ett annat verks stil eller innehåll. @sv
in scheme: Metatietosanasto
narrower: parodia
preferred label: imitated as work @en
preferred label: imitation @sv

psykoterapeutti
type: Concept
source: Kansallinen RDA-termi
source: YSO-termi
source: ALLFO-term @sv
source: Nationell RDA-term @sv
created: 2018-11-01
modified: 2024-08-27
alternative label: psychotherapists @en
alternative label: psykoterapeutit
alternative label: psykoterapeuter @sv
in scheme: Metatietosanasto
narrower: perheterapeutti
narrower: psykoanalyytikko
narrower: logoterapeutti
preferred label: psychotherapist @en
preferred label: psykoterapeut @sv

mekaanikko
type: Concept
source: Kansallinen RDA-termi
source: YSO-termi
source: ALLFO-term @sv
source: Nationell RDA-term @sv
created: 2018-11-01
modified: 2024-08-27
alternative label: mechanics @en
alternative label: mekaanikot
in scheme: Metatietosanasto
narrower: lentokonemekaanikko
narrower: automekaanikko
narrower: laivamekaanikko
preferred label: mechanic @en
preferred label: mekaniker @sv

toimihenkilö
type: Concept
source: Kansallinen RDA-termi
source: YSO-termi
source: ALLFO-term @sv
source: Nationell RDA-term @sv
created: 2018-11-01
modified: 2024-08-27
alternative label: white-collar workers @en
alternative label: toimihenkilöt
alternative label: befattningshavare @sv
alternative label: tjänstemän @sv
in scheme: Metatietosanasto
narrower: teollisuustoimihenkilö
narrower: pankkitoimihenkilö
narrower: tekninen toimihenkilö
preferred label: white-collar worker @en
preferred label: tjänsteman (privatanställda) @sv

näköispainos (manifestaatio)
type: Concept
source: RDA-termi
source: RDA-term @sv
created: 2016-01-08
modified: 2026-06-06
Vastavuoroinen suhde: näköispainos manifestaatiosta
alternative label: facimile (manifestation) @en
alternative label: aineiston näköispainos
alternative label: manifestaation näköispainos
alternative label: faksimil av manifestation @sv
alternative label: faksimil av materialet @sv
alternative label: faksimilupplaga (manifestation) @sv
alternative label: faksimilupplaga av materialet @sv
broader: aineiston jäljenne
definition: Manifestaatio, joka jäljentää tarkalleen toisen manifestaation. (RDA Registry)
definition: Manifestation som exakt reproducerar en annan manifestation. @sv
in scheme: Metatietosanasto
narrower: säilytyskopio (manifestaatio)
preferred label: facsimile of manifestation @en
preferred label: faksimil (manifestation) @sv

piirtäjä
type: Concept
source: Kansallinen RDA-termi
source: YSO-termi
source: ALLFO-term @sv
source: Nationell RDA-term @sv
created: 2018-11-01
modified: 2024-08-27
alternative label: drawers @en
alternative label: piirtäjät
alternative label: ritare @sv
broader: kuvataiteilija
in scheme: Metatietosanasto
narrower: pilapiirtäjä
narrower: sarjakuvataiteilija
preferred label: drawer (visual artist) @en
preferred label: tecknare @sv

sairaanhoitaja
type: Concept
source: Kansallinen RDA-termi
source: YSO-termi
source: ALLFO-term @sv
source: Nationell RDA-term @sv
created: 2018-11-01
modified: 2024-08-27
alternative label: sairaanhoitaja (ammatti)
alternative label: sjukskötare (yrke) @sv
in scheme: Metatietosanasto
narrower: ensihoitaja
narrower: psykiatrian sairaanhoitaja
narrower: erikoissairaanhoitaja
preferred label: nurse @en
preferred label: sjukskötare @sv

säveltäjä
type: Concept
source: Kansallinen RDA-termi
source: YSO-termi
source: ALLFO-term @sv
source: Nationell RDA-term @sv
created: 2018-11-01
modified: 2024-08-27
alternative label: säveltäjä (ammatti)
alternative label: kompositör (yrke) @sv
broader: muusikko
in scheme: Metatietosanasto
narrower: laulaja-lauluntekijä
narrower: lauluntekijä
preferred label: composer @en
preferred label: kompositör @sv

sirkustaiteilija
type: Concept
source: Kansallinen RDA-termi
source: YSO-termi
source: ALLFO-term @sv
source: Nationell RDA-term @sv
created: 2018-11-01
modified: 2024-08-27
alternative label: circus artists @en
alternative label: sirkustaiteilijat
alternative label: cirkusartister @sv
broader: näyttämötaiteilija
in scheme: Metatietosanasto
narrower: klovni
narrower: jonglööri
preferred label: circus artist @en
preferred label: cirkusartist @sv

kustantaja
type: Concept
source: Kansallinen RDA-termi
source: YSO-termi
source: ALLFO-term @sv
source: Nationell RDA-term @sv
created: 2018-11-01
modified: 2024-08-27
alternative label: kustantaja (ammatti)
alternative label: utgivare (yrke) @sv
in scheme: Metatietosanasto
narrower: musiikkikustantaja
narrower: lehtikustantaja
narrower: pienkustantaja
preferred label: publisher @en
preferred label: utgivare @sv

rovasti
type: Concept
source: Kansallinen RDA-termi
source: YSO-termi
source: ALLFO-term @sv
source: Nationell RDA-term @sv
created: 2018-11-01
modified: 2024-08-27
alternative label: rovasti (ammatti)
alternative label: prost (yrke) @sv
broader: pappi
in scheme: Metatietosanasto
narrower: lääninrovasti
narrower: tuomiorovasti
preferred label: prost @sv

postityöntekijä
type: Concept
source: Kansallinen RDA-termi
source: YSO-termi
source: ALLFO-term @sv
source: Nationell RDA-term @sv
created: 2018-11-01
modified: 2024-08-27
alternative label: postal workers @en
alternative label: postimiehet
alternative label: postityöntekijät
alternative label: postanställda @sv
alternative label: postarbetare @sv
broader: työntekijä
in scheme: Metatietosanasto
narrower: postinjakaja
narrower: postivirkamies
preferred label: postal worker @en
preferred label: postanställd @sv

arkkitehti
type: Concept
source: Kansallinen RDA-termi
source: YSO-termi
source: ALLFO-term @sv
source: Nationell RDA-term @sv
created: 2018-11-01
modified: 2024-08-27
alternative label: arkkitehti (ammatti)
alternative label: arkitekt (yrke) @sv
in scheme: Metatietosanasto
narrower: aluearkkitehti
narrower: maisema-arkkitehti
narrower: puutarha-arkkitehti
preferred label: architect @en
preferred label: arkitekt @sv

kapellimestari
type: Concept
source: Kansallinen RDA-termi
source: YSO-termi
source: ALLFO-term @sv
source: Nationell RDA-term @sv
created: 2018-11-01
modified: 2024-08-27
alternative label: kapellimestari (ammatti)
alternative label: kapellmästare (yrke) @sv
alternative label: orkesterdirigent @sv
broader: muusikko
broader: esittäjä
in scheme: Metatietosanasto
narrower: sotilaskapellimestari
preferred label: conductor (music) @en
preferred label: kapellmästare @sv

puheenjohtaja
type: Concept
source: Kansallinen RDA-termi
source: YSO-termi
source: ALLFO-term @sv
source: Nationell RDA-term @sv
created: 2018-11-01
modified: 2024-08-27
alternative label: chairmen @en
alternative label: chairpersons @en
alternative label: puheenjohtajat
in scheme: Metatietosanasto
narrower: hallituksen puheenjohtaja
narrower: kunnanhallituksen puheenjohtaja
narrower: kaupunginhallituksen puheenjohtaja
preferred label: chairperson @en
preferred label: ordförande @sv

viihdetaiteilija
type: Concept
source: Kansallinen RDA-termi
source: YSO-termi
source: ALLFO-term @sv
source: Nationell RDA-term @sv
created: 2018-11-01
modified: 2024-08-27
alternative label: entertainers @en
alternative label: artistit
alternative label: estraditaiteilijat
alternative label: viihdetaiteilijat
alternative label: artister @sv
preferred label: entertainer @en
alternative label: estradartister @sv
alternative label: underhållare @sv
alternative label: underhållningsartister @sv
broader: taiteilija
in scheme: Metatietosanasto
narrower: drag-artisti
narrower: minstrel show -esiintyjä
preferred label: artist @sv

sanoittaja
type: Concept
source: Kansallinen RDA-termi
source: YSO-termi
source: ALLFO-term @sv
source: Nationell RDA-term @sv
created: 2018-11-01
modified: 2024-08-27
alternative label: sanoittaja (ammatti)
alternative label: textförfattare (yrke) @sv
broader: kirjailija
in scheme: Metatietosanasto
narrower: libretisti
narrower: lauluntekijä
preferred label: lyricist @en
preferred label: textförfattare @sv

uskonnollinen johtaja
type: Concept
source: Kansallinen RDA-termi
source: YSO-termi
source: ALLFO-term @sv
source: Nationell RDA-term @sv
created: 2018-11-01
modified: 2024-08-27
alternative label: religious leaders @en
alternative label: hengelliset johtajat
alternative label: uskonnolliset johtajat
alternative label: uskonnolliset vaikuttajat
alternative label: andliga ledare @sv
alternative label: religiösa ledare @sv
alternative label: religiösa påverkare @sv
broader: johtaja
in scheme: Metatietosanasto
narrower: imaami
narrower: paavi
preferred label: religious leader @en
preferred label: religiös ledare @sv

ompelija
type: Concept
source: Kansallinen RDA-termi
source: YSO-termi
source: ALLFO-term @sv
source: Nationell RDA-term @sv
created: 2018-11-01
modified: 2024-08-27
alternative label: sewers and seamstresses @en
alternative label: ompelijat
alternative label: sömmare @sv
alternative label: sömmerskor @sv
broader: käsityöläinen
in scheme: Metatietosanasto
narrower: pukuompelija
narrower: turkisompelija
preferred label: sewer/seamstress @en
preferred label: sömmerska @sv

yhteenveto
type: Concept
source: RDA-termi
source: RDA-term @sv
created: 2018-11-13
modified: 2025-08-27
Vastavuoroinen suhde: yhteenveto teoksesta
alternative label: summarized as work @en
alternative label: yhteenveto (teos)
alternative label: sammandrag @sv
alternative label: sammanfattning (verk) @sv
broader: teosta kuvaava teos
definition: Teos, joka on teoksen lyhyt kuvaus. (RDA Registry)
definition: Verk som är en kort beskrivning av ett verk. @sv
in scheme: Metatietosanasto
narrower: abstrakti
preferred label: summary @en
preferred label: sammanfattning @sv

jäljitelmä teoksesta
type: Concept
source: RDA-termi
source: RDA-term @sv
created: 2018-12-08
modified: 2025-07-02
Vastavuoroinen suhde: jäljitelmä
alternative label: jäljitelmän perustana
alternative label: jäljitelmän perustana (teos)
alternative label: imitation baserad på @sv
alternative label: imitation baserad på (verk) @sv
broader: muunnos tyylissä teoksesta
definition: Teos, jonka tyyliä tai sisältöä johdannaisteos jäljittelee. (RDA Registry)
definition: Verk vars stil eller innehåll ett härlett verk imiterar. @sv
in scheme: Metatietosanasto
narrower: parodia teoksesta
preferred label: imitation of work @en
preferred label: imitation av verket @sv

numero teoksessa
type: Concept
source: RDA-termi
source: RDA-term @sv
created: 2018-12-15
modified: 2025-08-15
Vastavuoroinen suhde: numero
alternative label: in series @en
alternative label: sisältyy sarjaan
alternative label: ingår i serie @sv
alternative label: nummer av verket @sv
broader: innoittaja
definition: Teos, joka on peräkkäisesti ilmestyvä aggregoiva teos, joka vaikuttaa staattisen teoksen yleiseen toimituslinjaan, toiminta-alaan ja tyyliin. (RDA Registry)
definition: Verk som är ett successivt utkommande aggregerande verk, som påverkar den redaktionella linjen, verksamhetsfältet och stilen i ett statiskt verk. @sv
in scheme: Metatietosanasto
narrower: erikoisnumero teokselle
preferred label: issue of @en
preferred label: nummer i verket @sv
scope note: Staattisen teoksen numero voi olla yksittäisteos tai aggregoiva teos. (RDA Registry)
scope note: Ett nummer av ett statiskt verk kan vara ett enskilt verk eller ett aggregerande verk. @sv

yhteenveto teoksesta
type: Concept
source: RDA-termi
source: RDA-term @sv
created: 2018-12-15
modified: 2025-08-27
Vastavuoroinen suhde: yhteenveto
alternative label: summary of work @en
alternative label: yhteenvedon perustana
alternative label: yhteenvedon perustana (teos)
alternative label: sammandrag av verket @sv
alternative label: sammanfattning baserad på @sv
alternative label: sammanfattning baserad på (verk) @sv
broader: kuvaus teoksesta
definition: Teos, jota teos kuvaa lyhyesti. (RDA Registry)
definition: Verk som ett verk kort sammanfattar. @sv
in scheme: Metatietosanasto
narrower: abstrakti teoksesta
preferred label: summary of @en
preferred label: sammanfattning av verket @sv

numero
type: Concept
source: RDA-termi
source: RDA-term @sv
created: 2018-12-18
modified: 2025-08-15
Vastavuoroinen suhde: numero teoksessa
alternative label: series container of @en
alternative label: sarjan osa
alternative label: sarjan osa (teos)
alternative label: seriedel @sv
alternative label: seriedel (verk) @sv
broader: innoitus teokselle
definition: Teos, joka on staattinen teos, johon on vaikuttanut peräkkäin ilmestyvän aggregoivan teoksen yleinen toimituslinja, toiminta-ala ja tyyli. (RDA Registry)
definition: Verk som är ett statiskt verk, som påverkats av den redaktionella linjen, verksamhetsfältet och stilen i ett successivt utkommande aggregerande verk. @sv
in scheme: Metatietosanasto
narrower: erikoisnumero
preferred label: issue @en
preferred label: nummer @sv
scope note: Staattisen teoksen numero voi olla yksittäisteos tai aggregoiva teos. (RDA Registry)
scope note: Ett nummer av ett statiskt verk kan vara ett enskilt verk eller ett aggregerande verk. @sv

jäljitelmä versiosta
type: Concept
source: RDA-termi
source: RDA-term @sv
created: 2019-01-05
modified: 2025-07-02
Vastavuoroinen suhde: jäljitelmä
alternative label: jäljitelmä ekspressiosta
alternative label: jäljitelmän perustana
alternative label: jäljitelmän perustana (ekspressio)
alternative label: imitation av uttrycket @sv
alternative label: imitation baserad på @sv
alternative label: imitation baserad på (uttryck) @sv
broader: ekspression perustana
definition: Teoksen ekspressio, jonka tyyliä tai sisältöä johdannaisteos jäljittelee. (RDA Registry)
definition: Uttryck av verk vars stil eller innehåll ett härlett verk imiterar. @sv
in scheme: Metatietosanasto
narrower: parodia versiosta
preferred label: imitation of expression @en
preferred label: imitation av versionen @sv

käännöksen perusta
type: Concept
source: RDA-termi
source: RDA-term @sv
created: 2019-01-05
modified: 2025-07-04
Vastavuoroinen suhde: käännös
alternative label: käännöksen perustana
broader: lähdeversio
definition: Teoksen ekspressio, joka on käännetty, eli teksti on ilmaistu alkuperäisteoksesta poikkeavalla kielellä. (RDA Registry)
definition: Uttryck av verk som har översatts, det vill säga texten har förmedlats på ett språk som avviker från originalverkets. @sv
in scheme: Metatietosanasto
narrower: dubatun version perusta
preferred label: translation of @en
preferred label: översättning baserad på @sv

yhteisövastaaja
type: Concept
source: RDA-termi
source: RDA-term @sv
created: 2019-02-27
modified: 2025-08-27
broader: teoksen tekijä
definition: Yhteisö, joka on syytettynä rikosprosessissa tai jota vastaan on nostettu kanne. (RDA Registry)
definition: Institution som är åtalad i en straffprocess eller mot vilken talan väckts. @sv
in scheme: Metatietosanasto
narrower: yhteisövastaaja siviilioikeudessa
narrower: yhteisövastaaja rikosoikeudessa
preferred label: defendant corporate body @en
preferred label: institution som svarande @sv

henkilövastaaja
type: Concept
source: RDA-termi
source: RDA-term @sv
created: 2019-02-27
modified: 2025-06-14
alternative label: person som tilltalad @sv
alternative label: person som åtalad @sv
broader: teoksen tekijä
definition: Henkilö, joka on syytettynä rikosprosessissa tai jota vastaan on nostettu kanne. (RDA Registry)
definition: Person som är åtalad i en straffprocess eller mot vilken talan väckts. @sv
in scheme: Metatietosanasto
narrower: henkilövastaaja siviilioikeudessa
narrower: henkilövastaaja rikosoikeudessa
preferred label: defendant person @en
preferred label: person som svarande @sv

kaupunki
type: Concept
source: Kansallinen RDA-termi
source: Nationell RDA-term @sv
created: 2016-01-08
modified: 2024-05-24
alternative label: kauppala
alternative label: köping @sv
definition: Suomessa nykyisin kunta, joka on ottanut käyttöön kaupunki-nimityksen. Aiemmin kaupungit perustettiin hallitsijan päätöksellä, Suomen itsenäistyttyä asetuksella (Wikipedia). Käytetään myös entisistä kauppaloista, joista myöhemmin on tullut kaupunkeja.
definition: I Finland numera kommun som tagit i bruk benämningen stad. Tidigare grundades städer genom regenters beslut, och efter att Finland blev självständigt genom förordning. Används även om tidigare köpingar, som senare blivit städer. @sv
example: Varkaus (kaupunki)
example: Nykarleby (stad) @sv
in scheme: Metatietosanasto
preferred label: stad @sv
related: kunta (hallintoalue)
related: seutukunta
related: kunta

neuvoja
type: Concept
source: Kansallinen RDA-termi
source: Nationell RDA-term @sv
created: 2019-07-12
modified: 2025-11-04
in scheme: Metatietosanasto
narrower: asiakasneuvoja
narrower: tiedotusneuvoja
narrower: metsätalousneuvoja
preferred label: rådgivare @sv

käännös
type: Concept
source: RDA-termi
source: RDA-term @sv
created: 2020-03-07
modified: 2025-07-04
Vastavuoroinen suhde: käännöksen perusta
alternative label: käännös (ekspressio)
alternative label: översättning (uttryck) @sv
broader: johdannaisversio
definition: Teoksen ekspressio, joka kääntää teoksen toisen ekspression tekstin. (RDA Registry)
definition: Uttryck av verk som översätter texten i ett annat uttryck av ett verk. @sv
in scheme: Metatietosanasto
narrower: dubattu versio
preferred label: translated as @en
preferred label: översättning @sv

jäljitelmä
type: Concept
source: RDA-termi
source: RDA-term @sv
created: 2020-03-07
modified: 2025-07-02
Vastavuoroinen suhde: jäljitelmä versiosta
alternative label: jäljitelmä (ekspressio)
alternative label: imitation (uttryck) @sv
broader: johdannaisteoksen versio
definition: Teoksen ekspressio, joka jäljittelee toisen teoksen ekspression tyyliä tai sisältöä. (RDA Registry)
definition: Uttryck av verk, som imiterar ett annat verks uttrycks stil eller innehåll. @sv
in scheme: Metatietosanasto
narrower: parodia
preferred label: imitated as expression @en
preferred label: imitation @sv

tallenteella myös
type: Concept
source: RDA-termi
source: RDA-term @sv
created: 2020-04-17
modified: 2025-08-21
alternative label: issued with @en
alternative label: ilmestynyt yhdessä
alternative label: julkaistu yhdessä
alternative label: utgiven tillsammans med @sv
broader: mukana ilmestynyt aineisto
definition: Manifestaatio, joka on ilmestynyt samalla tallenteella kuin kuvailun kohteena oleva manifestaatio. (RDA Registry)
definition: Manifestation som har utkommit på samma bärare som manifestationen som är föremål för beskrivning. @sv
in scheme: Metatietosanasto
narrower: levyllä myös
narrower: filmillä myös
preferred label: on carrier unit with @en
preferred label: på bäraren även @sv

näköispainos manifestaatiosta
type: Concept
source: RDA-termi
source: RDA-term @sv
created: 2020-04-17
modified: 2026-06-06
Vastavuoroinen suhde: näköispainos (manifestaatio)
alternative label: näköispainoksen alkuperä
alternative label: näköispainos aineistosta
alternative label: faksimil av materialet @sv
alternative label: faksimilupplaga av @sv
broader: jäljenne aineistosta
definition: Manifestaatio, jota on käytetty täsmällisen jäljennöksen perustana. (RDA Registry)
definition: Manifestation som har använts som grund för en exakt reproduktion. @sv
in scheme: Metatietosanasto
narrower: säilytyskopio manifestaatiosta
preferred label: facsimile of manifestation of @en
preferred label: faksimil av manifestationen @sv

liitteenä aineistossa
type: Concept
source: RDA-termi
source: RDA-term @sv
created: 2020-04-17
modified: 2025-07-05
Vastavuoroinen suhde: liite
alternative label: liitteenä manifestaatiossa
alternative label: bilaga till manifestationen @sv
broader: osa aineistoa
definition: Manifestaatio, joka sisältää toisen manifestaation erillisenä liitteenä. (RDA Registry)
definition: Manifestation som innehåller en annan manifestation som skild bilaga. @sv
in scheme: Metatietosanasto
narrower: liitteenä aineistossa
preferred label: inserted in @en
preferred label: bilaga till materialet @sv
scope note: Liite käsittää esim. kartan tai kuvitus- tai mainosliitteen, joka ei ole kiinteä osa muuta manifestaatiota. (RDA Registry)
scope note: Innefattar t.ex. en kart-, illustrations- eller reklambilaga, som inte är en fast del av den övriga manifestationen. @sv

suvun henkilöjäsen
type: Concept
source: RDA-termi
source: RDA-term @sv
created: 2020-05-04
modified: 2025-03-19
alternative label: family member @en
alternative label: suvun jäsen
alternative label: släktmedlem @sv
broader: sukuun liittyvä henkilö
definition: Henkilö, joka on suvun jäsen. (RDA Registry)
definition: Person som hör till en släkt. @sv
in scheme: Metatietosanasto
narrower: suvun kantahenkilö
narrower: suvun tunnettu jäsen
preferred label: person member of family @en
preferred label: personmedlem i släkten @sv

toimihenkilö
type: Concept
source: RDA-termi
source: RDA-term @sv
created: 2020-05-05
modified: 2025-08-23
alternative label: virkamies
alternative label: tjänsteman @sv
broader: yhteisöön liittyvä henkilö
definition: Henkilö, jolla on toimi tai virka yhteisössä. (RDA Registry)
definition: Person som har en anställning eller tjänst i en institution. @sv
in scheme: Metatietosanasto
narrower: pääjohtaja
narrower: edunvalvoja
preferred label: officer @en
preferred label: tjänsteperson @sv

henkilöjäsen suvussa
type: Concept
source: RDA-termi
source: RDA-term @sv
created: 2020-05-06
modified: 2025-01-11
alternative label: family @en
alternative label: suku
alternative label: släkt @sv
broader: henkilöön liittyvä suku
definition: Suku, johon henkilö kuuluu. (RDA Registry)
definition: Släkt till vilken en person hör. @sv
in scheme: Metatietosanasto
narrower: henkilöstä polveutuva suku
narrower: tunnettu jäsen suvussa
preferred label: person member of family of @en
preferred label: personmedlem i släkten @sv

toimihenkilönä yhteisössä
type: Concept
source: RDA-termi
source: RDA-term @sv
created: 2020-05-07
modified: 2025-08-23
alternative label: virkamiehenä yhteisössä
alternative label: tjänsteman vid institutionen @sv
broader: henkilöön liittyvä yhteisö
definition: Yhteisö, jota henkilö johtaa tai jossa hän on viranhaltijana. (RDA Registry)
definition: Institution som en person leder eller i vilken personen är tjänsteinnehavare. @sv
in scheme: Metatietosanasto
narrower: pääjohtajana yhteisössä
narrower: edunvalvojana yhteisössä
preferred label: officer of @en
preferred label: tjänsteperson vid institutionen @sv

yhteisön seuraaja
type: Concept
source: RDA-termi
source: RDA-term @sv
created: 2020-05-07
modified: 2025-08-27
alternative label: successor @en
alternative label: seuraaja
alternative label: efterföljare @sv
broader: yhteisöön liittyvä yhteisö
definition: Yhteisö, joka jatkaa tai seuraa toista yhteisöä. (RDA Registry)
definition: Institution som fortsätter eller följer på en annan institution. @sv
in scheme: Metatietosanasto
narrower: yhdistymisestä muodostunut yhteisö
narrower: jakautumisesta muodostunut yhteisö
preferred label: successor of corporate body @en
preferred label: efterföljande institution @sv

yhteisön edeltäjä
type: Concept
source: RDA-termi
source: RDA-term @sv
created: 2020-05-07
modified: 2025-08-27
alternative label: predecessor @en
alternative label: edeltäjä
alternative label: föregående @sv
broader: yhteisöön liittyvä yhteisö
definition: Yhteisö, joka edelsi toista yhteisöä. (RDA Registry)
definition: Institution som föregick en annan institution. @sv
in scheme: Metatietosanasto
narrower: yhdistynyt yhteisö
narrower: jakautunut yhteisö
preferred label: predecessor of corporate body @en
preferred label: föregående institution @sv

omistaja
type: Concept
source: RDA-termi
source: RDA-term @sv
created: 2020-05-14
modified: 2025-08-15
alternative label: owner @en
alternative label: omistaja (toimija)
alternative label: ägare (aktör) @sv
broader: kappaleeseen liittyvä toimija
definition: Toimija, jolla on kappaleen laillinen omistusoikeus. (RDA Registry)
definition: Aktör som har juridisk äganderätt till ett exemplar. @sv
in scheme: Metatietosanasto
narrower: aiempi omistaja
narrower: nykyinen omistaja
preferred label: owner agent @en
preferred label: ägare @sv

setä
type: Concept
source: AgRelOn, an Agent Relationship Ontology
source: Kansallinen RDA-termi
source: Nationell RDA-term @sv
created: 2021-01-27
modified: 2025-08-28
alternative label: isän veli
broader: vanhemman sisarus
definition: Kuvailtavan henkilön isän veli.
definition: Bror till en beskriven persons fader. @sv
in scheme: Metatietosanasto
preferred label: has uncle @en
preferred label: farbror @sv
related: täti
related: eno

komitea
type: Concept
source: Kansallinen RDA-termi
source: Nationell RDA-term @sv
created: 2021-04-20
modified: 2024-05-24
broader: toimielin
definition: Ryhmä, jolle on asetettu tehtäväksi tutkia jotain asiaa ja jonka työn tuloksena on mietintö (Kielitoimiston sanakirja).
definition: Grupp som har getts i uppgift att undersöka något ärende och vars arbete resulterar i ett betänkande. @sv
in scheme: Metatietosanasto
preferred label: kommitté @sv
related: toimikunta
related: lautakunta

toimikunta
type: Concept
source: Kansallinen RDA-termi
source: Nationell RDA-term @sv
created: 2021-04-20
modified: 2024-05-24
alternative label: komissio
alternative label: suunnittelukunta
broader: toimielin
definition: Määrätehtävään asetettu elin (Kielitoimiston sanakirja), jota kutsutaan toimikunnaksi.
definition: Organ tillsatt för en bestämd uppgift. @sv
in scheme: Metatietosanasto
preferred label: kommission @sv
related: komitea
related: lautakunta

lautakunta
type: Concept
source: Kansallinen RDA-termi
source: Nationell RDA-term @sv
created: 2021-04-20
modified: 2024-05-24
alternative label: kunnallinen lautakunta
alternative label: metsälautakunta
alternative label: kommunalnämnd @sv
alternative label: skogsnämnd @sv
broader: toimielin
definition: Julkista tehtävää varten asetettu monihenkinen elin (Kielitoimiston sanakirja), jota kutsutaan lautakunnaksi.
definition: Organ bestående av flera personer och utsett för en offentlig uppgift. @sv
in scheme: Metatietosanasto
preferred label: nämnd @sv
related: komitea
related: toimikunta

kappaleen näköispainos
type: Concept
source: RDA-termi
source: RDA-term @sv
created: 2024-12-18
modified: 2025-07-03
Vastavuoroinen suhde: näköispainos kappaleesta
alternative label: facsimile (item) @en
alternative label: näköispainos (kappale)
alternative label: faksimil (exemplar) @sv
broader: kappaleen jäljenne
definition: Manifestaatio, joka jäljentää tarkalleen toista manifestaatiota edustavan kappaleen. (RDA Registry)
definition: Manifestation som exakt reproducerar ett exemplar som representerar en annan manifestation. @sv
in scheme: Metatietosanasto
narrower: kappaleen säilytyskopio
preferred label: facsimile of item @en
preferred label: faksimil av exemplaret @sv

kappaleeseen liittyvä teos
type: Concept
source: RDA-termi
source: RDA-term @sv
created: 2024-12-18
modified: 2025-07-03
Vastavuoroinen suhde: teokseen liittyvä kappale
definition: Teos, joka liittyy kappaleeseen. (RDA Registry)
definition: Verk som relaterar till ett exemplar. @sv
in scheme: Metatietosanasto
narrower: kappale aiheena teoksessa
narrower: kappaleen sidos
preferred label: related work of item @en
preferred label: verk relaterat till exemplaret @sv

teokseen liittyvä kappale
type: Concept
source: RDA-termi
source: RDA-term @sv
created: 2024-12-18
modified: 2025-08-22
Vastavuoroinen suhde: kappaleeseen liittyvä teos
definition: Kappale, joka liittyy teokseen. (RDA Registry)
definition: Exemplar som relaterar till ett verk. @sv
in scheme: Metatietosanasto
narrower: kappaleen sidos kappaleesta
narrower: aiheena oleva kappale
preferred label: related item of work @en
preferred label: exemplar relaterat till verket @sv

digitaaliseen sisältöön osallinen yhteisö
type: Concept
source: RDA-termi
source: RDA-term @sv
created: 2024-12-18
modified: 2025-04-16
broader: aggregaattiin osallinen yhteisö
definition: Aggregaattiin osallinen yhteisö, joka on luonut aggregaattiin sisältyvän digitaalisen sisällön ekspression.
definition: Institution som bidragit till ett aggregat och som skapat ett uttryck med digitalt innehåll som ingår i ett aggregat. @sv
in scheme: Metatietosanasto
narrower: ohjelmoija
narrower: ohjelmistokehittäjä
preferred label: contributor corporate body of computer content @en
preferred label: bidragsgivare (institution) till digitalt innehåll @sv

omistaja
type: Concept
source: RDA-termi
source: RDA-term @sv
created: 2024-12-18
modified: 2025-08-15
alternative label: omistaja (henkilö)
alternative label: ägare (person) @sv
broader: kappaleeseen liittyvä henkilö
definition: Henkilö, jolla on kappaleen nykyinen tai aiempi laillinen omistusoikeus. (RDA Registry)
definition: Person som har nuvarande eller tidigare juridisk äganderätt till ett exemplar. @sv
in scheme: Metatietosanasto
narrower: nykyinen omistaja
narrower: aiempi omistaja
preferred label: owner person @en
preferred label: ägare @sv

muunnos genressä teoksesta
type: Concept
source: RDA-termi
source: RDA-term @sv
created: 2024-12-18
modified: 2025-04-09
Vastavuoroinen suhde: muunnos genressä
broader: muunnos teoksesta
definition: Teos, jolla on genre, jota on muutettu teoksen luomiseksi. (RDA Registry)
definition: Verk som har en genre, som är ändrad för att skapa ett verk. @sv
in scheme: Metatietosanasto
narrower: teoksen perustana
preferred label: transformation by genre of @en
preferred label: variant av genre för verket @sv

omistaja
type: Concept
source: RDA-termi
source: RDA-term @sv
created: 2024-12-18
modified: 2025-08-15
alternative label: omistaja (yhteisö)
alternative label: ägare (institution) @sv
broader: kappaleeseen liittyvä yhteisö
definition: Yhteisö, jolla on kappaleen nykyinen tai aiempi laillinen omistusoikeus. (RDA Registry)
definition: Institution som har nuvarande eller tidigare juridisk äganderätt till ett exemplar. @sv
in scheme: Metatietosanasto
narrower: aiempi omistaja
narrower: nykyinen omistaja
preferred label: owner corporate body @en
preferred label: ägare @sv

aiempi omistaja
type: Concept
source: RDA-termi
source: RDA-term @sv
created: 2024-12-18
modified: 2025-01-03
alternative label: aiempi omistaja (yhteisö)
alternative label: tidigare ägare (institution) @sv
broader: omistaja
definition: Yhteisö, joka on aiemmin laillisesti omistanut kappaleen. (RDA Registry)
definition: Institution som tidigare juridiskt ägt ett exemplar. @sv
in scheme: Metatietosanasto
narrower: lahjoittaja
narrower: myyjä
preferred label: former owner corporate body @en
preferred label: tidigare ägare @sv

teoksen versio
type: Concept
source: RDA-termi
source: RDA-term @sv
created: 2024-12-18
modified: 2025-08-23
Vastavuoroinen suhde: teos
alternative label: teoksen ekspressio
alternative label: uttryck av verk @sv
broader: teokseen liittyvä versio
definition: Ekspressio, joka on teoksen toteutus, joka voi olla muodoltaan aakkosnumeerinen, musiikkinuotinnos, tanssinotaatio, ääntä, kuva, esine, liikettä tms. tai mikä tahansa tällaisten muotojen yhdistelmä. (RDA Registry)
definition: Uttryck som är ett förverkligande av ett verk, som till sin form kan vara alfanumerisk, musiknotation, dansnotation, ljud, bild, föremål, rörelse eller dylikt, eller vilken som helst kombination av sådana former. @sv
in scheme: Metatietosanasto
narrower: edustava versio
preferred label: expression of work @en
preferred label: version av verk @sv

näköispainos kappaleesta
type: Concept
source: RDA-termi
source: RDA-term @sv
created: 2024-12-18
modified: 2025-08-15
Vastavuoroinen suhde: kappaleen näköispainos
broader: jäljenne kappaleesta
definition: Kappale, jota on käytetty täsmällisen jäljennöksen pohjana. (RDA Registry)
definition: Exemplar som har använts som grund för en exakt reproduktion. @sv
in scheme: Metatietosanasto
narrower: säilytyskopio kappaleesta
preferred label: facsimile of item of @en
preferred label: faksimil av exemplaret @sv

muunnos genressä
type: Concept
source: RDA-termi
source: RDA-term @sv
created: 2024-12-18
modified: 2025-08-15
Vastavuoroinen suhde: muunnos genressä teoksesta
broader: muunnos
definition: Teos, joka on luotu muuttamalla teoksen genreä tai kirjallista muotoa. (RDA Registry)
definition: Verk som skapats genom att ändra ett verks genre eller litterära form. @sv
in scheme: Metatietosanasto
narrower: johdannaisteos
preferred label: transformation by genre @en
preferred label: variant av genre @sv

ääniteknikko
type: Concept
source: RDA-termi
source: RDA-term @sv
created: 2024-12-18
modified: 2025-08-27
alternative label: ääniteknikko (henkilö)
alternative label: ljudtekniker (person) @sv
broader: esitykseen osallinen henkilö
definition: Henkilö, joka osallistuu ekspression tekemiseen huolehtimalla äänen teknisistä näkökohdista äänitys-, miksaus- ja äänentoistoprosessien aikana. (RDA Registry)
definition: Person som deltar i utförandet av ett uttryck, genom att sköta de tekniska aspekterna på ljud under inspelnings-, mixnings- och ljudåtergivningsprocesser. @sv
in scheme: Metatietosanasto
narrower: miksaaja
narrower: äänittäjä
preferred label: audio engineer person @en
preferred label: ljudtekniker @sv

johtaja
type: Concept
source: RDA-termi
source: RDA-term @sv
created: 2024-12-18
modified: 2025-07-01
alternative label: johtaja (henkilö)
alternative label: dirigent (person) @sv
broader: esittäjä
definition: Henkilö, joka on esittäjä, joka osallistuu musiikkiteoksen ekspression tekemiseen johtamalla esiintyjäryhmää musiikki- tai näytelmäesityksessä. (RDA Registry)
definition: Person som är en framförare som deltar i utförandet av ett musikverks uttryck, genom att dirigera en uppträdande grupp i en musik- eller dramaföreställning. @sv
in scheme: Metatietosanasto
narrower: kuoronjohtaja
narrower: kapellimestari
preferred label: conductor person @en
preferred label: dirigent @sv

aineistoa metatiedoilla kuvaileva teos
type: Concept
source: RDA-termi
source: RDA-term @sv
created: 2024-12-18
modified: 2025-01-03
Vastavuoroinen suhde: metatietokuvailu aineistosta
alternative label: manifestaatiota metatiedoilla kuvaileva teos
alternative label: verk som beskriver manifestationen med metadata @sv
broader: aineistoa kuvaava teos
definition: Teos, joka on manifestaation metatietoteos. (RDA Registry)
definition: Verk som är ett metadataverk för en manifestation. @sv
in scheme: Metatietosanasto
narrower: luettelo
preferred label: manifestation described with metadata by @en
preferred label: verk som beskriver materialet med metadata @sv

valmistaja
type: Concept
source: RDA-termi
source: RDA-term @sv
created: 2024-12-18
modified: 2025-08-23
alternative label: valmistaja (yhteisö)
alternative label: tillverkare (institution) @sv
broader: aineiston tekijä
definition: Yhteisö, joka on vastuussa julkaistun manifestaation painamisesta, monistamisesta, kirjasinten valamisesta tai muusta valmistustavasta. (RDA Registry)
definition: Institution som svarar för tryckningen, mångfaldigandet, gjutandet av typer eller något annat framställningssätt för en utgiven manifestation. @sv
in scheme: Metatietosanasto
narrower: painaja
narrower: pistekirjoituksen tekijä
preferred label: manufacturer corporate body @en
preferred label: tillverkare @sv

kappale aiheena teoksessa
type: Concept
source: RDA-termi
source: RDA-term @sv
created: 2024-12-18
modified: 2025-02-21
Vastavuoroinen suhde: aiheena oleva kappale
alternative label: subject of (item) @en
broader: kappaleeseen liittyvä teos
definition: Kappaleesta kertova teos. (RDA Registry)
definition: Verk som berättar om ett exemplar. @sv
in scheme: Metatietosanasto
narrower: kappaletta kuvaava teos
preferred label: subject item of @en
preferred label: behandlat exemplar i verket @sv

johtaja
type: Concept
source: RDA-termi
source: RDA-term @sv
created: 2024-12-18
modified: 2025-07-01
alternative label: johtaja (yhteisö)
alternative label: dirigent (institution) @sv
broader: esittäjä
definition: Yhteisö, joka on esittäjä, joka osallistuu musiikkiteoksen ekspression tekemiseen johtamalla esiintyjäryhmää musiikki- tai näytelmäesityksessä. (RDA Registry)
definition: Institution som är en framförare som deltar i utförandet av ett musikverks uttryck, genom att dirigera en uppträdande grupp i en musik- eller dramaföreställning. @sv
in scheme: Metatietosanasto
narrower: kuoronjohtaja
narrower: kapellimestari
preferred label: conductor corporate body @en
preferred label: dirigent @sv

designer
type: Concept
source: RDA-termi
source: RDA-term @sv
created: 2024-12-18
modified: 2025-05-27
alternative label: designer (henkilö)
alternative label: designer (person) @sv
broader: teoksen tekijä
definition: Henkilö, joka on vastuussa kohteen suunnittelusta tai muotoilusta. (RDA Registry)
definition: Person som svarar för design eller formgivning av ett objekt @sv
in scheme: Metatietosanasto
narrower: suunnittelija
narrower: muotoilija
preferred label: designer person @en

ääniteknikko
type: Concept
source: RDA-termi
source: RDA-term @sv
created: 2024-12-18
modified: 2025-08-27
alternative label: ääniteknikko (yhteisö)
alternative label: ljudtekniker (institution) @sv
broader: esitykseen osallinen yhteisö
definition: Yhteisö, joka osallistuu ekspression tekemiseen huolehtimalla äänen teknisistä näkökohdista äänitys-, miksaus- ja äänentoistoprosessien aikana. (RDA Registry)
definition: Institution som deltar i utförandet av ett uttryck, genom att sköta de tekniska aspekterna på ljud under inspelnings-, mixnings- och ljudåtergivningsprocesser. @sv
in scheme: Metatietosanasto
narrower: miksaaja
narrower: äänittäjä
preferred label: audio engineer corporate body @en
preferred label: ljudtekniker @sv

aiheena oleva kappale
type: Concept
source: RDA-termi
source: RDA-term @sv
created: 2024-12-18
modified: 2025-02-21
Vastavuoroinen suhde: kappale aiheena teoksessa
broader: teokseen liittyvä kappale
definition: Kappale, jota teos koskee. (RDA Registry)
definition: Exemplar som ett verk handlar om. @sv
in scheme: Metatietosanasto
narrower: kuvaus kappaleesta
preferred label: subject item @en
preferred label: behandlat exemplar @sv

digitaaliseen sisältöön osallinen henkilö
type: Concept
source: RDA-termi
source: RDA-term @sv
created: 2024-12-18
modified: 2025-04-16
broader: aggregaattiin osallinen henkilö
definition: Aggregaattiin osallinen henkilö, joka on luonut aggregaattiin sisältyvän digitaalisen sisällön ekspression.
definition: Person som bidragit till ett aggregat och som skapat ett uttryck med digitalt innehåll som ingår i ett aggregat. @sv
in scheme: Metatietosanasto
narrower: ohjelmistokehittäjä
narrower: ohjelmoija
preferred label: contributor person of computer content @en
preferred label: bidragsgivare (person) till digitalt innehåll @sv

valmistaja
type: Concept
source: RDA-termi
source: RDA-term @sv
created: 2024-12-18
modified: 2025-08-23
alternative label: valmistaja (henkilö)
alternative label: tillverkare (person) @sv
broader: aineiston tekijä
definition: Henkilö, joka on vastuussa julkaistun manifestaation painamisesta, monistamisesta, kirjasinten valamisesta tai muusta valmistustavasta. (RDA Registry)
definition: Person som svarar för tryckningen, mångfaldigandet, gjutandet av typer eller något annat framställningssätt för en utgiven manifestation. @sv
in scheme: Metatietosanasto
narrower: painaja
narrower: pistekirjoituksen tekijä
preferred label: manufacturer person @en
preferred label: tillverkare @sv

metatietokuvailu aineistosta
type: Concept
source: RDA-termi
source: RDA-term @sv
created: 2024-12-18
modified: 2025-08-14
Vastavuoroinen suhde: aineistoa metatiedoilla kuvaileva teos
alternative label: metatietokuvailu manifestaatiosta
alternative label: metadatabeskrivning av manifestationen @sv
broader: kuvaus aineistosta
definition: Metatietoteoksen kuvailema manifestaatio. (RDA Registry)
definition: Manifestation som ett metadataverk beskriver. @sv
in scheme: Metatietosanasto
narrower: luettelo aineistolle
preferred label: metadata description of manifestation @en
preferred label: metadatabeskrivning av materialet @sv

aiempi omistaja
type: Concept
source: RDA-termi
source: RDA-term @sv
created: 2024-12-18
modified: 2025-01-03
alternative label: aiempi omistaja (henkilö)
alternative label: tidigare ägare (person) @sv
broader: omistaja
definition: Henkilö, joka on aiemmin laillisesti omistanut kappaleen. (RDA Registry)
definition: Person som tidigare juridiskt ägt ett exemplar. @sv
in scheme: Metatietosanasto
narrower: myyjä
narrower: lahjoittaja
preferred label: former owner person @en
preferred label: tidigare ägare @sv

kunta
type: Concept
source: Kansallinen RDA-termi
source: Nationell RDA-term @sv
created: 2016-01-08
modified: 2024-05-24
alternative label: maalaiskunta
alternative label: pitäjä
alternative label: landskommun @sv
alternative label: socken @sv
definition: Julkishallinnon paikallistason itsehallinnollinen yksikkö, jolla on oma alueensa ja väestönsä.
definition: Autonom enhet på lokal nivå av offentlig förvaltning, med eget område och befolkning. @sv
in scheme: Metatietosanasto
preferred label: kommun @sv
related: kaupunki
related: kunta (hallintoalue)
related: seutukunta
scope note: Ei käytetä kunnista, jotka ovat tai ovat olleet kaupunkeja tai kauppaloita.
scope note: Används inte om kommuner som är eller har varit städer eller köpingar. @sv

tuomioistuin
type: Concept
source: Kansallinen RDA-termi
source: Nationell RDA-term @sv
created: 2016-01-08
modified: 2024-05-24
alternative label: hovioikeus
alternative label: korkein oikeus
alternative label: laamanninoikeus
alternative label: hovrätt @sv
alternative label: högsta domstolen @sv
alternative label: lagmansrätt @sv
definition: Valtion viranomainen ja oikeudenhoitoelin, jonka päätehtävänä on käyttää tuomiovaltaa riita-, rikos- ja hallintoasioissa, oikeus (Kielitoimiston sanakirja).
definition: Statlig myndighet och rättsvårdsorgan, vars huvuduppgift är att utöva domsrätt i tviste-, brott- och förvaltningsmål, rätt. @sv
example: Markkinaoikeus (tuomioistuin)
example: Tuomioistuinvirasto
example: Marknadsdomstolen @sv
in scheme: Metatietosanasto
narrower: alioikeus
narrower: sotatuomioistuin
narrower: hallintotuomioistuin
narrower: erityistuomioistuin
preferred label: domstol @sv

kuvalaatan valmistaja
type: Concept
source: RDA-termi
source: RDA-term @sv
created: 2016-12-02
modified: 2025-07-04
alternative label: printmaker @en
alternative label: kuvalaatan valmistaja (toimija)
alternative label: klichétillverkare @sv
alternative label: tryckmakare (aktör) @sv
broader: aineiston tekijä
definition: Toimija, joka osallistuu manifestaation valmistamiseen valmistamalla kohokuvan, syväpainon tai laakapainon painopinnan. (RDA Registry)
definition: Aktör som deltar i tillverkningen av en manifestation genom att tillverka tryckytan för relief, djuptryck eller plantryck. @sv
in scheme: Metatietosanasto
narrower: kaivertaja
narrower: litografi
narrower: etsaaja
preferred label: printmaker agent @en
preferred label: tryckmakare @sv

innoitus teokselle
type: Concept
source: RDA-termi
source: RDA-term @sv
created: 2018-08-28
modified: 2025-07-01
Vastavuoroinen suhde: innoittaja
alternative label: innoittaja
alternative label: har inspirerat @sv
broader: teokseen liittyvä teos
definition: Teos, jota siihen liittyvä teos on innoittanut. (RDA Registry)
definition: Verk som ett relaterat verk har gett inspiration till. @sv
in scheme: Metatietosanasto
narrower: numero
narrower: alasarja
preferred label: inspiration for @en
preferred label: inspiration till verket @sv

kuntajohtaja
type: Concept
source: Kansallinen RDA-termi
source: YSO-termi
source: ALLFO-term @sv
source: Nationell RDA-term @sv
created: 2018-11-01
modified: 2024-08-27
alternative label: managers of cities, towns and municipalities @en
alternative label: kuntajohtajat
alternative label: kommunchefer @sv
broader: johtaja
in scheme: Metatietosanasto
narrower: kauppalanjohtaja
narrower: kaupunginjohtaja
narrower: kunnanjohtaja
preferred label: manager of city, town or municipality @en
preferred label: kommunchef @sv

lehtori (opettaja)
type: Concept
source: Kansallinen RDA-termi
source: YSO-termi
source: ALLFO-term @sv
source: Nationell RDA-term @sv
created: 2018-11-01
modified: 2024-08-27
alternative label: lectors @en
alternative label: lectors and lecturers @en
alternative label: lecturers @en
alternative label: lehtorit
alternative label: lektorer @sv
broader: opettaja
in scheme: Metatietosanasto
narrower: ammattikorkeakoulun lehtori
narrower: lukion lehtori
narrower: yliopiston lehtori
preferred label: lector/lecturer @en
preferred label: lektor (lärare) @sv

juoksija
type: Concept
source: Kansallinen RDA-termi
source: YSO-termi
source: ALLFO-term @sv
source: Nationell RDA-term @sv
created: 2018-11-01
modified: 2024-08-27
alternative label: runners @en
alternative label: juoksijat
broader: yleisurheilija
in scheme: Metatietosanasto
narrower: kestävyysjuoksija
narrower: pikajuoksija
narrower: aitajuoksija
preferred label: runner @en
preferred label: löpare @sv

terapeutti
type: Concept
source: Kansallinen RDA-termi
source: YSO-termi
source: ALLFO-term @sv
source: Nationell RDA-term @sv
created: 2018-11-01
modified: 2024-08-27
alternative label: therapists @en
alternative label: terapeutit
alternative label: terapeuter @sv
in scheme: Metatietosanasto
narrower: musiikkiterapeutti
narrower: toimintaterapeutti
narrower: luontaishoitaja
narrower: puheterapeutti
preferred label: therapist @en
preferred label: terapeut @sv

ammatillisten opintojen opettaja
type: Concept
source: Kansallinen RDA-termi
source: YSO-termi
source: ALLFO-term @sv
source: Nationell RDA-term @sv
created: 2018-11-01
modified: 2024-08-27
alternative label: vocational studies teachers @en
alternative label: ammatillisten opintojen opettajat
alternative label: ammattiopettajat
alternative label: lärare för yrkesstudier @sv
broader: ammatillinen opettaja
in scheme: Metatietosanasto
narrower: sairaanhoidon opettaja
narrower: terveydenhuollon opettaja
narrower: kotiteollisuusopettaja
preferred label: vocational studies teacher @en
preferred label: lärare i yrkesinriktade studier @sv

naislaulaja
type: Concept
source: Kansallinen RDA-termi
source: YSO-termi
source: ALLFO-term @sv
source: Nationell RDA-term @sv
created: 2018-11-01
modified: 2024-08-27
alternative label: female singers @en
alternative label: women singers @en
alternative label: laulajat -- naiset
alternative label: laulajattaret
alternative label: naislaulajat
alternative label: kvinnliga sångare @sv
alternative label: kvinnliga vokalister @sv
alternative label: sångerskor @sv
broader: laulaja
in scheme: Metatietosanasto
narrower: altto
narrower: sopraano
narrower: mezzosopraano
preferred label: female singer @en
preferred label: sångerska @sv

valokuvaaja
type: Concept
source: Kansallinen RDA-termi
source: YSO-termi
source: ALLFO-term @sv
source: Nationell RDA-term @sv
created: 2018-11-01
modified: 2024-08-27
alternative label: photographers @en
alternative label: valokuvaajat
alternative label: valokuvataiteilijat
alternative label: fotografer @sv
alternative label: fotokonstnärer @sv
broader: kuvataiteilija
in scheme: Metatietosanasto
narrower: lehtikuvaaja
narrower: paparazzi
narrower: luontovalokuvaaja
preferred label: photographer @en
preferred label: fotograf @sv

opas
type: Concept
source: Kansallinen RDA-termi
source: YSO-termi
source: ALLFO-term @sv
source: Nationell RDA-term @sv
created: 2018-11-01
modified: 2024-08-27
alternative label: guides @en
alternative label: oppaat
alternative label: guider @sv
in scheme: Metatietosanasto
narrower: eräopas
narrower: matkailuopas
narrower: luonto-opas
narrower: museo-opas
preferred label: guide (occupation) @en
preferred label: guide (yrke) @sv

innoittaja
type: Concept
source: RDA-termi
source: RDA-term @sv
created: 2018-12-08
modified: 2025-07-01
Vastavuoroinen suhde: innoitus teokselle
alternative label: innoituksen perustana
alternative label: innoituksen perustana (teos)
alternative label: inspirerats av (verk) @sv
broader: teokseen liittyvä teos
definition: Teos, joka toimii innoituksena siihen liittyvälle teokselle. (RDA Registry)
definition: Verk som fungerar som inspiration till ett relaterat verk. @sv
in scheme: Metatietosanasto
narrower: numero teoksessa
narrower: pääsarja
preferred label: inspired by @en
preferred label: inspirerats av @sv

valtiovarainhallinto
type: Concept
source: Kansallinen RDA-termi
source: Nationell RDA-term @sv
created: 2019-03-13
modified: 2026-05-06
broader: julkinen hallinto
example: valtiovarainministeriö, valtiokonttori, verohallitus, tullihallitus, verohallinnon piiri- ja paikallisviranomaiset, tullihallinnon piiri- ja paikallisviranomaiset, tilastokeskus
example: finansministeriet, statskontoret, skattestyrelsen, tullstyrelsen, skatteförvaltningens distrikts- och lokala myndigheter, tullförvaltningens distrikts- och lokala myndigheter, statistikcentralen @sv
in scheme: Metatietosanasto
narrower: verohallinto
narrower: tullihallinto
narrower: finanssihallinto
preferred label: statens finansförvaltning @sv

amanuenssi
type: Concept
source: Kansallinen RDA-termi
source: Nationell RDA-term @sv
created: 2019-06-05
modified: 2025-11-04
in scheme: Metatietosanasto
narrower: arkistoamanuenssi
narrower: korkeakoulun amanuenssi
narrower: kirjastoamanuenssi
narrower: museoamanuenssi
preferred label: amanuens @sv

ohjaaja
type: Concept
source: RDA-termi
source: RDA-term @sv
created: 2016-01-08
modified: 2025-08-15
alternative label: director @en
alternative label: ohj. (ohjaaja)
alternative label: ohjaaja (suhde)
alternative label: ohjaaja (toimija)
alternative label: reg. (regissör) @sv
alternative label: regissör (aktör) @sv
alternative label: regissör (relation) @sv
broader: teoksen tekijä
definition: Toimija, joka on vastuussa elokuvatun esityksen, radio- tai televisio-ohjelman tms. yleisestä johtamisesta. (RDA Registry)
definition: Aktör som svarar för den allmänna ledningen av ett filmat framträdande, ett radio- eller tv-program eller dylikt. @sv
in scheme: Metatietosanasto
narrower: televisio-ohjaaja
narrower: elokuvaohjaaja
narrower: radio-ohjaaja
preferred label: director agent @en
preferred label: regissör @sv

orkesteri
type: Concept
source: Kansallinen RDA-termi
source: Nationell RDA-term @sv
created: 2016-01-08
modified: 2024-05-24
definition: Kymmenen tai useamman soittajan esityskokoonpano yleensä länsimaisen taidemusiikin viitekehyksessä.
definition: Vanligtvis instrumentalensembler som leds av en kapellmästare, och där åtminstone några stämmor spelas av flera instrumentalister; även allmänt om instrumentalensemble. @sv
example: Tapiola Sinfonietta (orkesteri)
example: Wasa sinfonietta (orkester) @sv
in scheme: Metatietosanasto
narrower: kamariorkesteri
narrower: jousiorkesteri
narrower: puhallinorkesteri
narrower: sinfoniaorkesteri
preferred label: orchestra @en
preferred label: orkester @sv

järjestö
type: Concept
source: Kansallinen RDA-termi
source: Nationell RDA-term @sv
created: 2016-01-08
modified: 2024-05-24
alternative label: metsästysseura (rekisteröimätön)
alternative label: salaseura (rekisteröimätön)
alternative label: seura (rekisteröimätön)
alternative label: sotilasliitto
alternative label: talousliitto
alternative label: ekonomisk union @sv
alternative label: hemligt sällskap (oregistrerat) @sv
alternative label: jaktförening (oregistrerad) @sv
alternative label: militärallians @sv
alternative label: sällskap (oregistrerat) @sv
example: Maan Turva (järjestö)
example: Folkhälsan (organisation) @sv
in scheme: Metatietosanasto
preferred label: organisation @sv
related: säätiö
related: puolue
related: yhdistys (julkisoikeudellinen)
related: yhdistys (rekisteröity)
scope note: Käytetään kansainvälisistä järjestöistä ja sellaisista kotimaisista järjestöistä, jotka eivät ole rekisteröityjä yhdistyksiä, julkisoikeudellisia yhdistyksiä, puolueita, uskonnollisia yhdyskuntia eivätkä säätiöitä.
scope note: Används om internationella organisationer och sådan inhemska organisationer som inte är registrerade föreningar, offentligrättsliga föreningar, partier, religiösa samfund eller stiftelser. @sv

saman kokoelman kappale
type: Concept
source: RDA-termi
source: RDA-term @sv
created: 2020-04-17
modified: 2025-08-19
alternative label: accompanied by item @en
alternative label: accompanying item relationship @en
alternative label: yhdistetty kappaleeseen
alternative label: medföljande exemplar @sv
broader: kappaleeseen liittyvä kappale
definition: Kappale, joka on samassa kokoelmassa. (RDA Registry)
definition: Exemplar som finns i samma samling. @sv
in scheme: Metatietosanasto
narrower: yhteensidottu
narrower: mikrofilmillä myös
narrower: levyllä myös
preferred label: held with @en
preferred label: exemplar i samma samling @sv

vanhemman sisarus
type: Concept
source: AgRelOn, an Agent Relationship Ontology
source: Kansallinen RDA-termi
source: Nationell RDA-term @sv
created: 2021-01-27
modified: 2025-08-28
broader: henkilöön liittyvä henkilö
definition: Kuvailtavan henkilön täti, setä tai eno.
definition: En beskriven persons faster, moster, farbror eller morbror. @sv
in scheme: Metatietosanasto
narrower: setä
narrower: täti
narrower: eno
preferred label: has aunt or uncle @en
preferred label: förälders syskon @sv

piiri (hallintoalue)
type: Concept
source: Kansallinen RDA-termi
source: Nationell RDA-term @sv
created: 2021-04-20
modified: 2025-10-30
alternative label: elinkeinopiiri
alternative label: kutsuntapiiri
alternative label: rajoni
alternative label: rajooni
alternative label: sotilaspiiri
alternative label: suojeluskuntapiiri
alternative label: tiepiiri
alternative label: tuomiokunta (tuomiopiiri)
alternative label: vesipiiri
alternative label: domsaga @sv
alternative label: militärdistrikt @sv
alternative label: näringsdistrikt @sv
alternative label: rajon @sv
alternative label: skyddskårsdistrikt @sv
alternative label: uppbådskrets @sv
alternative label: vattendistrikt @sv
alternative label: vägdistrikt @sv
definition: Aluehallinnon yksikkö tai sen toimialue, jota kutsutaan piiriksi.
definition: Enhet eller verksamhetsområde för regional förvaltning. @sv
example: Savon tie- ja vesipiiri; Kainuun elinkeinopiiri; Oulun suojeluskuntapiiri; Piippolan tuomiokunta; Viipurin posti- ja lennätinpiiri; Jyväskylän asutuspiiri
example: Savolax väg- och vattendistrikt; Kajanalands näringsdistrikt; Uleåborgs skyddskårsdistrikt; Piippola domsaga @sv
in scheme: Metatietosanasto
preferred label: distrikt (förvaltningsområde) @sv
related: maakunta
related: alue (hallintoalue)
related: piirikunta
related: lääni
scope note: Voidaan käyttää valitun yhteisön kategorian lisäksi täsmentämään, että ko. julkishallinnollinen yhteisö on piiritason organisaatio. Suomen kielessä yleisesti piirikunniksi kutsutuista useiden maiden aluehallinnon yksiköistä käytä termiä piirikunta. Nimismiespiiriä johtaneesta viranomaisesta käytä yhteisön kategorian historiallista termiä nimismies (viranomainen).
scope note: Kan användas utöver en vald kategori av institution för att precisera att den offentligrättsliga institutionen i fråga är en organisation på distriktsnivå. Om liknande förvaltningsenhet i flera engelskspråkiga länder används termen county. Om myndighet som ledde ett länsmansdistrikt används den historiska termen länsman (myndighet) som kategori av institution. @sv

piirikunta
type: Concept
source: Kansallinen RDA-termi
source: Nationell RDA-term @sv
created: 2021-12-08
modified: 2025-08-23
definition: Useissa maissa aluehallinnon yksikkö tai sen toimialue, jota suomen kielessä yleisesti kutsutaan piirikunnaksi.
definition: I flera engelskspråkiga länder regional förvaltningsenhet. @sv
example: DeKalbin piirikunta (Yhdysvallat)
example: DeKalb county (Förenta staterna) @sv
in scheme: Metatietosanasto
preferred label: county @sv
related: piiri (hallintoalue)
related: maakunta
related: alue (hallintoalue)
related: lääni
scope note: Suomen piirihallinnon yksiköistä käytä yhteisön tyyppinä termiä piiri (hallintoalue).

lääni
type: Concept
source: Kansallinen RDA-termi
source: Nationell RDA-term @sv
created: 2021-12-08
modified: 2025-08-29
alternative label: linnalääni
alternative label: sotilaslääni
alternative label: militärlän @sv
alternative label: slottslän @sv
definition: Aluehallinnon yksikkö tai sen toimialue, jota kutsutaan lääniksi. Suomessa valtion ylin aluehallinto järjestettiin lääninhallintona vuoden 2009 loppuun asti ja puolustusvoimien aluehallinto sotilaslääneinä eri muodoissa vuosina 1932-2014.
definition: Enhet eller verksamhetsområde för regional förvaltning. @sv
example: Vaasan lääni; Käkisalmen lääni; Pohjois-Suomen sotilaslääni
example: Vasa län; Kexholms län; Norra Finlands militärlän @sv
in scheme: Metatietosanasto
preferred label: län @sv
related: piiri (hallintoalue)
related: maakunta
related: alue (hallintoalue)
related: piirikunta
scope note: Voidaan käyttää valitun yhteisön kategorian lisäksi täsmentämään, että ko. julkishallinnollinen yhteisö on läänitason organisaatio. Lääninhallituksesta lääninhallinnon yksikkönä käytä yhteisön kategorian historiallista termiä lääninhallitus.
scope note: Kan användas utöver en vald kategori av institution för att precisera att den offentligrättsliga institutionen i fråga är en organisation på länsnivå. Om länsstyrelse som enhet för länsförvaltning används den historiska termen länsstyrelse som kategori av institution. @sv

kuva
type: Concept
created: 2023-01-21
modified: 2023-05-05
in scheme: Metatietosanasto
narrower: kartta
narrower: painokuva
narrower: piirustus
narrower: valokuva
preferred label: bild @sv

paikka
type: Concept
created: 2023-01-21
modified: 2023-05-05
in scheme: Metatietosanasto
narrower: rakennus
narrower: kulttuuriympäristö
narrower: rakennettu ympäristö
narrower: muinaisjäännös
preferred label: plats @sv

liikkuva kuva
type: Concept
created: 2023-01-21
modified: 2023-05-05
in scheme: Metatietosanasto
narrower: tv-ohjelma
narrower: haastattelu
narrower: elokuva
narrower: tapahtumatallenne
preferred label: rörlig bild @sv

taiteilija
type: Concept
source: RDA-termi
source: RDA-term @sv
created: 2016-01-08
modified: 2025-08-21
alternative label: artist @en
alternative label: taiteilija (suhde)
alternative label: taiteilija (toimija)
alternative label: konstnär (aktör) @sv
alternative label: konstnär (relation) @sv
broader: teoksen tekijä
definition: Toimija, joka on vastuussa alkuperäisen graafisen suunnitelman, piirroksen, maalauksen tms. luomisesta. (RDA Registry)
definition: Aktör som svarar för skapandet av en ursprunglig grafisk design, teckning, målning eller dylikt. @sv
in scheme: Metatietosanasto
narrower: kirjataiteilija
narrower: kalligrafi
narrower: kuvanveistäjä
preferred label: artist agent @en
preferred label: konstnär @sv

arviointi teoksesta
type: Concept
source: RDA-termi
source: RDA-term @sv
created: 2024-12-18
modified: 2025-03-22
Vastavuoroinen suhde: teoksen arviointi
broader: aiheena oleva teos
definition: Teos, jota on tutkittu tai arvioitu. (RDA Registry)
definition: Verk som har undersökts eller evaluerats. @sv
in scheme: Metatietosanasto
narrower: arvostelu teoksesta
narrower: kritiikki teoksesta
preferred label: evaluation of work @en
preferred label: evaluering av verket @sv

teoksen arviointi
type: Concept
source: RDA-termi
source: RDA-term @sv
created: 2024-12-18
modified: 2025-08-22
Vastavuoroinen suhde: arviointi teoksesta
alternative label: evaluated in (work) @en
alternative label: arvioitu teoksessa
alternative label: evaluerad i verket @sv
broader: aiheena oleva teos teoksessa
definition: Teos, joka tutkii tai arvioi teosta. (RDA Registry)
definition: Verk som undersöker eller evaluerar ett verk. @sv
in scheme: Metatietosanasto
narrower: teoksen arvostelu
narrower: teoksen kritiikki
preferred label: work evaluated by @en
preferred label: evaluering av verket i @sv

aiheena oleva versio
type: Concept
source: RDA-termi
source: RDA-term @sv
created: 2024-12-18
modified: 2025-02-21
Vastavuoroinen suhde: versio aiheena teoksessa
alternative label: aiheena oleva ekspressio
alternative label: behandlat uttryck @sv
broader: teokseen liittyvä versio
definition: Ekspressio, jota teos koskee. (RDA Registry)
definition: Uttryck som ett verk handlar om. @sv
in scheme: Metatietosanasto
narrower: arviointi versiosta
narrower: kuvaus versiosta
preferred label: subject expression @en
preferred label: behandlad version @sv

muokkaaja
type: Concept
source: RDA-termi
source: RDA-term @sv
created: 2024-12-18
modified: 2025-08-14
alternative label: modifier @en
alternative label: muokkaaja (toimija)
alternative label: bearbetare (aktör) @sv
broader: kappaleeseen liittyvä toimija
definition: Toimija, joka tekee muutoksia kappaleeseen luomatta uutta manifestaatiota. (RDA Registry)
definition: Aktör som gör ändringar i ett exemplar, utan att skapa en ny manifestation. @sv
in scheme: Metatietosanasto
narrower: kappaleen entisöijä
narrower: illuminoinnin tekijä
narrower: sitoja
preferred label: modifier agent @en
preferred label: bearbetare @sv

arviointi aineistosta
type: Concept
source: RDA-termi
source: RDA-term @sv
created: 2024-12-18
modified: 2025-03-22
Vastavuoroinen suhde: aineiston arviointi
alternative label: arviointi manifestaatiosta
alternative label: evaluering av manifestationen @sv
broader: aiheena oleva aineisto
definition: Manifestaatio, jota on tutkittu tai arvioitu. (RDA Registry)
definition: Manifestation som har undersökts eller evaluerats. @sv
in scheme: Metatietosanasto
narrower: arvostelu aineistosta
narrower: kritiikki aineistosta
preferred label: evaluation of manifestation @en
preferred label: evaluering av materialet @sv

sukuun liittyvä yhteisö
type: Concept
source: RDA-termi
source: RDA-term @sv
created: 2024-12-18
modified: 2025-08-21
definition: Yhteisö, joka liittyy sukuun. (RDA Registry)
definition: Institution som relaterar till en släkt. @sv
in scheme: Metatietosanasto
narrower: suvun sponsoroima yhteisö
narrower: suvun perustama yhteisö
narrower: sukujäsen yhteisössä
narrower: suvun yhteisöjäsen
preferred label: related corporate body of family @en
preferred label: institution relaterad till släkten @sv

aiheena oleva teos teoksessa
type: Concept
source: RDA-termi
source: RDA-term @sv
created: 2024-12-18
modified: 2025-02-21
Vastavuoroinen suhde: aiheena oleva teos
alternative label: subject of (work) @en
alternative label: aiheena teoksessa (teos)
alternative label: behandlat i verket (verk) @sv
broader: teokseen liittyvä teos
definition: Teos, joka koskee teosta. (RDA Registry)
definition: Verk som handlar om ett verk. @sv
in scheme: Metatietosanasto
narrower: teoksen arviointi
narrower: teosta kuvaava teos
preferred label: subject work of @en
preferred label: behandlat verk i verket @sv

luettelo aineistolle
type: Concept
source: RDA-termi
source: RDA-term @sv
created: 2024-12-18
modified: 2025-07-05
Vastavuoroinen suhde: luettelo
alternative label: luettelo manifestaatiolle
alternative label: förteckning över manifestationen @sv
broader: metatietokuvailu aineistosta
definition: Manifestaatio, joka on kokoelmamanifestaatio, jota metatietokokonaisuus kuvailee. (RDA Registry)
definition: Manifestation som är en samlingsmanifestation, som en metadatahelhet beskriver. @sv
in scheme: Metatietosanasto
narrower: hierarkkinen luettelo aineistolle
narrower: kokoelmaluettelo aineistolle
preferred label: finding aid of @en
preferred label: förteckning över materialet @sv

kuvalaatan valmistaja
type: Concept
source: RDA-termi
source: RDA-term @sv
created: 2024-12-18
modified: 2025-07-04
alternative label: kuvalaatan valmistaja (yhteisö)
alternative label: klichétillverkare @sv
alternative label: tryckmakare (institution) @sv
broader: aineiston tekijä
definition: Yhteisö, joka on vastuussa manifestaation valmistamisesta valmistamalla kohokuvan, syväpainon tai laakapainon painopinnan. (RDA Registry)
definition: Institution som svarar för tillverkningen av en manifestation genom att tillverka tryckytan för relief, djuptryck eller plantryck. @sv
in scheme: Metatietosanasto
narrower: litografi
narrower: kaivertaja
narrower: etsaaja
preferred label: printmaker corporate body @en
preferred label: tryckmakare @sv

muunnos linjassa teoksesta
type: Concept
source: RDA-termi
source: RDA-term @sv
created: 2024-12-18
modified: 2025-08-15
Vastavuoroinen suhde: muunnos linjassa
broader: muunnos teoksesta
definition: Teos, jolla on toiminta-ala tai toimituslinja, jota on muutettu teoksen luomiseksi. (RDA Registry)
definition: Verk med ett verksamhetsfält eller en redaktionell linje, som har ändrats för att skapa ett verk. @sv
in scheme: Metatietosanasto
narrower: edeltävä teos
narrower: muunnos laajennussuunnitelmassa teoksesta
preferred label: transformation by policy of @en
preferred label: variant av policy för verket @sv

versio aiheena teoksessa
type: Concept
source: RDA-termi
source: RDA-term @sv
created: 2024-12-18
modified: 2025-02-21
Vastavuoroinen suhde: aiheena oleva versio
alternative label: subject of (expression) @en
alternative label: aihe (ekspressio) teoksessa
alternative label: ekspressio aiheena teoksessa
alternative label: behandlat uttryck i verket @sv
alternative label: ämne (uttryck) i verket @sv
broader: versioon liittyvä teos
definition: Teos, jonka aiheena ekspressio on. (RDA Registry)
definition: Verk som handlar om ett uttryck. @sv
in scheme: Metatietosanasto
narrower: version arviointi
narrower: versiota kuvaava teos
preferred label: subject expression of @en
preferred label: behandlad version i verket @sv

arviointi versiosta
type: Concept
source: RDA-termi
source: RDA-term @sv
created: 2024-12-18
modified: 2025-03-22
Vastavuoroinen suhde: version arviointi
alternative label: arviointi ekspressiosta
alternative label: evaluering av uttrycket @sv
broader: aiheena oleva versio
definition: Ekspressio, jota on tutkittu tai arvioitu. (RDA Registry)
definition: Uttryck som har undersökts eller evaluerats. @sv
in scheme: Metatietosanasto
narrower: kritiikki versiosta
narrower: arvostelu versiosta
preferred label: evaluation of expression @en
preferred label: evaluering av versionen @sv

kuvalaatan valmistaja
type: Concept
source: RDA-termi
source: RDA-term @sv
created: 2024-12-18
modified: 2025-07-04
alternative label: kuvalaatan valmistaja (henkilö)
alternative label: klichétillverkare @sv
alternative label: tryckmakare (person) @sv
broader: aineiston tekijä
definition: Henkilö, joka on vastuussa manifestaation valmistamisesta valmistamalla kohokuvan, syväpainon tai laakapainon painopinnan. (RDA Registry)
definition: Person som svarar för tillverkningen av en manifestation genom att tillverka tryckytan för relief, djuptryck eller plantryck. @sv
in scheme: Metatietosanasto
narrower: kaivertaja
narrower: litografi
narrower: etsaaja
preferred label: printmaker person @en
preferred label: tryckmakare @sv

kappaleeseen liittyvä aineisto
type: Concept
source: RDA-termi
source: RDA-term @sv
created: 2024-12-18
modified: 2025-07-03
Vastavuoroinen suhde: aineistoon liittyvä kappale
alternative label: kappaleeseen liittyvä manifestaatio
alternative label: manifestation relaterad till exemplaret @sv
definition: Manifestaatio, joka liittyy kappaleeseen. (RDA Registry)
definition: Manifestation som relaterar till ett exemplar. @sv
in scheme: Metatietosanasto
narrower: kappaleen jäljenne
narrower: kappaleen edustama aineisto
narrower: kappale kokoelmassa
preferred label: related manifestation of item @en
preferred label: material relaterat till exemplaret @sv

yhteisöön liittyvä suku
type: Concept
source: RDA-termi
source: RDA-term @sv
created: 2024-12-18
modified: 2025-08-27
definition: Suku, joka liittyy yhteisöön. (RDA Registry)
definition: Släkt som relaterar till en institution. @sv
in scheme: Metatietosanasto
narrower: yhteisöä sponsoroiva suku
narrower: yhteisön perustanut suku
narrower: yhteisöjäsen suvussa
narrower: yhteisön sukujäsen
preferred label: related family of corporate body @en
preferred label: släkt relaterad till institutionen @sv

luettelo
type: Concept
source: RDA-termi
source: RDA-term @sv
created: 2024-12-18
modified: 2025-07-05
Vastavuoroinen suhde: luettelo aineistolle
broader: aineistoa metatiedoilla kuvaileva teos
definition: Teos, joka on kokoelmamanifestaation metatietokokonaisuus. (RDA Registry)
definition: Verk som är en metadatahelhet för en samlingsmanifestation. @sv
in scheme: Metatietosanasto
narrower: hierarkkinen luettelo
narrower: kokoelmaluettelo
preferred label: finding aid @en
preferred label: förteckning @sv

sukuun liittyvä suku
type: Concept
source: RDA-termi
source: RDA-term @sv
created: 2024-12-18
modified: 2025-08-21
definition: Suku, joka liittyy sukuun. (RDA Registry)
definition: Släkt som relaterar till en släkt. @sv
in scheme: Metatietosanasto
narrower: sukuhaara suvussa
narrower: suvun sukuhaara
narrower: suvun edeltäjä
narrower: suvun seuraaja
preferred label: related family of family @en
preferred label: släkt relaterad till släkten @sv

aineistoon liittyvä toimija
type: Concept
source: RDA-termi
source: RDA-term @sv
created: 2024-12-18
modified: 2025-04-15
alternative label: other agent associated with manifestation @en
alternative label: manifestaatioon liittyvä muu toimija
alternative label: manifestaatioon liittyvä toimija
alternative label: aktör relaterad till manifestationen @sv
alternative label: annan aktör relaterad till manifestationen @sv
definition: Toimija, joka liittyy manifestaatioon. (RDA Registry)
definition: Aktör som relaterar till en manifestation. @sv
in scheme: Metatietosanasto
narrower: paperinvalmistaja
narrower: aggregaattiin osallinen toimija
narrower: aineiston tekijä
narrower: jakelija
preferred label: related agent of manifestation @en
preferred label: aktör relaterad till materialet @sv

aineistoon liittyvä kappale
type: Concept
source: RDA-termi
source: RDA-term @sv
created: 2024-12-18
modified: 2025-04-15
Vastavuoroinen suhde: kappaleeseen liittyvä aineisto
alternative label: manifestaatioon liittyvä kappale
alternative label: exemplar relaterat till manifestationen @sv
definition: Kappale, joka liittyy manifestaatioon. (RDA Registry)
definition: Exemplar som relaterar till en manifestation. @sv
in scheme: Metatietosanasto
narrower: kokoelman kappale
narrower: jäljenne kappaleesta
narrower: aineiston kappale
preferred label: related item of manifestation @en
preferred label: exemplar relaterat till materialet @sv

muokkaaja
type: Concept
source: RDA-termi
source: RDA-term @sv
created: 2024-12-18
modified: 2025-08-14
alternative label: muokkaaja (yhteisö)
alternative label: bearbetare (institution) @sv
broader: kappaleeseen liittyvä yhteisö
definition: Yhteisö, joka tekee muutoksia kappaleeseen luomatta uutta manifestaatiota. (RDA Registry)
definition: Institution som gör ändringar i ett exemplar, utan att skapa en ny manifestation. @sv
in scheme: Metatietosanasto
narrower: kappaleen entisöijä
narrower: sitoja
narrower: illuminoinnin tekijä
preferred label: modifier corporate body @en
preferred label: bearbetare @sv

aineiston arviointi
type: Concept
source: RDA-termi
source: RDA-term @sv
created: 2024-12-18
modified: 2025-01-03
Vastavuoroinen suhde: arviointi aineistosta
alternative label: evaluated in (manifestation) @en
alternative label: manifestaation arviointi
alternative label: evaluering av manifestation i @sv
broader: aineisto aiheena teoksessa
definition: Teos, joka sisältää tutkivan arvioinnin ja arvostelun manifestaatiosta. (RDA Registry)
definition: Verk som innehåller en undersökande utvärdering och bedömning av en manifestation. @sv
in scheme: Metatietosanasto
narrower: aineiston arvostelu
narrower: aineiston kritiikki
preferred label: manifestation evaluated by @en
preferred label: evaluering av materialet i @sv

version tekijä
type: Concept
source: RDA-termi
source: RDA-term @sv
created: 2024-12-18
modified: 2025-08-23
alternative label: contributor @en
alternative label: ekspression tekijä
alternative label: ekspression tekijä (toimija)
alternative label: skapare av uttryck @sv
alternative label: skapare av uttryck (aktör) @sv
broader: versioon liittyvä toimija
definition: Toimija, joka on vastuussa teoksen toteutuksesta. (RDA Registry)
definition: Aktör som svarar för förverkligandet av ett verk. @sv
in scheme: Metatietosanasto
narrower: kääntäjä
narrower: yhdistymään osallinen toimija
narrower: tarkistaja
preferred label: creator agent of expression @en
preferred label: skapare av version @sv
scope note: Ekspression tekijään kuuluvat kääntäjä, sovittaja, esittäjä jne. Ekspression toteuttaman teoksen tekijä on myös ekspression tekijä. (RDA Registry)
scope note: Till skapare av uttryck hör översättare, arrangör, framförande person etc. Skapare av ett uttryck som förverkligar ett verk är också skapare av ett uttryck. @sv

akateeminen ohjaaja
type: Concept
source: RDA-termi
source: RDA-term @sv
created: 2024-12-18
modified: 2025-05-27
broader: teoksen tekijä
definition: Henkilö, joka on vastuussa kaikenlaisen akateemisen toiminnan valvonnasta, joka johtaa teokseen, mukaan lukien tutkielmat, tutkimukset ja projektit. (RDA Registry)
definition: Person som svarar för övervakning av all slags akademisk verksamhet, som leder till ett verk, även avhandlingar, forskning och projekt. @sv
in scheme: Metatietosanasto
narrower: opinnäytteen ohjaaja
narrower: projektin ohjaaja
narrower: tutkimuksen ohjaaja
preferred label: academic supervisor @en
preferred label: akademisk handledare @sv

ohjaaja
type: Concept
source: RDA-termi
source: RDA-term @sv
created: 2024-12-18
modified: 2025-08-15
alternative label: ohjaaja (henkilö)
alternative label: regissör (person) @sv
broader: teoksen tekijä
definition: Henkilö, joka on vastuussa elokuvatun esityksen, radio- tai televisio-ohjelman tms. yleisestä johtamisesta. (RDA Registry)
definition: Person som svarar för den allmänna ledningen av ett filmat framträdande, ett radio- eller tv-program eller dylikt. @sv
in scheme: Metatietosanasto
narrower: televisio-ohjaaja
narrower: radio-ohjaaja
narrower: elokuvaohjaaja
preferred label: director person @en
preferred label: regissör @sv

taiteilija
type: Concept
source: RDA-termi
source: RDA-term @sv
created: 2024-12-18
modified: 2025-08-22
alternative label: taiteilija (yhteisö)
alternative label: konstnär (institution) @sv
broader: teoksen tekijä
definition: Yhteisö, joka on vastuussa alkuperäisen graafisen suunnitelman, piirroksen, maalauksen tms. luomisesta. (RDA Registry)
definition: Institution som svarar för skapandet av en ursprunglig grafisk design, teckning, målning eller dylikt. @sv
in scheme: Metatietosanasto
narrower: kirjataiteilija
narrower: kalligrafi
narrower: kuvanveistäjä
preferred label: artist corporate body @en
preferred label: konstnär @sv

aiheena oleva aineisto
type: Concept
source: RDA-termi
source: RDA-term @sv
created: 2024-12-18
modified: 2025-02-21
Vastavuoroinen suhde: aineisto aiheena teoksessa
alternative label: aiheena oleva manifestaatio
alternative label: behandlad manifestation @sv
broader: teokseen liittyvä aineisto
definition: Manifestaatio, jota teos koskee. (RDA Registry)
definition: Manifestation som ett verk handlar om. @sv
in scheme: Metatietosanasto
narrower: arviointi aineistosta
narrower: kuvaus aineistosta
preferred label: subject manifestation @en
preferred label: behandlat material @sv

version arviointi
type: Concept
source: RDA-termi
source: RDA-term @sv
created: 2024-12-18
modified: 2025-08-23
Vastavuoroinen suhde: arviointi versiosta
alternative label: evaluated in (expression) @en
alternative label: arvioitu teoksessa (ekspressio)
alternative label: ekspression arviointi
alternative label: evaluerad i verket (uttryck) @sv
alternative label: evaluering av uttrycket i @sv
broader: versio aiheena teoksessa
definition: Teos, joka tutkii tai arvioi ekspressiota. (RDA Registry)
definition: Verk som undersöker eller evaluerar ett uttryck. @sv
in scheme: Metatietosanasto
narrower: version kritiikki
narrower: version arvostelu
preferred label: expression evaluated by @en
preferred label: evaluering av versionen i @sv

aineisto aiheena teoksessa
type: Concept
source: RDA-termi
source: RDA-term @sv
created: 2024-12-18
modified: 2025-02-21
Vastavuoroinen suhde: aiheena oleva aineisto
alternative label: subject of (manifestation) @en
alternative label: manifestaatio aiheena teoksessa
alternative label: manifestaation aiheena teoksessa
alternative label: behandlad manifestation i verket @sv
broader: aineistoon liittyvä teos
definition: Teos, jonka aiheena manifestaatio on. (RDA Registry)
definition: Verk som handlar om en manifestation. @sv
in scheme: Metatietosanasto
narrower: aineistoa kuvaava teos
narrower: aineiston arviointi
preferred label: subject manifestation of @en
preferred label: behandlat material i verket @sv

muunnos linjassa
type: Concept
source: RDA-termi
source: RDA-term @sv
created: 2024-12-18
modified: 2025-08-15
Vastavuoroinen suhde: muunnos linjassa teoksesta
broader: muunnos
definition: Teos, joka on luotu muuttamalla teoksen toiminta-alaa tai toimituslinjaa. (RDA Registry)
definition: Verk som har skapats genom att ändra ett verks verksamhetsfält eller redaktionella linje. @sv
in scheme: Metatietosanasto
narrower: myöhempi teos
narrower: muunnos laajennussuunnitelmassa
preferred label: transformation by policy @en
preferred label: variant av policy @sv

ohjaaja
type: Concept
source: RDA-termi
source: RDA-term @sv
created: 2024-12-18
modified: 2025-08-15
alternative label: ohjaaja (yhteisö)
alternative label: regissör (institution) @sv
broader: teoksen tekijä
definition: Yhteisö, joka on vastuussa elokuvatun esityksen, radio- tai televisio-ohjelman tms. yleisestä johtamisesta. (RDA Registry)
definition: Institution som svarar för den allmänna ledningen av ett filmat framträdande, ett radio- eller tv-program eller dylikt. @sv
in scheme: Metatietosanasto
narrower: televisio-ohjaaja
narrower: radio-ohjaaja
narrower: elokuvaohjaaja
preferred label: director corporate body @en
preferred label: regissör @sv

teokseen liittyvä versio
type: Concept
source: RDA-termi
source: RDA-term @sv
created: 2024-12-18
modified: 2025-08-22
Vastavuoroinen suhde: versioon liittyvä teos
alternative label: teokseen liittyvä ekspressio
alternative label: uttryck relaterat till verket @sv
definition: Ekspressio, joka liittyy teokseen. (RDA Registry)
definition: Uttryck som relaterar till ett verk. @sv
in scheme: Metatietosanasto
narrower: aiheena oleva versio
narrower: konkordanssihakemisto versiolle
narrower: teoksen versio
preferred label: related expression of work @en
preferred label: version relaterad till verket @sv

aiheena oleva teos
type: Concept
source: RDA-termi
source: RDA-term @sv
created: 2024-12-18
modified: 2025-02-21
Vastavuoroinen suhde: aiheena oleva teos teoksessa
broader: teokseen liittyvä teos
definition: Teos, jota teos koskee. (RDA Registry)
definition: Verk som ett verk handlar om. @sv
in scheme: Metatietosanasto
narrower: arviointi teoksesta
narrower: kuvaus teoksesta
preferred label: subject work @en
preferred label: behandlat verk @sv

tuottaja
type: Concept
source: RDA-termi
source: RDA-term @sv
created: 2016-01-08
modified: 2025-08-23
alternative label: producer @en
alternative label: tuott. (tuottaja)
alternative label: tuottaja (toimija)
alternative label: prod. (producent) @sv
alternative label: producent (aktör) @sv
broader: teoksen tekijä
definition: Toimija, joka vastaa suurimmasta osasta elokuva-, äänite-, televisio-, suoratoisto- tms. tuotannon liiketoiminnallisista tehtävistä. (RDA Registry)
definition: Aktör som svarar för största delen av de kommersiella uppgifterna kring en film-, ljudupptagnings-, tv-, streaming- eller dylik produktion. @sv
in scheme: Metatietosanasto
narrower: televisiotuottaja
narrower: radiotuottaja
narrower: äänituottaja
narrower: elokuvatuottaja
preferred label: producer agent @en
preferred label: producent @sv
scope note: Tuottaja vastaa tyypillisesti rahoituksen hankkimisesta, tuotannon johdosta, avainhenkilöstön palkkaamisesta, jakajien järjestämisestä jne. (RDA Registry)
scope note: En producent svarar typiskt för skaffande av finansiering, ledning av produktion, anställning av nyckelpersonal, ordning av distributörer etc. @sv

aineiston osa
type: Concept
source: RDA-termi
source: RDA-term @sv
created: 2016-01-08
modified: 2025-11-18
Vastavuoroinen suhde: osa aineistoa
alternative label: container of (manifestation) @en
alternative label: manifestaatio sisältää
alternative label: manifestaation osa
alternative label: sisältää
alternative label: sisältää (manifestaatio)
alternative label: innehåller @sv
alternative label: innehåller (manifestation) @sv
broader: aineistoon liittyvä aineisto
definition: Manifestaatio, joka on toisen manifestaation itsenäinen osa. (RDA Registry)
definition: Manifestation som är en självständig del av en annan manifestation. @sv
in scheme: Metatietosanasto
narrower: liite
narrower: näköispainososa
narrower: alakokoelma
preferred label: part manifestation @en
preferred label: del av materialet @sv

kollega
type: Concept
source: RDA-termi
source: RDA-term @sv
created: 2017-01-13
modified: 2025-07-03
broader: henkilöön liittyvä henkilö
definition: Henkilö, joka on saman ammattikunnan, henkilöstön tai tieteenalan jäsen. (RDA Registry)
definition: Person som är medlem av samma yrkeskår, personal eller vetenskapsgren. @sv
in scheme: Metatietosanasto
narrower: assistentti
narrower: kumppani
narrower: työtoveri
narrower: assistentti henkilölle
preferred label: colleague @en

kriitikko
type: Concept
source: Kansallinen RDA-termi
source: YSO-termi
source: ALLFO-term @sv
source: Nationell RDA-term @sv
created: 2018-11-01
modified: 2025-08-21
alternative label: arvostelija (kriitikko)
alternative label: kritiker (kritikerverksamhet) @sv
alternative label: recensent @sv
in scheme: Metatietosanasto
narrower: kirjallisuuskriitikko
narrower: taidekriitikko
narrower: musiikkikriitikko
narrower: elokuvakriitikko
narrower: teatterikriitikko
preferred label: critic @en
preferred label: kritiker @sv

myyjä
type: Concept
source: Kansallinen RDA-termi
source: YSO-termi
source: ALLFO-term @sv
source: Nationell RDA-term @sv
created: 2018-11-01
modified: 2025-03-18
alternative label: myyjä (ammatti)
alternative label: expedit @sv
alternative label: försäljare (yrke) @sv
broader: liiketyöntekijä
in scheme: Metatietosanasto
narrower: varaosamyyjä
narrower: kassamyyjä
narrower: automyyjä
narrower: maatalouskonemyyjä
preferred label: salesperson @en
preferred label: försäljare @sv

mieslaulaja
type: Concept
source: Kansallinen RDA-termi
source: YSO-termi
source: ALLFO-term @sv
source: Nationell RDA-term @sv
created: 2018-11-01
modified: 2024-08-27
alternative label: male singers @en
alternative label: men singers @en
alternative label: laulajat -- miehet
alternative label: mieslaulajat
alternative label: manliga sångare @sv
alternative label: manliga vokalister @sv
alternative label: manssångare @sv
broader: laulaja
in scheme: Metatietosanasto
narrower: baritoni
narrower: basso
narrower: tenori
narrower: kontratenori
preferred label: male singer @en
preferred label: manlig sångare @sv

perinteentaitaja
type: Concept
source: Kansallinen RDA-termi
source: YSO-termi
source: ALLFO-term @sv
source: Nationell RDA-term @sv
created: 2018-11-01
modified: 2024-08-27
alternative label: tradition bearers @en
alternative label: perinteentaitajat
in scheme: Metatietosanasto
narrower: kansankertoja
narrower: kansansoittaja
narrower: itkijä
narrower: kansanlaulaja
narrower: runonlaulaja
preferred label: tradition bearer @en
preferred label: traditionsbärare @sv

taidekäsityöläinen
type: Concept
source: Kansallinen RDA-termi
source: YSO-termi
source: ALLFO-term @sv
source: Nationell RDA-term @sv
created: 2018-11-01
modified: 2024-08-27
alternative label: art-craft professionals @en
alternative label: taidekäsityöläiset
broader: käsityöläinen
in scheme: Metatietosanasto
narrower: tekstiilitaiteilija
narrower: keramiikkataiteilija
narrower: korutaiteilija
narrower: lasitaiteilija
preferred label: art-craft professional @en
preferred label: konsthantverkare @sv

asiantuntija
type: Concept
source: Kansallinen RDA-termi
source: YSO-termi
source: ALLFO-term @sv
source: Nationell RDA-term @sv
created: 2018-11-01
modified: 2024-08-27
alternative label: asiantuntija (ammatti)
alternative label: expert (yrke) @sv
alternative label: sakkunnig @sv
alternative label: sakkännare @sv
alternative label: specialist @sv
in scheme: Metatietosanasto
narrower: tietoasiantuntija
narrower: viestintäasiantuntija
narrower: tekniikan erityisasiantuntija
narrower: atk-asiantuntija
narrower: erityisasiantuntija
preferred label: specialist (expert) @en
preferred label: expert @sv

esittäjä
type: Concept
source: Kansallinen RDA-termi
source: YSO-termi
source: ALLFO-term @sv
source: Nationell RDA-term @sv
created: 2018-11-01
modified: 2024-08-27
alternative label: esittäjä (ammatti)
alternative label: framförare (yrke) @sv
alternative label: framställare @sv
in scheme: Metatietosanasto
narrower: virtuoosi
narrower: solisti
narrower: kapellimestari
narrower: katusoittaja
narrower: kuoronjohtaja
preferred label: performing artist @en
preferred label: framförare @sv

ohjaaja (taiteet ja media)
type: Concept
source: Kansallinen RDA-termi
source: YSO-termi
source: ALLFO-term @sv
source: Nationell RDA-term @sv
created: 2018-11-01
modified: 2024-08-27
alternative label: directors @en
alternative label: ohjaajat
alternative label: regissörer @sv
broader: taiteilija
in scheme: Metatietosanasto
narrower: televisio-ohjaaja
narrower: elokuvaohjaaja
narrower: oopperaohjaaja
narrower: teatteriohjaaja
preferred label: director (artist) @en
preferred label: regissör @sv

sovitettu käsikirjoitukseksi
type: Concept
source: RDA-termi
source: RDA-term @sv
created: 2018-11-13
modified: 2025-08-19
Vastavuoroinen suhde: käsikirjoituksen perustana oleva teos
alternative label: sovitettu käsikirjoitukseksi (teos)
alternative label: teokseen perustuva käsikirjoitus
alternative label: bearbetad till manuskript (verk) @sv
alternative label: manuskript baserat på verk @sv
broader: mukaelma
definition: Teos, joka koostuu toiseen teokseen perustuvasta elokuvan, televisio-ohjelman tai videon käsikirjoituksesta. (RDA Registry)
definition: Verk som består av ett manuskript till en film, ett tv-program eller en video som grundar sig på ett annat verk. @sv
in scheme: Metatietosanasto
narrower: sovitettu televisiokäsikirjoitukseksi
narrower: sovitettu videokäsikirjoitukseksi
narrower: sovitettu elokuvakäsikirjoitukseksi
preferred label: adapted as screenplay work @en
preferred label: bearbetad till manuskript @sv

käsikirjoituksen perustana oleva teos
type: Concept
source: RDA-termi
source: RDA-term @sv
created: 2018-12-08
modified: 2025-07-04
Vastavuoroinen suhde: sovitettu käsikirjoitukseksi
alternative label: käsikirjoituksen perustana
alternative label: käsikirjoituksen perustana (teos)
alternative label: manuskript baserat på @sv
alternative label: manuskript baserat på (verk) @sv
broader: mukaelma teoksesta
definition: Teos, joka on sovitettu elokuvan, televisio-ohjelman tai videon käsikirjoitukseksi. (RDA Registry)
definition: Verk som är bearbetat till manuskript till en film, ett tv-program eller en video. @sv
in scheme: Metatietosanasto
narrower: elokuvakäsikirjoituksen perustana oleva teos
narrower: videokäsikirjoituksen perustana oleva teos
narrower: televisiokäsikirjoituksen perustana oleva teos
preferred label: screenplay based on work @en
preferred label: manuskript baserat på verket @sv

käsikirjoitus
type: Concept
source: RDA-termi
source: RDA-term @sv
created: 2019-01-04
modified: 2025-07-04
Vastavuoroinen suhde: käsikirjoitus teokseen
alternative label: käsikirjoitus (teos)
alternative label: manuskript (verk) @sv
broader: tekstiteos
definition: Teos, joka on tekstiteos, joka täydentää teosta, joka käyttää käsikirjoitusta. (RDA Registry)
definition: Verk som är ett textverk, som kompletterar ett verk som använder ett manuskript. @sv
in scheme: Metatietosanasto
narrower: televisio-ohjelman käsikirjoitus
narrower: elokuvan käsikirjoitus
narrower: videon käsikirjoitus
preferred label: screenplay work @en
preferred label: manuskript @sv

käsikirjoitus teokseen
type: Concept
source: RDA-termi
source: RDA-term @sv
created: 2019-01-04
modified: 2025-07-04
Vastavuoroinen suhde: käsikirjoitus
broader: teksti teokseen
definition: Teos, joka käyttää käsikirjoitusta ja jota on täydennetty tekstiteoksella. (RDA Registry)
definition: Verk som använder ett manuskript och som kompletterats med ett textverk. @sv
in scheme: Metatietosanasto
narrower: käsikirjoitus televisio-ohjelmaan
narrower: käsikirjoitus videoon
narrower: käsikirjoitus elokuvaan
preferred label: screenplay for work @en
preferred label: manuskript till verket @sv

sisäasiainhallinto
type: Concept
source: Kansallinen RDA-termi
source: Nationell RDA-term @sv
created: 2019-03-13
modified: 2026-05-06
broader: julkinen hallinto
example: sisäasiainministeriö, lääninhallitukset, aluehallintovirastot, poliisilaitokset, nimismiespiirit, kunnat, kuntayhtymät, siirtoväen huollon viranomaiset, Valtion pakolaisavustuskeskus, henkikirjoittajat, maistraatit, kruununvuodit, rajavartiostot
example: inrikesministeriet, länsstyrelser, regionförvaltningsverk, polisinrättningar, länsmansdistrikt, kommuner, samkommuner, myndigheter för vård av de evakuerade, Statens flyktinghjälpcentral, mantalsskrivare, magistrater, kronofogdar, gränsbevakningsavdelningar @sv
in scheme: Metatietosanasto
narrower: kunnallishallinto
narrower: sisäinen turvallisuus
narrower: aluehallinto
narrower: rajavalvonta
preferred label: inrikesförvaltning @sv

puolustusvoimat
type: Concept
source: Kansallinen RDA-termi
source: Nationell RDA-term @sv
created: 2019-03-13
modified: 2026-05-06
definition: Puolustusvoimien (maa-, meri- ja ilmavoimien) johto-organisaatiot, sotilasyksiköt ja muut joukko-osastot, varuskunnat ja varikot sekä Ruotsin vallan ajan, autonomian ajan ja sota-aikojen joukot. Pääluokkaan eivät kuulu puolustusministeriö ja sen johtaman puolustushallinnon toimijat (ks. puolustushallinto), sotilasalan koulut (ks. koulutus), sotaoikeudet (ks. oikeushallinto), sotilassairaalat (ks. terveys- ja sosiaaliala), rajavartiosto (ks. sisäasiainhallinto)
definition: Försvarsmaktens (arméns, marinens och flygvapnets) ledande organisationer, förband och andra truppavdelningar, garnisoner och depåer, samt trupper under den svenska tiden, autonoma tiden och krigstiderna. Till huvudkategorin hör inte försvarsministeriet och försvarsförvaltningens aktörer som det leder (se försvarsförvaltning), militärbranschens skolor (se utbildning), krigsrätter (se justitieförvaltning), militärsjukhus (se hälso- och socialvårdsbranschen), gränsbevakningsväsendet (se inrikesförvaltning). @sv
in scheme: Metatietosanasto
narrower: ilmavoimat
narrower: huoltojoukot
narrower: maavoimat
narrower: merivoimat
narrower: puolustusvoimain ylin johto
preferred label: försvarsmakten @sv

oikeushallinto
type: Concept
source: Kansallinen RDA-termi
source: Nationell RDA-term @sv
created: 2019-03-13
modified: 2026-05-06
alternative label: rättsförvaltning @sv
broader: julkinen hallinto
example: oikeusministeriö, korkein oikeus, hovioikeudet, hallinto-oikeudet, erikoisoikeudet, käräjäkunnat, tuomiokunnat, vankilat, sotavankileirit, kaupunginviskaalit
example: justitieministeriet, högsta domstolen, hovrätter, förvaltningsdomstolar, singulärrätter, tingslag, domsagor, fängelser, krigsfångeläger, stadsfiskaler @sv
in scheme: Metatietosanasto
narrower: vankeinhoito
narrower: vaalitoimi
narrower: syyttäjätoimi
narrower: ulosottotoimi
preferred label: justitieförvaltning @sv

käsikirjoituksen perustana oleva versio
type: Concept
source: RDA-termi
source: RDA-term @sv
created: 2020-03-07
modified: 2025-07-04
Vastavuoroinen suhde: teoksen versio sovitettu käsikirjoitukseksi
alternative label: käsikirjoituksen perustana
alternative label: käsikirjoituksen perustana (ekspressio)
alternative label: käsikirjoituksen perustana oleva ekspressio
alternative label: manuskript baserat på @sv
alternative label: manuskript baserat på (uttryck) @sv
alternative label: manuskript baserat på uttrycket @sv
broader: mukaelma versiosta
definition: Teoksen ekspressio, joka on sovitettu elokuvan, televisio-ohjelman tai videon käsikirjoitukseksi. (RDA Registry)
definition: Uttryck av verk som är bearbetat till manuskript till en film, ett tv-program eller en video. @sv
in scheme: Metatietosanasto
narrower: elokuvakäsikirjoituksen perustana oleva versio
narrower: videokäsikirjoituksen perustana oleva versio
narrower: televisiokäsikirjoituksen perustana oleva versio
preferred label: screenplay based on expression @en
preferred label: manuskript baserat på versionen @sv

teoksen versio sovitettu käsikirjoitukseksi
type: Concept
source: RDA-termi
source: RDA-term @sv
created: 2020-04-02
modified: 2025-08-23
Vastavuoroinen suhde: käsikirjoituksen perustana oleva versio
alternative label: ekspressioon perustuva käsikirjoitus
alternative label: sovitettu käsikirjoitukseksi
alternative label: sovitettu käsikirjoitukseksi (ekspressio)
alternative label: bearbetad till manuskript @sv
alternative label: bearbetad till manuskript (uttryck) @sv
alternative label: manuskript baserat på uttryck @sv
broader: mukaelma
definition: Teoksen ekspressio, joka koostuu toisen teoksen ekspressioon perustuvasta elokuvan, televisio-ohjelman tai videon käsikirjoituksesta. (RDA Registry)
definition: Uttryck av verk, som består av ett manuskript till en film, ett tv-program eller en video som grundar sig på ett annat verks uttryck. @sv
in scheme: Metatietosanasto
narrower: sovitettu televisiokäsikirjoitukseksi
narrower: sovitettu elokuvakäsikirjoitukseksi
narrower: sovitettu videokäsikirjoitukseksi
preferred label: adapted as screenplay expression @en
preferred label: version bearbetad till manuskript @sv

käsikirjoitus teoksen versioon
type: Concept
source: RDA-termi
source: RDA-term @sv
created: 2020-04-17
modified: 2025-07-04
Vastavuoroinen suhde: käsikirjoitus
alternative label: käsikirjoitus ekspressioon
alternative label: manuskript till uttrycket @sv
broader: täydentävä teoksen versio
definition: Teoksen, kuten elokuvan, television tai videon, ekspressio, joka käyttää teoksen tekstiä käsikirjoituksena. (RDA Registry)
definition: Uttryck av ett verk, såsom en film, ett tv-program eller en video, som använder ett verks text som manuskript. @sv
in scheme: Metatietosanasto
narrower: käsikirjoitus videoon
narrower: käsikirjoitus elokuvaan
narrower: käsikirjoitus televisio-ohjelmaan
preferred label: screenplay for expression @en
preferred label: manuskript till versionen @sv

käsikirjoitus
type: Concept
source: RDA-termi
source: RDA-term @sv
created: 2020-04-17
modified: 2025-07-04
Vastavuoroinen suhde: käsikirjoitus teoksen versioon
alternative label: käsikirjoitus (ekspressio)
alternative label: manuskript (uttryck) @sv
broader: täydentävä teoksen versio
definition: Teoksen ekspressio, joka on elokuvan, televisio-ohjelman tai videon käsikirjoitus. (RDA Registry)
definition: Uttryck av verk som är manuskript ttill en film, ett tv-program eller en video. @sv
in scheme: Metatietosanasto
narrower: videon käsikirjoitus
narrower: elokuvan käsikirjoitus
narrower: televisio-ohjelman käsikirjoitus
preferred label: screenplay expression @en
preferred label: manuskript @sv

kunta (hallintoalue)
type: Concept
source: Kansallinen RDA-termi
source: Nationell RDA-term @sv
created: 2021-04-20
modified: 2025-10-30
alternative label: hallintopitäjä
alternative label: kaupunki (hallintoalue)
alternative label: paikkakunta (hallintoalue)
alternative label: administrativ socken @sv
alternative label: ort (förvaltningsområde) @sv
alternative label: stad (förvaltningsområde) @sv
definition: Valtakunnallisen tai alueellisen organisaation paikallishallinnon yksikölle määritelty toimialue, esim. yhden kunnan alue.
definition: Verksamhetsområde för en lokal förvaltningsenhet inom en nationell eller regional organisation, t.ex. en kommuns område. @sv
example: Kouvolan verotoimisto; Suomussalmen metsänhoitoalue; Tuusniemen posti- ja lennätintoimisto
example: Kouvola skattebyrå; Suomussalmi forstrevir; Tuusniemi post- och telegrafkontor @sv
in scheme: Metatietosanasto
preferred label: kommun (förvaltningsområde) @sv
related: kaupunki
related: kuntayhtymä
related: kihlakunta
related: seutukunta
related: kunta
scope note: Voidaan käyttää valitun yhteisön kategorian lisäksi täsmentämään, että ko. julkishallinnollinen yhteisö on paikallinen organisaatio. Kunnallishallinnon organisaatioista voi käyttää myös yhteisön muotoa tarkentavia yhteisön kategorian termejä kunta ja kaupunki. Kuntayhtymästä käytä yhteisön kategorian termiä kuntayhtymä. Seurakunnasta käytä yhteisön kategorian termiä seurakunta. Seurakuntayhtymistä käytä yhteisön kategorian termiä seurakuntayhtymä.
scope note: Kan användas utöver en kategori av institution, för att precisera att den offentligrättsliga institutionen i fråga är en lokal organisation. Om kommunalförvaltningens organisationer kan också termerna kommun och stad användas som kategori av institution för precisera institutionens form. Om samkommun används termen samkommun som kategori av institution. Om församling används termen församling som kategori av institution. Om kyrklig samfällighet används termen kyrklig samfällighet som kategori av institution. @sv

maakunta
type: Concept
source: Kansallinen RDA-termi
source: Nationell RDA-term @sv
created: 2021-12-08
modified: 2025-08-29
alternative label: provinssi
alternative label: provins @sv
definition: Aluehallinnon yksikkö tai sen toimialue, jota kutsutaan maakunnaksi. Myös maakunnaksi kutsuttu liittovaltion osa.
definition: Enhet eller verksamhetsområde för regional förvaltning, som benämns landskap. @sv
example: Satakunta; Pohjois-Savo; Lappi
example: Satakunta; Norra Savolax; Lappland @sv
in scheme: Metatietosanasto
preferred label: landskap @sv
related: piiri (hallintoalue)
related: alue (hallintoalue)
related: piirikunta
related: lääni
related: seutukunta
scope note: Voidaan käyttää valitun yhteisön kategorian lisäksi täsmentämään, että ko. julkishallinnollinen yhteisö on maakunnallinen organisaatio.
scope note: Kan användas utöver en vald kategori av institution för att precisera att den offentligrättsliga institutionen i fråga är en organisation på landskapsnivå. @sv

harrastusjärjestöt
type: Concept
source: Kansallinen RDA-termi
source: Nationell RDA-term @sv
created: 2022-03-15
modified: 2026-05-06
alternative label: kalastusseurat
alternative label: kalastusyhdistykset
alternative label: kameraseurat
alternative label: metsästysjärjestöt
alternative label: metsästysseurat
alternative label: metsästysyhdistykset
alternative label: nimikkoseurat
alternative label: pursiseurat
alternative label: veneilyseurat
alternative label: båtklubbar @sv
alternative label: fiskeföreningar @sv
alternative label: fiskesällskap @sv
alternative label: fritidsorganisationer @sv
alternative label: jaktföreningar @sv
alternative label: jaktorganisationer @sv
alternative label: jaktsällskap @sv
alternative label: kameraklubbar @sv
alternative label: personsällskap @sv
alternative label: segelsällskap @sv
broader: järjestötoiminta
definition: Vapaa-ajan harrastustoimintaa tarjoavat ja kannattajatoimintaa harjoittavat järjestöt.
definition: Organisationer som erbjuder hobbyverksamhet på fritiden och ordnar stödverksamhet för sådan. @sv
in scheme: Metatietosanasto
preferred label: hobbyorganisationer @sv
related: kulttuurijärjestöt
related: liikuntajärjestöt
related: kotiseutuyhdistykset
related: sukuseurat
scope note: Kulttuuri- ja sivistys- ja opintotoimintaa harjoittavista järjestöistä käytä termiä kulttuurijärjestöt.
scope note: Paikallista tai alueellista perinne- ja kulttuuritoimintaa harjoittavista järjestöistä käytä termiä kotiseutuyhdistykset.
scope note: Sukututkimusta edistävistä sekä sukuperinnettä ja suvun yhteenkuuluvuutta ylläpitävistä järjestöistä käytä termiä sukuseurat.
scope note: Urheilu- ja liikuntatoimintaa edistävistä järjestöistä käytä termiä liikuntajärjestöt.
scope note: Om organisationer som främjar släktforskning och upprätthåller släkttradition och -sammanhållning används termen släktföreningar. @sv
scope note: Om organisationer som främjar sport- och idrottsverksamhet används termen idrottsorganisationer. @sv
scope note: Om organisationer som utövar kultur-, bildnings-, eller studieverksamhet används termen kulturorganisationer. @sv
scope note: Om organisationer som utövar lokal eller regional traditions- och kulturverksamhet används termen hembygdsföreningar. @sv

ääni
type: Concept
created: 2023-01-21
modified: 2023-05-05
in scheme: Metatietosanasto
narrower: puhe
narrower: tapahtumatallenne
narrower: haastattelu
narrower: radio-ohjelma
narrower: musiikki
preferred label: ljud @sv

tuottaja
type: Concept
source: RDA-termi
source: RDA-term @sv
created: 2024-12-18
modified: 2025-08-23
alternative label: tuottaja (yhteisö)
alternative label: producent (institution) @sv
broader: teoksen tekijä
definition: Yhteisö, joka on vastuussa suurimmasta osasta elokuva-, äänite-, televisio-, suoratoisto- tms. tuotannon liiketoiminnallisista tehtävistä. (RDA Registry)
definition: Institution som svarar för största delen av de kommersiella uppgifterna kring en film-, ljudupptagnings-, tv-, streaming- eller dylik produktion. @sv
in scheme: Metatietosanasto
narrower: televisiotuottaja
narrower: äänituottaja
narrower: elokuvatuottaja
narrower: radiotuottaja
preferred label: producer corporate body @en
preferred label: producent @sv
scope note: Tuottaja vastaa tyypillisesti rahoituksen hankkimisesta, tuotannon johdosta, avainhenkilöstön palkkaamisesta, jakajien järjestämisestä jne. (RDA Registry)
scope note: En producent svarar typiskt för skaffande av finansiering, ledning av produktion, anställning av nyckelpersonal, ordning av distributörer etc. @sv

muunnos yleisössä teoksesta
type: Concept
source: RDA-termi
source: RDA-term @sv
created: 2024-12-18
modified: 2025-08-15
Vastavuoroinen suhde: muunnos yleisössä
broader: muunnos teoksesta
definition: Teos, jolla on yleisö, jota on muutettu teoksen luomiseksi. (RDA Registry)
definition: Verk med en målgrupp som har ändrats för att skapa ett verk. @sv
in scheme: Metatietosanasto
narrower: kieliversio teoksesta
narrower: tallenneversio teoksesta
narrower: alueversio teoksesta
preferred label: transformation by audience of @en
preferred label: variant av målgrupp för verket @sv

lähdeversio
type: Concept
source: RDA-termi
source: RDA-term @sv
created: 2024-12-18
modified: 2025-04-05
Vastavuoroinen suhde: johdannaisversio
alternative label: lähde-ekspressio
alternative label: källuttryck @sv
broader: versioon liittyvä versio
definition: Ekspressio, jota on muokattu uuden ekspression luomiseksi samasta teoksesta. (RDA Registry)
definition: Uttryck som har bearbetats för att skapa ett nytt uttryck av samma verk. @sv
in scheme: Metatietosanasto
narrower: sovituksen perusta
narrower: uudistetun version perusta
narrower: käännöksen perusta
preferred label: source expression @en
preferred label: källversion @sv

muunnos yleisössä
type: Concept
source: RDA-termi
source: RDA-term @sv
created: 2024-12-18
modified: 2025-08-15
Vastavuoroinen suhde: muunnos yleisössä teoksesta
broader: muunnos
definition: Teos, joka on luotu muuttamalla teoksen yleisöä. (RDA Registry)
definition: Verk som har skapats genom att ändra målgrupp för ett verk. @sv
in scheme: Metatietosanasto
narrower: alueversio
narrower: tallenneversio
narrower: kieliversio
preferred label: transformation by audience @en
preferred label: variant av målgrupp @sv

muunnos laajennussuunnitelmassa
type: Concept
source: RDA-termi
source: RDA-term @sv
created: 2024-12-18
modified: 2025-04-09
Vastavuoroinen suhde: muunnos laajennussuunnitelmassa teoksesta
broader: muunnos linjassa
definition: Teos, joka on luotu muuttamalla teoksen laajennussuunnitelmaa. (RDA Registry)
definition: Verk som har skapats genom att ändra utvidgningsplanen för ett verk. @sv
in scheme: Metatietosanasto
narrower: staattinen versio
narrower: sarjaversio
narrower: peräkkäisversio
preferred label: transformation by extension plan @en
preferred label: variant av utvidgningsplan @sv

kappaletta kuvaava teos
type: Concept
source: RDA-termi
source: RDA-term @sv
created: 2024-12-18
modified: 2025-03-21
Vastavuoroinen suhde: kuvaus kappaleesta
alternative label: described in (item) @en
alternative label: kappaleen kuvaus
alternative label: beskrivning av exemplaret @sv
broader: kappale aiheena teoksessa
definition: Teos, joka kuvaa kappaletta. (RDA Registry)
definition: Verk som beskriver ett exemplar. @sv
in scheme: Metatietosanasto
narrower: kappaleen kommentaari
narrower: kappaleen analyysi
narrower: kappaletta metatiedoilla kuvaileva teos
preferred label: item described by @en
preferred label: verk som beskriver exemplaret @sv

versioon liittyvä teos
type: Concept
source: RDA-termi
source: RDA-term @sv
created: 2024-12-18
modified: 2025-08-23
Vastavuoroinen suhde: teokseen liittyvä versio
alternative label: ekspressioon liittyvä teos
alternative label: verk relaterat till uttrycket @sv
definition: Teos, joka liittyy ekspressioon. (RDA Registry)
definition: Verk som relaterar till ett uttryck. @sv
in scheme: Metatietosanasto
narrower: teos
narrower: versio aiheena teoksessa
narrower: edustava versio teokselle
narrower: konkordanssihakemisto
preferred label: related work of expression @en
preferred label: verk relaterat till versionen @sv

kirjoittaja
type: Concept
source: RDA-termi
source: RDA-term @sv
created: 2016-01-08
modified: 2025-07-03
alternative label: author @en
alternative label: kirjoittaja (toimija)
alternative label: författare (aktör) @sv
broader: teoksen tekijä
definition: Toimija, joka on vastuussa tekstiteoksen luomisesta. (RDA Registry)
definition: Aktör som svarar för skapandet av ett textverk. @sv
in scheme: Metatietosanasto
narrower: kokousten raportoija
narrower: libretisti
narrower: sanoittaja
narrower: käsikirjoittaja
preferred label: author agent @en
preferred label: författare @sv
scope note: Kattaa uuden teoksen luomisen toisen tekijän teoksia mukailemalla, muokkaamalla tai sovittamalla, mikäli muutos on olennaisesti muuttanut alkuperäisen luonnetta ja sisältöä tai muuttanut ilmaisumuotoa. (RDA Registry)
scope note: Innefattar skapandet av ett nytt verk genom att omarbeta, redigera eller arrangera ett verk av en annan upphovsperson, såvida ändringen väsentligen har ändrat originalets karaktär och innehåll eller uttrycksform. @sv

johdannaisversio
type: Concept
source: RDA-termi
source: RDA-term @sv
created: 2024-12-18
modified: 2025-07-01
Vastavuoroinen suhde: lähdeversio
alternative label: johdannaisekspressio
alternative label: härlett uttryck @sv
broader: versioon liittyvä versio
definition: Ekspressio, joka on muunnos saman teoksen toisesta ekspressiosta. (RDA Registry)
definition: Uttryck som är en variant av ett annat uttryck av samma verk. @sv
in scheme: Metatietosanasto
narrower: uudistettu versio
narrower: käännös
narrower: sovitus
preferred label: derivative expression @en
preferred label: härledd version @sv

aineistoon liittyvä yhteisö
type: Concept
source: RDA-termi
source: RDA-term @sv
created: 2024-12-18
modified: 2025-04-15
alternative label: manifestaatioon liittyvä yhteisö
alternative label: institution relaterad till manifestationen @sv
definition: Yhteisö, joka liittyy manifestaatioon. (RDA Registry)
definition: Institution som relaterar till en manifestation. @sv
in scheme: Metatietosanasto
narrower: aggregaattiin osallinen yhteisö
narrower: aineiston tekijä
narrower: paperinvalmistaja
narrower: jakelija
narrower: esittäjä
preferred label: related corporate body of manifestation @en
preferred label: institution relaterad till materialet @sv

muunnos laajennussuunnitelmassa teoksesta
type: Concept
source: RDA-termi
source: RDA-term @sv
created: 2024-12-18
modified: 2025-08-15
Vastavuoroinen suhde: muunnos laajennussuunnitelmassa
broader: muunnos linjassa teoksesta
definition: Teos, jolla on laajennussuunnitelma, jota on muutettu teoksen luomiseksi. (RDA Registry)
definition: Verk med en utvidgningsplan, som har ändrats för att skapa ett verk. @sv
in scheme: Metatietosanasto
narrower: staattinen versio teoksesta
narrower: peräkkäisversio teoksesta
narrower: sarjaversio teoksesta
preferred label: transformation by extension plan of @en
preferred label: variant av utvidgningsplan för verket @sv

aineistoa kuvaava teos
type: Concept
source: RDA-termi
source: RDA-term @sv
created: 2024-12-18
modified: 2025-01-16
Vastavuoroinen suhde: kuvaus aineistosta
alternative label: described in (manifestation) @en
alternative label: manifestaation kuvaus
alternative label: manifestaatiota kuvaava teos
alternative label: beskrivning av manifestationen @sv
alternative label: verk som beskriver manifestationen @sv
broader: aineisto aiheena teoksessa
definition: Teos, joka kuvaa manifestaatiota. (RDA Registry)
definition: Verk som beskriver en manifestation. @sv
in scheme: Metatietosanasto
narrower: aineistoa metatiedoilla kuvaileva teos
narrower: aineiston analyysi
narrower: aineiston kommentaari
preferred label: manifestation described by @en
preferred label: verk som beskriver materialet @sv

kuvaus aineistosta
type: Concept
source: RDA-termi
source: RDA-term @sv
created: 2024-12-18
modified: 2025-07-04
Vastavuoroinen suhde: aineistoa kuvaava teos
alternative label: kuvaus manifestaatiosta
alternative label: beskrivning av manifestationen @sv
broader: aiheena oleva aineisto
definition: Manifestaatio, jota teos kuvaa. (RDA Registry)
definition: Manifestation som ett verk beskriver. @sv
in scheme: Metatietosanasto
narrower: kommentaari aineistosta
narrower: analyysi aineistosta
narrower: metatietokuvailu aineistosta
preferred label: description of manifestation @en
preferred label: beskrivning av materialet @sv

kuvaus versiosta
type: Concept
source: RDA-termi
source: RDA-term @sv
created: 2024-12-18
modified: 2025-07-04
Vastavuoroinen suhde: versiota kuvaava teos
alternative label: kuvaus ekspressiosta
alternative label: beskrivning av uttrycket @sv
broader: aiheena oleva versio
definition: Ekspressio, jota teos kuvaa. (RDA Registry)
definition: Uttryck som ett verk beskriver. @sv
in scheme: Metatietosanasto
narrower: metatietokuvailu versiosta
narrower: analyysi versiosta
narrower: kommentaari versiosta
preferred label: description of expression @en
preferred label: beskrivning av versionen @sv

teoksen version tekijä
type: Concept
source: RDA-termi
source: RDA-term @sv
created: 2024-12-18
modified: 2026-03-10
alternative label: ekspression tekijä (yhteisö)
alternative label: skapare (institution) av uttryck @sv
broader: versioon liittyvä yhteisö
definition: Yhteisö, joka on vastuussa teoksen toteutuksesta. (RDA Registry)
definition: Institution som svarar för förverkligandet av ett verk. @sv
in scheme: Metatietosanasto
narrower: kääntäjä
narrower: tarkistaja
narrower: yhdistymään osallinen yhteisö
narrower: selkomukauttaja
preferred label: creator corporate body of expression @en
preferred label: skapare av version @sv
scope note: Ekspression tekijään kuuluvat kääntäjä, sovittaja, esittäjä jne. Ekspression toteuttaman teoksen tekijä on myös ekspression tekijä. (RDA Registry)
scope note: Till skapare av ett uttryck hör översättare, arrangör, framförande aktör etc. Skapare av ett verk som förverkligas av ett uttryck är också skapare av ett uttryck. @sv

kappaleeseen liittyvä henkilö
type: Concept
source: RDA-termi
source: RDA-term @sv
created: 2024-12-18
modified: 2025-07-03
definition: Henkilö, joka liittyy kappaleeseen. (RDA Registry)
definition: Person som relaterar till ett exemplar. @sv
in scheme: Metatietosanasto
narrower: muokkaaja
narrower: kappaleen omistuksen kohde
narrower: omistaja
narrower: säilyttäjä
narrower: kappaleella kunnioitettu henkilö
preferred label: related person of item @en
preferred label: person relaterad till exemplaret @sv

kappaleeseen liittyvä yhteisö
type: Concept
source: RDA-termi
source: RDA-term @sv
created: 2024-12-18
modified: 2025-07-03
definition: Yhteisö, joka liittyy kappaleeseen. (RDA Registry)
definition: Institution som relaterar till ett exemplar. @sv
in scheme: Metatietosanasto
narrower: kappaleella kunnioitettu yhteisö
narrower: omistaja
narrower: säilyttäjä
narrower: muokkaaja
narrower: kappaleen omistuksen kohde
preferred label: related corporate body of item @en
preferred label: institution relaterad till exemplaret @sv

kappaleeseen liittyvä toimija
type: Concept
source: RDA-termi
source: RDA-term @sv
created: 2024-12-18
modified: 2026-01-23
alternative label: other agent associated with item @en
alternative label: kappaleeseen liittyvä muu toimija
alternative label: annan aktör relaterad till exemplaret @sv
definition: Toimija, joka liittyy kappaleeseen. (RDA Registry)
definition: Aktör som relaterar till ett exemplar. @sv
in scheme: Metatietosanasto
narrower: kappaleen omistuksen kohde
narrower: kappaleella kunnioitettu toimija
narrower: omistaja
narrower: säilyttäjä
narrower: muokkaaja
preferred label: related agent of item @en
preferred label: aktör relaterad till exemplaret @sv

tuottaja
type: Concept
source: RDA-termi
source: RDA-term @sv
created: 2024-12-18
modified: 2025-08-23
alternative label: tuottaja (henkilö)
alternative label: producent (person) @sv
broader: teoksen tekijä
definition: Henkilö, joka on vastuussa suurimmasta osasta elokuva-, äänite-, televisio-, suoratoisto- tms. tuotannon liiketoiminnallisista tehtävistä. (RDA Registry)
definition: Person som svarar för största delen av de kommersiella uppgifterna kring en film-, ljudupptagnings-, tv-, streaming- eller dylik produktion. @sv
in scheme: Metatietosanasto
narrower: elokuvatuottaja
narrower: televisiotuottaja
narrower: radiotuottaja
narrower: äänituottaja
preferred label: producer person @en
preferred label: producent @sv
scope note: Tuottaja vastaa tyypillisesti rahoituksen hankkimisesta, tuotannon johdosta, avainhenkilöstön palkkaamisesta, jakajien järjestämisestä jne. (RDA Registry)
scope note: En producent svarar typiskt för skaffande av finansiering, ledning av produktion, anställning av nyckelpersonal, ordning av distributörer etc. @sv

versiota kuvaava teos
type: Concept
source: RDA-termi
source: RDA-term @sv
created: 2024-12-18
modified: 2025-03-21
Vastavuoroinen suhde: kuvaus versiosta
alternative label: described in (expression) @en
alternative label: ekspressiota kuvaava teos
alternative label: kuvattu teoksessa (ekspressio)
alternative label: beskriven i verket (uttryck) @sv
alternative label: verk som beskriver uttrycket @sv
broader: versio aiheena teoksessa
definition: Teos, joka on ekspression kuvaus. (RDA Registry)
definition: Verk som är en beskrivning av ett uttryck. @sv
in scheme: Metatietosanasto
narrower: versiota metatiedoilla kuvaileva teos
narrower: version kommentaari
narrower: version analyysi
preferred label: expression described by @en
preferred label: verk som beskriver versionen @sv

kuvaus kappaleesta
type: Concept
source: RDA-termi
source: RDA-term @sv
created: 2024-12-18
modified: 2025-07-04
Vastavuoroinen suhde: kappaletta kuvaava teos
broader: aiheena oleva kappale
definition: Kappale, jota teos kuvaa. (RDA Registry)
definition: Exemplar som ett verk beskriver. @sv
in scheme: Metatietosanasto
narrower: analyysi kappaleesta
narrower: metatietokuvailu kappaleesta
narrower: kommentaari kappaleesta
preferred label: description of item @en
preferred label: beskrivning av exemplaret @sv

aineistoon liittyvä henkilö
type: Concept
source: RDA-termi
source: RDA-term @sv
created: 2024-12-18
modified: 2025-04-15
alternative label: manifestaatioon liittyvä henkilö
alternative label: person relaterad till manifestationen @sv
definition: Henkilö, joka liittyy manifestaatioon. (RDA Registry)
definition: Person som relaterar till en manifestation. @sv
in scheme: Metatietosanasto
narrower: esittäjä
narrower: aggregaattiin osallinen henkilö
narrower: jakelija
narrower: aineiston tekijä
narrower: paperinvalmistaja
preferred label: related person of manifestation @en
preferred label: person relaterad till materialet @sv

tapahtuma
type: Concept
source: Kansallinen RDA-termi
source: Nationell RDA-term @sv
created: 2016-01-08
modified: 2024-05-24
alternative label: juhla (tapahtuma)
alternative label: kiertue
alternative label: leiri (tapahtuma)
alternative label: maatalousnäyttely
alternative label: markkinat
alternative label: matka (tapahtuma)
alternative label: messut (tapahtuma)
alternative label: paraati
alternative label: retki (tapahtuma)
alternative label: retriitti
alternative label: fest (evenemang) @sv
alternative label: lantbruksutställning @sv
alternative label: läger (evenemang) @sv
alternative label: marknad @sv
alternative label: mässa (evenemang) @sv
alternative label: parad @sv
alternative label: resa (evenemang) @sv
alternative label: retreat @sv
alternative label: turné @sv
alternative label: utfärd (evenemang) @sv
example: Kainuun rastiviikko (tapahtuma)
example: Jakobs dagar (evenemang) @sv
in scheme: Metatietosanasto
narrower: festivaali
narrower: näyttely
narrower: urheilutapahtuma
narrower: kilpailu (tapahtuma)
narrower: konferenssi/seminaari
preferred label: evenemang @sv

valtuutettu
type: Concept
source: Kansallinen RDA-termi
source: YSO-termi
source: ALLFO-term @sv
source: Nationell RDA-term @sv
created: 2018-11-01
modified: 2024-08-27
alternative label: councillors @en
alternative label: delegates @en
alternative label: representatives @en
alternative label: valtuutetut
alternative label: delegater @sv
alternative label: fullmaktsinnehavare @sv
alternative label: fullmäktige @sv
alternative label: fullmäktigeledamoter @sv
in scheme: Metatietosanasto
narrower: tasa-arvovaltuutettu
narrower: lapsiasiavaltuutettu
narrower: kunnanvaltuutettu
narrower: kaupunginvaltuutettu
narrower: yhdenvertaisuusvaltuutettu
narrower: ihmisoikeusvaltuutettu
preferred label: representative @en
preferred label: fullmäktig @sv

psykologi
type: Concept
source: Kansallinen RDA-termi
source: YSO-termi
source: ALLFO-term @sv
source: Nationell RDA-term @sv
created: 2018-11-01
modified: 2024-08-27
alternative label: psychologists @en
alternative label: psykologit
alternative label: psykologer @sv
in scheme: Metatietosanasto
narrower: opintopsykologi
narrower: neuropsykologi
narrower: sosiaalipsykologi
narrower: koulupsykologi
narrower: ammatinvalintapsykologi
narrower: kriminaalipsykologi
preferred label: psychologist @en
preferred label: psykolog @sv

maatalousyrittäjä
type: Concept
source: Kansallinen RDA-termi
source: YSO-termi
source: ALLFO-term @sv
source: Nationell RDA-term @sv
created: 2018-11-01
modified: 2024-08-27
alternative label: agricultural entrepreneurs @en
alternative label: maataloustuottajat
alternative label: maatalousyrittäjät
alternative label: jordbruksföretagare @sv
alternative label: jordbruksproducenter @sv
alternative label: lantbruksproducenter @sv
broader: yrittäjä
broader: tuottaja
in scheme: Metatietosanasto
narrower: turkistarhaaja
narrower: maanviljelijä
narrower: kotieläintuottaja
narrower: kalanviljelijä
preferred label: agricultural entrepreneur @en
preferred label: lantbruksföretagare @sv

tuottaja
type: Concept
source: Kansallinen RDA-termi
source: YSO-termi
source: ALLFO-term @sv
source: Nationell RDA-term @sv
created: 2018-11-01
modified: 2024-08-27
alternative label: producers @en
alternative label: tuottajat
alternative label: producenter @sv
in scheme: Metatietosanasto
narrower: äänitetuottaja
narrower: kulttuurituottaja
narrower: palveluntuottaja
narrower: maatalousyrittäjä
narrower: elokuvatuottaja
narrower: musiikkituottaja
preferred label: producer @en
preferred label: producent @sv

maa- ja metsätaloushallinto
type: Concept
source: Kansallinen RDA-termi
source: Nationell RDA-term @sv
created: 2019-03-13
modified: 2026-05-06
broader: julkinen hallinto
example: maa- ja metsätalousministeriö, asutushallitus, maanmittaushallitus, metsähallitus, maatilahallitus, asutushallinnon piiri- ja paikallisviranomaiset, maaseutuelinkeinopiirit, metsänhoitoalueet, maanmittaushallinnon piiriviranomaiset, riistanhoitoyhdistykset, osakaskunnat, paliskunnat
example: jord- och skogsbruksministeriet, kolonisationsstyrelsen, lantmäteristyrelsen, forststyrelsen, jordbruksstyrelsen, kolonisationsförvaltningens distrikts-, och lokala myndigheter, landsbygdsnäringsdistrikt, forstrevir, lantmäteriförvaltningens distriktsmyndigheter, jaktvårdsföreningar, delägarlag, renbeteslag @sv
in scheme: Metatietosanasto
narrower: metsätaloushallinto
narrower: kalastushallinto
narrower: maataloushallinto
narrower: maanmittaushallinto
narrower: asutushallinto
preferred label: jord- och skogsbruksförvaltning @sv

samansisältöinen aineisto
type: Concept
source: RDA-termi
source: RDA-term @sv
created: 2020-04-17
modified: 2025-08-19
alternative label: equivalent manifestation relationship @en
alternative label: vastaava manifestaatio
alternative label: vastaavan manifestaation suhde
alternative label: motsvarande manifestation @sv
alternative label: motsvarande material @sv
broader: aineistoon liittyvä aineisto
definition: Manifestaatio, joka sisältää saman teoksen ekspression kuin toinen manifestaatio. (RDA Registry)
definition: Manifestation som innehåller ett uttryck av samma verk som en annan manifestation. @sv
in scheme: Metatietosanasto
narrower: muu julkaisumuoto
narrower: peilisivusto
narrower: jäljenne aineistosta
narrower: alun perin julkaistu
narrower: aineiston jäljenne
preferred label: equivalent manifestation @en
preferred label: material med samma innehåll @sv

alue (hallintoalue)
type: Concept
source: Kansallinen RDA-termi
source: Nationell RDA-term @sv
created: 2021-12-08
modified: 2025-08-29
alternative label: kantoni
alternative label: oblasti
alternative label: kanton @sv
alternative label: oblast @sv
alternative label: område (förvaltningsområde) @sv
definition: Aluehallinnon yksikkö tai sen toimialue, jota kutsutaan alueeksi. Myös alueeksi kutsuttu liittovaltion osa. Suomen valtion ylimmiksi aluehallinnon yksiköiksi perustettiin vuonna 2010 aluehallintovirastoja.
definition: Enhet eller verksamhetsområde för regional förvaltning. @sv
example: Itä-Suomen aluehallintovirasto
example: Regionförvaltningsverket i Östra Finland @sv
in scheme: Metatietosanasto
preferred label: region (förvaltningsområde) @sv
related: piiri (hallintoalue)
related: kihlakunta
related: maakunta
related: piirikunta
related: lääni
related: seutukunta
scope note: Voidaan käyttää valitun yhteisön kategorian lisäksi täsmentämään, että ko. julkishallinnollinen yhteisö on aluetason organisaatio. Alueiksi nimetyistä paikallishallinnon yksiköistä käytä termiä kunta (hallintoalue).
scope note: Kan användas utöver en vald kategori av institution för att precisera att den offentligrättsliga institutionen i fråga är en organisation på regional nivå. Om enheter på lokal nivå används termen kommun (förvaltningsområde). @sv

seutukunta
type: Concept
source: Kansallinen RDA-termi
source: Nationell RDA-term @sv
created: 2023-04-06
modified: 2025-08-23
definition: Seutukunnat ovat yhden tai useamman kunnan muodostamia aluekokonaisuuksia, jotka muodostettiin lähinnä kuntien välisen yhteistyön ja työssäkäynnin perusteella ja joilla oli vuosina 1994–2014 virallinen asema aluepoliittisen tukialuejaon perusalueina.
definition: Ekonomiska regioner är områdeshelheter som utgörs av en eller flera kommuner och som bildades på basis av kommuners samarbete och arbetsmarknadsområden. @sv
example: Järviseudun seutukunta, Haapavesi-Siikalatvan seutukunta; Tampereen seutukunta; Jakobstadsregionen
example: Järviseutu ekonomiska region; Haapavesi-Siikalatva ekonomiska region; Tammerfors ekonomiska region; Jakobstads ekonomiska region @sv
in scheme: Metatietosanasto
preferred label: ekonomisk region @sv
related: kaupunki
related: kuntayhtymä
related: kunta (hallintoalue)
related: maakunta
related: alue (hallintoalue)
related: kunta

taiteilija
type: Concept
source: RDA-termi
source: RDA-term @sv
created: 2024-12-18
modified: 2025-08-22
alternative label: taiteilija (henkilö)
alternative label: konstnär (person) @sv
broader: teoksen tekijä
definition: Henkilö, joka on vastuussa alkuperäisen graafisen suunnitelman, piirroksen, maalauksen tms. luomisesta. (RDA Registry)
definition: Person som svarar för skapandet av en ursprunglig grafisk design, teckning, målning eller dylikt. @sv
in scheme: Metatietosanasto
narrower: sarjakuvantekijä
narrower: graafikko
narrower: kalligrafi
narrower: kirjataiteilija
narrower: kuvanveistäjä
preferred label: artist person @en
preferred label: konstnär @sv

säveltäjä
type: Concept
source: RDA-termi
source: RDA-term @sv
created: 2024-12-18
modified: 2026-03-03
alternative label: säveltäjä (yhteisö)
alternative label: kompositör (institution) @sv
alternative label: tonsättare @sv
broader: teoksen tekijä
definition: Yhteisö, joka on vastuussa musiikkiteoksen luomisesta. (RDA Registry)
definition: Institution som svarar för skapandet av ett musikverk. @sv
in scheme: Metatietosanasto
narrower: elokuvan musiikin säveltäjä
narrower: videon musiikin säveltäjä
narrower: televisio-ohjelman musiikin säveltäjä
narrower: kadenssin säveltäjä
narrower: sävellyksen täydentäjä
preferred label: composer @en
preferred label: kompositör @sv
scope note: Kattaa selvän muunnoksen muodostamiseksi tehdyn toisen musiikkiteoksen mukaelman, teoksen parafraasin tai teoksen luomisen toisen säveltäjän yleisen tyylin mukaisesti tai toisen säveltäjän musiikkiin perustuvan teoksen luomisen. (RDA Registry)
scope note: Innefattar omarbetningen av ett annat musikaliskt verk, parafrasen av ett verk, skapandet av ett verk enligt en annan kompositörs allmänna stil eller skapandet av ett verk som grundar sig på en annan kompositörs musik, som gjorts för att bilda en tydlig variant. @sv

teosta kuvaava teos
type: Concept
source: RDA-termi
source: RDA-term @sv
created: 2024-12-18
modified: 2025-03-21
Vastavuoroinen suhde: kuvaus teoksesta
alternative label: described in (work) @en
alternative label: kuvattu teoksessa
alternative label: beskriven i verket @sv
broader: aiheena oleva teos teoksessa
definition: Teos, joka on teoksen kuvaus. (RDA Registry)
definition: Verk som är en beskrivning av ett verk. @sv
in scheme: Metatietosanasto
narrower: yhteenveto
narrower: teoksen kommentaari
narrower: teoksen analyysi
narrower: teosta metatiedoilla kuvaileva teos
preferred label: work described by @en
preferred label: verk som beskriver verket @sv

aineistoon liittyvä teos
type: Concept
source: RDA-termi
source: RDA-term @sv
created: 2024-12-18
modified: 2025-04-15
Vastavuoroinen suhde: teokseen liittyvä aineisto
alternative label: manifestaatioon liittyvä teos
alternative label: verk relaterat till manifestationen @sv
definition: Teos, joka liittyy kuvailtavaan manifestaatioon. (RDA Registry)
definition: Verk som relaterar till en manifestation som beskrivs. @sv
in scheme: Metatietosanasto
narrower: aineiston sidos
narrower: sisältää (teos)
narrower: aineisto aiheena teoksessa
narrower: hakemisto
narrower: käytetty lähde metatietoteoksessa
preferred label: related work of manifestation @en
preferred label: verk relaterat till materialet @sv

teoksen version tekijä
type: Concept
source: RDA-termi
source: RDA-term @sv
created: 2024-12-18
modified: 2026-03-10
alternative label: ekspression tekijä (henkilö)
alternative label: skapare (person) av uttryck @sv
broader: versioon liittyvä henkilö
definition: Henkilö, joka on vastuussa teoksen toteutuksesta. (RDA Registry)
definition: Person som svarar för förverkligandet av ett verk. @sv
in scheme: Metatietosanasto
narrower: kielentarkastaja
narrower: kääntäjä
narrower: yhdistymään osallinen henkilö
narrower: tarkistaja
narrower: selkomukauttaja
preferred label: creator person of expression @en
preferred label: skapare av version @sv
scope note: Ekspression tekijään kuuluvat kääntäjä, sovittaja, esittäjä jne. Ekspression toteuttaman teoksen tekijä on myös ekspression tekijä. (RDA Registry)
scope note: Till skapare av ett uttryck hör översättare, arrangör, framförande aktör etc. Skapare av ett verk som förverkligas av ett uttryck är också skapare av ett uttryck. @sv

kappaleeseen liittyvä kappale
type: Concept
source: RDA-termi
source: RDA-term @sv
created: 2024-12-18
modified: 2025-07-03
alternative label: whole-part item relationship @en
alternative label: kappaleen osa-kokonaisuus-suhde
alternative label: del-helhetsrelation för exemplar @sv
definition: Kappale, joka liittyy kappaleeseen. (RDA Registry)
definition: Exemplar som relaterar till ett exemplar. @sv
in scheme: Metatietosanasto
narrower: vastaava kappale
narrower: saman kokoelman kappale
narrower: sisältää kappaleen
narrower: sisältyy kappaleeseen
narrower: aineistossa toisen kappaleen kanssa
preferred label: related item of item @en
preferred label: exemplar relaterat till exemplaret @sv

tekstiteos
type: Concept
source: RDA-termi
source: RDA-term @sv
created: 2024-12-18
modified: 2025-08-22
Vastavuoroinen suhde: teksti teokseen
alternative label: textuellt verk @sv
broader: täydentävä teos
definition: Teos, joka on tekstiteos, joka täydentää teosta. (RDA Registry)
definition: Verk som är ett textverk, som kompletterar ett annat verk. @sv
in scheme: Metatietosanasto
narrower: libretto
narrower: radio-ohjelman käsikirjoitus
narrower: käsikirjoitus
narrower: sanoitusteos
preferred label: text work @en
preferred label: textverk @sv

säveltäjä
type: Concept
source: RDA-termi
source: RDA-term @sv
created: 2024-12-18
modified: 2026-03-03
alternative label: säveltäjä (henkilö)
alternative label: kompositör (person) @sv
broader: teoksen tekijä
definition: Henkilö, joka on vastuussa musiikkiteoksen luomisesta. (RDA Registry)
definition: Person som svarar för skapandet av ett musikverk. @sv
in scheme: Metatietosanasto
narrower: videon musiikin säveltäjä
narrower: televisio-ohjelman musiikin säveltäjä
narrower: elokuvan musiikin säveltäjä
narrower: kadenssin säveltäjä
narrower: sävellyksen täydentäjä
preferred label: composer @en
preferred label: kompositör @sv
scope note: Kattaa selvän muunnoksen muodostamiseksi tehdyn toisen musiikkiteoksen mukaelman, teoksen parafraasin tai teoksen luomisen toisen säveltäjän yleisen tyylin mukaisesti tai toisen säveltäjän musiikkiin perustuvan teoksen luomisen. (RDA Registry)
scope note: Innefattar omarbetningen av ett annat musikaliskt verk, parafrasen av ett verk, skapandet av ett verk enligt en annan kompositörs allmänna stil eller skapandet av ett verk som grundar sig på en annan kompositörs musik, som gjorts för att bilda en tydlig variant. @sv

kappaleen jäljenne
type: Concept
source: RDA-termi
source: RDA-term @sv
created: 2024-12-18
modified: 2025-07-03
Vastavuoroinen suhde: jäljenne kappaleesta
broader: kappaleeseen liittyvä aineisto
definition: Manifestaatio, joka on jäljenne toista manifestaatiota edustavasta kappaleesta. (RDA Registry)
definition: Manifestation som är en reproduktion av ett exemplar som representerar en annan manifestation. @sv
in scheme: Metatietosanasto
narrower: kappaleen näköispainos
narrower: konvertoinnin tulos
narrower: kappaleen digitoitu jäljenne
narrower: kappaleen uusintapainos
preferred label: reproduced as item @en
preferred label: reproduktion av exemplaret @sv

puheeseen osallinen henkilö
type: Concept
source: RDA-termi
source: RDA-term @sv
created: 2024-12-18
modified: 2025-08-16
broader: aggregaattiin osallinen henkilö
definition: Aggregaattiin osallinen henkilö, joka on luonut aggregaattiin sisältyvän puheteoksen ekspression.
definition: Person som bidragit till ett aggregat och skapat ett uttryck av ett talverk som ingår i ett aggregat. @sv
in scheme: Metatietosanasto
narrower: kertoja
narrower: puheen äänisuunnittelija
narrower: lukija
narrower: puheen äänittäjä
narrower: puheen puhuja
preferred label: contributor person of speech @en
preferred label: bidragsgivare (person) till tal @sv

muunnos tyylissä
type: Concept
source: RDA-termi
source: RDA-term @sv
created: 2024-12-18
modified: 2025-08-15
Vastavuoroinen suhde: muunnos tyylissä teoksesta
broader: muunnos
definition: Teos, joka on luotu muuttamalla teoksen tyyliä. (RDA Registry)
definition: Verk som har skapats genom att ändra ett verks stil. @sv
in scheme: Metatietosanasto
narrower: jäljitelmä
narrower: parafraasi
narrower: uusintaproduktio
narrower: vapaamuotoinen käännös
preferred label: transformation by style @en
preferred label: variant av stil @sv

muunnos
type: Concept
source: RDA-termi
source: RDA-term @sv
created: 2024-12-18
modified: 2025-08-15
Vastavuoroinen suhde: muunnos teoksesta
preferred label: transformation @en
broader: teokseen liittyvä teos
definition: Teos, joka on luotu muuttamalla teoksen toiminta-alaa tai toimituslinjaa, genreä tai kirjallista muotoa, kohdeyleisöä tai tyyliä. (RDA Registry)
definition: Verk som skapats genom att ändra ett verks verksamhetsfält eller redaktionella linje, genre eller litterära form, målgrupp eller stil. @sv
in scheme: Metatietosanasto
narrower: muunnos yleisössä
narrower: muunnos tyylissä
narrower: muunnos genressä
narrower: muunnos linjassa
preferred label: variant @sv

tarkistaja
type: Concept
source: RDA-termi
source: RDA-term @sv
created: 2024-12-18
modified: 2026-05-20
alternative label: tarkistaja (henkilö)
alternative label: granskare (person) @sv
broader: teoksen version tekijä
definition: Henkilö, joka osallistuu ekspression tekemiseen tekemällä muutoksia toisen ekspression sisältöön. (RDA Registry)
definition: Person som deltar i utförandet av ett uttryck, genom att göra ändringar i ett annat uttrycks innehåll. @sv
in scheme: Metatietosanasto
narrower: sensori
narrower: transkriboija
narrower: entisöijä (ekspressio)
narrower: sovittaja
narrower: lyhentäjä
preferred label: reviser person @en
preferred label: granskare @sv

kuvaus teoksesta
type: Concept
source: RDA-termi
source: RDA-term @sv
created: 2024-12-18
modified: 2025-07-04
Vastavuoroinen suhde: teosta kuvaava teos
broader: aiheena oleva teos
definition: Teos, jota teos kuvaa. (RDA Registry)
definition: Verk som ett verk beskriver. @sv
in scheme: Metatietosanasto
narrower: yhteenveto teoksesta
narrower: kommentaari teoksesta
narrower: analyysi teoksesta
narrower: metatietokuvailu teoksesta
preferred label: description of work @en
preferred label: beskrivning av verket @sv

jäljenne kappaleesta
type: Concept
source: RDA-termi
source: RDA-term @sv
created: 2024-12-18
modified: 2025-07-02
Vastavuoroinen suhde: kappaleen jäljenne
alternative label: reproduction of (item) @en
broader: aineistoon liittyvä kappale
definition: Kappale, jota on käytetty jäljentämisen pohjana. (RDA Registry)
definition: Exemplar som har använts som grund för reproduktion. @sv
in scheme: Metatietosanasto
narrower: digitoitu kappaleesta
narrower: näköispainos kappaleesta
narrower: konvertoitu kappale
narrower: uusintapainos kappaleesta
preferred label: reproduction of item of @en
preferred label: reproduktion av exemplaret @sv

stillkuvaan osallinen henkilö
type: Concept
source: RDA-termi
source: RDA-term @sv
created: 2024-12-18
modified: 2025-08-21
broader: aggregaattiin osallinen henkilö
definition: Aggregaattiin osallinen henkilö, joka on luonut aggregaattiin sisältyvän stillkuvateoksen ekspression.
definition: Person som bidragit till ett aggregat och skapat ett uttryck av ett stillbildsverk som ingår i ett aggregat. @sv
in scheme: Metatietosanasto
narrower: valokuvaaja
narrower: stillkuvan arkkitehti
narrower: sarjakuvantekijä
narrower: stillkuvan värittäjä
narrower: taiteilija
preferred label: contributor person of still image @en
preferred label: bidragsgivare (person) till stillbild @sv

muunnos teoksesta
type: Concept
source: RDA-termi
source: RDA-term @sv
created: 2024-12-18
modified: 2025-08-15
Vastavuoroinen suhde: muunnos
broader: teokseen liittyvä teos
definition: Teos, jolla on toiminta-ala tai toimituslinja, genre tai kirjallinen muoto, kohdeyleisö tai tyyli, jota on muutettu teoksen luomiseksi. (RDA Registry)
definition: Verk med ett verksamhetsfält eller en redaktionell linje, genre eller litterär form, målgrupp eller stil, som har ändrats för att skapa ett verk. @sv
in scheme: Metatietosanasto
narrower: muunnos genressä teoksesta
narrower: muunnos yleisössä teoksesta
narrower: muunnos linjassa teoksesta
narrower: muunnos tyylissä teoksesta
preferred label: transformation of @en
preferred label: variant av verket @sv

tarkistaja
type: Concept
source: RDA-termi
source: RDA-term @sv
created: 2024-12-18
modified: 2026-05-20
alternative label: reviser @en
alternative label: tarkistaja (toimija)
alternative label: granskare (aktör) @sv
broader: version tekijä
definition: Toimija, joka osallistuu ekspression tekemiseen tekemällä muutoksia toisen ekspression sisältöön. (RDA Registry)
definition: Aktör som deltar i utförandet av ett uttryck, genom att göra ändringar i ett annat uttrycks innehåll. @sv
in scheme: Metatietosanasto
narrower: transkriboija
narrower: sovittaja
narrower: entisöijä (ekspressio)
narrower: sensori
narrower: lyhentäjä
preferred label: reviser agent @en
preferred label: granskare @sv

teokseen liittyvä aineisto
type: Concept
source: RDA-termi
source: RDA-term @sv
created: 2024-12-18
modified: 2025-08-22
Vastavuoroinen suhde: aineistoon liittyvä teos
alternative label: teokseen liittyvä manifestaatio
alternative label: manifestation relaterad till verket @sv
definition: Manifestaatio, joka liittyy teokseen. (RDA Registry)
definition: Manifestation som relaterar till ett verk. @sv
in scheme: Metatietosanasto
narrower: aineiston sidos aineistosta
narrower: käytetty lähde
narrower: hakemisto aineistolle
narrower: sisältyy aineistoon
narrower: aiheena oleva aineisto
preferred label: related manifestation of work @en
preferred label: material relaterat till verket @sv

tarkistaja
type: Concept
source: RDA-termi
source: RDA-term @sv
created: 2024-12-18
modified: 2026-05-20
alternative label: tarkistaja (yhteisö)
alternative label: granskare (institution) @sv
broader: teoksen version tekijä
definition: Yhteisö, joka osallistuu ekspression tekemiseen tekemällä muutoksia toisen ekspression sisältöön. (RDA Registry)
definition: Institution som deltar i utförandet av ett uttryck, genom att göra ändringar i ett annat uttrycks innehåll. @sv
in scheme: Metatietosanasto
narrower: sovittaja
narrower: lyhentäjä
narrower: transkriboija
narrower: entisöijä (ekspressio)
narrower: sensori
preferred label: reviser corporate body @en
preferred label: granskare @sv

muunnos tyylissä teoksesta
type: Concept
source: RDA-termi
source: RDA-term @sv
created: 2024-12-18
modified: 2025-08-15
Vastavuoroinen suhde: muunnos tyylissä
broader: muunnos teoksesta
definition: Teos, jolla on tyyli, jota on muutettu teoksen luomiseksi. (RDA Registry)
definition: Verk med en stil som har ändrats för att skapa ett verk. @sv
in scheme: Metatietosanasto
narrower: uusintaproduktio teoksesta
narrower: jäljitelmä teoksesta
narrower: vapaa käännös teoksesta
narrower: parafraasi teoksesta
preferred label: transformation by style of @en
preferred label: variant av stil för verket @sv

teksti teokseen
type: Concept
source: RDA-termi
source: RDA-term @sv
created: 2024-12-18
modified: 2025-03-19
Vastavuoroinen suhde: tekstiteos
broader: täydentävä teos
definition: Teos, jota täydentää teos, joka on tekstiteos. (RDA Registry)
definition: Verk som kompletteras av ett verk som är ett textverk. @sv
in scheme: Metatietosanasto
narrower: libretto teokseen
narrower: käsikirjoitus radio-ohjelmaan
narrower: käsikirjoitus teokseen
narrower: sanoitus teokseen
preferred label: text for work @en
preferred label: text till verket @sv

aineistoon liittyvä aineisto
type: Concept
source: RDA-termi
source: RDA-term @sv
created: 2024-12-18
modified: 2025-04-15
alternative label: whole-part manifestation relationship @en
alternative label: manifestaation osa-kokonaisuus-suhde
alternative label: manifestaatioon liittyvä manifestaatio
alternative label: manifestation relaterad till manifestationen @sv
definition: Manifestaatio, joka liittyy manifestaatioon. (RDA Registry)
definition: Manifestation som relaterar till en annan manifestation. @sv
in scheme: Metatietosanasto
narrower: alkuperäinen
narrower: aineiston osa
narrower: samansisältöinen aineisto
narrower: mukana ilmestynyt aineisto
narrower: osa aineistoa
preferred label: related manifestation of manifestation @en
preferred label: material relaterat till materialet @sv

puheeseen osallinen yhteisö
type: Concept
source: RDA-termi
source: RDA-term @sv
created: 2024-12-18
modified: 2025-08-16
broader: aggregaattiin osallinen yhteisö
definition: Aggregaattiin osallinen yhteisö, joka on luonut aggregaattiin sisältyvän puheteoksen ekspression.
definition: Institution som bidragit till ett aggregat och skapat ett uttryck av ett talverk som ingår i ett aggregat. @sv
in scheme: Metatietosanasto
narrower: puheen puhuja
narrower: kertoja
narrower: lukija
narrower: puheen äänisuunnittelja
narrower: puheen äänittäjä
preferred label: contributor corporate body of speech @en
preferred label: bidragsgivare (institution) till tal @sv

stillkuvaan osallinen yhteisö
type: Concept
source: RDA-termi
source: RDA-term @sv
created: 2024-12-18
modified: 2025-08-21
broader: aggregaattiin osallinen yhteisö
definition: Aggregaattiin osallinen yhteisö, joka on luonut aggregaattiin sisältyvän stillkuvateoksen ekspression.
definition: Institution som bidragit till ett aggregat och skapat ett uttryck av ett stillbildsverk som ingår i ett aggregat. @sv
in scheme: Metatietosanasto
narrower: sarjakuvantekijä
narrower: taiteilija
narrower: valokuvaaja
narrower: stillkuvan arkkitehti
narrower: stillkuvan värittäjä
preferred label: contributor corporate body of still image @en
preferred label: bidragsgivare (institution) till stillbild @sv

osa aineistoa
type: Concept
source: RDA-termi
source: RDA-term @sv
created: 2016-01-08
modified: 2025-11-18
Vastavuoroinen suhde: aineiston osa
alternative label: contained in (manifestation) @en
alternative label: osa manifestaatiota
alternative label: sisältyy manifestaatioon
alternative label: del av manifestationen @sv
alternative label: ingår i manifestation @sv
broader: aineistoon liittyvä aineisto
definition: Manifestaatio, johon sisältyvä manifestaatio on itsenäinen osa toisesta manifestaatiosta. (RDA Registry)
definition: En manifestation i vilken en ingående manifestation är en oberoende del av en annan manifestation. @sv
in scheme: Metatietosanasto
narrower: eripainos julkaisusta
narrower: näköispainos sisältyy aineistoon
narrower: liitteenä aineistossa
narrower: alakokoelma kokoelmassa
preferred label: part of manifestation @en
preferred label: del av materialet @sv

aineiston jäljenne
type: Concept
source: RDA-termi
source: RDA-term @sv
created: 2016-01-08
modified: 2025-01-03
Vastavuoroinen suhde: jäljenne aineistosta
alternative label: jäljenteenä
alternative label: jäljenteenä (manifestaatio)
alternative label: manifestaation jäljenne
alternative label: reproducerats som (manifestation) @sv
alternative label: som kopia @sv
broader: samansisältöinen aineisto
definition: Manifestaatio, joka on jäljenne toisesta manifestaatiosta. (RDA Registry)
definition: Manifestation som är en reproduktion av en annan manifestation. @sv
in scheme: Metatietosanasto
narrower: aineiston digitoitu jäljenne
narrower: näköispainos (manifestaatio)
narrower: konvertoinnin tulos
narrower: aineiston uusintapainos
preferred label: reproduced as manifestation @en
preferred label: reproduktion av materialet @sv

yhtiö
type: Concept
source: Kansallinen RDA-termi
source: Nationell RDA-term @sv
created: 2016-01-08
modified: 2024-05-24
definition: Kahden tai useamman henkilön yhteenliittymä, joka on muodostettu liiketoiminnan harjoittamista varten (Kielitoimiston sanakirja). Yhtiöstä, jota ei ole alun perin perustettu harjoittamaan liiketoimintaa, käytetään myös muuta soveltuvaa termiä, esim. urheiluseura.
definition: Sammanslutning av två eller flera personer, som har bildats i syfte att bedriva affärsverksamhet. Om bolag som ursprungligen inte grundats för att utöva affärsverksamhet används även andra lämpliga termer, t.ex. idrottsförening. @sv
example: Kajaani (yhtiö)
example: Kaleva (kustannusosakeyhtiö).
example: Kaleva (vakuutusyhtiö)
example: Kajaani (bolag) @sv
example: Kaleva (förlagsaktiebolag) @sv
example: Kaleva (försäkringsbolag) @sv
in scheme: Metatietosanasto
narrower: osuuskunta
narrower: osakeyhtiö
narrower: luottolaitos
narrower: vakuutuslaitos
narrower: kiinteistöyhtiö
narrower: henkilöyhtiö
preferred label: bolag @sv
scope note: Eri yhtiötyyppejä kuvaavia termejä käytetään, jos identifiointi vaatii.
scope note: Termer som beskriver olika bolagstyper används om de är nödvändiga för identifiering. @sv

näyttelijä
type: Concept
source: Kansallinen RDA-termi
source: YSO-termi
source: ALLFO-term @sv
source: Nationell RDA-term @sv
created: 2018-11-01
modified: 2024-08-27
alternative label: näyttelijä (ammatti)
alternative label: skådespelare (yrke) @sv
broader: näyttämötaiteilija
in scheme: Metatietosanasto
narrower: elokuvanäyttelijä
narrower: televisionäyttelijä
narrower: koomikko
narrower: harrastajanäyttelijä
narrower: lapsinäyttelijä
narrower: ääninäyttelijä
preferred label: actor (stage artist) @en
preferred label: skådespelare @sv

ministeri
type: Concept
source: Kansallinen RDA-termi
source: YSO-termi
source: ALLFO-term @sv
source: Nationell RDA-term @sv
created: 2018-11-01
modified: 2024-08-27
alternative label: ministeri (ammatti)
alternative label: minister (yrke) @sv
in scheme: Metatietosanasto
narrower: puolustusministeri
narrower: oikeusministeri
narrower: pääministeri
narrower: asuntoministeri
narrower: valtiovarainministeri
narrower: elinkeinoministeri
narrower: ulkoasiainministeri
preferred label: minister @sv

runoilija
type: Concept
source: Kansallinen RDA-termi
source: YSO-termi
source: ALLFO-term @sv
source: Nationell RDA-term @sv
created: 2018-11-01
modified: 2024-08-27
alternative label: poets @en
alternative label: lyyrikot
alternative label: runoilijat
alternative label: lyriker @sv
alternative label: poeter @sv
alternative label: skalder @sv
broader: kirjailija
in scheme: Metatietosanasto
narrower: truveeri
narrower: minnelaulaja
narrower: rahvaanrunoilija
narrower: trubaduuri
narrower: harrastajarunoilija
narrower: virsirunoilija
preferred label: poet @en
preferred label: diktare @sv

musiikki teokseen
type: Concept
source: RDA-termi
source: RDA-term @sv
created: 2019-01-04
modified: 2025-08-14
Vastavuoroinen suhde: musiikki
broader: täydentävä teos
definition: Teos, jota musiikkiteos täydentää. (RDA Registry)
definition: Verk som ett musikverk kompletterar. @sv
in scheme: Metatietosanasto
narrower: musiikki elokuvaan
narrower: musiikki videoon
narrower: musiikki televisio-ohjelmaan
narrower: musiikki radio-ohjelmaan
narrower: näytelmämusiikki teokseen
preferred label: music for work @en
preferred label: musik till verket @sv

musiikki
type: Concept
source: RDA-termi
source: RDA-term @sv
created: 2019-01-04
modified: 2025-08-14
Vastavuoroinen suhde: musiikki teokseen
alternative label: musiikki (teos)
alternative label: musik (verk) @sv
broader: täydentävä teos
definition: Musiikkiteos, joka täydentää teosta. (RDA Registry)
definition: Musikverk som kompletterar ett verk. @sv
in scheme: Metatietosanasto
narrower: radio-ohjelman musiikki
narrower: videon musiikki
narrower: näytelmämusiikki
narrower: televisio-ohjelman musiikki
narrower: elokuvamusiikki
preferred label: music work @en
preferred label: musik @sv

jäljenne aineistosta
type: Concept
source: RDA-termi
source: RDA-term @sv
created: 2020-04-17
modified: 2025-07-02
Vastavuoroinen suhde: aineiston jäljenne
alternative label: reproduction of (manifestation) @en
alternative label: jäljenne manifestaatiosta
alternative label: reproduktion av manifestationen @sv
broader: samansisältöinen aineisto
definition: Manifestaatio, jota on käytetty jäljentämisen pohjana. (RDA Registry)
definition: Manifestation som har använts som grund för reproduktion. @sv
in scheme: Metatietosanasto
narrower: uusintapainos aineistosta
narrower: digitoitu painetusta
narrower: digitoitu aineisto
narrower: näköispainos manifestaatiosta
narrower: konvertoitu aineisto
preferred label: reproduction of manifestation of @en
preferred label: reproduktion av materialet @sv

musiikki teoksen versioon
type: Concept
source: RDA-termi
source: RDA-term @sv
created: 2020-04-17
modified: 2025-08-14
Vastavuoroinen suhde: musiikki
alternative label: musiikki ekspressioon
alternative label: musik till uttrycket @sv
broader: täydentävä teoksen versio
definition: Teoksen ekspressio kuten elokuva, näytelmä, televisio-ohjelma tms., joka käyttää musiikkiteosta. (RDA Registry)
definition: Uttryck av ett verk, såsom en film, ett skådespel, ett tv-program eller dylikt, som använder ett musikverk. @sv
in scheme: Metatietosanasto
narrower: musiikki televisio-ohjelmaan
narrower: musiikki elokuvaan
narrower: näytelmämusiikki versioon
narrower: musiikki radio-ohjelmaan
narrower: musiikki videoon
preferred label: music for expression @en
preferred label: musik till versionen @sv

musiikki
type: Concept
source: RDA-termi
source: RDA-term @sv
created: 2020-04-17
modified: 2025-08-14
Vastavuoroinen suhde: musiikki teoksen versioon
alternative label: musiikki (ekspressio)
alternative label: musik (uttryck) @sv
broader: täydentävä teoksen versio
definition: Musiikkiteoksen ekspressio, jota käytetään elokuvassa, näytelmässä, televisio-ohjelmassa jne. (RDA Registry)
definition: Uttryck av musikverk, som används i film, skådespel, tv-program eller dylikt. @sv
in scheme: Metatietosanasto
narrower: televisio-ohjelman musiikki
narrower: videon musiikki
narrower: radio-ohjelman musiikki
narrower: elokuvamusiikki
narrower: näytelmämusiikki
preferred label: music expression @en
preferred label: musik @sv

sosiaalihuoltolaitos
type: Concept
source: Kansallinen RDA-termi
source: Nationell RDA-term @sv
created: 2021-04-20
modified: 2024-05-24
alternative label: hoitolaitos
alternative label: socialvårdsanstalt @sv
alternative label: socialvårdsinstitution @sv
alternative label: vårdanstalt @sv
alternative label: vårdinrättning @sv
alternative label: vårdinstitution @sv
definition: Sosiaalihuoltopalveluja tarjoava laitos.
definition: Inrättning som erbjuder socialvårdstjänster. @sv
in scheme: Metatietosanasto
narrower: toimintakeskus
narrower: päihdehuoltolaitos
narrower: turvakoti/ensikoti
narrower: vanhustenhuoltolaitos
narrower: päiväkoti
narrower: lastensuojelulaitos
narrower: perhekeskus
preferred label: socialvårdsinrättning @sv

esineeseen osallinen yhteisö
type: Concept
source: RDA-termi
source: RDA-term @sv
created: 2024-12-18
modified: 2025-06-04
broader: aggregaattiin osallinen yhteisö
definition: Aggregaattiin osallinen yhteisö, joka on luonut aggregaattiin sisältyvän esineteoksen ekspression.
definition: Institution som bidragit till ett aggregat, som skapat ett uttryck av ett föremålsverk som ingår i ett aggregat. @sv
in scheme: Metatietosanasto
narrower: designer
narrower: arkkitehti
narrower: kuvanveistäjä
narrower: kirjataiteilija
narrower: keksijä
narrower: piirtäjä
preferred label: contributor corporate body of object @en
preferred label: bidragsgivare (institution) till föremål @sv

esineeseen osallinen henkilö
type: Concept
source: RDA-termi
source: RDA-term @sv
created: 2024-12-18
modified: 2025-06-04
broader: aggregaattiin osallinen henkilö
definition: Aggregaattiin osallinen henkilö, joka on luonut aggregaattiin sisältyvän esineteoksen ekspression.
definition: Person som bidragit till ett aggregat, som skapat ett uttryck av ett föremålsverk som ingår i ett aggregat. @sv
in scheme: Metatietosanasto
narrower: keksijä
narrower: piirtäjä
narrower: arkkitehti
narrower: kuvanveistäjä
narrower: kirjataiteilija
narrower: designer
preferred label: contributor person of object @en
preferred label: bidragsgivare (person) till föremål @sv

kirjoittaja
type: Concept
source: RDA-termi
source: RDA-term @sv
created: 2024-12-18
modified: 2025-07-03
alternative label: kirjoittaja (yhteisö)
alternative label: författare (institution) @sv
broader: teoksen tekijä
definition: Yhteisö, joka on vastuussa tekstiteoksen luomisesta. (RDA Registry)
definition: Institution som svarar för skapandet av ett textverk. @sv
in scheme: Metatietosanasto
narrower: tekstiteoksen kirjoittaja
narrower: kokousten raportoija
narrower: sanoittaja
narrower: libretisti
narrower: käsikirjoittaja
narrower: musiikkiteoksen tekstin kirjoittaja
preferred label: author corporate body @en
preferred label: författare @sv
scope note: Kattaa uuden teoksen luomisen toisen tekijän teoksia mukailemalla, muokkaamalla tai sovittamalla, mikäli muutos on olennaisesti muuttanut alkuperäisen luonnetta ja sisältöä tai muuttanut ilmaisumuotoa. (RDA Registry)
scope note: Innefattar skapandet av ett nytt verk genom att omarbeta, redigera eller arrangera ett verk av en annan upphovsperson, såvida ändringen väsentligen har ändrat originalets karaktär och innehåll eller uttrycksform. @sv

kuoro
type: Concept
source: Kansallinen RDA-termi
source: Nationell RDA-term @sv
created: 2016-01-08
modified: 2024-05-24
definition: Kymmenen tai useamman laulajan muodostama esityskokoonpano.
definition: Ensemble bestående av tio eller fler sångare. @sv
example: Campanella (kuoro)
example: Brahe Djäknar (kör) @sv
in scheme: Metatietosanasto
narrower: sekakuoro
narrower: naiskuoro
narrower: unisonokuoro
narrower: nuorisokuoro
narrower: mieskuoro
narrower: lapsikuoro
narrower: poikakuoro
narrower: tyttökuoro
preferred label: kör @sv

laulaja
type: Concept
source: Kansallinen RDA-termi
source: YSO-termi
source: ALLFO-term @sv
source: Nationell RDA-term @sv
created: 2018-11-01
modified: 2024-08-27
alternative label: laulaja (ammatti)
alternative label: sångare (yrke) @sv
alternative label: vokalist @sv
broader: muusikko
in scheme: Metatietosanasto
narrower: kastraattilaulaja
narrower: mieslaulaja
narrower: kansanlaulaja
narrower: naislaulaja
narrower: laulaja-lauluntekijä
narrower: joikaaja
narrower: leuʹddaaja
preferred label: singer @en
preferred label: sångare @sv

kauppias
type: Concept
source: Kansallinen RDA-termi
source: YSO-termi
source: ALLFO-term @sv
source: Nationell RDA-term @sv
created: 2018-11-01
modified: 2025-08-30
alternative label: merchants @en
alternative label: kauppiaat
alternative label: handelskvinnor @sv
alternative label: handelsman @sv
alternative label: handelsmän @sv
broader: yrittäjä
in scheme: Metatietosanasto
narrower: tukkukauppias
narrower: kirjakauppias
narrower: vähittäiskauppias
narrower: taidekauppias
narrower: antiikkikauppias
narrower: kulkukauppias
narrower: kukkakauppias
preferred label: merchant @en
preferred label: handlare @sv

autonkuljettaja
type: Concept
source: Kansallinen RDA-termi
source: YSO-termi
source: ALLFO-term @sv
source: Nationell RDA-term @sv
created: 2018-11-01
modified: 2024-08-27
alternative label: chauffeurs @en
alternative label: ammattiautoilijat
alternative label: autonkuljettajat
alternative label: bilförare @sv
alternative label: chaufförer @sv
alternative label: yrkesbilister @sv
broader: kuljettaja
in scheme: Metatietosanasto
narrower: linja-autonkuljettaja
narrower: rekka-autonkuljettaja
narrower: postiautonkuljettaja
narrower: taksinkuljettaja
narrower: sairaankuljettaja
narrower: jäteautonkuljettaja
narrower: kuorma-autonkuljettaja
preferred label: chauffeur @en
preferred label: chaufför @sv

kuljettaja
type: Concept
source: Kansallinen RDA-termi
source: YSO-termi
source: ALLFO-term @sv
source: Nationell RDA-term @sv
created: 2018-11-01
modified: 2024-08-27
alternative label: drivers @en
alternative label: kuljettajat
in scheme: Metatietosanasto
narrower: autonkuljettaja
narrower: raitiovaununkuljettaja
narrower: veturinkuljettaja
narrower: trukinkuljettaja
narrower: metsäkoneenkuljettaja
narrower: nosturinkuljettaja
narrower: työkoneenkuljettaja
narrower: lossinkuljettaja
preferred label: driver @en
preferred label: förare @sv

insinööri
type: Concept
source: Kansallinen RDA-termi
source: YSO-termi
source: ALLFO-term @sv
source: Nationell RDA-term @sv
created: 2018-11-01
modified: 2024-08-27
alternative label: insinööri (ammatti)
alternative label: ingenjör (yrke) @sv
in scheme: Metatietosanasto
narrower: metsätalousinsinööri
narrower: automaatioinsinööri
narrower: piiri-insinööri
narrower: koneinsinööri
narrower: patentti-insinööri
narrower: rakennusinsinööri
narrower: maanmittausinsinööri
narrower: sähköinsinööri
preferred label: engineer @en
preferred label: ingenjör @sv

liikenne- ja rakennushallinto
type: Concept
source: Kansallinen RDA-termi
source: Nationell RDA-term @sv
created: 2019-03-13
modified: 2026-05-06
alternative label: liikennehallinto
alternative label: rakennushallinto
alternative label: byggnadsförvaltning @sv
alternative label: trafikförvaltning @sv
broader: julkinen hallinto
example: kulkulaitosten ja yleisten töiden ministeriö, liikenne- ja viestintäministeriö, rakennushallitus, tie- ja vesirakennushallitus, merenkulkuhallitus, posti- ja telelaitos, ajoneuvohallinnon viranomaiset, rakennushallinnon piiriviranomaiset, rautatiehallinnon piiri- ja paikallisviranomaiset, luotsipiirit, tie- ja vesirakennuspiirit, postin piiri- ja paikallisviranomaiset, lento-asemat, majakat
example: ministeriet för kommunikationsväsendet och allmänna arbetena, kommunikationsministeriet, byggnadsstyrelsen, väg- och vattenbyggnadsstyrelsen, sjöfartsstyrelsen, post- och televerket, fordonsförvaltningens myndigheter, byggnadsförvaltningens distriktsmyndigheter, järnvägsförvaltningens distrikts- och lokala myndigheter, lotsfördelningar, väg- och vattenbyggnadsdistrikt, postens distrikts- och lokala myndigheter, flygplatser, fyrar @sv
in scheme: Metatietosanasto
narrower: rautatiehallinto
narrower: merenkulkuhallinto
narrower: viestintähallinto
narrower: rakennushallinto
narrower: tie- ja vesirakennushallinto
narrower: ajoneuvohallinto
narrower: ilmailuhallinto
preferred label: trafik- och byggnadsförvaltning @sv

muokkaaja
type: Concept
source: RDA-termi
source: RDA-term @sv
created: 2024-12-18
modified: 2025-08-14
alternative label: muokkaaja (henkilö)
alternative label: bearbetare (person) @sv
broader: kappaleeseen liittyvä henkilö
definition: Henkilö, joka tekee muutoksia kappaleeseen luomatta uutta manifestaatiota. (RDA Registry)
definition: Person som gör ändringar i ett exemplar, utan att skapa en ny manifestation. @sv
in scheme: Metatietosanasto
narrower: omistuskirjoituksen kirjoittaja
narrower: lisähuomautusten kirjoittaja
narrower: nimikirjoituksen kirjoittaja
narrower: gratulaation kirjoittaja
narrower: kappaleen entisöijä
narrower: sitoja
narrower: illuminoinnin tekijä
preferred label: modifier person @en
preferred label: bearbetare @sv

aineiston tekijä
type: Concept
source: RDA-termi
source: RDA-term @sv
created: 2024-12-18
modified: 2025-05-27
alternative label: manifestaation tekijä (yhteisö)
alternative label: skapare (institution) av manifestation @sv
broader: aineistoon liittyvä yhteisö
definition: Yhteisö, joka on vastuussa yhden tai useamman ekspression ilmiasusta. (RDA Registry)
definition: Institution som svarar för ett eller flera uttrycks yttre form. @sv
in scheme: Metatietosanasto
narrower: julkaisemattoman aineiston tuottaja
narrower: kuvalaatan valmistaja
narrower: valaja
narrower: valmistaja
narrower: painolaatan valmistaja
narrower: graafinen suunnittelija
narrower: kustantaja
preferred label: creator corporate body of manifestation @en
preferred label: skapare av material @sv
scope note: Manifestaation tekijä sisältää jakelijan, valmistajan, tuottajan ja kustantajan. (RDA Registry)
scope note: Skapare av manifestation innefattar distributör, tillverkare, producent och utgivare. @sv

teokseen liittyvä toimija
type: Concept
source: RDA-termi
source: RDA-term @sv
created: 2024-12-18
modified: 2025-08-22
alternative label: other agent associated with work @en
alternative label: muu teokseen liittyvä toimija
alternative label: annan aktör relaterad till verket @sv
definition: Toimija, joka liittyy teokseen. (RDA Registry)
definition: Aktör som relaterar till ett verk. @sv
in scheme: Metatietosanasto
narrower: teoksen sponsori
narrower: toimeksiantaja
narrower: teoksella kunnioitettu toimija
narrower: julkaisija
narrower: teoksen tekijä
narrower: aiheena oleva toimija
narrower: vastaanottaja
narrower: teoksen omistuksen kohde
preferred label: related agent of work @en
preferred label: aktör relaterad till verket @sv

aineiston tekijä
type: Concept
source: RDA-termi
source: RDA-term @sv
created: 2024-12-18
modified: 2025-05-27
alternative label: manifestaation tekijä (henkilö)
alternative label: skapare (person) av manifestation @sv
broader: aineistoon liittyvä henkilö
definition: Henkilö, joka on vastuussa yhden tai useamman ekspression ilmiasusta. (RDA Registry)
definition: Person som svarar för ett eller flera uttrycks yttre form. @sv
in scheme: Metatietosanasto
narrower: kuvalaatan valmistaja
narrower: painolaatan valmistaja
narrower: julkaisemattoman aineiston tuottaja
narrower: graafinen suunnittelija
narrower: valaja
narrower: kustantaja
narrower: valmistaja
preferred label: creator person of manifestation @en
preferred label: skapare av material @sv
scope note: Manifestaation tekijä sisältää jakelijan, valmistajan, tuottajan ja kustantajan. (RDA Registry)
scope note: Skapare av manifestation innefattar distributör, tillverkare, producent och utgivare. @sv

aineiston tekijä
type: Concept
source: RDA-termi
source: RDA-term @sv
created: 2024-12-18
modified: 2025-05-27
alternative label: manifestaation tekijä
alternative label: manifestaation tekijä (toimija)
alternative label: skapare (aktör) av manifestation @sv
broader: aineistoon liittyvä toimija
definition: Toimija, joka on vastuussa yhden tai useamman ekspression ilmiasusta. (RDA Registry)
definition: Aktör som svarar för ett eller flera uttrycks yttre form. @sv
in scheme: Metatietosanasto
narrower: valmistaja
narrower: valaja
narrower: kuvalaatan valmistaja
narrower: painolaatan valmistaja
narrower: graafinen suunnittelija
narrower: julkaisemattoman aineiston tuottaja
narrower: kustantaja
preferred label: creator agent of manifestation @en
preferred label: skapare av material @sv
scope note: Manifestaation tekijä sisältää jakelijan, valmistajan, tuottajan ja kustantajan. (RDA Registry)
scope note: Skapare av manifestation innefattar distributör, tillverkare, producent och utgivare. @sv

oheistekstin kirjoittaja
type: Concept
source: Kansallinen RDA-termi
source: Nationell RDA-term @sv
created: 2026-02-18
modified: 2026-03-11
alternative label: tekstiin osallinen oheistekstin kirjoittaja (henkilö)
alternative label: författare till kompletterande textinnehåll @sv
broader: tekstiin osallinen henkilö
definition: Aggregaattiin osallinen henkilö, joka on luonut aggregaattiin sisältyvän oheistekstin ekspression.
definition: Person som bidragit till ett aggregat, genom att skapa ett uttryck av en kompletterande text som ingår i ett aggregat. @sv
in scheme: Metatietosanasto
narrower: johdannon kirjoittaja
narrower: alkusanojen kirjoittaja
narrower: jälkipuheen kirjoittaja
narrower: kommentaarin kirjoittaja
narrower: loppusanojen kirjoittaja
narrower: esipuheen kirjoittaja
narrower: lisätyn tekstin kirjoittaja
preferred label: författare till kompletterande text @sv

oheistekstin kirjoittaja
type: Concept
source: Kansallinen RDA-termi
source: Nationell RDA-term @sv
created: 2026-02-18
modified: 2026-03-11
alternative label: tekstiin osallinen oheistekstin kirjoittaja (yhteisö)
alternative label: författare till kompletterande textinnehåll @sv
broader: tekstiin osallinen yhteisö
definition: Aggregaattiin osallinen yhteisö, joka on luonut aggregaattiin sisältyvän oheistekstin ekspression.
definition: Institution som bidragit till ett aggregat, genom att skapa ett uttryck av en kompletterande text som ingår i ett aggregat. @sv
in scheme: Metatietosanasto
narrower: lisätyn tekstin kirjoittaja
narrower: esipuheen kirjoittaja
narrower: loppusanojen kirjoittaja
narrower: alkusanojen kirjoittaja
narrower: kommentaarin kirjoittaja
narrower: jälkipuheen kirjoittaja
narrower: johdannon kirjoittaja
preferred label: författare till kompletterande text @sv

laajennus teokseen
type: Concept
source: RDA-termi
source: RDA-term @sv
created: 2016-01-08
modified: 2025-12-13
Vastavuoroinen suhde: laajennettu teoksella
alternative label: täydennysosa teokseen
alternative label: kompletterande del till verket @sv
broader: teokseen liittyvä teos
definition: Teos, jonka sisältöä siihen liittyvä teos täydentää. (RDA Registry)
definition: Verk vars innehåll ett relaterat verk kompletterar. @sv
in scheme: Metatietosanasto
narrower: lisäykset teokseen
narrower: kuvitus teokseen
narrower: kadenssi teokseen
narrower: suplementti teokseen
narrower: liite teokseen
narrower: opas teokseen
narrower: painovirheluettelo teokseen
preferred label: augmentation of work @en
preferred label: utvidgning av verket @sv

käsityöläinen
type: Concept
source: Kansallinen RDA-termi
source: YSO-termi
source: ALLFO-term @sv
source: Nationell RDA-term @sv
created: 2018-11-01
modified: 2024-08-27
alternative label: craftsmen @en
alternative label: craftspeople @en
alternative label: craftspersons @en
alternative label: craftswomen @en
alternative label: käsityöläiset
in scheme: Metatietosanasto
narrower: seppä
narrower: koristeveistäjä
narrower: kisälli
narrower: taidekäsityöläinen
narrower: suutari
narrower: värjääjä
narrower: vaatturi
narrower: ompelija
narrower: kutoja
preferred label: craftsperson @en
preferred label: hantverkare @sv

laajennettu teoksella
type: Concept
source: RDA-termi
source: RDA-term @sv
created: 2019-01-04
modified: 2025-11-18
Vastavuoroinen suhde: laajennus teokseen
alternative label: täydennysosa
alternative label: täydennysosa (teos)
alternative label: kompletterande del @sv
alternative label: kompletterande del (verk) @sv
broader: teokseen liittyvä teos
definition: Teos, joka täydentää pääteoksen sisältöä. (RDA Registry)
definition: Verk som kompletterar innehållet i ett huvudsakligt verk. @sv
in scheme: Metatietosanasto
narrower: opas
narrower: liite
narrower: painovirheluettelo
narrower: suplementti
narrower: kuvitus
narrower: lisäykset
narrower: kadenssi
preferred label: augmented by work @en
preferred label: utvidgad med verket @sv

teollisuus
type: Concept
source: Kansallinen RDA-termi
source: Nationell RDA-term @sv
created: 2019-03-13
modified: 2026-05-06
definition: Alkutuotannosta saatuja materiaaleja ja komponentteja uusiksi tuotteiksi mekaanisesti, kemiallisesti tai biologisesti muuntamalla valmistavat toimijat. Pääluokka jakaantuu alaluokkiin teollisuuden alan mukaan. Pääluokkaan liitetään ne teollisuuden toimijat, joita ei päätoimialansa mukaan voida liittää mihinkään teollisuuden alaluokista, esim. monialaisen teollisen toiminnan harjoittajat.
definition: Aktörer som producerar nya produkter av material och komponenter som erhållits ur primärproduktion, genom att mekaniskt, kemiskt eller biologiskt omvandla dem. Huvudkategorin indelas i underavdelningar enligt industrigren. I huvudkategorin placeras de industriella aktörer som enligt sitt huvudsakliga verksamhetsområde inte kan placeras i någon av underavdelningarna för industri, t.ex. sådana som utövar branschövergripande industriverksamhet. @sv
in scheme: Metatietosanasto
narrower: metalli- ja konepajateollisuus
narrower: tekstiili- ja vaatetusteollisuus
narrower: metsäteollisuus
narrower: graafinen teollisuus
narrower: elektroniikka- ja sähköteollisuus
narrower: elintarviketeollisuus
narrower: kemianteollisuus
narrower: lääketeollisuus
narrower: lasi-, kivi- ja saviteollisuus
preferred label: industri @sv

laajennus teoksen versioon
type: Concept
source: RDA-termi
source: RDA-term @sv
created: 2020-04-17
modified: 2025-12-13
Vastavuoroinen suhde: laajennettu versiolla
alternative label: laajennus ekspressioon
alternative label: täydennysosa ekspressioon
alternative label: kompletterande del till uttrycket @sv
alternative label: utvidgning av uttrycket @sv
broader: versioon liittyvä versio
definition: Teoksen ekspressio, jonka sisältöä siihen liittyvä ekspressio täydentää. (RDA Registry)
definition: Uttryck av verk, vars innehåll ett relaterat uttryck kompletterar. @sv
in scheme: Metatietosanasto
narrower: opas teoksen versioon
narrower: suplementti teoksen versioon
narrower: liite teoksen versioon
narrower: lisäykset teoksen versioon
narrower: painovirheluettelo teoksen versioon
narrower: kuvitus teoksen versioon
narrower: kadenssi versioon
preferred label: augmentation of expression @en
preferred label: utvidgning av versionen @sv

laajennettu versiolla
type: Concept
source: RDA-termi
source: RDA-term @sv
created: 2020-04-17
modified: 2025-12-13
Vastavuoroinen suhde: laajennus teoksen versioon
alternative label: laajennettu ekspressiolla
alternative label: täydennysosa
alternative label: täydennysosa (ekspressio)
alternative label: kompletterande del @sv
alternative label: kompletterande del (uttryck) @sv
alternative label: utvidgad med uttrycket @sv
broader: versioon liittyvä versio
definition: Teoksen ekspressio, joka täydentää vallitsevan ekspression sisältöä. (RDA Registry)
definition: Uttryck av verk som kompletterar innehållet i ett rådande uttryck. @sv
in scheme: Metatietosanasto
narrower: suplementti
narrower: liite
narrower: teoksen version painovirheluettelo
narrower: kadenssi
narrower: kuvitus
narrower: opas
narrower: lisäykset
preferred label: augmented by expression @en
preferred label: utvidgad med versionen @sv

teksti
type: Concept
created: 2023-01-21
modified: 2023-05-05
in scheme: Metatietosanasto
narrower: lehtileikkeet
narrower: päiväkirja
narrower: käsikirjoitus
narrower: asiakirja
narrower: pienpainate
narrower: kirja
narrower: lehti
narrower: keruuvastaus
narrower: kirje
preferred label: text @sv

kirjoittaja
type: Concept
source: RDA-termi
source: RDA-term @sv
created: 2024-12-18
modified: 2025-07-03
alternative label: kirjoittaja (henkilö)
alternative label: författare (person) @sv
broader: teoksen tekijä
definition: Henkilö, joka on vastuussa tekstiteoksen luomisesta. (RDA Registry)
definition: Person som svarar för skapandet av ett textverk. @sv
in scheme: Metatietosanasto
narrower: sarjakuvantekijä
narrower: dramaturgi
narrower: tekstiteoksen kirjoittaja
narrower: musiikkiteoksen tekstin kirjoittaja
narrower: libretisti
narrower: kokousten raportoija
narrower: sanoittaja
narrower: käsikirjoittaja
preferred label: author person @en
preferred label: författare @sv
scope note: Kattaa uuden teoksen luomisen toisen tekijän teoksia mukailemalla, muokkaamalla tai sovittamalla, mikäli muutos on olennaisesti muuttanut alkuperäisen luonnetta ja sisältöä tai muuttanut ilmaisumuotoa. (RDA Registry)
scope note: Innefattar skapandet av ett nytt verk genom att omarbeta, redigera eller arrangera ett verk av en annan upphovsperson, såvida ändringen väsentligen har ändrat originalets karaktär och innehåll eller uttrycksform. @sv

teokseen liittyvä yhteisö
type: Concept
source: RDA-termi
source: RDA-term @sv
created: 2024-12-18
modified: 2025-08-22
definition: Yhteisö, joka liittyy teokseen. (RDA Registry)
definition: Institution som relaterar till ett verk. @sv
in scheme: Metatietosanasto
narrower: isäntäorganisaatio
narrower: vastaanottaja
narrower: aiheena oleva yhteisö
narrower: teoksen omistuksen kohde
narrower: toimeksiantaja
narrower: teoksen tekijä
narrower: teoksen sponsori
narrower: teoksella kunnioitettu yhteisö
narrower: julkaisija
preferred label: related corporate body of work @en
preferred label: institution relaterad till verket @sv

yhdistymään osallinen toimija
type: Concept
source: RDA-termi
source: RDA-term @sv
created: 2024-12-18
modified: 2025-08-23
alternative label: contributor to amalgamation @en
alternative label: yhdistymään osallistuja
alternative label: bidragsgivare till sammansmältning @sv
broader: version tekijä
definition: Toimija, joka osallistuu sellaisen ekspression tekemiseen, joka on saumaton yhdistelmä erilaisia sisältöjä. (RDA Registry)
definition: Aktör som deltar i utförandet av ett sådant uttryck som är en sömlös kombination av olika innehåll. @sv
in scheme: Metatietosanasto
narrower: pöytäkirjan laatija
narrower: tuomioistuimen kirjuri
narrower: tekstaaja
narrower: piirtäjä
narrower: värittäjä
narrower: ohjelmistokehittäjä
narrower: esitykseen osallinen toimija
narrower: toimittaja
preferred label: contributor agent to amalgamation @en
preferred label: bidragsgivare (aktör) till sammansmältning @sv

yhdistymään osallinen yhteisö
type: Concept
source: RDA-termi
source: RDA-term @sv
created: 2024-12-18
modified: 2025-08-23
broader: teoksen version tekijä
definition: Yhteisö, joka osallistuu sellaisen ekspression tekemiseen, joka on saumaton yhdistelmä erilaisia sisältöjä. (RDA Registry)
definition: Institution som deltar i utförandet av ett sådant uttryck som är en sömlös kombination av olika innehåll. @sv
in scheme: Metatietosanasto
narrower: värittäjä
narrower: toimittaja
narrower: esitykseen osallinen yhteisö
narrower: tekstaaja
narrower: piirtäjä
narrower: pöytäkirjan laatija
narrower: ohjelmistokehittäjä
narrower: tuomioistuimen kirjuri
preferred label: contributor corporate body to amalgamation @en
preferred label: bidragsgivare (institution) till sammansmältning @sv

teokseen liittyvä henkilö
type: Concept
source: RDA-termi
source: RDA-term @sv
created: 2024-12-18
modified: 2025-08-22
definition: Henkilö, joka liittyy teokseen. (RDA Registry)
definition: Person som relaterar till ett verk. @sv
in scheme: Metatietosanasto
narrower: gratulaation kohde
narrower: vastaanottaja
narrower: julkaisija
narrower: teoksella kunnioitettu henkilö
narrower: teoksen tekijä
narrower: toimeksiantaja
narrower: aiheena oleva henkilö
narrower: teoksen sponsori
narrower: teoksen omistuksen kohde
preferred label: related person of work @en
preferred label: person relaterad till verket @sv

myöhempi teos
type: Concept
source: RDA-termi
source: RDA-term @sv
created: 2018-09-07
modified: 2025-12-19
Vastavuoroinen suhde: edeltävä teos
alternative label: efterföljande verk @sv
broader: muunnos linjassa
definition: Teos, jolla on toista teosta myöhäisempi ajallinen kattavuus. (RDA Registry)
definition: Verk som har en senare tidsmässig omfattning än ett annat verk. @sv
in scheme: Metatietosanasto
narrower: jakautunut teokseen
narrower: yhdistynyt teokseksi
narrower: sulautunut osittain teokseen
narrower: eronnut teokseksi
narrower: osittain korvattu teoksella
narrower: sulautunut teokseen
narrower: korvaava teos
narrower: seuraaja
preferred label: succeeded by work @en
preferred label: senare verk @sv

kuvataiteilija
type: Concept
source: Kansallinen RDA-termi
source: YSO-termi
source: ALLFO-term @sv
source: Nationell RDA-term @sv
created: 2018-11-01
modified: 2024-08-27
alternative label: visual artists @en
alternative label: kuvaamataiteilijat
alternative label: kuvataiteilijat
alternative label: bildkonstnärer @sv
broader: taiteilija
in scheme: Metatietosanasto
narrower: koristemaalari
narrower: piirtäjä
narrower: kuvanveistäjä
narrower: taidemaalari
narrower: ikonimaalari
narrower: kuvittaja
narrower: valokuvaaja
narrower: heraldikko
narrower: graafikko
preferred label: visual artist @en
preferred label: bildkonstnär @sv

avustaja
type: Concept
source: Kansallinen RDA-termi
source: YSO-termi
source: ALLFO-term @sv
source: Nationell RDA-term @sv
created: 2018-11-01
modified: 2024-08-27
alternative label: assistants @en
alternative label: avustajat
in scheme: Metatietosanasto
narrower: poliittinen avustaja
narrower: henkilökohtainen avustaja
narrower: vammaisten avustaja
narrower: työssäkäyntiavustaja
narrower: kotiavustaja
narrower: oikeudenkäyntiavustaja
narrower: kansanedustajan avustaja
narrower: kyläavustaja
narrower: hoitoavustaja
narrower: vanhustenhoitaja
preferred label: assistant (general) @en
preferred label: hjälpare @sv

kirjailija
type: Concept
source: Kansallinen RDA-termi
source: YSO-termi
source: ALLFO-term @sv
source: Nationell RDA-term @sv
created: 2018-11-01
modified: 2025-09-24
alternative label: authors @en
alternative label: national author @en
alternative label: writers @en
alternative label: esseisti
alternative label: kansalliskirjailija
alternative label: kaunokirjailija
alternative label: kirjailijat
alternative label: novelisti
alternative label: novellisti
alternative label: proosakirjailija
alternative label: prosaisti
alternative label: työläiskirjailija
alternative label: arbetarförfattare @sv
alternative label: nationalförfattare @sv
alternative label: nationalskald @sv
alternative label: proletärförfattare @sv
broader: taiteilija
in scheme: Metatietosanasto
narrower: näytelmäkirjailija
narrower: lastenkirjailija
narrower: tietokirjailija
narrower: sanoittaja
narrower: kansankirjailija
narrower: nuortenkirjailija
narrower: runoilija
narrower: harrastajakirjoittaja
narrower: oppikirjailija
preferred label: author @en
preferred label: författare @sv

virkailija
type: Concept
source: Kansallinen RDA-termi
source: Nationell RDA-term @sv
created: 2019-06-11
modified: 2025-11-04
in scheme: Metatietosanasto
narrower: hotellivirkailija
narrower: kirjastovirkailija
narrower: verovirkailija
narrower: lentovirkailija
narrower: museovirkailija
narrower: arkistovirkailija
narrower: tullivirkailija
narrower: matkailuvirkailija
narrower: vakuutusvirkailija
narrower: televirkailija
preferred label: tjänsteman @sv

aggregaattiin osallinen henkilö
type: Concept
source: RDA-termi
source: RDA-term @sv
created: 2024-03-12
modified: 2025-05-27
alternative label: bidragsgivande person till aggregat @sv
broader: aineistoon liittyvä henkilö
definition: Henkilö, joka on vastuussa aggregaattiin sisältyvän teoksen ekspression luomisesta. (RDA Registry)
definition: Person som svarar för skapandet av ett verks uttryck som ingår i ett aggregat. @sv
in scheme: Metatietosanasto
narrower: koreografi (manifestaatio)
narrower: liikkuvaan kuvaan osallinen henkilö
narrower: kartantekijä
narrower: esineeseen osallinen henkilö
narrower: musiikkiin osallinen henkilö
narrower: puheeseen osallinen henkilö
narrower: stillkuvaan osallinen henkilö
narrower: tekstiin osallinen henkilö
narrower: digitaaliseen sisältöön osallinen henkilö
preferred label: contributor person to aggregate @en
preferred label: bidragsgivare (person) till aggregat @sv

aggregaattiin osallinen yhteisö
type: Concept
source: RDA-termi
source: RDA-term @sv
created: 2024-03-12
modified: 2025-05-27
alternative label: bidragsgivande institution till aggregat @sv
broader: aineistoon liittyvä yhteisö
definition: Yhteisö, joka on vastuussa aggregaattiin sisältyvän teoksen ekspression luomisesta. (RDA Registry)
definition: Institution som svarar för skapandet av ett verks uttryck som ingår i ett aggregat. @sv
in scheme: Metatietosanasto
narrower: kartantekijä
narrower: digitaaliseen sisältöön osallinen yhteisö
narrower: esineeseen osallinen yhteisö
narrower: tekstiin osallinen yhteisö
narrower: liikkuvaan kuvaan osallinen yhteisö
narrower: koreografi (manifestaatio)
narrower: musiikkiin osallinen yhteisö
narrower: puheeseen osallinen yhteisö
narrower: stillkuvaan osallinen yhteisö
preferred label: contributor corporate body to aggregate @en
preferred label: bidragsgivare (institution) till aggregat @sv

aggregaattiin osallinen toimija
type: Concept
source: RDA-termi
source: RDA-term @sv
created: 2024-12-18
modified: 2025-05-27
alternative label: bidragsgivare (agent) till aggregat @sv
broader: aineistoon liittyvä toimija
definition: Toimija, joka on vastuussa aggregaattiin sisältyvän teoksen ekspression luomisesta. (RDA Registry)
definition: Aktör som svarar för skapandet av ett verks uttryck som ingår i ett aggregat. @sv
in scheme: Metatietosanasto
narrower: digitaaliseen sisältöön osallinen toimija
narrower: tekstiin osallinen toimija
narrower: kartantekijä
narrower: puheeseen osallinen toimija
narrower: koreografiaan osallinen toimija
narrower: stillkuvaan osallinen toimija
narrower: liikkuvaan kuvaan osallinen toimija
narrower: musiikkiin osallinen toimija
narrower: esineeseen osallinen toimija
preferred label: contributor agent to aggregate @en
preferred label: bidragsgivare (aktör) till aggregat @sv

edeltävä teos
type: Concept
source: RDA-termi
source: RDA-term @sv
created: 2018-09-07
modified: 2025-12-19
Vastavuoroinen suhde: myöhempi teos
alternative label: aiempi teos
alternative label: tidigare verk @sv
broader: muunnos linjassa teoksesta
definition: Teos, jonka kronologinen kattavuus on varhaisempi kuin toisella teoksella. (RDA Registry)
definition: Verk vars kronologiska omfattning är tidigare än ett annat verks. @sv
in scheme: Metatietosanasto
narrower: itsenäinen jatko-osa teokselle
narrower: korvaa teoksen
narrower: eronnut teoksesta
narrower: jakautunut teoksesta
narrower: korvaa osittain teoksen
narrower: osittain sulautunut teos
narrower: teokseen yhdistyjä
narrower: sulautunut teos
narrower: jatkoa teokselle
preferred label: preceded by work @en
preferred label: föregående verk @sv

myöhempi teoksen versio
type: Concept
source: RDA-termi
source: RDA-term @sv
created: 2018-09-07
modified: 2025-08-15
Vastavuoroinen suhde: teoksen edeltävä versio
alternative label: myöhempi ekspressio
alternative label: efterföljande version @sv
alternative label: senare uttryck @sv
alternative label: senare version av verket @sv
broader: versioon liittyvä versio
definition: Teoksen ekspressio, joka seuraa edeltävää ekspressiota eli on sitä ajallisesti tai kerronnallisesti edellä. (RDA Registry)
definition: Uttryck av verk som följer på ett föregående uttryck, tidsmässigt eller berättarmässigt. @sv
in scheme: Metatietosanasto
narrower: seuraaja
narrower: jakautunut versioon
narrower: osittain korvattu versiolla
narrower: eronnut teoksen versioksi
narrower: sulautunut teoksen versioon
narrower: yhdistynyt teoksen versioksi
narrower: korvaava teoksen versio
narrower: sulautunut osittain teoksen versioon
narrower: jatko-osa (ekspressio)
preferred label: succeeded by expression @en
preferred label: senare version @sv

seppä
type: Concept
source: Kansallinen RDA-termi
source: YSO-termi
source: ALLFO-term @sv
source: Nationell RDA-term @sv
created: 2018-11-01
modified: 2024-08-27
alternative label: smiths @en
alternative label: sepät
alternative label: smeder @sv
broader: käsityöläinen
in scheme: Metatietosanasto
narrower: suksiseppä
narrower: aseseppä
narrower: kengitysseppä
narrower: kelloseppä
narrower: hopeaseppä
narrower: puuseppä
narrower: kultaseppä
narrower: peltiseppä
narrower: satulaseppä
narrower: lukkoseppä
preferred label: smith (craftsperson) @en
preferred label: smed @sv

yrittäjä
type: Concept
source: Kansallinen RDA-termi
source: YSO-termi
source: ALLFO-term @sv
source: Nationell RDA-term @sv
created: 2018-11-01
modified: 2024-08-27
alternative label: entrepreneurs @en
alternative label: yksityisyrittäjät
alternative label: yrittäjät
alternative label: egenföretagare @sv
alternative label: privatföretagare @sv
in scheme: Metatietosanasto
narrower: kauppias
narrower: matkailuyrittäjä
narrower: apteekkari
narrower: maaseutuyrittäjä
narrower: koneyrittäjä
narrower: pienyrittäjä
narrower: maatalousyrittäjä
narrower: liikkeenharjoittaja
narrower: teollisuusyrittäjä
narrower: liikenainen
narrower: liikemies
preferred label: entrepreneur @en
preferred label: företagare @sv

täydentävä teoksen versio
type: Concept
source: RDA-termi
source: RDA-term @sv
created: 2020-04-17
modified: 2025-08-23
alternative label: liittyy ekspressioon
alternative label: täydentävä ekspressio
alternative label: kompletterande uttryck @sv
alternative label: relaterat uttryck @sv
broader: versioon liittyvä versio
definition: Teoksen ekspressio, joka on yhdistetty siihen liittyvään ekspressioon ilman, että kumpaakaan ekspressiota pidetään ensisijaisena. (RDA Registry)
definition: Uttryck av verk, som är sammanparat med ett relaterat uttryck, utan att någotdera uttrycket anses primärt. @sv
in scheme: Metatietosanasto
narrower: koreografia
narrower: radio-ohjelman käsikirjoitus
narrower: käsikirjoitus radio-ohjelmaan
narrower: käsikirjoitus teoksen versioon
narrower: libretto versioon
narrower: käsikirjoitus
narrower: koreografia teoksen versioon
narrower: musiikki teoksen versioon
narrower: libretto
narrower: musiikki
preferred label: complemented by expression @en
preferred label: kompletterande version @sv

johdannaisteos
type: Concept
source: RDA-termi
source: RDA-term @sv
created: 2016-01-08
modified: 2025-11-18
Vastavuoroinen suhde: teoksen perustana
alternative label: johdettu teos
broader: muunnos genressä
definition: Teos, joka on toisen teoksen muunnos. (RDA Registry)
definition: Verk som är en variant av ett annat verk. @sv
in scheme: Metatietosanasto
narrower: laajennelma
narrower: abstraktit (teos)
narrower: lyhennelmä
narrower: tekstiin perustuva musiikki
narrower: mukautettu lyhennelmä
narrower: muuntelun tuloksena muodostunut teos
narrower: selkokielinen versio (teos)
narrower: intertekstuaalinen suhde (teos)
narrower: mukaelma
preferred label: derivative work @en
preferred label: härlett verk @sv

täydentävä teos
type: Concept
source: RDA-termi
source: RDA-term @sv
created: 2016-01-08
modified: 2025-08-23
alternative label: liittyy teokseen
alternative label: relaterat verk @sv
broader: teokseen liittyvä teos
definition: Teos, joka on yhdistetty siihen liittyvään teokseen ilman, että kumpaakaan teosta pidetään ensisijaisena. (RDA Registry)
definition: Verk, som är sammanparat med ett relaterat uttryck, utan att någotdera uttrycket anses primärt. @sv
in scheme: Metatietosanasto
narrower: koreografia teokseen
narrower: koreografia
narrower: musiikki teokseen
narrower: musiikki
narrower: tekstiteos
narrower: puhe teokseen
narrower: ääni teokseen
narrower: ääniteos
narrower: puheteos
narrower: teksti teokseen
preferred label: complemented by work @en
preferred label: kompletterande verk @sv

teoksen perustana
type: Concept
source: RDA-termi
source: RDA-term @sv
created: 2016-01-08
modified: 2025-11-18
Vastavuoroinen suhde: johdannaisteos
alternative label: source work @en
alternative label: lähdeteos
alternative label: perustuu teokseen
alternative label: pohjautuu teokseen
alternative label: baserat på verket @sv
alternative label: grundar sig på verket @sv
alternative label: källverk @sv
broader: muunnos genressä teoksesta
definition: Teos, jota on muokattu uuden teoksen luomiseksi. (RDA Registry)
definition: Verk som har bearbetats för att skapa ett nytt verk. @sv
in scheme: Metatietosanasto
narrower: mukaelma teoksesta
narrower: abstraktit teoksesta
narrower: lyhennelmä teoksesta
narrower: laajennettu versio teoksesta
narrower: perustuu osittain teokseen
narrower: mukautettu lyhennelmä teoksesta
narrower: muunnelmien perustana oleva teos
narrower: musiikkiteoksen teksti
narrower: intertekstuaalisen viittauksen perustana (teos)
preferred label: is based on work @en
preferred label: verk baserat på @sv

sotilashenkilö
type: Concept
source: Kansallinen RDA-termi
source: YSO-termi
source: ALLFO-term @sv
source: Nationell RDA-term @sv
created: 2018-11-01
modified: 2024-08-27
alternative label: military persons @en
alternative label: sotilashenkilöt
alternative label: militärer @sv
alternative label: militärpersoner @sv
in scheme: Metatietosanasto
narrower: kenttäpiispa
narrower: sotilasvirkamies
narrower: upseeri
narrower: adjutantti
narrower: sotilastarkkailija
narrower: sotilasammattihenkilö
narrower: puolustusvoimain komentaja
narrower: aliupseeri
narrower: sotilaspappi
narrower: marsalkka
narrower: raivaajasukeltaja
narrower: kanta-aliupseeri
preferred label: military person @en
preferred label: militärperson @sv

pappi
type: Concept
source: Kansallinen RDA-termi
source: YSO-termi
source: ALLFO-term @sv
source: Nationell RDA-term @sv
created: 2018-11-01
modified: 2024-08-27
alternative label: clergymen @en
alternative label: minister @en
alternative label: pastors @en
alternative label: priests @en
alternative label: papit
alternative label: pastorit
alternative label: pastorer @sv
alternative label: präster @sv
broader: kirkon työntekijä
in scheme: Metatietosanasto
narrower: pappismunkki
narrower: vankilapappi
narrower: merimiespappi
narrower: sairaalapappi
narrower: rovasti
narrower: kappalainen
narrower: kirkkoherra
narrower: kuurojenpappi
narrower: oppilaitospappi
narrower: sotilaspappi
narrower: seurakuntapastori
preferred label: priest @en
preferred label: präst @sv

toimielin
type: Concept
source: Kansallinen RDA-termi
source: Nationell RDA-term @sv
created: 2021-04-20
modified: 2024-05-24
alternative label: asiamies (yhteisötyyppi)
alternative label: jaosto
alternative label: seurantaryhmä
alternative label: yksikkö (toimielin)
alternative label: avdelning (organ) @sv
alternative label: enhet (organ) @sv
alternative label: uppföljningsgrupp @sv
definition: Jonkin yhteisön määrätehtäviä hoitava yksikkö, elin (Kielitoimiston sanakirja).
definition: Organ, enhet i en institution som sköter bestämda uppgifter. @sv
in scheme: Metatietosanasto
narrower: komitea
narrower: toimikunta
narrower: lautakunta
narrower: hallitus (toimielin)
narrower: neuvottelukunta
narrower: valiokunta
narrower: valtuuskunta
narrower: johtoryhmä
narrower: valtuusto
narrower: hoitokunta
narrower: neuvosto
narrower: työryhmä
preferred label: organ @sv
scope note: Valtionhallinnon osalta käytetään vain määräaikaisista toimielimistä; pysyvistä käytetään termiä viranomainen.
scope note: Gällande statsförvaltning används termen endast om tidsbestämda organ; om bestående används termen myndighet. @sv

taideteos
type: Concept
created: 2023-01-21
modified: 2023-05-05
in scheme: Metatietosanasto
narrower: ympäristötaide
narrower: biotaide
narrower: piirustus
narrower: valokuva
narrower: grafiikka
narrower: taideteollisuusesine
narrower: maalaus
narrower: taiteilijan työvälineet
narrower: esineteos
narrower: veistos
narrower: mediataide
narrower: installaatio
preferred label: konstverk @sv

suunnittelija
type: Concept
source: Kansallinen RDA-termi
source: YSO-termi
source: ALLFO-term @sv
source: Nationell RDA-term @sv
created: 2018-11-01
modified: 2024-08-27
alternative label: planners and designers @en
alternative label: suunnittelija (ammatti)
alternative label: planerare (yrke) @sv
in scheme: Metatietosanasto
narrower: kaupunkisuunnittelija
narrower: graafinen suunnittelija
narrower: tekstiilisuunnittelija
narrower: atk-suunnittelija
narrower: systeemisuunnittelija
narrower: pääsuunnittelija
narrower: muotisuunnittelija
narrower: sisustussuunnittelija
narrower: vaatesuunnittelija
narrower: sähkösuunnittelija
narrower: tekninen suunnittelija
narrower: yhdyskuntasuunnittelija
narrower: mainossuunnittelija
preferred label: planner/designer @en
preferred label: planerare @sv

näyttämötaiteilija
type: Concept
source: Kansallinen RDA-termi
source: YSO-termi
source: ALLFO-term @sv
source: Nationell RDA-term @sv
created: 2018-11-01
modified: 2025-11-05
alternative label: stage artists @en
alternative label: estraditaiteilijat
alternative label: näyttämötaiteilijat
alternative label: estradartister @sv
alternative label: scenartist @sv
alternative label: scenartister @sv
alternative label: scenkonstnärer @sv
broader: taiteilija
in scheme: Metatietosanasto
narrower: teatterimuusikko
narrower: pukusuunnittelija
narrower: näyttelijä
narrower: valosuunnittelija
narrower: sirkustaiteilija
narrower: koreografi
narrower: dramaturgi
narrower: lausuja
narrower: äänisuunnittelija
narrower: tanssija
narrower: lavastaja
narrower: teatteriohjaaja
preferred label: stage artist @en
preferred label: scenkonstnär @sv

yleisurheilija
type: Concept
source: Kansallinen RDA-termi
source: YSO-termi
source: ALLFO-term @sv
source: Nationell RDA-term @sv
created: 2018-11-01
modified: 2024-08-27
alternative label: track and field athletes @en
alternative label: yleisurheilijat
broader: urheilija
in scheme: Metatietosanasto
narrower: kymmenottelija
narrower: seiväshyppääjä
narrower: juoksija
narrower: keihäänheittäjä
narrower: kolmiloikkaaja
narrower: kiekonheittäjä
narrower: kilpakävelijä
narrower: seitsenottelija
narrower: kuulantyöntäjä
narrower: korkeushyppääjä
narrower: pituushyppääjä
narrower: moukarinheittäjä
preferred label: track and field athlete @en
preferred label: friidrottare @sv

yhdistymään osallinen henkilö
type: Concept
source: RDA-termi
source: RDA-term @sv
created: 2024-12-18
modified: 2025-08-23
broader: teoksen version tekijä
definition: Henkilö, joka osallistuu sellaisen ekspression tekemiseen, joka on saumaton yhdistelmä erilaisia sisältöjä. (RDA Registry)
definition: Person som deltar i utförandet av ett sådant uttryck som är en sömlös kombination av olika innehåll. @sv
in scheme: Metatietosanasto
narrower: kuvatoimittaja
narrower: sukututkija
narrower: tehtävien tekijä
narrower: esitykseen osallinen henkilö
narrower: värittäjä
narrower: leikkaaja
narrower: ohjelmistokehittäjä
narrower: toimittaja
narrower: tuomioistuimen kirjuri
narrower: pöytäkirjan laatija
narrower: tekstaaja
narrower: piirtäjä
preferred label: contributor person to amalgamation @en
preferred label: bidragsgivare (person) till sammansmältning @sv

teoksen edeltävä versio
type: Concept
source: RDA-termi
source: RDA-term @sv
created: 2018-09-07
modified: 2025-08-22
Vastavuoroinen suhde: myöhempi teoksen versio
alternative label: aiempi ekspressio
alternative label: edeltävä ekspressio
alternative label: föregående uttryck @sv
alternative label: föregående version av verk @sv
alternative label: tidigare uttryck @sv
broader: versioon liittyvä versio
definition: Teoksen ekspressio, joka edeltää seuraavaa ekspressiota eli on sitä ajallisesti tai kerronnallisesti varhaisempi. (RDA Registry)
definition: Uttryck av verk, som föregår följande uttryck, det vill säga är tidigare kronologiskt eller narrativt. @sv
in scheme: Metatietosanasto
narrower: jatkoa versiolle
narrower: eronnut teoksen versiosta
narrower: teoksen versioon yhdistyjä
narrower: korvaa osittain teoksen version
narrower: korvaa version
narrower: osittain sulautunut teoksen versio
narrower: jakautunut teoksen versiosta
narrower: sulautunut teoksen versio
narrower: julkaistu myös nimellä
narrower: julkaistu aiemmin nimellä
narrower: julkaistu myöhemmin nimellä
narrower: esiosa (ekspressio)
preferred label: preceded by expression @en
preferred label: föregående version @sv

aineenopettaja
type: Concept
source: Kansallinen RDA-termi
source: YSO-termi
source: ALLFO-term @sv
source: Nationell RDA-term @sv
created: 2018-11-01
modified: 2024-10-12
alternative label: subject teachers @en
alternative label: aineenopettajat
broader: opettaja
in scheme: Metatietosanasto
narrower: fysiikanopettaja
narrower: matematiikanopettaja
narrower: uskonnonopettaja
narrower: kuvataideopettaja
narrower: historianopettaja
narrower: kuvaamataidonopettaja
narrower: liikunnanopettaja
narrower: äidinkielenopettaja
narrower: kotitalousopettaja
narrower: kieltenopettaja
narrower: käsityönopettaja
narrower: musiikinopettaja
narrower: piirustuksenopettaja
preferred label: subject teacher @en
preferred label: ämneslärare @sv

kirkon työntekijä
type: Concept
source: Kansallinen RDA-termi
source: YSO-termi
source: ALLFO-term @sv
source: Nationell RDA-term @sv
created: 2018-11-01
modified: 2024-11-08
alternative label: church employees @en
alternative label: kirkon työntekijät
alternative label: kirkon viranhaltijat
alternative label: kyrkans anställda @sv
alternative label: kyrkliga tjänsteinnehavare @sv
alternative label: kyrkligt anställda @sv
broader: työntekijä
in scheme: Metatietosanasto
narrower: lehtori (kirkon työntekijä)
narrower: lapsityönohjaaja
narrower: pappi
narrower: lukkari
narrower: diakonissa
narrower: piispa
narrower: lähetystyöntekijä
narrower: suntio
narrower: nuorisotyönohjaaja
narrower: diakoni
narrower: kanttori
narrower: lähetyssihteeri
narrower: kenraalisuperintendentti
preferred label: church employee @en
preferred label: kyrkans arbetstagare @sv

julkinen hallinto
type: Concept
source: Kansallinen RDA-termi
source: Nationell RDA-term @sv
created: 2019-03-13
modified: 2026-05-06
definition: Julkisoikeudellista ja erityisesti julkishallinnollista tehtävää suorittavat tai sisäisestä turvallisuudesta ja järjestyksestä huolehtivat organisaatiot sekä pakollisen sosiaalivakuutustoiminnan toimijat. Pääluokkaan eivät kuulu ne julkishallinnon toimijat, joiden toiminta luetaan luonteensa puolesta toiseen pääluokkaan, esim. sotilasyksiköt (ks. puolustusvoimat), oppilaitokset (ks. koulutus), terveyden- ja sosiaalihuollon laitokset (ks. terveys- ja sosiaaliala), kulttuuri- ja urheilulaitokset (ks. kulttuuri- ja viihdeala, urheilu- ja virkistystoiminta), sekä eri toimialojen tutkimuslaitokset ja liikelaitokset. Pääluokka jakaantuu alaluokkiin hallinnonalan mukaan. Pääluokkaan liitetään ne julkishallinnon toimijat, joita ei päätoimialansa mukaan voida liittää mihinkään julkisen hallinnon alaluokista, esim. valtionhallinnon ylimmät viranomaiset.
definition: Organisationer som utför offentligrättsliga uppgifter och särskilt uppgifter inom offentlig förvaltning, eller ansvarar för inre säkerhet och ordning, samt aktörer inom obligatorisk socialförsäkringsverksamhet. Till huvudkategorin hör inte de aktörer inom offentlig förvaltning, vars verksamhet p.g.a. sin karaktär räknas till en annan huvudkategori, t.ex. militära enheter (se försvarsmakten), läroanstalter (se utbildning), anstalter för hälso- och socialvård (se hälso- och socialvårdsbranschen), kultur- och idrottsanläggningar (se kultur- och nöjesbranschen, idrotts- och rekreationsverksamhet) samt forskningsanstalter och affärsinrättningar inom olika verksamhetsområden. Huvudkategorin indelas i underavdelningar enligt förvaltningsområde. Med huvudkategorin sammankopplas de aktörer inom offentlig förvaltning som inte kan sammankopplas enligt sitt huvudsakliga verksamhetsområde med någon av underavdelningarna inom offentlig förvaltning, t.ex. de högsta myndigheterna för statsförvaltning. @sv
example: eduskunta, valtioneuvoston kanslia, kenraalikuvernöörin kanslia, Suomen senaatti, Vaasan senaatti, Suomen kansanvaltuuskunta, komiteat, oikeuskanslerinvirasto, tasavallan presidentin kanslia
example: riksdagen, statsrådets kansli, generalguvernörskansliet, Kejserliga Senaten för Finland, Vasasenaten, Finska folkdelegationen, kommittéer, justitiekanslersämbetet, republikens presidents kansli @sv
in scheme: Metatietosanasto
narrower: sosiaali- ja terveyshallinto
narrower: sisäasiainhallinto
narrower: maa- ja metsätaloushallinto
narrower: ulkoasiainhallinto
narrower: liikenne- ja rakennushallinto
narrower: ympäristö- ja vesihallinto
narrower: sosiaalivakuutus
narrower: opetus- ja kulttuurihallinto
narrower: kansanhuolto ja elintarvikehuolto
narrower: puolustushallinto
narrower: työ- ja elinkeinohallinto
narrower: oikeushallinto
narrower: kirkon hallinto
narrower: valtiovarainhallinto
preferred label: offentlig förvaltning @sv

oppilaitos
type: Concept
source: Kansallinen RDA-termi
source: Nationell RDA-term @sv
created: 2021-04-20
modified: 2024-12-18
alternative label: oppilaitos (yhteisötyyppi)
alternative label: läroanstalt (institutionstyp) @sv
alternative label: läroinrättning @sv
in scheme: Metatietosanasto
narrower: erityiskoulu
narrower: pappisseminaari
narrower: oppikoulu
narrower: yliopisto
narrower: lukio
narrower: sotilasopetuslaitos
narrower: ammatillinen oppilaitos
narrower: ammattikorkeakoulu
narrower: peruskoulu
narrower: harjoittelukoulu
narrower: opisto
narrower: kansakoulu
narrower: opettajaseminaari
preferred label: läroanstalt @sv
related: koulutuskeskus

yhteisöön liittyvä henkilö
type: Concept
source: RDA-termi
source: RDA-term @sv
created: 2024-12-18
modified: 2025-08-27
definition: Henkilö, joka liittyy yhteisöön. (RDA Registry)
definition: Person som relaterar till en institution. @sv
in scheme: Metatietosanasto
narrower: opiskelija
narrower: yhteisöä sponsoroiva henkilö
narrower: toimihenkilö
narrower: loppututkinnon suorittanut
narrower: liittyy ryhmään
narrower: johtaja
narrower: muusa
narrower: mesenaatti
narrower: vaikuttaja
narrower: vaikuttajana
narrower: mesenaattina
narrower: murhattu
narrower: yhteisön henkilöjäsen
narrower: yhteisön perustanut henkilö
preferred label: related person of corporate body @en
preferred label: person relaterad till institutionen @sv

henkilöön liittyvä yhteisö
type: Concept
source: RDA-termi
source: RDA-term @sv
created: 2024-12-18
modified: 2025-01-31
definition: Yhteisö, joka liittyy henkilöön. (RDA Registry)
definition: Institution som är relaterad till en person. @sv
in scheme: Metatietosanasto
narrower: toimihenkilönä yhteisössä
narrower: oppilaitos
narrower: tutkinnon myöntänyt oppilaitos
narrower: henkilöjäsen yhteisössä
narrower: johtajana
narrower: liittyy ryhmään
narrower: muusana
narrower: mesenaattina
narrower: mesenaatti
narrower: henkilön perustama yhteisö
narrower: vaikuttajana
narrower: vaikuttaja
narrower: murhaaja
narrower: henkilön sponsoroima yhteisö
preferred label: related corporate body of person @en
preferred label: institution relaterad till personen @sv

musiikkiin osallinen henkilö
type: Concept
source: RDA-termi
source: RDA-term @sv
created: 2024-12-18
modified: 2025-08-14
broader: aggregaattiin osallinen henkilö
definition: Aggregaattiin osallinen henkilö, joka on luonut aggregaattiin sisältyvän musiikkiteoksen ekspression.
definition: Person som bidragit till ett aggregat och skapat ett musikverks uttryck som ingår i ett aggregat. @sv
in scheme: Metatietosanasto
narrower: esittäjä
narrower: laulaja
narrower: taltioija
narrower: musiikin äänittäjä
narrower: sovittaja
narrower: soittaja
narrower: miksaaja
narrower: musiikkiohjelmoija
narrower: DJ
narrower: libretisti
narrower: säveltäjä
narrower: sanoittaja
narrower: johtaja
preferred label: contributor person of music @en
preferred label: bidragsgivare (person) till musik @sv

versioon liittyvä versio
type: Concept
source: RDA-termi
source: RDA-term @sv
created: 2024-12-18
modified: 2025-08-23
alternative label: derivative expression relationship @en
alternative label: sequential expression relationship @en
alternative label: whole-part expression relationship @en
alternative label: ekspressioon liittyvä ekspressio
alternative label: uttryck relaterat till uttrycket @sv
definition: Ekspressio, joka liittyy ekspressioon (RDA Registry)
definition: Uttryck som relaterar till ett uttryck. @sv
in scheme: Metatietosanasto
narrower: ekspression perustana
narrower: myöhempi teoksen versio
narrower: teoksen edeltävä versio
narrower: version osa
narrower: osa teoksen versiosta
narrower: täydentävä teoksen versio
narrower: laajennus teoksen versioon
narrower: laajennettu versiolla
narrower: aggregoija
narrower: aggregoi version
narrower: lähdeversio
narrower: johdannaisversio
narrower: johdannaisteoksen versio
preferred label: related expression of expression @en
preferred label: version relaterad till versionen @sv

musiikkiin osallinen yhteisö
type: Concept
source: RDA-termi
source: RDA-term @sv
created: 2024-12-18
modified: 2025-08-14
broader: aggregaattiin osallinen yhteisö
definition: Aggregaattiin osallinen yhteisö, joka on luonut aggregaattiin sisältyvän musiikkiteoksen ekspression.
definition: Institution som bidragit till ett aggregat och skapat ett musikverks uttryck som ingår i ett aggregat. @sv
in scheme: Metatietosanasto
narrower: laulaja
narrower: sanoittaja
narrower: DJ
narrower: taltioija
narrower: johtaja
narrower: sovittaja
narrower: esittäjä
narrower: miksaaja
narrower: musiikkiohjelmoija
narrower: musiikin äänittäjä
narrower: soittaja
narrower: säveltäjä
narrower: libretisti
preferred label: contributor corporate body of music @en
preferred label: bidragsgivare (institution) till musik @sv

ekspression perustana
type: Concept
source: RDA-termi
source: RDA-term @sv
created: 2016-01-08
modified: 2025-11-18
Vastavuoroinen suhde: johdannaisteoksen versio
alternative label: expression of source work @en
alternative label: lähdeteoksen ekspressio
alternative label: lähdeteoksen versio
alternative label: perustuu ekspressioon
alternative label: baserat på uttrycket @sv
alternative label: uttryck för källverk @sv
alternative label: version av källverk @sv
broader: versioon liittyvä versio
definition: Teoksen ekspressio, jota on muokattu johdannaisteoksen ekspression luomiseksi. (RDA Registry)
definition: Uttryck av verk, som har bearbetats för att skapa ett uttryck av ett härlett verk. @sv
in scheme: Metatietosanasto
narrower: abstraktit ekspressiosta
narrower: vapaa käännös versiosta
narrower: mukautettu lyhennelmä versiosta
narrower: parafraasi versiosta
narrower: musiikkiteoksen teksti
narrower: uusintaproduktio versiosta
narrower: jäljitelmä versiosta
narrower: variaation perustana oleva versio
narrower: laajennettu versio versiosta
narrower: lyhennelmä versiosta
narrower: mukaelma versiosta
narrower: konkordanssihakemisto
narrower: intertekstuaalisen viittauksen perustana (ekspressio)
preferred label: based on expression @en
preferred label: uttryck baserat på @sv

teknikko
type: Concept
source: Kansallinen RDA-termi
source: YSO-termi
source: ALLFO-term @sv
source: Nationell RDA-term @sv
created: 2018-11-01
modified: 2024-08-27
alternative label: technicians @en
alternative label: teknikot
alternative label: tekniker @sv
in scheme: Metatietosanasto
narrower: karjatalousteknikko
narrower: vaatetusteknikko
narrower: ääniteknikko
narrower: elintarviketeknikko
narrower: metsäteknikko
narrower: vuoriteknikko
narrower: maanmittausteknikko
narrower: hammasteknikko
narrower: rakennusteknikko
narrower: sähköteknikko
narrower: autoteknikko
narrower: kauppateknikko
narrower: apuneuvoteknikko
narrower: maatalousteknikko
narrower: kotitalousteknikko
preferred label: technician @en
preferred label: tekniker (yrke) @sv

tutkija
type: Concept
source: Kansallinen RDA-termi
source: YSO-termi
source: ALLFO-term @sv
source: Nationell RDA-term @sv
created: 2018-11-01
modified: 2024-08-27
alternative label: researchers @en
alternative label: tutkijat
in scheme: Metatietosanasto
narrower: elokuvatutkija
narrower: metsäntutkija
narrower: perinteentutkija
narrower: rauhantutkija
narrower: teatterintutkija
narrower: työntutkija
narrower: musiikintutkija
narrower: kansanrunoudentutkija
narrower: historiantutkija
narrower: kirjallisuudentutkija
narrower: arkistotutkija
narrower: etnomusikologi
narrower: lääketieteen tutkija
narrower: maa- ja metsätaloustieteilijä
narrower: erikoistutkija
preferred label: researcher @en
preferred label: forskare @sv

tekstiin osallinen henkilö
type: Concept
source: RDA-termi
source: RDA-term @sv
created: 2024-12-18
modified: 2026-03-10
broader: aggregaattiin osallinen henkilö
definition: Aggregaattiin osallinen henkilö, joka on luonut aggregaattiin sisältyvän tekstiteoksen ekspression.
definition: Person som bidragit till ett aggregat och skapat ett uttryck av ett textverk som ingår i ett aggregat. @sv
in scheme: Metatietosanasto
narrower: tutkija
narrower: tekstaaja
narrower: transkriboija
narrower: kirjoittaja
narrower: kuvittaja
narrower: sarjakuvantekijä
narrower: opinnäytteen tarkastaja
narrower: kääntäjä
narrower: tuomioistuimen kirjuri
narrower: raportoija
narrower: pöytäkirjan laatija
narrower: sensori
narrower: tarkistaja
narrower: oheistekstin kirjoittaja
preferred label: contributor person of text @en
preferred label: bidragsgivare (person) till text @sv

soitinyhtye
type: Concept
source: Kansallinen RDA-termi
source: Nationell RDA-term @sv
created: 2017-11-10
modified: 2024-05-24
alternative label: instrumentalband @sv
alternative label: instrumentalgrupp @sv
broader: yhtye
definition: Nimitys 2–9 hengen suuruisille soitinkokoonpanoille.
definition: Ensemble bestående av en besättning på 2-9 instrumentalister. @sv
in scheme: Metatietosanasto
narrower: puhallinkvintetti
narrower: jousikvartetti
narrower: pianokvartetti
narrower: pianotrio
narrower: jousikvintetti
narrower: pianokvintetti
narrower: jousitrio
narrower: puupuhallinkvartetti
narrower: puupuhallinyhtye
narrower: jousiyhtye
narrower: vaskipuhallinyhtye
narrower: puhallinyhtye
narrower: näppäilysoitinyhtye
narrower: lyömäsoitinyhtye
narrower: kosketinsoitinyhtye
preferred label: instrumentalensemble @sv

virkamies
type: Concept
source: Kansallinen RDA-termi
source: YSO-termi
source: ALLFO-term @sv
source: Nationell RDA-term @sv
created: 2018-11-01
modified: 2024-08-27
alternative label: government officials @en
alternative label: public servants @en
alternative label: valtion virkamiehet
alternative label: virkamiehet
alternative label: virkamies (ammatti)
alternative label: statstjänstemän @sv
alternative label: tjänsteman (yrke) @sv
alternative label: tjänstemän @sv
in scheme: Metatietosanasto
narrower: kaupallinen sihteeri
narrower: oikeuskansleri
narrower: kirkkoneuvos
narrower: hovioikeuden presidentti
narrower: kansleri
narrower: kansliapäällikkö
narrower: teollisuusneuvos
narrower: teollisuussihteeri
narrower: valtiosihteeri
narrower: postivirkamies
narrower: ulosottomies
narrower: julkinen notaari
narrower: prokuraattori
narrower: rautatievirkamies
narrower: kaupunkireviisori
narrower: tullivirkamies
preferred label: public servant @en
preferred label: tjänsteman (offentligt anställda) @sv

teokseen liittyvä teos
type: Concept
source: RDA-termi
source: RDA-term @sv
created: 2024-12-18
modified: 2025-08-22
alternative label: derivative work relationship @en
alternative label: referential work relationship @en
alternative label: sequential work relationship @en
alternative label: whole-part work relationship @en
definition: Teos, joka liittyy teokseen. (RDA Registry)
definition: Verk som relaterar till ett verk. @sv
in scheme: Metatietosanasto
narrower: laajennus teokseen
narrower: esiosa
narrower: jatko-osa
narrower: innoitus teokselle
narrower: innoittaja
narrower: muistoteos
narrower: osa teosta
narrower: muistoteos teokselle
narrower: teoksen osa
narrower: laajennettu teoksella
narrower: aiheena oleva teos teoksessa
narrower: muunnos
narrower: muunnos teoksesta
narrower: aiheena oleva teos
narrower: täydentävä teos
preferred label: related work of work @en
preferred label: verk relaterat till verket @sv

esittäjä
type: Concept
source: RDA-termi
source: RDA-term @sv
created: 2016-01-08
modified: 2025-08-21
alternative label: performer @en
alternative label: esitt. (esittäjä)
alternative label: esittäjä (suhde)
alternative label: esittäjä (toimija)
alternative label: artist @sv
alternative label: artist (relation) @sv
alternative label: framförare (aktör) @sv
broader: esitykseen osallinen toimija
definition: Toimija, joka osallistuu teoksen ekspression tekemiseen esittämällä musiikkia, näyttelemällä, tanssimalla, puhumalla tai muissa rooleissa usein musiikki- tai näytelmäesityksessä. (RDA Registry)
definition: Aktör som deltar i utförandet av ett verk genom att framföra musik, skådespela, dansa, tala, eller fungera i andra roller, ofta i ett musikaliskt eller dramatiskt framförande. @sv
in scheme: Metatietosanasto
narrower: panelisti
narrower: tanssija
narrower: puhuja
narrower: näyttelijä
narrower: juontaja
narrower: nukettaja
narrower: johtaja
narrower: esittämisestä vastaava toimija
narrower: kertoja
narrower: esittelijä
narrower: moderoija
narrower: opettaja
narrower: laulaja
narrower: tarinankertoja
narrower: kommentaattori
narrower: soittaja
preferred label: performer agent @en
preferred label: framförande aktör @sv

ohjaaja (kasvatus ja opastus)
type: Concept
source: Kansallinen RDA-termi
source: YSO-termi
source: ALLFO-term @sv
source: Nationell RDA-term @sv
created: 2018-11-01
modified: 2024-08-27
alternative label: advisors @en
alternative label: instructors @en
alternative label: ohjaajat
alternative label: instruktörer @sv
in scheme: Metatietosanasto
narrower: urheiluohjaaja
narrower: kuntoutusohjaaja
narrower: lapsityönohjaaja
narrower: liikunnanohjaaja
narrower: työnohjaaja
narrower: kunto-ohjaaja
narrower: lapsiohjaaja
narrower: vapaa-ajanohjaaja
narrower: nuorisotyönohjaaja
narrower: perhepäivähoidon ohjaaja
narrower: personal trainer
narrower: sosiaaliohjaaja
narrower: koulunkäynninohjaaja
narrower: työpaikkaohjaaja
narrower: nuoriso-ohjaaja
narrower: kehitysvammaisten ohjaaja
narrower: opinto-ohjaaja
preferred label: instructor (guidance and education) @en
preferred label: handledare @sv

muusikko
type: Concept
source: Kansallinen RDA-termi
source: YSO-termi
source: ALLFO-term @sv
source: Nationell RDA-term @sv
created: 2018-11-01
modified: 2024-08-27
alternative label: musicians @en
alternative label: leikarit
alternative label: musiikkitaiteilijat
alternative label: muusikot
broader: taiteilija
in scheme: Metatietosanasto
narrower: laulaja
narrower: teatterimuusikko
narrower: harrastajamuusikko
narrower: säveltäjä
narrower: kirkkomuusikko
narrower: soittaja
narrower: truveeri
narrower: minnelaulaja
narrower: kapellimestari
narrower: katusoittaja
narrower: tanssimuusikko
narrower: minstreli
narrower: kuoronjohtaja
narrower: DJ
narrower: trubaduuri
narrower: rap-artisti
preferred label: musician @en
preferred label: musiker @sv

asiamies
type: Concept
source: Kansallinen RDA-termi
source: YSO-termi
source: ALLFO-term @sv
source: Nationell RDA-term @sv
created: 2018-11-01
modified: 2024-08-27
alternative label: ombudsman (profession) @en
alternative label: ombudsmen @en
alternative label: ombudspersons @en
alternative label: agentit
alternative label: asiamiehet
alternative label: asiamies (ammatti)
alternative label: agenter @sv
alternative label: ombud (yrke) @sv
alternative label: ombudsmän @sv
in scheme: Metatietosanasto
narrower: kuluttaja-asiamies
narrower: potilasasiamies
narrower: oikeusasiamies
narrower: eläinsuojeluasiamies
narrower: patenttiasiamies
narrower: sosiaaliasiamies
narrower: teollisoikeusasiamies
narrower: tavaramerkkiasiamies
narrower: elinkeinoasiamies
narrower: sotilasasiamies
narrower: julkisasiamies
narrower: piiriasiamies
narrower: ostoasiamies
narrower: koneasiamies
narrower: vakuutusasiamies
narrower: kunnanasiamies-veroasiamies
narrower: metsäasiamies
preferred label: ombudsman @en
preferred label: ombud @sv

mukaelma versiosta
type: Concept
source: RDA-termi
source: RDA-term @sv
created: 2019-01-05
modified: 2025-08-14
Vastavuoroinen suhde: mukaelma
alternative label: mukaelma ekspressiosta
alternative label: mukaelman perustana
alternative label: mukaelman perustana (ekspressio)
alternative label: omarbetning av uttrycket @sv
alternative label: omarbetning baserad på @sv
alternative label: omarbetning baserad på (uttryck) @sv
broader: ekspression perustana
definition: Teoksen ekspressio, jota on muokattu jotain muuta kuin alkuperäistä tarkoitusta, käyttöä tai esitysmuotoa varten. (RDA Registry)
definition: Uttryck av verk som har bearbetats för något annat syfte, någon annan användning eller representation än de ursprungliga. @sv
in scheme: Metatietosanasto
narrower: dramatisointi versiosta
narrower: runomukaelma versiosta
narrower: sarjakuvaversio versiosta
narrower: käsikirjoituksen perustana oleva versio
narrower: oratoriosovitus versiosta
narrower: elokuvaversio versiosta
narrower: radiosovitus versiosta
narrower: romaanimukaelma versiosta
narrower: videosovitus versiosta
narrower: radiokäsikirjoituksen perustana oleva versio
narrower: oopperasovitus versiosta
narrower: televisiosovitus versiosta
narrower: libreton perustana oleva versio
narrower: musikaaliversio versiosta
narrower: koreografinen sovitus versiosta
preferred label: adaptation of expression @en
preferred label: omarbetning av versionen @sv
scope note: Kattaa sekä teoksen muotoon kohdistuvat muutokset että samassa muodossa kokonaan uudelleenmuokatut teokset. (RDA Registry)
scope note: Omfattar både ändringar som gäller formen för ett verk och helt omarbetade verk i samma form. @sv

mukaelma
type: Concept
source: RDA-termi
source: RDA-term @sv
created: 2020-04-02
modified: 2025-08-14
Vastavuoroinen suhde: mukaelma versiosta
alternative label: mukaelma (ekspressio)
alternative label: omarbetning (uttryck) @sv
broader: johdannaisteoksen versio
definition: Teoksen ekspressio, joka muokkaa toisen teoksen ekspressiota jotain muuta kuin alkuperäistä tarkoitusta, käyttöä tai esitysmuotoa varten. (RDA Registry)
definition: Uttryck av verk, som ändrar ett annat verks uttryck för något annat syfte, någon annan användning eller representation än de ursprungliga. @sv
in scheme: Metatietosanasto
narrower: dramatisointi
narrower: teoksen versio sovitettu käsikirjoitukseksi
narrower: teoksen versio sovitettu libretoksi
narrower: teoksen versio sovitettu koreografiaksi
narrower: elokuvaversio
narrower: romaanimukaelma
narrower: oopperasovitus
narrower: runomukaelma
narrower: radiosovitus
narrower: videosovitus
narrower: sovitettu radiokäsikirjoitukseksi
narrower: musikaaliversio
narrower: sarjakuvaversio
narrower: televisiosovitus
narrower: oratoriosovitus
preferred label: adapted as expression @en
preferred label: omarbetning @sv
scope note: Kattaa sekä teoksen muotoon kohdistuvat muutokset että samassa muodossa kokonaan uudelleenmuokatut teokset. (RDA Registry)
scope note: Omfattar både ändringar som gäller formen för ett verk och helt omarbetade verk i samma form. @sv

esittäjä
type: Concept
source: RDA-termi
source: RDA-term @sv
created: 2024-12-18
modified: 2025-08-21
alternative label: esittäjä (yhteisö)
alternative label: framförare (institution) @sv
broader: esitykseen osallinen yhteisö
definition: Yhteisö, joka osallistuu ekspression tekemiseen esittämällä musiikkia, näyttelemällä, tanssimalla, puhumalla ja muissa rooleissa usein musiikki- tai näytelmäesityksessä. (RDA Registry)
definition: Institution som deltar i utförandet av ett uttryck genom att framföra musik, skådespela, dansa, tala, eller fungera i andra roller, ofta i ett musikaliskt eller dramatiskt framförande. @sv
in scheme: Metatietosanasto
narrower: soittaja
narrower: esittelijä
narrower: laulaja
narrower: panelisti
narrower: tarinankertoja
narrower: puhuja
narrower: johtaja
narrower: tanssija
narrower: moderoija
narrower: juontaja
narrower: kertoja
narrower: näyttelijä
narrower: nukettaja
narrower: kommentaattori
narrower: opettaja
narrower: esittämisestä vastaava yhteisö
preferred label: performer corporate body @en
preferred label: framförande institution @sv

tekstiin osallinen yhteisö
type: Concept
source: RDA-termi
source: RDA-term @sv
created: 2024-12-18
modified: 2026-02-18
broader: aggregaattiin osallinen yhteisö
definition: Aggregaattiin osallinen yhteisö, joka on luonut aggregaattiin sisältyvän tekstiteoksen ekspression.
definition: Institution som bidragit till ett aggregat och skapat ett uttryck av ett textverk som ingår i ett aggregat. @sv
in scheme: Metatietosanasto
narrower: kuvittaja
narrower: pöytäkirjan laatija
narrower: tuomioistuimen kirjuri
narrower: kääntäjä
narrower: haastattelija
narrower: sarjakuvantekijä
narrower: raportoija
narrower: transkriboija
narrower: opinnäytteen tarkastaja
narrower: sensori
narrower: tutkija
narrower: tarkistaja
narrower: tekstaaja
narrower: kirjoittaja
narrower: haastateltava
narrower: oheistekstin kirjoittaja
preferred label: contributor corporate body of text @en
preferred label: bidragsgivare (institution) till text @sv

taiteilija
type: Concept
source: Kansallinen RDA-termi
source: YSO-termi
source: ALLFO-term @sv
source: Nationell RDA-term @sv
created: 2018-11-01
modified: 2024-08-27
alternative label: taiteilija (ammatti)
alternative label: konstnär (yrke) @sv
in scheme: Metatietosanasto
narrower: mediataiteilija
narrower: kansantaiteilija
narrower: muusikko
narrower: harrastajataiteilija
narrower: performanssitaiteilija
narrower: kuvataiteilija
narrower: näyttämötaiteilija
narrower: tekstiilitaiteilija
narrower: keramiikkataiteilija
narrower: viihdetaiteilija
narrower: muotoilija
narrower: ympäristötaiteilija
narrower: ohjaaja (taiteet ja media)
narrower: kirjailija
narrower: korutaiteilija
narrower: videotaiteilija
narrower: läänintaiteilija
narrower: lasitaiteilija
preferred label: artist @en
preferred label: konstnär @sv

johdannaisteoksen versio
type: Concept
source: RDA-termi
source: RDA-term @sv
created: 2016-01-08
modified: 2025-11-18
Vastavuoroinen suhde: ekspression perustana
alternative label: johdannaisteoksen ekspressio
alternative label: johdettu ekspressio
alternative label: härlett uttryck @sv
alternative label: uttryck av härlett verk @sv
broader: versioon liittyvä versio
definition: Teoksen ekspressio, joka on eri teoksen lähde-ekspression muunnos. (RDA Registry)
definition: Uttryck av verk, som är en variant av ett annat verks källuttryck. @sv
in scheme: Metatietosanasto
narrower: jäljitelmä
narrower: abstraktit (ekspressio)
narrower: laajennelma
narrower: mukaelma
narrower: variaatio
narrower: tekstiin perustuva musiikki
narrower: vapaamuotoinen käännös
narrower: mukautettu lyhennelmä
narrower: yhteenveto
narrower: lyhennelmä
narrower: parafraasi
narrower: uusintaproduktio
narrower: konkordanssihakemisto versioon
narrower: intertekstuaalinen suhde (ekspressio)
narrower: uudistettu painos teoksesta
narrower: uudistettu laitos teoksesta
preferred label: expression of derivative work @en
preferred label: version av härlett verk @sv

toimittaja
type: Concept
source: Kansallinen RDA-termi
source: YSO-termi
source: ALLFO-term @sv
source: Nationell RDA-term @sv
created: 2018-11-01
modified: 2024-08-27
alternative label: editors @en
alternative label: journalists @en
alternative label: journalistit
alternative label: lehtimiehet
alternative label: reportterit
alternative label: toimittajat
alternative label: journalister @sv
alternative label: redaktörer @sv
alternative label: reportrar @sv
alternative label: tidningsmän @sv
in scheme: Metatietosanasto
narrower: uutispäällikkö
narrower: toimituspäällikkö
narrower: ruokatoimittaja
narrower: televisiotoimittaja
narrower: tiedetoimittaja
narrower: oikeustoimittaja
narrower: ulkomaantoimittaja
narrower: kulttuuritoimittaja
narrower: kustannustoimittaja
narrower: taloustoimittaja
narrower: päätoimittaja
narrower: rikostoimittaja
narrower: musiikkitoimittaja
narrower: verkkotoimittaja
narrower: kuvatoimittaja
narrower: radiotoimittaja
narrower: muotitoimittaja
narrower: urheilutoimittaja
narrower: lehtitoimittaja
preferred label: journalist @en

sotilasyksikkö
type: Concept
source: Kansallinen RDA-termi
source: Nationell RDA-term @sv
created: 2021-04-20
modified: 2024-05-24
alternative label: joukko-osasto
alternative label: joukkue
alternative label: sotilaspartio
alternative label: sotilasryhmä
alternative label: taisteluosasto
alternative label: förband @sv
alternative label: militärenhet @sv
alternative label: militärpatrull @sv
alternative label: pluton @sv
alternative label: stridsgrupp @sv
alternative label: truppavdelning @sv
alternative label: truppförband @sv
definition: Asevoimien organisaatio.
definition: Organisation inom vapenmakt. @sv
in scheme: Metatietosanasto
narrower: rykmentti
narrower: divisioona
narrower: prikaati
narrower: lentue
narrower: komppania
narrower: lippukunta
narrower: varuskunta
narrower: lennosto
narrower: esikunta
narrower: pataljoona
narrower: armeijakunta
narrower: patteristo
narrower: armeija
narrower: patteri
narrower: linnake
narrower: eskadroona
narrower: laivue (ilmavoimat)
narrower: sotilastukikohta
narrower: laivue (merivoimat)
narrower: lippue
preferred label: militär enhet @sv
scope note: Käytetään kun tarkempaa sotilasyksikköä kuvaavaa termiä ei ole tai sitä ei nähdä tarpeelliseksi käyttää.
scope note: Används när närmare beskrivande termer för en militär enhet saknas eller inte anses nödvändiga. @sv

esittäjä
type: Concept
source: RDA-termi
source: RDA-term @sv
created: 2024-12-18
modified: 2025-10-02
alternative label: esittäjä (henkilö)
alternative label: framförare (person) @sv
broader: esitykseen osallinen henkilö
definition: Henkilö, joka osallistuu teoksen ekspression tekemiseen esittämällä musiikkia, näyttelemällä, tanssimalla, puhumalla ja muissa rooleissa usein musiikki- tai näytelmäesityksessä. (RDA Registry)
definition: Person som deltar i utförandet av ett verks uttryck genom att framföra musik, skådespela, dansa, tala, eller fungera i andra roller, ofta i ett musikaliskt eller dramatiskt framförande. @sv
in scheme: Metatietosanasto
narrower: selostaja
narrower: kertoja
narrower: moderoija
narrower: opettaja
narrower: esittelijä
narrower: johtaja
narrower: juontaja
narrower: esittämisestä vastaava henkilö
narrower: näyttelijä
narrower: puhuja
narrower: panelisti
narrower: laulaja
narrower: nukettaja
narrower: tanssija
narrower: tarinankertoja
narrower: soittaja
narrower: kommentaattori
narrower: lausuja
narrower: lukija
preferred label: performer person @en
preferred label: framförande person @sv

yhteisöön liittyvä yhteisö
type: Concept
source: RDA-termi
source: RDA-term @sv
created: 2024-12-18
modified: 2025-08-27
alternative label: associated institution @en
alternative label: liittyvä yhteisö
alternative label: relaterad institution @sv
definition: Yhteisö, joka liittyy yhteisöön. (RDA Registry)
definition: Institution som relaterar till en institution. @sv
in scheme: Metatietosanasto
narrower: sulautunut yhteisö
narrower: sulautunut yhteisöön
narrower: alayhteisö
narrower: kattoyhteisö
narrower: yhteisöjäsen yhteisössä
narrower: yhteisön perustanut yhteisö
narrower: yhteisön perustama yhteisö
narrower: yhteisöä sponsoroiva yhteisö
narrower: laajempi emoyhtiö
narrower: yhteisön sponsoroima yhteisö
narrower: yhteisön seuraaja
narrower: yhteisön edeltäjä
narrower: paikallinen tytäryhtiö
narrower: kanssayhdistyjä
narrower: yhteisön yhteisöjäsen
narrower: yhteiskonferenssi
narrower: vaikuttaja
narrower: vaikuttajana
narrower: mesenaatti
narrower: mesenaattina
preferred label: related corporate body of corporate body @en
preferred label: institution relaterad till institutionen @sv

mukaelma
type: Concept
source: RDA-termi
source: RDA-term @sv
created: 2016-01-08
modified: 2025-11-25
Vastavuoroinen suhde: mukaelma teoksesta
alternative label: mukaelma (teos)
alternative label: omarbetning (verk) @sv
broader: johdannaisteos
definition: Teos, joka muokkaa toista teosta jotain muuta kuin alkuperäistä tarkoitusta, käyttöä tai esitysmuotoa varten. (RDA Registry)
definition: Verk, som ändrar ett annat verk för något annat syfte, någon annan användning eller representation än de ursprungliga. @sv
in scheme: Metatietosanasto
narrower: sarjakuvaversio
narrower: musikaaliversio
narrower: dramatisointi
narrower: oopperasovitus
narrower: oratoriosovitus
narrower: runomukaelma
narrower: videopelisovitus
narrower: radiosovitus
narrower: romaanimukaelma
narrower: televisiosovitus
narrower: sovitettu käsikirjoitukseksi
narrower: sovitettu libretoksi
narrower: sovitettu radiokäsikirjoitukseksi
narrower: lastenversio (teos)
narrower: videosovitus
narrower: sovitettu koreografiaksi
narrower: elokuvaversio
narrower: uudelleenmiksaus
preferred label: adapted as work @en
preferred label: omarbetning @sv
scope note: Tämä elementti soveltuu muutoksiin muodossa tai samassa muodossa kokonaan uudelleenmuokattuihin teoksiin. (RDA Registry)
scope note: Omfattar både ändringar som gäller formen för ett verk och helt omarbetade verk i samma form. @sv

mukaelma teoksesta
type: Concept
source: RDA-termi
source: RDA-term @sv
created: 2016-01-08
modified: 2025-11-25
Vastavuoroinen suhde: mukaelma
alternative label: mukaelman perustana
alternative label: mukaelman perustana (teos)
alternative label: omarbetning baserad på @sv
alternative label: omarbetning baserad på (verk) @sv
broader: teoksen perustana
definition: Teos, jota on muokattu jotain muuta kuin alkuperäistä tarkoitusta, käyttöä tai esitysmuotoa varten. (RDA Registry)
definition: Verk som har bearbetats för något annat syfte, någon annan användning eller representation än de ursprungliga. @sv
in scheme: Metatietosanasto
narrower: televisiosovitus teoksesta
narrower: elokuvaversio teoksesta
narrower: selkokielisen version perustana (teos)
narrower: sarjakuvaversio teoksesta
narrower: lastenversion perustana (teos)
narrower: runomukaelma teoksesta
narrower: dramatisointi teoksesta
narrower: radiokäsikirjoituksen perustana oleva teos
narrower: radiosovitus teoksesta
narrower: koreografinen sovitus teoksesta
narrower: libreton perustana oleva teos
narrower: musikaaliversio teoksesta
narrower: videosovitus teoksesta
narrower: oopperasovitus teoksesta
narrower: käsikirjoituksen perustana oleva teos
narrower: oratoriosovitus teoksesta
narrower: videopelisovitus teoksesta
narrower: uudelleenmiksaus teoksesta
narrower: romaanimukaelma teoksesta
preferred label: adaptation of work @en
preferred label: omarbetning av verket @sv
scope note: Tämä elementti soveltuu muutoksiin muodossa tai samassa muodossa kokonaan uudelleenmuokattuihin teoksiin. (RDA Registry)
scope note: Omfattar både ändringar som gäller formen för ett verk och helt omarbetade verk i samma form. @sv

asentaja
type: Concept
source: Kansallinen RDA-termi
source: YSO-termi
source: ALLFO-term @sv
source: Nationell RDA-term @sv
created: 2018-11-01
modified: 2024-08-27
alternative label: assemblers and fitters @en
alternative label: asentajat
alternative label: montörer @sv
in scheme: Metatietosanasto
narrower: ajoneuvoasentaja
narrower: automaatioasentaja
narrower: LVI-asentaja
narrower: ilmastointiasentaja
narrower: autonasentaja
narrower: sähkölaitosasentaja
narrower: elektroniikka-asentaja
narrower: tietotekniikka-asentaja
narrower: tietokoneasentaja
narrower: puhelinasentaja
narrower: lämmityslaiteasentaja
narrower: teollisuusputkiasentaja
narrower: kaukolämpöasentaja
narrower: tietoliikenneasentaja
narrower: kotitalouskoneasentaja
narrower: lentokoneenasentaja
narrower: laivasähköasentaja
narrower: sähköasentaja
narrower: koneenasentaja
narrower: maatalouskoneasentaja
narrower: metsäkoneasentaja
narrower: putkiasentaja
preferred label: assembler @en
preferred label: montör @sv

upseeri
type: Concept
source: Kansallinen RDA-termi
source: YSO-termi
source: ALLFO-term @sv
source: Nationell RDA-term @sv
created: 2018-11-01
modified: 2024-08-27
alternative label: officers @en
alternative label: upseerit
broader: sotilashenkilö
in scheme: Metatietosanasto
narrower: eversti
narrower: luutnantti
narrower: komentaja
narrower: kapteeni
narrower: amiraali
narrower: majuri
narrower: insinööriupseeri
narrower: kenraaliluutnantti
narrower: everstiluutnantti
narrower: kenraali
narrower: vänrikki
narrower: kapteeniluutnantti
narrower: prikaatikenraali
narrower: kontra-amiraali
narrower: kenraalimajuri
narrower: lippueamiraali
narrower: vara-amiraali
narrower: kommodori
narrower: yliluutnantti
narrower: aliluutnantti
narrower: komentajakapteeni
preferred label: officer (military personnel) @en
preferred label: officerare @sv

maisteri
type: Concept
source: Kansallinen RDA-termi
source: Nationell RDA-term @sv
created: 2019-05-07
modified: 2024-05-24
in scheme: Metatietosanasto
narrower: oikeustieteen maisteri
narrower: kasvatustieteen maisteri
narrower: teatteritaiteen maisteri
narrower: terveystieteiden maisteri
narrower: musiikin maisteri
narrower: farmasian maisteri
narrower: yhteiskuntatieteiden maisteri
narrower: terveydenhuollon maisteri
narrower: taloustieteiden maisteri
narrower: taiteen maisteri
narrower: valtiotieteiden maisteri
narrower: kauppatieteiden maisteri
narrower: sotatieteiden maisteri
narrower: psykologian maisteri
narrower: kuvataiteen maisteri
narrower: teologian maisteri
narrower: elintarviketieteiden maisteri
narrower: filosofian maisteri
narrower: liikuntatieteiden maisteri
narrower: hallintotieteiden maisteri
narrower: maatalous- ja metsätieteiden maisteri
narrower: tanssitaiteen maisteri
preferred label: magister @sv

esitykseen osallinen yhteisö
type: Concept
source: RDA-termi
source: RDA-term @sv
created: 2024-12-18
modified: 2025-06-11
broader: yhdistymään osallinen yhteisö
definition: Yhteisö, joka osallistuu sellaisen ekspression tekemiseen, joka on esitys. (RDA Registry)
definition: Institution som deltar i utförandet av ett sådant uttryck som är ett framförande. @sv
in scheme: Metatietosanasto
narrower: esittäjä
narrower: musiikkiohjelmoija
narrower: haastattelija (ekspressio)
narrower: DJ
narrower: liikkuvaan kuvaan osallistuja
narrower: musiikillinen johtaja
narrower: valosuunnittelija
narrower: erikoistehosteiden tekijä
narrower: äänisuunnittelija
narrower: haastateltava (ekspressio)
narrower: tuotantosuunnittelija
narrower: leikkaaja
narrower: näyttämöohjaaja
narrower: lavastaja
narrower: animaattori
narrower: maskeeraaja
narrower: ääniteknikko
narrower: puvustaja
narrower: dubbausohjaaja
narrower: taltioija
narrower: visuaalisten tehosteiden tekijä
preferred label: contributor corporate body to performance @en
preferred label: bidragsgivare (institution) till framförande @sv

esitykseen osallinen toimija
type: Concept
source: RDA-termi
source: RDA-term @sv
created: 2024-12-18
modified: 2025-06-11
alternative label: contributor to performance @en
alternative label: esitykseen osallistuja
alternative label: bidragsgivare till framförande @sv
broader: yhdistymään osallinen toimija
definition: Toimija, joka osallistuu sellaisen ekspression tekemiseen, joka on esitys. (RDA Registry)
definition: Aktör som deltar i utförandet av ett sådant uttryck som är ett framförande. @sv
in scheme: Metatietosanasto
narrower: näyttämöohjaaja
narrower: esittäjä
narrower: animaattori
narrower: valosuunnittelija
narrower: leikkaaja
narrower: äänisuunnittelija
narrower: ääniteknikko
narrower: visuaalisten tehosteiden tekijä
narrower: maskeeraaja
narrower: haastateltava (ekspressio)
narrower: lavastaja
narrower: DJ
narrower: erikoistehosteiden tekijä
narrower: musiikkiohjelmoija
narrower: tuotantosuunnittelija
narrower: liikkuvaan kuvaan osallistuja
narrower: dubbausohjaaja
narrower: taltioija
narrower: puvustaja
narrower: musiikillinen johtaja
narrower: haastattelija (ekspressio)
preferred label: contributor agent to performance @en
preferred label: bidragsgivare (aktör) till framförande @sv

opettaja
type: Concept
source: Kansallinen RDA-termi
source: YSO-termi
source: ALLFO-term @sv
source: Nationell RDA-term @sv
created: 2018-11-01
modified: 2024-08-27
alternative label: opettaja (ammatti)
alternative label: lärare (yrke) @sv
in scheme: Metatietosanasto
narrower: liikenneopettaja
narrower: kansakoulunopettaja
narrower: uimaopettaja
narrower: lehtori (opettaja)
narrower: luokanopettaja
narrower: aineenopettaja
narrower: lennonopettaja
narrower: luokanvalvoja
narrower: tanssinopettaja
narrower: ammatillinen opettaja
narrower: laulunopettaja
narrower: yliopettaja
narrower: voimistelunopettaja
narrower: kotiopettaja
narrower: soitonopettaja
narrower: ratsastuksenopettaja
narrower: yksityisopettaja
narrower: kauppaopettaja
narrower: lastentarhanopettaja
narrower: teatteriopettaja
narrower: erityisopettaja
narrower: opinto-ohjaaja
narrower: opistonopettaja
narrower: korkeakouluopettaja
preferred label: lärare @sv

lääkäri
type: Concept
source: Kansallinen RDA-termi
source: YSO-termi
source: ALLFO-term @sv
source: Nationell RDA-term @sv
created: 2018-11-01
modified: 2024-08-27
alternative label: doctors @en
alternative label: medical doctors @en
alternative label: physicians @en
alternative label: lääkärit
in scheme: Metatietosanasto
narrower: erikoislääkäri
narrower: yleislääkäri
narrower: fysiatri
narrower: silmälääkäri
narrower: onkologi
narrower: työterveyslääkäri
narrower: oikeuslääkäri
narrower: allergologi
narrower: psykiatri
narrower: ihotautilääkäri
narrower: sotilaslääkäri
narrower: anestesiologi
narrower: gynekologi
narrower: urologi
narrower: vakuutuslääkäri
narrower: patologi
narrower: neurologi
narrower: lastenlääkäri
narrower: endokrinologi
narrower: kardiologi
narrower: kunnanlääkäri
narrower: kirurgi
narrower: urheilulääkäri
narrower: ylilääkäri
preferred label: medical doctor @en
preferred label: läkare @sv

muu julkaisumuoto
type: Concept
source: RDA-termi
source: RDA-term @sv
created: 2020-04-17
modified: 2025-08-14
alternative label: julkaistu myös
alternative label: annan publiceringsform @sv
alternative label: annan utgivningsform @sv
alternative label: utgiven även @sv
alternative label: även utkommit @sv
broader: samansisältöinen aineisto
definition: Manifestaatio, joka sisältää saman teoksen ekspression kuin toinen manifestaatio. Manifestaatiot ovat eri julkaisumuodoissa. (RDA Registry)
definition: Manifestation som innehåller samma verks uttryck som en annan manifestation. Manifestationerna är i olika publikationsformat. @sv
in scheme: Metatietosanasto
narrower: julkaistu myös eripainoksena
narrower: julkaistu myös verkkoaineistona
narrower: linkki
narrower: julkaistu myös CD-ROM-levynä
narrower: julkaistu myös LP-levynä
narrower: julkaistu myös e-kirjana
narrower: julkaistu myös äänikirjana
narrower: julkaistu myös CD-äänilevynä.
narrower: julkaistu myös digitoituna
narrower: julkaistu vain verkkoaineistona vuodesta...
narrower: julkaistu myös vinyylisinglelevynä
narrower: Yhteenveto-osa julkaistu myös verkkoaineistona.
narrower: julkaistu myös tarvepainatteena
narrower: julkaistu myös C-kasettina.
narrower: julkaistu myös painettuna
narrower: julkaistu myös e-lehtenä
narrower: linkki digitoituun aineistoon
narrower: julkaistu myös MD-levynä
narrower: julkaistu joitakin sarjan osia vain verkkoaineistona
narrower: linkki verkkoaineistoon
narrower: julkaistu aiemmin erillisinä niteinä
narrower: painettu
narrower: käytettävissä vapaakappalekirjastoissa
preferred label: also issued as @en
preferred label: annan publikationsform @sv

lisensiaatti
type: Concept
source: Kansallinen RDA-termi
source: Nationell RDA-term @sv
created: 2019-05-07
modified: 2024-05-24
in scheme: Metatietosanasto
narrower: tanssitaiteen lisensiaatti
narrower: oikeustieteen lisensiaatti
narrower: lakitieteen lisensiaatti
narrower: teologian lisensiaatti
narrower: musiikin lisensiaatti
narrower: hammaslääketieteen lisensiaatti
narrower: kasvatustieteen lisensiaatti
narrower: psykologian lisensiaatti
narrower: elintarviketieteiden lisensiaatti
narrower: maatalous- ja metsätieteiden lisensiaatti
narrower: farmasian lisensiaatti
narrower: terveydenhuollon lisensiaatti
narrower: kuvataiteen lisensiaatti
narrower: terveystieteiden lisensiaatti
narrower: hallintotieteiden lisensiaatti
narrower: liikuntatieteiden lisensiaatti
narrower: kauppatieteiden lisensiaatti
narrower: tekniikan lisensiaatti
narrower: eläinlääketieteen lisensiaatti
narrower: taloustieteiden lisensiaatti
narrower: teatteritaiteen lisensiaatti
narrower: taiteen lisensiaatti
narrower: filosofian lisensiaatti
narrower: lääketieteen lisensiaatti
narrower: yhteiskuntatieteiden lisensiaatti
narrower: valtiotieteiden lisensiaatti
preferred label: licentiat @sv

teoksen tekijä
type: Concept
source: RDA-termi
source: RDA-term @sv
created: 2024-12-18
modified: 2025-08-23
alternative label: creator @en
alternative label: teoksen tekijä (toimija)
alternative label: skapare (aktör) av verk @sv
broader: teokseen liittyvä toimija
definition: Toimija, joka on vastuussa teoksen luomisesta. (RDA Registry)
definition: Aktör som svarar för skapandet av ett verk. @sv
in scheme: Metatietosanasto
narrower: teoksen valokuvaaja
narrower: tuottaja
narrower: keksijä
narrower: designer
narrower: kuvaaja
narrower: omistuksen tekijä
narrower: uudelleenmiksaaja
narrower: koreografi
narrower: roolittaja
narrower: järjestäjä
narrower: toimituspäällikkö
narrower: tutkija
narrower: teoksen perustaja
narrower: asiantuntija
narrower: ohjaaja
narrower: taiteilija
narrower: ohjelmoija
narrower: kokoelman muodostaja
narrower: kirjoittaja
narrower: koostaja
narrower: teoksen kartantekijä
narrower: säveltäjä
narrower: arkkitehti
narrower: teoksen haastateltava
narrower: teoksen haastattelija
narrower: elokuvantekijä
preferred label: creator agent of work @en
preferred label: skapare av verk @sv
scope note: Teoksen tekijä kattaa toimijan, joka on yhteisesti vastuussa teoksen luomisesta joko toimimalla samassa roolissa kuin toinen toimija, kuten kahden kirjoittajan välisessä yhteistyössä, tai toimimalla eri rooleissa, kuten säveltäjän ja sanoittajan välisessä yhteistyössä. (RDA Registry)
scope note: Innefattar aktörer som gemensamt svarar för skapandet av ett verk, antingen genom att fungera i samma roll som en annan aktör, såsom i samarbete mellan två författare, eller genom att fungera i olika roller, såsom i samarbete mellan en kompositör och en textförfattare. @sv

tohtori
type: Concept
source: Kansallinen RDA-termi
source: Nationell RDA-term @sv
created: 2019-05-07
modified: 2024-05-24
in scheme: Metatietosanasto
narrower: taloustieteiden tohtori
narrower: kuvataiteen tohtori
narrower: hammaslääketieteen tohtori
narrower: eläinlääketieteen tohtori
narrower: lääketieteen ja kirurgian tohtori
narrower: psykologian tohtori
narrower: lääketieteen tohtori
narrower: oikeustieteen tohtori
narrower: terveydenhuollon tohtori
narrower: tekniikan tohtori
narrower: filosofian tohtori
narrower: teologian tohtori
narrower: farmasian tohtori
narrower: yhteiskuntatieteiden tohtori
narrower: elintarviketieteiden tohtori
narrower: teatteritaiteen tohtori
narrower: kasvatustieteiden tohtori
narrower: lakitieteen tohtori
narrower: taiteen tohtori
narrower: terveystieteiden tohtori
narrower: hallintotieteiden tohtori
narrower: maatalous- ja metsätieteiden tohtori
narrower: liikuntatieteiden tohtori
narrower: valtiotieteiden tohtori
narrower: musiikin tohtori
narrower: sotatieteiden tohtori
narrower: kauppatieteiden tohtori
narrower: tanssitaiteen tohtori
preferred label: doktor @sv

esitykseen osallinen henkilö
type: Concept
source: RDA-termi
source: RDA-term @sv
created: 2024-12-18
modified: 2025-06-11
broader: yhdistymään osallinen henkilö
definition: Henkilö, joka osallistuu sellaisen ekspression tekemiseen, joka on esitys. (RDA Registry)
definition: Person som deltar i utförandet av ett sådant uttryck som är ett framförande. @sv
in scheme: Metatietosanasto
narrower: sormituksen tekijä
narrower: sanoittaja (ekspressio)
narrower: äänitaiteilija (ekspressio)
narrower: dramaturgi (ekspressio)
narrower: videoteknikko
narrower: keskustelija (ekspressio)
narrower: esittäjä
narrower: äänisuunnittelija
narrower: DJ
narrower: haastattelija (ekspressio)
narrower: liikkuvaan kuvaan osallistuja
narrower: musiikkiohjelmoija
narrower: haastateltava (ekspressio)
narrower: ääniteknikko
narrower: puvustaja
narrower: erikoistehosteiden tekijä
narrower: tuotantosuunnittelija
narrower: animaattori
narrower: lavastaja
narrower: taltioija
narrower: visuaalisten tehosteiden tekijä
narrower: näyttämöohjaaja
narrower: valosuunnittelija
narrower: musiikillinen johtaja
narrower: maskeeraaja
narrower: dubbausohjaaja
narrower: tuottaja (ekspressio)
preferred label: contributor person to performance @en
preferred label: bidragsgivare (person) till framförande @sv

soittaja
type: Concept
source: Kansallinen RDA-termi
source: YSO-termi
source: ALLFO-term @sv
source: Nationell RDA-term @sv
created: 2018-11-01
modified: 2024-08-27
alternative label: soittaja (ammatti)
alternative label: instrumentalist (yrke) @sv
broader: muusikko
in scheme: Metatietosanasto
narrower: fagotisti
narrower: trumpetisti
narrower: pianisti
narrower: klarinetisti
narrower: viulisti
narrower: kontrabasisti
narrower: lyömäsoittaja
narrower: saksofonisti
narrower: urkuri
narrower: cembalisti
narrower: kansansoittaja
narrower: alttoviulisti
narrower: sellisti
narrower: basisti
narrower: harmonikansoittaja
narrower: kitaristi
narrower: kanteleensoittaja
narrower: huilisti
narrower: tuubansoittaja
narrower: mandoliininsoittaja
narrower: pasunisti
narrower: huuliharpunsoittaja
narrower: banjonsoittaja
narrower: harpunsoittaja
narrower: käyrätorvensoittaja
narrower: oboisti
narrower: puhallinsoittaja
narrower: steel-kitaristi
preferred label: instrumentalist @en

johtaja
type: Concept
source: Kansallinen RDA-termi
source: YSO-termi
source: ALLFO-term @sv
source: Nationell RDA-term @sv
created: 2018-11-01
modified: 2024-08-27
alternative label: johtaja (ammatti)
alternative label: ledare (yrke) @sv
in scheme: Metatietosanasto
narrower: museojohtaja
narrower: koulutoimenjohtaja
narrower: työnjohtaja
narrower: kuntajohtaja
narrower: pankinjohtaja
narrower: yritysjohtaja
narrower: hallintojohtaja
narrower: maakuntajohtaja
narrower: arkistonjohtaja
narrower: sotilasjohtaja
narrower: toimitusjohtaja
narrower: sosiaalijohtaja
narrower: kirjastonjohtaja
narrower: kustannusjohtaja
narrower: hotellinjohtaja
narrower: vankilanjohtaja
narrower: uskonnollinen johtaja
narrower: pääjohtaja
narrower: tehdasjohtaja
narrower: konsernijohtaja
narrower: urheilujohtaja
narrower: teatterinjohtaja
narrower: toiminnanjohtaja
narrower: sivistystoimijohtaja
narrower: puoluejohtaja
narrower: talousjohtaja
narrower: koulunjohtaja
narrower: kulttuuritoimenjohtaja
narrower: kehitysjohtaja
narrower: tutkimusjohtaja
preferred label: manager/executive @en
preferred label: ledare (roll) @sv

sihteeri
type: Concept
source: Kansallinen RDA-termi
source: YSO-termi
source: ALLFO-term @sv
source: Nationell RDA-term @sv
created: 2018-11-01
modified: 2024-08-27
alternative label: secretaries @en
alternative label: sihteerit
definition: 1) järjestön, tms. toimihenkilö, joka hoitaa juoksevat asiat; kokouksen pöytäkirjuri 2) johtajan tm. esimiehen henkilökohtaisena avustajana toimiva toimistotyöntekijä 3) jälkiosana eril. virka- ja tehtävänimikkeissä
definition: 1) funktionär i organisation e.d. som sköter löpande ärenden; protokollförare vid möte 2) kontorsarbetare som fungerar som personlig assistent för ledare eller annan chef 3) som efterled i olika tjänstetitlar och uppdragsbeteckningar @sv
in scheme: Metatietosanasto
narrower: kaupallinen sihteeri
narrower: puoluesihteeri
narrower: teollisuussihteeri
narrower: valtiosihteeri
narrower: nuorisosihteeri
narrower: kaupunginsihteeri
narrower: pääsihteeri
narrower: osastonsihteeri
narrower: lähetyssihteeri
narrower: kulttuurisihteeri
narrower: sosiaalisihteeri
narrower: opintosihteeri
narrower: raittiussihteeri
narrower: ministerivaltiosihteeri
narrower: lähetystösihteeri
narrower: kunnansihteeri
narrower: laskentasihteeri
narrower: hallintosihteeri
narrower: vientisihteeri
narrower: viestintäsihteeri
narrower: toimistosihteeri
narrower: tietopalvelusihteeri
narrower: järjestösihteeri
narrower: myyntisihteeri
narrower: verosihteeri
narrower: kuvaussihteeri
narrower: matkailusihteeri
narrower: esittelysihteeri
narrower: julkaisusihteeri
narrower: arkistosihteeri
narrower: oikeussihteeri
preferred label: secretary @en
preferred label: sekreterare @sv

kandidaatti
type: Concept
source: Kansallinen RDA-termi
source: Nationell RDA-term @sv
created: 2019-05-07
modified: 2024-05-24
in scheme: Metatietosanasto
narrower: farmasian kandidaatti
narrower: terveydenhuollon kandidaatti
narrower: kauppatieteiden kandidaatti
narrower: terveystieteiden kandidaatti
narrower: luonnontieteiden kandidaatti
narrower: tekniikan kandidaatti
narrower: liikuntatieteiden kandidaatti
narrower: liikuntakasvatuksen kandidaatti
narrower: yhteiskuntatieteiden kandidaatti
narrower: lakitieteen kandidaatti
narrower: humanististen tieteiden kandidaatti
narrower: filosofian kandidaatti
narrower: psykologian kandidaatti
narrower: kuvataiteen kandidaatti
narrower: oikeustieteen kandidaatti
narrower: kasvatustieteen kandidaatti
narrower: musiikin kandidaatti
narrower: teatteritaiteen kandidaatti
narrower: lainopin kandidaatti
narrower: hallintotieteiden kandidaatti
narrower: lääketieteen kandidaatti
narrower: valtiotieteiden kandidaatti
narrower: taiteen kandidaatti
narrower: hammaslääketieteen kandidaatti
narrower: maatalous- ja metsätieteiden kandidaatti
narrower: elintarviketieteiden kandidaatti
narrower: sotatieteiden kandidaatti
narrower: tanssitaiteen kandidaatti
narrower: opettajakandidaatti
narrower: teologian kandidaatti
narrower: taloustieteiden kandidaatti
preferred label: kandidat @sv

järjestötoiminta
type: Concept
source: Kansallinen RDA-termi
source: Nationell RDA-term @sv
created: 2019-03-13
modified: 2026-05-06
alternative label: föreningsverksamhet @sv
definition: Erityisten ryhmien etuja tai aatteita ajavat ja toimintaa edistävät yhdistykset, säätiöt tms. järjestäytyneet toimijat. Pääluokkaan eivät kuulu julkisen hallinnon organisaatiot (ks. julkinen hallinto), eri toimialojen yritykset eivätkä urheiluseurat (ks. urheilu- ja virkistystoiminta).
definition: Föreningar, stiftelser e.d. organiserade aktörer som driver vissa gruppers intressen och främjar deras verksamhet. Till huvudgruppen hör inte organisationer inom den offentliga förvaltningen (se offentlig förvaltning), företag inom olika branscher, eller idrottsföreningar (se idrotts- och rekreationsverksamhet). @sv
in scheme: Metatietosanasto
narrower: poliittiset järjestöt
narrower: elinkeinojärjestöt
narrower: ammattialajärjestöt
narrower: maanpuolustusjärjestöt
narrower: kuluttajajärjestöt
narrower: harrastusjärjestöt
narrower: sosiaalijärjestöt
narrower: uskonnolliset järjestöt
narrower: opiskelijajärjestöt
narrower: maatalousjärjestöt
narrower: kulttuurijärjestöt
narrower: eläkeläisjärjestöt
narrower: pelastusjärjestöt
narrower: ympäristöjärjestöt
narrower: rauhanjärjestöt
narrower: nuorisojärjestöt
narrower: liikuntajärjestöt
narrower: raittiusjärjestöt
narrower: sotaveteraanijärjestöt
narrower: matkailualan järjestöt
narrower: hyväntekeväisyysjärjestöt
narrower: kotitalousjärjestöt
narrower: ammattiyhdistykset
narrower: kannatusyhdistykset
narrower: kotiseutuyhdistykset
narrower: naisasiajärjestöt
narrower: asukasyhdistykset
narrower: kansainväliset järjestöt
narrower: sukuseurat
narrower: tiedejärjestöt
narrower: monikulttuuriset järjestöt
narrower: terveysjärjestöt
preferred label: organisationsverksamhet @sv

urheilija
type: Concept
source: Kansallinen RDA-termi
source: YSO-termi
source: ALLFO-term @sv
source: Nationell RDA-term @sv
created: 2018-11-01
modified: 2024-08-27
alternative label: athletes @en
alternative label: urheilijat
alternative label: idrottsutövare @sv
in scheme: Metatietosanasto
narrower: lumilautailija
narrower: ampuja
narrower: koripalloilija
narrower: ratsastaja
narrower: alppihiihtäjä
narrower: purjehtija
narrower: judoka
narrower: luistelija
narrower: lentopalloilija
narrower: voimistelija
narrower: moottoripyöräilijä
narrower: kilpapyöräilijä
narrower: yleisurheilija
narrower: painonnostaja
narrower: hiihtäjä
narrower: kilpa-autoilija
narrower: jalkapalloilija
narrower: nopeuslaskija
narrower: taitoluistelija
narrower: mäkihyppääjä
narrower: maalivahti
narrower: golfaaja
narrower: jääkiekkoilija
narrower: kehonrakentaja
narrower: uimari
narrower: tenniksenpelaaja
narrower: pesäpalloilija
narrower: vapaaottelija
narrower: nyrkkeilijä
narrower: painija
narrower: suunnistaja
narrower: jääpalloilija
narrower: ampumahiihtäjä
narrower: sulkapalloilija
preferred label: athlete @en
preferred label: idrottare @sv

teoksen tekijä
type: Concept
source: RDA-termi
source: RDA-term @sv
created: 2024-12-18
modified: 2025-08-23
alternative label: teoksen tekijä (yhteisö)
alternative label: skapare (institution) av verk @sv
broader: teokseen liittyvä yhteisö
definition: Yhteisö, joka on vastuussa teoksen luomisesta. (RDA Registry)
definition: Institution som svarar för skapandet av ett verk. @sv
in scheme: Metatietosanasto
narrower: sääntöjen ohjaama tuomioistuin
narrower: tuotantoyhtiö
narrower: oppiarvon myöntävä yhteisö
narrower: yhteisö muutoksenhakijana
narrower: yhteisö muutoksenhakijan vastapuolena
narrower: yhteisökantaja
narrower: yhteisövastaaja
narrower: valtiosopimuksen allekirjoittaja
narrower: säätävä hallintoelin
narrower: kokoelman muodostaja
narrower: tuottaja
narrower: säveltäjä
narrower: koostaja
narrower: teoksen valokuvaaja
narrower: toimituspäällikkö
narrower: roolittaja
narrower: uudelleenmiksaaja
narrower: kirjoittaja
narrower: koreografi
narrower: teoksen kartantekijä
narrower: teoksen perustaja
narrower: tutkija
narrower: taiteilija
narrower: asiantuntija
narrower: teoksen haastattelija
narrower: kuvaaja
narrower: ohjelmoija
narrower: järjestäjä
narrower: arkkitehti
narrower: teoksen haastateltava
narrower: ohjaaja
narrower: elokuvantekijä
narrower: designer
narrower: teoksen omistuksen tekijä
narrower: keksijä
preferred label: creator corporate body of work @en
preferred label: skapare av verk @sv
scope note: Teoksen tekijä kattaa toimijan, joka on yhteisesti vastuussa teoksen luomisesta joko toimimalla samassa roolissa kuin toinen toimija, kuten kahden kirjoittajan välisessä yhteistyössä, tai toimimalla eri rooleissa, kuten säveltäjän ja sanoittajan välisessä yhteistyössä. (RDA Registry)
scope note: Innefattar aktörer som gemensamt svarar för skapandet av ett verk, antingen genom att fungera i samma roll som en annan aktör, såsom i samarbete mellan två författare, eller genom att fungera i olika roller, såsom i samarbete mellan en kompositör och en textförfattare. @sv

liikkuvaan kuvaan osallinen henkilö
type: Concept
source: RDA-termi
source: RDA-term @sv
created: 2024-12-18
modified: 2026-03-10
broader: aggregaattiin osallinen henkilö
definition: Aggregaattiin osallinen henkilö, joka on luonut aggregaattiin sisältyvän liikkuvan kuvan teoksen ekspression.
definition: Person som bidragit till ett aggregat, genom att skapa ett uttryck av ett verk med rörlig bild, som ingår i ett aggregat. @sv
in scheme: Metatietosanasto
narrower: erikoistehosteiden tekijä
narrower: dubbausohjaaja
narrower: liikkuvan kuvan tanssija
narrower: liikkuvan kuvan äänisuunnittelija
narrower: lavastaja
narrower: ääniteknikko
narrower: näyttämöohjaaja
narrower: puvustaja
narrower: elokuvatuottaja
narrower: elokuvantekijä
narrower: sensori
narrower: elokuvaohjaaja
narrower: liikkuvan kuvan puhuja
narrower: moderoija
narrower: televisiotuottaja
narrower: esittelijä
narrower: panelisti
narrower: kuvaaja
narrower: liikkuvan kuvan esittäjä
narrower: tuotantosuunnittelija
narrower: taltioija
narrower: valosuunnittelija
narrower: nukettaja
narrower: maskeeraaja
narrower: leikkaaja
narrower: visuaalisten tehosteiden tekijä
narrower: näyttelijä
narrower: ääninäyttelijä
narrower: musiikillinen johtaja
narrower: animaattori
narrower: liikkuvan kuvan värittäjä
narrower: opettaja
narrower: juontaja
narrower: televisio-ohjaaja
narrower: kommentaattori
narrower: käsikirjoittaja
preferred label: contributor person of moving image @en
preferred label: bidragsgivare (person) till rörlig bild @sv

liikkuvaan kuvaan osallinen yhteisö
type: Concept
source: RDA-termi
source: RDA-term @sv
created: 2024-12-18
modified: 2025-07-05
broader: aggregaattiin osallinen yhteisö
definition: Aggregaattiin osallinen yhteisö, joka on luonut aggregaattiin sisältyvän liikkuvan kuvan teoksen ekspression.
definition: Institution som bidragit till ett aggregat, genom att skapa ett uttryck av ett verk med rörlig bild, som ingår i ett aggregat. @sv
in scheme: Metatietosanasto
narrower: elokuvaohjaaja
narrower: haastattelija
narrower: moderoija
narrower: televisio-ohjaaja
narrower: ääniteknikko
narrower: leikkaaja
narrower: visuaalisten tehosteiden tekijä
narrower: esittelijä
narrower: kuvaaja
narrower: dubbausohjaaja
narrower: liikkuvan kuvan puhuja
narrower: näyttämöohjaaja
narrower: näyttelijä
narrower: nukettaja
narrower: sensori
narrower: televisiotuottaja
narrower: haastateltava
narrower: puvustaja
narrower: juontaja
narrower: opettaja
narrower: taltioija
narrower: kommentaattori
narrower: erikoistehosteiden tekijä
narrower: maskeeraaja
narrower: liikkuvan kuvan värittäjä
narrower: käsikirjoittaja
narrower: elokuvatuottaja
narrower: liikkuvan kuvan esittäjä
narrower: elokuvantekijä
narrower: tuotantosuunnittelija
narrower: musiikillinen johtaja
narrower: ääninäyttelijä
narrower: valosuunnittelija
narrower: liikkuvan kuvan äänisuunnittelija
narrower: liikkuvan kuvan tanssija
narrower: panelisti
narrower: lavastaja
narrower: animaattori
preferred label: contributor corporate body of moving image @en
preferred label: bidragsgivare (institution) till rörlig bild @sv

päällikkö
type: Concept
source: Kansallinen RDA-termi
source: YSO-termi
source: ALLFO-term @sv
source: Nationell RDA-term @sv
created: 2018-11-01
modified: 2024-08-27
alternative label: leaders @en
alternative label: päälliköt
alternative label: tutkimuspäällikkö
alternative label: chefer @sv
alternative label: direktör @sv
alternative label: forskningschef @sv
in scheme: Metatietosanasto
narrower: uittopäällikkö
narrower: talouspäällikkö
narrower: sotapäällikkö
narrower: mainospäällikkö
narrower: uutispäällikkö
narrower: keittiöpäällikkö
narrower: toimituspäällikkö
narrower: kansliapäällikkö
narrower: jakelupäällikkö
narrower: työsuojelupäällikkö
narrower: poliisipäällikkö
narrower: rakennuspäällikkö
narrower: laatupäällikkö
narrower: konepäällikkö
narrower: projektipäällikkö
narrower: lehdistöpäällikkö
narrower: asemapäällikkö
narrower: palopäällikkö
narrower: hallintopäällikkö
narrower: toimistopäällikkö
narrower: tuotepäällikkö
narrower: tallipäällikkö
narrower: myyntipäällikkö
narrower: julkishallinnon päällikkö
narrower: ostopäällikkö
narrower: rahoituspäällikkö
narrower: varikkopäällikkö
narrower: ravintolapäällikkö
narrower: kanavapäällikkö
narrower: myymäläpäällikkö
narrower: tuotantopäällikkö
narrower: osastopäällikkö
narrower: piiripäällikkö
narrower: liikennepäällikkö
narrower: koulutuspäällikkö
narrower: markkinointipäällikkö
narrower: kuljetuspäällikkö
narrower: henkilöstöpäällikkö
narrower: aluepäällikkö
narrower: majakkapäällikkö
narrower: konttoripäällikkö
narrower: kehittämispäällikkö
preferred label: leader @en
preferred label: chef @sv

teoksen tekijä
type: Concept
source: RDA-termi
source: RDA-term @sv
created: 2024-12-18
modified: 2025-10-30
alternative label: teoksen tekijä (henkilö)
alternative label: skapare (person) av verk @sv
broader: teokseen liittyvä henkilö
definition: Henkilö, joka on vastuussa teoksen luomisesta. (RDA Registry)
definition: Person som svarar för skapandet av ett verk. @sv
in scheme: Metatietosanasto
narrower: opinnäytteen tarkastaja
narrower: respondentti
narrower: tuomari
narrower: soitonoppaan tekijä
narrower: laulunoppaan tekijä
narrower: preeses
narrower: henkilö muutoksenhakijana
narrower: henkilö muutoksenhakijan vastapuolena
narrower: keskustelija
narrower: henkilökantaja
narrower: henkilövastaaja
narrower: sisustusarkkitehti
narrower: taiteilija
narrower: arkkitehti
narrower: uudelleenmiksaaja
narrower: kirjoittaja
narrower: roolittaja
narrower: kuvaaja
narrower: säveltäjä
narrower: asiantuntija
narrower: tutkija
narrower: teoksen haastattelija
narrower: toimituspäällikkö
narrower: akateeminen ohjaaja
narrower: ohjaaja
narrower: järjestäjä
narrower: teoksen kartantekijä
narrower: designer
narrower: ohjelmoija
narrower: elokuvantekijä
narrower: tuottaja
narrower: koostaja
narrower: koreografi
narrower: teoksen omistuksen tekijä
narrower: kokoelman muodostaja
narrower: keksijä
narrower: teoksen haastateltava
narrower: teoksen perustaja
narrower: teoksen valokuvaaja
narrower: teorianoppaan tekijä
narrower: meedio
preferred label: creator person of work @en
preferred label: skapare av verk @sv
scope note: Teoksen tekijä kattaa toimijan, joka on yhteisesti vastuussa teoksen luomisesta joko toimimalla samassa roolissa kuin toinen toimija, kuten kahden kirjoittajan välisessä yhteistyössä, tai toimimalla eri rooleissa, kuten säveltäjän ja sanoittajan välisessä yhteistyössä. (RDA Registry)
scope note: Innefattar aktörer som gemensamt svarar för skapandet av ett verk, antingen genom att fungera i samma roll som en annan aktör, såsom i samarbete mellan två författare, eller genom att fungera i olika roller, såsom i samarbete mellan en kompositör och en textförfattare. @sv

henkilöön liittyvä henkilö
type: Concept
source: RDA-termi
source: RDA-term @sv
created: 2024-12-18
modified: 2025-06-14
definition: Henkilö, joka liittyy henkilöön. (RDA Registry)
definition: Person som är relaterad till en person. @sv
in scheme: Metatietosanasto
narrower: kollega
narrower: opettaja
narrower: oppilas
narrower: ystävä
narrower: opiskelutoveri
narrower: monikkosisarus
narrower: mesenaattina
narrower: tuttava
narrower: kihlattu
narrower: biologinen vanhempi
narrower: ottosisarus
narrower: adoptiosisarus
narrower: vaikuttaja
narrower: lapsipuoli
narrower: biologinen lapsi
narrower: puoliso
narrower: lapsi
narrower: meediona
narrower: avioton lapsi
narrower: lapsen puoliso
narrower: rakastaja
narrower: kummi
narrower: sisaruksen lapsi
narrower: naimaton vanhempi
narrower: murhaaja
narrower: avopuoliso
narrower: äitipuoli
narrower: puolisisarus
narrower: meedio
narrower: biologinen sisarus
narrower: adoptiovanhempi
narrower: kummilapsi
narrower: vanhempi
narrower: kasvattilapsi
narrower: kasvattivanhempi
narrower: sisarus
narrower: appivanhempi
narrower: sukulainen
narrower: puolison sisarus
narrower: isovanhempi
narrower: vanhemman sisarus
narrower: serkku
narrower: vaikuttajana
narrower: muusana
narrower: muusa
narrower: isäpuoli
narrower: lapsenlapsi
narrower: kasvattisisarus
narrower: adoptiolapsi
narrower: hengellinen kontakti
narrower: murhattu
narrower: mesenaatti
preferred label: related person of person @en
preferred label: person relaterad till personen @sv

työntekijä
type: Concept
source: Kansallinen RDA-termi
source: YSO-termi
source: ALLFO-term @sv
source: Nationell RDA-term @sv
created: 2019-05-15
modified: 2024-08-27
alternative label: public servant @en
alternative label: työntekijä (ammatti)
alternative label: anställd (yrke) @sv
in scheme: Metatietosanasto
narrower: satamatyöntekijä
narrower: sahatyöntekijä
narrower: sosiaalityöntekijä
narrower: freelancetyöntekijä
narrower: paperityöntekijä
narrower: puutarhatyöntekijä
narrower: metsätyöntekijä
narrower: katutyöntekijä
narrower: kirkon työntekijä
narrower: varastotyöntekijä
narrower: postityöntekijä
narrower: rakennustyöntekijä
narrower: liiketyöntekijä
narrower: kirjapainotyöntekijä
narrower: ravintolatyöntekijä
narrower: kaivostyöntekijä
narrower: lähetetty työntekijä
narrower: nuorisotyöntekijä
narrower: keittiötyöntekijä
narrower: teollisuustyöntekijä
narrower: lääketyöntekijä
narrower: valtion työntekijä
narrower: maataloustyöntekijä
narrower: elintarviketyöntekijä
narrower: kunnan työntekijä
narrower: metallityöntekijä
narrower: toimistotyöntekijä
narrower: sairaalatyöntekijä
narrower: koneteollisuustyöntekijä
narrower: järjestötyöntekijä
narrower: seurakunnan työntekijä
narrower: vesiliikennetyöntekijä
narrower: terveydenhuollon työntekijä
narrower: valimotyöntekijä
narrower: vaihetyöntekijä
narrower: tuotekehittäjä
narrower: leipomotyöntekijä
narrower: uittotyöntekijä
narrower: elektroniikkatyöntekijä
narrower: tietyöntekijä
narrower: kalustetyöntekijä
narrower: jalkinetyöntekijä
narrower: tekstiilityöntekijä
narrower: mediatyöntekijä
narrower: museotyöntekijä
narrower: rahtityöntekijä
narrower: asematyöntekijä
narrower: lasityöntekijä
narrower: laboratoriotyöntekijä
narrower: panimotyöntekijä
narrower: puutyöntekijä
narrower: arkistotyöntekijä
narrower: puistotyöntekijä
narrower: pesulatyöntekijä
narrower: nahkatyöntekijä
preferred label: employee @en
preferred label: arbetstagare @sv

Metatietosanasto
type: Ontology
type: ConceptScheme
creator: Kansalliskirjasto
creator: Nationalbiblioteket i Finland @sv
description: Metadata thesaurus contains terms and expressions required in describing materials. The thesaurus is also suitable for selecting headings displayed in user interfaces. The thesaurus has been organised according to entity-relationship structure of RDA text and LRM (IFLA Library Reference Model) conceptual model. The use of the terms in the thesaurus standardises the vocabulary of descriptive metadata and simultaneously harmonises description in order to promote productiveness. The aim of the thesaurus is also to make it easier to produce metadata by collecting vocabulary and expressions needed in description as well as to clarify concepts related to them. The thesaurus includes terms complying with the RDA description rules. The thesaurus does not contain vocabulary describing the subject matter of the work, such as index terms. @en
description: Metatietosanasto on aineistojen ja toimijoiden kuvailussa tarvittavien termien ja ilmausten kokonaisuus, joka sisältää RDA-kuvailusääntöjen mukaista terminologiaa. Sanaston käyttö vakiinnuttaa kuvailevan metatiedon tuottamista ja yhtenäistää kuvailua tiedonhaun tuloksellisuuden edistämiseksi. Metatietosanaston rakenteellinen hierarkia perustuu LRM (IFLA Library Reference Model) -käsitemallin mukaisiin kategorioihin: teos, ekspressio, manifestaatio, kappale, henkilö, yhteisö, suku sekä niiden väliset suhteet. Termi teos viittaa itsenäiseen tiedolliseen tai taiteelliseen sisältöön. Termi ekspressio viittaa teoksen tiedolliseen tai taiteelliseen toteutukseen, joka voi olla muodoltaan ääntä, kuvaa, liikettä, kirjaimista koostuva, musiikkinuotinnos jne. Termi manifestaatio viittaa teoksen ekspression saamaan ilmiasuun (esim. CD-äänilevy, kirja, karttalehti, PDF-tiedosto) Termi kappale viittaa yksittäiseen manifestaation toteutumaan (esim. yksittäinen kirja, CD-äänilevy kirjaston kokoelmissa) Termi henkilö viittaa yksilöön tai yksilön (yksin tai yhdessä yhden tai useamman muun yksilön kanssa) luomaan identiteettiin. Termi yhteisö viittaa organisaatioon tai ryhmään henkilöitä ja/tai organisaatioita, jotka tunnetaan tietyllä nimellä, ja jotka toimivat tai voivat toimia yhtenä kokonaisuutena. Termi suku viittaa kahteen tai useampaan henkilöön, joita yhdistää sukulaisuussuhde, avioliitto, adoptio, rekisteröity parisuhde tai vastaava oikeudellinen asema, tai jotka muuten esiintyvät perheenä Käsitemallin mukaiset kategoriat ja niihin kuuluvat kuvailuelementit ovat Metatietosanastossa ryhmiä, joihin yksi tai useampi käsite kuuluu. Jokainen käsite on sisällytetty johonkin ryhmään. Haku kohdistuu sekä ryhmiin että käsitteisiin. Aakkosellisessa listauksessa näkyvät vain käsitteiden termit. Sanasto ei sisällä kuvailuohjeita. Kirjastoaineistojen osalta kuvailuohjeet on saatavana RDA-kuvailu MARC 21 -formaatilla -sivustolta. Ehdotuksia uusiksi termeiksi voi lähettää tämän sivun ylälai…
description: Metadataordlistan är en helhet av termer och uttryck som behövs vid beskrivning av material och aktörer, och den innehåller terminologi i enlighet med RDA-beskrivningsanvisningar. Användning av vokabulären standardiserar produktionen av beskrivande metadata och förenhetligar beskrivningen för att främja effektiv informationssökning. Den strukturella hierarkin i Metadataordlistan grundar sig på de kategorier som finns i LRM (IFLA Library Reference Model) -begreppsmodellen: verk, uttryck, manifestation, exemplar, person, institution, familj/släkt, samt relationer mellan dessa. Termen verk hänvisar till ett självständigt intellektuellt eller konstnärligt innehåll. Termen uttryck hänvisar till ett intellektuellt eller konstnärligt förverkligande av ett verk, i form av ljud, bild, rörelse, bokstäver, musiknotation etc. Termen manifestation hänvisar till en fysisk gestalt som ett uttryck av ett verk har fått (t.ex. cd-ljudskiva, bok, kartblad, PDF-fil) Termen exemplar hänvisar till ett enskilt förverkligande av en manifestation (t.ex. en enskild bok eller en cd-ljudskiva i ett biblioteks samling) Termen person hänvisar till en individ eller identitet skapad av en individ (enskilt eller tillsammans med en eller flera andra individer) Termen institution hänvisar till en organisation eller en grupp personer och/eller organisationer, som är kända med ett visst namn och som fungerar eller kan fungera som en helhet. Termen familj/släkt hänvisar till två eller flera personer förenade av ett släktskapsförhållande, äktenskap, adoption, registrerat parförhållande eller en dylik juridisk ställning, eller som i övrigt uppträder som en familj. Begreppsmodellens kategorier och de tillhörande beskrivningselementen utgör i Metadataordlistan grupper, till vilka ett eller flera begrepp hör. Varje begrepp är inkluderat i någon grupp. Sökningar riktas mot både grupper och begrepp. I den alfabetiska listan syns enbart begreppens termer. Vokabulären innehåller inte beskrivningsanvisningar. Bes… @sv
rights: CC BY 4.0 licence for the data from the RDA Registry. Otherwise, the licence is CC0. @en
rights: RDA Registryn tiedoille Nimeä CC 4.0 -lisenssi, muilta osin CC0-lisenssi.
rights: Erkännande CC 4.0-licens för data ur RDA Registry, till övriga delar CC0-licens. @sv
title: Metadata thesaurus @en
title: Metadataordlista @sv
language: fin
language: swe
license: http://creativecommons.org/licenses/by/4.0/
license: http://creativecommons.org/publicdomain/zero/1.0/
modified: 2026-06-11T00:13:58+00:00
imports: http://purl.org/dc/elements/1.1/
imports: core