transkriptiot (musiikki)
type: Concept
created: 1996-02-09
is replaced by: Y204025
modified: 2017-07-12T15:55:05+03:00
definition: Musiikkiesityksen tarkka nuotinnos.
in scheme: MUSA/CILLA - Musiikin asiasanasto
scope note: deprecated on 2018.10.24

pastoraalit
type: Concept
created: 1997-10-01
is replaced by: Y219945
modified: 2017-05-09T08:36:44+03:00
definition: Termillä on useita eri merkityksiä keskiaikaisesta paimenlaulusta 1800-luvun "paimentunnelmaisiin" orkesteriteoksiin.
in scheme: MUSA/CILLA - Musiikin asiasanasto
note: Termiä käytetään aina yhdessä täsmentävien asiasanojen ja muiden määreiden kanssa, esimerkiksi pastoraalit : oopperat : Ranska : 1600-luku.
preferred label: pastoraler @sv
scope note: deprecated on 2018.10.24

kansansoittimet
type: Concept
created: 1997-10-06
is replaced by: Y98907
modified: 2017-03-13T11:24:37+02:00
alternative label: kansanmusiikkisoittimet
alternative label: perinnemusiikkisoittimet
alternative label: soittimet -- kansanmusiikki
alternative label: soittimet -- perinnemusiikki
alternative label: folkmusikinstrument @sv
alternative label: musikinstrument -- folkmusik @sv
alternative label: musikinstrument -- traditionell musik @sv
hidden label: soittimet kansanmusiikki
hidden label: soittimet perinnemusiikki
hidden label: musikinstrument folkmusik @sv
hidden label: musikinstrument traditionell musik @sv
in scheme: MUSA/CILLA - Musiikin asiasanasto
preferred label: folkliga instrument @sv
scope note: deprecated on 2018.10.24

sävellyskäsikirjoitukset
type: Concept
created: 1997-10-06
is replaced by: Y111361
modified: 2016-11-23T10:24:04+02:00
alternative label: käsikirjoitukset -- sävellykset
alternative label: musiikkikäsikirjoitukset
alternative label: nuottikäsikirjoitukset
alternative label: handskrifter -- kompositioner @sv
alternative label: kompositionshandskrifter @sv
alternative label: kompositionsmanuskript @sv
alternative label: nothandskrifter @sv
hidden label: käsikirjoitukset sävellykset
hidden label: handskrifter kompositioner @sv
in scheme: MUSA/CILLA - Musiikin asiasanasto
preferred label: notmanuskript @sv
scope note: deprecated on 2018.10.24

elegiat
type: Concept
created: 1996-02-07
is replaced by: Y218504
modified: 2017-05-09T08:36:23+03:00
definition: Taidemusiikkisävellyksen nimitys.
in scheme: MUSA/CILLA - Musiikin asiasanasto
note: Koska termi ei tarkoita mitään täsmällistä musiikillista muotoa tms., sitä käytetään vain niiden teosten yhteydessä, jotka säveltäjä on nimennyt elegioiksi.
preferred label: elegier @sv
scope note: deprecated on 2018.10.24

alankomaiset koulukunnat
type: Concept
created: 1996-02-07
is replaced by: Y214384
modified: 2017-09-04T13:29:23+03:00
alternative label: alankomaalaiset koulukunnat
alternative label: flaamilaiset koulukunnat
alternative label: flamländska skolorna @sv
definition: 1400–1500-luvuilla kukoistanut vokaalipolyfoninen sävellystyyli, jonka tunnetuimmat edustajat olivat Guillaume Du Fay, Henricus Isaac, Josquin des Prez ja Jean de Ockeghem.
in scheme: MUSA/CILLA - Musiikin asiasanasto
preferred label: nederländska skolorna @sv
scope note: deprecated on 2018.10.24

esittävät taiteet
type: Concept
created: 1996-02-07
is replaced by: Y106371
modified: 2017-05-09T08:36:33+03:00
definition: Kattotermi kaikille sellaisille taiteen lajeille, joihin sisältyy tai jotka ovat pääasiassa yleisölle esiintymistä.
in scheme: MUSA/CILLA - Musiikin asiasanasto
note: Termiä käytetään lähinnä kirjallisuuden indeksoinnissa.
preferred label: föreställande konst @sv
scope note: deprecated on 2018.10.24

funktioanalyysi
type: Concept
created: 1996-02-07
is replaced by: Y101390
modified: 2017-05-09T08:36:34+03:00
definition: Sointuasteiden analysointi.
in scheme: MUSA/CILLA - Musiikin asiasanasto
preferred label: funktionsanalys @sv
scope note: deprecated on 2018.10.24

genret
type: Concept
created: 1996-02-07
is replaced by: Y102983
modified: 2017-05-09T08:36:34+03:00
alternative label: lajityypit
definition: Populaarimusiikin tyylilajien nimitys. Esimerkiksi bebop ja free jazz ovat jazzin genrejä.
in scheme: MUSA/CILLA - Musiikin asiasanasto
preferred label: genrer @sv
scope note: deprecated on 2018.10.24

prima vista
type: Concept
created: 2005-06-16
is replaced by: Y214616
modified: 2017-09-04T13:29:51+03:00
definition: "Ensi näkemältä" suoraan nuoteista soittaminen tai laulaminen ilman edeltävää valmistautumista (englanniksi sight-reading).
in scheme: MUSA/CILLA - Musiikin asiasanasto
scope note: deprecated on 2018.10.24

kokoelmat
type: Concept
created: 2005-06-16
is replaced by: Y96275
modified: 2017-05-09T08:36:47+03:00
definition: (1) Esimerkiksi kirjaston omistamien aineistojen kokonaisuus ja (2) jonkin teeman puitteissa koottu joukko äänitteitä tai nuotinnettuja sävellyksiä.
in scheme: MUSA/CILLA - Musiikin asiasanasto
note: Termiä käytetään ykkösmerkityksessä aina täsmenteiden kanssa, esimerkiksi kokoelmat : äänitteet : tieteelliset kirjastot.
preferred label: samlingar @sv
scope note: deprecated on 2018.10.24

scratching
type: Concept
created: 2005-06-16
is replaced by: Y214649
modified: 2017-09-04T13:29:51+03:00
alternative label: skrätsäys
alternative label: turntablismi
alternative label: skratching @sv
definition: Lähinnä hip hop -kulttuurissa käytetty äänentuottotapa ja levysoittimen neulan hinkkausääni, joka syntyy DJ:n pyörittäessä vinyylilevyjä kädellä edestakaisin.
in scheme: MUSA/CILLA - Musiikin asiasanasto
scope note: deprecated on 2018.10.24

soitinvalmennus
type: Concept
created: 2005-06-16
is replaced by: Y214665
modified: 2017-09-04T13:29:51+03:00
definition: Musiikkileikkikoulun jälkeen varsinaisia soitinopintoja edeltävä opetus, jossa pohjustetaan esimerkiksi instrumentin valintaa, "musiikkiesikoulu".
in scheme: MUSA/CILLA - Musiikin asiasanasto
preferred label: förberedande instrumentstudier @sv
scope note: deprecated on 2018.10.24

sämplet
type: Concept
created: 2005-06-17
is replaced by: Y214687
modified: 2017-09-04T13:29:51+03:00
alternative label: samplet
alternative label: sämple @sv
definition: Termi tarkoittaa sämpläyksen tuloksena syntyvää äänikatkelmaa, joka sisällytetään sellaisenaan tai muokattuna uuden teoksen osaksi.
in scheme: MUSA/CILLA - Musiikin asiasanasto
preferred label: sample @sv
scope note: deprecated on 2018.10.24

transkribointi
type: Concept
created: 2005-06-17
is replaced by: Y214706
modified: 2017-09-04T13:29:52+03:00
alternative label: nuotintaminen
definition: Sävellyksen tarkka, musiikkiesityksen mukainen nuotintaminen.
in scheme: MUSA/CILLA - Musiikin asiasanasto
note: Transkriboinnin tuloksesta käytetään termiä transkriptiot (musiikki).
preferred label: transkribering @sv
scope note: deprecated on 2018.10.24

licksit
type: Concept
created: 2005-06-17
is replaced by: Y214544
modified: 2017-09-04T13:29:52+03:00
definition: Varsinkin kitaramusiikin yhteydessä käytettävä soittotekninen termi, jolla tarkoitetaan soittajalle tunnusomaista, improvisaation osana käytettyä lyhyttä motiivia.
in scheme: MUSA/CILLA - Musiikin asiasanasto
preferred label: lick @sv
scope note: deprecated on 2018.10.24

managerit
type: Concept
created: 2005-06-17
is replaced by: Y113111
modified: 2017-05-09T08:36:48+03:00
definition: Nimitys urheilijan, viihdetaiteilijan, muusikon tms. käytännöllisiä ja taiteellisia asioita hoitavalle henkilölle.
in scheme: MUSA/CILLA - Musiikin asiasanasto
note: Musiikin indeksoinnissa on aina käytettävä täsmentäviä termejä, esimerkiksi managerit : heavy rock : Yhdysvallat.
preferred label: managers @sv
scope note: deprecated on 2018.10.24

messukirjat
type: Concept
created: 2005-06-17
is replaced by: Y117608
modified: 2017-05-09T08:36:48+03:00
definition: Jumalanpalveluksessa käytettävät tekstit ja/tai sävelmät nuotinnoksina sisältävä julkaisu.
in scheme: MUSA/CILLA - Musiikin asiasanasto
preferred label: mässböcker @sv
scope note: deprecated on 2018.10.24

äänitetuottajat
type: Concept
created: 2005-06-17
is replaced by: Y214741
modified: 2017-09-04T13:29:52+03:00
alternative label: levytuottajat
definition: Henkilö, joka viime kädessä vastaa äänitteen valmistumisesta ja julkaisemisesta tietyn sisältöisenä ja tietyssä muodossa. Äänitetuottajan rooli teknisten ja taiteellisten ratkaisujen tekemisessä vaihtelee tapaus- ja genrekohtaisesti.
in scheme: MUSA/CILLA - Musiikin asiasanasto
note: Termiä käytetään lähinnä kirjallisuuden indeksoinnissa. Äänitteiden yhteydessä termiä käytetään vain silloin, kun kyseessä on tuottajan ympärille koottu julkaisu (esimerkiksi Spector, Phil : äänitetuottajat).
preferred label: ljudinspelningsproducenter @sv
scope note: deprecated on 2018.10.24

riffit
type: Concept
created: 2005-06-17
is replaced by: Y214626
modified: 2017-09-04T13:29:52+03:00
definition: Erityisesti rock-musiikin yhteydessä käytetty termi musiikillisen idean sisältävälle lyhyelle katkelmalle. Termiä käytetään lähinnä sähkökitaran yhteydessä.
in scheme: MUSA/CILLA - Musiikin asiasanasto
preferred label: riff @sv
scope note: deprecated on 2018.10.24

multimedia
type: Concept
created: 2005-06-17
is replaced by: Y105937
modified: 2017-05-09T08:36:48+03:00
definition: Kahden tai useamman taidelajin yhdistelmästä rakennettu julkaisu, esimerkiksi CD ROM -muotoinen tietosanakirja, jossa on kuvaa ja ääntä tekstin lisäksi.
in scheme: MUSA/CILLA - Musiikin asiasanasto
scope note: deprecated on 2018.10.24

musiikkikirjastonhoitajat
type: Concept
created: 2005-06-20
is replaced by: Y105193
modified: 2017-05-09T08:36:48+03:00
definition: Kirjastonhoitajan ammattikoulutuksen suorittanut henkilö, joka työskentelee musiikkikirjastossa.
in scheme: MUSA/CILLA - Musiikin asiasanasto
preferred label: musikbibliotekarier @sv
scope note: deprecated on 2018.10.24

musiikkikulttuuri
type: Concept
created: 2005-06-20
is replaced by: Y113392
modified: 2017-05-09T08:36:48+03:00
definition: Musiikkiin liittyvien yhteisöllisten toimintojen kokonaisuus.
in scheme: MUSA/CILLA - Musiikin asiasanasto
note: Termiä on yleisluontoisuutensa takia aina käytettävä täsmenteen kanssa, esimerkiksi musiikkikulttuuri : saamelaiset : Norja.
preferred label: musikkultur @sv
scope note: deprecated on 2018.10.24

musiikkiliikkeet
type: Concept
created: 2005-06-20
is replaced by: Y123631
modified: 2017-05-09T08:36:48+03:00
alternative label: levykaupat
alternative label: musiikkikaupat
alternative label: nuottikaupat
alternative label: äänilevykaupat
definition: Musiikkiaineistojen (äänitteet, nuotit, soittimet) välittämiseen erikoistunut kaupallinen yritys.
in scheme: MUSA/CILLA - Musiikin asiasanasto
preferred label: musikaffärer @sv
scope note: deprecated on 2018.10.24

oodit
type: Concept
created: 2005-06-20
is replaced by: Y505973
modified: 2017-05-09T08:36:49+03:00
definition: Yleisessä merkityksessään lyyrinen runo, musiikissa 1500-luvulta lähtien runoteksteihin perustuva sävellystyyppi.
in scheme: MUSA/CILLA - Musiikin asiasanasto
note: Musiikkikäytössä termiin liitetään aina täsmentäviä asiasanoja, esimerkiksi oodit : lauluyhtye : Englanti : 1690-luku.
preferred label: oden @sv
scope note: deprecated on 2018.10.24

orkesterikonsertot
type: Concept
created: 2005-06-20
is replaced by: Y214602
modified: 2017-09-04T13:29:53+03:00
alternative label: konsertot -- orkesterit
definition: Orkesterille sävelletty konsertto, jossa kullakin orkesterin sektiolla on solistisia osuuksia.
hidden label: konsertot orkesterit
in scheme: MUSA/CILLA - Musiikin asiasanasto
preferred label: konserter för orkester @sv
scope note: deprecated on 2018.10.24

pastissit
type: Concept
created: 2005-06-20
is replaced by: Y142593
modified: 2017-05-09T08:36:49+03:00
alternative label: pasticciot
definition: (1) Monen säveltäjän tuotoksista koottu kokonaisuus, esimerkiksi Beggar's opera tai (2) vanhempaa tyyliä mukaillen tehty uusi sävellys, esimerkiksi Stravinskyn Pulcinella-sarja.
in scheme: MUSA/CILLA - Musiikin asiasanasto
note: Termiä käytetään jälkimmäisessä merkityksessään lähinnä kirjallisuuden indeksoinnissa.
preferred label: pastischer @sv
scope note: deprecated on 2018.10.24

mainosmusiikki
type: Concept
created: 2006-10-02
is replaced by: Y140796
modified: 2017-05-09T08:36:49+03:00
alternative label: mainoslaulut
definition: Termiä käytetään pelkästään mainoksiin sävelletystä musiikista
definition: Termen används endast om musik som skrivits för reklamer @sv
in scheme: MUSA/CILLA - Musiikin asiasanasto
preferred label: reklammusik @sv
scope note: deprecated on 2018.10.24

idyllit
type: Concept
created: 1996-02-07
is replaced by: Y195218
modified: 2017-05-09T08:36:35+03:00
definition: Sävellyksen nimitys.
in scheme: MUSA/CILLA - Musiikin asiasanasto
note: Termiä käytetään vain sävellyksistä, joille säveltäjä on antanut tällaisen nimen.
preferred label: idyller @sv
scope note: deprecated on 2018.10.24

roolit
type: Concept
created: 1996-02-08
is replaced by: Y98623
modified: 2017-05-09T08:36:38+03:00
definition: Näyttämöteoksen esityskokoonpanoon kuuluvat soolo-osuudet.
in scheme: MUSA/CILLA - Musiikin asiasanasto
note: Termiä käytetään lähinnä kirjallisuuden indeksoinnissa ja yhdessä täsmentävän asiasanan kanssa, esimerkiksi roolit : oopperat : Wagner, Richard.
preferred label: roller @sv
scope note: deprecated on 2018.10.24

huumori
type: Concept
created: 1996-02-07
is replaced by: Y95450
modified: 2017-05-09T08:36:23+03:00
definition: Termiä käytetään musiikkijulkaisuissa aina yhdistettynä tarkempaan musiikin lajia ilmaisevaan termiin, esimerkiksi iskelmät : huumori : Suomi : 1960-luku.
in scheme: MUSA/CILLA - Musiikin asiasanasto
preferred label: humor @sv
scope note: deprecated on 2018.10.24

intonaatioteoria
type: Concept
created: 1996-02-08
is replaced by: Y214507
modified: 2017-09-04T13:29:34+03:00
definition: Boris V. Asafjevin kehittelemä marksilaisen filosofian piiriin lukeutuva teoria ihmisen tajunnan ja yhteiskunnallisen muutoksen, erityisesti poliittisen historian, sekä musiikin välisestä vuorovaikutuksesta.
in scheme: MUSA/CILLA - Musiikin asiasanasto
preferred label: intonationsteori @sv
scope note: deprecated on 2018.10.24

itkut
type: Concept
created: 1996-02-08
is replaced by: Y95589
modified: 2017-05-09T08:36:41+03:00
alternative label: itkuvirret
definition: (1) Improvisoitu valituslaulu (itkuvirsi) ja (2) laulutapa.
in scheme: MUSA/CILLA - Musiikin asiasanasto
note: Jälkimmäisessä merkityksessä termiin liitetään täsmentävä ilmaisu, esimerkiksi itkut : laulajat : naiset : Karjala.
preferred label: gråtkväden @sv
scope note: deprecated on 2018.10.24

pistemusiikki
type: Concept
created: 1996-02-08
is replaced by: Y214611
modified: 2017-05-09T08:36:42+03:00
alternative label: pisteellinen musiikki
definition: 1950-luvulla syntynyt taidemusiikin sävellystyylin suuntaus.
in scheme: MUSA/CILLA - Musiikin asiasanasto
preferred label: punktmusik @sv
scope note: deprecated on 2018.10.24

kuoronjohtaminen
type: Concept
created: 1996-02-09
is replaced by: Y107428
modified: 2016-11-25T14:05:56+02:00
alternative label: kuoronjohto
alternative label: kuorot -- johtaminen
alternative label: musiikin johtaminen
hidden label: kuorot johtaminen
in scheme: MUSA/CILLA - Musiikin asiasanasto
preferred label: kördirigering @sv
scope note: deprecated on 2018.10.24

orkesterinjohtaminen
type: Concept
created: 1996-02-09
is replaced by: Y103599
modified: 2016-11-17T22:23:19+02:00
alternative label: musiikin johtaminen
alternative label: orkesterinjohto
alternative label: orkesterit -- johtaminen
hidden label: orkesterit johtaminen
in scheme: MUSA/CILLA - Musiikin asiasanasto
preferred label: orkesterdirigering @sv
scope note: deprecated on 2018.10.24

musiikkikirjastot
type: Concept
created: 1996-02-09
is replaced by: Y97563
modified: 2017-05-09T08:36:43+03:00
definition: Laitos tai sen osa, joka hoitaa kirjastolaitoksen piirissä musiikkiin liittyviä tehtäviä ja palveluita.
in scheme: MUSA/CILLA - Musiikin asiasanasto
note: Termin yleisluontoisuuden takia sitä käytetään yhdessä täsmentävien termien kanssa, esimerkiksi musiikkikirjastot : käsikirjoitukset : Suomi.
preferred label: musikbibliotek @sv
scope note: deprecated on 2018.10.24

musiikkilehdet
type: Concept
created: 1996-02-09
is replaced by: Y100577
modified: 2017-05-09T08:36:43+03:00
definition: Musiikkiin erikoistunut sanoma- tai aikakauslehti.
in scheme: MUSA/CILLA - Musiikin asiasanasto
note: Termiä käytetään sekä ryhmästä että yksittäisistä lehdistä.
preferred label: musiktidskrifter @sv
scope note: deprecated on 2018.10.24

musiikkiterapia
type: Concept
created: 1996-02-09
is replaced by: Y97569
modified: 2017-05-09T08:36:43+03:00
definition: Hoitomuoto, jossa hoidon apuvälineinä käytetään musiikkia.
in scheme: MUSA/CILLA - Musiikin asiasanasto
preferred label: musikterapi @sv
scope note: deprecated on 2018.10.24

musikaalisuus
type: Concept
created: 1996-02-09
is replaced by: Y97570
modified: 2017-05-09T08:36:43+03:00
alternative label: epämusikaalisuus
definition: Termillä kuvataan yksilöllisiä musiikin hahmottamisen kykyjä ja musiikillista itsensä ilmaisemista.
in scheme: MUSA/CILLA - Musiikin asiasanasto
preferred label: musikalitet @sv
scope note: deprecated on 2018.10.24

temaattiset luettelot (musiikki)
type: Concept
created: 1996-02-09
is replaced by: Y214694
modified: 2016-11-24T11:16:35+02:00
alternative label: teemaluettelot
alternative label: teemat -- luettelot
alternative label: teman -- förteckningar @sv
hidden label: teemat luettelot
hidden label: teman förteckningar @sv
in scheme: MUSA/CILLA - Musiikin asiasanasto
preferred label: tematiska förteckningar (musik) @sv
scope note: deprecated on 2018.10.24

torviseitsikot
type: Concept
created: 1996-02-09
is replaced by: Y214703
modified: 2017-09-04T13:29:36+03:00
alternative label: septetit -- vaskipuhaltimet
alternative label: torviseptetit
alternative label: vaskipuhallinseptetit
alternative label: vaskiseitsikot
alternative label: vaskiseptetit
alternative label: septetter -- bleckblåsinstrument @sv
definition: Seitsemän vaskipuhaltajan, ja usein myös lyömäsoittajien, muodostama soitinyhtye. Torviseitsikkoja esiintyy yleensä vain Suomessa, missä ensimmäiset kokoonpanot perustettiin 1800-luvun lopulla.
hidden label: septetit vaskipuhaltimet
hidden label: septetter bleckblåsinstrument @sv
in scheme: MUSA/CILLA - Musiikin asiasanasto
preferred label: hornseptetter @sv
scope note: deprecated on 2018.10.24

polkka (tanssit)
type: Concept
created: 1996-02-08
is replaced by: Y216501
modified: 2017-07-12T15:18:39+03:00
broader: tanssit
definition: 1800-luvun alussa Böömissä syntynyt paritanssi.
in scheme: MUSA/CILLA - Musiikin asiasanasto
scope note: deprecated on 2018.10.24

äänitehosteet
type: Concept
created: 1996-02-15
is replaced by: Y117709
modified: 2017-05-09T08:36:43+03:00
alternative label: tehosteäänet
definition: Nimitys konkreettisille, yleensä ei-musiikillisille äänille, joita on kerätty käytettäväksi esimerkiksi teatteriesityksissä, elokuvien taustalle ja muissa esityksissä.
in scheme: MUSA/CILLA - Musiikin asiasanasto
preferred label: ljudeffekter @sv
related: luonnonäänet
scope note: deprecated on 2018.10.24

ääninauhat
type: Concept
created: 1996-02-15
is replaced by: Y104937
modified: 2017-05-09T08:36:43+03:00
definition: Nimitys teknisille tallenteille, joissa informaatio on sähkömagneettisesti tai digitaalisesti koodattu yleensä muovisen nauhan pintaan.
in scheme: MUSA/CILLA - Musiikin asiasanasto
narrower: äänikasetit
preferred label: ljudband @sv
scope note: deprecated on 2018.10.24

kurkkulaulu
type: Concept
created: 1996-02-15
is replaced by: Y214535
modified: 2017-09-04T13:29:36+03:00
alternative label: ääneslaulu
broader: laulaminen
definition: Erityisesti Aasiassa (mm. Mongolia ja Tuva) harjoitettava moniääninen ääneslaulu.
in scheme: MUSA/CILLA - Musiikin asiasanasto
preferred label: strupsång @sv
scope note: deprecated on 2018.10.24

muunnelmamuoto
type: Concept
created: 1996-02-09
is replaced by: Y214587
modified: 2017-09-04T13:29:36+03:00
broader: muoto-oppi
definition: Musiikinteoreettinen käsite, jolla kuvataan teemasta ja muunnelmista koostuvaa kokonaisuutta.
in scheme: MUSA/CILLA - Musiikin asiasanasto
preferred label: variationsform @sv
scope note: deprecated on 2018.10.24

synkopointi
type: Concept
created: 1996-02-08
is replaced by: Y214684
modified: 2017-09-04T13:29:36+03:00
alternative label: synkooppi
broader: rytmioppi
definition: Iskualan säännönmukaisesta eli tahtilajin määrittelemästä iskutuksesta poikkeava (metrillisen) iskun siirtäminen pois "oikealta" paikaltaan. Vaikka termiä käytetään kaikenlaisen musiikin yhteydessä, se tunnetaan parhaiten jazz-musiikin eräänä perusominaisuutena.
in scheme: MUSA/CILLA - Musiikin asiasanasto
preferred label: synkopering @sv
scope note: deprecated on 2018.10.24

musiikkikustantajat
type: Concept
created: 1997-09-30
is replaced by: Y108754
modified: 2017-05-09T08:36:44+03:00
alternative label: musiikkikustantamot
alternative label: musikförlag @sv
definition: Organisaatio, joka huolehtii musiikin julkaisemisesta ja kustantamisesta nuottien muodossa.
in scheme: MUSA/CILLA - Musiikin asiasanasto
preferred label: musikförläggare @sv
related: musiikkiteollisuus
scope note: deprecated on 2018.10.24

intermediot
type: Concept
created: 1997-09-30
is replaced by: Y214506
modified: 2017-09-04T13:29:36+03:00
alternative label: mellanspel @sv
broader: näyttämömusiikki
definition: Renessanssiajan näytelmien väliin sijoitettu musiikillinen välinäytös. Intermediot olivat erityisen tärkeitä Firenzessä 1500-luvulla. 1600-luvulla intermedio muuntui oopperan väliosaksi. Rinnakkaisia ilmiöitä olivat masque Englannissa ja ballet de cour Ranskassa.
in scheme: MUSA/CILLA - Musiikin asiasanasto
note: Termiä ei pidä sekoittaa käsitteeseen intermezzot.
preferred label: intermedier @sv
scope note: deprecated on 2018.10.24

jive (tanssit)
type: Concept
created: 1997-09-30
is replaced by: Y216384
modified: 2017-07-12T14:57:00+03:00
broader: tanssit
definition: Yhdysvalloissa jitterbugin nimellä 1920-luvulla syntyneen paritanssin eurooppalaisen version nimitys. Tanssi on ollut elinvoimainen sekä jazz- että rock-tanssina, mutta se on myös vakiintunut kilpatanssiohjelmistoon.
in scheme: MUSA/CILLA - Musiikin asiasanasto
preferred label: jive @sv
scope note: deprecated on 2018.10.24

eloelektroniikka
type: Concept
created: 1997-09-30
is replaced by: Y214457
modified: 2017-09-04T13:29:36+03:00
alternative label: live electronics
alternative label: live-elektroniikka
broader: elektroakustinen musiikki
definition: Elektronisia äänentuottamis- ja muokkaamisvälineitä hyödyntävä esitystekniikka, jonka avulla esittäjä kykenee muuntamaan elektronisesti tuotettua ääniainesta esitystilanteessa. Vastaava englanninkielinen termi on "live electronics".
in scheme: MUSA/CILLA - Musiikin asiasanasto
preferred label: levande elektronisk musik @sv
scope note: deprecated on 2018.10.24

historialliset äänitykset
type: Concept
created: 1997-09-30
is replaced by: Y214497
modified: 2017-09-04T13:29:38+03:00
alternative label: historialliset äänitteet
definition: Ennen 1950-luvun puoltaväliä fonografirullalle tai 78 kierroksen levylle tehty musiikki- tai puheäänite.
in scheme: MUSA/CILLA - Musiikin asiasanasto
preferred label: historiska inspelningar @sv
related: äänitykset
scope note: deprecated on 2018.10.24

äänimaisema
type: Concept
created: 1997-09-30
is replaced by: Y108842
modified: 2017-05-09T08:36:44+03:00
definition: Yksilön tai yhteisön ympäristön äänten kokonaisuus ja sen kokeminen.
in scheme: MUSA/CILLA - Musiikin asiasanasto
preferred label: ljudlandskap @sv
related: ambient
scope note: deprecated on 2018.10.24

versetit
type: Concept
created: 1997-10-01
is replaced by: Y214717
modified: 2017-09-04T13:29:37+03:00
broader: sävellykset
definition: Katolisessa liturgiassa psalmi- ja hymnisäkeistöjen kanssa vuorotteleva lyhyt urkusävellys.
in scheme: MUSA/CILLA - Musiikin asiasanasto
preferred label: versetter @sv
scope note: deprecated on 2018.10.24

rudimentit
type: Concept
created: 1997-10-01
is replaced by: Y214632
modified: 2017-09-05T11:11:36+03:00
alternative label: etydit -- rummut
definition: Rumpujensoiton opiskeluun tarkoitettu harjoituskappale, joita taidemusiikin yhteydessä yleensä kuvataan termillä etydit. Rumpujensoiton harjoittelussa hyödynnettäviä rytmiharjoituksia.
hidden label: etydit rummut
in scheme: MUSA/CILLA - Musiikin asiasanasto
preferred label: rudiment @sv
related: soitonoppaat
scope note: deprecated on 2018.10.24

masurkka (tanssit)
type: Concept
created: 1998-05-13
is replaced by: Y216498
modified: 2017-07-12T15:13:49+03:00
broader: tanssit
definition: Puolalaista alkuperää oleva kansantanssi, josta tuli yleiseurooppalainen seuratanssi 1830-luvulla.
in scheme: MUSA/CILLA - Musiikin asiasanasto
scope note: deprecated on 2018.10.24

mbaqanga
type: Concept
created: 1996-02-09
is replaced by: Y214557
modified: 2017-09-04T13:29:37+03:00
broader: afro
definition: Lähinnä Etelä-Afrikassa yleinen maailmanmusiikkityyli.
in scheme: MUSA/CILLA - Musiikin asiasanasto
scope note: deprecated on 2018.10.24

esitykset
type: Concept
created: 1998-05-12
is replaced by: Y106379
modified: 2017-05-09T08:36:45+03:00
alternative label: föreställningar -- framföranden @sv
definition: Nimitys yksittäisille esittävän taiteen esitystapahtumille.
hidden label: föreställningar framföranden @sv
in scheme: MUSA/CILLA - Musiikin asiasanasto
narrower: musiikkiesitykset
note: Termiä suositellaan käytettäväksi taiteenlajin nimeen yhdistettynä silloin, kun indeksoinnin kohteena on konkreettinen esitys tai sellaisten kokoelma, esimerkiksi esitykset : tanssi.
preferred label: föreställningar (framföranden) @sv
scope note: deprecated on 2018.10.24

merimieslaulut
type: Concept
created: 1996-10-17
is replaced by: Y214568
modified: 2017-09-04T13:29:18+03:00
alternative label: shanties
broader: laulut
definition: Populaarimusiikkiin kuuluvia lauluja, jotka tekstinsä takia liittyvät merimiesammatin perinteisiin.
in scheme: MUSA/CILLA - Musiikin asiasanasto
preferred label: sjömansvisor @sv
scope note: deprecated on 2018.10.24

bagatellit
type: Concept
created: 1998-06-22
is replaced by: Y214404
modified: 2017-09-04T13:29:38+03:00
broader: sävellykset
definition: Pienehkö, yleensä pianolle sävelletty karaktäärikappale.
in scheme: MUSA/CILLA - Musiikin asiasanasto
preferred label: bagateller @sv
scope note: deprecated on 2018.10.24

musiikkileikit
type: Concept
created: 1996-02-09
is replaced by: Y107743
modified: 2017-05-09T08:36:25+03:00
definition: Leikkejä, joissa musiikilla on keskeinen asema. Täsmällisin termi on laululeikit.
in scheme: MUSA/CILLA - Musiikin asiasanasto
narrower: laululeikit
preferred label: musiklekar @sv
scope note: deprecated on 2018.10.24

virsikirjat
type: Concept
created: 1996-02-15
is replaced by: Y100282
modified: 2017-05-09T08:36:25+03:00
definition: Kristillisten kirkkokuntien tilaisuuksissa laulettavat virret sisältävä julkaisu. Jos julkaisu sisältää myös virsien säestykset, käytetään termiä koraalivirsikirjat.
in scheme: MUSA/CILLA - Musiikin asiasanasto
narrower: koraalivirsikirjat
preferred label: psalmböcker @sv
scope note: deprecated on 2018.10.24

joiut
type: Concept
created: 1996-02-08
is replaced by: Y101941
modified: 2017-05-09T08:36:25+03:00
definition: Saamelaisten perinteeseen kuuluva laulu. Joikujen esittämisestä käytetään termiä joikaaminen.
in scheme: MUSA/CILLA - Musiikin asiasanasto
preferred label: jojkar @sv
related: kansanlaulut
scope note: deprecated on 2018.10.24

sikermät
type: Concept
created: 1997-10-01
is replaced by: Y214655
modified: 2017-09-04T13:29:38+03:00
alternative label: medleyt
alternative label: potpourrit
alternative label: potpurit
alternative label: medley @sv
broader: sävellykset
definition: Kahdesta tai sitä useammasta itsenäisestä sävelmästä koostettu sävelmien ketju, jossa ei ole taukoja. Sikermä voi sisältää yhtä hyvin populaari-, etno- kuin taidemusiikkiakin.
in scheme: MUSA/CILLA - Musiikin asiasanasto
preferred label: potpurrier @sv
scope note: deprecated on 2018.10.24

musiikin harrastaminen
type: Concept
created: 1996-10-14
is replaced by: Y214479
modified: 2017-09-04T13:29:37+03:00
alternative label: harrastemusiikki
in scheme: MUSA/CILLA - Musiikin asiasanasto
preferred label: amatörmusik @sv
related: harrastajamuusikot
scope note: deprecated on 2018.10.24

triosonaatit
type: Concept
created: 1996-02-09
is replaced by: Y214710
modified: 2017-09-04T13:29:19+03:00
broader: sonaatit
definition: Barokin ajan soitinsävellys kahdelle soolosoittimelle ja continuolle, joka saattaa koostua useammasta soittimesta ja soittajasta.
in scheme: MUSA/CILLA - Musiikin asiasanasto
note: Termiä käytetään aina soittimien nimiin yhdistettynä, esimerkiksi triosonaatit : huilu : viulu. Jos soolosoittimina on kaksi samaa soitinta, voidaan käyttää Yleisen asiasanaston käytännöstä poiketen kaarisulkeissa olevaa numeroa, esimerkiksi triosonaatit : viulu (2).
preferred label: triosonater @sv
scope note: deprecated on 2018.10.24

minimalismi
type: Concept
created: 1996-02-09
is replaced by: Y103535
modified: 2017-05-09T08:36:25+03:00
alternative label: minimalistisuus
alternative label: repetitiivinen musiikki
alternative label: repetitiomusiikki
alternative label: toistomusiikki
alternative label: repetitiv musik @sv
broader: tyylit
definition: Yleinen nimitys 1900-luvun loppupuolen taidesuuntaukselle, jolle ovat ominaisia niukat ainekset ja toisto. Musiikissa minimalismin huippukausi alkoi Yhdysvalloissa 1970- ja 1980-luvuilla, Euroopassa jonkin verran myöhemmin.
in scheme: MUSA/CILLA - Musiikin asiasanasto
note: Kun indeksoidaan musiikillista minimalismia, on aina käytettävä selventäviä lisätermejä, esimerkiksi minimalismi : taidemusiikki : Yhdysvallat : 1970-luku.
preferred label: minimalism @sv
scope note: deprecated on 2018.10.24

musiikkikasvatus
type: Concept
created: 1996-02-09
is replaced by: Y97562
modified: 2017-05-09T08:36:26+03:00
definition: Musiikin opetus ja siihen liittyvä toiminta kaikissa koulutusmuodoissa.
in scheme: MUSA/CILLA - Musiikin asiasanasto
preferred label: musikfostran @sv
related: musiikkipedagogiikka
scope note: deprecated on 2018.10.24

humppa (tanssit)
type: Concept
created: 1996-02-07
is replaced by: Y216382
modified: 2017-07-12T15:11:46+03:00
broader: tanssit
definition: Tasajakoinen 1900-luvun alkupuolella kehittynyt suomalainen paritanssi, joka pohjautuu foxtrotiin.
in scheme: MUSA/CILLA - Musiikin asiasanasto
preferred label: humpa @sv
scope note: deprecated on 2018.10.24

bossa nova
type: Concept
created: 1996-02-07
is replaced by: Y214422
modified: 2017-06-26T13:40:34+03:00
broader: latinalaisamerikkalainen populaarimusiikki
definition: Brasiliassa 1960-luvun alussa kehittynyt populaarimusiikkityyli, jossa on vaikutteita jazzista ja sambasta.
in scheme: MUSA/CILLA - Musiikin asiasanasto
scope note: deprecated on 2018.10.24

mustalaismusiikki
type: Concept
created: 1996-02-09
is replaced by: Y97573
modified: 2017-05-09T08:36:23+03:00
broader: viihdemusiikki
definition: Vanhahtava suomalainen ilmaisu erityisesti Keski-Euroopassa elävien romanien tulkitsemalle perinteiselle viihdemusiikille, jossa viululla ja cimbalomilla on keskeinen rooli.
in scheme: MUSA/CILLA - Musiikin asiasanasto
note: Termiä ei käytetä romanien varsinaisesta perinnemusiikista, joka indeksoidaan kuten muukin perinteinen musiikki, esim. perinnemusiikki : romanit : Suomi. Koska mustalaismusiikin lajeja ja tyylejä on useita (erityisesti Unkari, Espanja ja Venäjä), lisäksi on aina käytettävä maantieteellistä täsmennettävä, esimerkiksi mustalaismusiikki : kitara : Venäjä.
preferred label: zigenarmusik @sv
scope note: deprecated on 2018.10.24

rapsodiat
type: Concept
created: 1996-02-08
is replaced by: Y104138
modified: 2017-09-21T13:39:48+03:00
definition: Sävellystyyppi, joka yleistyi eurooppalaisessa taidemusiikissa 1700-luvulla. Rapsodia voi olla soitin- tai vokaalisävellys ja se perustuu usein kansanmusiikin tai populaarimusiikin melodioihin.
in scheme: MUSA/CILLA - Musiikin asiasanasto
note: Koska käsite on käytännössä epämääräinen ja moni-ilmeinen, termiä käytetään aina yhdessä täsmentävien asiasanojen kanssa, esimerkiksi rapsodiat : orkesteri, rapsodiat : altto : orkesterit.
preferred label: rapsodier @sv
scope note: deprecated on 2018.10.24

baletit
type: Concept
created: 1996-02-07
is replaced by: Y94850
modified: 2017-05-09T08:36:45+03:00
definition: Tanssitaiteeseen kuuluva taideteos kokonaisuutena (musiikki, tanssi, koreografia).
definition: Används om litteratur som behandlar balett @sv
in scheme: MUSA/CILLA - Musiikin asiasanasto
note: Termiä suositellaan käytettäväksi lähinnä kirjallisuuden ja videotallenteiden indeksoinnissa, äänitteissä käytetään termiä balettimusiikki.
preferred label: baletter @sv
related: balettimusiikki
scope note: deprecated on 2018.10.24

balladit
type: Concept
created: 1996-02-07
is replaced by: Y101000
modified: 2017-05-09T08:36:26+03:00
broader: laulut
definition: (1) Keskiaikainen, kertova tanssilaulu, (2) 1200-luvun trubaduurien ja truveerien laulettu runo, (3) moniääninen renessanssiajan laulutyyli, (4) romantiikan ajalta lähtien laulu- tai soitinsävellys, joka pohjautuu runolliseen ilmaisuun, (5) populaarimusiikissa kertova, suhteellisen yksinkertainen laulelma ja (6) 1960-luvulta lähtien rock- ja popmusiikin piirissä käytetty nimitys hidastempoisille ja tyyliltään rauhallisille lauluille.
in scheme: MUSA/CILLA - Musiikin asiasanasto
note: Kun termiä käytetään taidemusiikin yhteydessä, siihen on liitettävä tyylikautta tai muuta selventävää yhteyttä ilmaiseva asiasana. Jos termiä käytetään populaarimusiikin indeksoinnissa, on lisäksi käytettävä tarkempaa tyylillistä ilmaisua, esimerkiksi balladit : laulelmat : Ruotsi, balladit : rock : Iso-Britannia.
preferred label: ballader @sv
scope note: deprecated on 2018.10.24

serenadit
type: Concept
created: 1996-02-08
is replaced by: Y104301
modified: 2017-09-21T13:24:20+03:00
definition: Sävellyksen nimi, jota on historiallisesti käytetty hyvin monenlaisista soitin- ja laulumusiikkiteoksista aina kitarasäestyksellisistä lauluista moniosaisiin instrumentaalisiin kamariorkesteri- ja orkesteriteoksiin.
in scheme: MUSA/CILLA - Musiikin asiasanasto
note: Termiä käytetään vain teoksista, joille säveltäjä on antanut nimeksi serenadi. Termiä käytetään aina yhdessä esityskokoonpanon tai muun täsmenteen kanssa, esimerkiksi serenadit : kamariorkesterit, serenadit : baritoni : piano.
preferred label: serenader @sv
scope note: deprecated on 2018.10.24

jenka (tanssit)
type: Concept
created: 1996-02-08
is replaced by: Y216383
modified: 2017-07-12T14:59:13+03:00
alternative label: saksanpolkka (tanssit)
alternative label: sottiisi (tanssit)
alternative label: schottisar @sv
broader: tanssit
definition: Saksalaista alkuperää oleva tasajakoinen paritanssi.
in scheme: MUSA/CILLA - Musiikin asiasanasto
preferred label: jenka @sv
scope note: deprecated on 2018.10.24

kamarioopperat
type: Concept
created: 1996-02-08
is replaced by: Y214517
modified: 2017-09-04T13:29:22+03:00
broader: oopperat
definition: Kestoltaan ja esittäjistöltään suppea ooppera.
in scheme: MUSA/CILLA - Musiikin asiasanasto
preferred label: kammaroperor @sv
scope note: deprecated on 2018.10.24

televisio-oopperat
type: Concept
created: 1996-02-09
is replaced by: Y214693
modified: 2017-09-04T13:29:22+03:00
broader: oopperat
definition: Ooppera, jotka on sävelletty tai muokattu televisio-ohjelmana esitettäväksi.
in scheme: MUSA/CILLA - Musiikin asiasanasto
preferred label: TV-operor @sv
scope note: deprecated on 2018.10.24

adagiot
type: Concept
created: 1996-02-06
is replaced by: Y214378
modified: 2017-09-04T13:29:22+03:00
broader: sävellykset
definition: Sävellys tai sävellyksen yksittäinen osa, joka on nimetty Adagioksi tai jonka tempomääre on adagio.
in scheme: MUSA/CILLA - Musiikin asiasanasto
preferred label: adagion @sv
scope note: deprecated on 2018.10.24

benga
type: Concept
created: 1996-02-07
is replaced by: Y214416
modified: 2017-09-04T13:29:22+03:00
broader: afro
definition: Afrikkalainen, Keniassa 1970-luvun puolivälissä kehittynyt perinnemusiikkiin pohjautuva populaarimusiikin tyyli, jossa käytetään sähköisiä soittimia.
in scheme: MUSA/CILLA - Musiikin asiasanasto
scope note: deprecated on 2018.10.24

juju
type: Concept
created: 1996-02-08
is replaced by: Y214513
modified: 2017-06-27T10:53:32+03:00
broader: afro
definition: Afrikkalainen (nigerialainen) populaarimusiikin tyylilaji.
in scheme: MUSA/CILLA - Musiikin asiasanasto
scope note: deprecated on 2018.10.24

makossa
type: Concept
created: 1996-03-21
is replaced by: Y214553
modified: 2017-09-04T13:29:22+03:00
broader: afro
definition: Afrikkalainen maailmanmusiikkityyli, joka on kehittynyt kamerunilaisesta makossarytmistä erityisesti Manu Dibangon musiikissa.
in scheme: MUSA/CILLA - Musiikin asiasanasto
scope note: deprecated on 2018.10.24

mbalax
type: Concept
created: 1996-02-09
is replaced by: Y214556
modified: 2017-09-04T13:29:22+03:00
broader: afro
definition: Lähinnä Senegalissa 1970-luvulla kehittynyt maailmanmusiikkityyli.
in scheme: MUSA/CILLA - Musiikin asiasanasto
scope note: deprecated on 2018.10.24

soukous
type: Concept
created: 1996-02-08
is replaced by: Y214675
modified: 2017-09-04T13:29:22+03:00
broader: afro
definition: Erityisesti Kongon (Zairen) alueella esiintyvä maailmanmusiikkityyli, joka 1970-luvulta alkaen on noussut Keski-Afrikan alueen keskeiseksi tanssimusiikkityyliksi.
in scheme: MUSA/CILLA - Musiikin asiasanasto
scope note: deprecated on 2018.10.24

afrokuubalainen jazz
type: Concept
created: 1996-02-07
is replaced by: Y214380
modified: 2017-06-26T10:33:07+03:00
broader: bebop
definition: 1940-luvun lopulla bebopiin ja kuubalaiseen populaarimusiikkiin pohjautuva, yleensä suurella yhtyeellä tai orkesterilla (big band) esitetty jazzin laji.
in scheme: MUSA/CILLA - Musiikin asiasanasto
preferred label: afrokubansk jazz @sv
scope note: deprecated on 2018.10.24

agogiikka
type: Concept
created: 1996-02-07
is replaced by: Y214382
modified: 2017-09-04T13:29:22+03:00
broader: tulkinta
definition: Sävelten, taukojen ja rytmien kestoaikojen sekä temponkäsittelyn ilmaisullinen muuntelu, vivahde- ja hienosäätö.
in scheme: MUSA/CILLA - Musiikin asiasanasto
preferred label: agogik @sv
scope note: deprecated on 2018.10.24

sähköakustiikka
type: Concept
created: 1996-02-08
is replaced by: Y100624
modified: 2017-05-09T08:36:28+03:00
alternative label: elektroakustiikka
broader: akustiikka
definition: Sähköisten ja akustisten ilmiöiden yhteyksiä tutkiva ja soveltava tekniikan alue.
in scheme: MUSA/CILLA - Musiikin asiasanasto
preferred label: elektroakustik @sv
scope note: deprecated on 2018.10.24

aleatorinen musiikki
type: Concept
created: 1996-02-07
is replaced by: Y214385
modified: 2017-09-04T13:29:23+03:00
alternative label: indeterminismi
alternative label: sattumamusiikki
alternative label: indetermination @sv
broader: musiikki
definition: 1950-luvulla alkunsa saanut sävellys- ja esitystekniikka, jossa teoksen osa tai koko teos muodostuu säveltäjän tai esittäjän (esittäjien) sattumanvaraisten valintojen mukaan.
in scheme: MUSA/CILLA - Musiikin asiasanasto
preferred label: aleatorisk musik @sv
scope note: deprecated on 2018.10.24

altto
type: Concept
created: 1996-02-07
is replaced by: Y214389
modified: 2017-09-04T13:29:23+03:00
alternative label: alttoääni
alternative label: kontra-altto
alternative label: kontraalt @sv
broader: äänialat
definition: Matalin naisääni laulumusiikin äänialana (g-e'' tai laajempi). Termiä ei käytetä ilmaisemaan erilaisia alttoäänisiä soittimia tai yleensä soittimen äänialan korkeutta.
in scheme: MUSA/CILLA - Musiikin asiasanasto
preferred label: alt @sv
scope note: deprecated on 2018.10.24

asete
type: Concept
created: 1996-02-07
is replaced by: Y214398
modified: 2017-06-26T11:51:48+03:00
alternative label: ansatsi
broader: soittaminen
definition: Huulten valmiustila puhallinsoittajilla (ansatsi, Ansatz).
in scheme: MUSA/CILLA - Musiikin asiasanasto
preferred label: ansats @sv
scope note: deprecated on 2018.10.24

antifonit
type: Concept
created: 1996-02-07
is replaced by: Y214392
modified: 2017-09-04T13:29:23+03:00
broader: kirkkomusiikki
definition: Liturgiseen musiikkiin kuuluva lyhyt laulu, joka kehystää laulettua psalmia.
in scheme: MUSA/CILLA - Musiikin asiasanasto
preferred label: antifoner @sv
scope note: deprecated on 2018.10.24

antiikki
type: Concept
created: 1996-02-07
is replaced by: Y94664
modified: 2017-05-09T08:36:45+03:00
broader: tyylikaudet
definition: Musiikissa nimitys keskiaikaa varhaisemmille länsimaisen taidemusiikin tyylikausille.
definition: Avser den grekiska och den romerska forntiden @sv
in scheme: MUSA/CILLA - Musiikin asiasanasto
note: Termiä suositellaan käytettäväksi aina yhdessä jonkin musiikkiin liittyvän termin ja maantieteellisen täsmenteen kanssa, esimerkiksi soittimet : antiikki : Rooma.
preferred label: antiken @sv
scope note: deprecated on 2018.10.24

arabeskit (sävellykset)
type: Concept
created: 1996-02-07
is replaced by: Y214393
modified: 2017-09-04T13:29:38+03:00
broader: sävellykset
definition: Helmeilevän koristeellinen, yleensä pianolle sävelletty lyhyehkö ja hienostunut sävellys.
in scheme: MUSA/CILLA - Musiikin asiasanasto
preferred label: arabesker @sv
scope note: deprecated on 2018.10.24

itämainen tanssi
type: Concept
created: 1996-02-08
is replaced by: Y107831
modified: 2017-05-09T08:36:29+03:00
alternative label: vatsatanssi
alternative label: magdans @sv
definition: (1) Pohjois-Afrikassa ja Lähi-Idän maissa esiintyvien tanssien yleisnimitys ja (2) musiikkitermi, jolla tarkoitetaan itämaisen tanssin säestyksenä käytettävää musiikkia.
in scheme: MUSA/CILLA - Musiikin asiasanasto
note: Termiä suositellaan käytettäväksi musiikkijulkaisuissa funktionaalisesti musiikista, jota voidaan käyttää itämaisen tanssin harjoittelussa tai esittämisessä. Termin käyttöä ei ole tarkoituksenmukaista rajoittaa vain joihinkin täsmällisiin tyyleihin, sillä markkinoilla on hyvin monenlaista musiikkia, joka voi rytminsä puolesta soveltua tähän tehtävään. Termin yhteydessä suositellaan käytettäväksi tarpeen mukaan tyyliä tai aluetta täsmentäviä asiasanoja, esimerkiksi itämainen tanssi : viihdemusiikki : Libanon, itämainen tanssi : perinnemusiikki : Algeria.
preferred label: orientalisk dans @sv
related: arabialainen musiikki
scope note: deprecated on 2018.10.24

ariosot
type: Concept
created: 1996-02-07
is replaced by: Y214395
modified: 2017-09-04T13:29:23+03:00
broader: sävellykset
definition: Resitatiivia kiinteämpi, mutta aariaa suppeampi ja vapaampi vokaalimusiikin muototyyppi, myös erillinen vokaalisävellys tai laulullinen soitinsävellys.
in scheme: MUSA/CILLA - Musiikin asiasanasto
preferred label: arioson @sv
scope note: deprecated on 2018.10.24

artikulaatio
type: Concept
created: 1996-02-07
is replaced by: Y218506
modified: 2017-05-09T08:36:29+03:00
broader: tulkinta
definition: (1) Kirjainten, äänteiden, sanojen ja sävelten selkeä ääntäminen laulettaessa tai lausuttaessa. (2) Sävelten, taukojen ja rytmien erittely, ryhmittely ja painottaminen musiikillisessa ilmaisussa.
in scheme: MUSA/CILLA - Musiikin asiasanasto
preferred label: artikulation @sv
scope note: deprecated on 2018.10.24

pianola
type: Concept
created: 1996-02-08
is replaced by: Y214609
modified: 2017-09-04T13:29:23+03:00
broader: automaattisoittimet
definition: Automaattipiano, jossa koskettimia ohjataan reijitetyillä paperirullilla. Termiä on käytetty lähinnä Isossa-Britanniassa myös automaattipianojen yleisnimityksenä, vaikka Pianola on alun perin ollut vain tuotemerkki.
in scheme: MUSA/CILLA - Musiikin asiasanasto
scope note: deprecated on 2018.10.24

posetiivi
type: Concept
created: 1996-02-08
is replaced by: Y214613
modified: 2017-09-04T13:29:23+03:00
broader: automaattisoittimet
definition: Automaattiurut, joita yleensä käytetään käsin kahvasta pyörittämällä.
in scheme: MUSA/CILLA - Musiikin asiasanasto
preferred label: vevpositiv @sv
scope note: deprecated on 2018.10.24

soittorasia
type: Concept
created: 1996-02-08
is replaced by: Y214668
modified: 2017-09-04T13:29:23+03:00
alternative label: soittorasiat
broader: automaattisoittimet
definition: Mekaaninen soitin, jossa soivat sävellykset ovat ohjelmoitu jousivoimalla pyöriviin, metallipiikein varustettuihin lieriöihin.
in scheme: MUSA/CILLA - Musiikin asiasanasto
preferred label: speldosor @sv
scope note: deprecated on 2018.10.24

avantgarde
type: Concept
created: 1996-02-07
is replaced by: Y215863
modified: 2017-05-09T08:36:30+03:00
alternative label: kokeellinen musiikki
definition: Yleisesti kunkin aikakauden uusimpien taidesuuntauksien nimitys.
in scheme: MUSA/CILLA - Musiikin asiasanasto
note: Termiä suositellaan käytettäväksi vain 1900-luvun ja 2000-luvun musiikillisten ilmiöiden yhteydessä ajanmääreen kera, esimerkiksi piano : avantgarde : Italia : 1920-luku. Lisäksi suositellaan tarkemman tyylilajitermin käyttämistä, ellei julkaisu käsittele avantgardismia yleensä, esim. avantgarde : minimalismi : Yhdysvallat : 1960-luku, taidemusiikki : avantgarde : Suomi : 1980-luku.
related: ambient
scope note: deprecated on 2018.10.24

bandoneon
type: Concept
created: 1996-02-07
is replaced by: Y214405
modified: 2017-06-26T11:57:33+03:00
broader: harmonikka
in scheme: MUSA/CILLA - Musiikin asiasanasto
scope note: deprecated on 2018.10.24

baritoni
type: Concept
created: 1996-02-07
is replaced by: Y214407
modified: 2017-09-04T13:29:24+03:00
alternative label: bassobaritoni
alternative label: basbaryton @sv
broader: äänialat
definition: Toisiksi matalin miesääni laulumusiikin äänialana (A-f' tai laajempi). Termiä ei pidä sekoittaa barytoni-nimiseen jousisoittimeen eikä eufonium-nimiseen puhallinsoittimeen, josta käytetään myös nimitystä barytonitorvi.
in scheme: MUSA/CILLA - Musiikin asiasanasto
preferred label: baryton @sv
scope note: deprecated on 2018.10.24

barokki
type: Concept
created: 1996-02-07
is replaced by: Y101006
modified: 2017-05-09T08:36:30+03:00
broader: tyylikaudet
definition: Musiikillinen tyylikausi, joka kattaa suunnilleen vuosikymmenet 1600-1750. Tämä, kuten muutkin tyylikausitermit, määritellään eri lähteissä vaihtelevalla tavalla.
in scheme: MUSA/CILLA - Musiikin asiasanasto
note: Tyylikausinimityksiä suositellaan käytettäväksi aina täsmenteiden kera ja lähinnä sellaisten julkaisuiden yhteydessä, joiden tarkoituksena on esitellä tai kuvailla tyylikauden musiikkia. Tyylikausitermejä ei tule käyttää systemaattisesti jokaisen julkaisun yhteydessä.
preferred label: barock @sv
scope note: deprecated on 2018.10.24

basso
type: Concept
created: 1996-02-07
is replaced by: Y214411
modified: 2017-09-04T13:29:24+03:00
broader: äänialat
definition: Matalin miesääni laulumusiikin äänialana (F-e' tai laajempi). Termiä ei käytetä ilmaisemaan erilaisia bassoäänisiä soittimia tai yleensä soittimen äänialan korkeutta.
in scheme: MUSA/CILLA - Musiikin asiasanasto
preferred label: bas @sv
scope note: deprecated on 2018.10.24

bel canto
type: Concept
created: 1996-02-07
is replaced by: Y214415
modified: 2017-09-04T13:29:24+03:00
broader: laulaminen
definition: Perinteinen italialainen laulutyyli, jolle on ominaista vapautunut, tasapainoinen ja kaunis äänenmuodostus sekä tekninen virtuoosisuus vastakohtana romanttisemmalle, tunnepitoiselle ja tekstin tulkintaan paneutuvalle laulutavalle.
in scheme: MUSA/CILLA - Musiikin asiasanasto
scope note: deprecated on 2018.10.24

bhangra
type: Concept
created: 1996-02-07
is replaced by: Y214418
modified: 2017-09-04T13:29:24+03:00
broader: maailmanmusiikki
definition: Termi tarkoittaa alkuperäisessä muodossaan intialaista (Punjab) perinnemusiikki- ja tanssityyliä, jonka pohjalta kehittyi 1970-1980-lukujen vaihteessa lähinnä Lontoon alueella erityinen pop-bhangran nimellä kulkeva maailmanmusiikkityyli. Tämä pop-bhangra on kehittynyt yhä selkeämmin pop- ja diskotyyliksi.
in scheme: MUSA/CILLA - Musiikin asiasanasto
scope note: deprecated on 2018.10.24

bibliografiat
type: Concept
created: 1996-02-07
is replaced by: Y94863
modified: 2017-05-09T08:36:30+03:00
definition: Kirjoitusten tai kirjojen luettelo. Bibliografian muodolle tai laajuudelle ei ole olemassa täsmällisiä rajoja tai sääntöjä.
in scheme: MUSA/CILLA - Musiikin asiasanasto
preferred label: bibliografier @sv
related: diskografiat
scope note: deprecated on 2018.10.24

diskografiat
type: Concept
created: 1996-02-07
is replaced by: Y104938
modified: 2017-05-09T08:36:30+03:00
alternative label: levyluettelot
alternative label: ääniteluettelot
alternative label: fonogramkataloger @sv
alternative label: skivkataloger @sv
definition: Äänitteiden bibliografinen luettelo. Diskografiat jaetaan kolmeen pääryhmään: (1) kansallisdiskografiat, (2) henkilödiskografiat ja (3) tyylilajidiskografiat.
in scheme: MUSA/CILLA - Musiikin asiasanasto
note: Termiä suositellaan käytettäväksi lähinnä laajoista ja ainakin bibliografisin perustiedoin varustetuista luetteloista, koska diskografioiden bibliografinen tarkkuus ja laajuus vaihtelevat erittäin voimakkaasti.
preferred label: diskografier @sv
related: bibliografiat
scope note: deprecated on 2018.10.24

buzuki
type: Concept
created: 1996-02-07
is replaced by: Y214424
modified: 2017-09-04T13:29:24+03:00
preferred label: bouzouki
broader: näppäilysoittimet
definition: Kreikkalainen pitkäkaulainen luuttusoitin. Irlantilaisessa populaarikansanmusiikissa käytetään "bouzouki"-nimistä soitinta. Tästä rakenteeltaan hieman erilaisesta soittimesta suositellaan käytettäväksi nimitystä irlantilainen buzuki.
in scheme: MUSA/CILLA - Musiikin asiasanasto
scope note: deprecated on 2018.10.24

burleskit (sävellykset)
type: Concept
created: 1996-02-07
is replaced by: Y214423
modified: 2017-09-04T13:29:38+03:00
broader: sävellykset
definition: Nimitys "leikkisälle" tai "oikukkaalle" soitinsävellykselle.
in scheme: MUSA/CILLA - Musiikin asiasanasto
preferred label: burlesker @sv
scope note: deprecated on 2018.10.24

groupiet
type: Concept
created: 1996-02-07
is replaced by: Y214471
modified: 2017-09-04T13:29:25+03:00
alternative label: bändärit
broader: ihailijat
definition: Lähinnä pop- ja rock-musiikkipiireissä toimiva, äärimmäisen omistautunut ja innokas yksittäisen artistin tai yhtyeen ihailija. Termin suomenkielisenä vastineena on käytetty ilmaisua "bändäri". Groupiet voivat olla nais- tai miespuolisia.
in scheme: MUSA/CILLA - Musiikin asiasanasto
preferred label: groupies @sv
scope note: deprecated on 2018.10.24

capricciot
type: Concept
created: 1996-02-07
is replaced by: Y214431
modified: 2017-09-04T13:29:25+03:00
alternative label: capricciettot
alternative label: kapriisit
alternative label: kapriser @sv
broader: sävellykset
definition: Nimitys soitinsävellykselle, joka on luonteeltaan vilkas tai oikukas.
in scheme: MUSA/CILLA - Musiikin asiasanasto
preferred label: capriccion @sv
scope note: deprecated on 2018.10.24

chaconnet
type: Concept
created: 1996-02-07
is replaced by: Y214433
modified: 2017-09-04T13:29:25+03:00
broader: sävellykset
definition: Barokin aikana kehittynyt soitinmusiikkityyppi, jonka musiikillisia rinnakkaisilmiöitä ovat passacaglia ja englantilainen ground.
in scheme: MUSA/CILLA - Musiikin asiasanasto
preferred label: chaconner @sv
scope note: deprecated on 2018.10.24

Chicago-jazz
type: Concept
created: 1996-02-07
is replaced by: Y214353
modified: 2017-06-26T14:39:55+03:00
broader: traditionaalinen jazz
definition: 1920-luvulla kehittynyt traditionaalisen jazzin tyylisuunta.
in scheme: MUSA/CILLA - Musiikin asiasanasto
scope note: deprecated on 2018.10.24

congarumpu
type: Concept
created: 1996-02-07
is replaced by: Y214438
modified: 2017-09-04T13:29:26+03:00
broader: lyömäsoittimet
definition: Afro- ja latinalaisamerikkalaisessa musiikissa yleensä pareittain käytettävä noin 90 cm korkea rumpu, jonka kolme eri kokoa ovat nimeltään quinto, conga ja tumba.
in scheme: MUSA/CILLA - Musiikin asiasanasto
preferred label: congatrumma @sv
scope note: deprecated on 2018.10.24

csárdás (tanssit)
type: Concept
created: 1996-02-07
is replaced by: Y217311
modified: 2017-09-04T13:29:26+03:00
broader: tanssit
definition: 1800-luvun unkarilaisesta seuratanssista kehittynyt sävellystyyppi, joka on yleistynyt erityisesti ns. mustalaismusiikin yhteydessä hyvinkin viihteellisinä sovituksina.
in scheme: MUSA/CILLA - Musiikin asiasanasto
preferred label: csárdás @sv
scope note: deprecated on 2018.10.24

cumbia
type: Concept
created: 1996-02-07
is replaced by: Y214445
modified: 2017-06-26T15:14:17+03:00
broader: latinalaisamerikkalainen populaarimusiikki
definition: Kolumbiassa kehittynyt populaarimusiikin tyyli.
in scheme: MUSA/CILLA - Musiikin asiasanasto
scope note: deprecated on 2018.10.24

dynamiikka
type: Concept
created: 1996-02-07
is replaced by: Y94938
modified: 2017-05-09T08:36:32+03:00
broader: tulkinta
definition: Äänen voimakkuuden vaihtelu ja sen aikaansaamiseksi käytettävissä olevat voimavarat, jotka voivat olla yhtäkkisiä (forte - piano, sforzando) tai vähittäisiä (crescendo - diminuendo).
in scheme: MUSA/CILLA - Musiikin asiasanasto
preferred label: dynamik @sv
scope note: deprecated on 2018.10.24

ekspressionismi
type: Concept
created: 1996-02-07
is replaced by: Y94955
modified: 2017-05-09T08:36:32+03:00
broader: tyylit
definition: Yleinen taidehistoriallinen tyylikausitermi, jolla musiikissa tarkoitetaan yleensä 1900-luvun ensimmäisten vuosikymmenten ei-tonaalista musiikkia (mm. Schönberg, Berg ja Webern).
in scheme: MUSA/CILLA - Musiikin asiasanasto
note: Termiä suositellaan käytettäväksi aina yhdessä täsmentävän musiikkitermin kanssa, esimerkiksi ekspressionismi : taidemusiikki : Saksa : 1910-luku.
preferred label: expressionism @sv
scope note: deprecated on 2018.10.24

muistelmat
type: Concept
created: 1996-02-09
is replaced by: Y97522
modified: 2017-05-09T08:36:33+03:00
broader: elämäkerrat
definition: Henkilöhistorian laji, jossa kohdehenkilö itse toimii tapahtumien kuvaajana.
in scheme: MUSA/CILLA - Musiikin asiasanasto
note: Termiä käytetään musiikissa aina yhdistettynä täsmentäviin termeihin, esimerkiksi muistelmat : laulajat : ooppera : Suomi, muistelmat : kapellimestarit.
preferred label: memoarer @sv
scope note: deprecated on 2018.10.24

musiikkifolklorismi
type: Concept
created: 1996-02-09
is replaced by: Y214584
modified: 2017-09-04T13:29:27+03:00
definition: Kansanmusiikin taiteellista ja ideologista soveltamista (Kurkela: Musiikkifolklorismi & järjestökulttuuri)
in scheme: MUSA/CILLA - Musiikin asiasanasto
preferred label: musikfolklorism @sv
related: etnomusikologia
scope note: deprecated on 2018.10.24

musiikkileirit
type: Concept
created: 2003-10-20
is replaced by: Y116105
modified: 2017-09-21T13:40:02+03:00
definition: Musiikin jonkin osa-alueen opettamiseen ja/tai harjoittamiseen tarkoitettu leiri.
in scheme: MUSA/CILLA - Musiikin asiasanasto
preferred label: musikläger @sv
scope note: deprecated on 2018.10.24

kasettinauhurit
type: Concept
created: 1996-02-08
is replaced by: Y95916
modified: 2017-05-09T08:36:34+03:00
broader: nauhurit
definition: Soitin, jonka avulla toistetaan kasettiformaattiin pakattua ääni- tai kuvanauhaa. Yleensä termillä tarkoitetaan ns. c-kasetteja toistavaa laitetta.
in scheme: MUSA/CILLA - Musiikin asiasanasto
preferred label: kassettbandspelare @sv
scope note: deprecated on 2018.10.24

fanfaarit
type: Concept
created: 1996-02-07
is replaced by: Y214461
modified: 2017-09-04T13:29:27+03:00
broader: sävellykset
definition: Yleensä lyhyt, vaskipuhaltimilla esitettävä sävelmä, joka on tarkoitettu juhlallisen tapahtuman tai seremonian aloitussignaaliksi.
in scheme: MUSA/CILLA - Musiikin asiasanasto
preferred label: fanfarer @sv
scope note: deprecated on 2018.10.24

kelttiläinen kansanmusiikki
type: Concept
created: 1996-02-08
is replaced by: Y214520
modified: 2017-09-04T13:29:27+03:00
broader: kansanmusiikki
definition: Euroopassa esiintyvien kelttiperäisten kulttuurien perinteinen musiikki, joka on säilynyt Britteinsaarten lisäksi Ranskan Bretagnessa ja pienillä alueilla Espanjassa.
in scheme: MUSA/CILLA - Musiikin asiasanasto
preferred label: keltisk folkmusik @sv
scope note: deprecated on 2018.10.24

kaanonit (sävellykset)
type: Concept
created: 1996-02-08
is replaced by: Y199129
modified: 2017-09-04T13:29:38+03:00
alternative label: kehäkaanonit
alternative label: ketjulaulut
broader: sävellykset
definition: Kontrapunktinen musiikin muoto, jossa toistetaan samaa sävelmää sellaisenaan tai esimerkiksi eri tahdissa tai eri sävellajeissa.
in scheme: MUSA/CILLA - Musiikin asiasanasto
preferred label: kanon @sv
scope note: deprecated on 2018.10.24

psalmit
type: Concept
created: 2004-03-14
is replaced by: Y128452
modified: 2017-05-09T08:36:46+03:00
definition: (1) Uskonnollisen lyriikan tuote tai (2) Raamatun Vanhan testamentin psalmitekstiin (150 erilaista) tehty sävellys, joka voi olla osa liturgista kokonaisuutta, mutta myös itsenäinen taidemusiikkisävellys.
in scheme: MUSA/CILLA - Musiikin asiasanasto
note: Termiä käytetään jälkimmäisessä merkityksessä yhdessä esityskokoonpanoa ilmaisevan termin tai muun täsmenteen kanssa, esimerkiksi psalmit : lauluyhtyeet : Englanti : 1600- luku.
preferred label: psaltarpsalmer @sv
related: liturginen musiikki
scope note: deprecated on 2018.10.24

hootenanny
type: Concept
created: 1996-02-07
is replaced by: Y214498
modified: 2017-06-27T10:16:58+03:00
broader: folkmusiikki
definition: Folkmusiikin tyyli, jolle on ominaista yhteislaulu.
in scheme: MUSA/CILLA - Musiikin asiasanasto
scope note: deprecated on 2018.10.24

formalismi
type: Concept
created: 1996-02-07
is replaced by: Y101377
modified: 2017-05-09T08:36:34+03:00
broader: tyylit
definition: Musiikissa sävellyksen muodollisten tai rakenteellisten ominaisuuksien korostuminen, yleensä arvottavassa mielessä.
in scheme: MUSA/CILLA - Musiikin asiasanasto
preferred label: formalism @sv
scope note: deprecated on 2018.10.24

fraseeraus
type: Concept
created: 1996-02-07
is replaced by: Y214465
modified: 2017-09-04T13:29:27+03:00
broader: tulkinta
definition: Säerakenteen selvennys tai yleisemmin tapa muotoilla säerakennetta.
in scheme: MUSA/CILLA - Musiikin asiasanasto
preferred label: frasering @sv
scope note: deprecated on 2018.10.24

futurismi
type: Concept
created: 1996-02-07
is replaced by: Y95190
modified: 2017-05-09T08:36:34+03:00
broader: tyylit
definition: Kyseessä on lähinnä Italiassa 1920-luvulla esiintynyt taidesuunta. Musiikillisen futurismin piiriin kuuluvia (harrastaja)säveltäjiä tunnetaan nimellä lähinnä vain Italiasta (F. T. Marinetti, Pratella, Luigi Russolo, Franco Casavola, Nuccio Fiorda ja Antonio Russolo). Tyylisuunta sai jonkinlaista vastakaikua myös 1920-luvun Neuvostoliitossa.
in scheme: MUSA/CILLA - Musiikin asiasanasto
note: Termiä ei käytetä populaarimusiikissa. 1970-luvulla syntyi popmusiikin tyylisuunta, jolle vakiintui nimitys futurock. Tätä termiä ei ole otettu sanastoon sen ajallisen rajoittuneisuuden takia.
preferred label: futurism @sv
scope note: deprecated on 2018.10.24

fuugat
type: Concept
created: 1996-02-07
is replaced by: Y101394
modified: 2017-09-21T13:24:21+03:00
alternative label: fugatot
alternative label: fughetat
definition: (1) Polyfonisen musiikin muoto ja (2) tämänniminen sävellys. Historiallisesti läheisiä käsitteitä ovat kaanon ja ricercare.
in scheme: MUSA/CILLA - Musiikin asiasanasto
preferred label: fugor @sv
scope note: deprecated on 2018.10.24

gamelanmusiikki
type: Concept
created: 1996-02-07
is replaced by: Y214468
modified: 2017-09-04T13:29:27+03:00
broader: perinnemusiikki
definition: Indonesian saaristossa ja Malesiassa perinteisellä lyömäsoitinyhtyeellä tai -orkesterilla (gamelan) esitettävä musiikki.
in scheme: MUSA/CILLA - Musiikin asiasanasto
preferred label: gamelanmusik @sv
scope note: deprecated on 2018.10.24

ghazal
type: Concept
created: 1996-02-07
is replaced by: Y214469
modified: 2017-09-04T13:29:28+03:00
broader: maailmanmusiikki
definition: Islamilaiseen perinteeseen liittyvä laulumuoto, joka on ollut suosittu varsinkin Pakistanissa ja Intiassa, missä se on yleinen varsinkin elokuvamusiikissa. Tyylillisesti ghazal on maailmanmusiikkia, jossa on vaikutteita länsimaisesta populaarimusiikista.
in scheme: MUSA/CILLA - Musiikin asiasanasto
scope note: deprecated on 2018.10.24

gongi
type: Concept
created: 1996-02-07
is replaced by: Y214470
modified: 2017-09-04T13:29:28+03:00
broader: lyömäsoittimet
definition: Metallista valmistettu pyöreä lyömäsoitin.
in scheme: MUSA/CILLA - Musiikin asiasanasto
preferred label: gong @sv
scope note: deprecated on 2018.10.24

gotiikka
type: Concept
created: 1996-02-07
is replaced by: Y101450
modified: 2017-05-09T08:36:34+03:00
broader: tyylikaudet
definition: Keskiajan loppuun ja renessanssin ajan alkuun sijoittuva taidehistorian aikakausi. Musiikissa gotiikalla on yleisimmin tarkoitettu moniäänistä kirkkomusiikkityyliä.
in scheme: MUSA/CILLA - Musiikin asiasanasto
note: Termin moniselitteisyyden takia sitä on syytä käyttää musiikissa lähinnä kirjallisuuden indeksoinnissa. Nuottien ja äänitteiden kohdalla on suositeltavampaa käyttää vakiintuneita termejä kuten keskiaika ja renessanssi tarvittavine täsmenteineen.
preferred label: gotik @sv
scope note: deprecated on 2018.10.24

psychobilly
type: Concept
created: 2005-06-16
is replaced by: Y214617
modified: 2017-09-04T13:29:51+03:00
broader: rock
definition: 1970- ja 1980-lukujen vaihteessa syntynyt rock-tyyli, jossa yhdistyvät rockabilly ja punk rock. Tyypillisiä edustajia ovat mm. Reverend Horton Heat ja The Cramps.
in scheme: MUSA/CILLA - Musiikin asiasanasto
scope note: deprecated on 2018.10.24

koe-esiintyminen
type: Concept
created: 2005-06-16
is replaced by: Y214525
modified: 2017-09-04T13:29:51+03:00
alternative label: koelaulu
alternative label: koesoitto
broader: esiintyminen
definition: Tilaisuus, joka järjestetään esittävän taidemuodon tai viihteen lajin esitykseen tai kokoonpanoon pyrkiville hakijoille valintaa varten.
in scheme: MUSA/CILLA - Musiikin asiasanasto
preferred label: provuppträdande @sv
scope note: deprecated on 2018.10.24

bysanttilainen kirkkomusiikki
type: Concept
created: 2005-06-16
is replaced by: Y214425
modified: 2017-06-26T13:49:19+03:00
broader: ortodoksinen kirkkomusiikki
definition: Ortodoksisen kirkon bysanttilaisen liturgian mukainen jumalanpalvelusmusiikki.
in scheme: MUSA/CILLA - Musiikin asiasanasto
preferred label: bysantinsk kyrkomusik @sv
scope note: deprecated on 2018.10.24

sormiharjoitukset
type: Concept
created: 2005-06-17
is replaced by: Y214674
modified: 2017-09-04T13:29:51+03:00
broader: harjoitusaineistot
definition: Erilaisten soittimien soittajille tarkoitettuja teknis-motorisia harjoituksia.
in scheme: MUSA/CILLA - Musiikin asiasanasto
preferred label: fingerövningar @sv
scope note: deprecated on 2018.10.24

spektrimusiikki
type: Concept
created: 2005-06-17
is replaced by: Y214678
modified: 2017-09-08T12:54:13+03:00
broader: taidemusiikki
definition: 1970-luvulta lähtien sävellettyä taidemusiikkia, jossa äänen yläsävelspektriä käytetään sävellysteknisten ratkaisujen pohjana.
in scheme: MUSA/CILLA - Musiikin asiasanasto
preferred label: spektralmusik @sv
scope note: deprecated on 2018.10.24

sämplerit
type: Concept
created: 2005-06-17
is replaced by: Y214686
modified: 2017-09-04T13:29:51+03:00
alternative label: samplerit
alternative label: sämpler @sv
broader: musiikkiteknologia
definition: Laite tai tietokoneohjelma, jonka avulla sämplet otetaan, muokataan ja yhdistetään.
in scheme: MUSA/CILLA - Musiikin asiasanasto
preferred label: sampler @sv
scope note: deprecated on 2018.10.24

sämplääjät
type: Concept
created: 2005-06-17
is replaced by: Y214688
modified: 2017-09-04T13:29:51+03:00
alternative label: samplaajat
alternative label: sämplers @sv
broader: muusikot
definition: Henkilö, joka luo sämpläyksen avulla musiikillisia teoksia.
in scheme: MUSA/CILLA - Musiikin asiasanasto
preferred label: samplers @sv

cakewalk (tanssit)
type: Concept
created: 2005-06-17
is replaced by: Y214429
modified: 2017-09-04T13:29:52+03:00
broader: tanssit
definition: Yhdysvaltain mustan väestön piirissä 1800-luvulla syntynyt tanssi, joka 1890-luvulta alkaen levisi minstrel show -esitysten välityksellä osaksi vallitsevaa näyttämöllistä viihdekulttuuria. Cakewalkin musiikkina oli tavallisesti ragtime.
in scheme: MUSA/CILLA - Musiikin asiasanasto
preferred label: cakewalk @sv
scope note: deprecated on 2018.10.24

televisiomusiikki
type: Concept
created: 2005-06-17
is replaced by: Y214692
modified: 2017-09-04T13:29:52+03:00
alternative label: musiikki -- televisio-ohjelmat
alternative label: televisionsmusik @sv
broader: musiikki
definition: Televisio-ohjelmia ja mainoksia varten luotu tai niihin liitetty valmis musiikki, joka voi kuulua taustalla tai liittyä näytettävään musiikkiesitykseen.
hidden label: musiikki televisio-ohjelmat
in scheme: MUSA/CILLA - Musiikin asiasanasto
preferred label: musik i TV-program @sv
scope note: deprecated on 2018.10.24

musiikkiohjelmat (televisio-ohjelmat)
type: Concept
created: 2005-06-17
is replaced by: Y97565
modified: 2017-09-04T13:29:52+03:00
alternative label: musiikkiohjelmat -- televisio
alternative label: televisionsmusik @sv
broader: musiikkiohjelmat
definition: Televisiota varten tehdyt musiikkiaiheiset ohjelmat.
hidden label: musiikkiohjelmat televisio
in scheme: MUSA/CILLA - Musiikin asiasanasto
preferred label: musikprogram på tv @sv
scope note: deprecated on 2018.10.24

tribuutit
type: Concept
created: 2005-06-17
is replaced by: Y214709
modified: 2017-09-04T13:29:52+03:00
definition: Äänite- tai nuottikokoelma, joka on valmistettu yksittäisen säveltäjän, laulajan, muun artistin tai yhtyeen kunniaksi.
in scheme: MUSA/CILLA - Musiikin asiasanasto
preferred label: tributer @sv
related: cover-versiot
scope note: deprecated on 2018.10.24

luonnonäänet
type: Concept
created: 2005-06-17
is replaced by: Y110787
modified: 2017-05-09T08:36:48+03:00
definition: Nimitys luonnossa esiintyville äänille, jotka eivät ole ihmisen välillisesti tai välittömästi tuottamia.
in scheme: MUSA/CILLA - Musiikin asiasanasto
note: Jos kyseessä ei ole puhdas luonnonäänistä koostuva julkaisu, vaan esimerkiksi musiikkia ja luonnonääniä yhdistelevä äänite, muut elementit on ilmaistava täsmällisesti, esimerkiksi luonnonäänet : soitinmusiikki : barokki, new age -musiikki : luonnonäänet : syntetisaattori.
preferred label: naturljud @sv
related: äänitehosteet
scope note: deprecated on 2018.10.24

viisisäveljärjestelmä
type: Concept
created: 2005-06-17
is replaced by: Y214723
modified: 2017-09-04T13:29:52+03:00
alternative label: pentatoninen säveljärjestelmä
broader: säveljärjestelmät
definition: Viidestä sävelestä koostuvaan asteikkoon perustuva säveljärjestelmä, joka on yleinen eurooppalaisessa kansanmusiikissa, mutta myös monissa ei-eurooppalaisissa kulttuureissa ja mm. antiikin Kreikassa. Viisisäveljärjestelmät muodostuvat joko pelkistä kokosävelaskelista (antihemitoninen) tai myös puolisävelaskelista (hemitoninen).
in scheme: MUSA/CILLA - Musiikin asiasanasto
preferred label: pentatonik @sv
scope note: deprecated on 2018.10.24

skiffle
type: Concept
created: 2005-06-17
is replaced by: Y214661
modified: 2017-09-04T13:29:52+03:00
broader: populaarimusiikki
definition: Yhdysvalloissa käyttöön otettu nimitys jazzmusiikille, jossa kokoonpanossa oli sellaisia omatekoisia soittimia, kuten pesulauta ja paperilla päällystetty kampa. Nimityksen ottivat käyttöön myös eräät Isossa-Britanniassa 1950-luvulla syntyneet yhtyeet, jotka yhdistivät musiikissaan jazzia, bluesia ja folkia.
in scheme: MUSA/CILLA - Musiikin asiasanasto
scope note: deprecated on 2018.10.24

miksaajat
type: Concept
created: 2005-06-17
is replaced by: Y214572
modified: 2017-09-05T09:58:59+03:00
broader: äänentallennus
definition: Henkilö, joka studiossa tai konsertissa rakentaa soivan lopputuloksen ääniraitoja säätelemällä. Joissakin populaarimusiikin tyylilajeissa miksaajaa pidetään luovana artistina.
in scheme: MUSA/CILLA - Musiikin asiasanasto
preferred label: mixare @sv
scope note: deprecated on 2018.10.24

MP3
type: Concept
created: 2005-06-17
is replaced by: Y112394
modified: 2017-05-09T08:36:48+03:00
broader: musiikkiteknologia
definition: Digitaalisessa muodossa olevan äänen pakkausmenetelmä, jonka avulla äänitiedoston kokoa voidaan pienentää noin kymmenesosaan alkuperäisestä.
in scheme: MUSA/CILLA - Musiikin asiasanasto
scope note: deprecated on 2018.10.24

musiikkiklubit
type: Concept
created: 2005-06-20
is replaced by: Y130179
modified: 2017-09-21T13:40:03+03:00
alternative label: jazz-klubit
alternative label: rock-klubit
definition: Elävän musiikin esittämiseen tarkoitettu ravintola tai vastaava tila.
in scheme: MUSA/CILLA - Musiikin asiasanasto
preferred label: musikklubbar @sv
scope note: deprecated on 2018.10.24

musiikkipalkinnot
type: Concept
created: 2005-06-20
is replaced by: Y128442
modified: 2017-09-21T13:40:03+03:00
definition: Muusikolle tai säveltäjälle yksittäisestä kilpailusta, elämäntyöstä tms. annettu palkinto.
in scheme: MUSA/CILLA - Musiikin asiasanasto
preferred label: musikpris @sv
scope note: deprecated on 2018.10.24

musiikkipedagogiikka
type: Concept
created: 2005-06-20
is replaced by: Y184784
modified: 2017-05-09T08:36:48+03:00
definition: Musiikin opetuskäytännöt ja -menetelmät.
in scheme: MUSA/CILLA - Musiikin asiasanasto
preferred label: musikpedagogik @sv
related: musiikkikasvatus
scope note: deprecated on 2018.10.24

musiikkiteatterit
type: Concept
created: 2005-06-20
is replaced by: Y214586
modified: 2017-09-04T13:29:53+03:00
definition: Musiikkiin perustuviin näyttämöteoksiin erikoistunut laitos.
in scheme: MUSA/CILLA - Musiikin asiasanasto
note: Termiä suositellaan käytettäväksi sekä erikoistuneista laitoksista, joiden ohjelmiston pääpaino on musiikkiteatteriteoksissa että näiden laitosten toiminnasta.
preferred label: musikteatrar @sv
related: oopperatalot
scope note: deprecated on 2018.10.24

hard rock
type: Concept
created: 2005-06-20
is replaced by: Y214475
modified: 2017-06-27T09:17:05+03:00
broader: rock
definition: Rockin tyylilaji, jossa musiikillinen aines pohjautuu rockiin ja bluesiin, mutta toteutus- ja esitystapa muistuttavat heavy rockia.
in scheme: MUSA/CILLA - Musiikin asiasanasto
scope note: deprecated on 2018.10.24

offertoriumit
type: Concept
created: 2005-06-20
is replaced by: Y214598
modified: 2017-09-04T13:29:53+03:00
broader: messut
definition: Roomalaiskatolisen messuun sisältyvä ehtoolliseen valmistautumisen aikana laulettava liturginen laulu.
in scheme: MUSA/CILLA - Musiikin asiasanasto
preferred label: offertorier @sv
scope note: deprecated on 2018.10.24

partituurinsoitto
type: Concept
created: 2005-06-20
is replaced by: Y214607
modified: 2017-09-04T13:29:53+03:00
alternative label: partituurit -- soittaminen
broader: soittaminen
definition: Moniäänisen kuoro- tai orkesteripartituurin soittaminen, yleensä pianolla.
hidden label: partituurit soittaminen
in scheme: MUSA/CILLA - Musiikin asiasanasto
preferred label: partiturspel @sv
scope note: deprecated on 2018.10.24

Peking-ooppera
type: Concept
created: 2005-06-20
is replaced by: Y200918
modified: 2017-05-09T08:36:49+03:00
definition: 1800-luvulla syntynyt kiinalainen näyttämötaiteen muoto, joka sisältää musiikin lisäksi tanssia, pantomiimia ja akrobatiaa. Yksittäinen ooppera merkitään näyttämömusiikki : Peking-ooppera : Kiina.
in scheme: MUSA/CILLA - Musiikin asiasanasto
preferred label: Peking-opera @sv
related: näyttämömusiikki
scope note: deprecated on 2018.10.24

ihailijat
type: Concept
created: 2005-06-20
is replaced by: Y111245
modified: 2017-09-04T13:29:53+03:00
alternative label: fanit
definition: Henkilö, joka suhtautuu elokuva-, iskelmä-, pop- tai muuhun vastaavaan tähteen ihaillen.
in scheme: MUSA/CILLA - Musiikin asiasanasto
narrower: groupiet
note: Musiikissa termiä on syytä aina käyttää yhdistettynä musiikilliseen termiin, esim. Presley, Elvis : ihailijat : Suomi.
preferred label: beundrare @sv
scope note: deprecated on 2018.10.24

happening
type: Concept
created: 1996-02-07
is replaced by: Y106788
modified: 2017-05-09T08:36:35+03:00
definition: 1950-luvulla lähinnä Yhdysvalloissa kehittynyt moni- ja poikkitaiteellinen ilmiö, jossa yhdistyi musiikkia, kuvataiteita, tanssia ja runoutta.
in scheme: MUSA/CILLA - Musiikin asiasanasto
note: Termiä suositellaan käytettäväksi lähinnä tähän yhdysvaltalaiseen perinteeseen liittyvistä taidetapahtumista, ei yksittäisistä sävellyksistä, ellei esityskokoonpanoa koskevista tiedoista käy ilmi teoksen monitaiteellinen luonne.
related: performanssi
scope note: deprecated on 2018.10.24

performanssi
type: Concept
created: 1996-02-08
is replaced by: Y98047
modified: 2017-05-09T08:36:35+03:00
definition: Esittävän taiteen laji, jolle on ominaista eri taiteenlajien elementtien yhdistäminen kokonaisvaltaiseksi esitykseksi.
in scheme: MUSA/CILLA - Musiikin asiasanasto
note: Jos termiä käytetään musiikkiesitysten kuvaamiseen, täsmentävät termit ovat suotavia, esimerkiksi performanssi : tanssi : elektroakustinen musiikki.
preferred label: performance @sv
related: happening
scope note: deprecated on 2018.10.24

onnittelulaulut
type: Concept
created: 2006-10-02
is replaced by: Y214601
modified: 2017-09-04T13:29:54+03:00
broader: laulut
definition: Syntymäpäivän tai vastaavan tilaisuuden yhteydessä esitettävä laulu, joka on tähän tarkoitukseen sävelletty tai sanoitettu
definition: För födelsedagar eller motsvarande ändamål skriven sång @sv
in scheme: MUSA/CILLA - Musiikin asiasanasto
preferred label: gratulationssånger @sv
scope note: deprecated on 2018.10.24

soitinrakentajat
type: Concept
created: 2006-10-02
is replaced by: Y111658
modified: 2017-09-21T13:24:23+03:00
definition: Soittimia ammattimaisesti rakentavan henkilön ammattinimike.
definition: Yrkesbeteckning för person som bygger instrument yrkesmässigt @sv
in scheme: MUSA/CILLA - Musiikin asiasanasto
preferred label: instrumentbyggare @sv
scope note: deprecated on 2018.10.24

Harlem-jazz
type: Concept
created: 1996-02-07
is replaced by: Y214477
modified: 2017-06-27T09:46:16+03:00
broader: traditionaalinen jazz
definition: New Yorkissa 1920-luvulla kehittynyt traditionaalisen jazzin suuntaus.
in scheme: MUSA/CILLA - Musiikin asiasanasto
scope note: deprecated on 2018.10.24

romanssit
type: Concept
created: 1996-02-08
is replaced by: Y209018
modified: 2017-09-04T13:29:17+03:00
broader: sävellykset
definition: Laulu tai soitinmusiikkisävellys, jonka säveltäjä on nimennyt romanssiksi. Termillä ei ole mitään yksiselitteistä tyylillistä tai historiallista määritelmää.
in scheme: MUSA/CILLA - Musiikin asiasanasto
preferred label: romanser @sv
scope note: deprecated on 2018.10.24

havaijinkitara
type: Concept
created: 1996-02-07
is replaced by: Y214480
modified: 2017-09-04T13:29:28+03:00
broader: kitara
definition: Havaijilla 1880-luvulla syntynyt kitaran soittotyyli (sylissä, metallitangolla tai putkella kielillä liu'uttaen), jonka seurauksena alettiin valmistaa erityisesti tähän tarkoitukseen soveltuvia kitaroita.
in scheme: MUSA/CILLA - Musiikin asiasanasto
preferred label: hawaiigitarr @sv
scope note: deprecated on 2018.10.24

didgerido
type: Concept
created: 2007-07-30
is replaced by: Y214446
modified: 2017-09-04T13:29:54+03:00
alternative label: didgeridoo
alternative label: didgeridu
alternative label: didjeridoo
alternative label: didjeridu
alternative label: dijjariduu
broader: puhallinsoittimet
definition: Australian alkuperäisväestön perinteinen, puusta valmistettu pitkä trumpettisoitin.
in scheme: MUSA/CILLA - Musiikin asiasanasto
scope note: deprecated on 2018.10.24

historia
type: Concept
created: 1996-02-07
is replaced by: Y95390
modified: 2016-03-29T15:48:00+03:00
in scheme: MUSA/CILLA - Musiikin asiasanasto
narrower: musiikinhistoria
scope note: deprecated on 2018.10.24

kansanlaulajat
type: Concept
created: 2008-01-03
is replaced by: Y205558
modified: 2017-05-09T08:36:49+03:00
alternative label: kansanmuusikot
alternative label: laulajat -- kansanmusiikki
broader: laulajat
definition: Kouluttamaton, yhteisössään arvostettu laulujen esittäjä
hidden label: laulajat kansanmusiikki
in scheme: MUSA/CILLA - Musiikin asiasanasto
preferred label: folksångare @sv
scope note: deprecated on 2018.10.24

humoreskit
type: Concept
created: 1996-02-07
is replaced by: Y214500
modified: 2017-09-04T13:29:28+03:00
broader: sävellykset
definition: 1800-syntynyt erityisesti pianomusiikin sävellystyyppi, joka muistuttaa scherzoa, mutta on tätä melodisempi ja vähemmän groteski.
in scheme: MUSA/CILLA - Musiikin asiasanasto
preferred label: humoresker @sv
scope note: deprecated on 2018.10.24

beatboxing
type: Concept
created: 2008-12-01
is replaced by: Y214414
modified: 2017-09-04T13:29:55+03:00
alternative label: biitboksaus
broader: laulaminen
definition: Erityisesti hip hop -musiikissa käytetty esittämistapa, jossa suulla matkitaan eri soittimien ääntä.
in scheme: MUSA/CILLA - Musiikin asiasanasto
scope note: deprecated on 2018.10.24

hymnit
type: Concept
created: 1996-02-07
is replaced by: Y101727
modified: 2017-09-21T13:24:21+03:00
definition: (1) Roomalaiskatolisessa liturgiassa yksinkertainen säkeistölaulu ja (2) tekstiltään hengellinen tai muuten juhlallinen sävelmä. Englannin kielessä sana "hymn" tarkoittaa virttä tai koraalia.
in scheme: MUSA/CILLA - Musiikin asiasanasto
note: Termiä suositellaan käytettäväksi ensimmäisessä merkityksessään aina yhdistettynä termiin liturginen musiikki, toisessa merkityksessään esityskokoonpanoon. Termiä ei käytetä kansallishymneistä, joita kuvaava asiasanatermi on oikeassa muodossaan kansallislaulut.
preferred label: hymner @sv
scope note: deprecated on 2018.10.24

virsilaulu
type: Concept
created: 1996-02-15
is replaced by: Y100283
modified: 2017-05-09T08:36:35+03:00
alternative label: veisuu
definition: Nimitys kristillisten kirkkojen piirissä harjoitetulle virsien laulamiselle.
in scheme: MUSA/CILLA - Musiikin asiasanasto
note: Termiä suositellaan käytettäväksi lähinnä musiikkikirjallisuuden indeksoinnissa.
preferred label: psalmsång @sv
related: hymnologia
scope note: deprecated on 2018.10.24

näytelmämusiikki
type: Concept
created: 1996-02-07
is replaced by: Y179899
modified: 2017-05-09T08:36:35+03:00
alternative label: skådespel -- musik @sv
alternative label: skådespelsmusik @sv
broader: näyttämömusiikki
definition: Musiikki, joka on sävelletty esitettäväksi tietyn näytelmän yhteydessä.
hidden label: skådespel musik @sv
in scheme: MUSA/CILLA - Musiikin asiasanasto
note: Jos kyseessä on musiikki, jota vain on käytetty näytelmässä ilman että sävellys on siihen tarkoitettu, käytetään yhdistelmää näytelmät : musiikki.
preferred label: teatermusik @sv
scope note: deprecated on 2018.10.24

pantomiimit
type: Concept
created: 1996-02-08
is replaced by: Y103524
modified: 2017-05-09T08:36:35+03:00
broader: näytelmät
definition: Sanattoman, plastiseen liikuntaan ja ilmeisiin perustuvan näyttämöilmaisun nimitys.
in scheme: MUSA/CILLA - Musiikin asiasanasto
note: Kun tarkoitetaan pantomiimin taustalle sävellettyä musiikkia, käytetään aina täsmentävää termiä, esimerkiksi pantomiimit : kamariorkesterit : Italia : 1770-luku. Tanssitaiteeseen liittyvästä balettipantomiimista käytetään ilmaisua baletit : pantomiimit.
preferred label: pantomimer @sv
scope note: deprecated on 2018.10.24

oopperajuhlat
type: Concept
created: 1996-02-07
is replaced by: Y103602
modified: 2017-05-09T08:36:36+03:00
broader: musiikkijuhlat
definition: Oopperamusiikkiin keskittyneiden musiikkijuhlien nimitys.
in scheme: MUSA/CILLA - Musiikin asiasanasto
preferred label: operafestspel @sv
scope note: deprecated on 2018.10.24

opetus
type: Concept
created: 1996-02-07
is replaced by: Y97807
modified: 2016-03-29T15:24:56+03:00
in scheme: MUSA/CILLA - Musiikin asiasanasto
preferred label: undervisning @sv
related: opetusmenetelmät
scope note: deprecated on 2018.10.24

orkesteriharjoitukset
type: Concept
created: 1997-09-30
is replaced by: Y214476
modified: 2017-09-04T13:29:29+03:00
broader: harjoitusaineistot
definition: Orkesterille sävelletyistä teoksista koostettua harjoitteluaineistoa, joka voi esiintyä nuottina, videona tai "music-minus-one" -tyyppisenä äänitteenä. Orkesteriharjoitukset ovat eri soittimille tarkoitettuja orkesterimusiikkiteosten katkelmia ja soolo-osuuksia yksittäisinä ääninä. Tunnettuja orkesteriharjoitusjulkaisuja ovat Orchesterstudien, Orchester Probe-Spiele ja Orchestral excerpts.
in scheme: MUSA/CILLA - Musiikin asiasanasto
preferred label: orkesterövningar @sv
scope note: deprecated on 2018.10.24

äänenkuljetus
type: Concept
created: 2011-04-05
is replaced by: Y214739
modified: 2017-07-10T09:37:59+03:00
broader: sävellysoppi
definition: Länsimaisessa taidemusiikissa käytössä oleva moniäänisen kudoksen sävellystapa, jonka normisto vaihtelee aika- ja tyylikausien estetiikan mukaisesti.
in scheme: MUSA/CILLA - Musiikin asiasanasto
preferred label: stämföring @sv
scope note: deprecated on 2018.10.24

third stream -jazz
type: Concept
created: 1996-02-09
is replaced by: Y214699
modified: 2017-09-04T13:29:29+03:00
alternative label: kamarijazz
alternative label: kammarjazz @sv
broader: jazz
definition: Jazz-tyyli, jossa on toisena aineksena länsimainen taidemusiikki.
in scheme: MUSA/CILLA - Musiikin asiasanasto
note: Jos indeksoinnin kohteena on musiikki, jossa jazzin osuus ei ole hallitseva, käytetään ilmaisua taidemusiikki : jazz.
preferred label: third stream jazz @sv
scope note: deprecated on 2018.10.24

barkarolit
type: Concept
created: 2012-02-28
is replaced by: Y214409
modified: 2017-09-04T13:29:56+03:00
alternative label: barcarolat
alternative label: barcarolet
alternative label: barcarollet
alternative label: venelaulut
broader: sävellykset
definition: Venetsian gondoleerien perinteisistä lauluista käytetty nimitys, jolla taidemusiikissa tarkoitetaan "venelauluksi" kutsuttua soitin- tai laulusävellystyyppiä.
in scheme: MUSA/CILLA - Musiikin asiasanasto
preferred label: barkaroller @sv
scope note: deprecated on 2018.10.24

gallikaaninen laulu
type: Concept
created: 2012-02-28
is replaced by: Y214466
modified: 2017-09-04T13:29:56+03:00
broader: latinalainen kirkkolaulu
definition: Gallikaanisessa liturgiassa käytetty latinankielinen monofoninen kirkkolaulu, jonka 800-luvulla syrjäytti gregoriaaninen laulu.
in scheme: MUSA/CILLA - Musiikin asiasanasto
preferred label: gallikansk sång @sv
scope note: deprecated on 2018.10.24

populaarikulttuuri
type: Concept
created: 1996-02-08
is replaced by: Y98197
modified: 2017-09-04T13:29:38+03:00
in scheme: MUSA/CILLA - Musiikin asiasanasto
preferred label: populärkultur @sv
related: populaarimusiikki
scope note: deprecated on 2018.10.24

ritornellot
type: Concept
created: 2013-04-19
is replaced by: Y214628
modified: 2017-09-04T13:29:57+03:00
alternative label: ritornellit
alternative label: välisoitot
broader: sävellykset
definition: Barokin vokaaliteoksissa esiintyvä toistuva alku-, väli- tai loppusoitto.
in scheme: MUSA/CILLA - Musiikin asiasanasto
preferred label: ritorneller @sv
scope note: deprecated on 2018.10.24

Latin rock
type: Concept
created: 1996-02-08
is replaced by: Y214541
modified: 2017-07-13T08:31:45+03:00
broader: rock
definition: 1960-luvulla Yhdysvalloissa kehittynyt rock-musiikin tyyli, johon on otettu vaikutteita latinalaisamerikkalaisesta tanssimusiikista. Tunnettu tyylin edustaja on Santana.
in scheme: MUSA/CILLA - Musiikin asiasanasto
preferred label: latin rock @sv
scope note: deprecated on 2018.10.24

psykedeelinen rock
type: Concept
created: 1996-02-08
is replaced by: Y214618
modified: 2017-09-04T13:29:30+03:00
alternative label: psykedeelinen musiikki
alternative label: psykedelisk musik @sv
broader: rock
definition: Rockin laji, joka kukoisti 1960-luvun lopulta 1970-luvun puoleenväliin. Psykedeeliseen rockiin liittyivät tavallisesti pyrkimykset tietoisuuden tai mielen avartamiseen mm. sointivärikokeiluilla, huumausaineilla (erityisesti LSD) ja itämaisilla uskonnoilla. Psykedeelisellä rockilla oli myös selvät yhteydet sekä folk- että hippiliikkeeseen. Termiä voidaan käyttää myös tyylinmukaisesti myöhemmin tehdyn musiikin yhteydessä.
in scheme: MUSA/CILLA - Musiikin asiasanasto
preferred label: psykedelisk rock @sv
scope note: deprecated on 2018.10.24

graduaalit
type: Concept
created: 2014-12-09
is replaced by: Y214467
modified: 2017-09-04T13:29:57+03:00
broader: kirkkomusiikki
definition: Katolisen messun osa, ehtoollispalveluun liittyvä laulu tai hymni.
in scheme: MUSA/CILLA - Musiikin asiasanasto
note: Termiä käytetään vain sellaisista liturgisista teoksista, jotka on nimetty graduaaleiksi.
preferred label: gradualer @sv
scope note: deprecated on 2018.10.24

katumusiikki
type: Concept
created: 1996-02-08
is replaced by: Y107424
modified: 2017-09-21T13:39:57+03:00
definition: Julkisilla paikoilla, esimerkiksi kadulla, esitettävä musiikki.
in scheme: MUSA/CILLA - Musiikin asiasanasto
preferred label: gatumusik @sv
scope note: deprecated on 2018.10.24

taustamusiikki
type: Concept
created: 1996-02-09
is replaced by: Y103624
modified: 2017-09-21T13:39:58+03:00
alternative label: muzak
alternative label: tuotantomusiikki
definition: Liikekeskuksissa, työpaikoilla, lentokentillä yms. julkisissa tiloissa soitettava musiikki, jonka tarkoituksena on usein edistää haluttua mielialaa tai tunnelmaa (esim. ostohalukkuus, tarmokkuus työssä, rauhallisuus tms.). Taustamusiikki on yleensä staattista, toisteista ja tasaisen harmonista, joten siihen ei kiinnitetä tietoista huomiota.
in scheme: MUSA/CILLA - Musiikin asiasanasto
note: Termiä käytetään vain tässä merkityksessä. Arkikielessä yleistä termiä "muzak" ei käytetä, koska se on tavaramerkillä suojattu kaupallinen termi.
preferred label: bakgrundsmusik @sv
scope note: deprecated on 2018.10.24

voimistelumusiikki
type: Concept
created: 1996-02-15
is replaced by: Y100301
modified: 2017-05-09T08:36:37+03:00
definition: Nimitys musiikille, joka on sävelletty tai sovitettu käytettäväksi voimistelua rytmittävänä säestyksenä.
in scheme: MUSA/CILLA - Musiikin asiasanasto
preferred label: gymnastikmusik @sv
related: musiikkiliikunta
scope note: deprecated on 2018.10.24

intonaatio
type: Concept
created: 1996-02-08
is replaced by: Y505981
modified: 2017-05-09T08:36:37+03:00
broader: tulkinta
definition: (1) Sävelpuhtaus, (2) intervallin matemaattinen puhtaus, (3) pianon tai urkujen soinnillisten ominaisuuksien säätäminen ja (4) katolisessa liturgiassa kanttorin laulama sävellyksen alku.
in scheme: MUSA/CILLA - Musiikin asiasanasto
note: Termin tarkoitus on aina ilmaistava täsmentävällä asiasanalla, esimerkiksi intonaatio : säveljärjestelmät, intonaatio : piano : viritys.
preferred label: intonation @sv
scope note: deprecated on 2018.10.24

luonnontorvet
type: Concept
created: 1996-02-08
is replaced by: Y214546
modified: 2017-09-04T13:29:30+03:00
broader: puhallinsoittimet
definition: Sormiaukoton puhallinsoitin, jolla voidaan soittaa vain ns. luonnonsäveliä (yläsävelsarjaa).
in scheme: MUSA/CILLA - Musiikin asiasanasto
preferred label: naturhorn @sv
scope note: deprecated on 2018.10.24

melodika
type: Concept
created: 1996-02-09
is replaced by: Y214561
modified: 2017-09-04T13:29:31+03:00
broader: puhallinsoittimet
definition: Koskettimistolla soitettava, päästäpuhallettava huuliharppusoitin.
in scheme: MUSA/CILLA - Musiikin asiasanasto
scope note: deprecated on 2018.10.24

mezzosopraano
type: Concept
created: 1996-02-09
is replaced by: Y214569
modified: 2017-09-04T13:29:31+03:00
broader: äänialat
definition: Sopraanon ja alton väliin sijoittuva naisääni (a-f#'' tai laajempi).
in scheme: MUSA/CILLA - Musiikin asiasanasto
note: Termiä käytetään vain laulumusiikin äänialan ilmaisemiseksi.
preferred label: mezzosopran @sv
scope note: deprecated on 2018.10.24

sopraano
type: Concept
created: 1996-02-08
is replaced by: Y214672
modified: 2017-09-04T13:29:31+03:00
broader: äänialat
definition: Laulumusiikissa korkean naisäänen äänialamerkintä (c'-a'' tai laajempi). Termiä ei käytetä ilmaisemaan erilaisia sopraanoäänisiä soittimia tai yleensä soittimen äänialan korkeutta.
in scheme: MUSA/CILLA - Musiikin asiasanasto
preferred label: sopran @sv
scope note: deprecated on 2018.10.24

tenori
type: Concept
created: 1996-02-09
is replaced by: Y214695
modified: 2017-09-04T13:29:31+03:00
broader: äänialat
definition: Laulumusiikissa korkean miesäänen äänialamerkintä. Termiä ei käytetä ilmaisemaan erilaisia tenoriäänisiä soittimia tai yleensä soittimen äänialan korkeutta.
in scheme: MUSA/CILLA - Musiikin asiasanasto
preferred label: tenor @sv
scope note: deprecated on 2018.10.24

kansansoittajat
type: Concept
created: 1996-02-08
is replaced by: Y95874
modified: 2017-05-09T08:36:38+03:00
alternative label: kansanmuusikot
alternative label: pelimannit
alternative label: perinnemuusikot
alternative label: musikanter @sv
broader: muusikot
definition: Muusikko, jonka ohjelmisto koostuu kokonaan tai pääosin kansanmusiikista.
in scheme: MUSA/CILLA - Musiikin asiasanasto
note: Termiä voi käyttää kaikista kansanmusiikkia soittavista muusikoista. Termiin on syytä liittää soitinta ja maantieteellistä yhteyttä selventäviä täsmenteitä, esimerkiksi kansansoittajat : tuohihuilu : Suomi. Termiä "pelimannit" ei Musiikin asiasanastossa ole, mutta tietyntyyppisestä kansansoittajien esittämästä musiikista käytetään termiä pelimannimusiikki.
preferred label: spelmän @sv
scope note: deprecated on 2018.10.24

virtuoosit
type: Concept
created: 1996-02-15
is replaced by: Y140891
modified: 2017-05-09T08:36:38+03:00
broader: muusikot
definition: Muusikoita, joiden laulu- tai soittotekniikka on poikkeuksellisen taiturillinen.
in scheme: MUSA/CILLA - Musiikin asiasanasto
note: Koska ilmaisu on aina suhteellinen, sitä käytetään vain sellaisten muusikoiden yhteydessä, jotka on hakuteoksissa virtuooseiksi nimetty, esimerkiksi Paganini ja Liszt.
preferred label: virtuoser @sv
scope note: deprecated on 2018.10.24

magnificatit
type: Concept
created: 1996-02-09
is replaced by: Y214551
modified: 2017-09-05T09:36:56+03:00
broader: kirkkomusiikki
definition: Roomalaiskatoliseen liturgiaan kuuluva Marian kiitosvirsi, joka on otettu käyttöön myös protestanttisissa kirkoissa.
in scheme: MUSA/CILLA - Musiikin asiasanasto
preferred label: magnificat @sv
scope note: deprecated on 2018.10.24

vesperit
type: Concept
created: 1996-02-15
is replaced by: Y100202
modified: 2017-05-09T08:36:38+03:00
broader: kirkkomusiikki
definition: Iltajumalanpalvelukseen sävelletty tämänniminen teos.
in scheme: MUSA/CILLA - Musiikin asiasanasto
preferred label: vesprar @sv
scope note: deprecated on 2018.10.24

vigiliat
type: Concept
created: 1996-02-15
is replaced by: Y102533
modified: 2017-05-09T08:36:38+03:00
broader: kirkkomusiikki
definition: Katolisten kirkkojen yöjumalanpalvelus ja siinä käytettävä musiikki.
in scheme: MUSA/CILLA - Musiikin asiasanasto
note: Termiin on syytä liittää täsmennys, jotta tiedetään, minkä kirkkokunnan vigiliasta on kysymys, esimerkiksi vigiliat : ortodoksinen kirkkomusiikki : Venäjä.
preferred label: vigilior @sv
scope note: deprecated on 2018.10.24

renessanssi
type: Concept
created: 1996-02-08
is replaced by: Y98568
modified: 2017-05-09T08:36:38+03:00
broader: tyylikaudet
definition: Eurooppalainen tyyli- ja aikakausimääre, jolla tarkoitetaan keskiajan ja barokin välistä aikaa ja tuona aikana vallinnutta antiikin Kreikan ja Rooman jäljittelyyn tähdännyttä tyyliä.
in scheme: MUSA/CILLA - Musiikin asiasanasto
note: Hakuteoksissa annetaan musiikin renessanssin aikakaudelle hyvin vaihtelevia aikamääreitä. Yleisten kirjastojen luokitusjärjestelmässä on sovellettu aikaa noin vuodesta 1400 noin vuoteen 1600. Muiden tyylikausitermien tavoin käsitettä renessanssi täytyy aina käyttää selventävien asiasanojen kanssa, esimerkiksi kirkkomusiikki : renessanssi : kokoelmat : alankomaiset koulukunnat, renessanssi : soitinmusiikki : Italia.
preferred label: renässansen @sv
scope note: deprecated on 2018.10.24

inkamusiikki
type: Concept
created: 1996-02-08
is replaced by: Y214504
modified: 2017-09-04T13:29:31+03:00
broader: perinnemusiikki
definition: Etelä-Amerikan intiaanien ja espanjalaisten perinnemusiikkien sulautumana syntynyt musiikin laji etupäässä Andien alueella. Inkamusiikille tyypillisiä soittimia ovat erilaiset panhuilut, kitarat ja harput. Inkamusiikki on tyylillisesti usein populaari- ja perinnemusiikin sekoitusta.
in scheme: MUSA/CILLA - Musiikin asiasanasto
note: Termiä suositellaan käytettäväksi aina, kun kyseessä ei ole selkeästi intiaanien oma perinnemusiikki, jota esiintyy samoilla alueilla kuin inkamusiikkiakin.
preferred label: inkamusik @sv
scope note: deprecated on 2018.10.24

klezmer-musiikki
type: Concept
created: 1996-02-08
is replaced by: Y214524
modified: 2017-09-04T13:29:31+03:00
alternative label: klezmer
broader: perinnemusiikki
definition: Itä-Euroopan ja Yhdysvaltain juutalaisten perinteinen ja populaari soitinmusiikki (joskus harvemmin myös laulumusiikkia), jota esittävät yleensä tähän musiikinlajiin erikoistuneet yhtyeet.
in scheme: MUSA/CILLA - Musiikin asiasanasto
note: Termi on tyylilajin nimi, eikä sitä pidä käyttää juutalaisen perinnemusiikin synonyyminä.
preferred label: klezmermusik @sv
scope note: deprecated on 2018.10.24

qawwali
type: Concept
created: 1996-02-08
is replaced by: Y214620
modified: 2017-06-28T09:17:53+03:00
broader: perinnemusiikki
definition: Pakistanissa kehittynyt, laulettu, nykyisin popularisoitunut maailmanmusiikkityyli, jolla on vahvat siteet sufi-mystisismiin.
in scheme: MUSA/CILLA - Musiikin asiasanasto
scope note: deprecated on 2018.10.24

musiikkiarvostelut
type: Concept
created: 1996-02-09
is replaced by: Y100839
modified: 2017-07-12T11:31:42+03:00
alternative label: konserttiarvostelut
alternative label: levyarvostelut
alternative label: musiikkikritiikit
alternative label: musikkritik @sv
broader: arvostelut
definition: Arvostelijan työn tuloksena syntynyt musiikkiteoksen tai -esityksen julkinen arviointi.
in scheme: MUSA/CILLA - Musiikin asiasanasto
note: Termiä käytetään vain konkreettisista arvostelun tuloksista kuten lehtiartikkeleista tai radio-ohjelmista. Jos indeksoidaan toimintaa sinänsä, käytetään termiä musiikkikritiikki.
preferred label: musikrecensioner @sv
scope note: deprecated on 2018.10.24

kampiliira
type: Concept
created: 1996-02-08
is replaced by: Y214518
modified: 2017-09-04T13:29:31+03:00
broader: soittimet
definition: Eurooppalainen jousisoitin, jossa ääni syntyy pyörittämällä puista kiekkoa kieliä vasten. Kielten äänenkorkeutta vaihdellaan koskettimistolla. Termiä "lira" käytetään usein sekä kampiliirasta että Balkanin alueella tunnetusta jousisoittimesta.
in scheme: MUSA/CILLA - Musiikin asiasanasto
preferred label: vevlira @sv
scope note: deprecated on 2018.10.24

tuohisoittimet
type: Concept
created: 1996-02-09
is replaced by: Y214711
modified: 2017-09-04T13:29:31+03:00
broader: soittimet
definition: Tuohesta valmistetut soittimet.
in scheme: MUSA/CILLA - Musiikin asiasanasto
preferred label: näverinstrument @sv
scope note: deprecated on 2018.10.24

isonuottiset nuottijulkaisut
type: Concept
created: 2016-10-26
is replaced by: Y214509
modified: 2017-09-04T13:29:58+03:00
alternative label: isonuottiset
alternative label: isonuottiset nuotit
alternative label: musikalier med förstorad notskrift @sv
broader: nuottijulkaisut
definition: Tavallista isokokoisempaa nuottikirjoitusta sisältävät nuottijulkaisut, joissa musiikki on yleensä helpotettuina sovituksina erityisesti soitonopetuksen tarpeisiin.
in scheme: MUSA/CILLA - Musiikin asiasanasto
preferred label: musikalier med stor notskrift @sv
scope note: deprecated on 2018.10.24

mbira
type: Concept
created: 1996-02-09
is replaced by: Y214558
modified: 2017-09-04T13:29:31+03:00
alternative label: sormipiano
alternative label: fingerpiano @sv
broader: näppäilysoittimet
definition: Afrikkalainen sormipiano.
in scheme: MUSA/CILLA - Musiikin asiasanasto
scope note: deprecated on 2018.10.24

sitar
type: Concept
created: 1996-02-08
is replaced by: Y214659
modified: 2017-09-04T13:29:32+03:00
broader: näppäilysoittimet
definition: Intialainen pitkäkaulainen luuttusoitin, klassisen musiikin keskeinen soolosoitin.
in scheme: MUSA/CILLA - Musiikin asiasanasto
scope note: deprecated on 2018.10.24

libretistit
type: Concept
created: 1996-02-08
is replaced by: Y195124
modified: 2017-05-09T08:36:38+03:00
definition: Sanoittaja, joka on laatinut tekstin oopperaan, operettiin, musikaaliin tai muuhun näyttämömusiikkiteokseen.
in scheme: MUSA/CILLA - Musiikin asiasanasto
note: Termiä on syytä käyttää vain sellaisten henkilöiden yhteydessä, jotka tunnetaan ja mainitaan hakuteoksissa ensisijaisesti librettojen laatijoina.
preferred label: librettister @sv
related: näyttämömusiikki
scope note: deprecated on 2018.10.24

melodraamat
type: Concept
created: 1996-02-09
is replaced by: Y219097
is replaced by: Y219098
modified: 2017-05-09T08:36:38+03:00
broader: näyttämömusiikki
definition: Lausutun draamatekstin ja sitä säestävän musiikin yhdistelmä taidemuotona.
in scheme: MUSA/CILLA - Musiikin asiasanasto
note: Termiä käytetään vain sellaisista teoksista, jotka on sävelletty lausujalle tai lukijalle ja säestykselle.
preferred label: melodramer @sv
scope note: deprecated on 2018.10.24

sekvensseri (tietokoneohjelmat)
type: Concept
created: 2017-07-11
is replaced by: Y214802
modified: 2017-07-18T11:55:14+03:00
definition: Syntetisaattoria simuloiva tietokoneohjelma.
in scheme: MUSA/CILLA - Musiikin asiasanasto
scope note: deprecated on 2018.10.24

foxtrot (tanssit)
type: Concept
created: 1998-07-07
is replaced by: Y216945
modified: 2017-07-12T15:00:20+03:00
alternative label: foksi (tanssit)
broader: tanssit
definition: 1910-luvulla kehitetty seuratanssi, josta ovat kehittyneet nopeampi quickstep ja hitaampi slowfox.
in scheme: MUSA/CILLA - Musiikin asiasanasto
preferred label: foxtrot @sv
scope note: deprecated on 2018.10.24

rytmidiktaatti
type: Concept
created: 2017-07-12
is replaced by: Y214757
modified: 2017-09-04T13:30:06+03:00
alternative label: rytmisanelu
broader: diktaatti
definition: Säveltapailussa käytetty opetusmenetelmä ja -aineisto.
in scheme: MUSA/CILLA - Musiikin asiasanasto
scope note: deprecated on 2018.10.24

musetteharmonikka
type: Concept
created: 1996-02-09
is replaced by: Y214580
modified: 2017-05-28T15:59:31+03:00
broader: harmonikka
definition: Ranskalainen harmonikka, jossa äänikerrat on viritetty keskenään epävireeseen huojuvan äänen aikaansaamiseksi.
in scheme: MUSA/CILLA - Musiikin asiasanasto
preferred label: musettdragspel @sv
scope note: deprecated on 2018.10.24

poloneesi (tanssit)
type: Concept
created: 1996-02-08
is replaced by: Y216504
modified: 2017-07-12T15:19:59+03:00
broader: tanssit
definition: Puolalaista alkuperää oleva hidas, juhlallinen tanssi.
in scheme: MUSA/CILLA - Musiikin asiasanasto
scope note: deprecated on 2018.10.24

purpurit
type: Concept
created: 1996-02-08
is replaced by: Y104056
modified: 2017-05-09T08:36:38+03:00
alternative label: purppurit
alternative label: purppuri @sv
broader: kansantanssit
definition: Useista tansseista koostuva kokonaisuus, jota on tanssittu Suomessa 1800-luvun alusta lähtien. Purpuri on pääosin länsisuomalainen tapa.
in scheme: MUSA/CILLA - Musiikin asiasanasto
note: Termiä on aina syytä käyttää ainakin maantieteellisen täsmenteen kera, esimerkiksi purpurit : kansanmusiikki : Kaustinen.
preferred label: purpuri @sv
scope note: deprecated on 2018.10.24

joikaaminen
type: Concept
created: 1996-02-08
is replaced by: Y214511
modified: 2017-09-04T13:29:32+03:00
alternative label: joikaus
broader: laulaminen
in scheme: MUSA/CILLA - Musiikin asiasanasto
note: Joikaamalla esitettävästä musiikista käytetään termiä joiut.
preferred label: jojkning @sv
scope note: deprecated on 2018.10.24

scatlaulu
type: Concept
created: 1996-02-08
is replaced by: Y214647
modified: 2017-09-04T13:29:32+03:00
alternative label: jazzlaulu
alternative label: jazzsång @sv
broader: laulaminen
definition: Jazzissa käytetty laulutekniikka, jossa imitoidaan ihmisäänellä soittimien ääntä ja äänenmuodostusta.
in scheme: MUSA/CILLA - Musiikin asiasanasto
preferred label: scatsång @sv
scope note: deprecated on 2018.10.24

äänenmuodostus
type: Concept
created: 1996-02-15
is replaced by: Y103037
modified: 2017-05-09T08:36:39+03:00
definition: (1) Ihmisäänen tuottaminen ääntöelimistön avulla ja (2) puhe- ja lauluäänen kehittäminen.
in scheme: MUSA/CILLA - Musiikin asiasanasto
preferred label: tonbildning @sv
related: laulaminen
scope note: deprecated on 2018.10.24

vallenata
type: Concept
created: 1996-02-09
is replaced by: Y214715
modified: 2017-09-04T13:29:32+03:00
broader: latinalaisamerikkalainen populaarimusiikki
definition: Kolumbian pohjoisrannikolla perinnemusiikista kehittynyt populaarimusiikin muoto, josta puhutaan usein sen perusrytmien mukaisilla käsitteillä son, paseo, merengue ja puya.
in scheme: MUSA/CILLA - Musiikin asiasanasto
scope note: deprecated on 2018.10.24

triangeli
type: Concept
created: 1996-02-09
is replaced by: Y214708
modified: 2017-09-04T13:29:33+03:00
broader: lyömäsoittimet
definition: Metallinen lyömäsoitin (taivutettu metallitanko), joka on eri nimillä käytössä monissa musiikkikulttuureissa.
in scheme: MUSA/CILLA - Musiikin asiasanasto
preferred label: triangel @sv
scope note: deprecated on 2018.10.24

rekilaulut
type: Concept
created: 1996-02-08
is replaced by: Y191922
modified: 2017-05-09T08:36:50+03:00
alternative label: finska enstrofingar @sv
broader: kansanlaulut
definition: 1800-luvulla yleistynyt suomalainen, alkuaan yksisäkeistöinen, kahdesta keskenään loppusoinnullisesta säeparista muodostunut lyyrissävyinen kansanlaulu. Ensimmäinen säepari sisältää tavallisesti yleisluontoisen mieleen johdatuksen, yleensä luontoaiheisen, johon jälkisäepari liittää laulajan omakohtaisen kokemuksen.
definition: Ingen etablerad term på svenska @sv
in scheme: MUSA/CILLA - Musiikin asiasanasto
scope note: deprecated on 2018.10.24

tertsetit
type: Concept
created: 1996-02-09
is replaced by: Y214697
modified: 2017-09-04T13:29:33+03:00
alternative label: tersetter -- ensembler @sv
broader: lauluyhtyeet
definition: Kolmen lauluäänen muodostama kokoonpano.
hidden label: tersetter ensembler @sv
in scheme: MUSA/CILLA - Musiikin asiasanasto
note: Kolmelle lauluäänelle sävelletyistä tai sovitetuista teoksista käytetään termiä tertsetot. Kolmelle soittimelle sävelletyistä tai sovitetuista teoksista käytetään termiä triot (sävellykset).
preferred label: tersetter (ensembler) @sv
scope note: deprecated on 2018.10.24

impressionismi
type: Concept
created: 1996-02-08
is replaced by: Y101829
modified: 2017-05-09T08:36:40+03:00
broader: tyylit
definition: Maalaustaiteesta nimensä lainannut taidemusiikin tyylisuuntaus, jonka tunnetuin edustaja oli Claude Debussy.
in scheme: MUSA/CILLA - Musiikin asiasanasto
note: Termiä käytetään musiikissa aina yhdistettynä täsmentäviin ilmaisuihin, esimerkiksi impressionismi : orkesterimusiikki : Ranska : 1910-luku.
preferred label: impressionism @sv
scope note: deprecated on 2018.10.24

modernismi
type: Concept
created: 1996-02-09
is replaced by: Y97481
modified: 2017-05-09T08:36:40+03:00
broader: tyylit
definition: Oman aikansa vallitsevista periaatteista irtautuneiden tyylisuuntauksien nimitys.
in scheme: MUSA/CILLA - Musiikin asiasanasto
note: Termiä suositellaan käytettäväksi lähinnä 1900-luvun ja sitä myöhempien aikojen ilmiöistä ja tyyleistä, esimerkiksi modernismi : taidemusiikki : Suomi : 1920-luku.
preferred label: modernism @sv
scope note: deprecated on 2018.10.24

kollaasit
type: Concept
created: 1996-02-08
is replaced by: Y96283
modified: 2017-05-09T08:36:40+03:00
definition: Kuvataiteista lainattu termi, jolla musiikissa tarkoitetaan musiikillisista sitaateista koostuvia sävellyksiä.
in scheme: MUSA/CILLA - Musiikin asiasanasto
note: Musiikillinen siteeraaminen on yleistä myös muissa kuin varsinaisissa kollaasisävellyksissä. Termiä on syytä käyttää vain varsinaisten kollaasien yhteydessä.
preferred label: collage @sv
related: radiofonia
scope note: deprecated on 2018.10.24

musiikkivideot
type: Concept
created: 1996-02-09
is replaced by: Y106779
modified: 2017-05-09T08:36:40+03:00
definition: Pääosin pop- ja rock-musiikin promootiotarkoituksiin tehtyjen audiovisuaalisten teosten nimitys.
in scheme: MUSA/CILLA - Musiikin asiasanasto
note: Jos kyseessä on videolle tallennettu konsertti tai muu suora esityksen taltiointi, suositellaan käytettäväksi soveltaen YSA:n termiä kuvatallenteet, esimerkiksi rock : konsertit : kuvatallenteet : Suomi : 1980-luku.
preferred label: musikvideor @sv
related: videomusiikki
scope note: deprecated on 2018.10.24

kastraattilaulajat
type: Concept
created: 1996-02-08
is replaced by: Y214519
modified: 2017-09-04T13:29:33+03:00
broader: laulajat
definition: Miespuolinen laulaja, jonka äänenmurros on estetty lapsena tehdyllä kastrointileikkauksella.
in scheme: MUSA/CILLA - Musiikin asiasanasto
preferred label: kastratsångare @sv
scope note: deprecated on 2018.10.24

musiikkifilosofia
type: Concept
created: 1996-02-09
is replaced by: Y105892
modified: 2017-05-09T08:36:40+03:00
alternative label: musiikin filosofia
broader: musiikintutkimus
definition: Musiikkia filosofian menetelmin ja näkökulmasta tutkiva tieteenala.
in scheme: MUSA/CILLA - Musiikin asiasanasto
preferred label: musikfilosofi @sv
scope note: deprecated on 2018.10.24

musiikkipsykologia
type: Concept
created: 1996-02-09
is replaced by: Y107989
modified: 2017-05-09T08:36:40+03:00
alternative label: musiikin psykologia
broader: musiikintutkimus
definition: Musiikin, ihmisen musiikillisen käyttäytymisen, toiminnan ja tietoisuuden tutkiminen psykologian menetelmin tai näkökulmasta.
in scheme: MUSA/CILLA - Musiikin asiasanasto
preferred label: musikpsykologi @sv
scope note: deprecated on 2018.10.24

musiikkisemiotiikka
type: Concept
created: 1996-02-09
is replaced by: Y121160
modified: 2017-05-09T08:36:40+03:00
broader: musiikintutkimus
definition: Musiikkitieteen suuntaus, joka yleisen semiotiikan keinoin tutkii musiikkia merkitysjärjestelminä.
in scheme: MUSA/CILLA - Musiikin asiasanasto
preferred label: musiksemiotik @sv
scope note: deprecated on 2018.10.24

musiikkisosiologia
type: Concept
created: 1996-02-09
is replaced by: Y97559
modified: 2017-05-09T08:36:40+03:00
broader: musiikintutkimus
definition: Musiikin ja siihen liittyvien tekijöiden tarkastelemista sosiaalisina ja yhteiskunnallisina ilmiöinä ja yleisemmin sosiologian näkökulmasta.
in scheme: MUSA/CILLA - Musiikin asiasanasto
preferred label: musiksociologi @sv
scope note: deprecated on 2018.10.24

kaiuttimet
type: Concept
created: 1996-02-08
is replaced by: Y95752
modified: 2017-05-09T08:36:40+03:00
broader: äänentoistolaitteet
definition: Äänentoistoketjun loppupäässä oleva osa, joka muuntaa sähkömagneettiseen muotoon muunnetun värähtelyn (äänen) takaisin akustismekaaniseksi värähtelyksi eli kuuluvaksi ääneksi.
in scheme: MUSA/CILLA - Musiikin asiasanasto
preferred label: högtalare @sv
scope note: deprecated on 2018.10.24

korvalappustereot
type: Concept
created: 1996-02-08
is replaced by: Y102708
modified: 2017-05-09T08:36:40+03:00
broader: äänentoistolaitteet
definition: Kannettava kasetti- tai muita äänitallenteita (CD-levyt, MiniDisc-levyt jne.) toistava soitin, jota kuunnellaan korvakuulokkeilla.
in scheme: MUSA/CILLA - Musiikin asiasanasto
preferred label: freestylebandspelare @sv
scope note: deprecated on 2018.10.24

kuulokkeet
type: Concept
created: 1996-02-08
is replaced by: Y102855
modified: 2017-05-09T08:36:40+03:00
broader: äänentoistolaitteet
definition: Pienikokoinen kaiutinpari, jota kuunnellaan korvia vasten painettuna. Kuulokkeet ovat malliltaan joko avoimia, puoliavoimia tai suljettuja. Kannettavissa äänentoistolaitteissa käytetään usein myös ns. nappikuulokkeita, jotka työnnetään korvakanavaan.
in scheme: MUSA/CILLA - Musiikin asiasanasto
preferred label: hörlurar @sv
scope note: deprecated on 2018.10.24

vahvistimet
type: Concept
created: 1996-02-09
is replaced by: Y104769
modified: 2017-05-09T08:36:40+03:00
broader: äänentoistolaitteet
definition: Äänentoistojärjestelmään kuuluva laite, jonka avulla sähkömagneettista signaalia voidaan vahvistaa ja joissakin tapauksissa myös muokata.
in scheme: MUSA/CILLA - Musiikin asiasanasto
preferred label: förstärkare @sv
scope note: deprecated on 2018.10.24

viritinvahvistimet
type: Concept
created: 1996-02-15
is replaced by: Y104870
modified: 2017-05-09T08:36:40+03:00
broader: äänentoistolaitteet
definition: Äänentoistolaite, joka sisältää sekä vahvistimen että virittimen (radiovastaanottimen).
in scheme: MUSA/CILLA - Musiikin asiasanasto
preferred label: effektförstärkare @sv
scope note: deprecated on 2018.10.24

tabulatuurinuottikirjoitus
type: Concept
created: 1996-02-08
is replaced by: Y217948
modified: 2017-05-09T08:36:41+03:00
alternative label: tabulatuurinotaatiot
broader: nuottikirjoitus
definition: Sävellyksen merkitsemistapa, jossa on ilmaistu esimerkiksi numeroin sormien asemointi soittimen otelaudalla tai vastaavalla osalla.
in scheme: MUSA/CILLA - Musiikin asiasanasto
note: Termiä on käytettävä aina yhdistettynä sen soittimen nimeen, jonka nuottikirjoitusmenetelmästä on kyse, esimerkiksi tabulatuurinuottikirjoitus : luuttu, tabulatuurinuottikirjoitus : sähkökitara.
preferred label: tabulaturer @sv
scope note: deprecated on 2018.10.24

okariina
type: Concept
created: 1996-02-07
is replaced by: Y214599
modified: 2017-06-27T15:54:09+03:00
broader: huilusoittimet
definition: Useimmiten savesta valmistettu astiahuilu.
in scheme: MUSA/CILLA - Musiikin asiasanasto
preferred label: okarina @sv
scope note: deprecated on 2018.10.24

modulaatio
type: Concept
created: 1996-02-09
is replaced by: Y214576
modified: 2017-09-04T13:29:34+03:00
broader: sävellysoppi
definition: Sävellajin vaihdos.
in scheme: MUSA/CILLA - Musiikin asiasanasto
preferred label: modulation @sv
scope note: deprecated on 2018.10.24

laulunäytelmät
type: Concept
created: 1996-02-08
is replaced by: Y103042
modified: 2017-05-09T08:36:41+03:00
broader: musiikkinäytelmät
definition: Näytelmä, joka esitetään osaksi laulamalla.
in scheme: MUSA/CILLA - Musiikin asiasanasto
note: Termiä ei käytetä täsmällisesti nimetyistä oopperoista, opereteista tai musikaaleista.
preferred label: sångspel @sv
scope note: deprecated on 2018.10.24

konserttisalit
type: Concept
created: 1996-02-08
is replaced by: Y102660
modified: 2017-05-09T08:36:41+03:00
definition: Erityisesti musiikkiesitysten järjestämiseen tarkoitettu tai soveltuva sali.
in scheme: MUSA/CILLA - Musiikin asiasanasto
preferred label: konsertsalar @sv
related: konserttitalot
scope note: deprecated on 2018.10.24

impromptut
type: Concept
created: 1996-02-08
is replaced by: Y101832
modified: 2017-09-21T13:24:22+03:00
definition: Pienimuotoisen sävellyksen, yleensä pianokappaleen, nimitys.
in scheme: MUSA/CILLA - Musiikin asiasanasto
note: Termiä käytetään vain sävellyksistä, joille säveltäjä on antanut tällaisen nimen.
preferred label: impromptun @sv
scope note: deprecated on 2018.10.24

intermezzot
type: Concept
created: 1996-02-08
is replaced by: Y101861
is replaced by: Y215804
modified: 2017-09-21T13:40:01+03:00
alternative label: välisoitot
alternative label: mellanspel @sv
definition: (1) 1700-luvulla opera serian näytösten tai kohtausten välissä laulettu koominen musiikkinumero ja (2) 1800-luvun alusta lähtien orkesterivälisoitto tai itsenäinen soitinsävellys.
in scheme: MUSA/CILLA - Musiikin asiasanasto
note: Jos termiä käytetään ensimmäisessä merkityksessä, siihen on aina liitettävä selventävä termi, esimerkiksi intermezzot : oopperat : Italia : 1750-luku. Muutoin termiä suositellaan käytettäväksi orkesterivälisoiton tai itsenäisen soitinsävellyksen merkityksessä.
preferred label: intermezzon @sv
scope note: deprecated on 2018.10.24

inventiot
type: Concept
created: 1996-02-08
is replaced by: Y214508
modified: 2017-09-04T13:29:34+03:00
broader: sävellykset
definition: Yleensä lyhyt vokaali- tai soitinsävellys, jolle on ominaista musiikillisen materiaalin tai muodon uudenaikaisuus sävellysajankohtaan nähden.
in scheme: MUSA/CILLA - Musiikin asiasanasto
preferred label: inventioner @sv
scope note: deprecated on 2018.10.24

kasetit
type: Concept
created: 1996-02-08
is replaced by: Y102247
modified: 2017-05-09T08:36:41+03:00
definition: Tallenneformaatti, jossa informaatio tallennetaan koteloon sijoitetulle nauhalle.
in scheme: MUSA/CILLA - Musiikin asiasanasto
narrower: äänikasetit
preferred label: kassetter @sv
scope note: deprecated on 2018.10.24

kromatiikka
type: Concept
created: 1996-02-08
is replaced by: Y214534
modified: 2017-09-04T13:29:34+03:00
broader: säveloppi
definition: Diatoniseen, kokosävelaskelista ja kahdesta puolisävelaskeleesta muodostettuun asteikkoon kuulumattomien, mutta siitä johdettujen, kromaattisten sävelten käyttäminen musiikillisen ilmaisun jännitteistämiseksi ja värittämiseksi.
in scheme: MUSA/CILLA - Musiikin asiasanasto
preferred label: kromatik @sv
scope note: deprecated on 2018.10.24

levymerkit
type: Concept
created: 1996-02-08
is replaced by: Y113191
modified: 2017-05-09T08:36:41+03:00
definition: Levy-yhtiön käyttämä kaupallinen tuotemerkki (englanniksi label). Joissakin tapauksissa levymerkkinä on käytetty levy-yhtiön nimeä, mutta useimmiten suuremmilla levy-yhtiöillä on useita levymerkkejä erityyppisen musiikin julkaisemiseen.
in scheme: MUSA/CILLA - Musiikin asiasanasto
preferred label: skivmärken @sv
related: levy-yhtiöt
scope note: deprecated on 2018.10.24

passacagliat
type: Concept
created: 1996-02-08
is replaced by: Y215277
modified: 2017-09-04T13:29:35+03:00
broader: sävellykset
definition: Basso-ostinatolle rakentuva muunnelmateos.
in scheme: MUSA/CILLA - Musiikin asiasanasto
note: Termiä käytetään vain sävellyksistä, jotka säveltäjä on nimennyt passacaglioiksi.
preferred label: passacaglior @sv
scope note: deprecated on 2018.10.24

fantasiat (sävellykset)
type: Concept
created: 1996-02-07
is replaced by: Y214462
modified: 2017-09-04T13:29:38+03:00
broader: sävellykset
definition: "Mielikuvituksellinen", yleensä soittimille sävelletty vapaamuotoinen teostyyppi.
in scheme: MUSA/CILLA - Musiikin asiasanasto
preferred label: fantasier @sv
scope note: deprecated on 2018.10.24

rentoutusmusiikki
type: Concept
created: 1996-02-08
is replaced by: Y214624
modified: 2017-09-04T13:29:35+03:00
alternative label: avkopplingsmusik @sv
broader: musiikki
definition: Musiikki, joka on sävelletty tai jonka julkaisuyhteydestä käy ilmi, että se on tarkoitettu rentoutusmusiikiksi.
in scheme: MUSA/CILLA - Musiikin asiasanasto
preferred label: avslappningsmusik @sv
scope note: deprecated on 2018.10.24

ricercaret
type: Concept
created: 1996-02-08
is replaced by: Y214625
modified: 2017-09-04T13:29:35+03:00
broader: sävellykset
definition: Soolosoittimille tehty sävellys, joskus myös pienten soitinyhtyeiden esittämä teos.
in scheme: MUSA/CILLA - Musiikin asiasanasto
note: Koska termillä ei ole yksiselitteistä määritelmää, sitä käytetään kirjallisuuden indeksoinnin ohella vain yhdessä täsmentävien asiasanojen kanssa, esimerkiksi ricercaret : cembalo : Italia.
preferred label: ricercarer @sv
scope note: deprecated on 2018.10.24

rytmi
type: Concept
created: 1996-02-08
is replaced by: Y104234
modified: 2017-05-09T08:36:42+03:00
broader: rytmioppi
definition: Värähtelyn, liikkeen tai ajan jaksottainen tapahtuma, joka voidaan havaita erillisinä impulsseina. Kuuloaistimuksessa alle noin 15 sykäystä sekunnissa pystytään havaitsemaan rytminä, tätä nopeammat impulssit aistitaan taajuutena, sävelenä tai sointina.
in scheme: MUSA/CILLA - Musiikin asiasanasto
note: Termin monikäyttöisyyden takia sitä on syytä käyttää aina yhdessä muiden termien kanssa, esimerkiksi rytmi : perinnemusiikki : Kuuba.
preferred label: rytm @sv
scope note: deprecated on 2018.10.24

sanoittajat
type: Concept
created: 1996-02-08
is replaced by: Y98731
modified: 2017-05-09T08:36:42+03:00
definition: Musiikkiteokseen tekstin laatinut henkilö.
in scheme: MUSA/CILLA - Musiikin asiasanasto
note: Sanoittajan toiminta-alue on suositeltavaa ilmaista muilla asiasanoilla, esimerkiksi sanoittajat : iskelmät : Suomi. Librettojen kirjoittajista käytetään pelkästään tai lisäksi termiä libretistit.
preferred label: textförfattare @sv
related: sanoitukset
scope note: deprecated on 2018.10.24

menuetti (tanssit)
type: Concept
created: 1996-02-09
is replaced by: Y216500
modified: 2017-07-12T15:17:07+03:00
broader: tanssit
definition: Alkuperältään ranskalainen, kolmijakoinen kansantanssi, joka tuli jo 1600-luvulla hovikäyttöön, muuntuen 1700-luvulla itsenäiseksi sävellykseksi sekä sarjojen, sinfonioiden ja muiden laajempien sävellysten vakituiseksi osaksi.
in scheme: MUSA/CILLA - Musiikin asiasanasto
scope note: deprecated on 2018.10.24

sarjallinen musiikki
type: Concept
created: 1996-02-08
is replaced by: Y104275
modified: 2017-09-21T13:24:22+03:00
alternative label: sarjallisuus
definition: Sävellystekniikka, jossa musiikillisen materiaalin eli parametrien valintaa ja organisoimista ohjataan ennalta laadittujen (esimerkiksi matemaattisten) valintakriteerien ja sääntöjen mukaisesti. Kaksitoistasäveljärjestelmän pohjalta kehittyneeseen sarjallisuuteen lasketaan yleensä kuuluvaksi tekniikat, joissa useamman kuin yhden parametrin käyttö on säännöin ohjattua.
in scheme: MUSA/CILLA - Musiikin asiasanasto
note: Termiä suositellaan käytettäväksi lähinnä musiikkikirjallisuuden dokumentoinnissa.
preferred label: seriell musik @sv
scope note: deprecated on 2018.10.24

scherzot
type: Concept
created: 1996-02-08
is replaced by: Y214648
modified: 2017-09-04T13:29:35+03:00
broader: sävellykset
definition: (1) 1600-luvun alkupuolen vokaalisävellystyyppi, (2) 1600-luvun loppupuolelta lähtien luonteeltaan leikillinen soitinsävellys, (3) 1700-luvulta lähtien erityisesti kvartetoissa ja laajemmissa orkesterisävellyksissä vilkas, yllätyksellinen osa tai (4) itsenäinen soitinsävellys.
in scheme: MUSA/CILLA - Musiikin asiasanasto
note: Termiä käytetään aina yhdessä selittävien termien kanssa, esimerkiksi scherzot : orkesterimusiikki : Ranska : 1880-luku.
preferred label: scherzon @sv
scope note: deprecated on 2018.10.24

soittokilpailut
type: Concept
created: 1996-02-08
is replaced by: Y214666
modified: 2017-09-04T13:29:35+03:00
alternative label: instrumenttävlingar @sv
alternative label: tävlingar i instrumentalspel @sv
broader: musiikkikilpailut
definition: Kilpailutapahtuma, jossa kilpaillaan jonkin soittimen hallinnassa. Kilpailun lähtökohtana voi olla myös yhtyesoiton hallinta.
in scheme: MUSA/CILLA - Musiikin asiasanasto
note: Termiin on aina syytä liittää kyseessä olevan soittimen, musiikin lajin tai yhtyeen nimitys, esimerkiksi soittokilpailut : piano : Venäjä, soittokilpailut : kamarimusiikki : Savonlinna.
preferred label: musiktävlingar i instrumentalspel @sv
scope note: deprecated on 2018.10.24

säveltäjien teosluettelot
type: Concept
created: 1996-02-08
is replaced by: Y99195
modified: 2017-09-21T13:24:22+03:00
alternative label: opusluettelot
alternative label: sävellysluettelot
alternative label: temaattiset luettelot
alternative label: tonsättares verkförteckningar @sv
definition: Säveltäjän musiikillisen tuotannon luetteleva ja erittelevä luettelo, joka vastaa kirjailijan bibliografiaa. Teosluetteloita kootaan monilla eri tavoilla, joista perusteellisin on temaattis-bibliografinen ja pintapuolisin tiivis nimilistaus.
in scheme: MUSA/CILLA - Musiikin asiasanasto
preferred label: opusförteckningar @sv
scope note: deprecated on 2018.10.24

melodiat
type: Concept
created: 1996-02-09
is replaced by: Y109684
modified: 2017-09-21T13:40:01+03:00
alternative label: melodiikka
definition: Peräkkäisinä sävelinä etenevä sävelkulku, joka muodostaa selkeänä hahmottuvan kokonaisuuden joko yksinään, rytmisten ja/tai harmonisten osuuksien säestämänä tai osana moniäänistä (polyfonista) tekstuuria.
in scheme: MUSA/CILLA - Musiikin asiasanasto
preferred label: melodier @sv
scope note: deprecated on 2018.10.24

mensuraalinuottikirjoitus
type: Concept
created: 1996-02-09
is replaced by: Y214562
modified: 2017-09-04T13:29:35+03:00
alternative label: mensuraalimusiikki
broader: nuottikirjoitus
definition: Noin vuosina 1250–1600 käytössä ollut notaatio, johon nykyaikainen nuottikirjoitus perustuu.
in scheme: MUSA/CILLA - Musiikin asiasanasto
preferred label: mensuralmusik @sv
scope note: deprecated on 2018.10.24

metronomit
type: Concept
created: 1996-02-09
is replaced by: Y103503
modified: 2017-09-21T13:40:01+03:00
definition: 1810-luvulla keksitty tempomittari, joka voidaan säätää tikittämään halutussa tempossa. Metronomia käytetään yleensä soittamisen harjoitustilanteessa oikean tempon löytymisen ja pitämisen harjoittamiseen.
in scheme: MUSA/CILLA - Musiikin asiasanasto
preferred label: metronomer @sv
scope note: deprecated on 2018.10.24

musiikin tulkinta
type: Concept
created: 1996-02-09
is replaced by: Y214582
modified: 2017-09-04T13:29:35+03:00
alternative label: musiikki -- tulkinta
alternative label: musik -- tolkning @sv
alternative label: musikalisk tolkning @sv
alternative label: musiktolkning @sv
broader: musiikin esittäminen
hidden label: musiikki tulkinta
hidden label: musik tolkning @sv
in scheme: MUSA/CILLA - Musiikin asiasanasto
preferred label: tolkning av musik @sv
scope note: deprecated on 2018.10.24

musiikkikorkeakoulut
type: Concept
created: 1996-02-09
is replaced by: Y106764
modified: 2017-05-09T08:36:43+03:00
alternative label: musiikkiyliopistot
definition: Yliopistotasoista opetusta tarjoavan musiikkioppilaitoksen nimi. Suomessa vain Sibelius- Akatemia on musiikkikorkeakoulu.
in scheme: MUSA/CILLA - Musiikin asiasanasto
preferred label: musikhögskolor @sv
related: musiikkioppilaitokset
scope note: deprecated on 2018.10.24

musiikkileikkikoulut
type: Concept
created: 1996-02-09
is replaced by: Y103604
modified: 2017-05-09T08:36:43+03:00
broader: musiikkioppilaitokset
definition: Toiminnassaan musiikkia painottavan leikkikoulun nimitys.
in scheme: MUSA/CILLA - Musiikin asiasanasto
preferred label: musiklekskolor @sv
scope note: deprecated on 2018.10.24

musiikkiliikunta
type: Concept
created: 1996-02-09
is replaced by: Y97564
modified: 2017-05-09T08:36:43+03:00
definition: Musiikin mukana liikkumista ja musiikin liikeilmaisua.
in scheme: MUSA/CILLA - Musiikin asiasanasto
preferred label: musikgymnastik @sv
related: voimistelumusiikki
scope note: deprecated on 2018.10.24

musiikkilukiot
type: Concept
created: 1996-02-09
is replaced by: Y103206
modified: 2017-05-09T08:36:43+03:00
definition: Nimitys musiikkipainotteiselle lukiolle.
in scheme: MUSA/CILLA - Musiikin asiasanasto
preferred label: musikgymnasier @sv
related: musiikkiluokat
scope note: deprecated on 2018.10.24

musiikkiluokat
type: Concept
created: 1996-02-09
is replaced by: Y103605
modified: 2017-05-09T08:36:43+03:00
definition: Nimitys musiikkipainotteisille peruskoululuokille lukion ulkopuolella.
in scheme: MUSA/CILLA - Musiikin asiasanasto
preferred label: musikklasser @sv
related: musiikkilukiot
scope note: deprecated on 2018.10.24

musiikkipolitiikka
type: Concept
created: 1996-02-09
is replaced by: Y97567
modified: 2017-09-21T13:40:01+03:00
definition: Viranomaisten, alan järjestöjen ja muiden vaikuttajien noudattamat periaatteet mm. voimavarojen jakamisessa.
in scheme: MUSA/CILLA - Musiikin asiasanasto
preferred label: musikpolitik @sv
scope note: deprecated on 2018.10.24

toccatat
type: Concept
created: 1996-02-09
is replaced by: Y104622
modified: 2017-09-21T13:24:22+03:00
definition: Historiallisesti monimerkityksinen soitinsävellys, yleensä kosketinsoittimelle tai näppäilysoittimelle sävelletty virtuoosinen ja improvisatorinen kappale.
in scheme: MUSA/CILLA - Musiikin asiasanasto
note: Termin yhteydessä käytetään lisäksi soittimen nimeä ja mielellään aikakautta ilmaisevaa termiä, esimerkiksi toccatat : urut : Saksa : 1700-luku.
preferred label: toccator @sv
scope note: deprecated on 2018.10.24

viheltäminen
type: Concept
created: 1996-02-15
is replaced by: Y214722
modified: 2017-09-04T13:29:36+03:00
broader: musiikin esittäminen
definition: Nimitys äänelle, jonka ihminen huultensa välistä puhaltamalla synnyttää.
in scheme: MUSA/CILLA - Musiikin asiasanasto
note: Termiä käytetään samaan tapaan kuin varsinaisten soitinten nimiä.
preferred label: vissling @sv
scope note: deprecated on 2018.10.24

viittomalaulut
type: Concept
created: 1996-02-15
is replaced by: Y214724
modified: 2017-09-04T13:29:36+03:00
alternative label: laulut -- viittomakieli
alternative label: sånger -- teckenspråk @sv
broader: laulut
definition: Nimitys lauluille, joiden yhteydessä esitetään tukiviittomia tukemaan ymmärtämistä kielellisten tai kuulon häiriöiden vuoksi.
hidden label: laulut viittomakieli
hidden label: sånger teckenspråk @sv
in scheme: MUSA/CILLA - Musiikin asiasanasto
preferred label: sånger på teckenspråk @sv
scope note: deprecated on 2018.10.24

rock steady
type: Concept
created: 1997-10-01
is replaced by: Y214630
modified: 2017-09-05T11:04:00+03:00
broader: reggae
definition: Noin vuosina 1966-1968 Jamaikalla esiintynyt verrattain hidastempoinen reggaeta edeltänyt tyyli.
in scheme: MUSA/CILLA - Musiikin asiasanasto
note: Koska rock steady on levinnyt maailmanlaajuiseksi ilmiöksi, on sen yhteydessä syytä käyttää aina ajallisia ja maantieteellisiä täsmenteitä, esimerkiksi rock steady : Jamaika : 1960-luku.
related: reggae
scope note: deprecated on 2018.10.24

mikrotonaalinen musiikki
type: Concept
created: 1996-02-09
is replaced by: Y214571
modified: 2017-09-04T13:29:36+03:00
broader: musiikki
definition: Puolisävelaskelta pienempiä tai sitä suurempia mutta kokosävelaskelta pienempiä intervalleja sisältävä musiikin laji, joka esiintyy sekä modernistisena taidemusiikin tyylisuuntana että monien musiikkiperinteiden (esimerkiksi arabialainen musiikki, Intian klassinen musiikki ja monet etniset perinteet) osana.
in scheme: MUSA/CILLA - Musiikin asiasanasto
preferred label: mikrointervallmusik @sv
related: säveljärjestelmät
scope note: deprecated on 2018.10.24

sonatiinit
type: Concept
created: 1996-02-08
is replaced by: Y214670
modified: 2017-09-04T13:29:36+03:00
broader: sävellykset
definition: Sananmukaisesti "pieni sonaatti", joka täysimittaiseen sonaattiin verrattuna on kestoltaan lyhyempi ja yleensä soittoteknisesti helpompi.
in scheme: MUSA/CILLA - Musiikin asiasanasto
preferred label: sonatiner @sv
related: sonaatit
scope note: deprecated on 2018.10.24

modaalisuus
type: Concept
created: 1996-02-09
is replaced by: Y218505
modified: 2017-05-09T08:36:43+03:00
broader: säveloppi
definition: Nimitys säveltasorakenteen kirkkosävellajeista eli moodeista peräisin oleville ominaisuuksille.
in scheme: MUSA/CILLA - Musiikin asiasanasto
preferred label: modalitet @sv
related: moodit
scope note: deprecated on 2018.10.24

tempo
type: Concept
created: 1996-02-09
is replaced by: Y161843
modified: 2017-09-21T13:40:02+03:00
broader: rytmioppi
definition: Sävellyksen nopeus.
in scheme: MUSA/CILLA - Musiikin asiasanasto
scope note: deprecated on 2018.10.24

hengellinen viihdemusiikki
type: Concept
created: 1996-03-18
is replaced by: Y214493
modified: 2017-09-04T13:29:36+03:00
alternative label: hengellinen musiikki -- viihdemusiikki
alternative label: andlig musik -- underhållningsmusik @sv
broader: viihdemusiikki
broader: hengellinen musiikki
hidden label: hengellinen musiikki viihdemusiikki
hidden label: andlig musik underhållningsmusik @sv
in scheme: MUSA/CILLA - Musiikin asiasanasto
preferred label: andlig underhållningsmusik @sv
scope note: deprecated on 2018.10.24

sambat
type: Concept
created: 1996-02-08
is replaced by: Y104265
is replaced by: Y216944
modified: 2017-05-09T08:36:23+03:00
broader: latinalaisamerikkalainen populaarimusiikki
broader: latinalaistanssit
definition: (1) Vakioitu seura- ja kilpatanssi sekä (2) yleisnimi useille afrikkalaisperäisille brasilialaisille musiikki- ja tanssityyleille.
in scheme: MUSA/CILLA - Musiikin asiasanasto
note: Termiä suositellaan käytettäväksi ensimmäisessä merkityksessään aina yhdistettynä termiin tanssimusiikki tai kilpatanssi. Toisessa merkityksessä termiin on syytä lisätä maantieteellisen asiasanan lisäksi muita tyylillisiä täsmenteitä, esimerkiksi sambat : laulut : Brasilia.
preferred label: samba @sv
scope note: deprecated on 2018.10.24

musiikkiteatteri
type: Concept
created: 1997-09-30
is replaced by: Y103608
modified: 2017-05-09T08:36:44+03:00
definition: Teatteritaiteen laji, jossa musiikilla on olennainen merkitys.
in scheme: MUSA/CILLA - Musiikin asiasanasto
note: Musiikkiteatterin esittämiseen erikoistuneista laitoksista käytetään termiä musiikkiteatterit.
preferred label: musikteater @sv
related: revyyt
related: näyttämömusiikki
scope note: deprecated on 2018.10.24

kotiseutulaulut
type: Concept
created: 1997-09-30
is replaced by: Y214533
modified: 2017-09-04T13:29:36+03:00
broader: laulut
definition: Lauluja, jotka on sävelletty ja/tai sanoitettu kuvaamaan myönteisesti tiettyä rajallista aluetta tai paikkakuntaa.
in scheme: MUSA/CILLA - Musiikin asiasanasto
preferred label: hembygdssånger @sv
related: maakuntalaulut
scope note: deprecated on 2018.10.24

airit
type: Concept
created: 1997-09-30
is replaced by: Y214383
modified: 2017-09-04T13:29:36+03:00
broader: sävellykset
definition: 1600- ja 1700-luvuilla tavallinen, laulunomaiseen melodiaan perustuva soitinsävellys, yleensä oopperoissa, baleteissa ja soitinsarjoissa.
in scheme: MUSA/CILLA - Musiikin asiasanasto
preferred label: airer @sv
related: aariat
scope note: deprecated on 2018.10.24

dub
type: Concept
created: 1997-09-30
is replaced by: Y214450
modified: 2017-09-04T13:29:37+03:00
broader: reggae
definition: Reggae-musiikin piirissä kehittynyt tyyli, jonka puitteissa tehdään suosituista reggaelauluista lähinnä studiotekniikan avulla instrumentaaliversioita.
in scheme: MUSA/CILLA - Musiikin asiasanasto
related: ambient
scope note: deprecated on 2018.10.24

rāgat
type: Concept
created: 1997-10-01
is replaced by: Y214800
modified: 2017-09-04T13:29:37+03:00
alternative label: ragat
broader: säveljärjestelmät
definition: Intialaisen musiikin säveljärjestelmä, joka antaa sävellyksessä tai improvisaatiossa käytettävän melodisen materiaalin.
in scheme: MUSA/CILLA - Musiikin asiasanasto
preferred label: ragor @sv
scope note: deprecated on 2018.10.24

poikakuorot
type: Concept
created: 1997-10-01
is replaced by: Y134669
modified: 2017-09-21T13:40:02+03:00
broader: kuorot
definition: Esityskokoonpano, jossa on vain poikaäänisiä laulajia.
in scheme: MUSA/CILLA - Musiikin asiasanasto
note: Termiä käytetään vain itse kokoonpanosta, ei poikakuoron esittämästä musiikista.
preferred label: gosskörer @sv
scope note: deprecated on 2018.10.24

soulblues
type: Concept
created: 1997-10-01
is replaced by: Y214676
modified: 2017-09-04T13:29:37+03:00
broader: urban blues
definition: 1960-luvulla kehittynyt perinteisen bluesin ja uudemman soul-musiikin yhdistelmä, jonka tunnettuja edustajia ovat mm. Bobby Bland ja Little Milton.
in scheme: MUSA/CILLA - Musiikin asiasanasto
related: Chicago-blues
scope note: deprecated on 2018.10.24

äänitaide
type: Concept
created: 1996-02-08
is replaced by: Y131584
modified: 2017-09-04T13:29:37+03:00
alternative label: ääni-installaatiot
definition: Teos, joka perustuu erilaisten äänten yhdistelyyn. Äänitaideteos ei sisällä välttämättä musiikkia.
in scheme: MUSA/CILLA - Musiikin asiasanasto
narrower: ympäristömusiikki
preferred label: ljudkonst @sv
related: radiofonia
scope note: deprecated on 2018.10.24

työlaulut
type: Concept
created: 1997-11-11
is replaced by: Y171567
modified: 2017-09-21T13:40:02+03:00
broader: laulut
definition: Laulut, joita eri kulttuuripiireissä on käytetty työnteon keventämiseen, tehostamiseen, rytmittämiseen tai muistelemiseen.
in scheme: MUSA/CILLA - Musiikin asiasanasto
note: Termiä käytetään aina yhdessä täsmentävien asiasanojen kanssa, esimerkiksi työlaulut : merimiehet : Englanti.
preferred label: arbetssånger @sv
scope note: deprecated on 2018.10.24

hengelliset lastenlaulut
type: Concept
created: 1996-10-01
is replaced by: Y214494
modified: 2017-06-27T10:06:39+03:00
alternative label: hengelliset laulut -- lastenlaulut
alternative label: lastenlaulut -- hengelliset laulut
alternative label: andliga barnsånger @sv
broader: lastenlaulut
broader: hengellinen musiikki
hidden label: hengelliset laulut lastenlaulut
hidden label: lastenlaulut hengelliset laulut
in scheme: MUSA/CILLA - Musiikin asiasanasto
preferred label: andliga barnvisor @sv
scope note: deprecated on 2018.10.24

historiikit
type: Concept
created: 1998-06-24
is replaced by: Y95399
modified: 2017-05-09T08:36:45+03:00
alternative label: historiker -- litteratur @sv
definition: Musiikissa yhteisön vaiheiden systemaattisesta esittelystä käytettävä nimitys.
hidden label: historiker litteratur @sv
in scheme: MUSA/CILLA - Musiikin asiasanasto
note: Yleisen asiasanaston termi, jota suositellaan käytettäväksi musiikissa vain yhteisöjen vaiheita käsittelevien julkaisujen yhteydessä aikamääreen kanssa, esimerkiksi rock : yhtyeet : historiikit : Ruotsi : 1960-luku.
preferred label: historiker (litteratur) @sv
related: elämäkerrat
related: henkilöhistoria
scope note: deprecated on 2018.10.24

kuunnelmat
type: Concept
created: 1998-05-12
is replaced by: Y96590
modified: 2017-05-09T08:36:45+03:00
definition: Radiota varten valmistettu ja sen kautta esitetty näytelmä.
in scheme: MUSA/CILLA - Musiikin asiasanasto
preferred label: hörspel @sv
related: radiofonia
related: näytelmät
scope note: deprecated on 2018.10.24

mandoliini
type: Concept
created: 1996-02-09
is replaced by: Y103406
modified: 2017-09-21T13:39:44+03:00
broader: näppäilysoittimet
definition: Pienikokoinen luuttusoitin, jossa on yleensä neljä kieliparia.
in scheme: MUSA/CILLA - Musiikin asiasanasto
preferred label: mandolin @sv
scope note: deprecated on 2018.10.24

juomalaulut
type: Concept
created: 1996-02-08
is replaced by: Y101992
modified: 2017-09-21T13:39:45+03:00
broader: laulut
definition: Nimitys lauluille, jotka sopivan tekstin tai monille tutun sävelen takia soveltuvat erityisen hyvin yhteislaulamiseen alkoholin nauttimisen lomassa.
in scheme: MUSA/CILLA - Musiikin asiasanasto
preferred label: dryckesvisor @sv
scope note: deprecated on 2018.10.24

laulukilpailut
type: Concept
created: 1996-02-08
is replaced by: Y103039
modified: 2017-09-21T13:24:19+03:00
broader: musiikkikilpailut
definition: Kilpailutapahtuma, jossa kilpaillaan jonkin laulumuodon puitteissa.
in scheme: MUSA/CILLA - Musiikin asiasanasto
preferred label: sångtävlingar @sv
scope note: deprecated on 2018.10.24

isänmaallinen musiikki
type: Concept
created: 1996-02-08
is replaced by: Y214510
modified: 2017-09-04T13:29:18+03:00
alternative label: patriotisk musik @sv
broader: musiikki
definition: Musiikki, joka on sävelletty, sovitettu ja esitetty isänmaallisten tuntemusten edistämiseksi. Termillä ei tarkoiteta mitään täsmällisesti tunnistettavissa olevaa musiikin lajia, vaikka suomalaisessa kulttuurissa termi liittyy tavallisesti sotilassoittokuntien ja kuorojen ohjelmistoon.
in scheme: MUSA/CILLA - Musiikin asiasanasto
narrower: kansallislaulut
preferred label: fosterländsk musik @sv
scope note: deprecated on 2018.10.24

sekakuorot
type: Concept
created: 1996-02-08
is replaced by: Y102837
modified: 2017-09-21T13:39:46+03:00
broader: kuorot
definition: Kuoron esityskokoonpano, jossa on sopraano-, altto-, tenori- ja bassoääniä tai ainakin sekä nais- että miesääniä.
in scheme: MUSA/CILLA - Musiikin asiasanasto
note: Termiä voi käyttää sekä kokoonpanosta että sille sävelletystä tai sillä esitetystä musiikista.
preferred label: blandade körer @sv
scope note: deprecated on 2018.10.24

vanha musiikki
type: Concept
created: 1996-02-09
is replaced by: Y144396
modified: 2017-09-21T13:39:46+03:00
alternative label: gammal musik @sv
definition: Nimitys kaikelle ennen 1700-luvun alkua sävelletylle länsimaiselle taidemusiikille tyylikausien näkökulmasta.
definition: Används om västerländsk musik från tiden före senbarocken (ca. 1700-) om närmare tidsangivelse inte är möjlig, tex. ifråga om samlingsvolymer. @sv
in scheme: MUSA/CILLA - Musiikin asiasanasto
note: Termiä käytetään, kun tarkempi ilmaus esimerkiksi julkaisun kokoelmaluonteen takia ei kuvaa sisältöä yksiselitteisesti. Jos julkaisu sisältää vain yhden vanhaan musiikkiin kuuluvan tyylikauden musiikkia, on ensisijaisesti käytettävä tätä tarkkaa ilmaisua, esimerkiksi vanha musiikki : soitinmusiikki : Eurooppa mutta messut : renessanssi : Espanja.
preferred label: tidig musik @sv
related: tyylikaudet
scope note: deprecated on 2018.10.24

vapaa säestys
type: Concept
created: 1996-02-15
is replaced by: Y214716
modified: 2017-09-04T13:29:19+03:00
broader: säestykset
broader: säestäminen
definition: Improvisatorinen säestys, joka soitetaan viihteellisten nuottimerkintöjen, esimerkiksi ns. sointumerkkien mukaan tai kuulonvaraisesti.
in scheme: MUSA/CILLA - Musiikin asiasanasto
note: Termi on tarkoitettu kirjallisuuden ja nuottijulkaisujen indeksointiin.
preferred label: fritt ackompanjemang @sv
scope note: deprecated on 2018.10.24

alppitorvi
type: Concept
created: 1998-06-22
is replaced by: Y214387
modified: 2017-09-04T13:29:38+03:00
broader: puhallinsoittimet
broader: vaskipuhaltimet
definition: Yksinkertainen paimentorvi (luonnonsäveltorvi), jota käytetään Alppien alueella.
in scheme: MUSA/CILLA - Musiikin asiasanasto
preferred label: alphorn @sv
scope note: deprecated on 2018.10.24

etnomusikologia
type: Concept
created: 1996-02-07
is replaced by: Y95130
modified: 2017-05-09T08:36:25+03:00
alternative label: kansanmusiikintutkimus
alternative label: musiikkiantropologia
alternative label: musiikkietnologia
alternative label: vertaileva musiikintutkimus
alternative label: vertaileva musiikkitiede
alternative label: folkmusikforskning @sv
alternative label: jämförande musikvetenskap @sv
alternative label: musikantropologi @sv
alternative label: musiketnologi @sv
broader: musiikintutkimus
definition: Musiikkitieteen suuntaus, jonka tutkimuskohteena on musiikkikulttuuri. Etnomusikologiassa on perinteisesti tutkittu erityisesti etnistä ja populaarimusiikkia.
in scheme: MUSA/CILLA - Musiikin asiasanasto
preferred label: etnomusikologi @sv
related: musiikkifolklorismi
scope note: deprecated on 2018.10.24

viisikielinen kantele
type: Concept
created: 1996-02-15
is replaced by: Y100248
modified: 2017-09-21T13:39:46+03:00
broader: kantele
definition: Pienikokoinen, viidellä kielellä varustettu kantele.
in scheme: MUSA/CILLA - Musiikin asiasanasto
preferred label: femsträngad kantele @sv
scope note: deprecated on 2018.10.24

akustinen populaarimusiikki
type: Concept
created: 2001-02-23
is replaced by: Y113574
modified: 2017-09-21T13:40:02+03:00
broader: populaarimusiikki
definition: Populaarimusiikkiesitys, -nuotinnos tai -sävellys, jossa ei ole käytetty sähköisiä soittimia.
definition: Används om musik vars akustiska karaktär inte är självklar, närmast då gitarr, mandolin etc. avses @sv
in scheme: MUSA/CILLA - Musiikin asiasanasto
note: Termillä on kolme käyttöaluetta: (1) monia genrejä yhdistelevä populaarimusiikin tyylilaji (esim. David Grisman), (2) yleensä sähköisin soittimin esitettävän musiikin akustiset versiot (ns. Unplugged-versiot) ja (3) populaarimusiikin nuotinnokset selkeästi akustisille soittimille tai kokoonpanoille (esim. The Beatles -yhtyeen laulut klassiselle kitaralle sovitettuna). Termiä ei käytetä sellaisen musiikin yhteydessä, joka on lähtökohtaisesti akustista, kuten esimerkiksi folkmusiikki.
preferred label: akustisk populärmusik @sv
scope note: deprecated on 2018.10.24

laulukirjat
type: Concept
created: 1996-02-08
is replaced by: Y96791
modified: 2017-09-21T13:39:46+03:00
definition: Sekasisältöinen laulukokoelma, joka voi olla eri tavoin nuotinnettu tai pelkästään laulujen sanoista koostuva.
in scheme: MUSA/CILLA - Musiikin asiasanasto
note: Jos indeksoinnin kohteena ei ole sekasisältöinen yleislaulukirja, termiä suositellaan käytettäväksi laulukirjan luonnetta täsmentävien termien kanssa, esimerkiksi laulukirjat : koulut : Suomi : 1950-luku, laulukirjat : juomalaulut : Ruotsi.
preferred label: sångböcker @sv
related: nuottijulkaisut
scope note: deprecated on 2018.10.24

parafraasit
type: Concept
created: 1996-02-08
is replaced by: Y209011
modified: 2017-09-04T13:29:19+03:00
broader: sävellykset
definition: Yhden tai useamman sävelmän muokkaaminen vapaasti muunnellen uudeksi teokseksi.
in scheme: MUSA/CILLA - Musiikin asiasanasto
note: Koska rajanveto parafraasin, kollaasin ja muuten lainaavan sävellyksen välillä on vaikeaa, termiä käytetään vain teoksista, jotka säveltäjä ja hakuteokset määrittelevät parafraaseiksi.
preferred label: parafraser @sv
related: muunnelmat
scope note: deprecated on 2018.10.24

viulu
type: Concept
created: 1996-02-15
is replaced by: Y101962
modified: 2017-09-21T13:24:19+03:00
broader: jousisoittimet
definition: Nelikielinen jousisoitin ja viuluperheen sopraanokokoinen jäsen, jonka normaaliviritys on g–d'–a'–e''.
in scheme: MUSA/CILLA - Musiikin asiasanasto
preferred label: violin @sv
scope note: deprecated on 2018.10.24

madrigaalit
type: Concept
created: 1996-02-09
is replaced by: Y103358
modified: 2017-09-21T13:39:46+03:00
broader: laulut
definition: (1) 1300-luvulla Italiassa esiintynyt moniääninen maallinen laulutyyli ja (2) 1500-luvulla Euroopassa kukoistanut enimmäkseen neliääninen laulutyyli, jonka tekstien aihepiirinä oli yleensä rakkaus.
in scheme: MUSA/CILLA - Musiikin asiasanasto
note: Historiallisten madrigaalien lisäksi termiä voi käyttää sellaisten uudempien sävellysten yhteydessä, joille säveltäjä on antanut nimeksi madrigaali. Historiallinen yhteys on syytä aina ilmaista, esimerkiksi madrigaalit : Yhdysvallat : 1960-luku, madrigaalit : Italia : 1550-luku.
preferred label: madrigaler @sv
scope note: deprecated on 2018.10.24

Kodály-menetelmä
type: Concept
created: 1996-02-08
is replaced by: Y102587
modified: 2017-09-21T13:39:46+03:00
broader: opetusmenetelmät
definition: Säveltäjä Zoltán Kodályn kehittämä säveltapailun menetelmä.
in scheme: MUSA/CILLA - Musiikin asiasanasto
preferred label: Kodálymetoden @sv
scope note: deprecated on 2018.10.24

tonadillat
type: Concept
created: 1996-02-09
is replaced by: Y214702
modified: 2017-09-04T13:29:20+03:00
broader: näyttämömusiikki
definition: 1700-luvulla kehittynyt espanjalainen näyttämömusiikin muoto, joka 1800-luvulla korvautui pitkälle zarzuelalla.
in scheme: MUSA/CILLA - Musiikin asiasanasto
preferred label: tonadilla @sv
related: zarzuelat
scope note: deprecated on 2018.10.24

laululeikit
type: Concept
created: 1996-02-08
is replaced by: Y96792
modified: 2017-05-09T08:36:23+03:00
broader: musiikkileikit
definition: Leikit, joiden olennaisena osana on musiikki (yleensä laulu).
in scheme: MUSA/CILLA - Musiikin asiasanasto
preferred label: sånglekar @sv
related: lastenlaulut
scope note: deprecated on 2018.10.24

ksylofoni
type: Concept
created: 1996-02-08
is replaced by: Y102768
modified: 2017-09-21T13:39:47+03:00
alternative label: xylorimba
broader: lyömäsoittimet
definition: Eri taajuuksilla soivista puu-, bambu- tai synteettisistä palikoista valmistettu lyömäsoitin.
in scheme: MUSA/CILLA - Musiikin asiasanasto
preferred label: xylofon @sv
scope note: deprecated on 2018.10.24

continuo
type: Concept
created: 1996-02-07
is replaced by: Y102392
modified: 2017-09-21T13:39:47+03:00
alternative label: basso continuo
alternative label: continuosoitto
alternative label: numeroitu basso
definition: Barokin ja klassismin ajan musiikissa soittimistoltaan vapaavalintainen bassosäestys. Vastaavasta säestysperiaatteesta käytetään termiä kenraalibasso.
definition: Används om instrumentbesättning @sv
in scheme: MUSA/CILLA - Musiikin asiasanasto
related: kenraalibasso
scope note: deprecated on 2018.10.24

flamenco
type: Concept
created: 1996-03-18
is replaced by: Y101371
modified: 2017-05-09T08:36:26+03:00
broader: perinnemusiikki
definition: (1) Espanjalainen (romanien) kansanmusiikin laji, joka koostuu laulusta, tanssista ja kitaransoitosta ja (2) tähän perinteeseen kuuluvat yksittäiset laulut, tanssit ja sävelmät.
in scheme: MUSA/CILLA - Musiikin asiasanasto
note: Termin yhteydessä suositellaan aina käytettäväksi täsmentäviä määreitä, esimerkiksi flamenco : laulut, flamenco : kitara.
related: kansantanssit
scope note: deprecated on 2018.10.24

puhelaulu
type: Concept
created: 1996-02-08
is replaced by: Y104031
modified: 2017-09-21T13:39:48+03:00
alternative label: resitointi
definition: Puhelaulu on täsmällisesti nuotinnettua puhetta ilman melodiaa tai harmonioita. Suomessa esimerkiksi mieskuoro Huutajat on käyttänyt puhelaulua.
in scheme: MUSA/CILLA - Musiikin asiasanasto
note: Termiä käytetään lähinnä taidemusiikin yhteydessä.
preferred label: talsång @sv
related: laulaminen
scope note: deprecated on 2018.10.24

solmisaatio
type: Concept
created: 1996-10-11
is replaced by: Y214669
modified: 2017-09-04T13:29:21+03:00
broader: säveltapailu
definition: Säveltapailun menetelmä, jossa sävelet lauletaan niille annettuja solmisaationimiä käyttäen (do, re, mi, fa, sol, la, ti).
in scheme: MUSA/CILLA - Musiikin asiasanasto
preferred label: solmisation @sv
related: säveltapailu
scope note: deprecated on 2018.10.24

requiemit
type: Concept
created: 1996-02-08
is replaced by: Y103489
modified: 2017-09-21T13:39:48+03:00
alternative label: sielunmessut
alternative label: dödsmässor @sv
alternative label: själamässor @sv
broader: messut
definition: Katolisen sielunmessun nimitys. Termiä on käytetty myös sellaisten sävellysten nimenä, joissa on muutakin kuin liturgista tekstiä (esimerkiksi Brittenin War Requiem).
in scheme: MUSA/CILLA - Musiikin asiasanasto
note: Termiä käytetään vain sellaisista messusävellyksistä, jotka säveltäjä on määritellyt sielunmessuiksi. Termin requiem vastineena voi esiintyä myös latinankielinen ilmaisu Missa pro defunctis.
preferred label: rekviem @sv
scope note: deprecated on 2018.10.24

muunnelmat
type: Concept
created: 1996-02-09
is replaced by: Y103611
modified: 2017-05-09T08:36:26+03:00
alternative label: variaatiot
definition: Sävellystyyppi, joka perustuu teemaan ja sen muuntelevaan käsittelyyn.
in scheme: MUSA/CILLA - Musiikin asiasanasto
note: Termiä täsmennetään aina muilla termeillä, esimerkiksi muunnelmat : koraalit : urut.
preferred label: variationer @sv
related: parafraasit
related: rondot
scope note: deprecated on 2018.10.24

neumit
type: Concept
created: 1996-02-07
is replaced by: Y140809
modified: 2017-09-21T13:39:48+03:00
broader: nuottikirjoitus
definition: Nimitys varhaisessa nuottikirjoitustavassa (neumikirjoitus) oleville nuottimerkeille.
in scheme: MUSA/CILLA - Musiikin asiasanasto
preferred label: neumer @sv
scope note: deprecated on 2018.10.24

rummut
type: Concept
created: 1996-02-08
is replaced by: Y103261
modified: 2017-09-21T13:39:48+03:00
broader: lyömäsoittimet
definition: Lyömäsoitin, jossa on kehyksen yli pingotettu kalvo.
in scheme: MUSA/CILLA - Musiikin asiasanasto
preferred label: trummor @sv
scope note: deprecated on 2018.10.24

sotilasmusiikki
type: Concept
created: 1996-02-08
is replaced by: Y99010
modified: 2017-05-09T08:36:26+03:00
definition: Sotilaskäyttöön (lähinnä marssimusiikiksi, signaaleiksi yms.) tehty musiikki.
in scheme: MUSA/CILLA - Musiikin asiasanasto
note: Termiä ei suositella käytettäväksi automaattisesti sotilassoittokuntien yhteydessä, koska ne voivat esittää myös tavallista puhallinviihdettä tai taidemusiikkia.
preferred label: militärmusik @sv
related: marssit
related: sotilassoittokunnat
scope note: deprecated on 2018.10.24

konserttiaariat
type: Concept
created: 1996-02-08
is replaced by: Y214527
modified: 2017-09-04T13:29:21+03:00
broader: aariat
definition: Aariaksi nimitetty itsenäinen orkesterisäestysellinen laulu.
in scheme: MUSA/CILLA - Musiikin asiasanasto
note: Oopperoihin sisältyvistä aarioista käytetään asiasanaa aariat.
preferred label: konsertarior @sv
related: orkesterilaulut
scope note: deprecated on 2018.10.24

resitatiivit
type: Concept
created: 1996-02-08
is replaced by: Y182347
modified: 2017-09-21T13:39:48+03:00
definition: Continuon (recitativo secco) tai orkesterin säestyksellä (recitativo accompagnato) yhden tai joskus useamman laulajan puhelaulaen esittämä lyhyehkö dramaattinen osuus tavallisesti jossakin suuremmassa vokaaliteoksessa. Resitatiivi edeltää usein aariaa tai kuorokohtausta esimerkiksi oopperassa tai oratoriossa.
in scheme: MUSA/CILLA - Musiikin asiasanasto
preferred label: recitativ @sv
related: aariat
scope note: deprecated on 2018.10.24

libretot
type: Concept
created: 1996-02-08
is replaced by: Y103118
modified: 2017-05-09T08:36:27+03:00
broader: sanoitukset
definition: Teksti, joka on laadittu oopperaan, operettiin, musikaaliin tai muuhun näyttämömusiikkiteokseen. Termiä käytetään joskus myös baletin pohjana olevasta kirjallisesta teoksesta, samoin oratorion, passion tai muun vastaavaan laajahkon taidemusiikkisävellyksen tekstistä.
in scheme: MUSA/CILLA - Musiikin asiasanasto
note: Koska termiä käytetään erilaisten teosten yhteydessä, on sitä syytä käyttää yhdistettynä kyseiseen musiikinlajiin, esimerkiksi libretot : oopperat, libretot : baletit.
preferred label: libretton @sv
related: näyttämömusiikki
scope note: deprecated on 2018.10.24

taarab
type: Concept
created: 1996-02-08
is replaced by: Y216461
modified: 2017-05-09T08:36:28+03:00
broader: perinnemusiikki
definition: Sansibarin saarella kehittynyt erilaisten perinnemusiikkityylien paikallinen sulautuma, jossa on vaikutteita ainakin afrikkalaisesta, arabialaisesta ja intialaisesta perinnemusiikista.
in scheme: MUSA/CILLA - Musiikin asiasanasto
related: afro
scope note: deprecated on 2018.10.24

teemat
type: Concept
created: 1996-02-09
is replaced by: Y99350
modified: 2017-05-09T08:36:28+03:00
definition: Sävellyksen perustan useammasta motiivista muodostuva, omaleimainen musiikillinen idea tai ajatus.
in scheme: MUSA/CILLA - Musiikin asiasanasto
note: Termiä ei käytetä, kun halutaan indeksoida johonkin musiikkiin liittyvää ulkomusiikillista aihetta. Sen sijaan käytetään YSA:n termiä aiheet.
preferred label: teman @sv
related: aiheet
related: motiivit
scope note: deprecated on 2018.10.24

periodisoittimet
type: Concept
created: 1996-02-07
is replaced by: Y116052
modified: 2017-09-21T13:24:20+03:00
alternative label: alkuperäissoittimet
broader: soittimet
definition: Jonakin historiallisena aikakautena käytetyistä soittimista tehtyjä rekonstruktioita. Periodisoittimia käytetään historiallisesti mahdollisimman autenttisen esityksen aikaansaamiseksi.
in scheme: MUSA/CILLA - Musiikin asiasanasto
preferred label: periodinstrument @sv
scope note: deprecated on 2018.10.24

alueorkesteritoiminta
type: Concept
created: 1996-02-07
is replaced by: Y100712
modified: 2017-09-21T13:39:51+03:00
broader: orkesteritoiminta
definition: Alueellisen kulttuuritoiminnan osa-alue.
in scheme: MUSA/CILLA - Musiikin asiasanasto
preferred label: regional orkesterverksamhet @sv
scope note: deprecated on 2018.10.24

ambrosiaaninen laulu
type: Concept
created: 1996-02-07
is replaced by: Y214391
modified: 2017-09-04T13:29:23+03:00
alternative label: ambrosiaaninen kirkkolaulu
alternative label: milanolainen kirkkolaulu
broader: latinalainen kirkkolaulu
definition: Gregoriaanisen kirkkolaulun historiallinen edeltäjä, joka liittyi lähinnä Milanossa 300- luvulla esiintyneeseen ambrosiaaniseen liturgiaan.
in scheme: MUSA/CILLA - Musiikin asiasanasto
preferred label: ambrosiansk sång @sv
related: gregoriaaninen laulu
scope note: deprecated on 2018.10.24

arkistot
type: Concept
created: 1996-02-07
is replaced by: Y94693
modified: 2017-07-12T09:42:16+03:00
definition: Laitos, joka kerää, järjestää ja säilyttää uniikkiaineistoa, kuten musiikkikäsikirjoituksia.
definition: Istället för musikarkiv används arkiv : musik. @sv
in scheme: MUSA/CILLA - Musiikin asiasanasto
narrower: ääniarkistot
narrower: musiikkiarkistot
preferred label: arkiv @sv
scope note: deprecated on 2018.10.24

ääniarkistot
type: Concept
created: 1996-02-15
is replaced by: Y100821
modified: 2017-07-12T09:41:33+03:00
alternative label: nauhoitearkistot
alternative label: äänitearkistot
alternative label: bandarkiv @sv
alternative label: fonogramarkiv @sv
alternative label: musikarkiv @sv
alternative label: skivarkiv @sv
broader: arkistot
definition: Laitos, joka tallentaa pysyvästi äänitetyssä muodossa olevaa puhetta, musiikkia ja muita äänilähteitä.
in scheme: MUSA/CILLA - Musiikin asiasanasto
preferred label: ljudarkiv @sv
related: musiikkiarkistot
scope note: deprecated on 2018.10.24

ars antiqua
type: Concept
created: 1996-02-07
is replaced by: Y214396
modified: 2017-09-04T13:29:23+03:00
alternative label: ars veterum
alternative label: ars vetus
broader: tyylikaudet
definition: 1100- ja 1200-lukujen eurooppalainen moniääninen musiikki, joka tyylillisesti edelsi ars novaa.
in scheme: MUSA/CILLA - Musiikin asiasanasto
related: ars nova
scope note: deprecated on 2018.10.24

ars nova
type: Concept
created: 1996-02-07
is replaced by: Y214397
modified: 2017-09-04T13:29:23+03:00
broader: tyylikaudet
definition: 1300-luvun eurooppalainen polyfoninen sävellystyyli, jota edelsi ars antiqua.
in scheme: MUSA/CILLA - Musiikin asiasanasto
related: ars antiqua
scope note: deprecated on 2018.10.24

arvostelijat
type: Concept
created: 1996-02-07
is replaced by: Y94714
modified: 2017-05-09T08:36:29+03:00
alternative label: kriitikot
alternative label: kritiker @sv
definition: Henkilö, joka kirjoittaa tai muuten julkaisee taiteellisen esityksen tai teoksen arvostelun.
in scheme: MUSA/CILLA - Musiikin asiasanasto
note: Termiä suositellaan käytettäväksi yhdistettynä termiin musiikki tai tarkemmin, esimerkiksi arvostelijat : rock.
preferred label: recensenter @sv
related: arvostelu
related: arvostelut
scope note: deprecated on 2018.10.24

arvostelu
type: Concept
created: 1996-02-07
is replaced by: Y94715
modified: 2017-07-12T11:28:27+03:00
alternative label: anmälningar @sv
definition: Kritiikki ilmiönä sinänsä, ei yksittäisinä arvosteluina, joista käytetään termiä arvostelut.
in scheme: MUSA/CILLA - Musiikin asiasanasto
preferred label: kritik @sv
related: arvostelijat
related: arvostelut
scope note: deprecated on 2018.10.24

tonaalisuus
type: Concept
created: 1996-02-09
is replaced by: Y100912
modified: 2017-09-21T13:39:51+03:00
definition: (1) Duuri- ja molliasteikkoon perustuva säveljärjestelmä (duuri-mollitonaalisuus). (2) Tonaaliseen hierarkiaan perustuva säveljärjestelmä mukaan lukien kaikki modaaliset (pentatoniset, diatoniset, kromaattiset ja mikrointervalleja käyttävät) järjestelmät.
in scheme: MUSA/CILLA - Musiikin asiasanasto
preferred label: tonalitet @sv
related: atonaalisuus
scope note: deprecated on 2018.10.24

balalaikka
type: Concept
created: 1996-02-07
is replaced by: Y100996
modified: 2017-09-21T13:39:51+03:00
broader: näppäilysoittimet
definition: Venäläinen kolmikielinen näppäilysoitin, jossa on kolmionmuotoinen kaikukoppa.
in scheme: MUSA/CILLA - Musiikin asiasanasto
preferred label: balalajka @sv
scope note: deprecated on 2018.10.24

banjo
type: Concept
created: 1996-02-07
is replaced by: Y101003
modified: 2017-09-21T13:39:52+03:00
broader: näppäilysoittimet
definition: Pohjoisamerikkalainen luuttusoitin, jossa on yleensä 4-6 kieltä. Kaikukoppa on päällystetty pingotetulla kalvolla. Banjo on lähinnä populaarimusiikissa käytetty soitin.
in scheme: MUSA/CILLA - Musiikin asiasanasto
scope note: deprecated on 2018.10.24

barbershop-musiikki
type: Concept
created: 1996-02-07
is replaced by: Y214406
modified: 2017-09-04T13:29:24+03:00
alternative label: barbershop-musik @sv
broader: viihdemusiikki
definition: Lähinnä Yhdysvalloissa suosittu viihteellisen yhtye- tai kuorolaulun muoto.
in scheme: MUSA/CILLA - Musiikin asiasanasto
preferred label: barbershop @sv
related: lauluyhtyeet
scope note: deprecated on 2018.10.24

berceuset
type: Concept
created: 1996-02-07
is replaced by: Y214417
modified: 2017-09-04T13:29:24+03:00
broader: sävellykset
definition: Länsimaisen taidemusiikkiperinteen mukaan yleensä pianolle sävelletty kehtolaulua muistuttava karaktäärikappale.
in scheme: MUSA/CILLA - Musiikin asiasanasto
preferred label: berceuser @sv
related: kehtolaulut
scope note: deprecated on 2018.10.24

celesta
type: Concept
created: 1996-02-07
is replaced by: Y214432
modified: 2017-09-04T13:29:25+03:00
broader: kosketinsoittimet
broader: lyömäsoittimet
definition: Kosketinsoitin, jossa on kielten asemasta teräslevyt.
in scheme: MUSA/CILLA - Musiikin asiasanasto
scope note: deprecated on 2018.10.24

cha-cha-chat
type: Concept
created: 1996-02-07
is replaced by: Y110864
is replaced by: Y216942
modified: 2017-05-09T08:36:31+03:00
broader: latinalaisamerikkalainen populaarimusiikki
broader: latinalaistanssit
definition: 1950-luvulla Kuubassa kehitetty seuratanssi ja siihen liittyvän viihdemusiikin nimitys.
in scheme: MUSA/CILLA - Musiikin asiasanasto
preferred label: cha-cha-cha @sv
scope note: deprecated on 2018.10.24

Chicago-blues
type: Concept
created: 1996-02-07
is replaced by: Y214434
modified: 2017-09-04T13:29:25+03:00
broader: urban blues
definition: 1940-1960 -luvuilla erityisesti Chicagossa vallinnut yhtyebluesin tyyli, jolle on ominaista sähkökitaran keskeinen asema. Chicago-blues on kehittynyt Mississippi-bluesista. Tunnettuja esittäjiä ovat Muddy Waters, Elmore James ja Howlin' Wolf.
in scheme: MUSA/CILLA - Musiikin asiasanasto
related: soulblues
scope note: deprecated on 2018.10.24

cool jazz
type: Concept
created: 1996-02-07
is replaced by: Y214439
modified: 2017-09-04T13:29:26+03:00
broader: mainstream
definition: Yhdysvaltain länsirannikolla 1950-luvulla kehittynyt bebopiin pohjautuva jazz-tyyli, jossa on länsimaisesta taidemusiikista omaksuttuja piirteitä.
in scheme: MUSA/CILLA - Musiikin asiasanasto
related: west coast jazz
scope note: deprecated on 2018.10.24

west coast jazz
type: Concept
created: 1996-02-15
is replaced by: Y214718
modified: 2017-09-04T13:29:26+03:00
broader: mainstream
definition: Yhdysvaltain länsirannikolla 1950-luvulla kehittynyt mainstream-jazzin tyyli.
in scheme: MUSA/CILLA - Musiikin asiasanasto
related: cool jazz
scope note: deprecated on 2018.10.24

country-dancet (tanssit)
type: Concept
created: 1996-02-07
is replaced by: Y108496
modified: 2017-07-12T15:04:16+03:00
alternative label: country-dance (tanssit)
alternative label: country dance @sv
broader: tanssit
definition: Englantilainen 1600- ja 1700-lukujen tanssi.
in scheme: MUSA/CILLA - Musiikin asiasanasto
note: Termiä ei käytetä amerikkalaisen countryn tahtiin tanssittavista tansseista.
preferred label: country danser @sv
related: kontratanssit (tanssit)
scope note: deprecated on 2018.10.24

diminuutio
type: Concept
created: 1996-02-07
is replaced by: Y214448
modified: 2017-09-04T13:29:26+03:00
broader: rytmioppi
broader: sävellysoppi
definition: Sävelten (äänten) aika-arvojen rytmillinen tihentyminen, jonka vastakohta on additio.
in scheme: MUSA/CILLA - Musiikin asiasanasto
preferred label: diminution @sv
scope note: deprecated on 2018.10.24

divertimentot
type: Concept
created: 1996-02-07
is replaced by: Y214770
modified: 2017-09-04T13:29:26+03:00
broader: sarjat (sävellykset)
definition: Lähinnä 1700-luvun musiikissa yleinen kevyehkö, usein moniosainen, soitinsävellys.
in scheme: MUSA/CILLA - Musiikin asiasanasto
preferred label: divertimenton @sv
scope note: deprecated on 2018.10.24

dixieland
type: Concept
created: 1996-02-07
is replaced by: Y101092
modified: 2017-09-21T13:39:54+03:00
broader: traditionaalinen jazz
definition: Traditionaalisen jazzin tyylisuuntaus, joka syntyi valkoihoisten soittajien omaksuttua New Orleans -jazzille tyypillisen kollektiivisen improvisointitavan.
in scheme: MUSA/CILLA - Musiikin asiasanasto
scope note: deprecated on 2018.10.24

doo wop
type: Concept
created: 1996-02-07
is replaced by: Y214454
modified: 2017-09-04T13:29:26+03:00
broader: popmusiikki
definition: 1950-luvun lopulla kehittynyt viihteellinen, useimmiten lauluyhtyeiden esittämä rhythm & bluesista eriytynyt populaarimusiikin laji.
in scheme: MUSA/CILLA - Musiikin asiasanasto
related: rhythm and blues
scope note: deprecated on 2018.10.24

eklektismi
type: Concept
created: 1996-02-07
is replaced by: Y101122
modified: 2017-05-09T08:36:32+03:00
broader: tyylit
definition: Musiikissa eri tyylilajien ja niiden piirteiden sekoittaminen keskenään (esimerkiksi uusklassismi).
in scheme: MUSA/CILLA - Musiikin asiasanasto
note: Termiä on musiikkikäytössä aina täsmennettävä jollain musiikkitermillä, esimerkiksi säveltäminen : eklektismi.
preferred label: eklekticism @sv
related: kertaustyylit
scope note: deprecated on 2018.10.24

kertaustyylit
type: Concept
created: 1996-02-08
is replaced by: Y101124
modified: 2017-05-09T08:36:32+03:00
broader: tyylit
definition: Historiallisen tyylin ottaminen uudelleen käyttöön hieman muunneltuna, kuten esimerkiksi uusklassismissa.
in scheme: MUSA/CILLA - Musiikin asiasanasto
preferred label: imitationsstilar @sv
related: eklektismi
scope note: deprecated on 2018.10.24

elokuvat
type: Concept
created: 1996-02-07
is replaced by: Y95002
modified: 2017-05-09T08:36:33+03:00
definition: Yleisellä tasolla nimitys kaikille elokuvataiteen piirissä syntyneille teoksille.
in scheme: MUSA/CILLA - Musiikin asiasanasto
narrower: musiikkielokuvat
note: Termiä käytetään musiikin indeksoinnissa yhdistettynä johonkin musiikkitermiin, esimerkiksi elokuvat : taidemusiikki : muusikot. Jos kohteena on elokuvassa käytetty tai siihen sävelletty musiikki sinänsä, käytetään aina täsmällistä termiä elokuvamusiikki.
preferred label: filmer @sv
related: elokuvamusiikki
scope note: deprecated on 2018.10.24

rituaalimusiikki
type: Concept
created: 2002-02-20
is replaced by: Y117640
modified: 2017-05-09T08:36:46+03:00
definition: Jonkin kulttuurin juhlaviin menoihin sävelletty tai niiden yhteydessä käytettävä musiikki.
in scheme: MUSA/CILLA - Musiikin asiasanasto
note: Termiä on käytettävä aina yhdessä täsmentävien termien kanssa, jotta musiikin luonne käy ilmi, esimerkiksi rituaalimusiikki : buddhalaisuus : Tiibet.
preferred label: ritualmusik @sv
related: liturginen musiikki
related: juhlamusiikki
scope note: deprecated on 2018.10.24

henkilöhistoria
type: Concept
created: 1996-02-07
is replaced by: Y95335
modified: 2017-05-09T08:36:33+03:00
definition: Yksilön vaiheita käsittelevä julkaisu, joka ei kuitenkaan pyri olemaan koko elämän kattava elämäkerta, vaan keskittyy esimerkiksi tiettyyn ajanjaksoon.
in scheme: MUSA/CILLA - Musiikin asiasanasto
note: Jos kyseessä on kohdehenkilön itsensä kirjoittama julkaisu, käytetään lisäksi termiä muistelmat. Yhteisön vaiheista käytetään aina termiä historiikit.
preferred label: personhistoria @sv
related: historiikit
related: elämäkerrat
scope note: deprecated on 2018.10.24

foxtrotit (sävellykset)
type: Concept
created: 1996-02-07
is replaced by: Y161295
modified: 2017-07-12T15:00:53+03:00
alternative label: foksit (sävellykset)
broader: sävellykset
in scheme: MUSA/CILLA - Musiikin asiasanasto
related: tanssimusiikki
scope note: deprecated on 2018.10.24

encoret
type: Concept
created: 1996-02-07
is replaced by: Y214458
modified: 2017-09-04T13:29:26+03:00
alternative label: ylimääräiset
alternative label: extranummer @sv
broader: ohjelmistot
broader: musiikkiesitykset
definition: Esiintyvän taiteilijan varsinaisen ohjelman jatkoksi "ylimääräisinä" esitetty sävellys tai sellaisen osa.
in scheme: MUSA/CILLA - Musiikin asiasanasto
preferred label: encorer @sv
scope note: deprecated on 2018.10.24

esiintyjät
type: Concept
created: 1997-12-09
is replaced by: Y107580
modified: 2017-05-09T08:36:33+03:00
definition: Minkä tahansa esittävän taidemuodon tai viihteen lajin edustaja.
in scheme: MUSA/CILLA - Musiikin asiasanasto
narrower: solistit
note: Musiikin yhteydessä termi on syytä aina kytkeä varsinaiseen asiayhteyteen, esimerkiksi esiintyjät : viihdemusiikki : konsertit, varieteet : esiintyjät : matrikkelit.
preferred label: uppträdande @sv
related: esittäjät
scope note: deprecated on 2018.10.24

esiintyminen
type: Concept
created: 1997-12-09
is replaced by: Y110565
modified: 2017-05-09T08:36:33+03:00
definition: Minkä tahansa esittävän taidemuodon tai viihteen lajin edustajan konkreettisen toiminnan nimitys.
in scheme: MUSA/CILLA - Musiikin asiasanasto
narrower: koe-esiintyminen
preferred label: framträdande @sv
related: esittäminen
scope note: deprecated on 2018.10.24

esityskäytäntö
type: Concept
created: 1996-02-07
is replaced by: Y169086
modified: 2017-05-09T08:36:33+03:00
alternative label: historiallinen esityskäytäntö
definition: Nimitys historiallisesti ja tyylillisesti toisistaan poikkeaviin esityksiin liittyneille tavoille ja olosuhteille.
in scheme: MUSA/CILLA - Musiikin asiasanasto
note: Termiin liitetään tyyliä, musiikin lajia, soitinta tai esiintymisaikaa kuvaava termi, esimerkiksi esityskäytäntö : barokki, esityskäytäntö : barokki : viulu. Myös täsmällisempi ajallinen määre on mahdollinen, esimerkiksi esityskäytäntö : Italia : 1670-luku. Termiä voidaan käyttää sekä taide- että muun musiikin yhteydessä.
preferred label: uppförandepraxis @sv
related: tulkinta
related: esittäminen
scope note: deprecated on 2018.10.24

naiskuorot
type: Concept
created: 1996-02-07
is replaced by: Y102836
modified: 2017-09-21T13:39:55+03:00
broader: kuorot
definition: Esityskokoonpano, jossa on vain naisäänisiä laulajia (sopraanoja, mezzosopraanoja ja alttoja).
in scheme: MUSA/CILLA - Musiikin asiasanasto
note: Termiä voi käyttää sekä kokoonpanosta että tälle kokoonpanolle sävelletystä tai sillä esitetystä musiikista.
preferred label: damkörer @sv
scope note: deprecated on 2018.10.24

kirkkokuorot
type: Concept
created: 1996-02-08
is replaced by: Y102530
modified: 2017-05-09T08:36:23+03:00
broader: kuorot
definition: Funktionaalisesti kristillisen kirkon toimintaan osallistuva kuoro.
in scheme: MUSA/CILLA - Musiikin asiasanasto
note: Termiä suositellaan käytettäväksi vain musiikkikirjallisuuden yhteydessä, ei kuvaamaan yksittäisen kuoron luonnetta. Äänitteellä esiintyvän kuoron "kirkollisuuden" astetta ei ole tarkoituksenmukaista ryhtyä selvittämään.
preferred label: kyrkokörer @sv
related: kirkkomuusikot
scope note: deprecated on 2018.10.24

falsettilaulu
type: Concept
created: 1996-02-07
is replaced by: Y214460
modified: 2017-09-04T13:29:27+03:00
broader: laulaminen
definition: Miesäänen ylin rekisteri, jonka äänialue on lähellä naisääniä.
in scheme: MUSA/CILLA - Musiikin asiasanasto
preferred label: falsettsång @sv
related: kontratenori
scope note: deprecated on 2018.10.24

alkeistaso
type: Concept
created: 2004-01-14
is replaced by: Y214386
modified: 2017-09-04T13:29:49+03:00
definition: Aloittelevan laulajan tai soittajan taitotaso, jota dokumentoitava nuottijulkaisu tai opas vastaa. Termillä ei oteta kantaa laulajan tai soittajan ikään. Alkeistason nuottijulkaisu sisältää joko alun perin helppoja tai alkuperäisestä helpotettuja sovituksia.
in scheme: MUSA/CILLA - Musiikin asiasanasto
note: Jos kyseessä on selkeästi lapsille tarkoitettu aineisto, käytetään täsmenteenä termiä lapset. Termiä voi soveltaa myös laulun- ja soitonoppaiden vaatimustason määrittelyyn.
preferred label: nybörjarnivå @sv
related: keskitaso
related: edistynyt taso
scope note: deprecated on 2018.10.24

keskitaso
type: Concept
created: 2004-01-14
is replaced by: Y214521
modified: 2017-09-04T13:29:49+03:00
definition: Alkeet jo hallitsevan laulun tai soiton harrastajan taitotaso, jota dokumentoitava nuottijulkaisu tai opas vastaa ja jossa nuotit ovat normaalia yksinkertaisempia tai jonkin verran helpotettuja. Termillä ei oteta kantaa laulajan tai soittajan ikään.
in scheme: MUSA/CILLA - Musiikin asiasanasto
note: Jos kyseessä on selkeästi lapsille tarkoitettu aineisto, käytetään täsmenteenä termiä lapset. Termiä voi soveltaa myös laulun- ja soitonoppaiden vaatimustason määrittelyyn.
preferred label: medelnivå @sv
related: alkeistaso
related: edistynyt taso
scope note: deprecated on 2018.10.24

juhlaviikot
type: Concept
created: 1996-02-08
is replaced by: Y101358
modified: 2017-05-09T08:36:34+03:00
definition: Ohjelmallinen kokonaisuus, jolla on tällainen nimi.
in scheme: MUSA/CILLA - Musiikin asiasanasto
note: Termiä käytetään aina maantieteellisen tai muun täsmenteen kera, esimerkiksi juhlaviikot : Helsinki.
preferred label: festspelsveckor @sv
related: festivaalit
related: musiikkijuhlat
scope note: deprecated on 2018.10.24

pelimannimusiikki
type: Concept
created: 1996-02-08
is replaced by: Y98036
modified: 2017-05-09T08:36:34+03:00
broader: kansanmusiikki
broader: perinnemusiikki
definition: Kuulonvaraisesti siirtynyt perinteinen soitinmusiikki Pohjoismaissa (Suomi, Ruotsi, Norja, Tanska ja Islanti sekä näiden maiden siirtolaiset mm. Pohjois-Amerikassa).
in scheme: MUSA/CILLA - Musiikin asiasanasto
note: Termiä ei suositella käytettäväksi muiden maiden kansanmusiikin yhteydessä.
preferred label: spelmansmusik @sv
scope note: deprecated on 2018.10.24

free jazz
type: Concept
created: 1996-02-07
is replaced by: Y109478
modified: 2017-09-21T13:39:55+03:00
broader: jazz
definition: 1960-luvulla syntynyt kokeellinen jazzin tyylisuuntaus, jossa on pyritty eroon perinteisistä improvisointia ja yhteissoittoa koskeneista säännöistä. Tunnettuja free jazzin edustajia ovat olleet mm. Cecil Taylor, Ornette Coleman ja Art Ensemble of Chicago, Suomessa Edward Vesala.
in scheme: MUSA/CILLA - Musiikin asiasanasto
scope note: deprecated on 2018.10.24

garage rock
type: Concept
created: 1996-02-07
is replaced by: Y141509
modified: 2017-09-21T13:39:55+03:00
broader: rock
definition: Yksinkertainen ja pelkistetty rockmusiikin alalaji, joka syntyi Yhdysvalloissa 1960-luvun puolivälissä brittiläisen rhythm & bluesin inspiroimana (The Beatles, Kinks, The Rolling Stones). Tyyli koki renessanssin 1980-luvulla. Tyypillisiä edustajia ovat olleet Music Machine, Seeds, Standells ja 13th Floor Elevators.
in scheme: MUSA/CILLA - Musiikin asiasanasto
scope note: deprecated on 2018.10.24

gospelrock
type: Concept
created: 1996-02-07
is replaced by: Y141530
modified: 2017-05-09T08:36:34+03:00
broader: gospelmusiikki
broader: rock
definition: Nimitys pop- tai rock-musiikille, jonka tekstit liittävät sen hengelliseen musiikkiin. Kyseessä ei siten ole erityinen musiikillinen tyyli eikä sitä pidä sekoittaa gospelmusiikkiin.
in scheme: MUSA/CILLA - Musiikin asiasanasto
note: Termiä käytetään vain silloin, kun laulujen tekstit ovat kokonaan tai pääasiassa uskonnollisia tai hengellisiä.
scope note: deprecated on 2018.10.24

postludit
type: Concept
created: 2005-06-16
is replaced by: Y214615
modified: 2017-09-04T13:29:51+03:00
alternative label: loppusoitot
broader: sävellykset
definition: Loppusoitto, yleisimmin liturgisen musiikin yhteydessä uruilla esitettävä pikkukappale.
in scheme: MUSA/CILLA - Musiikin asiasanasto
preferred label: postludier @sv
related: preludit
scope note: deprecated on 2018.10.24

koraalikirjat
type: Concept
created: 2005-06-16
is replaced by: Y210538
modified: 2017-05-09T08:36:47+03:00
broader: nuottijulkaisut
definition: Virsien säestykset sisältävä julkaisu, jossa ei yleensä ole tekstejä.
in scheme: MUSA/CILLA - Musiikin asiasanasto
preferred label: koralböcker @sv
related: koraalivirsikirjat
scope note: deprecated on 2018.10.24

rocklyriikka
type: Concept
created: 2005-06-16
is replaced by: Y107436
modified: 2017-05-09T08:36:47+03:00
definition: Pop- ja rockmusiikkisävellysten sanoitus.
in scheme: MUSA/CILLA - Musiikin asiasanasto
note: Termiä käytetään vain pop- ja rockmusiikin yhteydessä, muuten sovelletaan termejä laululyriikka ja sanoitukset.
preferred label: rocklyrik @sv
related: laululyriikka
related: sanoitukset
scope note: deprecated on 2018.10.24

sinfoniettat
type: Concept
created: 2005-06-16
is replaced by: Y214657
modified: 2017-09-04T13:29:51+03:00
alternative label: sinfonietat
broader: sävellykset
definition: Orkesteriteoksen nimitys, sananmukaisesti "pieni sinfonia".
in scheme: MUSA/CILLA - Musiikin asiasanasto
note: Termiä käytetään vain teoksista, joille säveltäjä on antanut tällaisen nimen.
preferred label: sinfoniettor @sv
related: sinfoniat
scope note: deprecated on 2018.10.24

tanssimuusikot
type: Concept
created: 2005-06-17
is replaced by: Y112682
modified: 2017-09-21T13:40:03+03:00
broader: muusikot
definition: Muusikko, joka soittaa tanssimusiikkia esittävässä kokoonpanossa.
in scheme: MUSA/CILLA - Musiikin asiasanasto
note: Termiä käytetään lähinnä populaarimusiikin esittäjien yhteydessä.
preferred label: dansmusiker @sv
scope note: deprecated on 2018.10.24

timba
type: Concept
created: 2005-06-17
is replaced by: Y214701
modified: 2017-09-04T13:29:52+03:00
broader: latinalaisamerikkalainen populaarimusiikki
broader: latinalaisamerikkalainen musiikki
definition: Kuubalainen salsatyyli, johon on yhdistelty afro-kuubalaista perinnemusiikkia sekä jazzin, hip hopin ja funkin elementtejä.
in scheme: MUSA/CILLA - Musiikin asiasanasto
scope note: deprecated on 2018.10.24

lamentaatiot
type: Concept
created: 2005-06-17
is replaced by: Y214540
modified: 2017-09-04T13:29:52+03:00
broader: laulumusiikki
definition: Vanhan testamentin tekstiin perustuva valituslaulu. Liittyy roomalaiskatolisessa kirkossa pääsiäisviikon liturgiaan.
in scheme: MUSA/CILLA - Musiikin asiasanasto
preferred label: lamentationer @sv
related: surumusiikki
scope note: deprecated on 2018.10.24

laululyriikka
type: Concept
created: 2005-06-17
is replaced by: Y107435
modified: 2017-05-09T08:36:47+03:00
definition: Laulusävellyksiin erikseen tehty teksti tai laulusävellyksissä käytetty runo.
in scheme: MUSA/CILLA - Musiikin asiasanasto
note: Termiä käytetään sellaisista lauluteksteistä, jotka eivät ole tyylillisesti pop- tai rockmusiikkia.
preferred label: sånglyrik @sv
related: rocklyriikka
related: sanoitukset
scope note: deprecated on 2018.10.24

grunge
type: Concept
created: 1996-02-07
is replaced by: Y110032
modified: 2017-09-21T13:39:55+03:00
broader: rock
definition: Yhdysvaltain luoteisosissa 1980- ja 1990-luvun vaihteessa syntynyt rock-tyyli, jossa on punk rockin ja heavy rockin aineksia. Tunnettuja edustajia ovat olleet Foo Fighters, Mudhoney, Nirvana, Pearl Jam, Soundgarden ja Stone Temple Pilot.
in scheme: MUSA/CILLA - Musiikin asiasanasto
note: Termiä suositellaan käytettäväksi vain asiayhteydeltään selvissä tapauksissa.
scope note: deprecated on 2018.10.24

instrumentaalinen viihdemusiikki
type: Concept
created: 2005-06-17
is replaced by: Y214505
modified: 2017-09-04T13:29:52+03:00
alternative label: viihdemusiikki -- soitinmusiikki
alternative label: underhållningsmusik -- instrumentalmusik @sv
broader: viihdemusiikki
broader: soitinmusiikki
hidden label: viihdemusiikki soitinmusiikki
hidden label: underhållningsmusik instrumentalmusik @sv
in scheme: MUSA/CILLA - Musiikin asiasanasto
preferred label: instrumental underhållningsmusik @sv
scope note: deprecated on 2018.10.24

MC:t
type: Concept
created: 2005-06-17
is replaced by: Y214559
modified: 2017-06-27T13:39:50+03:00
alternative label: Master of ceremonyt
broader: muusikot
definition: Rap-musiikissa solistin (master of ceremony) nimitys.
in scheme: MUSA/CILLA - Musiikin asiasanasto
preferred label: MC @sv
related: rap
scope note: deprecated on 2018.10.24

dancehall
type: Concept
created: 2005-06-17
is replaced by: Y199292
modified: 2017-05-09T08:36:48+03:00
alternative label: ragga
alternative label: raggamuffin
broader: reggae
definition: 1980-luvun alussa Jamaikalla syntynyt reggaen laji, jonka tunnusomaisena piirteenä on DJ:n puhelaulu (toasting) yksinkertaisen konetaustan päälle. Tyyliä alettiin kutsua 1990- luvulla termillä raggamuffin (tai ragga), mutta alkuperäinen termi on sittemmin otettu uudelleen käyttöön. Tunnettuja edustajia ovat Yellowman, Elephant Man, Buju Banton, Sizzla ja Cutty Ranks.
in scheme: MUSA/CILLA - Musiikin asiasanasto
related: reggaeton
scope note: deprecated on 2018.10.24

neo-soul
type: Concept
created: 2005-06-20
is replaced by: Y214593
modified: 2017-09-04T13:29:53+03:00
alternative label: neo soul
alternative label: nu-soul
broader: popmusiikki
definition: 1990-luvulla muotoutunut perinnetietoinen soul-musiikin tyyli, jossa on tunnusomaisena piirteenä perinteisten soittimien ja soittajien käyttö. Tyypillisiä tyylin edustajia ovat Erykah Badu, Lauryn Hill, Angie Stone ja Raphael Saadiq.
in scheme: MUSA/CILLA - Musiikin asiasanasto
related: r&b
scope note: deprecated on 2018.10.24

näppäilysoittaminen
type: Concept
created: 2005-06-20
is replaced by: Y214596
modified: 2017-09-04T13:29:53+03:00
alternative label: fingerpicking
alternative label: pikkaus
broader: soittaminen
definition: Kieli- ja jousisoittimien soittotekniikka, jossa kieliä näppäillään sormilla.
in scheme: MUSA/CILLA - Musiikin asiasanasto
note: Termiä käytetään selvyyden vuoksi aina yhdessä soittimen nimen kanssa, esimerkiksi näppäilysoittaminen : kitara.
preferred label: spel på knäppinstrument @sv
related: plektrasoittaminen
scope note: deprecated on 2018.10.24

harrastajamuusikot
type: Concept
created: 1998-06-22
is replaced by: Y214478
modified: 2017-09-04T13:29:37+03:00
alternative label: amatöörimuusikot
broader: muusikot
definition: Ei-ammattimaisesti toimiva soittaja tai laulaja. Termillä ei oteta kantaa soitto- tai laulutaitoon.
in scheme: MUSA/CILLA - Musiikin asiasanasto
preferred label: amatörmusiker @sv
related: musiikin harrastaminen
scope note: deprecated on 2018.10.24

plektrasoittaminen
type: Concept
created: 2005-06-20
is replaced by: Y214612
modified: 2017-09-04T13:29:53+03:00
broader: soittaminen
definition: Kielisoittimen soittotekniikka, jossa kieliä näppäillään plektralla.
in scheme: MUSA/CILLA - Musiikin asiasanasto
preferred label: spel med plektrum @sv
related: näppäilysoittaminen
scope note: deprecated on 2018.10.24

katusoittajat
type: Concept
created: 2005-06-21
is replaced by: Y156773
modified: 2017-09-21T13:40:03+03:00
broader: muusikot
definition: Katumusiikin esittäjä.
in scheme: MUSA/CILLA - Musiikin asiasanasto
preferred label: gatumusikanter @sv
scope note: deprecated on 2018.10.24

hambo (tanssit)
type: Concept
created: 1996-02-07
is replaced by: Y216485
modified: 2017-11-02T09:01:02+02:00
broader: kansantanssit
definition: Ruotsalainen, perinteinen, polskaa muistuttava paritanssi.
in scheme: MUSA/CILLA - Musiikin asiasanasto
preferred label: hambo (dancer) @sv
related: polska (tanssit)
scope note: deprecated on 2018.10.24

new age -musiikki
type: Concept
created: 1996-02-07
is replaced by: Y107427
modified: 2017-05-09T08:36:35+03:00
definition: New age -liikkeen myötä kehittynyt musiikkityyli, joka perustuu selkeään tonaaliseen rakenteeseen. Siinä on vähän dynaamisia vaihteluita, runsaasti syntetisaattorilla tuotettuja ääniä, usein musiikkiin yhdistettynä erilaisia luonnonääniä, ja julkaisujen sekä kappaleiden nimissä viitataan usein mystiikkaan, mytologiaan, luontoon, mielenrauhaan, mietiskelyyn jne.
in scheme: MUSA/CILLA - Musiikin asiasanasto
note: New age -musiikki liittyy populaarimusiikin perinteeseen, mutta sen tarkempaa laatua on syytä täsmentää muilla termeillä, esimerkiksi new age -musiikki : soolot : piano.
preferred label: new age-musik @sv
related: ambient
related: meditaatiomusiikki
scope note: deprecated on 2018.10.24

hankaussoittimet
type: Concept
created: 1996-02-07
is replaced by: Y101527
modified: 2017-09-21T13:39:56+03:00
broader: soittimet
in scheme: MUSA/CILLA - Musiikin asiasanasto
preferred label: friktionsinstrument @sv
scope note: deprecated on 2018.10.24

altot (laulajat)
type: Concept
created: 2006-10-02
is replaced by: Y214388
modified: 2017-09-04T13:29:54+03:00
alternative label: alttolaulajat
alternative label: laulajat -- altto
alternative label: altsångare @sv
alternative label: sångare -- alt @sv
broader: naislaulajat
broader: laulajat
hidden label: laulajat altto
hidden label: sångare alt @sv
in scheme: MUSA/CILLA - Musiikin asiasanasto
preferred label: altar (sångare) @sv
scope note: deprecated on 2018.10.24

baritonit (laulajat)
type: Concept
created: 2006-10-02
is replaced by: Y214408
modified: 2017-09-04T13:29:54+03:00
alternative label: baritonilaulajat
alternative label: laulajat -- baritoni
alternative label: barytonsångare @sv
alternative label: sångare -- baryton @sv
broader: laulajat
broader: mieslaulajat
hidden label: laulajat baritoni
hidden label: sångare baryton @sv
in scheme: MUSA/CILLA - Musiikin asiasanasto
preferred label: barytoner (sångare) @sv
scope note: deprecated on 2018.10.24

bassot (laulajat)
type: Concept
created: 2006-10-02
is replaced by: Y214413
modified: 2017-09-04T13:29:54+03:00
alternative label: bassolaulajat
alternative label: laulajat -- basso
alternative label: bassångare @sv
alternative label: sångare -- bas @sv
broader: laulajat
broader: mieslaulajat
hidden label: laulajat basso
hidden label: sångare bas @sv
in scheme: MUSA/CILLA - Musiikin asiasanasto
preferred label: basar (sångare) @sv
scope note: deprecated on 2018.10.24

kontratenorit (laulajat)
type: Concept
created: 2006-10-02
is replaced by: Y214529
modified: 2017-09-04T13:29:54+03:00
alternative label: kontratenorilaulajat
alternative label: laulajat -- kontratenori
alternative label: kontratenorsångare @sv
alternative label: sångare -- kontratenor @sv
broader: laulajat
broader: mieslaulajat
hidden label: laulajat kontratenori
hidden label: sångare kontratenor @sv
in scheme: MUSA/CILLA - Musiikin asiasanasto
preferred label: kontratenorer (sångare) @sv
scope note: deprecated on 2018.10.24

sopraanot (laulajat)
type: Concept
created: 2006-10-02
is replaced by: Y214673
modified: 2017-09-04T13:29:54+03:00
alternative label: koloratuurisopraanot
alternative label: laulajat -- sopraano
alternative label: sopraanolaulajat
alternative label: koloratursopran @sv
alternative label: sopransångare @sv
alternative label: sångare -- sopran @sv
broader: naislaulajat
broader: laulajat
hidden label: laulajat sopraano
hidden label: sångare sopran @sv
in scheme: MUSA/CILLA - Musiikin asiasanasto
preferred label: sopraner (sångare) @sv
scope note: deprecated on 2018.10.24

tenorit (laulajat)
type: Concept
created: 2006-10-02
is replaced by: Y214696
modified: 2017-09-04T13:29:54+03:00
alternative label: laulajat -- tenori
alternative label: tenorilaulajat
alternative label: sångare -- tenor @sv
alternative label: tenorsångare @sv
broader: laulajat
broader: mieslaulajat
hidden label: laulajat tenori
hidden label: sångare tenor @sv
in scheme: MUSA/CILLA - Musiikin asiasanasto
preferred label: tenorer (sångare) @sv
scope note: deprecated on 2018.10.24

punk rock
type: Concept
created: 1996-02-08
is replaced by: Y505068
modified: 2017-09-04T13:29:28+03:00
broader: rock
definition: 1970-luvun puolivälissä Iso-Britanniassa kehittynyt nuorison alakulttuurin suosima musiikkityyli. Punk rock oli rockin kaupallisuutta ja raskasta sovittamista vastaan noussut kapinaliike, joka ilmeni musiikissa sanoitusten suoraviivaisuutena ja kantaaottavuutena. Sävellykset ovat yleensä lyhyitä, nopeatempoisia, dynaamisesti tasaisia, 1-3 soinnulla soitettavia pienten yhtyeiden musiikkia.
in scheme: MUSA/CILLA - Musiikin asiasanasto
preferred label: punkrock @sv
related: uusi aalto
scope note: deprecated on 2018.10.24

New Orleans -jazz
type: Concept
created: 1996-02-07
is replaced by: Y214594
modified: 2017-09-05T10:39:28+03:00
broader: traditionaalinen jazz
definition: Varhainen jazz-tyyli, joka on nimetty synnyinkaupunkinsa mukaan. Tunnettuja edustajia ovat mm. Joe "King" Oliver ja hänen Creole Jazz Band -yhtyeensä.
in scheme: MUSA/CILLA - Musiikin asiasanasto
preferred label: New Orleans jazz @sv
related: jazz
scope note: deprecated on 2018.10.24

harmoni
type: Concept
created: 1996-02-07
is replaced by: Y101548
modified: 2017-09-21T13:24:21+03:00
alternative label: urkuharmoni
alternative label: harmonium @sv
broader: kosketinsoittimet
definition: Urkujen sukuinen kosketinsoitin, jossa on yksinomaan resonaattorittomia läpilyöviä kieliäänikertoja (vapaalehdyköitä). Harmoni toimii polkimilla työstettävästä palkeistosta saatavalla paine- tai imuilmalla.
in scheme: MUSA/CILLA - Musiikin asiasanasto
preferred label: orgelharmonium @sv
scope note: deprecated on 2018.10.24

nocturnet
type: Concept
created: 1996-02-07
is replaced by: Y214792
modified: 2017-09-04T13:29:28+03:00
alternative label: nokturnit
broader: sävellykset
definition: 1700-luvulta alkaen nimitys sävellykselle, jossa on tavoiteltu "öistä" tunnelmaa. Nocturne on yleensä lyhyehkö, kolmiosainen ja tyyliltään lyyris-ekspressiivinen karaktäärikappale.
in scheme: MUSA/CILLA - Musiikin asiasanasto
preferred label: nocturner @sv
scope note: deprecated on 2018.10.24

musiikinhistoria
type: Concept
created: 1996-02-09
is replaced by: Y97555
modified: 2017-09-21T13:39:56+03:00
alternative label: musiikki -- historia
broader: historia
definition: Musiikillisten ilmiöiden tarkasteleminen historiallisesta näkökulmasta, esimerkiksi musiikinhistoria : Eurooppa : 1600-luku.
hidden label: musiikki historia
in scheme: MUSA/CILLA - Musiikin asiasanasto
note: Jos kohteena on täsmällisempi ilmiö, käytetään lisätermiä historia, esimerkiksi perinnemusiikki : historia : Venäjä.
preferred label: musikhistoria @sv
scope note: deprecated on 2018.10.24

hitit
type: Concept
created: 1996-02-07
is replaced by: Y142501
modified: 2017-05-09T08:36:35+03:00
definition: Äänitteiden myyntilistoilla menestyneiden populaarisävelmien nimitys.
in scheme: MUSA/CILLA - Musiikin asiasanasto
note: Termiä suositellaan käytettäväksi lähinnä kokoelmista, ei yksittäisistä sävelmistä.
preferred label: hits @sv
related: ikivihreät
related: iskelmät
scope note: deprecated on 2018.10.24

pianopartituurit
type: Concept
created: 1996-02-08
is replaced by: Y214610
modified: 2017-09-05T15:23:42+03:00
broader: nuottijulkaisut
broader: partituurit
definition: Partituurin erityismuoto, jossa säestävän orkesterin tai yhtyeen osuus on korvattu pianosäestyksellä.
in scheme: MUSA/CILLA - Musiikin asiasanasto
preferred label: pianopartitur @sv
scope note: deprecated on 2018.10.24

huuliharppu
type: Concept
created: 1996-02-07
is replaced by: Y101713
modified: 2017-09-21T13:39:56+03:00
broader: puhallinsoittimet
definition: Pienikokoinen vapaalehdykkäsoitin, jonka ääni syntyy ulos- ja sisäänhengityksen myötä värähtelevistä metallikielistä.
in scheme: MUSA/CILLA - Musiikin asiasanasto
preferred label: munspel @sv
scope note: deprecated on 2018.10.24

hymnologia
type: Concept
created: 1996-02-07
is replaced by: Y95460
modified: 2017-05-09T08:36:35+03:00
alternative label: virsioppi
definition: Käytännölliseen teologiaan kuuluva hymnien ja virsien tutkimus sekä tekstin että sävelmän osalta.
in scheme: MUSA/CILLA - Musiikin asiasanasto
preferred label: hymnologi @sv
related: virsilaulu
related: virret
scope note: deprecated on 2018.10.24

näyttämötaiteilijat
type: Concept
created: 1996-02-07
is replaced by: Y106360
modified: 2017-05-09T08:36:35+03:00
alternative label: estradartister @sv
definition: Yleisnimitys näyttämötaideteoksissa esiintyville eri alojen taiteilijoille.
in scheme: MUSA/CILLA - Musiikin asiasanasto
preferred label: scenartister @sv
related: laulajat
related: viihdetaiteilijat
scope note: deprecated on 2018.10.24

musiikkiohjelmat
type: Concept
created: 1996-02-09
is replaced by: Y97565
modified: 2017-09-04T13:29:29+03:00
broader: ohjelmat
definition: Nimitys joukkoviestimissä esiintyville, musiikkiin liittyville, ohjelmille.
in scheme: MUSA/CILLA - Musiikin asiasanasto
narrower: musiikkiohjelmat (televisio-ohjelmat)
preferred label: musikprogram @sv
scope note: deprecated on 2018.10.24

ohjelmistot
type: Concept
created: 1996-02-07
is replaced by: Y107868
modified: 2017-09-04T13:29:29+03:00
definition: Solistin, yhtyeen tms. esityksiin sisältyvät sävellykset ("repertuaari").
in scheme: MUSA/CILLA - Musiikin asiasanasto
narrower: encoret
note: Yhdistettynä termeihin alkeistaso ja keskitaso termiä käytetään ilmaisemaan yleisen ohjelmiston soveltuvuutta, esimerkiksi ohjelmistot : piano : alkeistaso.
preferred label: repertoarer @sv
related: ohjelmat
scope note: deprecated on 2018.10.24

oopperatalot
type: Concept
created: 1996-02-07
is replaced by: Y101981
modified: 2016-03-29T15:24:51+03:00
in scheme: MUSA/CILLA - Musiikin asiasanasto
preferred label: operahus @sv
related: musiikkiteatterit
related: konserttitalot
scope note: deprecated on 2018.10.24

konserttitalot
type: Concept
created: 1996-02-08
is replaced by: Y101979
modified: 2017-05-09T08:36:36+03:00
definition: Konserttisalin ja muita konserttitoiminnassa tarpeellisia tiloja sisältävä rakennus.
in scheme: MUSA/CILLA - Musiikin asiasanasto
preferred label: konserthus @sv
related: oopperatalot
related: konserttisalit
scope note: deprecated on 2018.10.24

monikuoroisuus
type: Concept
created: 2011-04-05
is replaced by: Y214578
modified: 2017-09-04T13:29:56+03:00
broader: kuoromusiikki
broader: monikuoroinen musiikki
definition: Venetsiassa 1500-luvulla syntynyt sävellystyyli, joka hyödyntää ison esitystilan (vrt. Pyhän Markuksen tuomiokirkko) fyysisiä ulottuvuuksia sijoittamalla useita eri kuoro- tai orkesterisektioita tilan eri osiin.
in scheme: MUSA/CILLA - Musiikin asiasanasto
preferred label: flerkörighet @sv
scope note: deprecated on 2018.10.24

ornamentiikka
type: Concept
created: 1996-02-07
is replaced by: Y216666
modified: 2017-09-04T13:29:29+03:00
alternative label: korukuviointi
alternative label: korukuviot
alternative label: mordentit
alternative label: ornamentit
alternative label: trillit
alternative label: ornament @sv
broader: tulkinta
definition: Musiikinteoreettinen termi varsinaiseen melodiaan lisättäville vähäisille sävelille ja sävelryhmille (esimerkiksi trilli ja arpeggio).
in scheme: MUSA/CILLA - Musiikin asiasanasto
narrower: koloratuuri
preferred label: ornamentik @sv
scope note: deprecated on 2018.10.24

otetaulukot
type: Concept
created: 1996-02-07
is replaced by: Y214605
modified: 2017-09-04T13:29:29+03:00
alternative label: sointuotteet
alternative label: sointutaulukot
alternative label: sormitustaulukot
definition: Taulukon muotoinen ohje, jonka avulla ilmaistaan minkä tahansa soittimen sormitusta tai muuta vastaavaa ominaisuutta.
in scheme: MUSA/CILLA - Musiikin asiasanasto
note: Termiin liitetään aina kyseessä olevan soittimen nimi, esimerkiksi otetaulukot : banjo.
preferred label: grepptabeller @sv
related: sormitukset
related: sointuoppaat
scope note: deprecated on 2018.10.24

hard bop
type: Concept
created: 1996-02-07
is replaced by: Y214474
modified: 2017-09-04T13:29:29+03:00
alternative label: hardbop
alternative label: neobop
broader: jazz
definition: Bebopin pohjalta 1950-luvun puolessavälissä kehittynyt jazzin tyylisuunta, jonka tunnettuja edustajia ovat olleet mm. Art Blakey ja Sonny Rollins.
in scheme: MUSA/CILLA - Musiikin asiasanasto
related: bebop
scope note: deprecated on 2018.10.24

swing
type: Concept
created: 1996-02-08
is replaced by: Y101930
modified: 2017-09-21T13:39:57+03:00
broader: jazz
definition: Yhdysvalloissa 1930-luvulla kehittynyt jazz-tyyli, jolle ovat ominaista walking bass -perusta, usein big band -kokoonpano ja suhteellisen viihteellinen esitystapa ja ohjelmisto.
in scheme: MUSA/CILLA - Musiikin asiasanasto
scope note: deprecated on 2018.10.24

albumit
type: Concept
created: 2012-02-28
is replaced by: Y216665
modified: 2017-05-09T08:36:50+03:00
alternative label: minialbumit
alternative label: pitkäsoittolevyt
alternative label: studioalbumit
alternative label: verkkoalbumit
alternative label: fullängdare @sv
alternative label: musikalbum @sv
definition: EP:tä laajempi, yleensä yli neljä kappaletta (raitaa) sisältävä julkaisukokonaisuus.
in scheme: MUSA/CILLA - Musiikin asiasanasto
preferred label: album @sv
related: EP:t
related: singlet
scope note: deprecated on 2018.10.24

EP:t
type: Concept
created: 2012-02-28
is replaced by: Y214459
modified: 2017-09-04T13:29:56+03:00
alternative label: EP-levyt
alternative label: eepeet
alternative label: EP-skivor @sv
definition: Singleä laajempi, mutta albumia suppeampi julkaisukokonaisuus, jonka nimitys tulee sanoista extended play.
in scheme: MUSA/CILLA - Musiikin asiasanasto
preferred label: EP:s @sv
related: albumit
related: singlet
scope note: deprecated on 2018.10.24

singlet
type: Concept
created: 2012-02-28
is replaced by: Y214658
modified: 2017-09-04T13:29:56+03:00
alternative label: maxisinglet
alternative label: sinkut (äänitteet)
alternative label: singelskivor @sv
definition: Yleensä yhden tai kahden kappaleen (raidan) muodostama julkaisukokonaisuus.
in scheme: MUSA/CILLA - Musiikin asiasanasto
preferred label: singlar @sv
related: albumit
related: EP:t
scope note: deprecated on 2018.10.24

choro
type: Concept
created: 2012-02-28
is replaced by: Y214435
modified: 2017-07-12T14:37:28+03:00
alternative label: chorinho
broader: latinalaisamerikkalainen populaarimusiikki
definition: Brasilialaisen populaarimusiikin tyylilaji.
in scheme: MUSA/CILLA - Musiikin asiasanasto
related: tanssimusiikki
scope note: deprecated on 2018.10.24

pienoispartituurit
type: Concept
created: 2012-02-28
is replaced by: Y185564
modified: 2017-09-21T13:40:04+03:00
alternative label: miniature score
alternative label: study score
alternative label: fickpartitur @sv
broader: partituurit
definition: Pienennetyssä muodossa julkaistu partituuri, jota ei ole ensisijaisesti tarkoitettu esityskäyttöön.
in scheme: MUSA/CILLA - Musiikin asiasanasto
preferred label: studiepartitur @sv
scope note: deprecated on 2018.10.24

indie rock
type: Concept
created: 1996-02-08
is replaced by: Y151196
modified: 2017-09-21T13:39:57+03:00
alternative label: alternative rock
alternative label: vaihtoehtorock
broader: rock
definition: 1980-luvulla syntynyt rock-musiikin alalaji, joka alun perin liittyi musiikin julkaisemiseen itsenäisten levy-yhtiöiden kautta (termin alkuosa indie tulee englanninkielen sanasta "independent"). Indie rockin tyylillisiksi piirteiksi ovat muotoutuneet punkin ja vaihtoehtorockin estetiikka.
in scheme: MUSA/CILLA - Musiikin asiasanasto
note: Määrittelyn vaikeuden takia termiä suositellaan käytettäväksi erittäin harkiten ja lähinnä asiayhteydeltään selvissä tapauksissa.
scope note: deprecated on 2018.10.24

progressiivinen rock
type: Concept
created: 1996-02-08
is replaced by: Y128892
modified: 2017-09-21T13:39:57+03:00
broader: rock
definition: Taiteellisesti kunnianhimoinen rock-tyyli, jolle on luonteenomaista virtuoosimainen soittimien käsittely, monipolviset kappalerakenteet ja rytmiikka sekä mahdolliset vaikutteet jazzista tai taidemusiikista.
in scheme: MUSA/CILLA - Musiikin asiasanasto
note: Koska määrittely ja rajanveto on muiden rock-tyylien lailla hankalaa, suositellaan lisäksi käytettäväksi aina myös termiä rock.
preferred label: progressiv rock @sv
scope note: deprecated on 2018.10.24

pelimusiikki
type: Concept
created: 2014-05-27
is replaced by: Y214608
modified: 2017-09-04T13:29:57+03:00
alternative label: digitaalipelimusiikki
alternative label: konsolipelimusiikki
alternative label: mobiilipelimusiikki
alternative label: tietokonepelimusiikki
alternative label: verkkopelimusiikki
alternative label: videopelimusiikki
broader: musiikki
definition: Kaikenlaisten fyysisten, analogisten ja digitaalisten pelien yhteyteen sävelletty tai muokattu ja niiden pelaamisen tai seuraamisen aikana soitettavaksi ja kuultavaksi tarkoitettu musiikki. Termiä voi myös käyttää silloin, kun kyse on pelimusiikiksi sävelletystä musiikista, joka esiintyy muussa yhteydessä.
in scheme: MUSA/CILLA - Musiikin asiasanasto
preferred label: spelmusik @sv
related: näyttämömusiikki
scope note: deprecated on 2018.10.24

teknorock
type: Concept
created: 1996-02-09
is replaced by: Y218841
modified: 2017-09-04T13:29:30+03:00
alternative label: Krautrock
broader: rock
definition: 1970-luvulla lähinnä Saksassa kehittynyt rock-tyyli ("Krautrock"), jossa oli keskeinen asema konemaisella rytmillä ja varhaisilla syntetisaattoreilla (esimerkiksi Kraftwerk-yhtye).
in scheme: MUSA/CILLA - Musiikin asiasanasto
note: Termiä ei käytetä myöhempien aikojen teknomusiikin kuvaamiseen.
preferred label: technorock @sv
related: tekno
scope note: deprecated on 2018.10.24

litaniat
type: Concept
created: 2014-12-09
is replaced by: Y214545
modified: 2017-09-04T13:29:57+03:00
broader: kirkkomusiikki
broader: laulumusiikki
definition: Vokaaliteos, joka on sävelletty esitettäväksi osana roomalaiskatolisen kirkon liturgiaa lausutun litaniarukouksen sijaan.
in scheme: MUSA/CILLA - Musiikin asiasanasto
preferred label: litanior @sv
scope note: deprecated on 2018.10.24

uusi aalto
type: Concept
created: 1996-02-09
is replaced by: Y214714
modified: 2017-09-04T13:29:30+03:00
alternative label: new wave
broader: rock
definition: 1970-luvun lopulle ja 1980-luvun alkupuolelle ajoittuva punk rockiin pohjautuva rock- ja popmusiikin tyyli, jossa punkin tyylilliset ja asenteelliset seikat yhdistyivät siistitympään muotoon.
in scheme: MUSA/CILLA - Musiikin asiasanasto
note: Termiä käytetään aina ajallisen ja maantieteellisen määreen kanssa.
preferred label: nya vågen @sv
related: punk rock
scope note: deprecated on 2018.10.24

kotimusiikki
type: Concept
created: 1996-02-08
is replaced by: Y214532
modified: 2017-09-04T13:29:30+03:00
alternative label: Hausmusik
broader: musiikki
definition: Harrastelijoille kotona soitettavaksi sävelletty musiikki ja tämän musiikin esitykset.
in scheme: MUSA/CILLA - Musiikin asiasanasto
preferred label: hemmamusik @sv
related: käyttömusiikki
scope note: deprecated on 2018.10.24

käyttömusiikki
type: Concept
created: 1996-02-08
is replaced by: Y214538
modified: 2017-09-04T13:29:30+03:00
broader: musiikki
in scheme: MUSA/CILLA - Musiikin asiasanasto
preferred label: bruksmusik @sv
related: kotimusiikki
scope note: deprecated on 2018.10.24

lastenmusiikki
type: Concept
created: 1996-02-08
is replaced by: Y103017
modified: 2017-09-21T13:39:57+03:00
definition: Yleisesti lasten käyttöön tarkoitettu musiikki, myös sellainen, johon ei liity tekstiä, selostusta tai leikkiohjeita.
in scheme: MUSA/CILLA - Musiikin asiasanasto
narrower: lastenlaulut
note: Termiä suositellaan käytettäväksi lähinnä silloin, kun indeksoidaan asiaa sinänsä, ei yksittäisiä sävellyksiä. Termiä ei suositella käytettäväksi esimerkiksi nuorille soittajille tarkoitettujen harjoituskappaleita sisältävien kokoelmien yhteydessä.
preferred label: barnmusik @sv
scope note: deprecated on 2018.10.24

salonkimusiikki
type: Concept
created: 1996-02-08
is replaced by: Y214646
modified: 2017-09-04T13:29:30+03:00
broader: viihdemusiikki
definition: 1800-luvun alusta lähtien lähinnä porvariston huvitukseksi kodeissa ja ravintoloissa esitetty musiikki, jota esitettiin pääasiassa taidemusiikin soittimin pienellä orkesterilla, yhtyeellä (jouset, puupuhaltimia) tai pelkällä pianolla. Salonkimusiikki on usein sovitettu suosituista ooppera- ja operettilauluista, mutta sitä on myös sävelletty tähän tarkoitukseen. Salonkimusiikki on yhteiskunnallisena ilmiönä osa viihdekulttuuria, mutta musiikillisesti lähempänä taide- kuin populaarimusiikkia.
in scheme: MUSA/CILLA - Musiikin asiasanasto
preferred label: salongsmusik @sv
related: taidemusiikki
scope note: deprecated on 2018.10.24

työväenmusiikki
type: Concept
created: 1996-02-09
is replaced by: Y104711
modified: 2017-09-21T13:39:58+03:00
definition: Eri tavoin järjestäytyneen työväenliikkeen tilaisuuksia varten luotu ja sovitettu musiikki.
in scheme: MUSA/CILLA - Musiikin asiasanasto
narrower: työväenlaulut
note: Termiä käytetään lähinnä soitinmusiikista, koska lauluille on olemassa täsmällinen terminsä, esimerkiksi työväenmusiikki : puhallinorkesterit.
preferred label: arbetarklassens musik @sv
scope note: deprecated on 2018.10.24

ympäristömusiikki
type: Concept
created: 1996-02-15
is replaced by: Y214734
modified: 2017-09-04T13:29:30+03:00
broader: äänitaide
definition: Tietyssä tilassa soimaan sävelletty teos (englannin kielessä yleensä enviromental music, sound sculpture). Ympäristömusiikkiin voidaan liittää musiikin lisäksi myös muita ääniä, visuaalisuutta ja multimediaa.
in scheme: MUSA/CILLA - Musiikin asiasanasto
preferred label: miljömusik @sv
related: ambient
scope note: deprecated on 2018.10.24

folkblues
type: Concept
created: 1996-02-07
is replaced by: Y214464
modified: 2017-09-04T13:29:30+03:00
broader: country blues
definition: Country bluesin yksinkertainen ja akustinen tyyli, joka on pehmeämpää ja balladimaisempaa kuin Mississippi-blues. Tyylin tunnettuja edustajia ovat mm. Mississippi John Hurt, Leadbelly ja Josh White.
in scheme: MUSA/CILLA - Musiikin asiasanasto
related: Mississippi-blues
scope note: deprecated on 2018.10.24

rekisteröinti
type: Concept
created: 1996-02-08
is replaced by: Y505969
modified: 2017-05-09T08:36:37+03:00
broader: tulkinta
definition: Urkujen (soveltaen myös sähköisten kosketinsoittimien) äänikertojen valitseminen halutun soinnin aikaansaamiseksi.
in scheme: MUSA/CILLA - Musiikin asiasanasto
note: Termiä on käytettävä aina yhdistettynä soittimen nimeen, esimerkiksi rekisteröinti : urut, rekisteröinti : sähköurut.
preferred label: registrering @sv
related: soittaminen
scope note: deprecated on 2018.10.24

signaalitorvi
type: Concept
created: 1996-02-08
is replaced by: Y214654
modified: 2017-09-04T13:29:31+03:00
broader: puhallinsoittimet
broader: signaalisoittimet
definition: Yksinkertainen trumpettisoitin, jolla voidaan soittaa vain luonnonsäveliä.
in scheme: MUSA/CILLA - Musiikin asiasanasto
preferred label: signalhorn @sv
scope note: deprecated on 2018.10.24

säkkipilli
type: Concept
created: 1996-02-08
is replaced by: Y124660
modified: 2017-09-21T13:39:58+03:00
broader: puhallinsoittimet
definition: Puhallinsoitin, jonka ääni syntyy joko puhalluspilliin puhaltamalla tai palkeiden kautta ilman siirtyessä säkkiin ja siitä soiviin pilleihin.
in scheme: MUSA/CILLA - Musiikin asiasanasto
preferred label: säckpipa @sv
scope note: deprecated on 2018.10.24

kontratenori
type: Concept
created: 1996-02-08
is replaced by: Y214528
modified: 2017-09-04T13:29:31+03:00
broader: äänialat
definition: Alton äänialaa vastaava miesääni, joka voi olla luonnollinen tai falsettilaululla saavutettu.
in scheme: MUSA/CILLA - Musiikin asiasanasto
preferred label: kontratenor @sv
related: falsettilaulu
scope note: deprecated on 2018.10.24

viola d'amore
type: Concept
created: 1996-02-15
is replaced by: Y214726
modified: 2017-09-04T13:29:31+03:00
broader: jousisoittimet
definition: 1600- ja 1700-luvuilla yleinen alttoviulun kaltainen soitin, joka kuitenkin muistuttaa ulkoisesti enemmän viola da gambaa.
in scheme: MUSA/CILLA - Musiikin asiasanasto
related: alttoviulu
scope note: deprecated on 2018.10.24

violone
type: Concept
created: 1996-02-15
is replaced by: Y214727
modified: 2017-09-04T13:29:31+03:00
broader: jousisoittimet
definition: Termiä käytetään usein matalaäänisimmästä viola da gambasta, mutta historiallisesti sitä on käytetty myös erilaisista modernin kontrabasson edeltäjistä.
in scheme: MUSA/CILLA - Musiikin asiasanasto
related: kontrabasso
scope note: deprecated on 2018.10.24

virsikantele
type: Concept
created: 1996-02-15
is replaced by: Y101961
modified: 2017-09-21T13:39:58+03:00
broader: jousisoittimet
definition: Pohjoismaissa 1800-luvun alkupuolella käyttöön otettu kirkkolaulun tason parantamiseksi kehitetty, jousella soitettava monokordi. Sittemmin soittimen käyttöalue on laajentunut.
in scheme: MUSA/CILLA - Musiikin asiasanasto
preferred label: psalmodikon @sv
scope note: deprecated on 2018.10.24

konserttitoiminta
type: Concept
created: 1996-02-08
is replaced by: Y102661
modified: 2017-09-21T13:39:59+03:00
definition: Musiikkikonserttien järjestämiseksi ja toteuttamiseksi tehtävä työ.
in scheme: MUSA/CILLA - Musiikin asiasanasto
preferred label: konsertverksamhet @sv
related: orkesteritoiminta
scope note: deprecated on 2018.10.24

rumbat
type: Concept
created: 1996-02-08
is replaced by: Y104211
modified: 2017-05-09T08:36:23+03:00
broader: latinalaisamerikkalainen populaarimusiikki
broader: latinalaistanssit
definition: Afrokuubalainen tanssi, jonka säestyssoittimena on trubadores-rummut. Termiä käytetään joskus virheellisesti kaiken kuubalaisen tanssimusiikin nimityksenä.
in scheme: MUSA/CILLA - Musiikin asiasanasto
note: Termiä käytetään sekä tanssista että sitä varten sävelletystä musiikista, esimerkiksi rumbat : laulajat : Kuuba.
preferred label: rumba @sv
scope note: deprecated on 2018.10.24

viritys
type: Concept
created: 1996-02-15
is replaced by: Y104872
modified: 2017-05-09T08:36:38+03:00
alternative label: stämning -- musikinstrument @sv
alternative label: tempererad stämning @sv
definition: Soittimen tuottamien äänten keskinäisten suhteiden säätäminen.
hidden label: stämning musikinstrument @sv
in scheme: MUSA/CILLA - Musiikin asiasanasto
note: Termillä tarkoitetaan musiikillisten soittimien virittämistä, ei esimerkiksi elektronisten laitteiden säätämistä.
preferred label: stämning (instrument) @sv
related: viritysjärjestelmät
related: soittaminen
scope note: deprecated on 2018.10.24

monikuoroinen musiikki
type: Concept
created: 2016-09-01
is replaced by: Y214577
modified: 2017-09-05T10:16:16+03:00
alternative label: monikuoromusiikki
broader: musiikki
definition: Musiikki, joka on sävelletty cori spezzati -tekniikalla eli jonka esittäminen vaatii esittäjistön jakamisen kahdeksi tai useammaksi, usein erilleen toisistaan sijoitetuksi ryhmäksi.
in scheme: MUSA/CILLA - Musiikin asiasanasto
narrower: monikuoroisuus
scope note: deprecated on 2018.10.24

signaalisoittimet
type: Concept
created: 1996-02-08
is replaced by: Y214653
modified: 2017-06-28T10:52:00+03:00
broader: soittimet
in scheme: MUSA/CILLA - Musiikin asiasanasto
narrower: signaalitorvi
preferred label: signalinstrument @sv
scope note: deprecated on 2018.10.24

edistynyt taso
type: Concept
created: 2016-10-26
is replaced by: Y214455
modified: 2017-09-04T13:29:58+03:00
alternative label: haastava taso
alternative label: vaativa taso
alternative label: ylin taso
definition: Edistyneen laulajan tai soittajan taitotaso, jota kuvailtava nuottijulkaisu tai opas vastaa. Termillä ei oteta kantaa laulajan tai soittajan ikään.
in scheme: MUSA/CILLA - Musiikin asiasanasto
note: Jos kyseessä on selkeästi lapsille tarkoitettu aineisto, käytetään täsmenteenä termiä lapset. Termiä voi soveltaa myös laulun- ja soitonoppaiden vaatimustason määrittelyyn.
preferred label: avancerad nivå @sv
related: alkeistaso
related: keskitaso
scope note: deprecated on 2018.10.24

soitinluokitukset
type: Concept
created: 1996-02-08
is replaced by: Y104356
modified: 2017-09-21T13:24:22+03:00
definition: Systemaattinen soitinten ryhmittely ominaisuuksiensa, soittotapojensa tai muiden piirteiden perusteella.
in scheme: MUSA/CILLA - Musiikin asiasanasto
preferred label: musikinstrumentsystematik @sv
related: soittimet
scope note: deprecated on 2018.10.24

beguine (tanssit)
type: Concept
created: 1998-07-07
is replaced by: Y214765
modified: 2017-07-13T09:50:00+03:00
broader: tanssit
definition: Latinalaisamerikkalainen paritanssi.
in scheme: MUSA/CILLA - Musiikin asiasanasto
preferred label: beguine @sv
scope note: deprecated on 2018.10.24

bolero (tanssit)
type: Concept
created: 2017-06-26
is replaced by: Y214763
modified: 2017-09-04T13:30:05+03:00
broader: tanssit
definition: Alun perin andalusialainen tanssi, josta on kehittynyt erilaisia populaareja tyylejä Espanjassa ja latinalaisessa Amerikassa.
in scheme: MUSA/CILLA - Musiikin asiasanasto
scope note: deprecated on 2018.10.24

cancan (tanssit)
type: Concept
created: 1998-07-07
is replaced by: Y214759
modified: 2017-07-18T11:46:04+03:00
broader: tanssit
definition: 1800-luvulla suosituksi tullut seuratanssi.
in scheme: MUSA/CILLA - Musiikin asiasanasto
preferred label: cancan @sv
scope note: deprecated on 2018.10.24

divertissementit
type: Concept
created: 2017-07-11
is replaced by: Y214771
modified: 2017-09-04T13:30:06+03:00
broader: oopperat
definition: Ranskalaisen barokkioopperan yleensä pienimuotoinen ja tarinaltaan yksittäiseen tunnetilaan painottuva yksinäytöksinen alalaji.
in scheme: MUSA/CILLA - Musiikin asiasanasto
scope note: deprecated on 2018.10.24

fandango (tanssit)
type: Concept
created: 2005-06-20
is replaced by: Y214774
modified: 2017-07-18T11:49:14+03:00
broader: tanssit
definition: Nopeatempoinen kolmijakoinen laajalle levinnyt espanjalainen tanssi.
in scheme: MUSA/CILLA - Musiikin asiasanasto
preferred label: fandango @sv
scope note: deprecated on 2018.10.24

gavotti (tanssit)
type: Concept
created: 2017-07-11
is replaced by: Y214777
modified: 2017-07-18T11:49:34+03:00
broader: tanssit
definition: Alkujaan 1500-luvun ranskalainen kansantanssi, joka oli suosittu seuratanssi 1500–1700-luvuilla.
in scheme: MUSA/CILLA - Musiikin asiasanasto
scope note: deprecated on 2018.10.24

lopukkeet
type: Concept
created: 2017-07-11
is replaced by: Y214779
modified: 2017-09-04T13:30:06+03:00
alternative label: sointulopuke
broader: sointuoppi
definition: Sointukulku, joka päättää sävellyksen tai sen osan.
in scheme: MUSA/CILLA - Musiikin asiasanasto
scope note: deprecated on 2018.10.24

katrilli (tanssit)
type: Concept
created: 2017-07-11
is replaced by: Y214780
modified: 2017-09-04T13:30:06+03:00
alternative label: ruotsinkatrilli (tanssit)
alternative label: venäjänkatrilli (tanssit)
broader: kontratanssit (tanssit)
definition: Neliömuodossa tanssittava seuratanssi, joka oli erityisen suosittu 1800-luvulla.
in scheme: MUSA/CILLA - Musiikin asiasanasto
scope note: deprecated on 2018.10.24

minstrel show -esiintyjät
type: Concept
created: 2017-07-11
is replaced by: Y214789
modified: 2017-09-04T13:30:06+03:00
broader: viihdetaiteilijat
definition: Yhdysvalloissa 1800-luvulla suosittu viihdemuoto minstrel show oli laulua, tanssia ja teatteria yhdistävä esitys, jossa perinteisesti karrikoitiin mustien ulkonäköä, tanssia ja laulua. Yleensä minstrel show -esiintyjät olivat valkoisia viihdetaiteilijoita, jotka maalasivat kasvonsa mustiksi.
in scheme: MUSA/CILLA - Musiikin asiasanasto
note: Termin lisäksi on syytä käyttää maantieteellisiä ja ajallisia täsmenteitä.
scope note: deprecated on 2018.10.24

moriska (tanssit)
type: Concept
created: 2005-06-17
is replaced by: Y214790
modified: 2017-09-04T13:30:06+03:00
broader: tanssit
definition: Espanjalainen keskiajalta peräisin oleva kansantanssi. Moriskaa tanssitaan riveihin asettuneissa ryhmissä. Tanssijoilla on kepit tai miekat ja kulkusilla koristellut vaatteet.
in scheme: MUSA/CILLA - Musiikin asiasanasto
preferred label: morisca @sv
scope note: deprecated on 2018.10.24

notturnot
type: Concept
created: 2017-07-11
is replaced by: Y214793
modified: 2017-09-04T13:30:06+03:00
broader: sarjat (sävellykset)
definition: 1700-luvulta peräisin oleva moniosainen soitinsävellys, joka perinteisesti esitettiin ulkona yöaikaan.
in scheme: MUSA/CILLA - Musiikin asiasanasto
scope note: deprecated on 2018.10.24

pasodoble (tanssit)
type: Concept
created: 1998-07-08
is replaced by: Y214794
modified: 2017-07-18T11:53:30+03:00
broader: latinalaistanssit
definition: Latinalaistansseihin kuuluvan seuratanssin nimitys.
in scheme: MUSA/CILLA - Musiikin asiasanasto
preferred label: pasodoble @sv
scope note: deprecated on 2018.10.24

passepied (tanssit)
type: Concept
created: 2005-06-20
is replaced by: Y214796
modified: 2017-09-04T13:30:06+03:00
broader: tanssit
definition: Ranskalaisperäinen tanssi, joka esiintyy usein soitinsarjojen osana.
in scheme: MUSA/CILLA - Musiikin asiasanasto
preferred label: passepied @sv
scope note: deprecated on 2018.10.24

pavana (tanssit)
type: Concept
created: 2005-06-20
is replaced by: Y214798
modified: 2017-09-04T13:30:06+03:00
broader: tanssit
definition: 1500-luvulta Italiasta peräisin oleva tanssi, jota tanssitaan jonomuodostelmassa.
in scheme: MUSA/CILLA - Musiikin asiasanasto
preferred label: pavane @sv
scope note: deprecated on 2018.10.24

tarantella (tanssit)
type: Concept
created: 1998-07-08
is replaced by: Y214804
modified: 2017-09-04T13:30:06+03:00
broader: tanssit
definition: 1300-luvulta lähtien tunnettu italialainen kansantanssi Napolin seudulta.
in scheme: MUSA/CILLA - Musiikin asiasanasto
preferred label: tarantella @sv
scope note: deprecated on 2018.10.24

twist (tanssit)
type: Concept
created: 2005-06-17
is replaced by: Y214808
modified: 2017-09-04T13:30:06+03:00
broader: tanssit
definition: 1950-luvun puolivälissä Yhdysvalloissa syntynyt ja 1960-luvun alussa maailmalle levinnyt popmusiikin tahdissa tanssittava tanssi.
in scheme: MUSA/CILLA - Musiikin asiasanasto
preferred label: twist @sv
scope note: deprecated on 2018.10.24

jenkat (sävellykset)
type: Concept
created: 2017-07-12
is replaced by: Y101934
modified: 2017-07-12T14:58:38+03:00
alternative label: saksanpolkat (sävellykset)
alternative label: sottiisit (sävellykset)
broader: sävellykset
in scheme: MUSA/CILLA - Musiikin asiasanasto
related: tanssimusiikki
scope note: deprecated on 2018.10.24

csárdásit (sävellykset)
type: Concept
created: 2017-07-12
is replaced by: Y214444
modified: 2017-07-12T15:02:11+03:00
broader: sävellykset
in scheme: MUSA/CILLA - Musiikin asiasanasto
related: tanssimusiikki
scope note: deprecated on 2018.10.24

humpat (sävellykset)
type: Concept
created: 2017-07-12
is replaced by: Y101694
modified: 2017-07-12T15:11:21+03:00
broader: sävellykset
in scheme: MUSA/CILLA - Musiikin asiasanasto
related: tanssimusiikki
scope note: deprecated on 2018.10.24

masurkat (sävellykset)
type: Concept
created: 1998-06-25
is replaced by: Y103439
modified: 2017-07-12T15:15:22+03:00
broader: sävellykset
in scheme: MUSA/CILLA - Musiikin asiasanasto
preferred label: masurkor @sv
related: tanssimusiikki
scope note: deprecated on 2018.10.24

menuetit (sävellykset)
type: Concept
created: 1998-06-26
is replaced by: Y103464
modified: 2017-07-12T15:17:11+03:00
broader: sävellykset
in scheme: MUSA/CILLA - Musiikin asiasanasto
preferred label: menuetter @sv
related: tanssimusiikki
scope note: deprecated on 2018.10.24

polkat (sävellykset)
type: Concept
created: 1998-06-30
is replaced by: Y103985
modified: 2017-07-12T15:18:17+03:00
broader: sävellykset
in scheme: MUSA/CILLA - Musiikin asiasanasto
preferred label: polkor @sv
related: tanssimusiikki
scope note: deprecated on 2018.10.24

poloneesit (sävellykset)
type: Concept
created: 1998-06-30
is replaced by: Y103987
modified: 2017-07-12T15:23:09+03:00
broader: sävellykset
in scheme: MUSA/CILLA - Musiikin asiasanasto
preferred label: polonäser @sv
related: tanssimusiikki
scope note: deprecated on 2018.10.24

valssi (tanssit)
type: Concept
created: 2017-07-13
is replaced by: Y214812
modified: 2017-09-04T13:30:06+03:00
broader: tanssit
definition: Kansanomaista alkuperää oleva kolmijakoinen tanssi, joka alkoi yleistyä 1700-luvun lopulla. Valssi on eri muodoissaan yksi suosituimmista edelleen tanssittavista tansseista.
in scheme: MUSA/CILLA - Musiikin asiasanasto
scope note: deprecated on 2018.10.24

zarzuelat
type: Concept
created: 1996-02-15
is replaced by: Y214736
modified: 2017-09-04T13:29:32+03:00
broader: oopperat
definition: Barokin aikana kehittynyt espanjalainen oopperatyyli, jonka kansanomaisempi muoto alkoi kehittyä 1850-luvulta lähtien.
in scheme: MUSA/CILLA - Musiikin asiasanasto
preferred label: zarzuela @sv
related: tonadillat
scope note: deprecated on 2018.10.24

slide-kitara
type: Concept
created: 1996-02-08
is replaced by: Y214662
modified: 2017-09-04T13:29:32+03:00
broader: soittaminen
definition: Kitaransoittotyyli, jossa kitaristi pitää oikeassa kädessään putkea tai muuta esinettä, joka määrää äänenkorkeuden sen sijaan, että nuotti painettaisiin otelaudalta sormella.
in scheme: MUSA/CILLA - Musiikin asiasanasto
preferred label: slide guitar @sv
related: kitara
scope note: deprecated on 2018.10.24

jodlaus
type: Concept
created: 1996-02-08
is replaced by: Y101936
modified: 2017-09-21T13:39:59+03:00
broader: laulaminen
definition: Lähinnä vain Euroopan Alppien seuduilla yleinen laulutapa, jolle ovat ominaisia nopeat ja laajat intervallihypyt normaali- ja falsettiäänen välillä. Jodlaus ei ole musiikillisen tyylin tai sävellystyypin nimi.
in scheme: MUSA/CILLA - Musiikin asiasanasto
preferred label: joddling @sv
scope note: deprecated on 2018.10.24

sinfoniaorkesterit
type: Concept
created: 1996-02-08
is replaced by: Y103810
modified: 2017-10-10T11:08:07+03:00
broader: orkesterit
definition: Orkesteri, jossa on tyypillisesti 70-100 soittajaa ja jonka soittimisto koostuu vähintään jousi- ja puhallinsoitinryhmistä.
in scheme: MUSA/CILLA - Musiikin asiasanasto
preferred label: symfoniorkestrar @sv
scope note: deprecated on 2018.10.24

viihdeorkesterit
type: Concept
created: 1996-02-15
is replaced by: Y103811
modified: 2017-09-21T13:24:22+03:00
broader: orkesterit
definition: Suurehko yhtye- tai orkesterikokoonpano, jolla esitetään viihdemusiikkia.
in scheme: MUSA/CILLA - Musiikin asiasanasto
preferred label: underhållningsorkestrar @sv
scope note: deprecated on 2018.10.24

cowboylaulut
type: Concept
created: 1996-02-07
is replaced by: Y214442
modified: 2017-09-04T13:29:32+03:00
broader: laulut
broader: country and western
definition: Country-musiikin piiriin kuuluva laulu, jonka teksti liittyy tavalla tai toisella Pohjois-Amerikan valkoihoisten karjapaimenten elämään ja elämäntyyliin.
in scheme: MUSA/CILLA - Musiikin asiasanasto
preferred label: cowboysånger @sv
scope note: deprecated on 2018.10.24

Mississippi-blues
type: Concept
created: 1996-02-09
is replaced by: Y214575
modified: 2017-06-27T15:03:14+03:00
broader: country blues
definition: Country bluesin keskeisin alueellinen tyylilaji, joka on esitystavaltaan karkeampaa kuin folk blues. Tunnettuja tyylin edustajia ovat mm. Charley Patton, Son House ja Robert Johnson.
in scheme: MUSA/CILLA - Musiikin asiasanasto
related: folkblues
scope note: deprecated on 2018.10.24

mambo (tanssit)
type: Concept
created: 1996-02-09
is replaced by: Y214787
modified: 2017-09-04T13:29:32+03:00
broader: latinalaistanssit
definition: 1930-luvulla syntynyt kuubalainen tanssi. Kansainväliseen suosioon tanssi nousi 1950-luvulla, jolloin termiä käytettiin laajemminkin kuubalaisen tanssimusiikin synonyyminä.
in scheme: MUSA/CILLA - Musiikin asiasanasto
preferred label: mambo @sv
scope note: deprecated on 2018.10.24

mariachimusiikki
type: Concept
created: 1996-02-09
is replaced by: Y214554
modified: 2017-09-04T13:29:32+03:00
broader: latinalaisamerikkalainen populaarimusiikki
broader: son-musiikki
definition: Meksikossa yleisen, mestitsikulttuuriin kuuluvan, kokoonpanon populaarimusiikkia. Viulun ja kitaroiden lisäksi mariachi-yhtyeeseen kuuluu trumpetti ja lyömäsoittimia. Sävellyksissä esiintyy sekä perinne- että populaarimusiikkityylejä.
in scheme: MUSA/CILLA - Musiikin asiasanasto
preferred label: mariachimusik @sv
scope note: deprecated on 2018.10.24

häämarssit
type: Concept
created: 1996-02-07
is replaced by: Y214501
modified: 2017-09-04T13:29:17+03:00
broader: häämusiikki
broader: marssit
definition: Kristilliseen perinteeseen liittyvien hääjuhlallisuuksien yhteydessä, yleensä uruilla kirkossa soitettava juhlallinen marssityyppinen sävelmä. Esityskokoonpanona voi olla myös orkesteri tai soitinyhtye.
in scheme: MUSA/CILLA - Musiikin asiasanasto
preferred label: brudmarscher @sv
scope note: deprecated on 2018.10.24

patarummut
type: Concept
created: 1996-02-08
is replaced by: Y103260
modified: 2017-09-21T13:39:59+03:00
alternative label: timpani
broader: lyömäsoittimet
definition: Metallirunkoinen lyömäsoitin, jonka viritystasoa voidaan muuttaa jopa soittamisen aikana. Sinfoniaorkesterissa on normaalisti useampia patarumpuja.
in scheme: MUSA/CILLA - Musiikin asiasanasto
preferred label: pukor @sv
scope note: deprecated on 2018.10.24

steel pan
type: Concept
created: 1996-02-08
is replaced by: Y214680
modified: 2017-09-04T13:29:32+03:00
broader: lyömäsoittimet
definition: Trinidadilainen öljytynnyreistä viritetty rumpu, joita normaalissa soittotilanteessa on useampia eri sävelkorkeudelle viritettyinä "steel band" -yhtyeen soitettavana.
in scheme: MUSA/CILLA - Musiikin asiasanasto
note: Steel pan -soittimista koostuvasta yhtyeestä käytetään asiasanaa steel bandit.
preferred label: steel drums @sv
related: steel bandit
scope note: deprecated on 2018.10.24

charleston (tanssit)
type: Concept
created: 1996-02-07
is replaced by: Y214768
modified: 2017-07-18T11:47:26+03:00
broader: tanssit
definition: Yhdysvalloissa 1920-luvulla kehittynyt jazz-tyylinen seuratanssi.
in scheme: MUSA/CILLA - Musiikin asiasanasto
preferred label: charleston @sv
scope note: deprecated on 2018.10.24

uusklassismi
type: Concept
created: 1996-02-09
is replaced by: Y104757
modified: 2017-05-09T08:36:40+03:00
alternative label: neoklassismi
alternative label: neoklassicism @sv
broader: tyylit
broader: klassismi
definition: Taidemusiikin kertaustyylinen tyylisuunta 1900-luvulla.
in scheme: MUSA/CILLA - Musiikin asiasanasto
preferred label: nyklassicism @sv
scope note: deprecated on 2018.10.24

säveltäminen
type: Concept
created: 1996-02-08
is replaced by: Y104494
modified: 2017-09-21T13:24:22+03:00
definition: Säveltäjän luovan työprosessin nimitys.
in scheme: MUSA/CILLA - Musiikin asiasanasto
note: Termiä käytetään vain kirjallisuuden indeksoinnissa.
preferred label: komposition @sv
related: sävellysoppi
scope note: deprecated on 2018.10.24

kamarikuorot
type: Concept
created: 1996-02-08
is replaced by: Y102140
modified: 2017-09-21T13:40:00+03:00
broader: kuorot
definition: Yleensä pienehkö, 10-25 laulajaa käsittävä kuoro.
in scheme: MUSA/CILLA - Musiikin asiasanasto
note: Termiä suositellaan käytettäväksi lähinnä silloin, kun se on julkaisussa erikseen mainittu. Kuoron kokoa ei ole syytä ryhtyä selvittämään ja nimeämään sillä perusteella.
preferred label: kammarkörer @sv
scope note: deprecated on 2018.10.24

mieskuorot
type: Concept
created: 1996-02-09
is replaced by: Y97450
modified: 2017-09-21T13:40:00+03:00
broader: kuorot
definition: Kuorokokoonpano, jossa on vain miesäänisiä laulajia (tenoreita, baritoneja ja bassoja).
in scheme: MUSA/CILLA - Musiikin asiasanasto
note: Termiä voi käyttää sekä kokoonpanosta että sille sävelletystä tai sillä esitetystä musiikista sopivin täsmentein, esimerkiksi kuoromusiikki : mieskuorot, mieskuorot : historia : Suomi.
preferred label: manskörer @sv
scope note: deprecated on 2018.10.24

kognitiivinen musiikkitiede
type: Concept
created: 1996-02-08
is replaced by: Y121100
modified: 2017-09-21T13:24:22+03:00
broader: musiikintutkimus
definition: Musiikkitieteen suuntaus, joka tutkii musiikkia kognitiotieteen näkökulmasta.
in scheme: MUSA/CILLA - Musiikin asiasanasto
preferred label: kognitiv musikvetenskap @sv
scope note: deprecated on 2018.10.24

musiikki-ikonografia
type: Concept
created: 1996-03-15
is replaced by: Y123630
modified: 2017-09-21T13:40:00+03:00
alternative label: musiikki-ikonologia
broader: musiikintutkimus
definition: Musiikkitieteen suuntaus, joka tutkii musiikkiin liittyviä kuvia.
in scheme: MUSA/CILLA - Musiikin asiasanasto
preferred label: musikikonografi @sv
scope note: deprecated on 2018.10.24

mikrofonit
type: Concept
created: 1996-02-09
is replaced by: Y97458
modified: 2017-05-09T08:36:40+03:00
broader: äänentoistolaitteet
definition: Äänen tallennuksen ja toiston ensimmäisen vaiheen väline, jonka avulla ilman värähtely muutetaan sähköiseksi signaaliksi.
in scheme: MUSA/CILLA - Musiikin asiasanasto
preferred label: mikrofoner @sv
related: äänentoistolaitteet
scope note: deprecated on 2018.10.24

virittimet
type: Concept
created: 1996-02-15
is replaced by: Y104871
modified: 2017-05-09T08:36:40+03:00
alternative label: tuners @sv
broader: äänentoistolaitteet
definition: Radiosignaalien vastaanottamiseen soveltuva laite, joka muuntaa signaalin vahvistimen käsiteltäväksi sopivaan muotoon.
in scheme: MUSA/CILLA - Musiikin asiasanasto
preferred label: radiodelar @sv
related: äänentoistolaitteet
scope note: deprecated on 2018.10.24

laulujuhlat
type: Concept
created: 1996-02-08
is replaced by: Y103038
modified: 2017-09-21T13:40:00+03:00
broader: musiikkijuhlat
definition: 1800-luvulla käynnistyneitä, yleensä laajamuotoisia kansallisia tapahtumia, joissa esiintyi suuria kuoroja ja harrastettiin yhteisesiintymisiä.
in scheme: MUSA/CILLA - Musiikin asiasanasto
preferred label: sångfester @sv
scope note: deprecated on 2018.10.24

piccolohuilu
type: Concept
created: 1996-02-08
is replaced by: Y101687
modified: 2017-09-21T13:40:00+03:00
broader: huilu
definition: Tavallista huilua oktaavia korkeammalta soiva pienikokoinen huilu.
in scheme: MUSA/CILLA - Musiikin asiasanasto
preferred label: piccolaflöjt @sv
scope note: deprecated on 2018.10.24

häävalssit
type: Concept
created: 1996-02-07
is replaced by: Y214502
modified: 2017-09-04T13:29:34+03:00
broader: häämusiikki
broader: valssit (sävellykset)
definition: Nimitys länsimaisten hääjuhlien yhteydessä tanssittaville valsseille. Yleensä termillä tarkoitetaan sitä valssia, jonka tahdissa hääpari aloittaa juhlien tanssiosuuden. Useimmat häävalssit ovat lähinnä populaarimusiikkia.
in scheme: MUSA/CILLA - Musiikin asiasanasto
preferred label: brudvalser @sv
scope note: deprecated on 2018.10.24

jouhikko
type: Concept
created: 1996-02-08
is replaced by: Y105315
modified: 2017-09-21T13:40:00+03:00
broader: lyyrasoittimet
definition: Suomessa ja Karjalassa käytetty jousella soitettava yleensä 2–4-kielinen lyyra, jonka läheisin sukulainen on talharpa.
in scheme: MUSA/CILLA - Musiikin asiasanasto
preferred label: stråkharpa @sv
scope note: deprecated on 2018.10.24

wieninvalssit
type: Concept
created: 1996-02-15
is replaced by: Y214721
modified: 2017-09-04T13:29:34+03:00
alternative label: wienervalssit
alternative label: wieniläisvalssit
broader: valssit (sävellykset)
broader: vanhat tanssit
definition: (1) Itävallassa 1800-luvulla suosiossa ollut valssisävellys ja (2) samanniminen tanssiurheilutanssi.
in scheme: MUSA/CILLA - Musiikin asiasanasto
preferred label: wienervalser @sv
scope note: deprecated on 2018.10.24

Orff-menetelmä
type: Concept
created: 1996-02-07
is replaced by: Y109071
modified: 2017-09-21T13:40:01+03:00
broader: opetusmenetelmät
definition: Carl Orffin kehittämän musiikinopetusmenetelmän nimitys.
in scheme: MUSA/CILLA - Musiikin asiasanasto
preferred label: Orffmetoden @sv
scope note: deprecated on 2018.10.24

Suzuki-menetelmä
type: Concept
created: 1996-02-08
is replaced by: Y94430
modified: 2017-09-21T13:40:01+03:00
broader: opetusmenetelmät
definition: Japanilaisen Shinichi Suzukin luoma soitonopetusmenetelmä. Menetelmä on kehitetty viulunsoiton opettamiseen, mutta sitä on sovellettu myös muiden soittimien opetuksessa.
in scheme: MUSA/CILLA - Musiikin asiasanasto
note: Ellei termiä käytetä kirjallisuuden indeksointiin ja yleisessä merkityksessä, sen yhteydessä on aina käytettävä opetettavan soittimen nimeä, esimerkiksi Suzuki-menetelmä : viulu : äänitteet.
preferred label: Suzukimetoden @sv
scope note: deprecated on 2018.10.24

seuratanssit
type: Concept
created: 1996-02-08
is replaced by: Y104311
modified: 2017-07-12T14:51:36+03:00
alternative label: paritanssit
alternative label: pardans @sv
broader: tanssit
definition: Yleisnimitys tansseille, joita tanssitaan yleensä pareina ravintoloissa, juhlasaleissa ja muissa sosiaalisissa yhteyksissä. Seuratanssit ovat pääasiassa populaarimusiikkia. Termin englanninkielinen vastine on "ballroom dance".
in scheme: MUSA/CILLA - Musiikin asiasanasto
narrower: vanhat tanssit
preferred label: sällskapsdanser @sv
scope note: deprecated on 2018.10.24

improvisaatiot (sävellykset)
type: Concept
created: 1996-02-08
is replaced by: Y214503
modified: 2017-09-04T13:29:38+03:00
broader: sävellykset
definition: Improvisoinnin tuloksena syntynyt sävellys.
in scheme: MUSA/CILLA - Musiikin asiasanasto
preferred label: improvisationer @sv
related: improvisointi
scope note: deprecated on 2018.10.24

joulumusiikki
type: Concept
created: 1997-10-01
is replaced by: Y208245
modified: 2017-05-09T08:36:41+03:00
broader: juhlamusiikki
definition: Kaikki sellainen musiikki, joka tekstinsä tai käyttöyhteytensä perusteella liittyy länsimaiseen (kristilliseen) joulunviettoperinteeseen.
in scheme: MUSA/CILLA - Musiikin asiasanasto
note: Termiä suositellaan käytettäväksi lähinnä sekasisältöisten, jouluun liittyvien, soitinsävellyskokoelmien yhteydessä. Yksittäisistä soitinteosten yhteydessä termiä käytetään vain, jos asiayhteys on varmistettu.
preferred label: julmusik @sv
related: joululaulut
scope note: deprecated on 2018.10.24

kadenssit
type: Concept
created: 1996-02-08
is replaced by: Y214778
modified: 2017-09-04T13:29:34+03:00
broader: soolot
definition: Solistin esitystilanteessa improvisoima tai solistin esitettäväksi jo ennakolta sävelletty säestyksetön, yleensä virtuoosinen soolojakso konsertossa tai vastaavassa teoksessa.
in scheme: MUSA/CILLA - Musiikin asiasanasto
preferred label: kadenser @sv
scope note: deprecated on 2018.10.24

äänikasetit
type: Concept
created: 1996-02-15
is replaced by: Y102248
modified: 2017-05-09T08:36:41+03:00
broader: ääninauhat
broader: kasetit
definition: Yleisnimitys magneettiseen nauhaan perustuville äänitteille, joissa nauha on sijoitettu suljetun kotelon sisälle. Ainoa laajaan käyttöön yleistynyt tyyppi on ns. C-kasetti.
in scheme: MUSA/CILLA - Musiikin asiasanasto
preferred label: ljudkassetter @sv
scope note: deprecated on 2018.10.24

vanhat tanssit
type: Concept
created: 1996-02-15
is replaced by: Y196345
modified: 2017-05-09T08:36:24+03:00
alternative label: salonkitanssit
broader: seuratanssit
definition: Nimitys 1900-luvun taitteessa suosituille seuratansseille, kuten mignon, pas d'Espagne, pas de quatre, krakoviak, wengerka, kickapoo ja wienervalssi.
in scheme: MUSA/CILLA - Musiikin asiasanasto
narrower: wieninvalssit
note: Termiä ei pidä sekoittaa Ruotsissa ja suomenruotsalaisten keskuudessa esiintyvään gammeldans-käsitteeseen, jolla tarkoitetaan kansanomaisia tansseja kuten valssi, jenkka, polkka, sottiisi, masurkka ja hambo.
preferred label: salongsdanser @sv
scope note: deprecated on 2018.10.24

kirkkosävellajit
type: Concept
created: 1996-02-08
is replaced by: Y214522
modified: 2017-09-04T13:29:34+03:00
broader: sävellajit
definition: Antiikin Kreikan ja Bysantin säveljärjestelmistä (moodeista) keskiajalla kirkolliseen käyttöön ja teoreettiseen termistöön vakiintuneet sävelasteikot (aluksi 8, sittemmin 12: doorinen, hypodoorinen, fryyginen, hypofryyginen, lyydinen, hypolyydinen, miksolyydinen, hypomiksolyydinen, aiolinen, hypoaiolinen, jooninen ja hypojooninen).
in scheme: MUSA/CILLA - Musiikin asiasanasto
preferred label: kyrkotonarter @sv
related: moodit
scope note: deprecated on 2018.10.24

laika
type: Concept
created: 1996-02-08
is replaced by: Y214539
modified: 2017-09-04T13:29:34+03:00
broader: populaarimusiikki
definition: Kreikkalainen populaarimusiikin tyylisuuntaus, joka on rebetikaa viihteellisempää kaupunkimusiikkia, eräänlaista kreikkalaista iskelmää.
in scheme: MUSA/CILLA - Musiikin asiasanasto
related: rebetika
scope note: deprecated on 2018.10.24

levy-yhtiöt
type: Concept
created: 1996-02-08
is replaced by: Y113188
modified: 2017-05-09T08:36:42+03:00
broader: ääniteteollisuus
definition: Organisaatioita, jotka julkaisevat ja kustantavat äänitteitä. Pääosa levy-yhtiöistä toimii kaupallisten tavoitteiden takia ja osana laajempaa ääniteteollisuutta, mutta joukossa on myös aatteellisista ja muista ei-kaupallisista syistä toimivia yrittäjiä.
in scheme: MUSA/CILLA - Musiikin asiasanasto
preferred label: skivbolag @sv
related: levymerkit
scope note: deprecated on 2018.10.24

tekijänoikeus
type: Concept
created: 1996-02-09
is replaced by: Y99355
modified: 2017-09-04T13:29:35+03:00
alternative label: copyright @sv
definition: Nimitys abstraktille oikeudelle ja konkreettiselle lainsäädäntöjärjestelmälle, jonka avulla tekijän immateriaalista oikeutta omaan teokseensa ja sen käyttöön pyritään toteuttamaan.
in scheme: MUSA/CILLA - Musiikin asiasanasto
narrower: bootlegit
narrower: piratismi
preferred label: upphovsrätt @sv
scope note: deprecated on 2018.10.24

sävellyskilpailut
type: Concept
created: 1996-02-08
is replaced by: Y103603
modified: 2017-09-21T13:40:01+03:00
broader: musiikkikilpailut
definition: Kilpailu, jossa ratkaistaan siihen osallistuvien sävellysten keskinäinen paremmuus.
in scheme: MUSA/CILLA - Musiikin asiasanasto
preferred label: kompositionstävlingar @sv
scope note: deprecated on 2018.10.24

musiikkiarkistot
type: Concept
created: 1996-02-09
is replaced by: Y110628
modified: 2017-07-12T09:43:07+03:00
alternative label: musiikki -- arkistot
alternative label: musik -- arkiv @sv
broader: arkistot
definition: Arkisto, jonka kokoelmat muodostuvat musiikkialan arkistoaineistosta.
hidden label: musiikki arkistot
hidden label: musik arkiv @sv
in scheme: MUSA/CILLA - Musiikin asiasanasto
preferred label: musikarkiv @sv
related: ääniarkistot
scope note: deprecated on 2018.10.24

musiikkioppilaitokset
type: Concept
created: 1996-02-09
is replaced by: Y97566
modified: 2017-05-09T08:36:43+03:00
alternative label: konservatoriot
alternative label: musiikkikoulut
alternative label: musiikkiopistot
alternative label: konservatorier @sv
alternative label: musikinstitut @sv
alternative label: musikskolor @sv
definition: Kaikki ne korkeakoulujen ulkopuoliset laitokset, joissa annetaan erikoistunutta musiikin opetusta.
in scheme: MUSA/CILLA - Musiikin asiasanasto
narrower: musiikkileikkikoulut
preferred label: musikläroinrättningar @sv
related: musiikkikorkeakoulut
scope note: deprecated on 2018.10.24

ääniteteollisuus
type: Concept
created: 1996-02-15
is replaced by: Y100514
modified: 2017-05-09T08:36:43+03:00
alternative label: äänilevyteollisuus
definition: Teollinen järjestelmä, joka on kehittynyt äänitteiden valmistamiseksi ja levittämiseksi.
in scheme: MUSA/CILLA - Musiikin asiasanasto
narrower: levy-yhtiöt
preferred label: skivindustri @sv
related: musiikkiteollisuus
scope note: deprecated on 2018.10.24

sonaattimuoto
type: Concept
created: 1996-02-08
is replaced by: Y104366
modified: 2017-09-21T13:40:02+03:00
broader: muoto-oppi
definition: Musiikinteoreettinen nimitys sävellysmuodolle, joka vakiintui wieniläisklassismin aikana. Sonaattimuodossa on kolme vaihetta: johdantojakso, kehittelyjakso ja kertausjakso, jotka sisältävät pää- ja sivuteemojen variaatioita eri sävellajeissa.
in scheme: MUSA/CILLA - Musiikin asiasanasto
preferred label: sonatform @sv
related: sonaatit
scope note: deprecated on 2018.10.24

musiikkianalyysi
type: Concept
created: 1996-02-09
is replaced by: Y97561
modified: 2017-09-21T13:40:02+03:00
alternative label: tyylianalyysi
broader: musiikinteoria
definition: Musiikinteoreettinen käsite, jolla tarkoitetaan sävelteoksen teoreettista erittelyä sekä sävellyksen rakenteen ja ominaisuuksien tutkimista.
in scheme: MUSA/CILLA - Musiikin asiasanasto
narrower: sointuanalyysi
preferred label: musikanalys @sv
scope note: deprecated on 2018.10.24

viritysjärjestelmät
type: Concept
created: 1996-02-15
is replaced by: Y214728
modified: 2017-09-04T13:29:36+03:00
alternative label: viritykset (musiikki)
broader: musiikinteoria
broader: säveloppi
definition: Yleisnimitys eri tavoille, joilla yksittäiset soittimet ja soitinryhmät viritetään halutulla tavalla. Länsimaisessa taide- ja populaarimusiikissa käytetään yleensä tasavireistä viritysjärjestelmää.
in scheme: MUSA/CILLA - Musiikin asiasanasto
preferred label: stämningssystem @sv
related: viritys
scope note: deprecated on 2018.10.24

kuoronjohtajat
type: Concept
created: 1997-09-30
is replaced by: Y106718
modified: 2017-09-21T13:40:02+03:00
alternative label: musiikinjohtajat
definition: Kuorojen ja lauluyhtyeiden johtajista käytettävä nimitys. Soitinmusiikin puolella vastaava termi on kapellimestarit.
in scheme: MUSA/CILLA - Musiikin asiasanasto
note: Termiä suositellaan käytettäväksi lähinnä musiikkikirjallisuudesta, joka käsittelee kuoronjohtajia ja heidän työtään.
preferred label: kördirigenter @sv
related: kapellimestarit
related: johtaminen
scope note: deprecated on 2018.10.24

äänitysstudiot
type: Concept
created: 1997-10-01
is replaced by: Y214743
modified: 2017-09-04T13:29:37+03:00
broader: musiikkiteknologia
definition: Äänityksiä varten rakennettu tila ja laiteympäristö.
in scheme: MUSA/CILLA - Musiikin asiasanasto
preferred label: inspelningsstudior @sv
related: studiotekniikka
related: äänitekniikka
scope note: deprecated on 2018.10.24

yksinlaulut
type: Concept
created: 1996-02-09
is replaced by: Y214732
modified: 2017-09-04T13:29:37+03:00
alternative label: liedit
alternative label: lieder @sv
broader: laulut
definition: Eurooppalaiseen taidemusiikkiperinteeseen kuuluva säestyksellinen soololaulu sävellystyyppinä.
in scheme: MUSA/CILLA - Musiikin asiasanasto
narrower: yksinlaulu
narrower: orkesterilaulut
note: Termiä käytetään musiikkijulkaisuissa ilmaisemaan sävellystyyppiä, esimerkiksi yksinlaulut : Suomi : 1910-luku. Jos halutaan indeksoida ilmiötä sinänsä, käytetään termiä yksinlaulu. Jos yksinlaulun ääniala on selvillä, voidaan sitä käyttää täsmentävänä terminä, kuitenkin ilman säestyssoitinta, jos se on piano, esimerkiksi yksinlaulut : sopraano : Itävalta. Jos säestyssoitin on jokin muu soitin, se on suositeltavaa merkitä asiasanaketjuun, esimerkiksi yksinlaulut : basso : kitara.
preferred label: solosånger @sv
scope note: deprecated on 2018.10.24

studiotekniikka
type: Concept
created: 1997-10-01
is replaced by: Y214682
modified: 2017-09-04T13:29:37+03:00
broader: musiikkiteknologia
definition: Musiikin tai muiden esitysten taltioimiseen tarkoitetuissa studioissa esiintyvä äänentallennustekniikka.
in scheme: MUSA/CILLA - Musiikin asiasanasto
preferred label: studioteknik @sv
related: äänitysstudiot
related: äänitekniikka
scope note: deprecated on 2018.10.24

rumpukone
type: Concept
created: 1997-10-01
is replaced by: Y214633
modified: 2017-06-28T10:15:52+03:00
broader: syntetisaattori
in scheme: MUSA/CILLA - Musiikin asiasanasto
preferred label: trummaskin @sv
related: MIDI
related: sekvensseri (sähkösoittimet)
scope note: deprecated on 2018.10.24

naislaulajat
type: Concept
created: 1997-10-06
is replaced by: Y214592
modified: 2017-09-04T13:29:37+03:00
alternative label: laulajat -- naiset
alternative label: laulajattaret
alternative label: naiset -- laulajat
alternative label: kvinnliga vokalister @sv
alternative label: sångare -- kvinnor @sv
broader: laulajat
hidden label: laulajat naiset
hidden label: naiset laulajat
hidden label: sångare kvinnor @sv
in scheme: MUSA/CILLA - Musiikin asiasanasto
narrower: altot (laulajat)
narrower: sopraanot (laulajat)
preferred label: sångerskor @sv
scope note: deprecated on 2018.10.24

joululaulut
type: Concept
created: 1996-02-08
is replaced by: Y95642
modified: 2017-09-21T13:24:18+03:00
alternative label: carolit
alternative label: noëlit
broader: laulut
definition: Länsimaiseen perinteeseen liittyviä lauluja, jotka tekstinsä perusteella voidaan yhdistää joulunviettoperinteeseen.
in scheme: MUSA/CILLA - Musiikin asiasanasto
preferred label: julsånger @sv
related: joulumusiikki
scope note: deprecated on 2018.10.24

musiikkiala
type: Concept
created: 1998-05-13
is replaced by: Y109922
modified: 2017-09-21T13:24:23+03:00
definition: Taloudellis-hallinnollinen nimitys musiikkiin liittyville organisaatioille ja niiden välisille yhteiskunnallisille suhteille.
in scheme: MUSA/CILLA - Musiikin asiasanasto
narrower: musiikkiteollisuus
note: Termiä käytetään lähinnä taloudellishallinnollisissa yhteyksissä, ei varsinaisena musiikkiterminä.
preferred label: musikbranschen @sv
related: musiikkielämä
scope note: deprecated on 2018.10.24

liturginen musiikki
type: Concept
created: 1996-02-08
is replaced by: Y182287
modified: 2017-05-09T08:36:24+03:00
alternative label: jumalanpalvelusmusiikki
alternative label: gudstjänstmusik @sv
broader: kirkkomusiikki
definition: Jumalanpalvelumenoissa käytettävän musiikin yleisnimitys.
in scheme: MUSA/CILLA - Musiikin asiasanasto
note: Termiä käytetään vain kristillisten uskontokuntien jumalanpalvelukseen vahvistetun tai muutoin vakiintuneesti kuuluvan musiikin yhteydessä. Jos tätä yhteyttä ei ole, kyse on hengellisistä lauluista tai musiikista. Termiä ei käytetä ei-kristillisten uskontokuntien yhteydessä. Kirkkokunnan nimeä voidaan käyttää täsmenteenä, esimerkiksi liturginen musiikki : koptilainen kirkko.
preferred label: liturgisk musik @sv
related: rituaalimusiikki
related: psalmit
scope note: deprecated on 2018.10.24

ikivihreät
type: Concept
created: 1996-12-04
is replaced by: Y101787
modified: 2017-09-21T13:39:45+03:00
alternative label: evergreenit
definition: Pysyvästi suosittu populaarimusiikkisävelmä.
in scheme: MUSA/CILLA - Musiikin asiasanasto
note: Termiä käytetään vain populaarimusiikin yhteydessä. Termin yhteydessä ei käytetä aikamääreitä, ellei kyseessä ole tietyn aikakauden ikivihreitä esittelevä kokoelma.
preferred label: evergreens @sv
related: iskelmät
related: hitit
scope note: deprecated on 2018.10.24

koraalit
type: Concept
created: 1996-02-08
is replaced by: Y102532
modified: 2017-05-09T08:36:23+03:00
broader: kirkkomusiikki
definition: Protestanttisen kirkon perinteeseen kuuluva sävelmä, joka voidaan esittää sekä laulamalla että pelkästään uruilla tai jollain muulla soittimella.
in scheme: MUSA/CILLA - Musiikin asiasanasto
note: Jos termiä käytetään tarkoittamaan gregoriaanista koraalia, on aina käytettävä täsmenteenä termiä gregoriaaninen laulu.
preferred label: koraler @sv
related: koraalialkusoitot
related: virret
scope note: deprecated on 2018.10.24

maakuntalaulut
type: Concept
created: 1996-02-09
is replaced by: Y97150
modified: 2017-09-21T13:39:46+03:00
broader: laulut
definition: Suomen maakuntien epävirallisia nimikkolauluja, joita esitetään usein kansallislaulun tapaan yhteislauluna juhlatilaisuuksissa.
in scheme: MUSA/CILLA - Musiikin asiasanasto
note: Termiä voi käyttää myös sellaisista sävellyksistä, jotka on sävelletty ja tekstitetty maakuntalauluiksi, mutta jotka eivät ole tätä asemaa historiallisesti saaneet. Useimmissa maakunnissa on yksi kiistaton maakuntalaulu, jonka rinnalla voi esiintyä kilpailevia sävelmiä.
preferred label: landskapssånger @sv
related: kotiseutulaulut
scope note: deprecated on 2018.10.24

lapsikuorot
type: Concept
created: 1996-02-08
is replaced by: Y205708
modified: 2017-09-21T13:39:46+03:00
broader: kuorot
definition: Kuorokokoonpano, jossa on vain lapsiäänisiä laulajia (sopraanoja ja alttoja).
in scheme: MUSA/CILLA - Musiikin asiasanasto
note: Termiä voidaan käyttää sekä kokoonpanosta että sillä esittävästä musiikista sopivin lisämäärein.
preferred label: barnkörer @sv
related: nuorisokuorot
scope note: deprecated on 2018.10.24

beguinet (sävellykset)
type: Concept
created: 1996-02-07
is replaced by: Y214764
modified: 2017-09-04T13:29:16+03:00
broader: sävellykset
definition: Sävellys, jonka tahdissa on tarkoitus tanssia beguinea tai joka tyylittelee mainitunlaista tanssisävellystä.
in scheme: MUSA/CILLA - Musiikin asiasanasto
related: tanssimusiikki
scope note: deprecated on 2018.10.24

piano
type: Concept
created: 1996-02-08
is replaced by: Y102713
modified: 2017-09-21T13:39:42+03:00
alternative label: kirahvipiano
alternative label: konserttiflyygeli
alternative label: pianino
alternative label: pyramidipiano
alternative label: pystypiano
alternative label: royalino
broader: kosketinsoittimet
definition: 1700-luvulla kehitetty kosketinsoitin, joka vakiintui 1800-luvulla länsimaisen taidemusiikin keskeiseksi soolosoittimeksi.
in scheme: MUSA/CILLA - Musiikin asiasanasto
related: fortepiano
scope note: deprecated on 2018.10.24

DVD-soittimet
type: Concept
created: 2001-02-23
is replaced by: Y113374
modified: 2017-05-09T08:36:46+03:00
broader: lasersoittimet
definition: Yleisnimitys teknisille välineille, joilla voidaan toistaa DVD-standardin mukaisia levyjä (ääntä tai kuvaa ja ääntä).
in scheme: MUSA/CILLA - Musiikin asiasanasto
preferred label: DVD-spelare @sv
related: SACD-soittimet
related: CD-soittimet
scope note: deprecated on 2018.10.24

dulcimer
type: Concept
created: 1996-02-07
is replaced by: Y214452
modified: 2017-09-04T13:29:19+03:00
alternative label: cimbalom
alternative label: czimbalom
broader: lyömäsoittimet
broader: sitrasoittimet
in scheme: MUSA/CILLA - Musiikin asiasanasto
preferred label: hackbräde @sv
related: symbaali
scope note: deprecated on 2018.10.24

etydit
type: Concept
created: 1996-02-07
is replaced by: Y101334
modified: 2017-09-05T13:53:14+03:00
broader: sävellykset
definition: (1) Soittotekninen harjoituskappale (étude, study) ja (2) itsenäinen sävellysteos (esim. Debussyllä tai Villa-Lobosilla).
in scheme: MUSA/CILLA - Musiikin asiasanasto
note: Koska rajanveto on vaikeaa, termiä käytetään aina, kun säveltäjä on teoksen etydiksi jollain kielellä nimennyt.
preferred label: etyder @sv
related: harjoitusaineistot
scope note: deprecated on 2018.10.24

oratoriot
type: Concept
created: 1996-02-07
is replaced by: Y102535
modified: 2017-09-21T13:24:19+03:00
broader: laulumusiikki
definition: Tavallisesti suurimuotoinen kirkkomusiikkiteos, jonka teksti on hengellinen, muttei liturginen.
in scheme: MUSA/CILLA - Musiikin asiasanasto
note: Termiä käytetään vain niistä teoksista, jotka säveltäjä ja hakuteokset nimeävät oratorioiksi.
preferred label: oratorier @sv
related: kirkkomusiikki
scope note: deprecated on 2018.10.24

pasuuna
type: Concept
created: 1996-02-08
is replaced by: Y103892
modified: 2017-09-21T13:39:46+03:00
alternative label: basun @sv
broader: puhallinsoittimet
broader: vaskipuhaltimet
definition: Jo 1000-luvulta lähtien tunnettu vaskipuhallin, joka koostuu suukappaleesta, luistista ja kello-osasta. Tästä vetopasuunasta kehitettiin 1820-luvulla venttiileillä varustettu malli, venttiilipasuuna.
in scheme: MUSA/CILLA - Musiikin asiasanasto
preferred label: trombon @sv
scope note: deprecated on 2018.10.24

sello
type: Concept
created: 1996-02-08
is replaced by: Y101960
modified: 2017-09-21T13:39:46+03:00
alternative label: cello @sv
broader: jousisoittimet
definition: Viuluperheen toiseksi matalaäänisin soitin. Sello muistuttaa kontrabassoa ja sitä soitetaan kontrabasson tavoin pystysuunnassa, mutta on pienempi ja soi oktaavia korkeammalta.
in scheme: MUSA/CILLA - Musiikin asiasanasto
preferred label: violoncell @sv
related: viola da gamba
scope note: deprecated on 2018.10.24

kornetti
type: Concept
created: 1996-02-08
is replaced by: Y214531
modified: 2017-09-04T13:29:20+03:00
broader: puhallinsoittimet
broader: vaskipuhaltimet
definition: Korkeaääninen trumpettisoitin.
in scheme: MUSA/CILLA - Musiikin asiasanasto
preferred label: kornett @sv
related: trumpetti
scope note: deprecated on 2018.10.24

surumarssit
type: Concept
created: 1996-02-08
is replaced by: Y103429
modified: 2017-09-21T13:24:19+03:00
broader: marssit
broader: surumusiikki
definition: Marssi, jolle säveltäjä on antanut tällaisen nimen (marche funèbre, marcia funebre), sekä marssi, joka tiedetään tarkoitetun surumarssiksi. Surumarssilla ei ole mitään objektiivisia ominaisuuksia, mutta yleensä niihin liitetään hidas tempo, harras tunnelma ja suurten dynaamisten vaihteluiden välttäminen.
in scheme: MUSA/CILLA - Musiikin asiasanasto
preferred label: sorgmarscher @sv
scope note: deprecated on 2018.10.24

kontrabasso
type: Concept
created: 1996-02-08
is replaced by: Y101959
modified: 2017-09-21T13:39:46+03:00
alternative label: bassetto
broader: jousisoittimet
definition: Jousisoitinperheen matalin soitin. Kontrabasso on kooltaan suuri ja siinä on yleensä neljä kieltä, joita soitetaan joko jousella tai näppäillen. Se on eurooppalaisen sinfoniaorkesterin jousisoittimiston bassosoitin, mutta sitä käytetään usein myös jazzin ja populaarimusiikin kokoonpanoissa.
in scheme: MUSA/CILLA - Musiikin asiasanasto
preferred label: kontrabas @sv
related: violone
scope note: deprecated on 2018.10.24

chansonit
type: Concept
created: 1996-02-07
is replaced by: Y107421
modified: 2017-09-21T13:24:19+03:00
broader: laulut
definition: Ranskankielinen laulu tai laulelma.
in scheme: MUSA/CILLA - Musiikin asiasanasto
note: Koska termillä voidaan tarkoittaa aivan eri aikakausien lauluja, on täsmenteillä aina ilmaistava chansonin tarkempi laatu, esimerkiksi chansonit : viihdemusiikki : Ranska : 1950-luku, chansonit : laulumusiikki : Ranska : 1500-luku.
preferred label: chansoner @sv
related: laulelmat
scope note: deprecated on 2018.10.24

marimba
type: Concept
created: 1996-02-09
is replaced by: Y103259
modified: 2017-09-21T13:39:47+03:00
broader: lyömäsoittimet
definition: Eri taajuksilla soivista puisista tai lasikuituisista laatoista ja resonaattoriputkista koostuva lyömäsoitin, jota soitetaan malleteilla.
in scheme: MUSA/CILLA - Musiikin asiasanasto
related: vibrafoni
scope note: deprecated on 2018.10.24

vibrafoni
type: Concept
created: 1996-11-29
is replaced by: Y103263
modified: 2017-09-21T13:39:47+03:00
broader: lyömäsoittimet
definition: Marimban kaltainen lyömäsoitin, jossa on eri taajuuksilla soivat metalliset laatat, putkiresonaattorit ja nykyään usein myös pedaalit.
in scheme: MUSA/CILLA - Musiikin asiasanasto
preferred label: vibrafon @sv
related: marimba
scope note: deprecated on 2018.10.24

koraalivirsikirjat
type: Concept
created: 1996-02-08
is replaced by: Y96327
modified: 2017-05-09T08:36:26+03:00
broader: virsikirjat
broader: nuottijulkaisut
definition: Nuottijulkaisu, joka sisältää virsikirjan sävelmien tekstit ja nuotit sekä laulajille että säestäjälle (uruille).
in scheme: MUSA/CILLA - Musiikin asiasanasto
preferred label: koralpsalmböcker @sv
related: koraalikirjat
scope note: deprecated on 2018.10.24

tuuba
type: Concept
created: 1996-02-09
is replaced by: Y104689
modified: 2017-09-21T13:39:47+03:00
broader: puhallinsoittimet
broader: vaskipuhaltimet
definition: Matalaääninen vaskipuhallin, jossa on joko pumppu- tai sylinteriventtilit.
in scheme: MUSA/CILLA - Musiikin asiasanasto
preferred label: tuba @sv
scope note: deprecated on 2018.10.24

alttoviulu
type: Concept
created: 1996-02-07
is replaced by: Y100703
modified: 2017-09-21T13:39:47+03:00
alternative label: altviolin @sv
broader: jousisoittimet
definition: Viuluperheen alttoääninen viulu.
in scheme: MUSA/CILLA - Musiikin asiasanasto
preferred label: viola @sv
related: viola d'amore
scope note: deprecated on 2018.10.24

ragtime
type: Concept
created: 1996-02-08
is replaced by: Y101931
modified: 2017-09-21T13:39:47+03:00
broader: afroamerikkalainen musiikki
definition: 1900-luvun alun suosittu tanssi ja sävellystyyppi, jota on pidetty tärkeänä jazzin esimuotona. Tunnettuja ragtime-sävellyksiä ovat esimerkiksi monet Scott Joplinin pianosävellykset.
in scheme: MUSA/CILLA - Musiikin asiasanasto
note: Termiä on suositeltavaa käyttää aina täsmentävien asiasanojen kanssa, esimerkiksi ragtime : piano : sävellykset : Yhdysvallat : 1910-luku.
related: jazz
scope note: deprecated on 2018.10.24

käyrätorvi
type: Concept
created: 1996-02-08
is replaced by: Y102925
modified: 2017-09-21T13:24:20+03:00
broader: puhallinsoittimet
broader: vaskipuhaltimet
definition: Luonnonäänitorvista kehittynyt vaskipuhallin, jossa on ympyrään taivutettu putki.
in scheme: MUSA/CILLA - Musiikin asiasanasto
preferred label: valthorn @sv
scope note: deprecated on 2018.10.24

harppu
type: Concept
created: 1996-02-07
is replaced by: Y101549
modified: 2017-09-21T13:39:47+03:00
broader: näppäilysoittimet
broader: harppusoittimet
definition: Kielisoitin, jonka pystysuunnassa pingotettuja kieliä näppäillään käsillä molemmin puolin. Harpulla on useita rakenteeltaan erilaisia muunnoksia.
in scheme: MUSA/CILLA - Musiikin asiasanasto
preferred label: harpa @sv
scope note: deprecated on 2018.10.24

gregoriaaninen laulu
type: Concept
created: 1996-02-07
is replaced by: Y101461
modified: 2017-09-21T13:39:48+03:00
broader: latinalainen kirkkolaulu
definition: Säestyksetön, yksiääninen, roomalaiskatolisen kirkon latinankielinen laulu.
in scheme: MUSA/CILLA - Musiikin asiasanasto
note: Gregoriaanisen laulun erilaisia esitystraditioita ei asiasanoin eritellä.
preferred label: gregoriansk sång @sv
related: ambrosiaaninen laulu
scope note: deprecated on 2018.10.24

sinfoniat
type: Concept
created: 1996-02-08
is replaced by: Y98855
modified: 2017-09-21T13:24:20+03:00
alternative label: koraalisinfoniat
alternative label: kuorosinfoniat
broader: orkesterimusiikki
definition: 1700-luvulla syntynyt laajamuotoinen orkesterisävellystyyppi. Myöhemmissä sinfonioissa voi olla myös lauluosuuksia.
in scheme: MUSA/CILLA - Musiikin asiasanasto
note: Varhaisemmista sinfonioiksi nimitetyistä soitinteoksista käytetään asiasanaa alkusoitot tai ritornellot. Sinfoniaksi nimitetystä soittimesta käytetään asiasanaa kampiliira.
preferred label: symfonier @sv
related: sinfoniettat
scope note: deprecated on 2018.10.24

rillumareimusiikki
type: Concept
created: 1996-02-08
is replaced by: Y214627
modified: 2017-09-04T13:29:38+03:00
broader: populaarimusiikki
definition: Lähinnä 1950-luvun suomalaisissa farssielokuvissa runsaana esiintynyt viihdelaulutyyli, jonka aihepiirit liittyivät yleensä tukkijätkäkulttuuriin.
definition: Hänför sig till finska filmfarser från femtiotalet @sv
in scheme: MUSA/CILLA - Musiikin asiasanasto
note: Termiä on syytä käyttää aina yhdessä selittävien täsmenteiden kanssa, esimerkiksi rillumareimusiikki : elokuvat : Suomi : 1950-luku.
preferred label: rillumareimusik @sv
related: iskelmät
related: kupletit
scope note: deprecated on 2018.10.24

motetit
type: Concept
created: 1996-02-09
is replaced by: Y103573
modified: 2017-09-21T13:39:49+03:00
alternative label: koraalimotetit
alternative label: koralmotetter @sv
broader: kirkkomusiikki
broader: laulumusiikki
definition: Pienimuotoisia, moniäänisiä ja yleensä kirkolliseen käyttöön tarkoitettuja sävellyksiä, jollaisia on sävelletty jo 1200-luvun lopulta alkaen.
in scheme: MUSA/CILLA - Musiikin asiasanasto
note: Termiä käytetään vain, kun julkaisussa tai hakuteoksissa on määritelty indeksoitava musiikki motetiksi.
preferred label: motetter @sv
scope note: deprecated on 2018.10.24

ortodoksinen kirkkomusiikki
type: Concept
created: 1996-02-07
is replaced by: Y97879
modified: 2017-05-09T08:36:27+03:00
alternative label: kirkkomusiikki -- ortodoksinen kirkko
broader: kirkkomusiikki
broader: laulumusiikki
definition: Ortodoksisen kirkon liturgiaan kuuluvan musiikin yleisnimitys.
hidden label: kirkkomusiikki ortodoksinen kirkko
in scheme: MUSA/CILLA - Musiikin asiasanasto
narrower: bysanttilainen kirkkomusiikki
note: Tarvittaessa termiin liitetään maantieteellinen täsmenne kertomaan, kumman ortodoksisen kirkon pääsuuntauksen musiikista on kyse, esimerkiksi ortodoksinen kirkkomusiikki : Kreikka, ortodoksinen kirkkomusiikki : Venäjä. Kreikan kirkon musiikista käytetään termiä bysanttilainen kirkkomusiikki vain historiallisissa yhteyksissä.
preferred label: ortodox kyrkomusik @sv
scope note: deprecated on 2018.10.24

verismi
type: Concept
created: 1996-02-15
is replaced by: Y110690
modified: 2017-05-09T08:36:27+03:00
broader: tyylit
definition: Oopperataiteen realismia painottanut suuntaus, joka kehittyi 1900-luvun taitteen Italiassa.
in scheme: MUSA/CILLA - Musiikin asiasanasto
preferred label: verism @sv
related: oopperat
related: ooppera
scope note: deprecated on 2018.10.24

afro-rock
type: Concept
created: 1996-02-07
is replaced by: Y214381
modified: 2017-09-04T13:29:22+03:00
broader: rock
definition: 1970-luvulla kehittynyt rockin tyylisuuntaus, jossa angloamerikkalaiseen rock-musiikkiin yhdistettiin afrikkalaisen perinnemusiikin aineksia. Musiikissa on viitteitä myös highlifetyylistä. Tunnettu tyylin edustaja on Osibisa-yhtye.
in scheme: MUSA/CILLA - Musiikin asiasanasto
note: Termiä ei käytetä afrikkalaisen rock-musiikin yleisnimityksenä.
preferred label: afrorock @sv
related: afro
related: highlife
scope note: deprecated on 2018.10.24

highlife
type: Concept
created: 1996-02-07
is replaced by: Y214495
modified: 2017-09-04T13:29:22+03:00
broader: afroamerikkalainen musiikki
definition: Afrikkalainen viihdemusiikkityyli, joka kehittyi Afrikan kaupungeissa 1930-luvulta lähtien. Tyylin pohjana on afroamerikkalainen tanssimusiikki, johon on lisätty afrikkalaisia piirteitä.
in scheme: MUSA/CILLA - Musiikin asiasanasto
related: afro
related: afro-rock
scope note: deprecated on 2018.10.24

aiheet
type: Concept
created: 1996-02-07
is replaced by: Y94526
modified: 2017-05-09T08:36:28+03:00
alternative label: tematiikka
definition: Taideteoksen käsittelemä aihe tai aihepiiri. Musiikillisista aiheista käytetään termejä motiivit ja teemat.
in scheme: MUSA/CILLA - Musiikin asiasanasto
note: Termiä käytetään yhdistettynä termiin musiikki ja aihetta kuvaavaan termiin, esimerkiksi musiikki : aiheet : meri. Termiä suositellaan käytettäväksi lähinnä niin kutsutun ohjelmamusiikin yhteydessä ja kun säveltäjän tiedetään itse halunneen kuvata mainittua aihetta. Termiä voi käyttää säveltäjien tarkoituksista riippumatta myös sellaisten kokoelmien yhteydessä, joihin on koottu tiettyyn aihepiiriin soveltuvaa musiikkia.
preferred label: ämnen @sv
related: motiivit
related: ohjelmamusiikki
related: teemat
scope note: deprecated on 2018.10.24

motiivit
type: Concept
created: 1996-02-09
is replaced by: Y97511
modified: 2017-05-09T08:36:28+03:00
definition: Musiikinteoreettinen käsite, jolla tarkoitetaan pienintä musiikillisesti mielekästä sävelkulkua, aihetta tms elementtiä. Useasta motiivista muodostuu teema.
in scheme: MUSA/CILLA - Musiikin asiasanasto
preferred label: motiv @sv
related: aiheet
related: ohjelmamusiikki
related: teemat
scope note: deprecated on 2018.10.24

arabialainen musiikki
type: Concept
created: 1996-02-07
is replaced by: Y214394
modified: 2017-09-04T13:29:23+03:00
broader: perinnemusiikki
in scheme: MUSA/CILLA - Musiikin asiasanasto
note: Termiä käytetään kuvailtaessa arabialaista musiikkia laajasti käsittelevää aineistoa. Yksittäisen arabimaan musiikkia käsittelevä aineisto kuvaillaan tarkemmalla musiikinlajitermillä (esimerkiksi tanssimusiikki) ja maantieteellisellä termillä (esimerkiksi Tunisia).
preferred label: arabisk musik @sv
related: rai
related: itämainen tanssi
scope note: deprecated on 2018.10.24

arkkiveisut
type: Concept
created: 1997-11-11
is replaced by: Y94698
modified: 2017-05-09T08:36:29+03:00
alternative label: arkkiviisut
broader: perinnemusiikki
broader: laulut
definition: Irtoarkeille painettuja laulurunoja, joita Suomessakin painettiin jo 1600-luvulta alkaen. Suosionsa huipulla arkkiveisut olivat 1800-luvun lopulla ennen sanomalehdistön nousua.
in scheme: MUSA/CILLA - Musiikin asiasanasto
preferred label: skillingtryck @sv
related: perinnemusiikki
scope note: deprecated on 2018.10.24

intervallit
type: Concept
created: 1996-02-08
is replaced by: Y107387
modified: 2017-09-21T13:39:51+03:00
broader: säveljärjestelmät
definition: Kahden sävelkorkeuden tai äänitaajuuden välinen etäisyys, joka voidaan ilmaista intervallin nimenä (priimi, sekunti, terssi jne.), värähtelevän kielen tai ilmapatsaan pituuksien suhteina (1:1, 9:8, 5:4) tai värähdyslukujen (Hz) suhteina.
in scheme: MUSA/CILLA - Musiikin asiasanasto
note: Jos termiä käytetään muussa kuin musiikillisessa merkityksessä, termiin on lisättävä selittävä täsmenne, esimerkiksi intervallit : akustiikka.
preferred label: intervaller @sv
related: sävelasteikot
scope note: deprecated on 2018.10.24

atonaalisuus
type: Concept
created: 1996-02-07
is replaced by: Y100911
modified: 2017-09-21T13:39:51+03:00
definition: Ei-tonaalisuus, sävellajittomuus. Säveljärjestelmä, jossa ei ole tonaalista keskiötä eikä sävelten välisiä hierarkkisia suhteita.
in scheme: MUSA/CILLA - Musiikin asiasanasto
narrower: kaksitoistasäveljärjestelmä
note: Jos termillä halutaan ilmaista tarkkaa tyylikautta, käytetään täsmentäviä paikan ja ajan määreitä, esim. atonaalisuus : Itävalta : 1910-luku.
preferred label: atonalitet @sv
related: tonaalisuus
scope note: deprecated on 2018.10.24

kaksitoistasäveljärjestelmä
type: Concept
created: 1996-02-07
is replaced by: Y95760
modified: 2017-09-21T13:39:51+03:00
alternative label: dodekafonia
alternative label: dodekafoni @sv
broader: säveljärjestelmät
broader: atonaalisuus
definition: Sävellystekniikka, jossa sävelasteikon 12 säveltä on määritelty tasa-arvoisiksi ja luovuttu tonaalisuuteen kuuluvista sävelten välisistä hierarkkisista suhteista. Järjestelmälle on tunnusomaista ns. sävelrivin käyttö, joka sitoo melodianmuodostuksen ennalta laadittuun sääntöön.
in scheme: MUSA/CILLA - Musiikin asiasanasto
note: Termi on tarkoitettu kirjallisuuden indeksointiin, tällä tekniikalla sävelletyn musiikin yhteydessä termiä ei ole suositeltavaa käyttää.
preferred label: tolvtonssystem @sv
scope note: deprecated on 2018.10.24

balettimusiikki
type: Concept
created: 1996-02-07
is replaced by: Y100998
modified: 2017-05-09T08:36:30+03:00
broader: näyttämömusiikki
broader: tanssimusiikki
definition: Balettien yhteydessä käytettävän (sekä balettiin sävelletyn että siinä käytetyn) musiikin yleinen nimitys, johon ei liity mitään täsmällistä tyylillistä tai esityskokoonpanoon liittyvää määritelmää.
in scheme: MUSA/CILLA - Musiikin asiasanasto
note: Termiä käytetään samoin kuin termiä elokuvamusiikki kuvaamaan funktionaalista käyttöyhteyttä musiikin tyylilajista riippumatta. Termiä käytetään normaalisti jonkin muun asiasanan kanssa, esimerkiksi balettimusiikki : kamariorkesterit : Venäjä : 1910-luku.
preferred label: balettmusik @sv
related: baletit
scope note: deprecated on 2018.10.24

kenraalibasso
type: Concept
created: 1996-02-08
is replaced by: Y96078
modified: 2017-09-21T13:24:21+03:00
alternative label: numeroitu basso
broader: soinnutus
definition: Musiikinhistoriallinen ja -teoreettinen nimitys säestysperiaatteelle, joka yleistyi 1600-luvun alkupuolella. Tekniikasta käytetään joskus myös nimitystä "numeroitu basso".
definition: Används inom musikteorin @sv
in scheme: MUSA/CILLA - Musiikin asiasanasto
note: Termiä käytetään teoriakirjallisuuden indeksoinnissa. Käytännön sovelluksissa käytettävä termi on continuo.
preferred label: generalbas @sv
related: continuo
scope note: deprecated on 2018.10.24

bluegrass
type: Concept
created: 1996-02-07
is replaced by: Y214419
modified: 2017-09-04T13:29:24+03:00
broader: country
definition: Yhdysvalloissa 1930- ja 1940-luvuilla kehittynyt valkoisen väestön akustinen ja perinteisiin nojautuva maaseutumusiikin tyyli, jota ei ole tarkoitettu tanssittavaksi. Bluegrassin alkuperäiseen esityskokoonpanoon kuuluu vain kielisoittimia, lähinnä banjo, mandoliini, kitara, dobro, viulu ja kontrabasso.
in scheme: MUSA/CILLA - Musiikin asiasanasto
related: country and western
related: hillbilly
scope note: deprecated on 2018.10.24

bolerot (sävellykset)
type: Concept
created: 1996-02-07
is replaced by: Y214762
modified: 2017-09-04T13:29:24+03:00
broader: sävellykset
definition: Sävellys, jonka tahdissa on tarkoitus tanssia boleroa tai joka tyylittelee mainitunlaista tanssisävellystä.
in scheme: MUSA/CILLA - Musiikin asiasanasto
preferred label: bolero @sv
related: tanssimusiikki
scope note: deprecated on 2018.10.24

kvintetit
type: Concept
created: 1996-02-08
is replaced by: Y214537
modified: 2017-09-21T13:24:21+03:00
alternative label: kvintetter -- ensembler @sv
broader: yhtyeet
definition: Viiden soittimen tai lauluäänen muodostaman esityskokoonpanon nimitys.
hidden label: kvintetter ensembler @sv
in scheme: MUSA/CILLA - Musiikin asiasanasto
note: Viidelle laulu- tai soitinäänelle sävelletyistä tai sovitetuista teoksista käytetään termiä kvintetot.
preferred label: kvintetter (ensembler) @sv
related: lauluyhtyeet
scope note: deprecated on 2018.10.24

nonetit
type: Concept
created: 1996-02-07
is replaced by: Y214595
modified: 2017-09-21T13:39:53+03:00
alternative label: nonetter -- ensembler @sv
broader: yhtyeet
definition: Yhdeksän soittimen tai lauluäänen muodostama esityskokoonpano.
hidden label: nonetter ensembler @sv
in scheme: MUSA/CILLA - Musiikin asiasanasto
note: Yhdeksälle laulu- tai soitinäänelle sävelletyistä tai sovitetuista teoksista käytetään termiä nonetot.
preferred label: nonetter (ensembler) @sv
related: lauluyhtyeet
scope note: deprecated on 2018.10.24

oktetit
type: Concept
created: 1996-02-07
is replaced by: Y214600
modified: 2017-09-21T13:39:53+03:00
alternative label: oktetter -- ensembler @sv
broader: yhtyeet
definition: Kahdeksan soittimen tai lauluäänen muodostama esityskokoonpano.
hidden label: oktetter ensembler @sv
in scheme: MUSA/CILLA - Musiikin asiasanasto
note: Kahdeksalle laulu- tai soitinäänelle sävelletyistä tai sovitetuista teoksista käytetään termiä oktetot.
preferred label: oktetter (ensembler) @sv
related: lauluyhtyeet
scope note: deprecated on 2018.10.24

sekstetit
type: Concept
created: 1996-02-08
is replaced by: Y214650
modified: 2017-09-21T13:39:53+03:00
alternative label: sextetter -- ensembler @sv
broader: yhtyeet
definition: Kuuden soittimen tai lauluäänen muodostaman esityskokoonpanon nimitys.
hidden label: sextetter ensembler @sv
in scheme: MUSA/CILLA - Musiikin asiasanasto
note: Kuudelle laulu- tai soitinäänelle sävelletyistä tai sovitetuista teoksista käytetään termiä sekstetot.
preferred label: sextetter (ensembler) @sv
related: lauluyhtyeet
scope note: deprecated on 2018.10.24

septetit
type: Concept
created: 1996-02-08
is replaced by: Y214651
modified: 2017-09-21T13:39:53+03:00
alternative label: septetter -- ensembler @sv
broader: yhtyeet
definition: Seitsemän soittimen tai lauluäänen muodostama esityskokoonpano.
hidden label: septetter ensembler @sv
in scheme: MUSA/CILLA - Musiikin asiasanasto
note: Seitsemälle laulu- tai soitinäänelle sävelletyistä tai sovitetuista teoksista käytetään termiä septetot.
preferred label: septetter (ensembler) @sv
related: lauluyhtyeet
scope note: deprecated on 2018.10.24

steel bandit
type: Concept
created: 1996-02-08
is replaced by: Y214679
modified: 2017-09-04T13:29:25+03:00
broader: orkesterit
broader: yhtyeet
definition: Trinidadin saarella 1930-luvulla kehittynyt esityskokoonpano, jonka soittimisto koostuu steel-rummuista (alun perin valmistettu tyhjistä öljytynnyreistä) ja joskus myös muista rytmisoittimista.
in scheme: MUSA/CILLA - Musiikin asiasanasto
preferred label: steel band @sv
related: steel pan
scope note: deprecated on 2018.10.24

triot (sävellykset)
type: Concept
created: 1996-02-09
is replaced by: Y214806
modified: 2017-09-21T13:39:53+03:00
broader: sävellykset
definition: Kolmelle soittimelle sävelletty tai sovitettu teos.
in scheme: MUSA/CILLA - Musiikin asiasanasto
note: Kolmelle lauluäänelle sävelletyistä tai sovitetuista teoksista käytetään termiä tertsetot. Kolmen soittajan muodostamasta esityskokoonpanosta käytetään termiä triot (yhtyeet).
related: kamarimusiikki
scope note: deprecated on 2018.10.24

cajun
type: Concept
created: 1996-02-07
is replaced by: Y214428
modified: 2017-09-04T13:29:25+03:00
broader: country
definition: Louisianan alueella ranskalaisten siirtolaisten kulttuurista kehittynyt perinne- ja populaarimusiikkityyli. Saman alueen ranskankielisen afroamerikkalaisen väestön vastaavasta populaarimusiikista käytetään nimitystä zydeco.
in scheme: MUSA/CILLA - Musiikin asiasanasto
related: country and western
related: zydeco
scope note: deprecated on 2018.10.24

cancanit (sävellykset)
type: Concept
created: 1996-02-07
is replaced by: Y214761
modified: 2017-09-04T13:29:25+03:00
broader: sävellykset
definition: Sävellys, jonka tahdissa on tarkoitus tanssia cancania tai joka tyylittelee mainitunlaista tanssisävellystä.
in scheme: MUSA/CILLA - Musiikin asiasanasto
related: tanssimusiikki
scope note: deprecated on 2018.10.24

canzonat
type: Concept
created: 1996-02-07
is replaced by: Y214766
modified: 2017-09-04T13:29:25+03:00
broader: sävellykset
definition: Alankomaisten koulukuntien piirissä sävelletyistä chansoneista kehittynyt soitinsävellysmuoto, joka oli käytössä 1600- ja 1700-luvuilla.
in scheme: MUSA/CILLA - Musiikin asiasanasto
preferred label: canzoner @sv
related: soitinmusiikki
scope note: deprecated on 2018.10.24

concerto grossot
type: Concept
created: 1996-02-07
is replaced by: Y214437
modified: 2017-09-04T13:29:26+03:00
broader: konsertot
definition: Barokin ajan keskeinen orkesterisävellyksen muoto, jossa solistinen soitinryhmä vuorottelee koko orkesterin kanssa.
in scheme: MUSA/CILLA - Musiikin asiasanasto
preferred label: concerto grosson @sv
related: sinfonia concertantet
related: ryhmäkonsertot
scope note: deprecated on 2018.10.24

sinfonia concertantet
type: Concept
created: 1996-02-08
is replaced by: Y214656
modified: 2017-09-04T13:29:26+03:00
alternative label: concertantet
alternative label: concertonet
alternative label: konsertoivat sinfoniat
alternative label: konsertanta symfonier @sv
broader: orkesterimusiikki
definition: Kahdelle tai useammalle soolosoittimelle ja orkesterille sävelletty konsertto, jossa on myös sinfonian elementtejä.
in scheme: MUSA/CILLA - Musiikin asiasanasto
preferred label: sinfonia concertanten @sv
related: concerto grossot
related: konsertot
scope note: deprecated on 2018.10.24

conga (tanssit)
type: Concept
created: 1996-02-07
is replaced by: Y214769
modified: 2017-09-04T13:29:26+03:00
broader: latinalaisamerikkalainen populaarimusiikki
broader: latinalaistanssit
definition: Afrokuubalaista alkuperää oleva tanssi.
in scheme: MUSA/CILLA - Musiikin asiasanasto
note: Samannimisestä rummusta käytetään termiä congarumpu.
preferred label: conga @sv
scope note: deprecated on 2018.10.24

diktaatti
type: Concept
created: 1996-02-07
is replaced by: Y214447
modified: 2017-09-04T13:29:26+03:00
broader: säveltapailu
definition: Rytmi-, sävel- tai sointusanelu, säveltapailussa käytetty opetusmenetelmä ja -aineisto.
in scheme: MUSA/CILLA - Musiikin asiasanasto
narrower: rytmidiktaatti
preferred label: diktat @sv
related: säveltapailu
scope note: deprecated on 2018.10.24

musiikkielokuvat
type: Concept
created: 1996-02-09
is replaced by: Y101180
modified: 2017-05-09T08:36:33+03:00
broader: elokuvat
definition: (1) Elokuvattu ooppera, operetti, musikaali ja muu vastaava teos sekä (2) musiikkiaiheiden ympärille muutoin rakennettu näytelmäelokuva.
in scheme: MUSA/CILLA - Musiikin asiasanasto
note: Koska musiikkia käytetään runsaasti miltei kaikessa elokuvassa, termiä ei tule käyttää muutoin kuin sen täsmällisimmässä ja rajatuimmassa muodossaan. Elokuvassa olevasta musiikista käytetään termiä elokuvamusiikki.
preferred label: musikfilmer @sv
related: elokuvamusiikki
related: musikaalit
scope note: deprecated on 2018.10.24

videomusiikki
type: Concept
created: 1996-02-15
is replaced by: Y214720
modified: 2017-09-04T13:29:26+03:00
broader: musiikki
definition: Nimitys videotaideteosten osaksi sävelletylle musiikille.
in scheme: MUSA/CILLA - Musiikin asiasanasto
note: Jos musiikkia ei ole sävelletty videoteosta varten, käytetään soveltaen ilmaisua populaarimusiikki : videotaide.
preferred label: videomusik @sv
related: elokuvamusiikki
related: musiikkivideot
scope note: deprecated on 2018.10.24

elämäkerrat
type: Concept
created: 1996-02-07
is replaced by: Y95034
modified: 2017-05-09T08:36:33+03:00
definition: Kirja tai muu julkaisu, joka käsittelee suhteellisen kattavasti yksilön elämän vaiheet. Elämäkerran on yleensä tehnyt joku muu kuin kohdehenkilö itse.
in scheme: MUSA/CILLA - Musiikin asiasanasto
narrower: muistelmat
note: Jos julkaisu ei ole ajallisesti tai uran näkökulmasta kattava, suositellaan käytettäväksi mieluummin termiä henkilöhistoria. Mikäli kyseessä on kohdehenkilön itsensä tekemä elämäkerta, käytetään sijasta tai lisäksi aina termiä muistelmat. Yhteisöiden vaiheista käytetään termiä historiikit.
preferred label: biografier @sv
related: historiikit
related: henkilöhistoria
scope note: deprecated on 2018.10.24

karaoke
type: Concept
created: 1996-02-08
is replaced by: Y107548
modified: 2017-09-21T13:39:54+03:00
definition: Termillä on kaksi merkitystä: (1) populaarimusiikin esittäminen laulamalla valmiin musiikkitaustan avulla muille esiintyen ja (2) äänitteet ja videotallenteet, jotka on tarkoitettu karaoke-esittämisen harjoitteluun.
in scheme: MUSA/CILLA - Musiikin asiasanasto
note: Karaoke-tallenteita ei pidä sotkea erityisesti taidemusiikin puolella yleisiin "music-minus-one" -tyyppisiin tallenteisiin, jotka on tarkoitettu täsmälliseen sävellyksen harjoitteluun (laulu tai soolosoitin). Näistä käytetään tarvittaessa termiä säestykset.
related: laulaminen
related: esittäminen
scope note: deprecated on 2018.10.24

esiklassismi
type: Concept
created: 1996-02-07
is replaced by: Y107941
modified: 2017-09-21T13:39:55+03:00
alternative label: esiklassiikka
alternative label: galantti tyyli
alternative label: varhaisklassiikka
alternative label: varhaisklassismi
alternative label: galant stil @sv
broader: klassismi
definition: Varsinaisen klassismin, erityisesti wieniläisklassismin kauden, varhaismuodot (mm. Mannheimin koulukunta).
in scheme: MUSA/CILLA - Musiikin asiasanasto
preferred label: förklassicism @sv
related: wieniläisklassismi
scope note: deprecated on 2018.10.24

wieniläisklassismi
type: Concept
created: 1996-02-15
is replaced by: Y104910
modified: 2017-09-21T13:39:55+03:00
broader: klassismi
definition: Nimityksellä tarkoitetaan taidemusiikin tyyliä, joka kukoisti noin 1770-1830. Tyylisuunnan tärkeimpiä edustajia olivat Joseph Haydn, Wolfgang Amadeus Mozart ja Ludwig van Beethoven.
in scheme: MUSA/CILLA - Musiikin asiasanasto
note: Termiä suositellaan käytettäväksi kirjallisuuden ja kokoelmien indeksoinnissa.
preferred label: wienklassicism @sv
related: esiklassismi
scope note: deprecated on 2018.10.24

nauhoitus
type: Concept
created: 1996-02-07
is replaced by: Y103651
modified: 2017-05-09T08:36:33+03:00
alternative label: bandinspelning -- teknik @sv
broader: äänentallennus
definition: Äänen tallentaminen erityisvalmisteiselle nauhalle osana äänentallennusprosessia. Modernissa studiossa voidaan nauha korvata digitaalisin äänentallentimin.
hidden label: bandinspelning teknik @sv
in scheme: MUSA/CILLA - Musiikin asiasanasto
preferred label: bandinspelning @sv
related: levytys
related: miksaus
scope note: deprecated on 2018.10.24

solistit
type: Concept
created: 2003-09-18
is replaced by: Y125718
modified: 2017-05-09T08:36:46+03:00
broader: muusikot
broader: esiintyjät
definition: Esiintyjä, jolla on esityksessä keskeinen rooli ja merkitys ja joka esiintyy ainakin osan ajasta yksin (mahdollisen säestyksen kera).
in scheme: MUSA/CILLA - Musiikin asiasanasto
note: Musiikissa termiä on syytä käyttää yhdessä musiikin lajia tai esityskokoonpanoa täsmentävän termin kanssa, esimerkiksi solistit : viulu. Termiä ei pidä sen yleisyyden takia käyttää systemaattisesti kaikissa julkaisuissa, joissa on yksi tai useampia solisteja, vaan lähinnä kirjallisuudessa, joka käsittelee laulamista, soittamista tai muuta esiintymistä solistin näkökulmasta.
preferred label: solister @sv
related: laulajat
scope note: deprecated on 2018.10.24

nauhurit
type: Concept
created: 1996-02-07
is replaced by: Y100920
modified: 2017-05-09T08:36:33+03:00
alternative label: magnetofonit
alternative label: magnetofoner @sv
broader: äänentallennuslaitteet
broader: äänentoistolaitteet
definition: Äänen sähkömagneettiseen tallennukseen ja toistoon tarkoitettu väline.
in scheme: MUSA/CILLA - Musiikin asiasanasto
narrower: kasettinauhurit
note: Vaikka termillä sinänsä ei viitata mihinkään tekniseen ratkaisuun, sitä suositellaan käytettäväksi vain ns. kelanauhureista, koska kasettinauhureille on oma suppeampi termi.
preferred label: bandspelare @sv
scope note: deprecated on 2018.10.24

fadot
type: Concept
created: 1996-02-07
is replaced by: Y107422
modified: 2017-09-21T13:24:21+03:00
broader: laulut
definition: Portugalilainen laulelma- ja tanssityyli.
in scheme: MUSA/CILLA - Musiikin asiasanasto
note: Termiä käytetään kuten muita laulutyylejä ilmaisevia termejä (esim. chansonit, iskelmät, kupletit), se ei ole musiikinlaji sinänsä.
preferred label: fado @sv
related: kansanlaulut
scope note: deprecated on 2018.10.24

festivaalit
type: Concept
created: 1996-02-07
is replaced by: Y101178
modified: 2017-05-09T08:36:34+03:00
definition: Laajan kulttuuritapahtumakokonaisuuden nimitys samaan tapaan kuin termeillä juhlaviikot tai musiikkijuhlat.
in scheme: MUSA/CILLA - Musiikin asiasanasto
note: Termiä käytetään tapahtumista, joita nimitetään festivaaleiksi. Useimmat rock-tapahtumat ovat Suomessa olleet festivaaleja, eivät musiikkijuhlia, jota termiä käytetään lähinnä taidemusiikin yhteydessä.
preferred label: festivaler @sv
related: juhlaviikot
related: kulttuuritapahtumat
related: musiikkijuhlat
scope note: deprecated on 2018.10.24

kulttuuritapahtumat
type: Concept
created: 1996-02-08
is replaced by: Y102804
modified: 2017-05-09T08:36:34+03:00
definition: Yleisnimitys julkisille tapahtumille, joiden ohjelma liittyy kulttuuri-ilmiöihin kuten musiikkiin, kirjallisuuteen, kuvataiteisiin tai näyttämötaiteeseen.
in scheme: MUSA/CILLA - Musiikin asiasanasto
narrower: musiikkijuhlat
note: Termiin on aina syytä liittää täsmentävä termi, ellei puhuta hyvin yleisellä tasolla. Esimerkiksi kulttuuritapahtumat : taidemusiikki : Suomi.
preferred label: kulturevenemang @sv
related: festivaalit
related: musiikkijuhlat
scope note: deprecated on 2018.10.24

kansanperinne
type: Concept
created: 1996-02-08
is replaced by: Y95868
modified: 2017-05-09T08:36:34+03:00
definition: Henkinen ja aineellinen perinne, joka edustaa aidosti oman aikansa kansallista kulttuuria. Yleensä käsitteen piiriin ei kuitenkaan lueta ns. korkeakulttuuria.
in scheme: MUSA/CILLA - Musiikin asiasanasto
narrower: kansanmusiikki
narrower: kansantanssit
note: Kun kohteena on musiikillinen kansanperinne, täytyy aina käyttää täsmentäviä termejä, esimerkiksi kansanperinne : musiikki : Etelä-Pohjanmaa.
preferred label: folktradition @sv
related: perinnemusiikki
scope note: deprecated on 2018.10.24

flyygelitorvi
type: Concept
created: 1996-02-07
is replaced by: Y214463
modified: 2017-06-28T13:50:56+03:00
broader: puhallinsoittimet
broader: vaskipuhaltimet
definition: Kornetin sukuinen vaskipuhallinsoitin.
in scheme: MUSA/CILLA - Musiikin asiasanasto
preferred label: flygelhorn @sv
related: trumpetti
scope note: deprecated on 2018.10.24

fortepiano
type: Concept
created: 1996-02-07
is replaced by: Y109516
modified: 2017-09-21T13:39:55+03:00
alternative label: vasaraklaveeri
alternative label: hammarklaver @sv
broader: kosketinsoittimet
definition: Nykyaikaisen pianon puurakenteinen varhaismuoto, jota pidetään itsenäisenä soittimena lähinnä esitysten autenttisuuspyrkimysten takia.
in scheme: MUSA/CILLA - Musiikin asiasanasto
related: piano
scope note: deprecated on 2018.10.24

klaaviharjoitukset
type: Concept
created: 2005-06-16
is replaced by: Y214523
modified: 2017-09-04T13:29:51+03:00
broader: säveltapailu
broader: nuotinluku
definition: Eri nuottiavaimille kirjoitettujen teosten tai melodioiden käytännön soitto- tai lauluharjoituksia.
in scheme: MUSA/CILLA - Musiikin asiasanasto
preferred label: klavövningar @sv
related: transponointi
scope note: deprecated on 2018.10.24

r&b
type: Concept
created: 2005-06-16
is replaced by: Y214621
modified: 2017-09-04T13:29:51+03:00
broader: popmusiikki
definition: Popmusiikin tyylilaji, jossa on hip hop -tyyliset ohjelmoidut taustat, yksinkertaiset ja typistetyt laulumelodiat sekä usein rap-osuuksia. Tyypillisiä edustajia ovat esim. TLC, Destiny's Child, R. Kelly ja Antti Tuisku.
in scheme: MUSA/CILLA - Musiikin asiasanasto
note: Termiä ei pidä sekoittaa termiin rhythm and blues, josta usein käytetään lyhennettä r & b. Tämä popmusiikkitermi kirjoitetaan yhteen ilman välilyöntejä.
related: dance
related: neo-soul
scope note: deprecated on 2018.10.24

laulaja-lauluntekijät
type: Concept
created: 2005-06-17
is replaced by: Y140775
modified: 2017-09-21T13:40:03+03:00
preferred label: singer-songwriters
broader: muusikot
definition: Käsitteellä tarkoitetaan populaarimusiikin piirissä henkilöitä (yleensä laulajia), jotka säveltäjät (ja usein myös sanoittavat) ohjelmistonsa itse. Englannin kielessä vastaava termi on singer-songwriters.
in scheme: MUSA/CILLA - Musiikin asiasanasto
related: säveltäjät
scope note: deprecated on 2018.10.24

sämpläys
type: Concept
created: 2001-11-21
is replaced by: Y214688
modified: 2017-09-04T13:29:51+03:00
alternative label: samplaus
preferred label: sampling
alternative label: sämpling @sv
broader: äänitekniikka
definition: Tekninen menetelmä, jolla toisesta yhteydestä irrotettu ääninäyte sisällytetään sellaisenaan tai muokattuna uuden teoksen osaksi.
in scheme: MUSA/CILLA - Musiikin asiasanasto
note: Termiä suositellaan käytettäväksi aina täsmentävän asiasanan kanssa, esimerkiksi sämpläys : dance.
related: syntetisaattori
related: MIDI
scope note: deprecated on 2018.10.24

masterointi
type: Concept
created: 2005-06-17
is replaced by: Y214555
modified: 2017-09-05T09:50:37+03:00
definition: Äänitteen valmistusprosessissa miksausta seuraava vaihe, jossa valmistetaan teknistaiteellisesti lopullisen tuotteen massavalmistuksessa käytettävä masteräänite.
in scheme: MUSA/CILLA - Musiikin asiasanasto
preferred label: masterredigering @sv
related: äänentallennus
related: miksaus
related: miksaukset
scope note: deprecated on 2018.10.24

DJ:t
type: Concept
created: 1998-07-07
is replaced by: Y101088
modified: 2017-09-21T13:40:03+03:00
alternative label: disc jockeyt
alternative label: discjockeyt
alternative label: tiskijukat
alternative label: discjockey @sv
alternative label: diskjockey @sv
broader: muusikot
definition: Henkilö, joka soittaa äänitettyä musiikkia tanssijoille. Populaarimusiikin esiintyvä taiteilija, joka käyttää esityksensä aineistona äänilevyjen soittamista, ohjelmointia, sämpläystä jne. omaperäisellä tavalla (mm. scratching, sämpläys, miksaus).
in scheme: MUSA/CILLA - Musiikin asiasanasto
preferred label: DJ @sv
scope note: deprecated on 2018.10.24

moriskat (sävellykset)
type: Concept
created: 2005-06-17
is replaced by: Y214791
modified: 2017-09-04T13:29:52+03:00
broader: sävellykset
definition: Sävellys, jonka tahdissa on tarkoitus tanssia moriskaa tai joka tyylittelee mainitunlaista tanssisävellystä.
in scheme: MUSA/CILLA - Musiikin asiasanasto
related: tanssimusiikki
scope note: deprecated on 2018.10.24

fandangot (sävellykset)
type: Concept
created: 2005-06-20
is replaced by: Y214775
modified: 2017-09-04T13:29:53+03:00
broader: sävellykset
definition: Sävellys, jonka tahdissa on tarkoitus tanssia fandangoa tai joka tyylittelee mainitunlaista tanssisävellystä.
in scheme: MUSA/CILLA - Musiikin asiasanasto
related: tanssimusiikki
scope note: deprecated on 2018.10.24

passepied't (sävellykset)
type: Concept
created: 2005-06-20
is replaced by: Y214797
modified: 2017-09-04T13:29:53+03:00
broader: sävellykset
definition: Sävellys, jonka tahdissa on tarkoitus tanssia passepied'ta tai joka tyylittelee mainitunlaista tanssisävellystä.
in scheme: MUSA/CILLA - Musiikin asiasanasto
related: tanssimusiikki
scope note: deprecated on 2018.10.24

pavanat (sävellykset)
type: Concept
created: 2005-06-20
is replaced by: Y214799
modified: 2017-09-04T13:29:53+03:00
broader: sävellykset
definition: Sävellys, jonka tahdissa on tarkoitus tanssia pavanaa tai joka tyylittelee mainitunlaista tanssisävellystä. Sävellystä on käytetty soitinmusiikkisarjojen osana tai itsenäisenä sävellysmuotona erityisesti luuttumusiikissa.
in scheme: MUSA/CILLA - Musiikin asiasanasto
related: tanssimusiikki
scope note: deprecated on 2018.10.24

katrillit (sävellykset)
type: Concept
created: 2005-06-21
is replaced by: Y214781
modified: 2017-09-04T13:29:53+03:00
alternative label: ruotsinkatrillit (sävellykset)
alternative label: venäjänkatrillit (sävellykset)
broader: kontratanssit (sävellykset)
definition: Sävellys, jonka tahdissa on tarkoitus tanssia katrillia tai joka tyylittelee mainitunlaista tanssisävellystä.
in scheme: MUSA/CILLA - Musiikin asiasanasto
related: tanssimusiikki
scope note: deprecated on 2018.10.24

haitarijazz
type: Concept
created: 1996-02-07
is replaced by: Y214472
modified: 2017-09-04T13:29:28+03:00
broader: populaarimusiikki
definition: Suomalainen populaarin tanssimusiikin tyylilaji, jossa on perinteisten viihdemusiikin lajien (erityisesti foxtrot) joukkoon yhdistetty hieman "jatsia" ja jossa harmonikalla on solistisia sooloja. Haitarijazzia esittivät mm. Dallapé, Ramblers ja Rytmi-Pojat 1920- ja 1930-luvuilla. Pääosa haitarijazzin piirissä esitetyistä sävellyksistä oli foxtroteja, valsseja, tangoja, polkkia ja jenkkoja. Nykypäivän korvin kuultuna haitarijazzia on suhteellisen vaikea erottaa muista menneiden vuosikymmenten tanssimusiikkityyleistä.
in scheme: MUSA/CILLA - Musiikin asiasanasto
preferred label: dragspelsjazz @sv
related: jazz
related: viihdemusiikki
scope note: deprecated on 2018.10.24

meditaatiomusiikki
type: Concept
created: 1996-02-09
is replaced by: Y214560
modified: 2017-09-04T13:29:28+03:00
broader: musiikki
definition: Nimitys kaikelle sellaiselle musiikille, joka on tarkoitettu tai jota käytetään mietiskelyn taustamusiikkina.
in scheme: MUSA/CILLA - Musiikin asiasanasto
preferred label: meditationsmusik @sv
related: ambient
related: new age -musiikki
scope note: deprecated on 2018.10.24

urut
type: Concept
created: 1996-02-09
is replaced by: Y99914
modified: 2017-09-21T13:39:44+03:00
broader: kosketinsoittimet
definition: Koskettimistolla ohjattava puhallinsoitin, jolla on useita kooltaan ja tekniikaltaan vaihtelevia muunnelmia.
in scheme: MUSA/CILLA - Musiikin asiasanasto
preferred label: orgel @sv
related: sähköurut
scope note: deprecated on 2018.10.24

ylistysmusiikki
type: Concept
created: 2006-10-02
is replaced by: Y214733
modified: 2017-09-04T13:29:54+03:00
broader: hengellinen musiikki
definition: Joidenkin kristillisten kirkkokuntien jumalanpalveluksissa ja muissa tilaisuuksissa esiintyvä yhteislaulullinen musiikinlaji, jossa useimmiten pop- ja rock-tyylipiirteet yhdistetään Jumalaa ylistävään tekstiin.
in scheme: MUSA/CILLA - Musiikin asiasanasto
preferred label: lovsångsmusik @sv
related: hengelliset laulut
related: gospelmusiikki
scope note: deprecated on 2018.10.24

harppusoittimet
type: Concept
created: 1996-02-07
is replaced by: Y110814
modified: 2017-09-21T13:39:56+03:00
broader: näppäilysoittimet
definition: Näppäilysoitin, jonka kielet ovat pystysuunnassa.
in scheme: MUSA/CILLA - Musiikin asiasanasto
narrower: harppu
preferred label: harpinstrument @sv
scope note: deprecated on 2018.10.24

nonetot
type: Concept
created: 1996-02-07
is replaced by: Y214815
modified: 2017-09-21T13:39:56+03:00
alternative label: nonetter -- kompositioner @sv
broader: sävellykset
definition: Yhdeksän soittimen tai lauluäänen muodostamalle esityskokoonpanolle tehty sävellys tai sävellystyypin nimitys.
hidden label: nonetter kompositioner @sv
in scheme: MUSA/CILLA - Musiikin asiasanasto
note: Yhdeksän soittajan tai laulajan muodostamasta esityskokoonpanosta käytetään termiä nonetit.
preferred label: nonetter (kompositioner) @sv
related: kamarimusiikki
scope note: deprecated on 2018.10.24

homofonia
type: Concept
created: 1996-02-07
is replaced by: Y101670
modified: 2017-09-21T13:39:56+03:00
broader: sävellysoppi
definition: (1) Sävellystapa, jossa on selkeästi erottuva melodia ja sitä säestävä soinnutus tai jossa (2) kaikki äänet etenevät saman rytmisen kaavan mukaisesti vastakohtana polyfoniselle tai kontrapunktiselle käsittelylle, jossa äänet etenevät itsenäisesti tai toisiaan imitoiden.
in scheme: MUSA/CILLA - Musiikin asiasanasto
preferred label: homofoni @sv
related: polyfonia
scope note: deprecated on 2018.10.24

nuorisokuorot
type: Concept
created: 1996-02-07
is replaced by: Y97690
modified: 2017-09-21T13:39:56+03:00
broader: kuorot
definition: Esityskokoonpano, joka koostuu nuorista, mutta ei enää lapsi-ikäisistä laulajista.
in scheme: MUSA/CILLA - Musiikin asiasanasto
note: Termiä käytetään vain esityskokoonpanosta, ei sillä esitetystä musiikista.
preferred label: ungdomskörer @sv
related: lapsikuorot
scope note: deprecated on 2018.10.24

kansallislaulut
type: Concept
created: 1996-02-08
is replaced by: Y95845
modified: 2017-09-21T13:39:56+03:00
alternative label: kansallishymnit
alternative label: nationalhymner @sv
broader: isänmaallinen musiikki
broader: laulut
definition: Nimitys itsenäisten valtioiden symbolina esimerkiksi juhlatilaisuuksissa soitettavalle sävelmälle.
in scheme: MUSA/CILLA - Musiikin asiasanasto
note: Termiä käytetään valtioiden kansallishymneistä riippumatta siitä, onko teos julkaisussa tai esityksessä varustettu tekstillä vai ei. Soitinversioiden yhteydessä termi on syytä varustaa esityskokoonpanon täsmenteellä, esimerkiksi kansallislaulut : puhallinorkesterit : Suomi. Maantieteellistä täsmennettä käytetään aina viittaamaan valtioon, jonka kansallislaulusta on kyse.
preferred label: nationalsånger @sv
scope note: deprecated on 2018.10.24

ohjelmat
type: Concept
created: 1996-02-07
is replaced by: Y200911
modified: 2017-05-09T08:36:35+03:00
definition: Konsertin, festivaalin tai muun vastaavan esityksen sisällön ilmaiseva julkaisu. Joukkoviestimien ohjelmista käytetään YSA:n termejä radio-ohjelmat ja televisio-ohjelmat.
in scheme: MUSA/CILLA - Musiikin asiasanasto
narrower: konserttiohjelmat
narrower: musiikkiohjelmat
note: Käyttöyhteys on termin monimerkityksisyyden takia aina ilmaistava täsmentävillä asiasanoilla, esimerkiksi ohjelmat : konsertit : musiikkijuhlat : Helsinki.
preferred label: program @sv
related: ohjelmistot
scope note: deprecated on 2018.10.24

konserttiohjelmat
type: Concept
created: 1996-02-08
is replaced by: Y210537
modified: 2017-09-21T13:39:56+03:00
broader: ohjelmat
definition: Konsertin seuraajille painettu ja jaettava luettelo konsertissa esitettävästä ohjelmasta.
in scheme: MUSA/CILLA - Musiikin asiasanasto
note: Jos halutaan kuvailla itse ohjelmistoja, käytetään ketjua konsertit : ohjelmistot.
preferred label: konsertprogram @sv
related: konsertit
scope note: deprecated on 2018.10.24

oktetot
type: Concept
created: 1996-02-07
is replaced by: Y214816
modified: 2017-09-21T13:39:56+03:00
alternative label: oktetter -- kompositioner @sv
broader: sävellykset
definition: Kahdeksan soittimen tai lauluäänen muodostamalle esityskokoonpanolle tehty sävellys tai sävellystyypin nimitys.
hidden label: oktetter kompositioner @sv
in scheme: MUSA/CILLA - Musiikin asiasanasto
note: Kahdeksan soittajan tai laulajan muodostamasta esityskokoonpanosta käytetään termiä oktetit.
preferred label: oktetter (kompositioner) @sv
related: kamarimusiikki
scope note: deprecated on 2018.10.24

soitinnus
type: Concept
created: 1996-02-08
is replaced by: Y104357
modified: 2017-09-21T13:24:21+03:00
alternative label: instrumentaatio
alternative label: orkestraatio
alternative label: orkestrointi
alternative label: orkestrering @sv
broader: musiikinteoria
definition: Sävellyksen äänten jakaminen yksittäisille soittimille tai soitinryhmille.
in scheme: MUSA/CILLA - Musiikin asiasanasto
preferred label: instrumentation @sv
related: sovitukset
related: sovittaminen
scope note: deprecated on 2018.10.24

sormitukset
type: Concept
created: 1996-02-08
is replaced by: Y171546
modified: 2017-09-21T13:24:22+03:00
broader: soittaminen
definition: Soittimen hallinnassa käytettävä järjestelmä, jonka mukaan sormia liikutellaan koskettimistolla, kielillä, otelaudalla, sormiaukoilla tai läpillä.
in scheme: MUSA/CILLA - Musiikin asiasanasto
note: Koska termiä voi käyttää erilaisten soitinten yhteydessä, soittimen tai soitinryhmän nimi on lisäksi tarpeen, esimerkiksi sormitukset : kosketinsoittimet, sormitukset : viulu.
preferred label: fingersättningar @sv
related: otetaulukot
scope note: deprecated on 2018.10.24

gavotit (sävellykset)
type: Concept
created: 2012-01-09
is replaced by: Y214776
modified: 2017-09-04T13:29:56+03:00
broader: sävellykset
definition: Sävellys, jonka tahdissa on tarkoitus tanssia gavottia tai joka tyylittelee mainitunlaista tanssisävellystä.
in scheme: MUSA/CILLA - Musiikin asiasanasto
preferred label: gavotter @sv
related: tanssimusiikki
scope note: deprecated on 2018.10.24

ska
type: Concept
created: 1996-03-06
is replaced by: Y214660
modified: 2017-09-04T13:29:29+03:00
broader: popmusiikki
definition: Jamaikalla noin vuosina 1961-1966 kukoistanut, reggaeta edeltänyt, suhteellisen nopeatempoinen populaarimusiikkityyli.
in scheme: MUSA/CILLA - Musiikin asiasanasto
related: rock
related: reggae
scope note: deprecated on 2018.10.24

surfmusiikki
type: Concept
created: 1996-02-08
is replaced by: Y214683
modified: 2017-09-04T13:29:30+03:00
broader: popmusiikki
definition: Yhdysvalloissa kehittynyt, pääosin instrumentaalinen popmusiikkityyli, jonka esityskokoonpanossa on merkittävä osa sähkökitaralla. Surfmusiikki oli pitkälti paikallista "elämäntapamusiikkia".
in scheme: MUSA/CILLA - Musiikin asiasanasto
preferred label: surfmusik @sv
related: rock
related: rautalankamusiikki
scope note: deprecated on 2018.10.24

tex mex -musiikki
type: Concept
created: 1996-02-09
is replaced by: Y214698
modified: 2017-09-04T13:29:30+03:00
broader: popmusiikki
definition: Yhdysvaltain ja Meksikon välisen rajaseutualueen perinteeseen pohjautuva populaarimusiikin muoto, eräänlainen paikallinen country-musiikin tyyli.
in scheme: MUSA/CILLA - Musiikin asiasanasto
preferred label: tex mex-musik @sv
related: country
related: rancheramusiikki
scope note: deprecated on 2018.10.24

rock and roll
type: Concept
created: 1996-02-08
is replaced by: Y214629
modified: 2017-09-04T13:29:30+03:00
broader: rock
definition: Yhdysvalloissa 1950-luvulla kehittynyt ja nimetty popmusiikin muoto, jossa on yhdistettynä sekä valkoisen että afroamerikkalaisen perinteen osia. Rock and rollia pidetään yleisesti rock-tyylien tärkeimpänä esimuotona. Rock and rollin esityskokoonpanoon kuuluvat yleensä laulajan lisäksi sähkökitara, rummut ja kontrabasso.
in scheme: MUSA/CILLA - Musiikin asiasanasto
note: Termiin on syytä aina liittää aikaa ja paikkaa ilmaisevia määreitä, koska tyylinmukaista musiikkia on tehty 2000-luvulle asti, esimerkiksi rock and roll : Suomi : 1970-luku.
related: twistit (sävellykset)
related: rockabilly
scope note: deprecated on 2018.10.24

rockabilly
type: Concept
created: 1996-03-15
is replaced by: Y121297
modified: 2017-09-21T13:39:57+03:00
broader: rock
definition: Yhdysvalloissa 1950-luvulla syntynyt tyyli, jossa yhdistyivät rhythm and blues ja hillbilly. Vakioesityskokoonpanoon kuuluvat kitara, rummut ja kontrabasso. Tyylille on tunnusomaista mm. kontrabasson slap-soittotekniikka. Tunnettuja esittäjiä ovat Elvis Presley (Sun-tuotanto), Carl Perkins, Gene Vincent ja Brian Setzer.
in scheme: MUSA/CILLA - Musiikin asiasanasto
related: rock and roll
scope note: deprecated on 2018.10.24

taidemusiikki
type: Concept
created: 1996-02-08
is replaced by: Y99237
modified: 2017-09-21T13:39:58+03:00
alternative label: klassinen musiikki
alternative label: konserttimusiikki
alternative label: länsimainen taidemusiikki
alternative label: vakava musiikki
alternative label: klassisk musik @sv
alternative label: konsertmusik @sv
alternative label: seriös musik @sv
definition: Kansanmusiikin ja populaarimusiikin ulkopuolelle jäävä musiikki. Taidemusiikki käsitteenä viittaa erityisesti 1800-luvulla syntyneeseen jaotteluun vakavan taidemusiikin ja kansanomaisen kansan- ja populaarimusiikin välillä, mutta taidemusiikiksi voidaan sanoa myös vanhaa kirkko- ja hovimusiikkia, jotka taidemusiikista eroavista funktioistaan huolimatta nähdään saman perinteen jatkumona. Taidemusiikkia yhdistävät yleensä institutionaalinen olemus, perinteisiin nojautuvat käytännöt sekä tietyt esteettiset piirteet.
in scheme: MUSA/CILLA - Musiikin asiasanasto
narrower: spektrimusiikki
note: Kirjastoluetteloissa termiä taidemusiikki käytetään karkean kolmijaon "etninen - populaari - taidemusiikki" pohjalta. Termiä suositellaan käytettäväksi kirjallisuuden indeksoinnin lisäksi vain sellaisissa tapauksissa, joissa halutaan korostaa odotusten vastaista sisältöä, esimerkiksi harmonikka : taidemusiikki, tai tuoda esille sisällön monialaisuus, esimerkiksi jazz : taidemusiikki : performanssi. Termiä ei käytetä systemaattisesti ilmaisemaan julkaisun sisältävän taidemusiikkia. Termiä voi käyttää myös ei-eurooppalaisen musiikin yhteydessä kahden täsmentävän termiketjun avulla, esimerkiksi taidemusiikki : Intia, perinnemusiikki : Intia. Jos musiikki kuitenkin on tyyliltään eurooppalaisperäistä, pelkkä maantieteellinen asiasana riittää, esimerkiksi taidemusiikki : Japani.
preferred label: konstmusik @sv
related: salonkimusiikki
scope note: deprecated on 2018.10.24

improvisointi
type: Concept
created: 1996-02-08
is replaced by: Y95544
modified: 2017-06-27T13:57:46+03:00
alternative label: improvisaatio
broader: tulkinta
definition: Nimitys esityshetkellä syntyvälle runolle, sävellykselle tai muulle esitetylle taideluomukselle. Ilmaisu sisältää ajatuksen, ettei syntynyttä lopputulosta ole etukäteen harkittu tai suunniteltu.
in scheme: MUSA/CILLA - Musiikin asiasanasto
note: Musiikissa termiin liitetään täsmenteeksi soittimen tai musiikin lajin termi.
preferred label: improvisation @sv
related: tulkinta
related: improvisaatiot (sävellykset)
scope note: deprecated on 2018.10.24

johtaminen
type: Concept
created: 1996-02-08
is replaced by: Y105031
modified: 2017-05-09T08:36:37+03:00
definition: Musiikissa työ, jota tehdään orkesterin, yhtyeen tai kuoron saamiseksi yhtenäisen taiteellisen tahdon alaiseksi.
in scheme: MUSA/CILLA - Musiikin asiasanasto
note: Termiä voi käyttää sekä soitin- että vokaalikokoonpanojen johtamisesta. Termiä on syytä täsmentää esityskokoonpanomerkinnällä, esimerkiksi johtaminen : kamariorkesterit.
preferred label: dirigering @sv
related: kuoronjohtajat
related: tulkinta
related: kapellimestarit
scope note: deprecated on 2018.10.24

yleisö
type: Concept
created: 1996-02-15
is replaced by: Y100428
modified: 2017-05-09T08:36:37+03:00
alternative label: kuulijat
alternative label: lyssnare @sv
alternative label: åhörare @sv
definition: Joukkoviestinnän, taiteellisen tai viihteellisen esityksen tai muun vastaavan tarjonnan vastaanottajajoukko.
in scheme: MUSA/CILLA - Musiikin asiasanasto
note: Termi on tarkoitettu lähinnä musiikkikirjallisuuden indeksointiin.
preferred label: publik @sv
related: tulkinta
related: vastaanotto
related: kuuntelutottumukset
scope note: deprecated on 2018.10.24

sinfoniset runot
type: Concept
created: 1996-02-08
is replaced by: Y104333
modified: 2017-09-21T13:24:22+03:00
alternative label: sävelrunot
broader: ohjelmamusiikki
broader: orkesterimusiikki
definition: Ohjelmalliseen sisältöön jollain tavalla viittaavan orkesterisävellyksen nimitys.
in scheme: MUSA/CILLA - Musiikin asiasanasto
note: Termiä käytetään vain teoksista, jotka säveltäjä tai hakuteokset ovat nimenneet sinfonisiksi runoiksi. Lisäksi on syytä käyttää myös termiä orkesterimusiikki.
preferred label: symfoniska dikter @sv
scope note: deprecated on 2018.10.24

viola da gamba
type: Concept
created: 1996-02-15
is replaced by: Y123707
modified: 2017-09-21T13:39:58+03:00
broader: jousisoittimet
definition: Otenauhallinen yleensä kuusi- tai seitsemänkielinen varsinkin renessanssin ja barokin aikana käytetty jousisoitin, jota valmistettiin eri kokoina. Varsinkin Englannissa eri korkuiset viola da gambat soittivat yhdessä ns. consort-musiikkia.
in scheme: MUSA/CILLA - Musiikin asiasanasto
related: sello
scope note: deprecated on 2018.10.24

sointuoppaat
type: Concept
created: 1996-02-08
is replaced by: Y214664
modified: 2017-09-04T13:29:17+03:00
alternative label: sointuotteet
alternative label: ackordguider @sv
broader: soitonoppaat
definition: Yksittäisen soittimen sointujen muodostamisen opas. Soittimen luonteesta riippuen soinnut voidaan näyttää koskettimistolla, otelaudalla tai muulla soittimen kaavakuvalla.
in scheme: MUSA/CILLA - Musiikin asiasanasto
note: Termiä käytetään aina yhdessä soittimen nimen kanssa, esim. sointuoppaat : kosketinsoittimet, sointuoppaat : luuttu.
preferred label: ackordtabeller @sv
related: soitonoppaat
related: otetaulukot
scope note: deprecated on 2018.10.24

kanttorit
type: Concept
created: 1996-02-08
is replaced by: Y102221
modified: 2017-05-09T08:36:38+03:00
alternative label: kanttori-urkurit
broader: muusikot
broader: kirkkomuusikot
definition: Kristillisen kirkon esilaulaja ja kuoronjohtaja, jolla on protestanttisissa maissa yleensä myös urkurin tehtäviä.
in scheme: MUSA/CILLA - Musiikin asiasanasto
preferred label: kantorer @sv
related: kirkkomuusikot
scope note: deprecated on 2018.10.24

säveltäjät
type: Concept
created: 1996-02-08
is replaced by: Y99196
modified: 2017-09-21T13:39:59+03:00
alternative label: kompositörer @sv
broader: muusikot
definition: Henkilö, joka luo sävellyksiä.
in scheme: MUSA/CILLA - Musiikin asiasanasto
note: Termiä käytetään lähinnä kirjallisuuden indeksoinnissa.
preferred label: tonsättare @sv
related: laulaja-lauluntekijät
scope note: deprecated on 2018.10.24

arvostelut
type: Concept
created: 1996-02-07
is replaced by: Y94716
modified: 2017-05-09T08:36:38+03:00
alternative label: kritiikit
alternative label: anmälningar @sv
definition: Arvostelijan työn tuloksena syntyvä suullinen, kirjallinen tai muu esitys.
in scheme: MUSA/CILLA - Musiikin asiasanasto
narrower: musiikkiarvostelut
note: Termiä suositellaan aina käytettäväksi yhdistettynä siihen ilmiöön tai teokseen, jota arvostelu koskee. Sävellyksiä ja niiden esityksiä koskevista arvosteluista käytetään aina termiä musiikkiarvostelut.
preferred label: recensioner @sv
related: arvostelijat
related: arvostelu
scope note: deprecated on 2018.10.24

luuttu
type: Concept
created: 1996-02-08
is replaced by: Y103248
modified: 2017-09-21T13:39:59+03:00
broader: näppäilysoittimet
broader: luuttusoittimet
definition: Pyöreäpohjainen, kaksoiskielin varustettu näppäilysoitin.
in scheme: MUSA/CILLA - Musiikin asiasanasto
preferred label: luta @sv
scope note: deprecated on 2018.10.24

lyyrasoittimet
type: Concept
created: 1996-02-08
is replaced by: Y103258
modified: 2017-09-21T13:24:22+03:00
broader: näppäilysoittimet
definition: Näppäilysoitin, jonka kielet ovat samansuuntaisesti soittimen kannen kanssa. Soittimeen kuuluu kaikukopan ja kielten lisäksi kaksi sivuvartta ja poikkipuu.
in scheme: MUSA/CILLA - Musiikin asiasanasto
narrower: jouhikko
preferred label: lyrinstrument @sv
scope note: deprecated on 2018.10.24

polska (tanssit)
type: Concept
created: 1996-02-08
is replaced by: Y216495
modified: 2017-11-02T09:01:20+02:00
broader: tanssit
broader: kansantanssit
definition: Alun perin puolalainen, mutta Suomeen Ruotsista levinnyt kansantanssi, jolla saattaa olla yhteinen syntytausta poloneesin ja masurkan kanssa. Termillä tarkoitetaan myös tämän nimisiä tanssisävellyksiä.
in scheme: MUSA/CILLA - Musiikin asiasanasto
preferred label: polskor (danser) @sv
related: hambo (tanssit)
scope note: deprecated on 2018.10.24

sitra
type: Concept
created: 1996-02-08
is replaced by: Y110743
modified: 2017-09-21T13:39:59+03:00
broader: näppäilysoittimet
broader: sitrasoittimet
definition: Saksassa ja Itävalloissa kehittynyt nykyään tunnetuin sitrasoitin, jossa on viisi melodiakieltä ja 24-37 säestyskieltä.
in scheme: MUSA/CILLA - Musiikin asiasanasto
preferred label: cittra @sv
scope note: deprecated on 2018.10.24

steel-kitara
type: Concept
created: 1996-02-08
is replaced by: Y214681
modified: 2017-09-04T13:29:32+03:00
broader: näppäilysoittimet
definition: Yhdysvalloissa 1930-luvulla havaijinkitarasta kehitetty magneettisia mikrofoneja käyttävä versio.
in scheme: MUSA/CILLA - Musiikin asiasanasto
preferred label: steel guitar @sv
related: kitara
scope note: deprecated on 2018.10.24

canzonettat
type: Concept
created: 2017-07-11
is replaced by: Y214767
modified: 2017-09-04T13:30:06+03:00
broader: sävellykset
definition: Kepeähkö italialaistyylinen maallinen säkeistölaulu.
in scheme: MUSA/CILLA - Musiikin asiasanasto
related: laulumusiikki
scope note: deprecated on 2018.10.24

lambada (tanssit)
type: Concept
created: 2001-11-21
is replaced by: Y214785
modified: 2017-07-18T11:51:26+03:00
broader: tanssit
broader: latinalaistanssit
definition: Karibian meren saarilla ja pohjoisessa Brasiliassa harrastettu paritanssi.
in scheme: MUSA/CILLA - Musiikin asiasanasto
preferred label: lambada @sv
scope note: deprecated on 2018.10.24

hambot (sävellykset)
type: Concept
created: 2017-07-12
is replaced by: Y214473
modified: 2017-07-12T15:24:21+03:00
broader: sävellykset
in scheme: MUSA/CILLA - Musiikin asiasanasto
related: tanssimusiikki
related: polskat (sävellykset)
scope note: deprecated on 2018.10.24

polskat (sävellykset)
type: Concept
created: 2017-07-12
is replaced by: Y103988
modified: 2017-11-02T08:58:48+02:00
broader: sävellykset
in scheme: MUSA/CILLA - Musiikin asiasanasto
related: tanssimusiikki
related: hambot (sävellykset)
scope note: deprecated on 2018.10.24

tarantellat (sävellykset)
type: Concept
created: 1996-02-08
is replaced by: Y214805
modified: 2017-09-04T13:29:32+03:00
broader: sävellykset
definition: Sävellys, jonka tahdissa on tarkoitus tanssia tarantellaa tai joka tyylittelee mainitunlaista tanssisävellystä.
in scheme: MUSA/CILLA - Musiikin asiasanasto
note: Jos termiä käytetään taidemusiikin yhteydessä, siihen on liitettävä esityskokoonpanoa ilmaiseva merkintä, esimerkiksi tarantellat : piano : Puola.
related: tanssimusiikki
scope note: deprecated on 2018.10.24

jousiorkesterit
type: Concept
created: 1996-02-08
is replaced by: Y101958
modified: 2017-09-21T13:24:22+03:00
broader: orkesterit
broader: kamariorkesterit
definition: Länsimaisen taidemusiikin esittämiseen alunperin tarkoitettu yli yhdeksän hengen esityskokoonpano, jonka soittimisto koostuu jousisoittimista (voi sisältää continuon ja muutamia lyömäsoittimia). 1900-luvulta alkaen kokoonpanoa on käytetty runsaasti myös populaarimusiikissa.
in scheme: MUSA/CILLA - Musiikin asiasanasto
note: Jos orkesterissa on mukana myös muihin soitinryhmiin kuuluvia soittimia, mutta kyseessä ei ole täysimittainen sinfoniaorkesteri, käytetään termiä kamariorkesterit.
preferred label: stråkorkestrar @sv
scope note: deprecated on 2018.10.24

kamariorkesterit
type: Concept
created: 1996-02-08
is replaced by: Y102142
modified: 2017-09-21T13:39:59+03:00
broader: orkesterit
definition: Kamariorkesterina pidetään esityskokoonpanoa, jossa on edustajia vähintään kahdesta soitinperheestä ja jossa on korkeintaan noin 25 soittajaa. Tätä suuremmista kokoonpanoista käytetään termejä orkesterit, sinfoniaorkesterit ja puhallinorkesterit. Jos kokoonpanossa on vain jousisoittimia (lisäksi voi olla joitakin lyömäsoittimia), käytetään termiä jousiorkesterit.
in scheme: MUSA/CILLA - Musiikin asiasanasto
narrower: jousiorkesterit
preferred label: kammarorkestrar @sv
scope note: deprecated on 2018.10.24

sotilassoittokunnat
type: Concept
created: 1996-02-08
is replaced by: Y104029
modified: 2017-05-09T08:36:39+03:00
broader: puhallinorkesterit
broader: soittokunnat
definition: Sotilaallisten organisaatioiden yhteydessä toimiva puhallinorkesteri.
in scheme: MUSA/CILLA - Musiikin asiasanasto
preferred label: militärmusikkårer @sv
related: sotilasmusiikki
scope note: deprecated on 2018.10.24

western swing
type: Concept
created: 1996-02-15
is replaced by: Y214719
modified: 2017-09-04T13:29:32+03:00
broader: country
definition: Yhdysvaltain lounaisosissa 1930-luvulla kehittynyt countryn tyyli, jossa on vahvasti vaikutteita jazzista, erityisesti swingistä.
in scheme: MUSA/CILLA - Musiikin asiasanasto
related: country and western
related: hillbilly
scope note: deprecated on 2018.10.24

rancheramusiikki
type: Concept
created: 1996-02-08
is replaced by: Y214622
modified: 2017-06-28T09:53:39+03:00
broader: latinalaisamerikkalainen populaarimusiikki
definition: Yhdysvaltain ja Meksikon raja-alueilla kehittynyt countryn tyylilaji, josta on puolestaan kehittynyt tex mex -musiikki.
in scheme: MUSA/CILLA - Musiikin asiasanasto
preferred label: rancheramusik @sv
related: country
related: tex mex -musiikki
scope note: deprecated on 2018.10.24

son-musiikki
type: Concept
created: 1996-02-08
is replaced by: Y214671
modified: 2017-09-04T13:29:32+03:00
broader: latinalaisamerikkalainen populaarimusiikki
definition: Yleisnimitys Meksikon maaseudun mestitsien musiikkityyleille, jotka kehittyivät 1700-luvulla espanjalaisten, afrikkalaisten ja alkuperäisten musiikkitraditioiden sekoituksena. (Grove; Alejandro L. Madrid: Music in Mexico.)
definition: Avser son av spanskt ursprung som spelas i Central-Amerika, isht. i Mexiko. @sv
in scheme: MUSA/CILLA - Musiikin asiasanasto
narrower: mariachimusiikki
preferred label: son-musik @sv
related: son
scope note: deprecated on 2018.10.24

äänilevyt
type: Concept
created: 1996-02-15
is replaced by: Y100512
modified: 2017-05-09T08:36:39+03:00
alternative label: vinyylilevyt
definition: Äänite, jossa informaatio on jollain tekniikalla koodattu pyörivän kiekon pintaan.
in scheme: MUSA/CILLA - Musiikin asiasanasto
narrower: CD-äänilevyt
narrower: SACD-levyt
note: Sanastossa ei ole termejä kaikille erityyppisille äänilevyille, joten tarkempi tieto niistä on merkittävä luettelointitietueen huomautuksiin.
preferred label: grammofonskivor @sv
related: DVD-levyt
scope note: deprecated on 2018.10.24

symbaali
type: Concept
created: 1996-02-08
is replaced by: Y103262
modified: 2017-09-21T13:39:59+03:00
broader: lyömäsoittimet
definition: Metallinen, yksittäin tai pareittain käytettävä lyömäsoitin.
in scheme: MUSA/CILLA - Musiikin asiasanasto
preferred label: cymbal @sv
related: dulcimer
scope note: deprecated on 2018.10.24

pasodoblet (sävellykset)
type: Concept
created: 1996-02-08
is replaced by: Y214795
modified: 2017-09-04T13:29:33+03:00
alternative label: paso doblet (sävellykset)
broader: sävellykset
definition: Sävellys, jonka tahdissa on tarkoitus tanssia pasodoblea tai joka tyylittelee mainitunlaista tanssisävellystä.
in scheme: MUSA/CILLA - Musiikin asiasanasto
related: latinalaisamerikkalainen populaarimusiikki
scope note: deprecated on 2018.10.24

kisällilaulut
type: Concept
created: 1996-02-08
is replaced by: Y102559
modified: 2017-05-09T08:36:39+03:00
broader: poliittiset laulut
broader: laulut
definition: Termiä käytetään historiallisesta laulutyylistä, joka kehittyi 1920-luvulla suomalaisen työväenliikkeen nuorison harrastustoiminnan osana. Tekstiltään kisällilaulut olivat yleensä poliittisia tai pilkkalauluja, sävelmät olivat pääosin lainattu tunnetuista kansan- ja populaarikappaleista.
in scheme: MUSA/CILLA - Musiikin asiasanasto
preferred label: gesällvisor @sv
related: työväenlaulut
scope note: deprecated on 2018.10.24

kaksoiskonsertot
type: Concept
created: 1996-02-08
is replaced by: Y214515
modified: 2017-09-04T13:29:33+03:00
broader: konsertot
definition: Konsertto kahdelle soolosoittimelle ja orkesterille.
in scheme: MUSA/CILLA - Musiikin asiasanasto
preferred label: dubbelkonserter @sv
related: ryhmäkonsertot
related: kolmoiskonsertot
scope note: deprecated on 2018.10.24

kolmoiskonsertot
type: Concept
created: 1996-02-08
is replaced by: Y214526
modified: 2017-09-04T13:29:33+03:00
broader: konsertot
definition: Konsertto kolmelle soolosoittimille ja orkesterille.
in scheme: MUSA/CILLA - Musiikin asiasanasto
preferred label: trippelkonserter @sv
related: ryhmäkonsertot
related: kaksoiskonsertot
scope note: deprecated on 2018.10.24

kvintetot
type: Concept
created: 1996-02-08
is replaced by: Y214814
modified: 2017-09-21T13:40:00+03:00
alternative label: kvintetter -- kompositioner @sv
broader: sävellykset
definition: Viiden soittimen tai lauluäänen muodostamalle esityskokoonpanolle tehty sävellys tai sävellystyypin nimitys.
hidden label: kvintetter kompositioner @sv
in scheme: MUSA/CILLA - Musiikin asiasanasto
note: Viiden soittajan tai laulajan muodostamasta esityskokoonpanosta käytetään termiä kvintetit.
preferred label: kvintetter (kompositioner) @sv
related: kamarimusiikki
scope note: deprecated on 2018.10.24

sekstetot
type: Concept
created: 1996-02-08
is replaced by: Y214818
modified: 2017-09-21T13:40:00+03:00
alternative label: sextetter -- kompositioner @sv
broader: sävellykset
definition: Kuuden soittimen tai lauluäänen muodostamalle esityskokoonpanolle tehty sävellys tai sävellystyypin nimitys.
hidden label: sextetter kompositioner @sv
in scheme: MUSA/CILLA - Musiikin asiasanasto
note: Kuuden soittajan tai laulajan muodostamasta esityskokoonpanosta käytetään termiä sekstetit.
preferred label: sextetter (kompositioner) @sv
related: kamarimusiikki
scope note: deprecated on 2018.10.24

kontrapunkti
type: Concept
created: 1996-02-08
is replaced by: Y102667
modified: 2017-09-21T13:24:22+03:00
broader: sävellysoppi
definition: Äänenkuljetustapa - sekä tätä tekniikkaa käsittelevä oppi -, jossa sävellys rakentuu kahden tai useamman äänen itsenäisestä, melodisesti mielekkäästä rakenteesta.
in scheme: MUSA/CILLA - Musiikin asiasanasto
preferred label: kontrapunkt @sv
related: polyfonia
scope note: deprecated on 2018.10.24

kuuntelutottumukset
type: Concept
created: 1996-02-08
is replaced by: Y96592
modified: 2017-05-09T08:36:41+03:00
definition: Musiikin kuuntelemiseen liittyvien tapojen kokonaisuus musiikkisosiologiassa.
in scheme: MUSA/CILLA - Musiikin asiasanasto
preferred label: lyssnarvanor @sv
related: vastaanotto
related: yleisö
related: musiikkimaku
scope note: deprecated on 2018.10.24

musiikkimaku
type: Concept
created: 1996-02-09
is replaced by: Y110589
modified: 2017-09-21T13:24:22+03:00
definition: Yksilön musiikilliset mieltymykset.
in scheme: MUSA/CILLA - Musiikin asiasanasto
preferred label: musiksmak @sv
related: vastaanotto
related: kuuntelutottumukset
scope note: deprecated on 2018.10.24

piratismi
type: Concept
created: 1996-02-08
is replaced by: Y98136
modified: 2017-07-12T14:33:42+03:00
alternative label: piratverksamhet @sv
broader: tekijänoikeus
definition: Ammattimainen tekijänoikeussäädöksiä rikkova toiminta (radiolähetykset, äänitteiden ja muiden tallenteiden valmistaminen ja myynti).
in scheme: MUSA/CILLA - Musiikin asiasanasto
preferred label: pirattryck @sv
related: bootlegit
scope note: deprecated on 2018.10.24

rondomuoto
type: Concept
created: 1996-02-08
is replaced by: Y214631
modified: 2017-09-05T11:09:46+03:00
broader: muoto-oppi
definition: Sävellysmuoto, jossa rondoteema vuorottelee erilaisten välitaitteiden kanssa.
in scheme: MUSA/CILLA - Musiikin asiasanasto
narrower: rondot
preferred label: rondoform @sv
related: rondot
scope note: deprecated on 2018.10.24

sointiväri
type: Concept
created: 1996-02-08
is replaced by: Y186418
modified: 2017-10-10T11:29:05+03:00
alternative label: timbre
broader: musiikinteoria
definition: Äänentuottamistavan, soivan (värähtelevän) kielen, ilmapatsaan, kalvon tms. kokonais- ja osavärähtelyjen, resonoivien ja ääntä kaiuttavien (soitin)rakenteiden yhteissointi, jonka ansiosta pystytään tunnistamaan, millä soittimella tai lauluäänialalla sävelet on tuotettu.
in scheme: MUSA/CILLA - Musiikin asiasanasto
preferred label: klangfärg @sv
related: musiikinteoria
scope note: deprecated on 2018.10.24

sointuanalyysi
type: Concept
created: 1996-02-08
is replaced by: Y208940
modified: 2017-09-21T13:40:01+03:00
broader: musiikkianalyysi
broader: sointuoppi
definition: Sävelteosten sointurakenteen ja soinnutuksen analyysi.
in scheme: MUSA/CILLA - Musiikin asiasanasto
preferred label: harmonianalys @sv
scope note: deprecated on 2018.10.24

soitinrakennus
type: Concept
created: 1996-02-08
is replaced by: Y98904
modified: 2017-09-21T13:24:22+03:00
definition: Musiikin tuottamiseen tarkoitettujen soittimien valmistaminen.
in scheme: MUSA/CILLA - Musiikin asiasanasto
note: Soitinrakennuksen piiriin ei lueta teknisten tallenteiden toistamiseen tarkoitettujen laitteiden, kuten levysoittimien, valmistusta.
preferred label: instrumentbyggeri @sv
related: soittimet
related: musiikkiteknologia
scope note: deprecated on 2018.10.24

soolot
type: Concept
created: 1996-02-08
is replaced by: Y104367
modified: 2017-09-21T13:24:22+03:00
definition: Yhdelle soittimelle ilman säestystä sävelletty teos.
in scheme: MUSA/CILLA - Musiikin asiasanasto
narrower: kadenssit
narrower: sävellykset
preferred label: solonummer @sv
scope note: deprecated on 2018.10.24

sovittajat
type: Concept
created: 1996-02-08
is replaced by: Y104404
modified: 2017-09-21T13:24:22+03:00
alternative label: arrangörer -- musik @sv
definition: Henkilö, joka sovittaa sävellyksen toiselle kokoonpanolle tai toisen musiikkityylin mukaiseksi.
hidden label: arrangörer musik @sv
in scheme: MUSA/CILLA - Musiikin asiasanasto
note: Koska termillä on arkikielessä myös muita kuin musiikillisia merkityksiä, sitä on käytettävä yhdessä jonkin musiikkitermin kanssa, esimerkiksi sovittajat : viihdemusiikki : orkesterit.
preferred label: arrangörer (musik) @sv
related: sovitukset
related: sovittaminen
scope note: deprecated on 2018.10.24

musiikin esittäminen
type: Concept
created: 1996-02-09
is replaced by: Y214581
modified: 2017-09-04T13:29:35+03:00
alternative label: musiikki -- esittäminen
alternative label: musikaliskt framförande @sv
broader: esittäminen
hidden label: musiikki esittäminen
in scheme: MUSA/CILLA - Musiikin asiasanasto
narrower: musiikin tulkinta
narrower: viheltäminen
preferred label: musikframförande @sv
scope note: deprecated on 2018.10.24

moodit
type: Concept
created: 1996-02-09
is replaced by: Y175470
modified: 2017-09-04T13:29:36+03:00
broader: säveljärjestelmät
definition: (1) Taidemusiikin teoriassa sävelsuku tai (2) rytminen kaava 1200-luvun musiikissa.
in scheme: MUSA/CILLA - Musiikin asiasanasto
note: Jos termiä käytetään muussa merkityksessä kuin sävelsukuna, on käytettävä täsmentäviä asiasanoja.
preferred label: modus @sv
related: modaalisuus
related: sävellajit
related: kirkkosävellajit
scope note: deprecated on 2018.10.24

äänitykset
type: Concept
created: 1997-10-01
is replaced by: Y214742
modified: 2017-09-04T13:29:37+03:00
alternative label: levytykset
alternative label: skivinspelningar @sv
broader: äänentallennus
definition: Musiikin tms. äänittämisen prosessi, jonka englanninkielinen vastine on "recording session".
in scheme: MUSA/CILLA - Musiikin asiasanasto
narrower: cover-versiot
note: Termiä voi käyttää myös konkreettisista äänitysprosessien tuotteista, varsinkin yksittäisen artistin tietylle levymerkille tekemistä äänityksistä koottuja kokoelmia indeksoitaessa, esimerkiksi Complete Sun Recordings. Termiä voi käyttää myös yksittäisestä sävellyksestä tehtyjä versioita sisältävän kokoomajulkaisun yhteydessä.
preferred label: inspelningar @sv
related: historialliset äänitykset
related: levytys
scope note: deprecated on 2018.10.24

häämusiikki
type: Concept
created: 1996-02-08
is replaced by: Y101766
modified: 2017-09-21T13:39:44+03:00
broader: juhlamusiikki
definition: Musiikki, jota käytetään tai joka esiintyy häämenojen yhteydessä, esimerkiksi häämarssit ja häävalssit.
in scheme: MUSA/CILLA - Musiikin asiasanasto
narrower: häämarssit
narrower: häävalssit
note: Termiä suositellaan käytettäväksi lähinnä häämusiikiksi nimettyjen kokoelmien yhteydessä sekä silloin, kun kyseessä on erityisesti häihin sävelletty musiikki.
preferred label: bröllopsmusik @sv
scope note: deprecated on 2018.10.24

yhteislaulu
type: Concept
created: 1996-02-15
is replaced by: Y103040
modified: 2017-09-21T13:39:44+03:00
broader: laulumusiikki
definition: Sosiaalinen tapahtuma, jossa amatöörivoimin, mutta esilaulajan ja mahdollisesti säestäjän tukemana, lauletaan kaikille osallistujille tuttuja lauluja, yleensä yksiäänisenä unisonokuorona.
in scheme: MUSA/CILLA - Musiikin asiasanasto
preferred label: allsång @sv
related: yksinlaulu
related: laulaminen
scope note: deprecated on 2018.10.24

musikaalit
type: Concept
created: 1996-02-09
is replaced by: Y103606
modified: 2017-05-09T08:36:24+03:00
broader: näyttämömusiikki
broader: musiikkinäytelmät
definition: Yhdysvalloissa 1900-luvun aikana kehittynyt populaarimusiikin tyyleihin perustuva näyttämömusiikkiteos. Musikaalien juuret ovat eurooppalaisessa kevyessä musiikkiteatterissa ja opereteissa.
in scheme: MUSA/CILLA - Musiikin asiasanasto
note: Termiä voi käyttää sekä kokonaisten musikaalien että niistä poimittujen laulujen yhteydessä. Jälkimmäisessä tapauksessa käytetään kuitenkin ensimmäisenä asiasanana soveltaen ilmaisua laulut : musikaalit. Termiä käytetään myös elokuvattujen musikaalien indeksoinnissa, esimerkiksi musikaalit : elokuvat, elokuvamusiikki : musikaalit. Jos käsitellään musikaali-ilmiötä, merkitään musiikkiteatteri : musikaalit.
preferred label: musikaler @sv
related: operetit
related: musiikkielokuvat
scope note: deprecated on 2018.10.24

marssit
type: Concept
created: 1996-02-09
is replaced by: Y103428
modified: 2017-09-21T13:39:42+03:00
definition: Alkuperältään sotilaallinen, tasatahtinen ja kaksijakoinen musiikin laji. Historiallisesti termillä on tarkoitettu myös täysin ei-sotilaallisia sävellyksiä, joita on käytetty mm. juhlallisissa tilaisuuksissa.
in scheme: MUSA/CILLA - Musiikin asiasanasto
narrower: surumarssit
narrower: häämarssit
note: Termin tarkempi luonne ilmaistaan lisätermeillä, esimerkiksi marssit : kamariorkesterit : Itävalta : 1780-luku, marssit : sotilasmusiikki : Suomi.
preferred label: marscher @sv
related: sotilasmusiikki
scope note: deprecated on 2018.10.24

laulunoppaat
type: Concept
created: 1998-03-02
is replaced by: Y103041
modified: 2017-09-21T13:24:19+03:00
alternative label: laulukoulut
definition: Opas, jonka avulla on tarkoitus oppia laulamaan yksin, yhtyeessä tai kuorossa.
in scheme: MUSA/CILLA - Musiikin asiasanasto
note: Termiä on syytä täsmentää tapauksen mukaan, esimerkiksi laulunoppaat : kuorot, laulunoppaat : yksinlaulu.
preferred label: sångskolor @sv
related: soitonoppaat
related: laulaminen
related: nuottijulkaisut
scope note: deprecated on 2018.10.24

sähköurut
type: Concept
created: 1996-02-08
is replaced by: Y104480
modified: 2017-09-21T13:39:43+03:00
broader: sähkösoittimet
broader: kosketinsoittimet
definition: Elektroninen kosketinsoitin, jolla tuotetaan mm. urkuja matkivia ääniä. Kehittyneimmät sähköurut ovat lähellä syntetisaattoreita.
in scheme: MUSA/CILLA - Musiikin asiasanasto
preferred label: elorgel @sv
related: urut
scope note: deprecated on 2018.10.24

cembalo
type: Concept
created: 1996-02-07
is replaced by: Y101045
modified: 2017-09-21T13:39:46+03:00
broader: kosketinsoittimet
definition: Koskettimistolla varustettu näppäilysoitin, jossa ääni syntyy metallikieliä näppäilevillä "kynsillä". Kielet ovat koskettimiin nähden pituussuunnassa.
in scheme: MUSA/CILLA - Musiikin asiasanasto
related: klavikordi
related: virginaali
scope note: deprecated on 2018.10.24

saksofoni
type: Concept
created: 1996-02-08
is replaced by: Y104255
modified: 2017-09-21T13:39:46+03:00
broader: puhallinsoittimet
broader: lehdykkäsoittimet
broader: puupuhaltimet
definition: 1800-luvulla keksitty lehdykkäpuhallinsoitin, jota on käytetty sekä taide- että populaarimusiikissa.
in scheme: MUSA/CILLA - Musiikin asiasanasto
preferred label: saxofon @sv
scope note: deprecated on 2018.10.24

klarinetti
type: Concept
created: 1996-02-08
is replaced by: Y96255
modified: 2017-09-21T13:39:46+03:00
broader: puhallinsoittimet
broader: lehdykkäsoittimet
broader: puupuhaltimet
definition: Eurooppalainen puupuhallin, jossa on yksinkertainen värähtelevä ruokolehti.
in scheme: MUSA/CILLA - Musiikin asiasanasto
preferred label: klarinett @sv
scope note: deprecated on 2018.10.24

harmonikka
type: Concept
created: 1996-02-07
is replaced by: Y95292
modified: 2017-09-21T13:39:43+03:00
alternative label: haitari
alternative label: hanuri
alternative label: dragharmonika @sv
broader: kosketinsoittimet
definition: Pienikokoinen vapaalehdykkäsoitin, jonka ilmansyöttö tapahtuu käsipalkein ja joka on varustettu soittimen kummassakin päässä olevalla koskettimistolla tai näppäimistöllä.
in scheme: MUSA/CILLA - Musiikin asiasanasto
narrower: bandoneon
narrower: musetteharmonikka
preferred label: dragspel @sv
scope note: deprecated on 2018.10.24

aariat
type: Concept
created: 1996-02-06
is replaced by: Y100528
modified: 2017-05-09T08:36:26+03:00
alternative label: ariettat
broader: laulumusiikki
definition: Oopperaan, operettiin, oratorioon, kantaattiin, serenataan tai muuhun vastaavaan teokseen sisältyvä yksittäinen, yleensä orkesterin säestyksellä esitettävä laulu.
in scheme: MUSA/CILLA - Musiikin asiasanasto
narrower: konserttiaariat
note: Termiä käytetään vain laulumusiikissa (sekä oopperoiden yhteydessä että itsenäisenä laulutyyppinä). Soitinmusiikissa samaa alkuperää oleva termi on airit.
preferred label: arior @sv
related: airit
related: resitatiivit
scope note: deprecated on 2018.10.24

surumusiikki
type: Concept
created: 1996-02-08
is replaced by: Y104444
modified: 2017-09-21T13:39:48+03:00
alternative label: hautajaismusiikki
broader: juhlamusiikki
definition: Nimitys musiikille, joka säveltäjän ilmaisemalla tavalla tai myöhemmin vakiintuneen käyttöyhteyden kautta yhdistetään yksilöllisen tai yhteisöllisen surun ilmaisemiseen.
in scheme: MUSA/CILLA - Musiikin asiasanasto
narrower: surumarssit
note: Jos sävellys on muodoltaan marssi, käytetään täsmällisempää ilmaisua surumarssit.
preferred label: sorgemusik @sv
related: lamentaatiot
scope note: deprecated on 2018.10.24

alkusoitot
type: Concept
created: 1996-02-07
is replaced by: Y100688
modified: 2017-09-21T13:39:48+03:00
alternative label: uvertyrer @sv
broader: soitinmusiikki
definition: (1) Oopperan, oratorion tai muun vastaavan laajamuotoisen sävellyksen aloittava soitinosa tai (2) itsenäinen, mutta kestoltaan ja luonteeltaan prologimainen orkesterisävellys.
in scheme: MUSA/CILLA - Musiikin asiasanasto
note: Alkusoitosta ja sitä seuraavasta (tanssillisten) osien muodostamasta kokonaisuudesta (alkusoittosarja) käytetään nimitystä sarjat.
preferred label: ouvertyrer @sv
related: koraalialkusoitot
related: preludit
scope note: deprecated on 2018.10.24

kehtolaulut
type: Concept
created: 1996-02-08
is replaced by: Y96055
modified: 2017-09-21T13:39:48+03:00
broader: laulut
definition: Nimitys kaikille niille lauluille, joita eri kulttuureissa on kehittynyt pienten lasten uneen tuudittamiseksi.
in scheme: MUSA/CILLA - Musiikin asiasanasto
note: Termi on funktionaalinen ja se on syytä aina kytkeä täsmentävään termiin, esimerkiksi kehtolaulut : perinnemusiikki : Suomi.
preferred label: vaggvisor @sv
related: lastenlaulut
related: berceuset
scope note: deprecated on 2018.10.24

a cappella -musiikki
type: Concept
created: 1996-02-05
is replaced by: Y214758
modified: 2017-09-04T13:29:21+03:00
broader: laulumusiikki
broader: kuoromusiikki
definition: Säestyksetön kuoro- tai yhtyelaulumusiikki erityisesti populaarimusiikissa.
in scheme: MUSA/CILLA - Musiikin asiasanasto
note: Används om sångensembler inom populärmusiken. @sv
preferred label: a cappella @sv
related: laulumusiikki
scope note: deprecated on 2018.10.24

yksinlaulu
type: Concept
created: 1996-02-15
is replaced by: Y214731
modified: 2017-09-04T13:29:21+03:00
alternative label: soololaulu
broader: yksinlaulut
broader: laulumusiikki
definition: Eurooppalaiseen taidemusiikkiperinteeseen kuuluva säestyksellinen tai säestyksetön soololaulu ilmiönä. Sanasto ei sisällä vastaavanlaisia termejä yhtye- ja kuorolaululle.
in scheme: MUSA/CILLA - Musiikin asiasanasto
note: Termiä käytetään lähinnä kirjallisuuden indeksoinnissa. Jos indeksoidaan yksinlaulusävellyksiä, käytetään termiä yksinlaulut.
preferred label: solosång @sv
related: yhteislaulu
related: laulaminen
scope note: deprecated on 2018.10.24

kantaatit
type: Concept
created: 1996-02-08
is replaced by: Y102218
modified: 2017-09-21T13:39:49+03:00
alternative label: hengelliset konsertot
alternative label: kirkkokantaatit
alternative label: koraalikantaatit
alternative label: vokaalikonsertot
broader: laulumusiikki
definition: Historiallinen, vaihtelevan muotoisten laulumusiikkiteosten nimitys.
in scheme: MUSA/CILLA - Musiikin asiasanasto
note: Termiä voi käyttää kaikista sellaisista vokaalisävellyksistä, joille säveltäjä on antanut nimen kantaatti. Jos termiä käytetään muun kuin taidemusiikin yhteydessä, täsmentävä asiasana on välttämätön, esimerkiksi kantaatit : jazz.
preferred label: kantater @sv
related: kirkkomusiikki
related: laulumusiikki
scope note: deprecated on 2018.10.24

passiot
type: Concept
created: 1996-02-08
is replaced by: Y98024
modified: 2017-09-21T13:24:20+03:00
broader: kirkkomusiikki
broader: laulumusiikki
definition: Raamatun evankeliumien teksteihin perustuva laulusävellys, josta barokin aikana kehittyi laajamuotoinen kirkkomusiikkiteostyyppi.
in scheme: MUSA/CILLA - Musiikin asiasanasto
note: Termiä käytetään vain teoksista, jotka säveltäjä on nimennyt passioiksi.
preferred label: passioner @sv
related: laulumusiikki
scope note: deprecated on 2018.10.24

ooppera
type: Concept
created: 1996-02-07
is replaced by: Y103771
modified: 2017-05-09T08:36:27+03:00
broader: näyttämömusiikki
definition: Näyttämötaiteisiin kuuluva musiikkiteatterin muoto ilmiönä ja taidemuotona.
in scheme: MUSA/CILLA - Musiikin asiasanasto
note: Jos kohteena on yksittäinen oopperateos, käytetään termiä oopperat.
preferred label: opera @sv
related: oopperat
related: operetit
related: verismi
scope note: deprecated on 2018.10.24

acid jazz
type: Concept
created: 1996-02-06
is replaced by: Y214377
modified: 2017-09-04T13:29:22+03:00
broader: jazz
definition: 1980-luvulla syntynyt, hip hop -liikkeeseen liittyvä hard bopiin pohjautuva jazztyyli.
in scheme: MUSA/CILLA - Musiikin asiasanasto
related: fuusiomusiikki
related: hip hop
related: mainstream
scope note: deprecated on 2018.10.24

fuusiomusiikki
type: Concept
created: 1996-02-07
is replaced by: Y107430
modified: 2017-09-21T13:39:49+03:00
alternative label: jazz-rock
alternative label: popjazz
alternative label: jazzrock @sv
broader: jazz
definition: Nimitys jazzin tyylisuuntaukselle, jossa on voimakkaita pop- ja rock-musiikin elementtejä ja soittimisto koostuu pääosin sähköisistä soittimista.
in scheme: MUSA/CILLA - Musiikin asiasanasto
note: Termiä ei tule käyttää muiden fuusioiden kuvailemiseen, vaan niissä sovelletaan asiasanojen ketjuttamista, esimerkiksi progressiivinen rock : sinfoniat : Iso-Britannia : 1970-luku, perinnemusiikki : jazz : Intia.
preferred label: fusionsmusik @sv
related: acid jazz
related: rock
scope note: deprecated on 2018.10.24

boogie woogie
type: Concept
created: 1996-02-07
is replaced by: Y214420
modified: 2017-09-04T13:29:22+03:00
broader: afroamerikkalainen musiikki
definition: Useimmiten pianolla esitettävään blues-pohjaiseen basso-ostinatoon ("walking bass") perustuva populaarimusiikin tyyli.
in scheme: MUSA/CILLA - Musiikin asiasanasto
related: jazz
related: blues
related: barrelhouse piano
scope note: deprecated on 2018.10.24

preludit
type: Concept
created: 1996-02-08
is replaced by: Y100689
modified: 2017-09-21T13:24:20+03:00
alternative label: praeambulumit
alternative label: preambulumit
definition: 1400-luvulta lähtien esiintyvä sävellystyyppi, joka on tarkoitettu joko itsenäiseksi kappaleeksi tai laajemman kokonaisuuden johdatukseksi.
in scheme: MUSA/CILLA - Musiikin asiasanasto
note: Koska termiä on historiallisesti käytetty hyvin moninaisista sävellyksistä, eikä pelkästään varsinaisista "alkusoitoista", sitä käytetään aina yhdessä täsmentävän asiasanan kanssa, esimerkiksi preludit : kosketinsoitin ; Saksa : 1730-luku, preludit, orkesterit : Unkari.
preferred label: preludier @sv
related: alkusoitot
related: koraalialkusoitot
related: postludit
scope note: deprecated on 2018.10.24

orkesteritoiminta
type: Concept
created: 1996-02-07
is replaced by: Y100713
modified: 2017-09-21T13:39:51+03:00
definition: Orkestereiden muuhun kuin taiteelliseen toimintaan liittyvien toimintojen yleisnimitys.
in scheme: MUSA/CILLA - Musiikin asiasanasto
narrower: alueorkesteritoiminta
preferred label: orkesterverksamhet @sv
related: orkesterit
related: konserttitoiminta
scope note: deprecated on 2018.10.24

levyautomaatit
type: Concept
created: 1996-02-08
is replaced by: Y100947
modified: 2017-05-09T08:36:30+03:00
alternative label: jukeboksit
broader: äänentoistolaitteet
definition: Nimitys yleensä maksullisille laitteille, jotka soittavat automaattisesti äänilevyjä valinnan mukaan.
in scheme: MUSA/CILLA - Musiikin asiasanasto
preferred label: jukeboxar @sv
related: automaattisoittimet
related: levysoittimet
related: CD-soittimet
scope note: deprecated on 2018.10.24

bassokitara
type: Concept
created: 1996-02-07
is replaced by: Y101008
modified: 2017-09-21T13:39:52+03:00
broader: sähkösoittimet
broader: kitara
broader: näppäilysoittimet
definition: Erityisesti populaarimusiikissa käytetty bassosoitin, joka oli alun perin akustinen kitarasoitin. Bassokitaran äänen vahvistamiseksi kehitettiin sähköbasso.
in scheme: MUSA/CILLA - Musiikin asiasanasto
preferred label: elbas @sv
scope note: deprecated on 2018.10.24

big bandit
type: Concept
created: 1996-02-07
is replaced by: Y101016
modified: 2017-09-21T13:39:52+03:00
broader: orkesterit
definition: Populaarimusiikissa (sekä jazz että viihdemusiikki) puhallinsoitinkuoron (sektio) sisältävä orkesteri vastakohtana pienikokoisemmille yhtyeille.
in scheme: MUSA/CILLA - Musiikin asiasanasto
note: Termiä käytetään 10 tai useampia soittajia sisältävistä orkestereista.
preferred label: big band @sv
related: puhallinorkesterit
related: soittokunnat
scope note: deprecated on 2018.10.24

soittokunnat
type: Concept
created: 1996-02-08
is replaced by: Y214667
modified: 2017-09-04T13:29:24+03:00
broader: orkesterit
definition: Pääasiassa puhaltimia ja lyömäsoittimia käsittävä sotilas-, ammattikunta- (esim. poliisi, palokunta, rautatie), työväenyhdistyksen jne. orkesteri.
in scheme: MUSA/CILLA - Musiikin asiasanasto
narrower: sotilassoittokunnat
note: Jos puhallinsoittimista koostuva kokoonpano sisältää modernin puhallinorkesterin soittimet, siitä käytetään ilmaisua puhallinorkesterit. Jos tällainen kokoonpano on nimetysti osa sotilaallista organisaatiota, käytetään termiä sotilassoittokunnat.
preferred label: musikkårer @sv
related: big bandit
related: puhallinorkesterit
scope note: deprecated on 2018.10.24

hillbilly
type: Concept
created: 1996-02-07
is replaced by: Y214496
modified: 2017-09-04T13:29:24+03:00
broader: country
definition: Lähinnä Yhdysvaltain kaakkoisosan vuoristoalueilla erityisesti 1920- ja 1930-luvuilla harrastettu instrumentaalinen countryn tyyli, jossa on runsaasti vaikutteita mm. irlantilaisesta perinnemusiikista.
in scheme: MUSA/CILLA - Musiikin asiasanasto
related: bluegrass
related: country and western
related: western swing
scope note: deprecated on 2018.10.24

kvartetit
type: Concept
created: 1996-02-08
is replaced by: Y214536
modified: 2017-09-21T13:39:52+03:00
alternative label: kvartetter -- ensembler @sv
broader: yhtyeet
broader: lauluyhtyeet
definition: Neljän soittimen tai lauluäänen muodostama esityskokoonpano.
hidden label: kvartetter ensembler @sv
in scheme: MUSA/CILLA - Musiikin asiasanasto
note: Neljälle laulu- tai soitinäänelle sävelletyistä tai sovitetuista teoksista käytetään termiä kvartetot.
preferred label: kvartetter (ensembler) @sv
related: lauluyhtyeet
scope note: deprecated on 2018.10.24

zydeco
type: Concept
created: 1996-02-15
is replaced by: Y214738
modified: 2017-09-04T13:29:25+03:00
broader: populaarimusiikki
broader: afroamerikkalainen musiikki
definition: Louisianan ranskankielisen mustan väestön keskuudessa toisen maailmansodan jälkeen kehittynyt tanssimusiikkityyli, jolla on yhtymäkohtia toisaalta valkoisen väestön cajun-musiikkiin, toisaalta jazziin ja bluesiin.
in scheme: MUSA/CILLA - Musiikin asiasanasto
related: blues
related: cajun
scope note: deprecated on 2018.10.24

merengue
type: Concept
created: 1996-02-09
is replaced by: Y214567
modified: 2017-06-27T13:51:14+03:00
broader: latinalaisamerikkalainen populaarimusiikki
definition: Dominikaanisessa tasavallassa, Haitilla ja Venezuelassa harrastettava tanssimusiikin laji.
in scheme: MUSA/CILLA - Musiikin asiasanasto
related: mento
related: son
related: calypso
scope note: deprecated on 2018.10.24

CD-levyt
type: Concept
created: 1996-02-07
is replaced by: Y94098
modified: 2017-05-09T08:36:31+03:00
alternative label: laserlevyt
alternative label: laserskivor @sv
definition: Yleisnimitys erilaisille optisille CD-standardiin perustuville levyille.
in scheme: MUSA/CILLA - Musiikin asiasanasto
narrower: CD-äänilevyt
preferred label: CD-skivor @sv
related: SACD-levyt
related: SACD-soittimet
related: DVD-levyt
scope note: deprecated on 2018.10.24

CD-äänilevyt
type: Concept
created: 1996-03-18
is replaced by: Y107420
modified: 2017-05-09T08:36:31+03:00
alternative label: laserlevyt
alternative label: laserskivor @sv
broader: CD-levyt
broader: äänilevyt
definition: CD-standardiin perustuvan audiolevyn nimitys.
in scheme: MUSA/CILLA - Musiikin asiasanasto
preferred label: CD-ljudskivor @sv
related: SACD-levyt
related: DVD-levyt
scope note: deprecated on 2018.10.24

klavikordi
type: Concept
created: 1996-02-08
is replaced by: Y105382
modified: 2017-09-21T13:39:53+03:00
broader: kosketinsoittimet
definition: Eurooppalainen, suorakulmainen kosketinsoitin, joka oli aktiivisessa käytössä 1400-luvulta aina 1800-luvulle modernin pianon kehittymiseen asti.
in scheme: MUSA/CILLA - Musiikin asiasanasto
preferred label: klavikord @sv
related: cembalo
related: virginaali
scope note: deprecated on 2018.10.24

virginaali
type: Concept
created: 1996-02-15
is replaced by: Y153072
modified: 2017-09-21T13:39:53+03:00
broader: kosketinsoittimet
definition: Pienikokoinen cembalosoitin, jossa on yksi äänikerta yhdellä sormiolla ja jonka koskettimisto on suorassa kulmassa kieliin ja soittimen pitkään sivuun nähden.
in scheme: MUSA/CILLA - Musiikin asiasanasto
preferred label: virginal @sv
related: cembalo
related: klavikordi
scope note: deprecated on 2018.10.24

radiofonia
type: Concept
created: 1996-02-08
is replaced by: Y175625
modified: 2017-05-09T08:36:32+03:00
definition: Kuunnelman ja elektroakustisen musiikin keinoin toteutettu äänitaidemuoto.
in scheme: MUSA/CILLA - Musiikin asiasanasto
preferred label: radiofoni @sv
related: äänitaide
related: kuunnelmat
related: elektroakustinen musiikki
related: kollaasit
scope note: deprecated on 2018.10.24

viihdetaiteilijat
type: Concept
created: 1996-02-15
is replaced by: Y106540
modified: 2017-09-04T13:29:27+03:00
alternative label: artistit
alternative label: artister @sv
alternative label: estradartister @sv
definition: Nimitys esiintyville taiteilijoille, joiden ohjelmistoa pidetään viihteellisenä.
in scheme: MUSA/CILLA - Musiikin asiasanasto
narrower: minstrel show -esiintyjät
note: Jos termillä tarkoitetaan musiikkialan taiteilijaa, on käytettävä täsmentävää asiasanaa, esimerkiksi viihdetaiteilijat : laulajat.
preferred label: underhållningsartister @sv
related: esittäjät
related: laulajat
related: näyttämötaiteilijat
scope note: deprecated on 2018.10.24

klassismi
type: Concept
created: 1996-02-08
is replaced by: Y104950
modified: 2017-05-09T08:36:33+03:00
alternative label: klassiikka
alternative label: klassisismi
broader: tyylikaudet
definition: Taidemusiikin tyylikausi noin 1700-luvun puolivälistä 1800-luvun alkupuolelle romantiikan aikaan asti.
in scheme: MUSA/CILLA - Musiikin asiasanasto
narrower: esiklassismi
narrower: wieniläisklassismi
narrower: uusklassismi
note: Muiden tyylikausitermien tavoin termiä käytetään yhdessä musiikillisen täsmenteen kanssa, esimerkiksi klassismi : taidemusiikki : Ruotsi.
preferred label: klassicism @sv
scope note: deprecated on 2018.10.24

levytys
type: Concept
created: 1996-02-08
is replaced by: Y96851
modified: 2017-09-04T13:29:27+03:00
broader: äänentallennus
definition: Prosessi, jonka avulla ja kuluessa auditiivinen esitys taltioidaan kiinteälle alustalle (levylle tai nauhalle). Levytyksen tavoitteena on normaalisti valmistaa äänilevyjä tai -nauhoja.
in scheme: MUSA/CILLA - Musiikin asiasanasto
note: Jos halutaan indeksoida levytyksen tuloksena syntyviä tuotteita (levytyksiä), käytetään termiä äänitykset.
preferred label: skivinspelning @sv
related: äänitykset
related: nauhoitus
related: miksaus
scope note: deprecated on 2018.10.24

fagotti
type: Concept
created: 1996-02-07
is replaced by: Y101349
modified: 2017-09-21T13:39:55+03:00
broader: puhallinsoittimet
broader: lehdykkäsoittimet
broader: puupuhaltimet
definition: Matalaääninen puupuhallin, joka koostuu kahdesta yhteenliitetystä putkesta ja metallisesta s-putkesta.
in scheme: MUSA/CILLA - Musiikin asiasanasto
preferred label: fagott @sv
scope note: deprecated on 2018.10.24

funk
type: Concept
created: 1996-02-07
is replaced by: Y113138
modified: 2017-09-21T13:39:55+03:00
broader: popmusiikki
definition: Yhdysvalloissa 1960-luvulla rhythm and bluesista ja soulista kehittynyt afroamerikkalainen populaarimusiikkityyli, jolla on leimallista vahva, synkopoitu rytmiikka. Edustajia ovat mm. James Brown (1960-lopulta alkaen), J.B's, George Clinton, Parliament, Funkadelic ja Sly & the Family Stone.
in scheme: MUSA/CILLA - Musiikin asiasanasto
related: hip hop
related: soul
scope note: deprecated on 2018.10.24

kontratanssit (sävellykset)
type: Concept
created: 2005-06-16
is replaced by: Y214783
modified: 2017-09-04T13:29:51+03:00
broader: sävellykset
definition: Sävellys, jonka tahdissa on tarkoitus tanssia kontratanssia tai joka tyylittelee mainitunlaista tanssisävellystä.
in scheme: MUSA/CILLA - Musiikin asiasanasto
narrower: katrillit (sävellykset)
related: tanssimusiikki
scope note: deprecated on 2018.10.24

ryhmäkonsertot
type: Concept
created: 2005-06-16
is replaced by: Y214634
modified: 2017-09-04T13:29:51+03:00
alternative label: konsertot -- yhtyeet -- orkesterit
alternative label: neloiskonsertot
alternative label: viitoiskonsertot
alternative label: yhtyekonsertot
alternative label: konserter -- ensembler -- orkester @sv
broader: konsertot
definition: Orkesterisäestyksellinen konsertto, joissa on vähintään neljä soolosoitinta, mutta joka ei ole varsinainen concerto grosso. Pelkistä soolosoittimista (tai soolosoittimista ja continuosta) koostuvista konsertoista käytetään termiä kamarikonsertot. Tärkeitä ryhmäkonserttojen säveltäjiä ovat olleet mm. Fasch, Heinichen, Telemann ja Vivaldi.
hidden label: konsertot yhtyeet orkesterit
hidden label: konserter ensembler orkester @sv
in scheme: MUSA/CILLA - Musiikin asiasanasto
preferred label: gruppkonserter @sv
related: concerto grossot
related: kaksoiskonsertot
related: kolmoiskonsertot
scope note: deprecated on 2018.10.24

SACD-levyt
type: Concept
created: 2005-06-16
is replaced by: Y134688
modified: 2017-05-09T08:36:47+03:00
alternative label: Super Audio CD-levyt
alternative label: Super Audio CD-skivor @sv
broader: äänilevyt
definition: Yleisnimitys SACD-standardin mukaan valmistetuille levyille.
in scheme: MUSA/CILLA - Musiikin asiasanasto
note: Jos levy on ns. hybridilevy, joka sisältää sekä CD- että SACD-muotoisen audiosisällön, käytetään termiä CD-äänilevy.
preferred label: SACD @sv
related: CD-levyt
related: CD-äänilevyt
related: DVD-levyt
scope note: deprecated on 2018.10.24

bootlegit
type: Concept
created: 2005-06-16
is replaced by: Y214421
modified: 2017-09-04T13:29:51+03:00
broader: tekijänoikeus
definition: Ilman oikeudenhaltijan lupaa valmistettu ja levitetty julkaisu, tavallisimmin LP- tai CD-äänilevy. Pääosa bootleg-tallenteista sisältää konserteissa luvatta tehtyjä äänityksiä. Bootlegtallenteita levitetään sekä kaupallisesti että puhtaasti harrastuksen vuoksi.
in scheme: MUSA/CILLA - Musiikin asiasanasto
preferred label: bootlegs @sv
related: barrelhouse piano
related: piratismi
scope note: deprecated on 2018.10.24

vastaanotto
type: Concept
created: 1998-06-30
is replaced by: Y104170
modified: 2017-05-09T08:36:47+03:00
definition: Musiikin yhteydessä sävellysten ja niiden esitysten vastaanotto (kriitikot ja tavallinen yleisö).
in scheme: MUSA/CILLA - Musiikin asiasanasto
note: Termiä käytetään käsitteiden "reseptiohistoria" ja "reseptioteoria" sijasta tilanteeseen soveltuvien ketjujen avulla, esimerkiksi vastaanotto : oopperat: Suomi : 1970-luku.
preferred label: reception @sv
related: tulkinta
related: yleisö
related: kuuntelutottumukset
related: musiikkimaku
scope note: deprecated on 2018.10.24

trance
type: Concept
created: 2005-06-17
is replaced by: Y214705
modified: 2017-09-04T13:29:52+03:00
broader: elektroninen tanssimusiikki
definition: Ambient-vaikutteinen, hypnoottisia ääni- ja rytmikulkuja hyödyntävä teknomusiikin alalaji, jolle on luonteenomaista muuttumaton ja tasajakoinen (4/4) rytmitausta, jota jäsentävät lyhyet, toistuvat syntikkateemat ja ajoittaiset atmosfääriset sointivärit. Tunnettuja edustajia Aphex Twin, Joey Beltram, CJ Bolland, DJ Orkidea. Hardfloor ja Sven Väth. Lähempänä tavanomaista popmusiikkia ovat esimerkiksi Ian Van Dahl, Lasgo ja Darude.
in scheme: MUSA/CILLA - Musiikin asiasanasto
related: dance
related: house
related: tekno
scope note: deprecated on 2018.10.24

city blues
type: Concept
created: 2001-11-20
is replaced by: Y214436
modified: 2017-09-04T13:29:52+03:00
alternative label: cityblues
broader: blues
definition: 1920- ja 1930-luvuilla kaupungeissa kehittynyt bluesin tyylilaji, joka on yleensä akustista pienyhtyebluesia selvin yhteyksin jazziin. City bluesin edustajia ovat mm. Big Maceo, Tampa Red, ja Sonny Boy Williamson I.
in scheme: MUSA/CILLA - Musiikin asiasanasto
note: Myöhempien aikojen kaupunkilaisbluesista käytetään termiä urban blues.
related: urban blues
related: rhythm and blues
related: country blues
scope note: deprecated on 2018.10.24

yhteismusisointi
type: Concept
created: 2005-06-17
is replaced by: Y214730
modified: 2017-09-04T13:29:52+03:00
broader: soittaminen
broader: laulaminen
definition: Yhdessä soittamisen ja laulamisen harjoittelua. Termillä ei oteta kantaa musiikin lajiin tai laulajien/soittajien lukumäärään.
in scheme: MUSA/CILLA - Musiikin asiasanasto
narrower: kuorolaulaminen
narrower: yhtyelaulaminen
note: Termiä voidaan käyttää kirjallisuuden asiasanoituksen lisäksi nuottijulkaisuissa, esimerkiksi yhteismusisointi : orkesterit : alkeistaso.
preferred label: sammusicerande @sv
scope note: deprecated on 2018.10.24

twistit (sävellykset)
type: Concept
created: 2005-06-17
is replaced by: Y214809
modified: 2017-09-04T13:29:52+03:00
broader: sävellykset
definition: Sävellys, jonka tahdissa on tarkoitus tanssia twistiä tai joka tyylittelee mainitunlaista tanssisävellystä.
in scheme: MUSA/CILLA - Musiikin asiasanasto
related: rock and roll
related: tanssimusiikki
scope note: deprecated on 2018.10.24

miksaukset
type: Concept
created: 2005-06-17
is replaced by: Y214573
modified: 2017-09-05T10:02:16+03:00
alternative label: remiksaukset
alternative label: remixit
alternative label: uudelleenmiksaukset
broader: äänitekniikka
broader: äänentallennus
definition: Saman äänitallenteen ääniraitojen erilaisilla valinnoilla tuotetut, toisistaan poikkeavat äänitteen versiot. Ajallisesti myöhäisistä miksauksista käytetään usein termiä remiksaukset tai uudelleenmiksaukset.
in scheme: MUSA/CILLA - Musiikin asiasanasto
note: Miksausten tekijästä käytetään termiä miksaajat.
preferred label: mixningar @sv
related: äänentallennus
related: masterointi
scope note: deprecated on 2018.10.24

kamarikonsertot
type: Concept
created: 2005-06-20
is replaced by: Y214516
modified: 2017-09-04T13:29:53+03:00
alternative label: konsertot -- yhtyeet
broader: konsertot
broader: sävellykset
definition: Soitinyhtyeelle sävelletty konsertto.
hidden label: konsertot yhtyeet
in scheme: MUSA/CILLA - Musiikin asiasanasto
note: Orkesterisäestyksellisiä yhtyekonserttoja nimitetään ryhmäkonsertoiksi.
preferred label: kammarkonserter @sv
related: kamarimusiikki
related: konsertot
scope note: deprecated on 2018.10.24

polyfonia
type: Concept
created: 1996-02-08
is replaced by: Y101672
modified: 2017-09-21T13:24:21+03:00
broader: sävellysoppi
definition: Nimitys moniääniselle sävellystyylille, joka yleistyi renessanssin aikana 1300-luvulla.
in scheme: MUSA/CILLA - Musiikin asiasanasto
preferred label: polyfoni @sv
related: homofonia
related: kontrapunkti
scope note: deprecated on 2018.10.24

spirituaalit
type: Concept
created: 1996-12-04
is replaced by: Y101449
modified: 2017-09-21T13:39:44+03:00
alternative label: negro spirituaalit
alternative label: negrospirituaalit
alternative label: negro spirituals @sv
broader: hengellinen musiikki
definition: Yhdysvaltain afroamerikkalaisen väestön perinteinen suullisena perimätietona välittynyt hengellinen laulu, jollaisia on laulettu alun perin ilman säestystä ja myöhemmin myös urkujen, harmonin tms. säestyksellä, usein jumalanpalvelusten yhteydessä. Spirituaaleina pidetään myös näiden laulujen taidemusiikin omaisia sovituksia.
in scheme: MUSA/CILLA - Musiikin asiasanasto
preferred label: spirituals @sv
related: hengelliset laulut
related: gospelmusiikki
scope note: deprecated on 2018.10.24

partituurit
type: Concept
created: 1996-02-08
is replaced by: Y103887
modified: 2017-09-21T13:39:56+03:00
broader: nuottijulkaisut
definition: Nimitys nuottijulkaisulle, joka sisältää päällekkäisinä nuotinnoksina kaikki sävellyksen soivat äänet (ja mahdollisen tekstin).
in scheme: MUSA/CILLA - Musiikin asiasanasto
narrower: pianopartituurit
narrower: pienoispartituurit
note: Käytännössä käsitteen ulkopuolelle on kirjastomaailmassa rajattu yhdelle soittajalle tarkoitetut nuottijulkaisut, vaikka ääniä olisi enemmän kuin yksi. Arkikielessä termillä tarkoitetaan yleensä vain orkesteriteoksen tarkkaa nuotinnosta, mutta asiasanana termiä käytetään laajemmassa merkityksessä. Termiä ei käytetä jokaisen partituurimuotoisen julkaisun yhteydessä, vaan pääasiassa kirjallisuuden indeksoinnissa sekä ilmaisemaan oletuksesta poikkeavaa julkaisumuotoa, esimerkiksi rock : partituurit. Kaikilla musiikin dokumentoinnissa erityismääreinä käytetyillä erilaisilla partituureilla ei ole täsmällistä vastinetta Musiikin asiasanastossa. Tarvittaessa ne indeksoidaan soveltuvien lisätermien avulla, esimerkiksi partituurit : kuorot (kuoropartituuri).
preferred label: partitur @sv
scope note: deprecated on 2018.10.24

näytelmät
type: Concept
created: 1996-02-07
is replaced by: Y97723
modified: 2017-05-09T08:36:35+03:00
definition: Näyttämötaideteoksen nimitys.
in scheme: MUSA/CILLA - Musiikin asiasanasto
narrower: musiikkinäytelmät
narrower: pantomiimit
note: Musiikin indeksoinnissa termiä käytetään aina täsmentävän musiikkitermin kanssa, esimerkiksi näytelmät : rock. Täsmällistä termiä musiikkinäytelmät on suositeltavaa käyttää aina kun se on mahdollista.
preferred label: skådespel @sv
related: kuunnelmat
related: näyttämömusiikki
scope note: deprecated on 2018.10.24

opetusmenetelmät
type: Concept
created: 1996-02-07
is replaced by: Y97811
modified: 2017-05-09T08:36:46+03:00
definition: Yleisnimitys erilaisille pedagogisille metodeille.
definition: Också andra än i registret nämnda undervisningsmetoder kan användas som ämnesord. @sv
in scheme: MUSA/CILLA - Musiikin asiasanasto
narrower: Kodály-menetelmä
narrower: Orff-menetelmä
narrower: Suzuki-menetelmä
note: Musiikin opetusmenetelmät indeksoidaan aina mahdollisimman tarkasti, esim. piano : opetusmenetelmät : Suzuki-menetelmä. Myös muita kuin sanastossa nyt mainittuja menetelmiä (Kodály, Orff ja Suzuki) voi tarvittaessa käyttää vastaavalla tavalla.
preferred label: undervisningsmetoder @sv
related: opetus
scope note: deprecated on 2018.10.24

rautalankamusiikki
type: Concept
created: 1996-02-08
is replaced by: Y159239
modified: 2017-09-21T13:39:57+03:00
broader: popmusiikki
definition: Rautalankamusiikki on erityisesti Isossa-Britanniassa (The Shadows) 1950-luvun lopulla syntynyttä instrumentaalista rockia, jota soitetaan sähkökitaroilla, bassokitaralla ja rummuilla. Suomessa tyylistä innostuttiin 1960-luvulla ja suomalaiselle tyyliä edustavalle musiikille annettiin nimeksi rautalankamusiikki. Läheinen ilmiö surfmusiikki on pääosin yhdysvaltalainen ilmiö.
in scheme: MUSA/CILLA - Musiikin asiasanasto
preferred label: ståltrådsmusik @sv
related: rock
related: surfmusiikki
scope note: deprecated on 2018.10.24

country rock
type: Concept
created: 1996-02-07
is replaced by: Y127402
modified: 2017-09-21T13:39:57+03:00
broader: rock
definition: 1960-luvulla kehittynyt rock-musiikin tyyli, jossa on vaikutteita country-musiikista.
in scheme: MUSA/CILLA - Musiikin asiasanasto
related: country
related: folk rock
scope note: deprecated on 2018.10.24

cover-versiot
type: Concept
created: 2014-05-27
is replaced by: Y214443
modified: 2017-09-04T13:29:57+03:00
alternative label: cover-esitykset
alternative label: cover-levyt
alternative label: cover-levytykset
alternative label: cover-äänitteet
alternative label: coverit
alternative label: koverit
alternative label: lainakappaleet
alternative label: cover-versioner @sv
broader: äänitykset
broader: sovitukset
broader: musiikkiesitykset
definition: Populaarimusiikissa kappaleen ensimmäisen levytyksen jälkeen jonkun toisen esittäjän siitä tekemä levytys tai esitys.
in scheme: MUSA/CILLA - Musiikin asiasanasto
preferred label: covers @sv
related: tribuutit
scope note: deprecated on 2018.10.24

panhuilu
type: Concept
created: 1996-02-08
is replaced by: Y101690
modified: 2017-09-21T13:39:58+03:00
broader: puhallinsoittimet
broader: huilusoittimet
definition: Eripituisista putkista rakennettu puhallinsoitin, josta on olemassa useita muunnoksia eri musiikkikulttuureissa.
definition: Zampoña (spanska) = siku (ayamara-indianernas språk). - Instrumentet benämns ofta felaktigt panflöjt. @sv
in scheme: MUSA/CILLA - Musiikin asiasanasto
preferred label: panflöjt @sv
related: huilu
scope note: deprecated on 2018.10.24

koloratuuri
type: Concept
created: 1996-02-08
is replaced by: Y214782
modified: 2017-09-04T13:29:31+03:00
broader: ornamentiikka
definition: Eurooppalaisen taidemusiikin laulutyyleissä esiintyvä nopea kuvio ja juoksutus.
in scheme: MUSA/CILLA - Musiikin asiasanasto
preferred label: koloratur @sv
related: äänialat
related: laulaminen
scope note: deprecated on 2018.10.24

sävelasteikot
type: Concept
created: 1996-02-08
is replaced by: Y200894
modified: 2017-09-21T13:24:18+03:00
alternative label: asteikot
broader: säveljärjestelmät
definition: Säveljoukko, joka on järjestetty asteikoksi matalimmasta äänestä korkeimpaan tai toisin päin määrittämään sävellajia tai moodia. Arkikielessä käytetään usein käsitettä "skaala".
in scheme: MUSA/CILLA - Musiikin asiasanasto
preferred label: skalor @sv
related: sävellajit
related: intervallit
scope note: deprecated on 2018.10.24

kirkkomuusikot
type: Concept
created: 1996-02-08
is replaced by: Y102222
modified: 2017-05-09T08:36:38+03:00
broader: muusikot
definition: Kristillisen kirkon piirissä työskentelevä muusikko.
in scheme: MUSA/CILLA - Musiikin asiasanasto
narrower: kanttorit
note: Termiä käytetään ilmaisemaan ammattia, ei kaikista kirkkomusiikkia esimerkiksi levyllä esittävistä muusikoista.
preferred label: kyrkomusiker @sv
related: kirkkokuorot
related: kanttorit
scope note: deprecated on 2018.10.24

minnelaulajat
type: Concept
created: 1996-02-09
is replaced by: Y214574
modified: 2017-09-05T10:11:37+03:00
broader: muusikot
definition: Saksalaisella kielialueella 1100-1300-luvuilla vaikuttaneita kierteleviä muusikoita.
in scheme: MUSA/CILLA - Musiikin asiasanasto
preferred label: minnesångare @sv
related: laulajat
related: trubaduurit
related: truveerit
scope note: deprecated on 2018.10.24

minstrelit
type: Concept
created: 1996-02-09
is replaced by: Y214788
modified: 2017-09-04T13:29:31+03:00
broader: muusikot
definition: Kiertelevä tai hovissa työskentelevä kansanmuusikko 1100-1600-luvuilla. Minstrelit soittivat yleensä instrumentaalimusiikkia, mutta joskus myös lauloivat.
in scheme: MUSA/CILLA - Musiikin asiasanasto
preferred label: minstrels @sv
related: muusikot
related: laulajat
scope note: deprecated on 2018.10.24

trubaduurit
type: Concept
created: 1996-02-09
is replaced by: Y111641
modified: 2017-05-09T08:36:38+03:00
broader: muusikot
definition: Keskiaikaisia, lähinnä Etelä-Ranskan alueella toimineita runoilijoita ja muusikoita.
in scheme: MUSA/CILLA - Musiikin asiasanasto
note: Termiä ei käytetä nykyaikaisen laulelmamusiikin ja viihteen yhteydessä. Sen sijasta käytetään soveltaen termiä laulajat, esimerkiksi laulajat : laulelmat : Suomi.
preferred label: trubadurer @sv
related: laulajat
related: minnelaulajat
related: truveerit
scope note: deprecated on 2018.10.24

truveerit
type: Concept
created: 1996-02-09
is replaced by: Y180021
modified: 2017-05-09T08:36:38+03:00
broader: muusikot
definition: Keskiaikaisia, lähinnä Pohjois-Ranskan alueella toimineita runoilijoita ja muusikoita.
in scheme: MUSA/CILLA - Musiikin asiasanasto
preferred label: trouverer @sv
related: laulajat
related: minnelaulajat
related: trubaduurit
scope note: deprecated on 2018.10.24

folk metal
type: Concept
created: 2016-06-02
is replaced by: Y208934
modified: 2017-09-21T13:40:04+03:00
alternative label: Celtic metal
alternative label: folkmetalli
alternative label: kelttimetalli
alternative label: keskiaikametalli
alternative label: medieval metal
alternative label: pagan metal
alternative label: pakanametalli
alternative label: tribal metal
broader: heavy rock
definition: Heavy rockin alalaji, jossa on vaikutteita kansanmusiikista ja jonka sanoituksissa käsitellään usein mytologisia aiheita. Musiikkia esitetään pääasiassa sähköisin soittimin, mutta mukana voi myös olla kansanmusiikkisoittimia.
in scheme: MUSA/CILLA - Musiikin asiasanasto
related: kansanmusiikki
related: folk rock
scope note: deprecated on 2018.10.24

luuttusoittimet
type: Concept
created: 1996-02-08
is replaced by: Y110815
modified: 2017-09-21T13:24:22+03:00
broader: näppäilysoittimet
definition: Pyöreäpohjainen, kaksoiskielin varustettu näppäilysoitin.
in scheme: MUSA/CILLA - Musiikin asiasanasto
narrower: luuttu
preferred label: lutinstrument @sv
related: kitara
scope note: deprecated on 2018.10.24

duot (yhtyeet)
type: Concept
created: 2017-04-24
is replaced by: Y214772
modified: 2017-09-04T13:30:00+03:00
broader: yhtyeet
broader: lauluyhtyeet
definition: Yhtye, joka muodostuu kahdesta esittäjästä.
in scheme: MUSA/CILLA - Musiikin asiasanasto
note: Kahdelle lauluäänelle sävelletyistä tai sovitetuista teoksista käytetään termiä duetot. Kahdelle soittimelle sävelletyistä tai sovitetuista teoksista käytetään termiä duot (sävellykset).
preferred label: duor (ensembler) @sv
related: lauluyhtyeet
scope note: deprecated on 2018.10.24

sähkökitara
type: Concept
created: 1996-02-08
is replaced by: Y102561
modified: 2017-09-21T13:39:59+03:00
broader: sähkösoittimet
broader: kitara
broader: näppäilysoittimet
definition: Kitara, jonka ääni on sähköisesti vahvistettu. Osa sähkökitaroista on ns. puoliakustisia, jolloin syntyvä ääni on osittain akustinen.
in scheme: MUSA/CILLA - Musiikin asiasanasto
preferred label: elgitarr @sv
scope note: deprecated on 2018.10.24

kuorolaulaminen
type: Concept
created: 2017-06-26
is replaced by: Y196744
modified: 2017-07-18T11:44:51+03:00
broader: laulaminen
broader: yhteismusisointi
in scheme: MUSA/CILLA - Musiikin asiasanasto
related: yhtyelaulaminen
scope note: deprecated on 2018.10.24

yhtyelaulaminen
type: Concept
created: 2017-06-26
is replaced by: Y216446
modified: 2017-07-18T11:45:07+03:00
broader: laulaminen
broader: yhteismusisointi
in scheme: MUSA/CILLA - Musiikin asiasanasto
related: kuorolaulaminen
scope note: deprecated on 2018.10.24

triot (yhtyeet)
type: Concept
created: 1998-07-05
is replaced by: Y214807
modified: 2017-09-21T13:40:04+03:00
broader: yhtyeet
definition: Kolmen soittajan muodostama esityskokoonpano.
in scheme: MUSA/CILLA - Musiikin asiasanasto
note: Kolmelle lauluäänelle sävelletyistä tai sovitetuista teoksista käytetään termiä tertsetot. Kolmen soittajan muodostamasta esityskokoonpanosta käytetään termiä triot (yhtyeet). Kolmen laulajan muodostamasta esityskokoonpanosta käytetään termiä tertsetit.
preferred label: trior @sv
related: tertsetot
related: kamarimusiikki
scope note: deprecated on 2018.10.24

kontratanssit (tanssit)
type: Concept
created: 2005-06-16
is replaced by: Y214784
modified: 2017-07-18T11:50:58+03:00
alternative label: angleesi (tanssit)
alternative label: franseesi (tanssit)
alternative label: kotiljonki (tanssit)
broader: tanssit
definition: Seuratanssilaji, jonka suurin suosio oli 1700-luvulla. Kontratanssin versioita ovat mm. angleesi, franseesi ja kotiljonki.
in scheme: MUSA/CILLA - Musiikin asiasanasto
narrower: katrilli (tanssit)
preferred label: kontradans @sv
related: country-dancet (tanssit)
scope note: deprecated on 2018.10.24

vokaliisit (harjoitusaineistot)
type: Concept
created: 2017-07-11
is replaced by: Y214810
modified: 2017-07-18T11:56:51+03:00
broader: harjoitusaineistot
definition: Sanaton laulaminen.
in scheme: MUSA/CILLA - Musiikin asiasanasto
related: laulaminen
related: harjoitusaineistot
scope note: deprecated on 2018.10.24

tango (tanssit)
type: Concept
created: 1998-07-08
is replaced by: Y214803
modified: 2017-09-21T13:40:04+03:00
broader: latinalaisamerikkalainen populaarimusiikki
broader: tanssit
definition: Argentiinassa 1800-luvun lopulla kehittynyt kaupunkilainen tanssi, joka on 1900-luvun aikana levinnyt ympäri maailmaa, osittain eriytyneinä versioina.
in scheme: MUSA/CILLA - Musiikin asiasanasto
preferred label: tango @sv
related: latinalaistanssit
scope note: deprecated on 2018.10.24

lambadat (sävellykset)
type: Concept
created: 1996-02-08
is replaced by: Y214786
modified: 2017-09-04T13:29:32+03:00
broader: sävellykset
definition: 1980-luvulla tuli Suomessakin suosituksi samanniminen sävellys, joka on viihteellinen sovitus bolivialaisesta sävelmästä Lorando se fue.
in scheme: MUSA/CILLA - Musiikin asiasanasto
related: latinalaisamerikkalainen populaarimusiikki
related: tanssimusiikki
scope note: deprecated on 2018.10.24

protestilaulut
type: Concept
created: 1996-02-08
is replaced by: Y122065
modified: 2017-09-21T13:39:59+03:00
broader: laulut
definition: Nimitys musiikille, joka on läheistä sukua pilkkalauluille. Protestilauluissa kritiikki on suoraviivaisempaa ja voimakkaampaa.
in scheme: MUSA/CILLA - Musiikin asiasanasto
preferred label: protestsånger @sv
related: poliittiset laulut
related: pilkkalaulut
scope note: deprecated on 2018.10.24

kvartetot
type: Concept
created: 1996-02-08
is replaced by: Y214813
modified: 2017-09-21T13:40:00+03:00
alternative label: kvartetter -- kompositioner @sv
broader: sävellykset
definition: Neljän soittimen tai lauluäänen muodostamalle esityskokoonpanolle tehty sävellys tai sävellystyypin nimitys.
hidden label: kvartetter kompositioner @sv
in scheme: MUSA/CILLA - Musiikin asiasanasto
note: Neljän soittajan tai laulajan muodostamasta esityskokoonpanosta käytetään termiä kvartetit.
preferred label: kvartetter (kompositioner) @sv
related: tertsetot
related: kamarimusiikki
scope note: deprecated on 2018.10.24

septetot
type: Concept
created: 1996-02-08
is replaced by: Y214652
modified: 2017-09-21T13:40:00+03:00
alternative label: septetter -- kompositioner @sv
broader: kamarimusiikki
broader: sävellykset
definition: Seitsemän soittimen tai lauluäänen muodostamalle esityskokoonpanolle tehty sävellys tai sävellystyypin nimitys.
hidden label: septetter kompositioner @sv
in scheme: MUSA/CILLA - Musiikin asiasanasto
note: Seitsemän soittajan tai laulajan muodostamasta esityskokoonpanosta käytetään termiä septetit.
preferred label: septetter (kompositioner) @sv
related: kamarimusiikki
scope note: deprecated on 2018.10.24

sonaatit
type: Concept
created: 1996-02-08
is replaced by: Y104365
modified: 2017-09-04T13:29:33+03:00
alternative label: duosonaatit
alternative label: kamarisonaatit
alternative label: kirkkosonaatit
alternative label: soolosonaatit
definition: Sonaattimuotoinen sävellys yleensä kahdelle soittimelle, joista toinen on soolosoitin. Myös yhden soittimen soolosonaatteja on olemassa. Historiallisesti termiä on käytetty väljemmin, yleensä soitinsävellyksen nimenä.
in scheme: MUSA/CILLA - Musiikin asiasanasto
narrower: triosonaatit
note: Termiä käytetään teoksista, joille säveltäjä on antanut nimen sonaatti, aina yhdistettynä soolosoittimet nimeen, esimerkiksi sonaatit : viulu : cembalo. Säestävää soitinta ei tarvitse merkitä, jos kyseessä on vakiintunut yhdistelmä, esimerkiksi viulu : sonaatit (säestyssoittimena piano). Jos kyseessä on sonaatti yhdelle soittimelle, käytetään lisäksi termiä soolot, esimerkiksi sonaatit : sello : soolot.
preferred label: sonater @sv
related: sonaattimuoto
related: sonatiinit
related: kamarimusiikki
scope note: deprecated on 2018.10.24

musiikkielämä
type: Concept
created: 1996-02-09
is replaced by: Y103601
modified: 2017-09-21T13:24:22+03:00
definition: Yhteisön, kaupungin, maan tms. julkisten musiikkiaktiviteettien (konsertit, kritiikki, ilmestyvät kirjat, äänitteet ja nuotit jne.) nimitys.
in scheme: MUSA/CILLA - Musiikin asiasanasto
note: Termiä suositellaan käytettäväksi aina yhdistettynä siihen maantieteelliseen tai muuhun yksikköön, jonka musiikkielämästä on kyse, esimerkiksi musiikkielämä : Turku, musiikkielämä : opiskelijat.
preferred label: musikliv @sv
related: musiikkiala
related: musiikkijuhlat
related: konsertit
scope note: deprecated on 2018.10.24

konsertit
type: Concept
created: 1996-02-08
is replaced by: Y102658
modified: 2017-09-21T13:40:00+03:00
alternative label: live-konsertit
broader: musiikkiesitykset
definition: Yleisölle järjestetty musiikinesitystilaisuus.
in scheme: MUSA/CILLA - Musiikin asiasanasto
note: Termiä voi käyttää eri musiikinlajien yhteydessä kertomaan taltioinnin luonteesta, esimerkiksi rock : konsertit, kamarimusiikki : konsertit.
preferred label: konserter (framträdanden) @sv
related: konserttiohjelmat
related: musiikkielämä
scope note: deprecated on 2018.10.24

musiikkiesitykset
type: Concept
created: 1996-02-09
is replaced by: Y214583
modified: 2017-09-04T13:29:34+03:00
broader: esitykset
definition: Yleisnimitys tapahtumille, joissa musiikkia esitetään yleisölle.
in scheme: MUSA/CILLA - Musiikin asiasanasto
narrower: encoret
narrower: cover-versiot
narrower: konsertit
preferred label: musikframföranden @sv
scope note: deprecated on 2018.10.24

kantele
type: Concept
created: 1996-02-08
is replaced by: Y95889
modified: 2017-09-21T13:39:44+03:00
broader: näppäilysoittimet
broader: sitrasoittimet
definition: Suomalainen sitrasoitin, jonka sukulaisia ovat mm. kandel, kandla, kanklès, kannel, kuokle ja pyngyr. Kanteleessa on puinen runko ja viisi tai enemmän kieliä.
in scheme: MUSA/CILLA - Musiikin asiasanasto
narrower: viisikielinen kantele
scope note: deprecated on 2018.10.24

musiikkikilpailut
type: Concept
created: 1996-02-09
is replaced by: Y102482
modified: 2017-09-21T13:24:22+03:00
definition: Laulajille, soittajille ja säveltäjille järjestettävät kilpailut.
in scheme: MUSA/CILLA - Musiikin asiasanasto
narrower: laulukilpailut
narrower: soittokilpailut
narrower: sävellyskilpailut
note: Termiä on syytä käyttää yhdessä täsmentävän termin kanssa, esimerkiksi musiikkikilpailut : sello.
preferred label: musiktävlingar @sv
scope note: deprecated on 2018.10.24

sarjat (sävellykset)
type: Concept
created: 1996-02-08
is replaced by: Y206548
modified: 2017-09-04T13:29:38+03:00
alternative label: alkusoittosarjat
alternative label: kassaatiot
alternative label: parthiat
alternative label: partitat
alternative label: tanssisarjat
alternative label: kassationer @sv
alternative label: partitor @sv
broader: sävellykset
definition: Soitinmusiikissa vuosisatoja harrastettu sävellysmuotoratkaisu, jossa kokonaisuus syntyy toisiaan suunnitelmallisesti seuraavista osista. Sarjamuotoisilla sävellyksillä on historiallisesti ollut monenlaisia nimityksiä kuten sonaatti, partita, ouverture, cassazione, divertimento ja serenadi.
in scheme: MUSA/CILLA - Musiikin asiasanasto
narrower: divertimentot
narrower: notturnot
preferred label: sviter @sv
scope note: deprecated on 2018.10.24

rondot
type: Concept
created: 1996-02-08
is replaced by: Y103612
modified: 2017-09-21T13:24:22+03:00
alternative label: rondeaut
alternative label: rondinot
broader: rondomuoto
definition: Nimitys rondomuotoa noudattavalle sävellykselle tai sävellyksen osalle. Vanhemmassa musiikissa käytettiin samasta asiasta yleensä muotoa rondeau.
in scheme: MUSA/CILLA - Musiikin asiasanasto
note: Vaikka rondo voidaan määritellä kohtuullisen hyvin, sitä tulee kirjallisuuden indeksoinnin lisäksi käyttää vain sellaisista sävellyksistä ja osista, jotka säveltäjä on nimennyt rondoiksi.
preferred label: rondon @sv
related: muunnelmat
related: rondomuoto
scope note: deprecated on 2018.10.24

sanoitukset
type: Concept
created: 1996-02-08
is replaced by: Y98732
modified: 2017-05-09T08:36:42+03:00
definition: Musiikkiteoksiin tehty teksti.
in scheme: MUSA/CILLA - Musiikin asiasanasto
narrower: libretot
note: Sanoituksen kohteena oleva musiikinlaji on suositeltavaa ilmaista täydentävällä asiasanalla, esimerkiksi sanoitukset : iskelmät : Suomi. Jos sanoitus on tarkemmin määritelty libretoksi, käytetään pelkästään tai lisäksi termiä libretot.
preferred label: sångtexter @sv
related: rocklyriikka
related: laululyriikka
related: sanoittajat
scope note: deprecated on 2018.10.24

stereofonia
type: Concept
created: 1996-02-08
is replaced by: Y99028
modified: 2017-05-09T08:36:42+03:00
definition: Äänentoistotekniikassa käytettävä termi, jolla tarkoitetaan kaksikanavaista toistoa. Stereofonian perustavoitteena on äänityksessä ja toistossa jäljitellä ihmisen korvien sijaintia ja hahmotuskykyä.
in scheme: MUSA/CILLA - Musiikin asiasanasto
preferred label: stereofoni @sv
related: akustiikka
related: äänitekniikka
related: äänentoistolaitteet
related: äänentoisto
scope note: deprecated on 2018.10.24

vokaliisit (laulut)
type: Concept
created: 1996-02-15
is replaced by: Y214811
modified: 2017-09-04T13:29:36+03:00
alternative label: sanattomat laulut
broader: laulut
definition: Esitettäväksi tarkoitettu laulu, jonka teksti muodostuu pelkistä vokaaleista ilman sanallista sisältöä.
in scheme: MUSA/CILLA - Musiikin asiasanasto
preferred label: vokaliser @sv
related: laulut
related: laulaminen
scope note: deprecated on 2018.10.24

säestykset
type: Concept
created: 1997-10-01
is replaced by: Y104473
modified: 2017-09-04T13:29:37+03:00
broader: harjoitusaineistot
definition: Erikseen julkaistu säestysosuus, jonka avulla harjoitellaan soolo-osuuksia, esimerkiksi Music-minus-one -tyyppiset julkaisut.
definition: Säestäminen + säestykset = ackompanjemang @sv
in scheme: MUSA/CILLA - Musiikin asiasanasto
narrower: vapaa säestys
note: Termiä käytetään yhdessä sen termin kanssa, jonka säestämisestä on kysymys, esimerkiksi säestykset : yksinlaulut. Termiä ei koskaan käytetä säestettyjen musiikkiesitysten yhteydessä. Lähinnä populaarimusiikin yhteydessä esiintyvistä pelkän säestyksen ja laulujen sanat sisältävistä julkaisuista käytetään termiä karaoke.
preferred label: ackompanjemang @sv
related: soittaminen
related: esittäminen
related: säestäminen

kabareet
type: Concept
created: 1998-05-27
is replaced by: Y102077
modified: 2017-05-09T08:36:44+03:00
definition: Ravintolaviihteen laji tai tällaisen viihteen esityspaikka. Viihteen lajina kabareelle on ominaista monista aineksista koostuva ohjelma, joka kuitenkin muodostaa juonellisen kokonaisuuden. Suomessa 1960-luvulla kehittynyt poliittinen kabaree irtautui ravintolaympäristöstä.
in scheme: MUSA/CILLA - Musiikin asiasanasto
note: Musiikin yhteydessä termi kytketään varsinaiseen asiayhteyteen, esimerkiksi kabareet : esiintyjät : matrikkelit.
preferred label: kabaréer @sv
related: revyyt
related: showt
related: varieteet
related: näyttämömusiikki
related: vaudeville
scope note: deprecated on 2018.10.24

showt
type: Concept
created: 1998-05-27
is replaced by: Y102079
modified: 2017-05-09T08:36:45+03:00
definition: Yleisnimitys viihteelliselle näyttämöesitykselle, joka ei välttämättä koostu musiikista tai sisällä pelkästään sitä.
in scheme: MUSA/CILLA - Musiikin asiasanasto
note: Tarvittaessa käytetään asiaa täsmentäviä musiikin asiasanoja, esimerkiksi showt : viihdemusiikki : Suomi.
preferred label: shower @sv
related: kabareet
related: revyyt
related: varieteet
related: näyttämömusiikki
related: vaudeville
scope note: deprecated on 2018.10.24

varieteet
type: Concept
created: 1998-05-27
is replaced by: Y102080
modified: 2017-05-09T08:36:45+03:00
definition: Viihteellinen näyttämötaiteen laji, jolle on ominaista temaattisesti ja teknisesti vaihteleva ohjelmisto (paljon muutakin kuin musiikkia) ja orkesterisäestys. Historiallisesti tarkastellen termillä tarkoitetaan monia erinimisiä ilmiöitä eri puolilla Eurooppaa.
in scheme: MUSA/CILLA - Musiikin asiasanasto
preferred label: varietéer @sv
related: kabareet
related: revyyt
related: showt
related: näyttämömusiikki
related: vaudeville
scope note: deprecated on 2018.10.24

sointuoppi
type: Concept
created: 1996-02-08
is replaced by: Y104354
modified: 2017-09-21T13:39:44+03:00
alternative label: harmoniaoppi
alternative label: satslära @sv
broader: musiikinteoria
definition: Nimitys yhtä aikaa soivia ääniä käsittelevälle musiikinteorian osalle (harmonia).
in scheme: MUSA/CILLA - Musiikin asiasanasto
narrower: lopukkeet
narrower: soinnutus
narrower: sointuanalyysi
preferred label: harmonilära @sv
scope note: deprecated on 2018.10.24

elokuvamusiikki
type: Concept
created: 1996-02-07
is replaced by: Y94998
modified: 2017-09-04T13:29:18+03:00
broader: musiikki
definition: Elokuviin sävelletty ja niissä käytetty musiikki.
in scheme: MUSA/CILLA - Musiikin asiasanasto
note: Termiä käytetään kaikkien soundtrack-äänitteiden yhteydessä. Termiä voi myös käyttää silloin, kun kyse on elokuvamusiikiksi sävelletystä musiikista, vaikka se esiintyisi muussa yhteydessä. Kokoomaäänitteissä ja -nuoteissa, joihin on koottu elokuvissa käytettyä, mutta ei sitä varten sävellettyä musiikkia (yleensä taidemusiikkia), ja joissa yhteys elokuviin on tuotu julkaisussa selvästi ilmi, suositellaan käytettäväksi asiasanaketjua kuten esimerkiksi elokuvat : taidemusiikki : kokoelmat. Jos elokuvamusiikki on kokonaan tai pääasiassa populaarimusiikkia, termiä suositellaan käytettäväksi yhdistettynä tyylilajia ilmaisevaan asiasanaan, esimerkiksi elokuvamusiikki : iskelmät : Suomi : 1940-luku. Jos indeksoidaan elokuvassa käytettyä populaarimusiikkia, jota ei ole elokuvaan sävelletty, suositellaan termiä käytettäväksi yhdessä musiikin lajia ilmaisevan termin kanssa, esimerkiksi elokuvamusiikki : rock : Yhdysvallat : 1980-luku.
preferred label: filmmusik @sv
related: näyttämömusiikki
related: elokuvat
related: musiikkielokuvat
related: videomusiikki
scope note: deprecated on 2018.10.24

transponointi
type: Concept
created: 1996-02-09
is replaced by: Y214707
modified: 2017-09-04T13:29:18+03:00
broader: nuotinluku
definition: Sävellyksen sävellajin tai äänenkorkeuden muuttaminen ilman muita muutoksia.
in scheme: MUSA/CILLA - Musiikin asiasanasto
preferred label: transponering @sv
related: säveltapailu
related: klaaviharjoitukset
related: nuotinluku
related: sovittaminen
scope note: deprecated on 2018.10.24

sävellajit
type: Concept
created: 1996-02-08
is replaced by: Y104493
modified: 2017-09-21T13:24:18+03:00
broader: säveljärjestelmät
definition: Tonaalisen säveljärjestelmän keskeinen osakokonaisuus, jonka mukaisia nimityksiä käytetään myös yleisnimisten sävellysten ominaispiirteenä ("sinfonia C-duurissa").
in scheme: MUSA/CILLA - Musiikin asiasanasto
narrower: kirkkosävellajit
preferred label: tonarter @sv
related: moodit
related: sävelasteikot
scope note: deprecated on 2018.10.24

kansanlaulut
type: Concept
created: 1996-02-08
is replaced by: Y95862
modified: 2017-05-09T08:36:24+03:00
broader: kansanmusiikki
broader: laulut
definition: Vokaalinen kansanmusiikkiteos esityskokoonpanosta riippumatta.
in scheme: MUSA/CILLA - Musiikin asiasanasto
narrower: rekilaulut
note: Termin yhteydessä suositellaan aina käytettäväksi sekä esityskokoonpanon selvittävää täsmennettä että maantieteellistä määrettä, esimerkiksi kansanlaulut : lauluyhtyeet : Bulgaria.
preferred label: folkvisor @sv
related: joiut
related: fadot
scope note: deprecated on 2018.10.24

juhlamusiikki
type: Concept
created: 1996-02-08
is replaced by: Y101767
modified: 2017-09-21T13:24:19+03:00
definition: Musiikinlajit ja yksittäiset teokset, joita käytetään juhlatilaisuuksien yhteydessä.
in scheme: MUSA/CILLA - Musiikin asiasanasto
narrower: häämusiikki
narrower: surumusiikki
narrower: joulumusiikki
note: Koska termillä ei tarkoiteta mitään tarkemmin määriteltävissä olevaa tyyliä tms., on termiin liitettävä täsmentävä ilmaisu, esimerkiksi juhlamusiikki : syntymäpäivät : säveltäjät.
preferred label: festmusik @sv
related: rituaalimusiikki
scope note: deprecated on 2018.10.24

muoto-oppi
type: Concept
created: 1996-02-09
is replaced by: Y106043
modified: 2017-09-04T13:29:19+03:00
broader: musiikinteoria
definition: Sävelteoksen muotorakenteita käsittelevä oppi ja sen analyyttinen tai tutkimuksellinen soveltaminen.
in scheme: MUSA/CILLA - Musiikin asiasanasto
narrower: sonaattimuoto
narrower: muunnelmamuoto
narrower: rondomuoto
preferred label: formlära @sv
related: sävellysoppi
scope note: deprecated on 2018.10.24

operetit
type: Concept
created: 1996-02-07
is replaced by: Y103607
modified: 2017-05-09T08:36:25+03:00
broader: näyttämömusiikki
definition: Orkesterisäestyksinen musiikkiteatterisävellys, jossa vaihtelevat puhutut ja lauletut osat. Rajanveto musiikkinäytelmiin ja koomiseen oopperaan on häilyvä, samoin historiallisesti uudempaan musikaaliin.
in scheme: MUSA/CILLA - Musiikin asiasanasto
note: Rajanvedon vaikeuden takia termiä vain niiden teosten yhteydessä, jotka hakuteoksissakin on määritelty opereteiksi.
preferred label: operetter @sv
related: musikaalit
related: oopperat
related: musiikkinäytelmät
related: ooppera
scope note: deprecated on 2018.10.24

trumpetti
type: Concept
created: 1996-02-09
is replaced by: Y104650
modified: 2017-09-21T13:24:19+03:00
broader: puhallinsoittimet
broader: vaskipuhaltimet
definition: Vaskipuhallinsoitin, jonka ääni muodostetaan kuppisuukappaleen avulla.
in scheme: MUSA/CILLA - Musiikin asiasanasto
preferred label: trumpet @sv
related: kornetti
related: flyygelitorvi
scope note: deprecated on 2018.10.24

messut
type: Concept
created: 1996-02-09
is replaced by: Y102534
modified: 2017-09-04T13:29:20+03:00
alternative label: koraalimessut
broader: kirkkomusiikki
broader: laulumusiikki
broader: orkesterilaulut
definition: Ehtoollisjumalanpalveluksessa esitettäväksi sävelletty vähintään kaksiosainen vokaaliteos.
in scheme: MUSA/CILLA - Musiikin asiasanasto
narrower: requiemit
narrower: offertoriumit
preferred label: mässor @sv
scope note: deprecated on 2018.10.24

oboe
type: Concept
created: 1996-02-07
is replaced by: Y103724
modified: 2017-09-21T13:24:20+03:00
broader: puhallinsoittimet
broader: lehdykkäsoittimet
broader: puupuhaltimet
definition: Vastakkain värisevällä lehdykkäparilla varustettu puupuhallin.
in scheme: MUSA/CILLA - Musiikin asiasanasto
related: englannintorvi
scope note: deprecated on 2018.10.24

mainstream
type: Concept
created: 1996-02-09
is replaced by: Y214552
modified: 2017-06-27T13:25:25+03:00
broader: jazz
definition: 1950-luvulla bebopista kehittynyt pienyhtyejazzin tyyli, josta on sittemmin tullut hyvin yleinen suuntaus.
in scheme: MUSA/CILLA - Musiikin asiasanasto
narrower: cool jazz
narrower: west coast jazz
related: acid jazz
related: bebop
scope note: deprecated on 2018.10.24

rai
type: Concept
created: 1996-02-08
is replaced by: Y138135
modified: 2017-09-21T13:39:50+03:00
broader: maailmanmusiikki
broader: populaarimusiikki
definition: 1920-1930-luvulta peräisin oleva algerialainen populaarilaulutyyli, joka tyypillisesti koostuu vuorottelevista lauletuista säkeistä ja gaspah-huilulla soitetuista välikkeistä.
in scheme: MUSA/CILLA - Musiikin asiasanasto
note: Termiä ei käytetä soitinmusiikista eikä tarkoittamaan yleisemmin arabimaissa suosittuja laulutyylejä.
related: afro
related: arabialainen musiikki
scope note: deprecated on 2018.10.24

salsa
type: Concept
created: 1996-02-08
is replaced by: Y110865
is replaced by: Y217972
modified: 2017-09-21T13:39:50+03:00
broader: latinalaisamerikkalainen populaarimusiikki
broader: afroamerikkalainen musiikki
definition: 1960-1970 -lukujen New Yorkissa syntynyt afrokuubalaisen tanssimusiikin ja tanssin laji. Nimitys ei viittaa yksittäiseen tanssiin, vaan se käsittää useita latinalaisamerikkalaisen tanssimusiikin lajeja.
in scheme: MUSA/CILLA - Musiikin asiasanasto
note: Termiä suositellaan käytettäväksi kokoelmista sekä silloin, kun musiikin tarkempi laji ei ole selvillä. Täsmentävät asiasanat ovat suositeltavia, esimerkiksi salsa : tanssimusiikki : kokoelmat : Yhdysvallat.
related: jazz
related: son
scope note: deprecated on 2018.10.24

latinalaisamerikkalainen musiikki
type: Concept
created: 1996-02-08
is replaced by: Y103030
modified: 2017-09-21T13:39:50+03:00
broader: laulumusiikki
definition: Latinalaisessa Amerikassa (Meksiko, Keski- ja Etelä-Amerikka sekä Karibian saaret) esiintyvät etniset ja populaarit musiikkityylit.
in scheme: MUSA/CILLA - Musiikin asiasanasto
narrower: latinalaisamerikkalainen populaarimusiikki
narrower: timba
note: Termiä ei käytetä latinalaisessa Amerikassa sävelletystä eurooppalaisen perinteen mukaisesta taidemusiikista.
preferred label: latinamerikansk musik @sv
related: afroamerikkalainen musiikki

bebop
type: Concept
created: 1996-02-07
is replaced by: Y111659
modified: 2017-09-21T13:24:20+03:00
broader: jazz
definition: Jazzin tyylisuunta, joka syntyi swingin jälkeen yhtyekokoonpanoissa 1940-luvulla, alun perin Yhdysvaltojen suurissa kaupungeissa, erityisesti New Yorkissa.
in scheme: MUSA/CILLA - Musiikin asiasanasto
narrower: afrokuubalainen jazz
note: Koska bebop, kuten monet muutkin historialliset ilmiöt, ovat olleet suosiossa myöhemminkin, on termiin syytä liittää aina ajallinen määre.
related: mainstream
related: hard bop
scope note: deprecated on 2018.10.24

ohjelmamusiikki
type: Concept
created: 1996-02-07
is replaced by: Y179901
modified: 2017-09-21T13:39:50+03:00
broader: soitinmusiikki
definition: Sävellys, jonka avulla säveltäjä haluaa synnyttää kuulijoissa ulkomusiikillisia mielleyhtymiä. Ohjelmallisuus voi perustua teoksen nimeen, osien nimiin tai kuvailuun, soitinmusiikkiin liitettyyn runoon tai mottoon jne.
in scheme: MUSA/CILLA - Musiikin asiasanasto
narrower: sinfoniset runot
note: Koska vain joidenkin sävellysten kohdalla ohjelmallisuus on kiistaton (säveltäjä on itse sen ilmaissut), termiä on syytä käyttää harkiten.
preferred label: programmusik @sv
related: aiheet
related: motiivit
scope note: deprecated on 2018.10.24

akustiikka
type: Concept
created: 1996-02-07
is replaced by: Y94563
modified: 2017-05-09T08:36:28+03:00
alternative label: huoneakustiikka
alternative label: rakennusakustiikka
alternative label: äänioppi
alternative label: byggnadsakustik @sv
alternative label: ljudlära -- (musik) @sv
alternative label: rumsakustik @sv
definition: (1) Ääntä ja äänen ominaisuuksia tutkiva tieteen (mekaniikan) ala, (2) tilassa kuuluvaan tai soittimen tuottamaan ääneen liittyvä fysikaalinen ominaisuus.
hidden label: ljudlära (musik) @sv
in scheme: MUSA/CILLA - Musiikin asiasanasto
narrower: sähköakustiikka
note: Termiä käytetään lähinnä kirjallisuuden asiasanoituksessa.
preferred label: akustik @sv
related: äänitekniikka
related: äänentoistolaitteet
related: äänentoisto
related: stereofonia
scope note: deprecated on 2018.10.24

koraalialkusoitot
type: Concept
created: 1996-12-04
is replaced by: Y214530
modified: 2017-09-04T13:29:23+03:00
alternative label: koraalipreludit
broader: kirkkomusiikki
broader: soitinmusiikki
definition: Yleensä uruilla esitettävä lyhyt sävelmä, jonka temaattisena pohjana on jokin koraali- eli virsisävelmä.
in scheme: MUSA/CILLA - Musiikin asiasanasto
preferred label: koralförspel @sv
related: koraalit
related: alkusoitot
related: preludit
scope note: deprecated on 2018.10.24

tangot (sävellykset)
type: Concept
created: 1996-02-08
is replaced by: Y104532
modified: 2017-09-04T13:29:17+03:00
broader: latinalaisamerikkalainen populaarimusiikki
broader: sävellykset
definition: Sävellys, jonka tahdissa on tarkoitus tanssia tangoa tai joka tyylittelee mainitunlaista tanssisävellystä.
in scheme: MUSA/CILLA - Musiikin asiasanasto
related: latinalaisamerikkalainen populaarimusiikki
related: tanssimusiikki
scope note: deprecated on 2018.10.24

barrelhouse piano
type: Concept
created: 1996-02-07
is replaced by: Y214410
modified: 2017-09-04T13:29:24+03:00
broader: jazz
broader: blues
definition: Varhaiseen jazz-musiikkiin liittyvä pianonsoittotyyli, jota voidaan pitää boogie woogien edeltäjänä. Kyseessä ei ole soitintermi.
in scheme: MUSA/CILLA - Musiikin asiasanasto
related: blues
related: boogie woogie
related: bootlegit
scope note: deprecated on 2018.10.24

puhallinorkesterit
type: Concept
created: 1996-02-08
is replaced by: Y103809
modified: 2017-09-21T13:39:52+03:00
alternative label: brass bandit
alternative label: brass band @sv
broader: orkesterit
definition: Pääosin vaskipuhaltimista koostuva orkesteri.
in scheme: MUSA/CILLA - Musiikin asiasanasto
narrower: sotilassoittokunnat
note: Jos orkesteri koostuu pääosin puupuhaltimista, käytetään ensisijaisesti käsitettä kamariorkesterit.
preferred label: blåsorkestrar @sv
related: big bandit
related: soittokunnat
scope note: deprecated on 2018.10.24

mento
type: Concept
created: 1996-02-09
is replaced by: Y214566
modified: 2017-09-04T13:29:25+03:00
broader: latinalaisamerikkalainen populaarimusiikki
definition: Jamaikalla 1940-luvulla kehittynyt kansanomainen populaarimusiikkityyli, jolla on yhtymäkohtia calypso-musiikkiin.
in scheme: MUSA/CILLA - Musiikin asiasanasto
related: merengue
related: soca
related: zouk
related: calypso
scope note: deprecated on 2018.10.24

traditionaalinen jazz
type: Concept
created: 1996-02-09
is replaced by: Y214704
modified: 2017-06-29T12:05:42+03:00
broader: jazz
definition: Jazzin varhaisimpien tyylien yleisnimitys.
in scheme: MUSA/CILLA - Musiikin asiasanasto
narrower: Chicago-jazz
narrower: dixieland
narrower: New Orleans -jazz
narrower: Harlem-jazz
preferred label: traditionell jazz @sv
scope note: deprecated on 2018.10.24

elektroakustinen musiikki
type: Concept
created: 1996-02-07
is replaced by: Y101140
modified: 2017-09-21T13:24:21+03:00
alternative label: akusmaattinen musiikki
alternative label: elektronimusiikki
alternative label: elektroninen musiikki
alternative label: konkreettinen musiikki
alternative label: nauhamusiikki
alternative label: tietokonemusiikki
alternative label: bandmusik @sv
alternative label: datormusik @sv
alternative label: elektronisk musik @sv
alternative label: konkret musik @sv
definition: Uuden taidemusiikin suuntaus, joka perustuu elektronisesti tuotetun tai käsitellyn ääniaineksen käyttöön. Jos kyseessä ei ole taidemusiikin piiriin kuuluva ilmiö, käytetään termiä elektroninen populaarimusiikki.
in scheme: MUSA/CILLA - Musiikin asiasanasto
narrower: eloelektroniikka
preferred label: elektroakustisk musik @sv
related: elektroninen populaarimusiikki
related: radiofonia
related: syntetisaattori
scope note: deprecated on 2018.10.24

englannintorvi
type: Concept
created: 1996-02-07
is replaced by: Y101263
modified: 2017-09-21T13:39:54+03:00
broader: puhallinsoittimet
broader: lehdykkäsoittimet
broader: puupuhaltimet
definition: Oboen tenoriääninen versio, jota kuitenkin pidetään itsenäisenä soittimena.
in scheme: MUSA/CILLA - Musiikin asiasanasto
preferred label: engelskt horn @sv
related: oboe
scope note: deprecated on 2018.10.24

kapellimestarit
type: Concept
created: 1996-02-08
is replaced by: Y95893
modified: 2017-09-21T13:39:54+03:00
alternative label: musiikinjohtajat
alternative label: dirigenter @sv
broader: muusikot
definition: Orkesterin tai soitinyhtyeen johtaja. Kuoron tai lauluyhtyeen johtajasta käytetään termiä kuoronjohtaja.
in scheme: MUSA/CILLA - Musiikin asiasanasto
note: Termiä suositellaan käytettäväksi lähinnä musiikkikirjallisuuden yhteydessä teoksista, jotka käsittelevät kapellimestareita ja/tai heidän työtään. Yksittäisten teosten äänitteiden yhteydessä termiä ei tule käyttää.
preferred label: kapellmästare @sv
related: kuoronjohtajat
related: esittäjät
related: johtaminen
scope note: deprecated on 2018.10.24

säestäminen
type: Concept
created: 1996-02-08
is replaced by: Y104473
modified: 2017-09-21T13:39:55+03:00
definition: Solistisen esityksen tukeminen soittamalla tai laulamalla.
in scheme: MUSA/CILLA - Musiikin asiasanasto
narrower: vapaa säestys
note: Termiä käytetään vain aihetta koskevan kirjallisuuden ja laulun- ja soitonoppaiden indeksoinnissa. Musiikkiesitysten tallenteiden yhteydessä käytetään soveltaen termiä säestykset.
related: säestykset
related: soittaminen
related: esittäminen
scope note: deprecated on 2018.10.24

lasersoittimet
type: Concept
created: 2003-09-17
is replaced by: Y103003
modified: 2017-09-04T13:29:49+03:00
broader: äänentoistolaitteet
definition: Laite, joilla voidaan toistaa lasersäteellä luettavia optiseen tallennukseen perustuvia levyjä.
in scheme: MUSA/CILLA - Musiikin asiasanasto
narrower: DVD-soittimet
narrower: SACD-soittimet
narrower: CD-soittimet
note: Termi on käytössä vain alan teknisessä kirjallisuudessa, normaalisti käytetään täsmällisempiä termejä.
preferred label: laserspelare @sv
related: levysoittimet
scope note: deprecated on 2018.10.24

miksaus
type: Concept
created: 1996-02-09
is replaced by: Y108018
modified: 2017-05-09T08:36:33+03:00
definition: Levytysprosessin vaihe, jossa äänitettyjä ääniraitoja valitaan ja editoidaan lopullisen äänitteen rakentamiseksi.
in scheme: MUSA/CILLA - Musiikin asiasanasto
preferred label: mixning @sv
related: äänitekniikka
related: nauhoitus
related: äänentallennus
related: levytys
related: masterointi
scope note: deprecated on 2018.10.24

äänentallennuslaitteet
type: Concept
created: 1996-02-15
is replaced by: Y101375
modified: 2017-05-09T08:36:33+03:00
broader: musiikkiteknologia
definition: Teknisiä laitteita, joiden avulla ääntä voidaan tallentaa jonkinlaiselle fyysiselle alustalle.
in scheme: MUSA/CILLA - Musiikin asiasanasto
narrower: nauhurit
preferred label: inspelningsapparater @sv
related: äänentallennus
related: äänentoistolaitteet
related: äänentoisto
scope note: deprecated on 2018.10.24

folkmusiikki
type: Concept
created: 1996-02-07
is replaced by: Y95175
modified: 2017-09-21T13:39:55+03:00
alternative label: folkrock -- akustisk @sv
broader: popmusiikki
definition: Alkuperältään angloamerikkalainen, perinnemusiikin tyyleihin ja sävelmiin nojautuva akustisen musiikin tyylilaji, joka syntyi 1950-luvun puolivälissä ja kukoisti erityisesti 1960-luvun alkupuolella myös Yhdysvaltojen ulkopuolella.
hidden label: folkrock akustisk @sv
in scheme: MUSA/CILLA - Musiikin asiasanasto
narrower: hootenanny
note: Folkmusiikkia on tehty 1990-luvulle asti, mutta termin käyttö tulee aina rajata tyylinmukaiseen musiikkiin.
preferred label: folkrock (akustisk) @sv
related: rock
related: folk rock
scope note: deprecated on 2018.10.24

doom metal
type: Concept
created: 2005-04-25
is replaced by: Y214453
modified: 2017-09-04T13:29:51+03:00
broader: heavy rock
definition: 1980-luvulla syntynyt, äärimmäisen synkkä ja liikkumaton heavy rockin tyylilaji. Tyypillisiä edustajia ovat Anathema, Cathedral ja My Dying Bride.
in scheme: MUSA/CILLA - Musiikin asiasanasto
related: black metal
related: death metal
related: speed metal
related: thrash metal
scope note: deprecated on 2018.10.24

speed metal
type: Concept
created: 2005-04-25
is replaced by: Y214677
modified: 2017-09-04T13:29:51+03:00
broader: heavy rock
definition: 1980-luvun alussa Yhdysvalloissa syntynyt erittäin nopea ja teknisesti vaativa heavy rockin tyyli, joka on saanut vahvoja vaikutteita punk rockista. Tunnettuja edustajia ovat olleet Anthrax, Megadeth, Metallica (varhainen), Slayer ja suomalainen Stone.
in scheme: MUSA/CILLA - Musiikin asiasanasto
related: black metal
related: death metal
related: doom metal
related: thrash metal
scope note: deprecated on 2018.10.24

thrash metal
type: Concept
created: 2005-04-25
is replaced by: Y214700
modified: 2017-09-04T13:29:51+03:00
alternative label: thrash
alternative label: trash metal
broader: heavy rock
definition: 1980-luvulla syntynyt heavy rockin tyyli, joka on luonteeltaan erittäin perkussiivista ja aggressiivista. Varsinkin alussa tyyli oli nopeatempoista ja hyvin lähellä speed metal -tyyliä. Tunnettuja edustajia Pantera, Sepultura ja Voivod.
in scheme: MUSA/CILLA - Musiikin asiasanasto
related: black metal
related: death metal
related: doom metal
related: speed metal
scope note: deprecated on 2018.10.24

kuoromusiikki
type: Concept
created: 1996-02-08
is replaced by: Y96567
modified: 2017-09-21T13:39:44+03:00
broader: laulumusiikki
definition: Yleisesti kaikki kuoroille sävelletty taide-, perinne- ja populaarimusiikki.
in scheme: MUSA/CILLA - Musiikin asiasanasto
narrower: a cappella -musiikki
narrower: monikuoroisuus
note: Termiä suositellaan käytettäväksi erityisesti sekasisältöisten kuoromusiikkikokoelmien yhteydessä, esimerkiksi kuoromusiikki : Espanja : 1500-luku. Jos esityskokoonpano on täsmällinen, tulee sitä käyttää ensisijaisena asiasanana, esimerkiksi sävellykset : mieskuorot.
preferred label: körmusik @sv
related: kuorot
scope note: deprecated on 2018.10.24

vaudeville
type: Concept
created: 1998-06-30
is replaced by: Y107833
modified: 2017-05-09T08:36:47+03:00
definition: Termillä on tarkoitettu historian eri vaiheissa (1500-luvulta 1900-luvulle) monenlaisia, mutta perusolemukseltaan viihteellisiä ohjelmatyyppejä. Yleisimmässä merkityksessä vaudeville on koomisen oopperan rinnakkaisilmiö. Yhdysvalloissa termiä on käytetty samassa merkityksessä kuin termiä varieteet.
in scheme: MUSA/CILLA - Musiikin asiasanasto
note: Termiä käytetään musiikkikirjastollisuuden ulkopuolella vain, kun indeksoinnin kohde on hakuteoksissa tai julkaisussa määritelty vaudevilleksi. Täsmentävät asiasanat ovat yleensä tarpeen, esimerkiksi vaudeville : Ranska : 1700-luku, vaudeville : Yhdysvallat : 1900-luku.
related: kabareet
related: revyyt
related: showt
related: varieteet
related: näyttämömusiikki
scope note: deprecated on 2018.10.24

DVD-levyt
type: Concept
created: 2005-06-17
is replaced by: Y110220
modified: 2017-05-09T08:36:48+03:00
definition: Yleisnimitys DVD-standardin mukaan valmistetuille levyille (ääni tai kuva ja ääni).
in scheme: MUSA/CILLA - Musiikin asiasanasto
preferred label: DVD-skivor @sv
related: CD-levyt
related: CD-äänilevyt
related: SACD-levyt
related: SACD-soittimet
related: äänilevyt
scope note: deprecated on 2018.10.24

nuottikirjoitus
type: Concept
created: 2005-06-20
is replaced by: Y137917
modified: 2017-09-21T13:50:40+03:00
alternative label: graafinen nuottikirjoitus
alternative label: notaatio (musiikki)
alternative label: notation @sv
definition: Erilaiset musiikin visuaaliset merkkijärjestelmät.
in scheme: MUSA/CILLA - Musiikin asiasanasto
narrower: neumit
narrower: tabulatuurinuottikirjoitus
narrower: mensuraalinuottikirjoitus
note: Jos termiä käytetään tarkoittamaan jotain muuta kuin eurooppalaisen taidemusiikin piirissä kehittynyttä nuottikirjoitusta, on käytettävä lisäksi täsmentävää asiasanaa, esimerkiksi nuottikirjoitus : perinnemusiikki : Intia.
preferred label: notskrift @sv
related: nuotinluku
scope note: deprecated on 2018.10.24

orkesterilaulut
type: Concept
created: 2005-06-20
is replaced by: Y214604
modified: 2017-09-05T10:52:48+03:00
broader: yksinlaulut
broader: laulumusiikki
definition: Orkesterisäestyksinen yksinlaulu tai yksinlaulusarja, ei kuitenkaan ooppera-aaria.
in scheme: MUSA/CILLA - Musiikin asiasanasto
narrower: messut
preferred label: orkestersånger @sv
related: laulumusiikki
related: konserttiaariat
scope note: deprecated on 2018.10.24

nokkahuilu
type: Concept
created: 1996-02-07
is replaced by: Y101688
modified: 2017-09-21T13:39:56+03:00
broader: puhallinsoittimet
broader: puupuhaltimet
broader: huilusoittimet
definition: Päästä puhallettava tulppakanavahuilu, jossa on yksi peukaloaukko ja yleensä seitsemän sormiaukkoa.
in scheme: MUSA/CILLA - Musiikin asiasanasto
preferred label: blockflöjt @sv
related: huilu
scope note: deprecated on 2018.10.24

sovitukset
type: Concept
created: 1996-02-08
is replaced by: Y104405
modified: 2017-09-04T13:29:55+03:00
alternative label: arrangemang -- musik @sv
definition: Sovittajan työn tuloksena syntynyt uudistettu versio aiemmin sävelletystä teoksesta.
definition: Sovittaminen + sovitukset = arrangemang : musik @sv
hidden label: arrangemang musik @sv
in scheme: MUSA/CILLA - Musiikin asiasanasto
narrower: cover-versiot
note: Koska termillä on arkikielessä myös muita kuin musiikillisia merkityksiä, sitä on aina käytettävä yhdessä jonkin musiikkitermin kanssa, esimerkiksi alkusoitot : sovitukset : piano.
preferred label: arrangemang (musik) @sv
related: soitinnus
related: sovittaminen
related: soinnutus
related: sovittajat
scope note: deprecated on 2018.10.24

orkesterimusiikki
type: Concept
created: 1996-02-07
is replaced by: Y103808
modified: 2017-09-21T13:39:56+03:00
broader: soitinmusiikki
definition: Eurooppalaiselle orkesterille sävelletty taidemusiikki.
in scheme: MUSA/CILLA - Musiikin asiasanasto
narrower: sinfoniat
narrower: sinfonia concertantet
narrower: sinfoniset runot
note: Termiä suositellaan käytettäväksi vain, jos indeksoitavalla musiikilla ei ole täsmällisempää määritelmää (esimerkiksi konsertot, sarjat, sinfoniat, alkusoitot jne.) Jos halutaan indeksoida muulle kokoonpanolle kuin sinfoniaorkesterille sävellettyä musiikkia, käytetään sopivia täsmentäviä termejä, esimerkiksi orkesterimusiikki : kamariorkesterit : Suomi.
preferred label: orkestermusik @sv
scope note: deprecated on 2018.10.24

folk rock
type: Concept
created: 1996-02-07
is replaced by: Y127401
modified: 2017-09-21T13:24:22+03:00
alternative label: folkrock -- elförstärkt @sv
broader: rock
definition: Alkuperältään angloamerikkalainen sähkösoittimia hyödyntävä pop- ja rockmusiikkityyli, jossa käytetään hyväksi perinnesävelmiä ja osittain -soittimia. Tyylisuunta kehittyi lähinnä Isossa-Britanniassa 1960-luvun lopulla ja kukoisti 1970-luvulla. Myös Yhdysvalloissa oli oma folk rockin kausi, joka käynnistyi, kun osa folkmusiikin esittäjistä alkoi käyttää sähköisiä soittimia (mm. Bob Dylan ja The Byrds). Folk rockin rinnakkainen ilmiö on country rock.
hidden label: folkrock elförstärkt @sv
in scheme: MUSA/CILLA - Musiikin asiasanasto
preferred label: folkrock (förstärkt) @sv
related: folkmusiikki
related: country rock
related: folk metal
scope note: deprecated on 2018.10.24

levysoittimet
type: Concept
created: 1996-02-08
is replaced by: Y100919
modified: 2017-05-09T08:36:38+03:00
alternative label: gramofonit
alternative label: grammofoner @sv
broader: äänentoistolaitteet
definition: Nimitys teknisille laitteille, joiden avulla toistetaan erityyppisillä äänilevyillä olevaa informaatiota.
in scheme: MUSA/CILLA - Musiikin asiasanasto
note: Jos termillä ei tarkoiteta modernia, stereolevyjäkin toistavaa soitinta, on aina käytettävä lisäksi täsmentävää asiasanaa historialliset äänitteet. Jos on tarve ilmaista tarkemmin esimerkiksi levysoittimen kierrosnopeudet tai muita vastaavia ominaisuuksia, on käytettävä kuvailevaa luettelointia indeksoinnin sijasta.
preferred label: skivspelare @sv
related: levyautomaatit
related: lasersoittimet
related: SACD-soittimet
related: CD-soittimet
scope note: deprecated on 2018.10.24

mieslaulajat
type: Concept
created: 2017-06-28
is replaced by: Y214570
modified: 2017-06-28T15:29:57+03:00
alternative label: laulajat -- miehet
broader: laulajat
hidden label: laulajat miehet
in scheme: MUSA/CILLA - Musiikin asiasanasto
narrower: baritonit (laulajat)
narrower: bassot (laulajat)
narrower: kontratenorit (laulajat)
narrower: tenorit (laulajat)
scope note: deprecated on 2018.10.24

virret
type: Concept
created: 1996-12-04
is replaced by: Y100281
modified: 2017-08-31T15:19:59+03:00
broader: kirkkomusiikki
broader: hengellinen musiikki
definition: Kristillisten kirkkojen jumalanpalveluksissa ja muissa tilaisuuksissa laulettava yhteislaulu.
in scheme: MUSA/CILLA - Musiikin asiasanasto
preferred label: psalmer @sv
related: hengelliset laulut
related: koraalit
related: hymnologia
scope note: deprecated on 2018.10.24

pilkkalaulut
type: Concept
created: 1996-02-08
is replaced by: Y112576
modified: 2017-09-21T13:39:59+03:00
broader: laulut
definition: Mikä tahansa laulu, jonka tekstillä pyritään arvostelemaan kriittisesti jotain asiaa. Pilkkalaulun tekstin ei tarvitse olla poliittinen. Suomalaisia pilkkalaulun esittäjiä ovat mm. J. Alfred Tanner ja Jaakko Teppo.
in scheme: MUSA/CILLA - Musiikin asiasanasto
preferred label: nidvisor @sv
related: poliittiset laulut
related: kupletit
related: protestilaulut
scope note: deprecated on 2018.10.24

työväenlaulut
type: Concept
created: 1996-02-09
is replaced by: Y103044
modified: 2017-09-21T13:39:59+03:00
broader: poliittiset laulut
broader: laulut
broader: työväenmusiikki
definition: Sanoitukseltaan kantaaottavat laulut, joita on käytetty järjestäytyneen työväenliikkeen toiminnassa.
in scheme: MUSA/CILLA - Musiikin asiasanasto
preferred label: arbetarsånger @sv
related: kisällilaulut
scope note: deprecated on 2018.10.24

MIDI
type: Concept
created: 1996-02-09
is replaced by: Y209738
modified: 2017-05-09T08:36:40+03:00
broader: musiikkiteknologia
definition: Digitaalisten soittimien ja laitteiden yhteinen tiedonkoodaus- ja siirtostandardi (Music Instrument Digital Interface).
in scheme: MUSA/CILLA - Musiikin asiasanasto
note: Termiä käytetään vain kirjallisuuden indeksoinnissa, esimerkiksi MIDI : sähkökitara : oppaat.
related: rumpukone
related: syntetisaattori
related: sämpläys
related: sekvensseri (sähkösoittimet)
scope note: deprecated on 2018.10.24

sekvensseri (sähkösoittimet)
type: Concept
created: 1996-02-08
is replaced by: Y214801
modified: 2017-09-04T13:29:33+03:00
broader: sähkösoittimet
definition: Sähkösoittimiin, useimmiten syntetisaattoriin liittyvä laite, jonka avulla käsitellään MIDI-muotoista musiikki-informaatiota.
in scheme: MUSA/CILLA - Musiikin asiasanasto
preferred label: sequencer @sv
related: rumpukone
related: syntetisaattori
related: MIDI
scope note: deprecated on 2018.10.24

sovittaminen
type: Concept
created: 1996-02-08
is replaced by: Y104358
modified: 2017-09-21T13:40:01+03:00
definition: Sävellyksen muokkaaminen esitettäväksi toisella kokoonpanolla tai toisen musiikkityylin mukaisesti. Kuulonvaraisesti siirtyvän perinnemusiikin tulkitsemista ei yleensä pidetä sovittamisena.
in scheme: MUSA/CILLA - Musiikin asiasanasto
note: Koska termillä on arkikielessä myös muita kuin musiikillisia merkityksiä, sitä on aina käytettävä yhdessä jonkin musiikkitermin kanssa, esimerkiksi sovittaminen : oopperat : alkusoitot.
preferred label: arrangering (musik) @sv
related: transponointi
related: sovitukset
related: soitinnus
related: sovittajat
scope note: deprecated on 2018.10.24

rebetika
type: Concept
created: 1996-02-08
is replaced by: Y214623
modified: 2017-09-05T15:27:46+03:00
broader: laulelmat
broader: laulut
broader: populaarimusiikki
definition: Kreikkalaisen populaarimusiikin tyylisuuntaus, jonka lähtökohtana on ollut Kreikan satamakaupunkien alamaailman kapakkakulttuuri. Rebetika-laulujen säestyssoittimena on yleensä buzuki tai baglama. Rebetikan viihteellisempi rinnakkaisilmiö on laika.
in scheme: MUSA/CILLA - Musiikin asiasanasto
related: laulelmat
related: laika
scope note: deprecated on 2018.10.24

CD-soittimet
type: Concept
created: 1998-06-23
is replaced by: Y106777
modified: 2017-05-09T08:36:41+03:00
alternative label: CD-levysoittimet
broader: lasersoittimet
definition: Yleisnimitys välineille, joilla voidaan toistaa CD-standardin mukaan valmistettuja CD-äänilevyjä.
in scheme: MUSA/CILLA - Musiikin asiasanasto
preferred label: CD-spelare @sv
related: DVD-soittimet
related: levyautomaatit
related: SACD-soittimet
related: levysoittimet
scope note: deprecated on 2018.10.24

soinnutus
type: Concept
created: 1996-02-08
is replaced by: Y98902
modified: 2017-09-21T13:24:22+03:00
alternative label: harmonia (soinnutus)
alternative label: harmonier @sv
alternative label: satslära @sv
broader: sointuoppi
broader: musiikinteoria
definition: Sävellyksen harmoninen kokoonpano sekä tekniikka, jolla sointuja käytetään sävellyksessä (homofonisessa musiikissa).
in scheme: MUSA/CILLA - Musiikin asiasanasto
narrower: kenraalibasso
preferred label: harmonisering @sv
related: sovitukset
scope note: deprecated on 2018.10.24

musiikkiteollisuus
type: Concept
created: 1996-02-09
is replaced by: Y97568
modified: 2017-09-21T13:40:01+03:00
broader: musiikkiala
definition: Kaikkien teollisesti toimivien elinkeinoelämän haarojen kokonaisuus, jotka osallistuvat musiikin tuottamiseen (levy-yhtiöt, musiikkikustantajat, radio- ja televisiotuotanto jne.).
in scheme: MUSA/CILLA - Musiikin asiasanasto
preferred label: musikindustri @sv
related: musiikkikustantajat
related: musiikkiteknologia
related: ääniteteollisuus
scope note: deprecated on 2018.10.24

tertsetot
type: Concept
created: 1997-10-01
is replaced by: Y214819
modified: 2017-09-04T13:29:37+03:00
alternative label: tersetter -- kompositioner @sv
broader: laulumusiikki
broader: sävellykset
definition: Kolmelle lauluäänelle sävelletty tai sovitettu teos.
hidden label: tersetter kompositioner @sv
in scheme: MUSA/CILLA - Musiikin asiasanasto
note: Kolmelle soittimelle sävelletyistä tai sovitetuista teoksista käytetään termiä triot (sävellykset). Kolmen laulajan muodostamasta esityskokoonpanosta käytetään termiä tertsetit.
preferred label: tersetter (kompositioner) @sv
related: laulumusiikki
related: duetot
related: triot (yhtyeet)
related: kvartetot
scope note: deprecated on 2018.10.24

urban blues
type: Concept
created: 1997-10-01
is replaced by: Y214713
modified: 2017-06-29T16:30:58+03:00
broader: blues
definition: Yleisnimitys Yhdysvalloissa 1940-luvun kaupungistumisen seurauksena syntyneille bluesin tyylisuunnille.
in scheme: MUSA/CILLA - Musiikin asiasanasto
narrower: soulblues
narrower: Chicago-blues
related: rhythm and blues
related: city blues
related: country blues
scope note: deprecated on 2018.10.24

poliittiset laulut
type: Concept
created: 1996-02-08
is replaced by: Y102560
modified: 2017-09-21T13:39:42+03:00
broader: laulut
definition: Nimitys laulumusiikille, jonka sanoitukset sisältävät yhteiskunnallista kommentointia tai suoranaista kritiikkiä.
in scheme: MUSA/CILLA - Musiikin asiasanasto
narrower: kisällilaulut
narrower: työväenlaulut
note: Termiä suositellaan käytettäväksi aina täsmentävien asiasanojen kanssa, esimerkiksi poliittiset laulut : työväenliike : Suomi : 1910-luku.
preferred label: politiska sånger @sv
related: pilkkalaulut
related: protestilaulut
scope note: deprecated on 2018.10.24

hengelliset laulut
type: Concept
created: 1996-02-07
is replaced by: Y95328
modified: 2017-05-09T08:36:24+03:00
broader: laulut
broader: hengellinen musiikki
definition: Kristillisten uskontokuntien ei-liturgiseen lauluperinteeseen kuuluva teos.
in scheme: MUSA/CILLA - Musiikin asiasanasto
note: Muiden kuin kristillisten uskontokuntien kohdalla suositellaan muotoa uskonnot : musiikki : laulut tai tarkemmin, esimerkiksi buddhalaisuus : laulumusiikki.
preferred label: andliga sånger @sv
related: gospelmusiikki
related: ylistysmusiikki
related: spirituaalit
related: virret
scope note: deprecated on 2018.10.24

laulelmat
type: Concept
created: 1996-12-04
is replaced by: Y96790
modified: 2017-09-21T13:24:19+03:00
broader: laulut
definition: Populaarimusiikin piirissä esiintyvä laulu, jolle on ominaista tekstin keskeisyys. Laulelmat eivät ole tarkoitettuja tanssittaviksi, mikä yleensä kuuluu myös säestyksestä.
in scheme: MUSA/CILLA - Musiikin asiasanasto
narrower: rebetika
note: Termiä ei käytetä taidemusiikissa, jossa käytetään termiä laulut tarpeellisine täsmenteineen.
preferred label: visor @sv
related: chansonit
related: kupletit
related: rebetika
scope note: deprecated on 2018.10.24

lastenlaulut
type: Concept
created: 1996-02-08
is replaced by: Y96769
modified: 2017-09-21T13:39:45+03:00
broader: laulut
broader: lastenmusiikki
definition: Lauluja, jotka on tekstinsä ja yleensä myös musiikkinsa osalta tarkoitettu eri-ikäisten lasten kuunneltavaksi.
in scheme: MUSA/CILLA - Musiikin asiasanasto
narrower: hengelliset lastenlaulut
note: Koska termillä ei ole selkeään tyyliin liittyvää määritelmää, eikä käsitteellä "lapsi" ole mitään tarkkoja ikämääreitä, termiä käytetään sellaisten laulujen yhteydessä, joita omana aikanaan ja tietyssä kulttuuripiirissä on pidetty lastenmusiikkina.
preferred label: barnvisor @sv
related: laululeikit
related: kehtolaulut
scope note: deprecated on 2018.10.24

rytmioppi
type: Concept
created: 1996-02-08
is replaced by: Y104235
modified: 2017-09-21T13:24:19+03:00
broader: musiikinteoria
definition: Musiikinteorian osa-alue, joka käsittelee rytmiä.
in scheme: MUSA/CILLA - Musiikin asiasanasto
narrower: synkopointi
narrower: tempo
narrower: diminuutio
narrower: rytmi
preferred label: rytmik @sv
scope note: deprecated on 2018.10.24

kansanmusiikki
type: Concept
created: 1996-02-07
is replaced by: Y95864
modified: 2017-09-04T13:29:19+03:00
alternative label: neo-kansanmusiikki
alternative label: tanhumusiikki
alternative label: folkdansmusik @sv
broader: perinnemusiikki
broader: kansanperinne
definition: Yleisnimitys musiikille, joka on kuulonvaraisesti siirtynyttä kansanperinnettä aitoina esityksinä ja/tai tulkintoina.
definition: Indexera folkmusik från ett geografiskt område eller tillhörande en etnisk grupp som t.ex. folkmusik @sv
in scheme: MUSA/CILLA - Musiikin asiasanasto
narrower: kansanlaulut
narrower: kelttiläinen kansanmusiikki
narrower: pelimannimusiikki
note: Termiin suositellaan aina lisättäväksi tarkentavia täsmenteitä, esimerkiksi kansanmusiikki : kantele : Suomi, kansanmusiikki : pygmit.
preferred label: folkmusik @sv
related: folk metal
scope note: deprecated on 2018.10.24

gospelmusiikki
type: Concept
created: 1996-02-07
is replaced by: Y101448
modified: 2017-09-04T13:29:38+03:00
broader: populaarimusiikki
broader: hengellinen musiikki
definition: Spirituaaleista kehittynyt, yleensä sovitettu afroamerikkalainen hengellisen populaarimusiikin tyyli, jolla on usein yhtymäkohtia bluesiin.
in scheme: MUSA/CILLA - Musiikin asiasanasto
narrower: gospelrock
note: Termiä käytetään vain afroamerikkalaisen populaarimusiikin yhteydessä. Muiden musiikillisten perinteiden ja tyylien pohjalta kehittyneitä hengellisen populaarimusiikin muotoja ei nimitetä gospelmusiikiksi. Valtaosa suomalaisesta hengellisestä viihdemusiikista ei ole gospelmusiikkia.
preferred label: gospelmusik @sv
related: hengelliset laulut
related: ylistysmusiikki
related: spirituaalit
scope note: deprecated on 2018.10.24

duetot
type: Concept
created: 1996-02-07
is replaced by: Y101101
modified: 2017-09-21T13:24:20+03:00
broader: laulumusiikki
broader: sävellykset
definition: Kahdelle lauluäänelle sävelletty tai sovitettu teos.
in scheme: MUSA/CILLA - Musiikin asiasanasto
note: Kahdelle soittimelle sävelletyistä tai sovitetuista teoksista käytetään termiä duot (sävellykset). Kahden esittäjän muodostamasta yhtyeestä käytetään termiä duot (yhtyeet).
preferred label: duetter @sv
related: tertsetot
related: laulumusiikki
related: duot (sävellykset)
scope note: deprecated on 2018.10.24

latinalainen kirkkolaulu
type: Concept
created: 1996-02-08
is replaced by: Y196861
modified: 2017-09-21T13:24:20+03:00
broader: kirkkomusiikki
broader: laulumusiikki
definition: Katolisen kirkon perinteinen yksiääninen laulutyyli, joka on eriytynyt lähinnä historiallis-maantieteellisiksi ilmiöiksi (ambrosiaaninen, gregoriaaninen, gallikaaninen ja mozarabinen laulu).
in scheme: MUSA/CILLA - Musiikin asiasanasto
narrower: gregoriaaninen laulu
narrower: ambrosiaaninen laulu
narrower: gallikaaninen laulu
note: Termiä ei käytetä musiikin indeksoinnissa gregoriaanisen laulun synonyyminä, jollaisena se esiintyy monissa hakuteoksissa.
preferred label: latinsk kyrkosång @sv
scope note: deprecated on 2018.10.24

musiikkinäytelmät
type: Concept
created: 1996-02-09
is replaced by: Y103043
modified: 2017-05-09T08:36:27+03:00
alternative label: musiikkidraamat
broader: näyttämömusiikki
broader: näytelmät
definition: Näytelmä, joka sisältää musiikkiesityksiä tai jossa musiikilla on kokonaisuudessa keskeinen asema.
in scheme: MUSA/CILLA - Musiikin asiasanasto
narrower: musikaalit
narrower: laulunäytelmät
preferred label: musikdramer @sv
related: oopperat
related: operetit
scope note: deprecated on 2018.10.24

automaattisoittimet
type: Concept
created: 1996-02-07
is replaced by: Y100949
modified: 2017-09-21T13:39:51+03:00
alternative label: mekaaniset soittimet
alternative label: mekaniska musikinstrument @sv
broader: soittimet
definition: Soitin, jossa mekaaninen koneisto tuottaa ennalta valmistellun ja valitun musiikin aina samalla tavalla.
in scheme: MUSA/CILLA - Musiikin asiasanasto
narrower: pianola
narrower: posetiivi
narrower: soittorasia
preferred label: automatiska musikinstrument @sv
related: levyautomaatit
scope note: deprecated on 2018.10.24

country and western
type: Concept
created: 1996-02-07
is replaced by: Y101051
modified: 2017-09-04T13:29:24+03:00
broader: country
definition: Akustinen, laulusolistin merkitystä korostava countryn tyylisuuntaus.
in scheme: MUSA/CILLA - Musiikin asiasanasto
narrower: cowboylaulut
related: bluegrass
related: hillbilly
related: cajun
related: western swing

son
type: Concept
created: 1996-02-08
is replaced by: Y110862
modified: 2017-09-21T13:39:53+03:00
broader: afroamerikkalainen musiikki
definition: Kuubalainen populaarimusiikkilaji, jonka tahtilaji on 2/4. Sonin läheinen sukulainen on salsa. Meksikossa ja muualla Väli-Amerikassa esiintyvästä sonista, joka poikkeaa rakenteeltaan ja soittimistoltaan kuubalaisesta sonista, käytetään termiä son-musiikki.
definition: Avser son från Karibien, främst den afroamerikanska traditionen på Kuba @sv
in scheme: MUSA/CILLA - Musiikin asiasanasto
related: salsa
related: merengue
related: son-musiikki
related: calypso
scope note: deprecated on 2018.10.24

rhythm and blues
type: Concept
created: 1996-02-08
is replaced by: Y113414
modified: 2017-09-21T13:39:54+03:00
broader: populaarimusiikki
definition: Yhdysvalloissa 1940- ja 1950-luvuilla kukoistanut bluesiin ja big band -jazziin pohjautuva musiikkityyli, jossa puhallinsoittimilla ja blues-tyylisellä laululla oli keskeinen asema. Tyylin tunnettuja edustajia ovat mm. T-Bone Walker, Louis Jordan ja Big Joe Turner. Tyyli on kokenut 1960-luvulta lähtien uuden suosion myös valkoisten rock-yhtyeiden kiinnostuksen myötä.
in scheme: MUSA/CILLA - Musiikin asiasanasto
note: Jos termiä käytetään 1960-luvun ja myöhempien aikojen "valkoisen r & b:n" yhteydessä, suositellaan toisena asiasanana käytettäväksi termiä rock tai popmusiikki, esimerkiksi rhythm and blues : rock : Iso-Britannia : 1960-luku.
related: urban blues
related: blues
related: doo wop
related: city blues
related: country blues
scope note: deprecated on 2018.10.24

sitrasoittimet
type: Concept
created: 1996-02-08
is replaced by: Y110796
modified: 2017-09-21T13:24:21+03:00
broader: soittimet
broader: näppäilysoittimet
definition: Kielisoitin, jossa on kielet, kielirunko ja irrotettava kaikukoppa. Sitrasoittimet jaotellaan eri muotoisten kielirunkojen mukaan.
in scheme: MUSA/CILLA - Musiikin asiasanasto
narrower: dulcimer
narrower: sitra
narrower: kantele
preferred label: cittror @sv
scope note: deprecated on 2018.10.24

esittäjät
type: Concept
created: 1996-02-07
is replaced by: Y101316
modified: 2017-05-09T08:36:33+03:00
definition: Termiä käytetään kaikkia esittäjiä ilmaisevana käsitteenä, joka kattaa laulajat, soittajat, tanssijat, lausujat jne. Termi on musiikin lajien suhteen neutraali ilmaisu.
in scheme: MUSA/CILLA - Musiikin asiasanasto
note: Termiä suositellaan käytettäväksi lähinnä silloin, kun julkaisussa on käsitelty eri esittäjäryhmiä, muuten käytetään mieluummin täsmällisiä termejä kuten muusikot tai kapellimestarit.
preferred label: framställare @sv
related: muusikot
related: esiintyjät
related: esittäminen
related: kapellimestarit
related: laulajat
related: viihdetaiteilijat
scope note: deprecated on 2018.10.24

black metal
type: Concept
created: 2005-04-25
is replaced by: Y169576
modified: 2017-09-21T13:40:03+03:00
broader: heavy rock
definition: 1980-luvun lopulla thrash metal -tyylistä kehittynyt heavy rockin soittoteknisesti yksinkertainen alalaji, jolle ovat ominaisia nopea, aggressiivinen soittotapa ja korkeaääninen, kirskuva laulutapa. Sanoitusten aihepiiri liittyy usein uskonnollisiin ilmiöihin ja mytologioihin. Tyypillisiä edustajia ovat Darkthrone, Bathory, Venom ja Emperor.
in scheme: MUSA/CILLA - Musiikin asiasanasto
related: death metal
related: doom metal
related: speed metal
related: thrash metal
scope note: deprecated on 2018.10.24

death metal
type: Concept
created: 2005-04-25
is replaced by: Y188367
modified: 2017-09-21T13:40:03+03:00
broader: heavy rock
definition: 1980-luvun lopulla thrash metal -tyylistä kehittynyt heavy rockin alalaji, jolle ovat ominaisia äkilliset tempomuutokset, matalalle viritetyt soittimet sekä matala, mörisevä laulutyyli. Tyypillisiä edustajia ovat Morbid Angel, Bolt Thrower ja varhainen Amorphis.
in scheme: MUSA/CILLA - Musiikin asiasanasto
related: black metal
related: doom metal
related: speed metal
related: thrash metal
scope note: deprecated on 2018.10.24

SACD-soittimet
type: Concept
created: 2005-06-16
is replaced by: Y214645
modified: 2017-09-05T11:12:48+03:00
broader: lasersoittimet
definition: Yleisnimitys teknisille välineille, joilla voidaan toistaa SACD-standardin mukaisia levyjä.
in scheme: MUSA/CILLA - Musiikin asiasanasto
preferred label: SACD-spelare @sv
related: DVD-soittimet
related: CD-levyt
related: DVD-levyt
related: levysoittimet
related: CD-soittimet
scope note: deprecated on 2018.10.24

drum 'n' bass
type: Concept
created: 2005-06-17
is replaced by: Y214449
modified: 2017-09-04T13:29:52+03:00
alternative label: drum and bass
alternative label: drum'n'bass
alternative label: jungle
broader: elektroninen tanssimusiikki
definition: Elektronisen tanssimusiikin alalaji, joka kehittyi Englannissa 1990-luvun alkupuolella hardcore-teknosta. Jungle on drum 'n' bassin rinnakkainen ilmiö (enemmän reggaevaikutteinen) ja molemmat perustuvat nopeisiin polyrytmeihin ja synkopoituun breakbeatiin sekä matalataajuisiin bassokulkuihin.
in scheme: MUSA/CILLA - Musiikin asiasanasto
related: dance
related: hip hop
related: house
related: tekno
related: dubstep
scope note: deprecated on 2018.10.24

harjoitusaineistot
type: Concept
created: 2005-06-20
is replaced by: Y214476
modified: 2017-09-04T13:29:53+03:00
definition: Lähinnä alkeistasolle tarkoitettu ja tätä varten sävelletty tai sovitettu harjoitus.
in scheme: MUSA/CILLA - Musiikin asiasanasto
narrower: säestykset
narrower: sormiharjoitukset
narrower: orkesteriharjoitukset
narrower: vokaliisit (harjoitusaineistot)
preferred label: övningsmaterial @sv
related: etydit
related: vokaliisit (harjoitusaineistot)
scope note: deprecated on 2018.10.24

huilusoittimet
type: Concept
created: 1996-02-07
is replaced by: Y101686
modified: 2017-09-21T13:24:21+03:00
broader: puhallinsoittimet
definition: Puupuhallin, jonka ääni syntyy soittajan puhaltaman ilmavirran osuessa terävään reunaan.
in scheme: MUSA/CILLA - Musiikin asiasanasto
narrower: huilu
narrower: nokkahuilu
narrower: panhuilu
narrower: okariina
preferred label: flöjtinstrument @sv
scope note: deprecated on 2018.10.24

valssit (sävellykset)
type: Concept
created: 1996-02-09
is replaced by: Y104788
modified: 2017-09-04T13:29:17+03:00
broader: tanssit
broader: sävellykset
definition: Sävellys, jonka tahdissa on tarkoitus tanssia valssia tai joka tyylittelee mainitunlaista tanssisävellystä.
in scheme: MUSA/CILLA - Musiikin asiasanasto
narrower: häävalssit
narrower: wieninvalssit
preferred label: valser @sv
related: tanssimusiikki
scope note: deprecated on 2018.10.24

reggaeton
type: Concept
created: 2012-02-28
is replaced by: Y199290
modified: 2017-05-09T08:36:50+03:00
alternative label: regueton
broader: popmusiikki
definition: Popmusiikkityyli, joka tuli suosituksi 1990-luvun lopulla latinalaisamerikkalaisen nuorison keskuudessa. Se syntyi Panamassa nimellä reggae en espanol ja on levinnyt erityisesti Puerto Ricoon, Yhdysvaltoihin ja Eurooppaan 2000-luvun alkupuolelta lähtien.
in scheme: MUSA/CILLA - Musiikin asiasanasto
note: Reggaeton sekoittaa jamaikalaisia musiikkivaikutteita (reggaeta ja dancehallia) latinalaisen Amerikan bomba-, plena- sekä hip hop -musiikkeihin. Reggaetoniin yhdistetään yleensä espanjankielistä räppäystä.
related: dance
related: latinalaisamerikkalainen populaarimusiikki
related: hip hop
related: dancehall
related: reggae
scope note: deprecated on 2018.10.24

dubstep
type: Concept
created: 2014-12-09
is replaced by: Y214451
modified: 2017-06-26T15:42:20+03:00
alternative label: dub step
broader: elektroninen populaarimusiikki
broader: elektroninen tanssimusiikki
definition: Elektronisen tanssimusiikin alalaji, joka kehittyi Isossa-Britanniassa 2000-luvun vaihteessa drum'n'bassista, junglesta, reggaesta ja dubista. Perustuu synkopoituihin rytmikuvioihin ja matalataajuisiin bassokulkuihin.
in scheme: MUSA/CILLA - Musiikin asiasanasto
related: hip hop
related: tekno
related: drum 'n' bass
related: reggae
scope note: deprecated on 2018.10.24

country blues
type: Concept
created: 1996-02-07
is replaced by: Y214441
modified: 2017-09-04T13:29:30+03:00
broader: blues
definition: 1920- ja 1930-luvuilla Yhdysvaltain maaseudulla kehittynyt akustinen bluestyyli, joka koki 1960-luvulla tärkeän uuden suosion kauden.
in scheme: MUSA/CILLA - Musiikin asiasanasto
narrower: folkblues
narrower: Mississippi-blues
related: urban blues
related: rhythm and blues
related: city blues
scope note: deprecated on 2018.10.24

äänentoisto
type: Concept
created: 1996-02-15
is replaced by: Y100505
modified: 2017-05-09T08:36:37+03:00
definition: Tekninen kokonaisuus, jonka avulla tallennettu ääni saadaan kuuluville.
in scheme: MUSA/CILLA - Musiikin asiasanasto
preferred label: ljudåtergivning @sv
related: akustiikka
related: äänitekniikka
related: äänentallennus
related: äänentallennuslaitteet
related: äänentoistolaitteet
related: stereofonia
scope note: deprecated on 2018.10.24

kansantanssit
type: Concept
created: 1996-02-08
is replaced by: Y95879
modified: 2017-11-02T09:00:45+02:00
alternative label: tanhut
broader: tanssit
broader: kansanperinne
definition: Kansanperinteeseen liittyvä tanssityyli.
in scheme: MUSA/CILLA - Musiikin asiasanasto
narrower: hambo (tanssit)
narrower: polska (tanssit)
narrower: purpurit
preferred label: folkdanser @sv
related: flamenco
scope note: deprecated on 2018.10.24

nuotinluku
type: Concept
created: 1996-02-07
is replaced by: Y103702
modified: 2017-09-21T13:40:00+03:00
definition: Nuottikirjoituksen tulkitseminen.
in scheme: MUSA/CILLA - Musiikin asiasanasto
narrower: transponointi
narrower: klaaviharjoitukset
preferred label: notläsning @sv
related: transponointi
related: säveltapailu
related: nuottikirjoitus
scope note: deprecated on 2018.10.24

calypso
type: Concept
created: 1996-02-07
is replaced by: Y214430
modified: 2017-09-04T13:29:17+03:00
broader: latinalaisamerikkalainen populaarimusiikki
definition: Etelä- ja Itä-Karibian alueen perinteinen laulelmatyyli.
in scheme: MUSA/CILLA - Musiikin asiasanasto
related: mento
related: merengue
related: soca
related: son
related: zouk
scope note: deprecated on 2018.10.24

säveloppi
type: Concept
created: 1996-02-08
is replaced by: Y104492
modified: 2017-09-21T13:40:01+03:00
broader: musiikinteoria
definition: Sävelten keskinäisiä suhteita käsittelevä musiikinteorian osa-alue.
in scheme: MUSA/CILLA - Musiikin asiasanasto
narrower: modaalisuus
narrower: viritysjärjestelmät
narrower: säveljärjestelmät
narrower: kromatiikka
preferred label: melodik @sv
scope note: deprecated on 2018.10.24

sähkösoittimet
type: Concept
created: 1996-02-08
is replaced by: Y99169
modified: 2017-09-21T13:39:44+03:00
alternative label: elektroniset soittimet
alternative label: elektroniska musikinstrument @sv
alternative label: elinstrument @sv
broader: soittimet
definition: Sähköisesti ääntä tuottava tai vahvistava soitin.
in scheme: MUSA/CILLA - Musiikin asiasanasto
narrower: sähköurut
narrower: bassokitara
narrower: syntetisaattori
narrower: sähkökitara
narrower: sekvensseri (sähkösoittimet)
preferred label: elektriska musikinstrument @sv
scope note: deprecated on 2018.10.24

soitonoppaat
type: Concept
created: 1997-10-01
is replaced by: Y98905
modified: 2017-09-21T13:24:23+03:00
alternative label: soitinkoulut
definition: Jonkin soittimen hallitsemiseen opastava julkaisu. Soitonopas voi olla muodoltaan yhtä hyvin painettu kirja, äänite, videotallenne tai moniviestin.
in scheme: MUSA/CILLA - Musiikin asiasanasto
narrower: sointuoppaat
note: Termiä käytetään aina yhdessä soittimen nimen kanssa, esimerkiksi soitonoppaat : mandoliini. Soitonoppaan vaikeustasoa voidaan ilmaista termeillä alkeistaso ja keskitaso.
preferred label: instrumentskolor @sv
related: rudimentit
related: laulunoppaat
related: soittaminen
related: nuottijulkaisut
related: sointuoppaat
scope note: deprecated on 2018.10.24

revyyt
type: Concept
created: 1997-10-01
is replaced by: Y102078
modified: 2017-05-09T08:36:44+03:00
definition: Laulu-, soitto- tanssi- ja puhenumeroista koostuva koominen tai satiirinen näyttämöesitys.
in scheme: MUSA/CILLA - Musiikin asiasanasto
note: Termiä suositellaan käytettäväksi musiikin indeksoinnissa lähinnä kirjallisuudessa sekä kokonaisten revyiden taltioinneista, esimerkiksi revyyt : Ruotsi : 1950-luku.
preferred label: revyer @sv
related: musiikkiteatteri
related: kabareet
related: showt
related: varieteet
related: näyttämömusiikki
related: kupletit
related: vaudeville
scope note: deprecated on 2018.10.24

huilu
type: Concept
source: Sivupuhalteinen puupuhallin, joka valmistetaan yleensä metallista.
created: 1996-02-07
is replaced by: Y101685
modified: 2017-09-21T13:24:19+03:00
broader: puhallinsoittimet
broader: puupuhaltimet
broader: huilusoittimet
in scheme: MUSA/CILLA - Musiikin asiasanasto
narrower: piccolohuilu
preferred label: flöjt @sv
related: nokkahuilu
related: panhuilu
scope note: deprecated on 2018.10.24

kupletit
type: Concept
created: 1996-02-08
is replaced by: Y96572
modified: 2017-09-21T13:24:20+03:00
broader: laulut
definition: Suomessa 1800-luvun lopulla vakiintunut säkeistö-kertosäkeistö -muotoinen laulutyyppi, jolle on ominaista ajankohtaisten aiheiden käsittely humoristisella tai satiirisella tavalla. Perinteisiä kuplettilaulajia ovat olleet J. Alfred Tanner, Rafael Ramstedt ja Esa Pakarinen, uudempiin kuuluu mm. Jaakko Teppo.
in scheme: MUSA/CILLA - Musiikin asiasanasto
preferred label: kupletter @sv
related: revyyt
related: iskelmät
related: laulelmat
related: rillumareimusiikki
related: pilkkalaulut
scope note: deprecated on 2018.10.24

duot (sävellykset)
type: Concept
created: 1996-02-07
is replaced by: Y214773
modified: 2017-09-21T13:39:52+03:00
broader: kamarimusiikki
broader: yhtyeet
broader: lauluyhtyeet
broader: sävellykset
definition: Kahdelle soittimelle sävelletty tai sovitettu teos.
in scheme: MUSA/CILLA - Musiikin asiasanasto
note: Kahdelle lauluäänelle sävelletyistä tai sovitetuista teoksista käytetään termiä duetot. Kahden soittajan muodostamasta esityskokoonpanosta käytetään termiä duot (yhtyeet).
preferred label: duor (kompositioner) @sv
related: kamarimusiikki
related: duetot
scope note: deprecated on 2018.10.24

soca
type: Concept
created: 1996-02-08
is replaced by: Y214663
modified: 2017-09-04T13:29:25+03:00
broader: maailmanmusiikki
broader: latinalaisamerikkalainen populaarimusiikki
broader: popmusiikki
definition: Lähinnä Trinidadin saarella 1970-luvulla kehittynyt populaarimusiikkityyli, jossa on yhdistetty soulin ja calypson aineksia.
in scheme: MUSA/CILLA - Musiikin asiasanasto
related: mento
related: zouk
related: diskomusiikki
related: calypso
scope note: deprecated on 2018.10.24

zouk
type: Concept
created: 1996-02-15
is replaced by: Y214737
modified: 2017-09-04T13:29:49+03:00
broader: maailmanmusiikki
broader: populaarimusiikki
definition: Karibian saariston alueella esiintyvä moderni tanssimusiikkityyli, jossa on yhdistelty perinteistä Väli-Amerikkalaista musiikkia ja modernia soitinteknologiaa.
in scheme: MUSA/CILLA - Musiikin asiasanasto
related: mento
related: soca
related: rock
related: diskomusiikki
related: calypso
scope note: deprecated on 2018.10.24

syntetisaattori
type: Concept
created: 1996-02-08
is replaced by: Y99123
modified: 2017-09-21T13:39:54+03:00
alternative label: syntetoija
alternative label: synthesizers @sv
broader: sähkösoittimet
definition: Elektroninen, nykyisin yleensä tietokoneen ohjaama laite, jonka avulla soitetaan synteettisesti tuotettuja ääniä.
in scheme: MUSA/CILLA - Musiikin asiasanasto
narrower: rumpukone
preferred label: syntar @sv
related: elektroakustinen musiikki
related: sämpläys
related: MIDI
related: sekvensseri (sähkösoittimet)
scope note: deprecated on 2018.10.24

musiikkijuhlat
type: Concept
created: 1996-02-09
is replaced by: Y101359
modified: 2017-05-09T08:36:34+03:00
alternative label: musiikkifestivaalit
alternative label: musikfestivaler @sv
broader: kulttuuritapahtumat
definition: Nimitys musiikkiesityksiin keskittyville julkisille juhlille. Yksittäisten juhlien nimiä voi käyttää asiasanoina verkkosanastossa olevan luettelon mukaisesti.
in scheme: MUSA/CILLA - Musiikin asiasanasto
narrower: oopperajuhlat
narrower: laulujuhlat
preferred label: musikfestspel @sv
related: festivaalit
related: juhlaviikot
related: kulttuuritapahtumat
related: musiikkielämä
scope note: deprecated on 2018.10.24

rap
type: Concept
created: 1996-02-08
is replaced by: Y107364
modified: 2017-09-21T13:39:57+03:00
broader: popmusiikki
definition: Alun perin 1970-luvulla New Yorkissa kehittyneen rytmisen puhelaulun nimitys (lyhenne sanoista rhytmically accentuated poetry), sittemmin yleisemmin nimitys hip hop -kulttuuriin liittyvälle musiikille. Alkujaan täysin Yhdysvaltain afroamerikkalaisen väestön omasta ilmiöstä on tullut kansainvälinen tyyli kansallisine sovelluksineen ja solisteineen.
in scheme: MUSA/CILLA - Musiikin asiasanasto
note: Historiallisista ja tyylillisistä syistä termin yhteydessä on syytä aina käyttää täsmentäviä asiasanoja, esimerkiksi rap : Suomi : 2000-2009.
related: hip hop
related: rock
related: soul
related: MC:t
related: reggae
scope note: deprecated on 2018.10.24

elektroninen populaarimusiikki
type: Concept
created: 1997-09-30
is replaced by: Y146188
modified: 2017-09-21T13:40:02+03:00
alternative label: electroclash
alternative label: electronica
alternative label: elektro
alternative label: elektropop
alternative label: konemusiikki
alternative label: syntikkapop
alternative label: electropop @sv
alternative label: syntpop @sv
broader: populaarimusiikki
definition: Syntetisaattoreiden ja muiden vastaavien elektronisten äänentuottamisvälineiden avulla luotu populaarimusiikki. Termi voi liittyä erilaisiin populaarimusiikin ryhmiin (esimerkiksi kokeellinen populaarimusiikki, ns. harmaan vyöhykkeen musiikki, syntetisaattorimusiikki, new age -musiikki, "syntikkapop", progressiivinen rock ja "syntikkaviihde"). Termiä käytetään myös tietokoneen avulla tuotetusta popmusiikista, esim. joistain teknon alalajeista.
in scheme: MUSA/CILLA - Musiikin asiasanasto
narrower: ambient
narrower: dubstep
note: Termiä suositellaan käytettäväksi jonkin populaarimusiikin tyyliä kuvaavan termin kanssa, esimerkiksi elektroninen populaarimusiikki : tekno : Saksa : 1990-luku.
preferred label: elektronisk populärmusik @sv
related: ambient
related: popmusiikki
related: elektroakustinen musiikki
related: elektroninen tanssimusiikki
scope note: deprecated on 2018.10.24

iskelmät
type: Concept
created: 1996-02-08
is replaced by: Y95579
modified: 2017-09-21T13:39:45+03:00
broader: laulut
broader: populaarimusiikki
broader: viihdemusiikki
definition: 1900-luvulla yleistynyt viihdelaulun suosittu muoto, jossa tarttuva sävelmä (usein kertosäkeistö) on yhdistetty helposti muistettavaan tekstiin.
in scheme: MUSA/CILLA - Musiikin asiasanasto
note: Termiä suositellaan käytettäväksi ensisijaisesti sellaisista viihdelauluista, jotka liittyvät skandinaavis-germaaniseen, itäeurooppalaiseen tai italialaiseen iskelmäperinteeseen. Mm. englantilaisen, ranskalaisen tai yhdysvaltalaisen viihdelaulun yhteydessä suositellaan käytettäväksi mieluummin termiä viihdemusiikki soveltaen, esimerkiksi viihdemusiikki : laulut : Yhdysvallat : 1960-luku.
preferred label: schlager @sv
related: ikivihreät
related: kupletit
related: rillumareimusiikki
related: hitit
scope note: deprecated on 2018.10.24

säveltapailu
type: Concept
created: 1996-02-08
is replaced by: Y99194
modified: 2017-09-21T13:24:19+03:00
alternative label: solfege @sv
definition: Korvankoulutuksen ja nuotinlukutaidon opetusmenetelmä, jonka tavoitteena on oppia laulamaan (tai soittamaan mielessään) edessä oleva nuottikuva, ja oppia kirjoittamaan nuoteiksi kuultu tai mielessä soiva musiikki ilman soittimen käyttämistä apuvälineenä.
in scheme: MUSA/CILLA - Musiikin asiasanasto
narrower: solmisaatio
narrower: diktaatti
narrower: klaaviharjoitukset
preferred label: tonträffning @sv
related: transponointi
related: solmisaatio
related: diktaatti
related: nuotinluku
scope note: deprecated on 2018.10.24

kitara
type: Concept
created: 1996-02-08
is replaced by: Y101009
modified: 2017-09-21T13:39:43+03:00
broader: näppäilysoittimet
definition: Yleensä kuusikielinen näppäilysoitin, jota voidaan soittaa myös rämpyttäen. Perinteisessä klassisessa kitarassa on ääntä vahvistava puinen kaikukoppa. Kitaralla on useita muunnoksia, joista osa on sähköisesti vahvistettuja ja osassa kielet ja rakenne ovat erilaiset.
in scheme: MUSA/CILLA - Musiikin asiasanasto
narrower: bassokitara
narrower: havaijinkitara
narrower: sähkökitara
preferred label: gitarr @sv
related: luuttusoittimet
related: steel-kitara
related: slide-kitara
scope note: deprecated on 2018.10.24

konsertot
type: Concept
created: 1996-02-08
is replaced by: Y102659
modified: 2017-09-21T13:39:53+03:00
alternative label: concertinot
alternative label: konsertiinot
alternative label: soolokonsertot
definition: Konsertoksi nimetty sävellys soolosoittimelle ja orkesterille.
in scheme: MUSA/CILLA - Musiikin asiasanasto
narrower: concerto grossot
narrower: ryhmäkonsertot
narrower: kamarikonsertot
narrower: kaksoiskonsertot
narrower: kolmoiskonsertot
note: Termiä ei käytetä lauluäänelle ja säestävälle kokoonpanoille tehdyistä "vokaalikonsertoista", ei myöskään 1680-lukua vanhemmista konsertto-nimisistä sävellyksistä, jotka saattoivat olla mitä hyvänsä soitinsävellyksiä.
preferred label: konserter (kompositioner) @sv
related: sinfonia concertantet
related: kamarikonsertot
scope note: deprecated on 2018.10.24

heavy rock
type: Concept
created: 1996-02-07
is replaced by: Y110284
modified: 2017-09-21T13:24:21+03:00
alternative label: Gothic metal
alternative label: grindcore
alternative label: heavy metal
alternative label: hevi
alternative label: hip hop -metal
alternative label: industrial metal
alternative label: jytä
alternative label: metal
alternative label: metallimusiikki
alternative label: nu-metal
alternative label: pop heavy
broader: rock
definition: 1960-luvulta alkaen rockista eriytynyt raskaan rockin tyylilaji, johon sisältyy useita alalajeja.
in scheme: MUSA/CILLA - Musiikin asiasanasto
narrower: black metal
narrower: death metal
narrower: doom metal
narrower: speed metal
narrower: thrash metal
narrower: folk metal
note: Termiä käytetään yleisnimityksenä aina, kun ei ole kysymys täsmällisestä alaryhmästä ja epävarmoissa tapauksissa täsmällisemmän tyylin lisäksi.
scope note: deprecated on 2018.10.24

hengellinen musiikki
type: Concept
created: 1996-02-07
is replaced by: Y95327
modified: 2017-09-04T13:29:28+03:00
alternative label: uskonnollinen musiikki -- kirkot
alternative label: uskonnollinen musiikki -- kristinusko
definition: Kristillisten kirkkokuntien piirissä esiintyvien musiikin lajien yleisnimitys.
hidden label: uskonnollinen musiikki kirkot
hidden label: uskonnollinen musiikki kristinusko
in scheme: MUSA/CILLA - Musiikin asiasanasto
narrower: hengellinen viihdemusiikki
narrower: hengelliset lastenlaulut
narrower: hengelliset laulut
narrower: gospelmusiikki
narrower: kirkkomusiikki
narrower: ylistysmusiikki
narrower: spirituaalit
narrower: virret
note: Muiden uskontokuntien musiikkia kuvataan termeillä uskonnot : musiikki tai uskonnolliset yhteisöt : musiikki ja soveltaen, esimerkiksi buddhalaisuus : musiikki.
preferred label: andlig musik @sv
scope note: deprecated on 2018.10.24

elektroninen tanssimusiikki
type: Concept
created: 2016-10-26
is replaced by: Y214456
modified: 2017-09-04T13:29:58+03:00
alternative label: EDM
alternative label: breakbeat
alternative label: electronic dance music
alternative label: klubimusiikki
alternative label: rave-musiikki
broader: popmusiikki
definition: Elektronisesti tuotettu, klubiympäristöön tarkoitettu tanssittava popmusiikki, jota luonnehtii yleensä rumpukoneen luoma voimakas rytmi, samplerilla tai syntetisaattorilla luotu melodia sekä nopea tempo. Laulun rooli on yleensä vähäinen ja musiikki usein enimmäkseen instrumentaalista, poikkeuksena kuitenkin dance.
in scheme: MUSA/CILLA - Musiikin asiasanasto
narrower: dance
narrower: house
narrower: tekno
narrower: trance
narrower: drum 'n' bass
narrower: dubstep
preferred label: elektronisk dansmusik @sv
related: elektroninen populaarimusiikki
scope note: deprecated on 2018.10.24

oopperat
type: Concept
created: 1996-02-07
is replaced by: Y97801
modified: 2017-09-04T13:29:19+03:00
broader: näyttämömusiikki
in scheme: MUSA/CILLA - Musiikin asiasanasto
narrower: kamarioopperat
narrower: televisio-oopperat
narrower: divertissementit
narrower: zarzuelat
preferred label: operor @sv
related: operetit
related: musiikkinäytelmät
related: ooppera
related: verismi
scope note: deprecated on 2018.10.24

tyylikaudet
type: Concept
created: 1996-02-09
is replaced by: Y104698
modified: 2017-07-12T11:38:40+03:00
alternative label: tyylisuunnat
alternative label: stilriktningar @sv
definition: Eurooppalaisen taidemusiikin tyylikausien (keskiaika, renessanssi, barokki, klassismi, romantiikka jne.) yleisnimitys.
definition: Registret upptar namnen på de vanligaste konstmusikaliska stilperioderna, alla andra kan också användas som ämnesord. @sv
in scheme: MUSA/CILLA - Musiikin asiasanasto
narrower: antiikki
narrower: ars antiqua
narrower: ars nova
narrower: barokki
narrower: klassismi
narrower: gotiikka
narrower: renessanssi
note: Muita kuin sanastossa mainittuja musiikin tyylikausitermejä ei käytetä. Jos sovelletaan YSA:sta löytyviä yleisempiä taidetyylikausitermejä, on niiden yhteydessä aina käytettävä musiikin lajityyppiä ilmaisevaa termiä, esimerkiksi minimalismi : populaarimusiikki.
preferred label: stilperioder @sv
related: vanha musiikki
related: tyylit
scope note: deprecated on 2018.10.24

soul
type: Concept
created: 1996-02-08
is replaced by: Y103995
modified: 2017-09-21T13:39:54+03:00
broader: popmusiikki
definition: Yhdysvalloissa 1950-luvulla gospelmusiikista ja rhythm and bluesista kehittynyt popmusiikkityyli, josta tuli 1960-luvulla maailmanlaajuisesti suosittua. Tunnettuja edustajia ovat mm. James Brown, Aretha Franklin, The Supremes ja The Temptations.
in scheme: MUSA/CILLA - Musiikin asiasanasto
related: hip hop
related: rock
related: diskomusiikki
related: house
related: funk
related: rap
related: reggae
scope note: deprecated on 2018.10.24

lehdykkäsoittimet
type: Concept
created: 1996-02-08
is replaced by: Y214542
modified: 2017-09-04T13:29:27+03:00
broader: soittimet
broader: puhallinsoittimet
broader: puupuhaltimet
in scheme: MUSA/CILLA - Musiikin asiasanasto
narrower: saksofoni
narrower: klarinetti
narrower: oboe
narrower: englannintorvi
narrower: fagotti
preferred label: rörbladsinstrument @sv
related: soittimet
scope note: deprecated on 2018.10.24

vaskipuhaltimet
type: Concept
created: 1996-02-15
is replaced by: Y102926
modified: 2017-09-21T13:39:55+03:00
broader: puhallinsoittimet
definition: Puhallinsoitin, jonka ääni syntyy soittajan puhaltaessa suukappaleeseen niin, että huulten väristessä alkaa myös puhaltimen putkessa oleva ilmapatsas värähdellä. Vaskipuhaltimet ovat usein metallisia, mutta ne voivat olla myös esimerkiksi puisia tai muovisia.
in scheme: MUSA/CILLA - Musiikin asiasanasto
narrower: alppitorvi
narrower: pasuuna
narrower: trumpetti
narrower: kornetti
narrower: tuuba
narrower: käyrätorvi
narrower: flyygelitorvi
preferred label: bleckblåsinstrument @sv
scope note: deprecated on 2018.10.24

musiikintutkimus
type: Concept
created: 2005-06-17
is replaced by: Y155072
modified: 2017-09-21T13:40:03+03:00
alternative label: musiikin tutkimus
alternative label: musiikki -- tutkimus
alternative label: musiikkitiede
alternative label: musikologia
alternative label: uusi musiikkitiede
alternative label: yleinen musiikkitiede
alternative label: allmän musikvetenskap @sv
alternative label: musikologi @sv
definition: Musiikin ja musiikin harjoittamisen systemaattinen tutkiminen niiden kaikissa ilmenemismuodoissa.
hidden label: musiikki tutkimus
in scheme: MUSA/CILLA - Musiikin asiasanasto
narrower: etnomusikologia
narrower: kognitiivinen musiikkitiede
narrower: musiikkifilosofia
narrower: musiikki-ikonografia
narrower: musiikkipsykologia
narrower: musiikkisemiotiikka
narrower: musiikkisosiologia
note: Termiä käytetään, kun kyse ei ole jostain täsmällisemmästä tutkimussuuntauksesta kuten etnomusikologia tai kognitiivinen musiikkitiede tai kun tällaista erottelua ei kyetä tekemään.
preferred label: musikforskning @sv
related: musiikinteoria
scope note: deprecated on 2018.10.24

nuottijulkaisut
type: Concept
created: 1996-02-07
is replaced by: Y97708
modified: 2017-09-21T13:24:21+03:00
alternative label: nuotit
alternative label: noter @sv
definition: (1) Musiikin graafinen julkaisumuoto ja (2) näistä julkaisuista kirjastojen dokumentoinnissa käytettävä käsite.
in scheme: MUSA/CILLA - Musiikin asiasanasto
narrower: koraalivirsikirjat
narrower: koraalikirjat
narrower: partituurit
narrower: pianopartituurit
narrower: isonuottiset nuottijulkaisut
note: Termiä käytetään ensimmäisessä merkityksessään lähinnä nuottijulkaisuja käsittelevän musiikkikirjallisuuden indeksoinnissa, ei jokaisen nuottijulkaisun yhteydessä. Joissakin tapauksissa termillä voidaan kuitenkin täsmentää julkaisun luonnetta, esimerkiksi laulukirjat : nuottijulkaisut.
preferred label: musikalier @sv
related: soitonoppaat
related: laulunoppaat
related: laulukirjat
scope note: deprecated on 2018.10.24

soitinmusiikki
type: Concept
created: 1996-02-08
is replaced by: Y98903
modified: 2017-09-21T13:39:57+03:00
alternative label: instrumentaalimusiikki
broader: musiikki
definition: Nimitys musiikille, joka ei sisällä ihmisen ääntä.
in scheme: MUSA/CILLA - Musiikin asiasanasto
narrower: kamarimusiikki
narrower: alkusoitot
narrower: ohjelmamusiikki
narrower: koraalialkusoitot
narrower: instrumentaalinen viihdemusiikki
narrower: orkesterimusiikki
note: Termiä suositellaan käytettäväksi lähinnä kirjallisuudessa indeksoinnissa, ja varsinaisissa musiikkijulkaisuissa vain silloin, kun kyseessä on sekasisältöinen soitinmusiikkia sisältävä kokoelma, esimerkiksi soitinmusiikki : renessanssi : Italia : 1300-luku. Termiä ei ole missään tapauksessa tarkoitus käyttää jokaisen soitinmusiikkijulkaisun yhteydessä.
preferred label: instrumentalmusik @sv
related: canzonat
scope note: deprecated on 2018.10.24

ambient
type: Concept
created: 1997-09-30
is replaced by: Y214390
modified: 2017-09-04T13:29:36+03:00
alternative label: dark ambient
alternative label: experimental ambient
broader: elektroninen populaarimusiikki
definition: 1970-luvulla syntynyt populaarimusiikkityyli, jossa on pyritty luomaan yleensä elektronisin soittimin erilaisia, tavallisesti harmonisia ääniympäristöjä. Puhtaassa ambient-musiikissa rytmillä on hyvin pieni merkitys. Termiä suositellaan käytettäväksi lähinnä vain vuoden 1975 jälkeen syntyneestä musiikista.
in scheme: MUSA/CILLA - Musiikin asiasanasto
note: Termi esiintyy myös osana 1990-luvulla rave-kulttuurin johdannaisena luoduista genreistä käytettäviä nimityksiä (esim. ambient dub, ambient house, ambient pop, ambient techno). Näiden yhteydessä suositellaan käytettäväksi niiden yläkäsitteitä (dub, house, popmusiikki, tekno jne.).
related: elektroninen populaarimusiikki
related: dub
related: äänimaisema
related: avantgarde
related: house
related: tekno
related: new age -musiikki
related: meditaatiomusiikki
related: ympäristömusiikki
scope note: deprecated on 2018.10.24

säveljärjestelmät
type: Concept
created: 1996-02-08
is replaced by: Y104491
modified: 2017-09-21T13:39:45+03:00
broader: säveloppi
definition: Musiikinteoreettinen nimitys kokonaisuudelle, joka muodostuu tiettyjen sääntöjen mukaan valituista sävelistä ja sävelten joukoista määrättyine suhdejärjestelmineen. Esimerkiksi duuri-mollitonaalisuus on tällainen järjestelmä.
in scheme: MUSA/CILLA - Musiikin asiasanasto
narrower: moodit
narrower: rāgat
narrower: sävellajit
narrower: intervallit
narrower: kaksitoistasäveljärjestelmä
narrower: viisisäveljärjestelmä
narrower: sävelasteikot
preferred label: tonsystem @sv
related: mikrotonaalinen musiikki
scope note: deprecated on 2018.10.24

kuorot
type: Concept
created: 1996-02-08
is replaced by: Y96568
modified: 2017-09-21T13:39:48+03:00
definition: Kymmenen tai useamman laulajan muodostama esityskokoonpano. Alle kymmenen hengen kokoonpanoista käytetään nimitystä lauluyhtyeet.
in scheme: MUSA/CILLA - Musiikin asiasanasto
narrower: poikakuorot
narrower: sekakuorot
narrower: lapsikuorot
narrower: naiskuorot
narrower: kirkkokuorot
narrower: nuorisokuorot
narrower: kamarikuorot
narrower: mieskuorot
note: Termiä käytetään lähinnä kokoelmista ja kun kuoron tarkempi laatu ei ole selvillä.
preferred label: körer @sv
related: kuoromusiikki
scope note: deprecated on 2018.10.24

äänitekniikka
type: Concept
created: 1997-10-01
is replaced by: Y100513
modified: 2017-09-04T13:29:22+03:00
alternative label: ljudbearbetning @sv
broader: musiikkiteknologia
definition: Tekniikka, joka liittyy äänen tallennukseen ja toistoon.
in scheme: MUSA/CILLA - Musiikin asiasanasto
narrower: sämpläys
narrower: miksaukset
preferred label: ljudteknik @sv
related: äänitysstudiot
related: studiotekniikka
related: akustiikka
related: äänentallennus
related: miksaus
related: äänentoisto
related: stereofonia
scope note: deprecated on 2018.10.24

äänialat
type: Concept
created: 1996-02-15
is replaced by: Y214740
modified: 2017-09-04T13:29:23+03:00
alternative label: lauluäänet
broader: laulaminen
definition: Yleisnimitys erikorkuisille ihmisäänille.
in scheme: MUSA/CILLA - Musiikin asiasanasto
narrower: altto
narrower: baritoni
narrower: basso
narrower: kontratenori
narrower: mezzosopraano
narrower: sopraano
narrower: tenori
note: Termiä käytetään musiikkikirjallisuuden indeksoinnissa. Äänitteissä ja nuottijulkaisuissa käytetään aina täsmällistä äänialaa kuvaavaa termiä.
preferred label: sångstämmor @sv
related: laulajat
related: koloratuuri
scope note: deprecated on 2018.10.24

jousisoittimet
type: Concept
created: 1996-02-08
is replaced by: Y100704
modified: 2017-09-21T13:39:50+03:00
alternative label: kielisoittimet
broader: soittimet
definition: Jousisoitinten ryhmään kuuluvien soittimien yleisnimitys. Jousisoittimet ovat kielisoittimia, joita soitetaan jousen avulla.
in scheme: MUSA/CILLA - Musiikin asiasanasto
narrower: viulu
narrower: sello
narrower: kontrabasso
narrower: alttoviulu
narrower: viola da gamba
narrower: viola d'amore
narrower: violone
narrower: virsikantele
preferred label: stråkinstrument @sv
scope note: deprecated on 2018.10.24

viihdemusiikki
type: Concept
created: 1996-02-15
is replaced by: Y104533
modified: 2017-09-21T13:39:52+03:00
broader: populaarimusiikki
definition: Musiikkityylit, joiden ensisijainen käyttötarkoitus on ihmisten viihdyttäminen, yleensä sosiaalisen kanssakäymisen tilanteissa.
in scheme: MUSA/CILLA - Musiikin asiasanasto
narrower: hengellinen viihdemusiikki
narrower: iskelmät
narrower: mustalaismusiikki
narrower: barbershop-musiikki
narrower: instrumentaalinen viihdemusiikki
narrower: salonkimusiikki
preferred label: underhållningsmusik @sv
related: haitarijazz
related: tanssimusiikki
scope note: deprecated on 2018.10.24

latinalaistanssit
type: Concept
created: 1996-02-08
is replaced by: Y103031
modified: 2017-09-04T13:29:25+03:00
broader: tanssit
definition: Latinalaisamerikkalaista syntyperää olevia seuratansseja, jotka ovat levinneet käyttöön ympäri maailmaa.
in scheme: MUSA/CILLA - Musiikin asiasanasto
narrower: sambat
narrower: cha-cha-chat
narrower: conga (tanssit)
narrower: rumbat
narrower: lambada (tanssit)
narrower: pasodoble (tanssit)
narrower: mambo (tanssit)
note: Termiä suositellaan käytettäväksi silloin, kun halutaan ilmaista, että julkaisu sisältää näiden tanssien säestykseksi soveltuvaa musiikkia.
preferred label: latinamerikanska danser @sv
related: latinalaisamerikkalainen populaarimusiikki
related: tango (tanssit)
scope note: deprecated on 2018.10.24

puupuhaltimet
type: Concept
created: 1996-02-08
is replaced by: Y101264
modified: 2017-09-21T13:39:54+03:00
broader: puhallinsoittimet
definition: Puhallinsoitin, jonka ääni syntyy ilmavirran osuessa joko reunaan tai tulppakanavaan (huilusoittimet) tai ruokolehdykän värähtelystä (lehdykkäsoittimet). Puupuhaltimia valmistetaan puun lisäksi usein myös metallista.
in scheme: MUSA/CILLA - Musiikin asiasanasto
narrower: saksofoni
narrower: klarinetti
narrower: huilu
narrower: oboe
narrower: englannintorvi
narrower: lehdykkäsoittimet
narrower: fagotti
narrower: nokkahuilu
preferred label: träblåsinstrument @sv
scope note: deprecated on 2018.10.24

esittäminen
type: Concept
created: 1996-02-07
is replaced by: Y107871
modified: 2017-05-28T16:04:59+03:00
definition: Nimitys taiteelliselle esittämiselle (laulamista, soittamista, tanssimista).
in scheme: MUSA/CILLA - Musiikin asiasanasto
narrower: musiikin esittäminen
preferred label: framförande @sv
related: säestykset
related: tulkinta
related: soittaminen
related: laulaminen
related: esittäjät
related: esiintyminen
related: esityskäytäntö
related: karaoke
related: säestäminen
scope note: deprecated on 2018.10.24

sävellysoppi
type: Concept
created: 1996-02-08
is replaced by: Y101671
modified: 2017-09-21T13:24:21+03:00
broader: musiikinteoria
definition: Säveltämiseen liittyvien osatekijöiden musiikinteoreettinen käsittelyväline.
in scheme: MUSA/CILLA - Musiikin asiasanasto
narrower: diminuutio
narrower: homofonia
narrower: polyfonia
narrower: äänenkuljetus
narrower: kontrapunkti
narrower: modulaatio
preferred label: kompositionslära @sv
related: muoto-oppi
related: säveltäminen
scope note: deprecated on 2018.10.24

maailmanmusiikki
type: Concept
created: 1996-02-09
is replaced by: Y107796
modified: 2017-09-21T13:24:19+03:00
alternative label: etnopop
alternative label: neo-kansanmusiikki
alternative label: nykykansanmusiikki
alternative label: world beat
alternative label: world music
broader: populaarimusiikki
definition: Populaarimusiikkia, jossa on vaikutteita jonkin toisen kulttuurin musiikista.
in scheme: MUSA/CILLA - Musiikin asiasanasto
narrower: afro
narrower: rai
narrower: bhangra
narrower: soca
narrower: zouk
narrower: ghazal
preferred label: världsmusik @sv
related: perinnemusiikki
related: latinalaisamerikkalainen populaarimusiikki
related: popmusiikki
scope note: deprecated on 2018.10.24

dance
type: Concept
created: 2001-02-23
is replaced by: Y113587
modified: 2017-09-21T13:40:02+03:00
alternative label: dance-pop
alternative label: eurodance
alternative label: tanssipop
broader: popmusiikki
broader: elektroninen tanssimusiikki
definition: 1990-luvulla suosituksi tullut elektronisen tanssimusiikin laji, jota voi luonnehtia housen ja teknon helpotetuksi versioksi. Laulu ja melodisuus ovat tärkeämmässä osassa kuin muussa elektronisessa tanssimusiikissa. Tunnetuin dancen alagenre on eurodance, joka sisältää usein myös räppiä.
in scheme: MUSA/CILLA - Musiikin asiasanasto
note: Termiä käytetään myös klubimusiikista vaikutteita ammentavien listapop-artistien tuotannon tanssittavimmasta osasta.
related: hip hop
related: diskomusiikki
related: house
related: tekno
related: r&b
related: trance
related: drum 'n' bass
related: reggaeton
scope note: deprecated on 2018.10.24

blues
type: Concept
created: 1996-02-07
is replaced by: Y94887
modified: 2017-09-21T13:39:50+03:00
broader: afroamerikkalainen musiikki
definition: Yhdysvaltain afroamerikkalaisen väestön keskuudessa kehittynyt populaarimusiikin tyyli. Termillä tarkoitetaan joskus myös ns. blues-kaavaa, tietynlaista muotorakennetta.
in scheme: MUSA/CILLA - Musiikin asiasanasto
narrower: urban blues
narrower: barrelhouse piano
narrower: city blues
narrower: country blues
note: Termiä käytetään aina, kun blues-musiikin tarkempi laatu ei ole tiedossa tai kyseessä on bluesin eri lajeja sisältävä kokoelma.
related: jazz
related: boogie woogie
related: barrelhouse piano
related: zydeco
related: rhythm and blues
scope note: deprecated on 2018.10.24

orkesterit
type: Concept
created: 1996-02-07
is replaced by: Y101017
modified: 2017-09-21T13:39:52+03:00
definition: Kymmenen tai useamman soittajan esityskokoonpano yleensä länsimaisen taidemusiikin viitekehyksessä.
in scheme: MUSA/CILLA - Musiikin asiasanasto
narrower: big bandit
narrower: puhallinorkesterit
narrower: soittokunnat
narrower: steel bandit
narrower: jousiorkesterit
narrower: kamariorkesterit
narrower: sinfoniaorkesterit
narrower: viihdeorkesterit
note: Jos termiä käytetään muun kuin länsimaisen taidemusiikin yhteydessä, on aina käytettävä täsmentävää asiasanaa, esimerkiksi orkesterit : gamelan : Bali.
preferred label: orkestrar @sv
related: orkesteritoiminta
related: yhtyeet
scope note: deprecated on 2018.10.24

country
type: Concept
created: 1996-02-07
is replaced by: Y101051
modified: 2017-09-21T13:39:52+03:00
alternative label: kantri
broader: populaarimusiikki
definition: Yhdysvaltain valkoisen maaseutuväestön keskuudessa 1920-luvulla syntynyt popmusiikin tyylilaji.
in scheme: MUSA/CILLA - Musiikin asiasanasto
narrower: bluegrass
narrower: country and western
narrower: hillbilly
narrower: cajun
narrower: western swing
note: Termiä suositellaan käytettäväksi yleisteoksista ja sekasisältöisistä kokoelmista sekä silloin, kun musiikin tarkempaa kuulumista johonkin countryn alalajiin ei pystytä selvittämään.
related: popmusiikki
related: tex mex -musiikki
related: country rock
related: rancheramusiikki
scope note: deprecated on 2018.10.24

diskomusiikki
type: Concept
created: 1996-02-07
is replaced by: Y101089
modified: 2017-09-28T14:00:40+03:00
broader: popmusiikki
definition: 1970-luvulla New Yorkin klubeilla syntynyt elektronisen tanssimusiikin tyylilaji.
in scheme: MUSA/CILLA - Musiikin asiasanasto
narrower: house
note: Termiin on syytä lisätä aikamääre, esimerkiksi diskomusiikki : Suomi : 1970-luku.
preferred label: diskomusik @sv
related: dance
related: hip hop
related: soca
related: zouk
related: rock
related: house
related: soul
related: tekno
scope note: deprecated on 2018.10.24

house
type: Concept
created: 1996-02-07
is replaced by: Y214499
modified: 2017-09-04T13:29:26+03:00
alternative label: ambient house
broader: popmusiikki
broader: diskomusiikki
broader: elektroninen tanssimusiikki
definition: Elektronisen tanssimusiikin laji, joka kehittyi discomusiikista 1980-luvun alkupuolella. Tyyli oli instrumentaalipainotteista, rytmi muuttui mekaanisemmaksi, bassotaajuudet syvemmiksi, ja mukaan tuli vaikutteita mm. syntikkapopista, dub reggaesta, hip hopista ja jazzista. 1980-luvun loppupuolelta alkaen tyyli yleistyi ja sirpaloitui (mm. ambient house, acid house, deep house, epic house, hard house ja latino house). 1990-luvulla house-tyylistä tuli popmusiikin valtavirtaan kuuluva ilmiö. Tunnettuja edustajia ovat olleet Basement Jaxx, Daft Punk, Larry Heard, Marshall Jefferson, Frankie Knuckles, Larry Levan, David Morales, Eric Morillo, Danny Rampling ja Todd Terry.
in scheme: MUSA/CILLA - Musiikin asiasanasto
related: ambient
related: dance
related: hip hop
related: diskomusiikki
related: soul
related: tekno
related: trance
related: drum 'n' bass
scope note: deprecated on 2018.10.24

tekno
type: Concept
created: 1996-02-09
is replaced by: Y107742
modified: 2017-05-09T08:36:32+03:00
alternative label: ambient techno
preferred label: techno
broader: popmusiikki
broader: elektroninen tanssimusiikki
definition: Elektronisesti tuotettu, klubiympäristöön tarkoitettu tanssittava popmusiikki, jota luonnehtii yleensä hyvin nopea tempo ja instrumentaalisuus (poikkeuksena teknorap). Tekno on myös varsin usein hyvin anonyymisti sävellettyä ja esitettyä.
in scheme: MUSA/CILLA - Musiikin asiasanasto
related: ambient
related: dance
related: rock
related: diskomusiikki
related: house
related: trance
related: drum 'n' bass
related: teknorock
related: dubstep
scope note: deprecated on 2018.10.24

tyylit
type: Concept
created: 1996-02-09
is replaced by: Y99740
modified: 2017-05-09T08:36:45+03:00
alternative label: tyylisuunnat
alternative label: stilriktningar @sv
definition: Musiikkityylien yleisnimitys.
definition: Registret upptar namnen på de vanligaste stilriktningarna, också alla andra stilriktningar kan användas som ämnesord. @sv
in scheme: MUSA/CILLA - Musiikin asiasanasto
narrower: minimalismi
narrower: verismi
narrower: eklektismi
narrower: kertaustyylit
narrower: ekspressionismi
narrower: formalismi
narrower: futurismi
narrower: impressionismi
narrower: modernismi
narrower: uusklassismi
note: Jos termiä käytetään muun kuin taidemusiikin yhteydessä, on aina käytettävä lisäksi musiikinlajia ilmaisevaa termiä, esimerkiksi tyylit : popmusiikki.
preferred label: stilar @sv
related: tyylikaudet
scope note: deprecated on 2018.10.24

musiikkiteknologia
type: Concept
created: 2011-04-05
is replaced by: Y186385
modified: 2017-09-21T13:40:04+03:00
definition: Musiikin ja muun äänen säveltämiseen, soittamiseen, tallentamiseen, muokkaamiseen, säilyttämiseen, jakeluun ja toistamiseen tarkoitetut tekniset (erityisesti sähköiset) laitteet, välineet, tietokone- ja tietoverkkosovellukset sekä muu teknologia. Käsite esiintyy myös opetettavana aineena oppilaitoksissa.
in scheme: MUSA/CILLA - Musiikin asiasanasto
narrower: äänitysstudiot
narrower: studiotekniikka
narrower: äänitekniikka
narrower: äänentallennuslaitteet
narrower: äänentoistolaitteet
narrower: sämplerit
narrower: MP3
narrower: MIDI
preferred label: musikteknologi @sv
related: soitinrakennus
related: musiikkiteollisuus
scope note: deprecated on 2018.10.24

kosketinsoittimet
type: Concept
created: 1996-02-08
is replaced by: Y101046
modified: 2017-09-21T13:39:45+03:00
broader: soittimet
definition: Soitin, jota soitetaan sormilla koskettimiston yksittäisiä säveliä vastaavia koskettimia painamalla.
in scheme: MUSA/CILLA - Musiikin asiasanasto
narrower: piano
narrower: sähköurut
narrower: cembalo
narrower: harmonikka
narrower: celesta
narrower: klavikordi
narrower: virginaali
narrower: fortepiano
narrower: urut
narrower: harmoni
preferred label: tangentinstrument @sv
scope note: deprecated on 2018.10.24

hip hop
type: Concept
created: 1996-02-07
is replaced by: Y110283
modified: 2017-09-21T13:24:20+03:00
broader: popmusiikki
definition: Kollektiivinen käsite urbaanille kulttuurille ja taiteelle, joka on peräisin 1970-luvun New Yorkista. Erityisesti erilaisilla musiikkityyleillä (mm. rap, acid jazz ja house) on keskeinen asema.
in scheme: MUSA/CILLA - Musiikin asiasanasto
note: Termiä suositellaan käytettäväksi lähinnä kirjallisuuden ja musiikkikokoelmien yhteydessä.
preferred label: hiphop @sv
related: dance
related: acid jazz
related: diskomusiikki
related: house
related: soul
related: funk
related: drum 'n' bass
related: reggaeton
related: rap
related: dubstep
scope note: deprecated on 2018.10.24

afroamerikkalainen musiikki
type: Concept
created: 1996-03-18
is replaced by: Y94518
modified: 2017-09-21T13:24:20+03:00
definition: Musiikinlajit, jotka ovat syntyneet ja muotoutuneet afrikkalaisten musiikkikulttuureiden sulautuessa amerikkalaiseen kulttuuriin aina afrikkalaisten orjien tuonnista 1400-luvulta 1800-luvulle ja sen jälkeen afrikkalaista syntyperää olevien amerikkalaisten keskuudessa.
in scheme: MUSA/CILLA - Musiikin asiasanasto
narrower: jazz
narrower: ragtime
narrower: highlife
narrower: popmusiikki
narrower: blues
narrower: boogie woogie
narrower: salsa
narrower: zydeco
narrower: son
note: Termiä suositellaan käytettäväksi lähinnä musiikkikirjallisuuden indeksoinnissa sekä afroamerikkalaisen musiikin eri lajeja sisältävien nuotti- ja äänitekokoelmien yhteydessä.
preferred label: afroamerikansk musik @sv
related: populaarimusiikki
related: latinalaisamerikkalainen musiikki
scope note: deprecated on 2018.10.24

äänentallennus
type: Concept
created: 1996-02-15
is replaced by: Y100504
modified: 2017-09-04T13:29:27+03:00
alternative label: äänittäminen
alternative label: äänitys
alternative label: bandning @sv
alternative label: inspelning @sv
definition: Nimitys prosessille, jossa elävä ääni tallennetaan sähkömagneettisesti tai jollain muulla teknisellä menetelmällä.
in scheme: MUSA/CILLA - Musiikin asiasanasto
narrower: äänitykset
narrower: nauhoitus
narrower: levytys
narrower: miksaajat
narrower: miksaukset
preferred label: ljudinspelning @sv
related: äänitekniikka
related: miksaus
related: äänentallennuslaitteet
related: äänentoistolaitteet
related: masterointi
related: miksaukset
related: äänentoisto
scope note: deprecated on 2018.10.24

reggae
type: Concept
created: 1996-02-08
is replaced by: Y98558
modified: 2017-09-21T13:39:57+03:00
broader: popmusiikki
definition: Noin vuodesta 1968 alkaen Jamaikalla kehittynyt popmusiikin tyyli, jonka edeltäjiä olivat ska ja rock steady.
in scheme: MUSA/CILLA - Musiikin asiasanasto
narrower: rock steady
narrower: dub
narrower: dancehall
note: Koska reggae on levinnyt maailmanlaajuiseksi ilmiöksi, on sen yhteydessä suositeltavaa käyttää aina ajallisia ja maantieteellisiä täsmenteitä, esimerkiksi reggae : Iso-Britannia : 1980-luku.
related: rock steady
related: rock
related: soul
related: reggaeton
related: rap
related: ska
related: dubstep
scope note: deprecated on 2018.10.24

musiikinteoria
type: Concept
created: 1996-02-09
is replaced by: Y97556
modified: 2017-09-21T13:39:45+03:00
alternative label: musiikkioppi
alternative label: musiklära @sv
definition: Musiikin rakenteiden tutkimisen ja mallintamisen menetelmä ja esitystapa.
in scheme: MUSA/CILLA - Musiikin asiasanasto
narrower: musiikkianalyysi
narrower: viritysjärjestelmät
narrower: sointuoppi
narrower: rytmioppi
narrower: muoto-oppi
narrower: sävellysoppi
narrower: soitinnus
narrower: säveloppi
narrower: soinnutus
narrower: sointiväri
note: Termiä ei sovelleta muiden tieteiden menetelmien yhteydessä, sen sijasta käytetään termiä musiikintutkimus.
preferred label: musikteori @sv
related: musiikintutkimus
related: sointiväri
scope note: deprecated on 2018.10.24

afro
type: Concept
created: 1996-02-07
is replaced by: Y107796
modified: 2017-09-04T13:29:49+03:00
broader: maailmanmusiikki
definition: Yleisnimitys erilaisille afrikkalaisille maailmanmusiikkityyleille.
in scheme: MUSA/CILLA - Musiikin asiasanasto
narrower: mbaqanga
narrower: benga
narrower: juju
narrower: makossa
narrower: mbalax
narrower: soukous
related: populaarimusiikki
related: afro-rock
related: highlife
related: popmusiikki
related: rai
related: taarab

perinnemusiikki
type: Concept
created: 1996-02-08
is replaced by: Y98074
modified: 2017-09-04T13:29:38+03:00
alternative label: etninen musiikki
alternative label: etnomusiikki
alternative label: etnisk musik @sv
definition: Musiikki, joka on kuulonvaraisesti siirtynyttä, etnisesti tiettyyn alueeseen kiinnittynyttä, ei välttämättä "aitoa kansanmusiikkia", ei eriytynyt taide- tai populaarimusiikiksi, ei välttämättä lokalisoitunutta, eikä länsimaista taide- tai populaarimusiikkia.
in scheme: MUSA/CILLA - Musiikin asiasanasto
narrower: kansanmusiikki
narrower: flamenco
narrower: taarab
narrower: arabialainen musiikki
narrower: arkkiveisut
narrower: pelimannimusiikki
narrower: gamelanmusiikki
narrower: inkamusiikki
narrower: klezmer-musiikki
narrower: qawwali
note: Termiä käytetään ilmaisemaan musiikin lajia kun kyseessä on monia perinnemusiikin lajeja sisältävä kokoelma. Termiä ei kuitenkaan sovelleta mekaanisesti jokaisen perinnemusiikkia sisältävän julkaisun indeksoinnissa.
preferred label: traditionell musik @sv
related: maailmanmusiikki
related: populaarimusiikki
related: arkkiveisut
related: kansanperinne
scope note: deprecated on 2018.10.24

lyömäsoittimet
type: Concept
created: 1996-02-08
is replaced by: Y102769
modified: 2017-09-21T13:39:47+03:00
alternative label: slagverk @sv
broader: soittimet
definition: Lyömäsoitinten ryhmään kuuluvat soittimet, joiden ääni syntyy soitinta lyömällä.
in scheme: MUSA/CILLA - Musiikin asiasanasto
narrower: dulcimer
narrower: ksylofoni
narrower: marimba
narrower: vibrafoni
narrower: rummut
narrower: celesta
narrower: congarumpu
narrower: gongi
narrower: patarummut
narrower: steel pan
narrower: symbaali
narrower: triangeli
preferred label: slaginstrument @sv
scope note: deprecated on 2018.10.24

tulkinta
type: Concept
created: 1996-02-09
is replaced by: Y101609
modified: 2017-05-09T08:36:28+03:00
alternative label: interpretation @sv
definition: Tapa, jolla musiikillinen esitys toteutetaan.
in scheme: MUSA/CILLA - Musiikin asiasanasto
narrower: agogiikka
narrower: artikulaatio
narrower: dynamiikka
narrower: fraseeraus
narrower: ornamentiikka
narrower: intonaatio
narrower: rekisteröinti
narrower: improvisointi
preferred label: tolkning @sv
related: esittäminen
related: esityskäytäntö
related: vastaanotto
related: improvisointi
related: johtaminen
related: yleisö
scope note: deprecated on 2018.10.24

yhtyeet
type: Concept
created: 1996-02-15
is replaced by: Y102143
modified: 2017-09-21T13:39:52+03:00
alternative label: bändit
alternative label: ensemblet (musiikki)
alternative label: band -- orkestrar @sv
definition: Nimitys 2-9 hengen suuruisille soitinkokoonpanoille.
hidden label: band orkestrar @sv
in scheme: MUSA/CILLA - Musiikin asiasanasto
narrower: duot (sävellykset)
narrower: kvartetit
narrower: kvintetit
narrower: nonetit
narrower: oktetit
narrower: sekstetit
narrower: septetit
narrower: steel bandit
narrower: lauluyhtyeet
narrower: duot (yhtyeet)
narrower: triot (yhtyeet)
note: Termiä käytetään vain soitinyhtyeistä, koska sanastossa on vokaaliyhtyeille oma termi lauluyhtyeet.
preferred label: ensembler @sv
related: kamarimusiikki
related: orkesterit
scope note: deprecated on 2018.10.24

lauluyhtyeet
type: Concept
created: 1996-02-08
is replaced by: Y101103
modified: 2017-09-21T13:24:18+03:00
alternative label: lauluryhmät
broader: yhtyeet
definition: 2-9 laulajan muodostaman esityskokoonpanon nimitys. Suuremmasta kokoonpanosta käytetään termiä kuorot.
in scheme: MUSA/CILLA - Musiikin asiasanasto
narrower: duot (sävellykset)
narrower: kvartetit
narrower: duot (yhtyeet)
narrower: tertsetit
preferred label: sångensembler @sv
related: barbershop-musiikki
related: kvartetit
related: kvintetit
related: nonetit
related: oktetit
related: sekstetit
related: septetit
related: duot (yhtyeet)
scope note: deprecated on 2018.10.24

soittaminen
type: Concept
created: 1996-02-08
is replaced by: Y98906
modified: 2017-09-21T13:24:21+03:00
definition: Soittimen käyttäminen musiikillisen äänen tuottamiseen.
in scheme: MUSA/CILLA - Musiikin asiasanasto
narrower: asete
narrower: yhteismusisointi
narrower: näppäilysoittaminen
narrower: partituurinsoitto
narrower: plektrasoittaminen
narrower: sormitukset
narrower: slide-kitara
note: Jos termiä käytetään konkreettisesti, soittimen nimi on aina yhdistettävä mukaan, esimerkiksi soittaminen : kitara. Termiä ei käytetä nuottien tai äänitteiden indeksoinnissa.
preferred label: musicerande @sv
related: soitonoppaat
related: säestykset
related: soittimet
related: esittäminen
related: säestäminen
related: rekisteröinti
related: viritys
scope note: deprecated on 2018.10.24

kamarimusiikki
type: Concept
created: 1996-02-08
is replaced by: Y102141
modified: 2017-09-21T13:39:47+03:00
broader: soitinmusiikki
definition: Barokin aikana termi tarkoitti kaikkea laulu- ja soitinmusiikkia, joka ei ollut kirkkoon tai teatteriin tarkoitettua. 1700-luvun puolivälin jälkeen alkoi vakiintua termin käyttö tarkoittamaan yksityisissä tiloissa suhteellisen pienellä kokoonpanolla esitettyä soitinmusiikkia. Pienimuotoista laulumusiikkia ei yleensä lueta kamarimusiikin käsitteen piiriin, ei myöskään yhdelle soittimelle sävellettyä musiikkia.
in scheme: MUSA/CILLA - Musiikin asiasanasto
narrower: duot (sävellykset)
narrower: septetot
note: Termiä suositellaan käytettäväksi musiikkiaineistossa lähinnä kokoelmien yhteydessä sekä monografioissa silloin, kun julkaisu käsittelee tätä musiikin lajia yleensä.
preferred label: kammarmusik @sv
related: yhtyeet
related: duot (sävellykset)
related: triot (sävellykset)
related: kamarikonsertot
related: nonetot
related: oktetot
related: triot (yhtyeet)
related: kvartetot
related: kvintetot
related: sekstetot
related: septetot
related: sonaatit
scope note: deprecated on 2018.10.24

musiikki
type: Concept
created: 1996-03-01
is replaced by: Y97560
modified: 2017-09-21T13:39:49+03:00
alternative label: säveltaide
definition: Säveltaide, eli ääneen perustuva taiteen muoto. Termiä käytetään samassa merkityksessä kuin puhutaan kuvataiteista ja kaunokirjallisuudesta.
in scheme: MUSA/CILLA - Musiikin asiasanasto
narrower: mikrotonaalinen musiikki
narrower: elokuvamusiikki
narrower: näyttämömusiikki
narrower: isänmaallinen musiikki
narrower: aleatorinen musiikki
narrower: videomusiikki
narrower: televisiomusiikki
narrower: meditaatiomusiikki
narrower: soitinmusiikki
narrower: pelimusiikki
narrower: kotimusiikki
narrower: käyttömusiikki
narrower: tanssimusiikki
narrower: monikuoroinen musiikki
narrower: rentoutusmusiikki
note: Termiä käytetään ei-musiikillisten asiasanojen täsmenteenä, kun tarkempaa termiä ei voida käyttää, esimerkiksi piratismi : musiikki. Varsinaisten musiikkitermien yhteydessä ilmaisua ei ole tarkoituksenmukaista käyttää, mistä syystä myös hierarkiasuhteet on jätetty merkitsemättä.
preferred label: musik @sv
scope note: deprecated on 2018.10.24

jazz
type: Concept
created: 1996-02-08
is replaced by: Y95621
modified: 2017-09-21T13:39:47+03:00
broader: afroamerikkalainen musiikki
definition: Yhdysvalloissa 1900-luvun alussa bluesin ja soittokuntamusiikin pohjalta kehittynyt afroamerikkalaisen populaarimusiikin tyyli, joka vuosisadan kuluessa on jakautunut lukuisiin alaryhmiin.
in scheme: MUSA/CILLA - Musiikin asiasanasto
narrower: acid jazz
narrower: fuusiomusiikki
narrower: mainstream
narrower: bebop
narrower: barrelhouse piano
narrower: traditionaalinen jazz
narrower: free jazz
narrower: hard bop
narrower: swing
narrower: third stream -jazz
related: ragtime
related: blues
related: boogie woogie
related: salsa
related: haitarijazz
related: New Orleans -jazz
scope note: deprecated on 2018.10.24

kirkkomusiikki
type: Concept
created: 1996-02-08
is replaced by: Y96218
modified: 2017-05-09T08:36:26+03:00
broader: hengellinen musiikki
definition: Yleisnimitys kristillisten kirkkojen piirissä ja käyttöön sävelletylle musiikille. Jos termiä käytetään muiden uskontokuntien yhteydessä, on aina käytettävä myös kyseisen uskonnon tai uskontokunnan nimeä täsmentävänä asiasanana.
in scheme: MUSA/CILLA - Musiikin asiasanasto
narrower: liturginen musiikki
narrower: koraalit
narrower: messut
narrower: latinalainen kirkkolaulu
narrower: motetit
narrower: ortodoksinen kirkkomusiikki
narrower: passiot
narrower: koraalialkusoitot
narrower: antifonit
narrower: graduaalit
narrower: litaniat
narrower: magnificatit
narrower: vesperit
narrower: vigiliat
narrower: virret
note: Termiä suositellaan käytettäväksi lähinnä musiikkikirjallisuudessa sekä erilaisia kirkkomusiikkisävellyksiä sisältävien kokoelmien yhteydessä. Yksittäisistä sävellyksistä termiä käytetään vain, jos tarkempi laatu ei ole selvillä. Termi voidaan yhdistää täsmälliseen kirkkokunnan nimeen, esimerkiksi kirkkomusiikki : kveekarit.
preferred label: kyrkomusik @sv
related: oratoriot
related: kantaatit
scope note: deprecated on 2018.10.24

soittimet
type: Concept
created: 1996-02-08
is replaced by: Y98908
modified: 2017-09-21T13:39:50+03:00
alternative label: instrumentit (musiikki)
alternative label: musiikki-instrumentit
alternative label: instrument @sv
alternative label: musik instrument @sv
definition: Väline, jonka avulla ihminen tuottaa musiikillisia ääniä.
in scheme: MUSA/CILLA - Musiikin asiasanasto
narrower: sähkösoittimet
narrower: kosketinsoittimet
narrower: lyömäsoittimet
narrower: periodisoittimet
narrower: puhallinsoittimet
narrower: jousisoittimet
narrower: automaattisoittimet
narrower: näppäilysoittimet
narrower: sitrasoittimet
narrower: lehdykkäsoittimet
narrower: hankaussoittimet
narrower: kampiliira
narrower: signaalisoittimet
narrower: tuohisoittimet
preferred label: musikinstrument @sv
related: soittaminen
related: lehdykkäsoittimet
related: soitinluokitukset
related: soitinrakennus
scope note: deprecated on 2018.10.24

äänentoistolaitteet
type: Concept
created: 1996-02-15
is replaced by: Y100506
modified: 2017-05-09T08:36:34+03:00
alternative label: hifilaitteet
alternative label: kuuntelulaitteet
alternative label: stereolaitteet
alternative label: stereot
alternative label: hifi-anläggningar @sv
alternative label: lyssnarapparater @sv
alternative label: stereoanläggningar @sv
alternative label: stereor @sv
broader: musiikkiteknologia
definition: Teknisiä laitteita, joita tallennetun äänen toistamisessa voidaan käyttää ja tarvita.
in scheme: MUSA/CILLA - Musiikin asiasanasto
narrower: levyautomaatit
narrower: lasersoittimet
narrower: nauhurit
narrower: levysoittimet
narrower: mikrofonit
narrower: virittimet
narrower: kaiuttimet
narrower: korvalappustereot
narrower: kuulokkeet
narrower: vahvistimet
narrower: viritinvahvistimet
preferred label: ljudåtergivningsanläggningar @sv
related: akustiikka
related: äänentallennus
related: äänentallennuslaitteet
related: äänentoisto
related: mikrofonit
related: virittimet
related: stereofonia
scope note: deprecated on 2018.10.24

näppäilysoittimet
type: Concept
created: 1996-02-07
is replaced by: Y100997
modified: 2017-09-21T13:39:51+03:00
alternative label: kielisoittimet
broader: soittimet
definition: Näppäilysoitinten ryhmään kuuluvat soittimet, joiden ääni syntyy sormilla näppäilemällä.
in scheme: MUSA/CILLA - Musiikin asiasanasto
narrower: mandoliini
narrower: harppu
narrower: kitara
narrower: balalaikka
narrower: banjo
narrower: bassokitara
narrower: buzuki
narrower: sitrasoittimet
narrower: harppusoittimet
narrower: luuttu
narrower: luuttusoittimet
narrower: lyyrasoittimet
narrower: mbira
narrower: sitar
narrower: sitra
narrower: steel-kitara
narrower: sähkökitara
narrower: kantele
preferred label: knäppinstrument @sv
scope note: deprecated on 2018.10.24

laulaminen
type: Concept
created: 1996-02-08
is replaced by: Y103036
modified: 2017-09-21T13:24:21+03:00
alternative label: laulutekniikka
alternative label: sångteknik @sv
definition: Musiikin tuottaminen ihmisäänellä.
in scheme: MUSA/CILLA - Musiikin asiasanasto
narrower: kurkkulaulu
narrower: äänialat
narrower: bel canto
narrower: falsettilaulu
narrower: yhteismusisointi
narrower: beatboxing
narrower: kuorolaulaminen
narrower: yhtyelaulaminen
narrower: jodlaus
narrower: joikaaminen
narrower: scatlaulu
note: Termiä on yleisyytensä takia syytä käyttää vain täsmentävien termien kanssa, esimerkiksi laulaminen : avantgardismi : Yhdysvallat.
preferred label: sång @sv
related: yhteislaulu
related: laulunoppaat
related: puhelaulu
related: yksinlaulu
related: esittäminen
related: karaoke
related: koloratuuri
related: vokaliisit (harjoitusaineistot)
related: äänenmuodostus
related: vokaliisit (laulut)
scope note: deprecated on 2018.10.24

laulajat
type: Concept
created: 1996-02-08
is replaced by: Y96789
modified: 2017-09-21T13:39:54+03:00
alternative label: oopperalaulajat
alternative label: vokalistit
alternative label: operasångare @sv
alternative label: vokalister @sv
broader: muusikot
definition: Henkilö, joka esittää musiikkia laulamalla.
in scheme: MUSA/CILLA - Musiikin asiasanasto
narrower: naislaulajat
narrower: altot (laulajat)
narrower: baritonit (laulajat)
narrower: bassot (laulajat)
narrower: kontratenorit (laulajat)
narrower: sopraanot (laulajat)
narrower: tenorit (laulajat)
narrower: kansanlaulajat
narrower: mieslaulajat
narrower: kastraattilaulajat
note: Termiä on yleisyytensä syytä käyttää vain täsmentävien termien kanssa, esimerkiksi laulajat : naiset : rock, laulajat : perinnemusiikki : saamelaiset.
preferred label: sångare @sv
related: äänialat
related: muusikot
related: esittäjät
related: viihdetaiteilijat
related: solistit
related: näyttämötaiteilijat
related: minnelaulajat
related: minstrelit
related: trubaduurit
related: truveerit
scope note: deprecated on 2018.10.24

populaarimusiikki
type: Concept
created: 1996-02-08
is replaced by: Y102201
modified: 2017-09-21T13:24:20+03:00
alternative label: rytmimusiikki
definition: 1900-luvulla kehittyneet musiikkityylit, jotka jäävät taide- ja perinnemusiikin ulkopuolelle. Termiä käytetään myös ilmaisemaan musiikkia, jonka tarkempaa tyyliä tai lajia ei pystytä määrittelemään.
in scheme: MUSA/CILLA - Musiikin asiasanasto
narrower: elektroninen populaarimusiikki
narrower: iskelmät
narrower: maailmanmusiikki
narrower: akustinen populaarimusiikki
narrower: latinalaisamerikkalainen populaarimusiikki
narrower: gospelmusiikki
narrower: rillumareimusiikki
narrower: popmusiikki
narrower: rai
narrower: viihdemusiikki
narrower: country
narrower: zydeco
narrower: zouk
narrower: rhythm and blues
narrower: skiffle
narrower: haitarijazz
narrower: laika
narrower: rebetika
note: Ensimmäisessä merkityksessään termiä käytetään lähinnä kirjallisuuden indeksoinnissa, toisessa merkityksessään äänitteiden ja nuottijulkaisuiden indeksoinnissa. Termiä ei sen yleisyyden takia pidä käyttää systemaattisesti ilmaisemaan, että julkaisu sisältää populaarimusiikkia.
preferred label: populärmusik @sv
related: perinnemusiikki
related: afro
related: afroamerikkalainen musiikki
related: populaarikulttuuri
scope note: deprecated on 2018.10.24

muusikot
type: Concept
created: 1996-02-09
is replaced by: Y97581
modified: 2017-09-21T13:39:51+03:00
alternative label: instrumentalistit
alternative label: leikarit
alternative label: soittajat
alternative label: musiker @sv
definition: Musiikkia luova ja esittävä ihminen. Käsitteen piiriin kuuluvat myös säveltäjät ja kapellimestarit.
in scheme: MUSA/CILLA - Musiikin asiasanasto
narrower: kapellimestarit
narrower: laulajat
narrower: solistit
narrower: laulaja-lauluntekijät
narrower: sämplääjät
narrower: tanssimuusikot
narrower: MC:t
narrower: DJ:t
narrower: harrastajamuusikot
narrower: katusoittajat
narrower: kansansoittajat
narrower: kanttorit
narrower: kirkkomuusikot
narrower: virtuoosit
narrower: minnelaulajat
narrower: minstrelit
narrower: säveltäjät
narrower: trubaduurit
narrower: truveerit
note: Musiikin asiasanoituksessa ei käytetä muusikoista YSA:n ohjeen mukaisia ammattinimekkeitä (esimerkiksi pianisti, trumpetisti). Vastaavat termit muodostetaan käyttäen hyväksi termiä muusikot, esimerkiksi muusikot : piano, muusikot : trumpetti. Ratkaisu johtuu siitä, että esikytkettyinä termejä tarvittaisiin yksi jokaista mahdollista soitinta varten, eikä kieliopillisista syistä kuitenkaan pystyttäisi ilmaisemaan esikytkettynä kuin osa tarpeellisista termeistä. Sellainen muoto kuin "cimbalomin soittaja" ei olisi olennaisesti parempi kuin muusikot : cimbalom.
preferred label: lekare @sv
related: esittäjät
related: laulajat
related: minstrelit
scope note: deprecated on 2018.10.24

näyttämömusiikki
type: Concept
created: 1996-02-07
is replaced by: Y100999
modified: 2017-09-04T13:29:18+03:00
broader: musiikki
definition: Yleisnimitys sekä näyttämötaideteoksiin sävelletylle musiikille että varsinaisille näyttämömusiikkiteoksille.
in scheme: MUSA/CILLA - Musiikin asiasanasto
narrower: intermediot
narrower: musikaalit
narrower: oopperat
narrower: operetit
narrower: tonadillat
narrower: musiikkinäytelmät
narrower: ooppera
narrower: balettimusiikki
narrower: näytelmämusiikki
narrower: melodraamat
preferred label: scenmusik @sv
related: musiikkiteatteri
related: kabareet
related: revyyt
related: showt
related: varieteet
related: elokuvamusiikki
related: laulumusiikki
related: libretot
related: vaudeville
related: Peking-ooppera
related: näytelmät
related: pelimusiikki
related: libretistit
scope note: deprecated on 2018.10.24

puhallinsoittimet
type: Concept
created: 1996-02-08
is replaced by: Y101689
modified: 2017-09-21T13:39:50+03:00
alternative label: puhaltimet (soittimet)
broader: soittimet
definition: Puhallinsoitinten ryhmään kuuluvat soittimet, joiden ääni syntyy ilmapatsaan värähdellessä joko soittajan tai palkeiden puhaltaessa soittimeen.
in scheme: MUSA/CILLA - Musiikin asiasanasto
narrower: alppitorvi
narrower: pasuuna
narrower: saksofoni
narrower: klarinetti
narrower: trumpetti
narrower: kornetti
narrower: huilu
narrower: tuuba
narrower: käyrätorvi
narrower: oboe
narrower: englannintorvi
narrower: lehdykkäsoittimet
narrower: puupuhaltimet
narrower: fagotti
narrower: flyygelitorvi
narrower: vaskipuhaltimet
narrower: nokkahuilu
narrower: huilusoittimet
narrower: didgerido
narrower: huuliharppu
narrower: luonnontorvet
narrower: melodika
narrower: panhuilu
narrower: signaalitorvi
narrower: säkkipilli
preferred label: blåsinstrument @sv
scope note: deprecated on 2018.10.24

popmusiikki
type: Concept
created: 1996-02-07
is replaced by: Y98194
modified: 2017-09-21T13:39:50+03:00
broader: populaarimusiikki
broader: afroamerikkalainen musiikki
definition: Afroamerikkalaiseen populaarimusiikkiin pohjautuvat populaarimusiikin tyylilajit aina 1950-luvulta lähtien. Popmusiikkiin kuuluu suuri joukko populaarimusiikin ilmiöitä, jotka eivät ole bluesia, jazzia, viihdemusiikkia tai laulelmia.
in scheme: MUSA/CILLA - Musiikin asiasanasto
narrower: dance
narrower: hip hop
narrower: soca
narrower: rock
narrower: diskomusiikki
narrower: house
narrower: soul
narrower: tekno
narrower: doo wop
narrower: folkmusiikki
narrower: funk
narrower: r&b
narrower: neo-soul
narrower: reggaeton
narrower: rap
narrower: rautalankamusiikki
narrower: reggae
narrower: ska
narrower: surfmusiikki
narrower: tex mex -musiikki
narrower: elektroninen tanssimusiikki
note: Koska termillä on sanastossa myös arkikielestä poikkeava merkitys, sitä käytetään aina täsmentävien termien kanssa, esimeriksi popmusiikki : kokoelmat : Yhdysvallat, popmusiikki : soitinmusiikki : kokoelmat.
preferred label: popmusik @sv
related: elektroninen populaarimusiikki
related: maailmanmusiikki
related: afro
related: country
scope note: deprecated on 2018.10.24

latinalaisamerikkalainen populaarimusiikki
type: Concept
created: 1996-02-08
is replaced by: Y103030
modified: 2017-09-21T13:39:43+03:00
broader: populaarimusiikki
broader: latinalaisamerikkalainen musiikki
definition: Latinalaisessa Amerikassa (Meksiko, Keski- ja Etelä-Amerikka sekä Karibian saaret) syntyneet ja esiintyvät populaarit musiikkityylit.
in scheme: MUSA/CILLA - Musiikin asiasanasto
narrower: sambat
narrower: bossa nova
narrower: salsa
narrower: tangot (sävellykset)
narrower: mento
narrower: merengue
narrower: soca
narrower: cha-cha-chat
narrower: conga (tanssit)
narrower: cumbia
narrower: timba
narrower: choro
narrower: rumbat
narrower: tango (tanssit)
narrower: rancheramusiikki
narrower: mariachimusiikki
narrower: son-musiikki
narrower: vallenata
narrower: calypso
note: Termiä suositellaan käytettäväksi lähinnä kokoelmissa, jotka sisältävät useita eri tyylejä edustavia sävellyksiä ja esityksiä. Muuten pyritään aina ilmaisemaan tyyli mahdollisimman tarkasti.
preferred label: latinamerikansk populärmusik @sv
related: maailmanmusiikki
related: laulumusiikki
related: tangot (sävellykset)
related: latinalaistanssit
related: reggaeton
related: lambadat (sävellykset)
related: pasodoblet (sävellykset)
scope note: deprecated on 2018.10.24

laulumusiikki
type: Concept
created: 1996-02-08
is replaced by: Y96793
modified: 2017-09-21T13:24:20+03:00
alternative label: vokaalimusiikki
definition: Musiikki, jossa on keskeisessä tai ainakin merkittävässä roolissa lauluääni tai lauluäänet. Käsitteen piiriin ei yleensä lueta näyttämömusiikkiteoksia kuten oopperoita ja operetteja.
in scheme: MUSA/CILLA - Musiikin asiasanasto
narrower: tertsetot
narrower: yhteislaulu
narrower: oratoriot
narrower: messut
narrower: laulut
narrower: aariat
narrower: a cappella -musiikki
narrower: duetot
narrower: latinalainen kirkkolaulu
narrower: motetit
narrower: yksinlaulu
narrower: kantaatit
narrower: ortodoksinen kirkkomusiikki
narrower: passiot
narrower: latinalaisamerikkalainen musiikki
narrower: kuoromusiikki
narrower: lamentaatiot
narrower: orkesterilaulut
narrower: litaniat
note: Termiä käytetään lähinnä taidemusiikista ja joissakin tapauksissa perinnemusiikista, lähinnä silloin kun kyseessä ei ole eurooppalainen perinne. Termiä suositellaan käytettäväksi sen yleisyyden takia lähinnä sekasisältöisistä kokoelmista sekä musiikkikirjallisuuden indeksoinnissa.
preferred label: vokalmusik @sv
related: tertsetot
related: näyttämömusiikki
related: latinalaisamerikkalainen populaarimusiikki
related: a cappella -musiikki
related: duetot
related: kantaatit
related: passiot
related: orkesterilaulut
related: canzonettat
scope note: deprecated on 2018.10.24

rock
type: Concept
created: 1996-02-08
is replaced by: Y98616
modified: 2017-09-21T13:39:53+03:00
broader: popmusiikki
definition: Yhdysvalloissa rock and rollista ja mustan musiikin muodoista kehittynyt popmusiikin laji, joka on levinnyt kaikkialle maailmassa erääksi suosituimmista populaarimusiikin tyyliryhmistä. Rock-musiikille on ominaista suhteellisen nopea tempo, toisen ja neljännen tahdinosan korostaminen (back beat) ja yksinkertainen, sähköinen esityskokoonpano (sähkökitarat, sähköbasso, rummut). 1900-luvun toisella puoliskolla syntyi suuri määrä rockin muunnelmia, joiden määritelmällinen erottaminen toisistaan on usein erittäin vaikeaa.
in scheme: MUSA/CILLA - Musiikin asiasanasto
narrower: afro-rock
narrower: heavy rock
narrower: garage rock
narrower: gospelrock
narrower: psychobilly
narrower: grunge
narrower: hard rock
narrower: punk rock
narrower: country rock
narrower: folk rock
narrower: indie rock
narrower: Latin rock
narrower: progressiivinen rock
narrower: psykedeelinen rock
narrower: rock and roll
narrower: rockabilly
narrower: teknorock
narrower: uusi aalto
related: fuusiomusiikki
related: zouk
related: diskomusiikki
related: soul
related: tekno
related: folkmusiikki
related: rap
related: rautalankamusiikki
related: reggae
related: ska
related: surfmusiikki
scope note: deprecated on 2018.10.24

tanssimusiikki
type: Concept
created: 1996-02-08
is replaced by: Y99308
modified: 2017-09-21T13:39:58+03:00
alternative label: vanha tanssimusiikki
alternative label: gammal dansmusik @sv
broader: musiikki
definition: Musiikinlajit, joita käytetään yleensä tanssimisen taustalla.
in scheme: MUSA/CILLA - Musiikin asiasanasto
narrower: balettimusiikki
note: Termillä ei tarkoiteta 1980- ja 1990-lukujen diskomusiikkiin rinnastuvaa "dance"-ilmiötä, josta käytetään diskomusiikin lisäksi tai sijasta termejä hip hop, house jne.
preferred label: dansmusik @sv
related: beguinet (sävellykset)
related: tangot (sävellykset)
related: viihdemusiikki
related: tanssit
related: bolerot (sävellykset)
related: cancanit (sävellykset)
related: foxtrotit (sävellykset)
related: kontratanssit (sävellykset)
related: twistit (sävellykset)
related: moriskat (sävellykset)
related: fandangot (sävellykset)
related: passepied't (sävellykset)
related: pavanat (sävellykset)
related: katrillit (sävellykset)
related: valssit (sävellykset)
related: gavotit (sävellykset)
related: choro
related: jenkat (sävellykset)
related: csárdásit (sävellykset)
related: humpat (sävellykset)
related: masurkat (sävellykset)
related: menuetit (sävellykset)
related: polkat (sävellykset)
related: poloneesit (sävellykset)
related: hambot (sävellykset)
related: polskat (sävellykset)
related: tarantellat (sävellykset)
related: lambadat (sävellykset)
scope note: deprecated on 2018.10.24

tanssit
type: Concept
created: 1996-02-08
is replaced by: Y99309
modified: 2017-09-04T13:29:24+03:00
definition: Liikunnallinen ilmaisumuoto, joka voi olla taiteellista esiintymistä tai viihdyttämistä ja omaehtoista liikuntaa.
definition: Registret upptar de namnen på de vanligaste danserna, alla andra danser kan också användas som ämnesord. @sv
in scheme: MUSA/CILLA - Musiikin asiasanasto
narrower: polkka (tanssit)
narrower: jive (tanssit)
narrower: masurkka (tanssit)
narrower: humppa (tanssit)
narrower: jenka (tanssit)
narrower: latinalaistanssit
narrower: country-dancet (tanssit)
narrower: csárdás (tanssit)
narrower: cakewalk (tanssit)
narrower: valssit (sävellykset)
narrower: polska (tanssit)
narrower: beguine (tanssit)
narrower: bolero (tanssit)
narrower: cancan (tanssit)
narrower: fandango (tanssit)
narrower: gavotti (tanssit)
narrower: kontratanssit (tanssit)
narrower: lambada (tanssit)
narrower: moriska (tanssit)
narrower: passepied (tanssit)
narrower: pavana (tanssit)
narrower: tarantella (tanssit)
narrower: twist (tanssit)
narrower: foxtrot (tanssit)
narrower: valssi (tanssit)
narrower: tango (tanssit)
narrower: kansantanssit
narrower: poloneesi (tanssit)
narrower: charleston (tanssit)
narrower: seuratanssit
narrower: menuetti (tanssit)
preferred label: danser @sv
related: tanssimusiikki
scope note: deprecated on 2018.10.24

laulut
type: Concept
created: 1996-02-08
is replaced by: Y101582
modified: 2017-09-21T13:24:20+03:00
broader: laulumusiikki
definition: Ihmisäänelle sävelletty tai sillä esitettävä sävellys.
in scheme: MUSA/CILLA - Musiikin asiasanasto
narrower: kotiseutulaulut
narrower: yksinlaulut
narrower: työlaulut
narrower: joululaulut
narrower: merimieslaulut
narrower: juomalaulut
narrower: iskelmät
narrower: poliittiset laulut
narrower: hengelliset laulut
narrower: kansanlaulut
narrower: laulelmat
narrower: lastenlaulut
narrower: maakuntalaulut
narrower: madrigaalit
narrower: chansonit
narrower: kupletit
narrower: kehtolaulut
narrower: balladit
narrower: arkkiveisut
narrower: fadot
narrower: onnittelulaulut
narrower: kansallislaulut
narrower: cowboylaulut
narrower: kisällilaulut
narrower: pilkkalaulut
narrower: protestilaulut
narrower: työväenlaulut
narrower: rebetika
narrower: viittomalaulut
narrower: vokaliisit (laulut)
note: Termiä voi käyttää kaikkien musiikinlajien yhteydessä, mutta yleisyyden takia aina toiseen termiin yhdistettynä, esimerkiksi laulut : perinnemusiikki : marit, vanha musiikki : keskiaika : laulut : Provence.
preferred label: sånger @sv
related: vokaliisit (laulut)
scope note: deprecated on 2018.10.24

sävellykset
type: Concept
created: 1996-02-08
is replaced by: Y108687
modified: 2017-09-21T13:24:22+03:00
alternative label: kappaleet
alternative label: musiikkiteokset
alternative label: sävellysteokset
alternative label: sävelteokset
alternative label: tonsättningar @sv
broader: soolot
definition: Luovan musiikillisen työn tuloksen nimitys. Samasta asiasta käytetään arkikielessä myös nimityksiä "teos", "sävelteos" ja "sävellysteos".
definition: Registret upptar de vanligaste kompositionstyperna inom konstmusiken; alla andra kan också användas som ämnesord. De upptagna kompositionstyperna finns sammanförda i den systematiska delen. @sv
in scheme: MUSA/CILLA - Musiikin asiasanasto
narrower: sonatiinit
narrower: airit
narrower: tertsetot
narrower: versetit
narrower: bagatellit
narrower: sikermät
narrower: beguinet (sävellykset)
narrower: etydit
narrower: parafraasit
narrower: duetot
narrower: adagiot
narrower: arabeskit (sävellykset)
narrower: ariosot
narrower: tangot (sävellykset)
narrower: berceuset
narrower: bolerot (sävellykset)
narrower: burleskit (sävellykset)
narrower: duot (sävellykset)
narrower: triot (sävellykset)
narrower: cancanit (sävellykset)
narrower: canzonat
narrower: capricciot
narrower: chaconnet
narrower: foxtrotit (sävellykset)
narrower: fanfaarit
narrower: kaanonit (sävellykset)
narrower: postludit
narrower: kontratanssit (sävellykset)
narrower: sinfoniettat
narrower: twistit (sävellykset)
narrower: moriskat (sävellykset)
narrower: fandangot (sävellykset)
narrower: passepied't (sävellykset)
narrower: pavanat (sävellykset)
narrower: kamarikonsertot
narrower: nocturnet
narrower: nonetot
narrower: romanssit
narrower: humoreskit
narrower: valssit (sävellykset)
narrower: oktetot
narrower: gavotit (sävellykset)
narrower: barkarolit
narrower: ritornellot
narrower: canzonettat
narrower: jenkat (sävellykset)
narrower: csárdásit (sävellykset)
narrower: humpat (sävellykset)
narrower: masurkat (sävellykset)
narrower: menuetit (sävellykset)
narrower: polkat (sävellykset)
narrower: poloneesit (sävellykset)
narrower: hambot (sävellykset)
narrower: polskat (sävellykset)
narrower: tarantellat (sävellykset)
narrower: lambadat (sävellykset)
narrower: pasodoblet (sävellykset)
narrower: kvartetot
narrower: kvintetot
narrower: sekstetot
narrower: septetot
narrower: improvisaatiot (sävellykset)
narrower: inventiot
narrower: sarjat (sävellykset)
narrower: passacagliat
narrower: fantasiat (sävellykset)
narrower: ricercaret

MUSA/CILLA - Musiikin asiasanasto
type: ConceptScheme
creator: Luumu working group @en
creator: National Library of Finland @en
creator: Kansalliskirjasto
creator: Luumu-työryhmä
creator: Luumu-arbetsgruppen @sv
creator: Nationalbiblioteket i Finland @sv
description: Musiikin asiasanasto (MUSA) on yksikielinen musiikin indeksointiin tarkoitettu erikoissanasto, joka noudattaa Yleisen suomalaisen asiasanaston (YSA) periaatteita ja rakennetta. Musiikin asiasanasto on tarkoitettu käytettäväksi musiikkia käsittelevien kirjojen ja artikkelien sekä kaikkien musiikkitallenteiden (nuottijulkaisut, äänitteet jne.) indeksointiin ja tiedonhakuun. Sanasto ohjaa tiedontallentajia ja -hakijoita käyttämään yhteistä kieltä. Musiikin asiasanaston laadinnassa on noudatettu Suomenkielisen tesauruksen laatimis- ja ylläpito-ohjeita (SFS 5471). Ruotsinkieliset CILLA-termit löydät vaihtamalla sisällön kielen ruotsiksi.
description: Specialtesaurus för musik (CILLA) är ett specialregister för indexering av musikmaterial. Registret är uppgjort efter samma principer och har samma tesaurusstruktur som Yleinen suomalainen asiasanasto (YSA) och Allmän tesaurus på svenska (Allärs). Specialtesaurus för musik är avsedd för indexering och sökning av böcker och artiklar om musik, musikalier, inspelningar etc. i bibliotek, kartotek och bibliografier av olika slag. Registret hjälper inmatare av information och informationssökare att använda ett gemensamt språk. Specialtesaurus för musik är uppgjord enligt standarden Suomenkielisen tesauruksen laatimis- ja ylläpito-ohjeita (SFS 5471). @sv
publisher: National Library of Finland @en
publisher: Kansalliskirjasto
publisher: Nationalbiblioteket i Finland @sv
title: MUSA/CILLA - Finnish Music thesaurus @en
title: CILLA/MUSA - Specialtesaurus för musik @sv
language: fin
language: swe
license: http://creativecommons.org/publicdomain/zero/1.0/
modified: 2021-09-28T14:46:24+00:00
relation: allars
relation: ysa
subject: p21510