medialukutaito
type: Concept
source: Tietotermit
broader: lukutaito
definition: form of literacy that is related to information that is presented in different media @en
definition: eri medioissa esitetyn tiedon lukutaito
definition: färdighet att läsa information som presenteras i olika medier @sv
in scheme: Tietotermit
note: Media literacy emphasises the significance of evaluating the utility and validity of information. @en
note: Medialukutaidossa korostuu tiedon hyödyllisyyden ja paikkansapitävyyden arvioimisen merkitys.
note: Centralt för medieläskunnighet är att kunna bedöma informationens användbarhet och korrekthet. @sv
preferred label: media literacy @en
preferred label: medieläskunnighet @sv

tunnus (koodistossa)
type: Concept
source: Tietotermit
broader: koodi (koodistossa)
definition: code (in a code set) that individualises the target that it is referring to @en
definition: koodi (koodistossa), joka yksilöi viittaamansa kohteen
definition: kod (i en koduppsättning) som identifierar det objekt som koden refererar till @sv
hidden label: identifier @en
hidden label: tunnus
in scheme: Tietotermit
note: Some identifiers are permanent (Persistent Identifier, PID). @en
note: Osa tunnuksista on pysyviä (pysyvä tunnus, PID, Persistent Identifier).
note: En del beteckningar är bestående (PID, Persistent Identifier). @sv
preferred label: identifier (in a code set) @en
preferred label: beteckning (i en koduppsättning) @sv

suojaamaton tieto
type: Concept
source: Tietotermit
alternative label: unprotected data @en
broader: tieto
definition: information whose unauthorised access and use has not been prohibited @en
definition: tieto, johon luvattomasti pääsyä ja jonka luvatonta käyttöä ei ole estetty
definition: uppgift, vars olovliga användning inte har förhindrats @sv
in scheme: Tietotermit
preferred label: unprotected information @en
preferred label: oskyddad uppgift @sv

tekijänoikeus
type: Concept
source: Tietotermit
broader: immateriaalioikeus
definition: intellectual property right that is created primarily for the author of a written or artistic work @en
definition: ensisijaisesti tekijälle syntyvä immateriaalioikeus, joka koskee kirjallista tai taiteellista teosta
definition: immateriell rätt som i första hand uppstår till den som har skapat ett litterärt eller konstnärligt verk @sv
in scheme: Tietotermit
note: A copyright is created only for the personal form of expression of a work. The exploitation of a work's ideas, information and theories cannot be limited on the basis of its copyright. @en
note: Tekijänoikeus koskee vain teoksen persoonallista ilmaisumuotoa. Teoksen sisältämien ideoiden, tietojen ja teorioiden hyödyntämistä ei voi rajoittaa tekijänoikeuden nojalla.
note: Upphovsrätten gäller endast för den personliga uttrycksformen av ett verk. Utnyttjandet av idéer, information och teorier i ett verk kan inte begränsas med stöd av upphovsrätt. @sv
preferred label: copyright @en
preferred label: upphovsrätt @sv

tiedon määräaikaissäilytys
type: Concept
source: Tietotermit
broader: tiedon säilytys
definition: storage of data for a specific term @en
definition: tiedon säilytys tietyn ennalta määritellyn ajan
definition: förvaring av information i förhandsbestämd tid @sv
in scheme: Tietotermit
note: Fixed-term storage can be short or long term in nature, and the storage period can last for 100 years or more. @en
note: Määräaikaissäilytys voi olla lyhyt- tai pitkäaikaista, ja määritelty säilytysaika voi olla jopa 100 vuotta tai enemmän.
note: Tidsbunden förvaring kan utföras på kort eller lång sikt, och den förhandsbestämda förvaringstiden kan vara upp till 100 år eller mer. @sv
preferred label: fixed-term data storage @en
preferred label: tidsbunden förvaring av information @sv

lähderekisteri
type: Concept
source: Tietotermit
broader: rekisteri
definition: register whose the information on the target has been copied to another information resource @en
definition: rekisteri, josta kohteeseen liittyvä tieto on kopioitu toiseen tietovarantoon
definition: register som information om ett objekt har kopierats från till ett annat datalager @sv
in scheme: Tietotermit
note: For example, the population information system is the source register for personal identity codes. @en
note: Esimerkiksi Väestötietojärjestelmä on henkilötunnusten lähderekisteri.
note: Exempel: Befolkningsdataregistret är ett källregister över personbeteckningar. @sv
preferred label: source register @en
preferred label: källregister @sv

kyvykkyys
type: Concept
source: JHS 179 Kokonaisarkkitehtuurin suunnittelu ja kehittäminen, 2017-02-07
alternative label: färdighet @sv
alternative label: kapacitet @sv
definition: ability to act in the appropriate manner in a certain field and utilise one's skills and resources to achieve the desired objectives @en
definition: kyky toimia tarkoituksenmukaisella tavalla tietyllä osa-alueella, ja hyödyntää osaamistaan sekä resurssejaan, jotta tavoitteet saavutetaan
definition: färdighet att agera på ett ändamålsenligt sätt inom ett visst delområde och utnyttja sin kompetens och sina resurser för att uppnå mål @sv
in scheme: Tietotermit
note: To be able to fully realise its capabilities, an organisation should usually combine the following features in different ways: its operating models and processes, staff and skills, as well as data and systems. @en
note: Organisaatioiden kyvykkyyksien toteuttamiseen tarvitaan yleensä yhdistelmiä kolmesta osakokonaisuudesta, joita ovat toimintamallit ja prosessit, henkilöstö ja osaaminen sekä tiedot ja järjestelmät.
note: För att realisera organisationers förmågor behövs i allmänhet kombinationer av tre delområden, som utgörs av verksamhetsmodeller och processer, personal och kompetens samt information och system. @sv
preferred label: capability @en
preferred label: förmåga @sv
top concept of: Tietotermit

hiljainen tieto
type: Concept
source: Tietotermit
alternative label: implicit kunskap @sv
alternative label: underförstådd kunskap @sv
broader: tieto
definition: knowledge that a person accumulates through experience @en
definition: kokemuksen kautta henkilölle kertynyt tieto
definition: kunskap som samlats in via erfarenhet @sv
in scheme: Tietotermit
note: Tacit knowledge is subjective and intuitive in nature. It is often hard or practically impossible to wholly change tacit knowledge into explicit knowledge. @en
note: Hiljainen tieto on luonteeltaan subjektiivista ja intuitiivista. Hiljaista tietoa on usein vaikeaa tai jopa mahdotonta muuttaa kokonaan eksplisiittiseksi tiedoksi.
note: Tyst kunskap är subjektiv och intuitiv. Det är ofta svårt och i vissa fall omöjligt att omvandla tyst kunskap till explicit kunskap. @sv
preferred label: tacit knowledge @en
preferred label: tyst kunskap @sv

kontrolloitu sanasto
type: Concept
source: Tietotermit
broader: sanasto
definition: glossary that has been created for a specific purpose and whose creation and maintenance are subject to agreed-upon practices and discretion @en
definition: tiettyä käyttötarkoitusta varten laadittu sanasto, jonka laadinnassa ja päivittämisessä on noudatettu sovittuja käytäntöjä ja harkintaa
definition: ordlista som har skapats för ett visst syfte efter överenskommen praxis och övervägande @sv
in scheme: Tietotermit
note: In addition to the terms that are to be used, a controlled vocabulary may contain other terms (such as synonyms or terms describing the same subject) that are not to be used as-is but help guide users into using a specifically selected term. In index term lists, these types of terms that guide users to the terms that are to be used are called non-descriptors. Controlled vocabularies can be used to unify the descriptions of materials, for example. @en
note: Käytettävien termien lisäksi kontrolloitu sanasto saattaa sisältää muita termejä (esim. synonyymejä tai samaa aihepiiriä kuvaavia termejä), joita ei itsessään käytetä, vaan ne ohjaavat käyttämään sen sijaan tiettyä valittua termiä. Asiasanastoissa näitä käytettäviin termeihin ohjaavia termejä kutsutaan ohjaustermeiksi. Kontrolloitujen sanastojen avulla pyritään yhdenmukaistamaan esimerkiksi aineistojen kuvailua.
note: Utöver termer som ska användas kan en kontrollerad ordlista även innehålla andra termer (t.ex. synonymer eller termer som beskriver samma ämnesområde) som inte används direkt, utan som hänvisar till att använda de valda termerna. I ämnesordsregister kallas dessa termer hänvisningsord. Kontrollerade ordlistor används till exempel för att enhetligt beskriva olika material. @sv
preferred label: controlled vocabulary @en
preferred label: kontrollerad ordlista @sv

avoin sanasto
type: Concept
source: Tietotermit
alternative label: vapaa sanasto
alternative label: fri ordlista @sv
broader: sanasto
definition: glossary that is based on some or all free word choices that have been made in a specific environment @en
definition: sanasto, joka perustuu joihinkin tai kaikkiin tietyssä ympäristössä tehtyihin vapaisiin sanavalintoihin
definition: ordlista som baserar sig på vissa eller alla fria ordval i ett visst sammanhang @sv
in scheme: Tietotermit
note: Uncontrolled vocabularies include glossaries that explain the terms that appear in a specific text and open index term lists, i.e. folksonomies. @en
note: Avoimia sanastoja ovat esimerkiksi tietyssä tekstissä esiintyviä termejä selittävät sanastot ja avoimet asiasanastot eli folksonomiat.
note: Öppna ordlistor är till exempel ordlistor över termer som förekommer i en viss text och öppna ämnesordsregister, dvs. folksonomier. @sv
preferred label: uncontrolled vocabulary @en
preferred label: öppen ordlista @sv

suojaustasoluokiteltu tieto
type: Concept
source: Tietotermit
broader: salassa pidettävä tieto
definition: confidential information whose unauthorised disclosure or use has been evaluated and classified according to national safety classification standards on the harm that it could cause to any public or private interest @en
definition: salassa pidettävä tieto, jonka luvattomasta paljastumisesta tai luvattomasta käytöstä aiheutuva haitta yleiselle tai yksityiselle edulle on arvioitu ja merkitty kansallisen suojaustasoluokittelun mukaisesti
definition: sekretessbelagd uppgift som har en klassificering enligt skyddsnivå enligt den skada som obehörigt avslöjande eller obehörig användning av uppgiften kan orsaka för allmänna och enskilda intressen @sv
in scheme: Tietotermit
note: "The following protection levels are used for the classification of information by protection level: Protection level I, if unauthorised disclosure or use could cause particularly grave damage to any public interest; protection level II, if unauthorised disclosure or use could cause significant damage to any public interest; protection level III, if unauthorised disclosure or use could cause damage to any public or private interest; protection level IV, if unauthorised disclosure or use could cause harm to any public or private interest." @en
note: "Suojaustasoluokittelussa käytetään seuraavia luokkia: Suojaustaso I, jos luvaton paljastuminen tai käyttö voi aiheuttaa erityisen suurta vahinkoa yleiselle edulle; suojaustaso II, jos luvaton paljastuminen tai käyttö voi aiheuttaa merkittävää vahinkoa yleiselle edulle; suojaustaso III, jos luvaton paljastuminen tai käyttö voi aiheuttaa vahinkoa yleiselle tai yksityiselle edulle; suojaustaso IV, jos luvaton paljastuminen tai käyttö voi aiheuttaa haittaa yleiselle edulle tai yksityiselle edulle."
note: "Vid klassificering enligt skyddsnivå används följande klasser: Skyddsnivå I, om obehörigt avslöjande eller obehörig användning kan orsaka särskilt stor skada för allmänna intressen; skyddsnivå II, om obehörigt avslöjande eller obehörig användning kan orsaka betydande skada för allmänna intressen; skyddsnivå III, om obehörigt avslöjande eller obehörig användning kan orsaka skada för allmänna eller enskilda intressen; skyddsnivå IV, om obehörigt avslöjande eller obehörig användning kan orsaka olägenheter för allmänna eller enskilda intressen." @sv
preferred label: information classified by protection level @en
preferred label: uppgift klassificerad enligt skyddsnivå @sv

tekninen yhteentoimivuus
type: Concept
source: Tietotermit
alternative label: teknisen tason yhteentoimivuus
alternative label: interoperabilitet på teknisk nivå @sv
broader: yhteentoimivuus
definition: form of interoperability that enables the transfer of data via information technology @en
definition: yhteentoimivuus, joka mahdollistaa tietotekniikan avulla tehtävät tiedonsiirrot
definition: interoperabilitet som gör det möjligt att överföra information med hjälp av informationsteknik @sv
in scheme: Tietotermit
note: Technical interoperability is connected to the technical part of information systems, i.e. hardware and software. However, the benefits of technical interoperability are limited if there is no semantic, organisational or legal interoperability between the information systems. @en
note: Tekninen yhteentoimivuus liittyy tekniseen, laitteista ja ohjelmista koostuvaan osaan tietojärjestelmiä. Teknisellä yhteentoimivuudella saavutettavat edut ovat rajallisia, jos tietojärjestelmien välillä ei ole semanttista, organisatorista tai oikeudellista yhteentoimivuutta.
note: Teknisk interoperabilitet anknyter till den tekniska delen av informationssystem som utgörs av enheter och program. Fördelarna som uppnås med teknisk interoperabilitet är begränsade utan semantisk, organisatorisk och rättslig interoperabilitet mellan ifrågavarande informationssystem. @sv
preferred label: technical interoperability @en
preferred label: teknisk interoperabilitet @sv

diaari
type: Concept
source: Tietotermit
broader: asiarekisteri
definition: case register where every case is provided with its own number or other identifier and whose purpose is to enable good information management practices and openness in the activities of public authorities @en
definition: asiarekisteri, jossa jokaisella asialla on oma numero tai muu tunnus ja jonka tarkoituksena on toteuttaa viranomaisen hyvää tiedonhallintatapaa ja julkisuutta
definition: ärenderegister, där varje ärende har ett eget nummer eller någon annan beteckning och vars syfte är att genomföra myndigheters praxis för god informationshantering och offentlighet @sv
in scheme: Tietotermit
preferred label: journal @en
preferred label: diarium @sv

tiedon pysyväissäilytys
type: Concept
source: Tietotermit
broader: tiedon säilytys
definition: storage of data without any time limits @en
definition: tiedon säilytys ilman aikarajaa
definition: förvaring av information utan tidsgräns @sv
in scheme: Tietotermit
note: The permanent storage of data can usually last for hundreds of years, even forever @en
note: Pysyväissäilytyksessä tietoja säilytetään tavallisesti satoja vuosia, jopa ikuisesti.
note: Information som förvaras permanent förvaras vanligtvis i hundratals år, i vissa fall för evigt. @sv
preferred label: permanent data storage @en
preferred label: permanent förvaring av information @sv

digitaalinen lukutaito
type: Concept
source: Tietotermit
broader: lukutaito
definition: form of literacy that is related to information that is presented with the help of digital tools @en
definition: digitaalisten välineiden avulla esitetyn tiedon lukutaito
definition: färdighet att läsa information som presenteras med digitala verktyg @sv
in scheme: Tietotermit
preferred label: digital literacy @en
preferred label: digital läskunnighet @sv

erityisrekisteri
type: Concept
source: Tietotermit
broader: rekisteri
definition: register that is maintained on the targets of a specific function and that contains the necessary information for the preparation, management and monitoring of any related matters @en
definition: tietyn toiminnon kohteista ylläpidettävä rekisteri, johon merkitään asioiden valmistelussa, käsittelyssä ja seurannassa tarvittavat tiedot
definition: register som omfattar objekt som tillhör en särskild funktion och information som behövs för beredning, behandling och uppföljning av ärenden @sv
in scheme: Tietotermit
note: A special register can contain information on e.g. people, companies or buildings. @en
note: Erityisrekisteri voi sisältää tietoa esimerkiksi henkilöistä, yrityksistä tai rakennuksista.
note: Ett specialregister kan innehålla information om till exempel personer, företag eller byggnader. @sv
preferred label: special register @en
preferred label: specialregister @sv

master data
type: Concept
source: Tietotermit
alternative label: perustieto
alternative label: huvuddata @sv
broader: tieto
definition: information describing a target that is related to an organisation's activities and that is required or utilised by several of the organisation's processes or functions @en
definition: organisaation toimintaan liittyvää kohdetta kuvaava tieto, jota useampi organisaation prosessi tai toiminto tarvitsee tai hyödyntää
definition: uppgifter som beskriver föremål i anslutning till en organisations verksamhet som flera av organisationens processer eller funktioner behöver eller använder @sv
in scheme: Tietotermit
note: The master data of an organisation can include information on e.g. the organisation's customers, suppliers, partners, products, services or offices. Master data is usually slow to change and needed in the long term. @en
note: Organisaation master dataa voivat olla esimerkiksi asiakkaita, toimittajia, yhteistyökumppaneita, tuotteita, palveluita tai toimipaikkoja koskevat tiedot. Tavallisesti master data on hitaasti muuttuvaa ja sen tarve on pitkäaikaista.
note: En organisations master data kan vara uppgifter om till exempel kunder, leverantörer, samarbetspartners, produkter, tjänster eller verksamhetsställen. Master data ändras vanligtvis långsamt och behövs under längre perioder. @sv

paikkatieto
type: Concept
source: Tietotekniikan termitalkoot, 2012-12-21
alternative label: geodata @en
alternative label: geographic data @en
alternative label: geographical information @en
alternative label: geografiska data @sv
definition: entity that contains the location data and descriptive information of a target @en
definition: kohteen sijaintitiedon ja kohteen ominaisuuksia kuvaavien tietojen muodostama kokonaisuus
definition: helhet som omfattar positionsinformation för ett objekt och uppgifter som beskriver objektets egenskaper @sv
in scheme: Tietotermit
note: Geographic information contains a reference to a specific place or geographical area. Geographic information can be used to describe the location or other features of a target, such as its shape. Geographic information is often used to describe natural or man-made targets, but it can also be used to describe any kind of activity or phenomenon whose location is known. @en
note: Paikkatieto sisältää viittauksen tiettyyn paikkaan tai maantieteelliseen alueeseen. Paikkatieto voi kuvata kohteen sijaintia ja muita ominaisuuksia, kuten muotoa. Paikkatieto kuvaa usein luonnon tai rakennetun ympäristön kohteita, mutta voi kuvata mitä tahansa toimintaa tai ilmiötä, jonka sijainti tunnetaan.
note: Geografisk information omfattar en referens till en viss plats eller ett visst geografiskt område. Geografisk information kan beskriva positionen och andra egenskaper, som formen, för ett objekt. Geografisk information beskriver ofta objekt i naturen eller i den byggda miljön, men kan beskriva allt som har en geografisk position. @sv
preferred label: geographic information @en
preferred label: geografisk information @sv
top concept of: Tietotermit

julkinen tieto
type: Concept
source: Tietotermit
broader: tieto
definition: information that is accessible to all @en
definition: tieto, johon kaikilla on pääsy
definition: information som alla har tillgång till @sv
in scheme: Tietotermit
note: All documents created by public authorities are public in nature unless otherwise stated by law. @en
note: Viranomaisten asiakirjat ovat julkisia, jollei laissa erikseen toisin säädetä.
note: Myndighetshandlingar är offentliga, om inte något annat föreskrivs i lag. @sv
preferred label: public information @en
preferred label: offentlig information @sv

lähioikeus
type: Concept
source: Tietotermit
alternative label: tekijänoikeuden lähioikeus
alternative label: upphovsrätten närstående rättighet @sv
broader: immateriaalioikeus
definition: intellectual property right that concerns the presentation of or financial investment connection to an intellectual work that does not result in a copyrightable work but whose protection is defined separately in connection with copyright legislation @en
definition: immateriaalioikeus, joka koskee sellaista henkisen työn esitystä tai henkiseen työhön liittyvää taloudellista panostusta, jonka tuloksena ei synny tekijänoikeuksilla suojattavaa teosta mutta jonka suojasta säädetään erikseen tekijänoikeuslakien yhteydessä
definition: immateriell rättighet som gäller en framställning av intellektuellt arbete eller en ekonomisk investering i samband med intellektuellt arbete som inte resulterar i ett verk som skyddas av upphovsrätt utan som skyddas enligt skilda bestämmelser i upphovsrättslagen @sv
in scheme: Tietotermit
note: Neighbouring rights are used to protect e.g. databases, lists, performances by performing artists, works by recording and visual recording producers as well as the rights of public broadcasting corporations to their broadcasting signals. A neighbouring right can be created for a private person or organisation. @en
note: Lähioikeuksilla suojataan mm. tietokantoja, luetteloita, esittävien taiteilijoiden suoritteita, äänite- ja kuvatallennetuottajien tekemää työtä sekä yleisradioyhtiöiden oikeutta lähetyssignaaliinsa. Lähioikeus voi syntyä yksityishenkilölle tai organisaatiolle.
note: Närstående rättigheter används för att skydda bl.a. Databaser, kataloger, konstnärliga framföranden, ljud- och bildproducenters arbeten samt rundradiobolags rätt till sin egen sändningssignal. Närstående rättigheter kan uppstå till privatpersoner eller organisationer. @sv
preferred label: neighbouring right @en
preferred label: närstående rättighet @sv

suojattu tieto
type: Concept
source: Tietotermit
alternative label: protected data @en
broader: tieto
definition: information whose unauthorised access and use has been prohibited with legislative, administrative, technical and physical means @en
definition: tieto, johon luvaton pääsy ja jonka luvaton käyttö on estetty juridisin, hallinnollisin, teknisin ja fyysisin toimenpitein
definition: uppgift, vars olovliga användning har förhindrats med juridiska, administrativa, tekniska och fysiska åtgärder @sv
in scheme: Tietotermit
preferred label: protected information @en
preferred label: skyddad uppgift @sv

yksilökäsite
type: Concept
source: Terminologian sanasto (TSK 36, 2006)
broader: käsite
definition: concept that corresponds to a single unique concept @en
definition: käsite, joka vastaa yhtä ainutkertaista tarkoitetta
definition: begrepp som kan knytas till en unik referent @sv
in scheme: Tietotermit
note: Individual concepts are referred to with proper names such as 'Jupiter' and 'the Baltic Sea'. Terminology work rarely focuses on individual concepts. @en
note: Yksilökäsitteisiin viitataan erisnimillä kuten 'Jupiter' ja 'Itämeri'. Sanastotyössä käsitellään yksilökäsitteitä melko harvoin.
note: Individualbegrepp benämns med egennamn. Exempel: 'Jupiter', 'Östersjön'. Individualbegrepp utreds sällan i terminologiarbete. @sv
preferred label: individual concept @en
preferred label: individualbegrepp @sv

oikeudellinen yhteentoimivuus
type: Concept
source: Tietotermit
alternative label: juridinen yhteentoimivuus
alternative label: interoperabilitet på rättslig nivå @sv
alternative label: juridisk interoperabilitet @sv
broader: yhteentoimivuus
definition: form of interoperability that enables data transfers between different legislative regions without violating any pertinent legislation @en
definition: yhteentoimivuus, joka mahdollistaa tiedonsiirrot eri lainsäädännöllisten alueiden välillä ilman, että asiaankuuluvaa lainsäädäntöä rikotaan
definition: interoperabilitet som gör det möjligt att överföra information mellan områden med olika lagstiftning utan att relevanta lagar bryts @sv
in scheme: Tietotermit
note: Legal interoperability is connected especially to the nature of the data that is contained in the information systems and how this data is collected, arranged and transferred. @en
note: Oikeudellinen yhteentoimivuus liittyy erityisesti tietojärjestelmissä käsiteltävien tietojen luonteeseen ja tapoihin, joilla tietoja kerätään, järjestetään ja siirretään.
note: Rättslig interoperabilitet anknyter speciellt till information i informationssystem samt till informationens art och hur man samlar in, ordnar och överför informationen. @sv
preferred label: legal interoperability @en
preferred label: rättslig interoperabilitet @sv

tilannekuva
type: Concept
source: Tietotermit / Tietojohtaminen (Laihonen et al., 2013)
definition: description of current conditions, the events that created the situation, the analysis and interpretation of the situation, as well as the operational readiness of different actors @en
definition: kuvaus vallitsevista olosuhteista, tilanteen synnyttäneistä tapahtumista, tilanteen analyysista ja tulkinnasta sekä eri toimijoiden toimintavalmiuksista
definition: beskrivning av rådande förhållanden, av händelser som lett till en situation, av en analys och en tolkning av situationen samt av beredskapen hos olika aktörer @sv
in scheme: Tietotermit
note: A snapshot contains information that has been gathered both inside and outside the organisation. In addition to the information that has been acquired from information systems, human knowledge and expertise are also required. @en
note: Tilannekuva koostuu sekä organisaation ulkopuolelta että organisaation sisältä kerätystä tiedosta. Siihen tarvitaan tietojärjestelmistä saatavan tiedon lisäksi myös inhimillistä tietoa ja osaamista.
note: En lägesbild omfattar information som samlats in både inom och utanför en organisation. Förutom information från informationssystem kräver en lägesbild även mänsklig kunskap och kompetens. @sv
preferred label: snapshot @en
preferred label: lägesbild @sv
top concept of: Tietotermit

massadata
type: Concept
source: Tietotermit
preferred label: big data
broader: data (koneluettava tieto)
definition: data (machine-readable information) that is diverse, large in size and grows rapidly @en
definition: data (koneluettava tieto), joka on monimuotoinen ja suuri kooltaan sekä kasvaa nopeasti
definition: mångsidig och riklig mängd data (maskinläsbara uppgifter) som snabbt ökar i storlek @sv
in scheme: Tietotermit
note: To be able to process big data, a device or application needs a great deal of storage capacity and processing power. @en
note: Laitteilta ja sovelluksilta vaaditaan huomattavaa tallennuskapasiteettia ja suorituskykyä, jotta ne pystyisivät käsittelemään massadataa.
note: Maskiner och program måste ha betydande lagringskapacitet och prestanda för att kunna bearbeta stordata. @sv
preferred label: stordata @sv

turvallisuusluokiteltu tieto
type: Concept
source: Tietotermit
alternative label: turvaluokiteltu tieto
alternative label: säkerhetsskyddsklassificerad uppgift @sv
broader: salassa pidettävä tieto
definition: confidential information whose unauthorised disclosure or use has been evaluated and classified according to international safety classification standards on the harm that it could cause to international relations, state security, national defence or any other similar public interest @en
definition: salassa pidettävä tieto, jonka luvattomasta paljastumisesta tai luvattomasta käytöstä aiheutuva haitta kansainvälisille suhteille, valtion turvallisuudelle, maanpuolustukselle tai muulle vastaavalle yleiselle edulle on arvioitu ja merkitty kansainvälisen turvallisuusluokittelun mukaisesti
definition: sekretessbelagd uppgift som har en anteckning om internationell säkerhetsklassificering enligt den skada som obehörigt avslöjande eller obehörig användning av uppgiften kan orsaka för internationella relationer, statens säkerhet, försvaret eller andra allmänna intressen. @sv
in scheme: Tietotermit
note: "The following classes are used for the classification of classified information: Class I TOP SECRET, if unauthorised disclosure or use could cause particularly grave damage to any public interest; class II SECRET, if unauthorised disclosure or use could cause significant damage to any public interest; class III CONFIDENTIAL, if unauthorised disclosure or use could cause damage to any public or private interest; class IV RESTRICTED, if unauthorised disclosure or use could cause harm to any public or private interest." @en
note: "Turvallisuusluokittelussa käytetään seuraavia luokkia: Turvallisuusluokka I ERITTÄIN SALAINEN, jos luvaton paljastuminen tai käyttö voi aiheuttaa erityisen suurta vahinkoa yleiselle edulle; turvallisuusluokka II SALAINEN, jos luvaton paljastuminen tai käyttö voi aiheuttaa merkittävää vahinkoa yleiselle edulle; turvallisuusluokka III LUOTTAMUKSELLINEN, jos luvaton paljastuminen tai käyttö voi aiheuttaa vahinkoa yleiselle tai yksityiselle edulle; turvallisuusluokka IV KÄYTTÖ RAJOITETTU, jos luvaton paljastuminen tai käyttö voi aiheuttaa haittaa yleiselle edulle tai yksityiselle edulle."
note: "Följande klasser används vid säkerhetsklassificering: Säkerhetsklass I YTTERST HEMLIG, om obehörigt avslöjande eller obehörig användning kan orsaka särskilt stor skada för allmänna intressen; säkerhetsklass II HEMLIG, om obehörigt avslöjande eller obehörig användning kan orsaka betydande skada för allmänna intressen; säkerhetsklass III KONFIDENTIELL, om obehörigt avslöjande eller obehörig användning kan orsaka skada för allmänna eller enskilda intressen; säkerhetsklass IV BEGRÄNSAD TILLGÅNG, om obehörigt avslöjande eller obehörig användning kan orsaka olägenheter för allmänna eller enskilda intressen." @sv
preferred label: classified information @en
preferred label: säkerhetsklassificerad uppgift @sv

tesaurus
type: Concept
source: Tietotermit
broader: asiasanasto
definition: index term list that indicates the relationships between the index terms that are presented in the list @en
definition: asiasanasto, jossa asiasanojen yhteydessä ilmaistaan niiden suhteet muihin asiasanoihin
definition: ämnesordsregister som omfattar förhållanden mellan ämnesord @sv
in scheme: Tietotermit
preferred label: thesaurus @en

operatiivinen tieto
type: Concept
source: Tietotermit
broader: liiketoimintatieto
definition: business information that helps utilise resources in an efficient manner @en
definition: liiketoimintatieto, joka ohjaa hyödyntämään resursseja tehokkaasti
definition: affärskunskap som hjälper att använda resurser effektivt @sv
in scheme: Tietotermit
preferred label: operational information @en
preferred label: operativ kunskap @sv

perusrekisteri
type: Concept
source: Tietotermit
broader: rekisteri
definition: register that contains information on the key basic units of society and their features and that also individualises these basic units @en
definition: rekisteri, joka sisältää tietoja yhteiskunnan keskeisistä perusyksiköistä ja näiden ominaisuuksista sekä yksilöi nämä perusyksiköt
definition: register som omfattar information om samhällets centrala grundenheter och deras egenskaper och som identifierar dessa grundenheter @sv
in scheme: Tietotermit
note: It is common for basic registers to be prescribed by an act or decree. Basic registers include personal information systems, community information systems, real estate systems and building information systems. @en
note: Perusrekistereille on ominaista, että niistä säädetään laissa tai asetuksessa. Perusrekistereitä ovat henkilötietojärjestelmä, yhteisötietojärjestelmä, kiinteistötietojärjestelmä ja rakennustietojärjestelmä.
note: Basregister kännetecknas av att det finns bestämmelser om dem i lagen. Basregister är befolkningsdatasystemet, företags- och organisationsdatasystemet samt fastighetsdatasystemet. @sv
preferred label: basic register @en
preferred label: basregister @sv

yhteinen ymmärrys
type: Concept
source: Tietotermit
alternative label: jaettu ymmärrys
alternative label: delad förståelse @sv
broader: ymmärrys
definition: adequate understanding of all those participating in the decision-making process on what they agree and disagree on and the reasons for their agreements or disagreements @en
definition: kaikkien päätöksentekoon osallistuvien riittävä ymmärrys siitä, mistä he ovat samaa ja mistä eri mieltä ja miksi
definition: tillräcklig förståelse mellan beslutsfattare över vad de är överens och oense om samt varför @sv
in scheme: Tietotermit
note: Shared understanding can be achieved by laying out the participants' views, opinions and values as well as their justifications and disagreements that are related to the matter at hand. @en
note: Yhteinen ymmärrys on mahdollista saavuttaa kuvaamalla päätöksentekoon osallistuvien näkemykset, mielipiteet ja arvot aiheesta sekä perustelut ja erimielisyydet.
note: Det är möjligt att uppnå en gemensam förståelse genom att beskriva synpunkterna, åsikterna och värderingarna samt motiveringarna och meningsskiljaktigheterna hos de som deltar i beslutsfattandet. @sv
preferred label: shared understanding @en
preferred label: gemensam förståelse @sv

raakadata
type: Concept
source: Tietotekniikan termitalkoot, 2013-12-16
broader: data (koneluettava tieto)
definition: data (machine-readable information) that is raw or unedited from the perspective of a specific information processing phase @en
definition: tietyn tietojen käsittelyvaiheen kannalta käsittelemätön tai muokkaamaton data (koneluettava tieto)
definition: data (maskinläsbara uppgifter) som inte har behandlats eller redigerats i ett visst databehandlingsskede @sv
in scheme: Tietotermit
note: Data is often processed in several phases, so the processed data of one phase may be raw data in another. @en
note: Dataa käsitellään monesti useassa vaiheessa, joten yhden vaiheen käsitelty data saattaa olla seuraavan vaiheen raakadataa.
note: Data behandlas ofta i flera skeden, så data som har behandlats i ett skede kan vara rådata i nästa skede. @sv
preferred label: raw data @en
preferred label: rådata @sv

suhdepääoma
type: Concept
source: Tietotermit
alternative label: sosiaalinen pääoma
alternative label: socialt kapital @sv
broader: aineeton pääoma
definition: intellectual capital that is comprised of an organisation's relationships with its customers and other stakeholders as well as the benefits that it derives from these relationships @en
definition: aineeton pääoma, joka koostuu organisaation suhteista asiakkaisiin ja muihin sidosryhmiin sekä näistä suhteista saatavasta hyödystä
definition: intellektuellt kapital som består av en organisations relationer till kunder och andra intressentgrupper samt av den nytta som relationerna medför @sv
in scheme: Tietotermit
preferred label: relational capital @en
preferred label: relationellt kapital @sv

visuaalinen lukutaito
type: Concept
source: Tietotermit
broader: lukutaito
definition: form of literacy that is related to visual information and visual forms of expression @en
definition: visuaalisessa muodossa esitetyn tiedon ja visuaalisten ilmaisukeinojen lukutaito
definition: färdighet att läsa visuellt representerad information och visuella uttrycksformer @sv
in scheme: Tietotermit
preferred label: visual literacy @en
preferred label: visuell läskunnighet @sv

taktinen tieto
type: Concept
source: Tietotermit
broader: liiketoimintatieto
definition: business information that is used to target resources in the appropriate manner and adjust operations when necessary @en
definition: liiketoimintatieto, joka ohjaa kohdentamaan resursseja tarpeiden mukaisesti ja muuttamaan tarvittaessa toimintapoja
definition: affärskunskap som hjälper att tilldela resurser och ändra verksamhetssätt enligt behov @sv
in scheme: Tietotermit
preferred label: tactical information @en
preferred label: taktisk kunskap @sv

rakennepääoma
type: Concept
source: Tietotermit
broader: aineeton pääoma
definition: intellectual capital that is comprised of an organisation's structures, leadership, systems, processes and technologies as well as corporate culture, values and atmosphere @en
definition: aineeton pääoma, joka koostuu organisaation rakenteista, johtamisesta, järjestelmistä, prosesseista ja teknologiasta sekä yrityskulttuurista, arvoista ja ilmapiiristä
definition: intellektuellt kapital som består av en organisations strukturer, ledning, system, processer och teknologi samt dess företagskultur, värderingar och gemenskap @sv
in scheme: Tietotermit
preferred label: structural capital @en
preferred label: strukturkapital @sv

eksplisiittinen tieto
type: Concept
source: Tietotermit
broader: tieto
definition: information that is expressed in some language or other code @en
definition: jollain kielellä tai muulla koodilla ilmaistu tieto
definition: information uttryckt på ett språk eller genom en annan kod @sv
in scheme: Tietotermit
note: Explicit knowledge can be presented as text, speech or through a diagram, for example. Explicit knowledge can be transferred and stored. @en
note: Eksplisiittinen tieto voi olla esimerkiksi tekstin, puheen tai kaavion muodossa. Eksplisiittistä tietoa voidaan siirtää ja tallentaa.
note: Explicit kunskap kan framställas till exempel i form av text, tal eller diagram. Explicit kunskap kan överföras och lagras. @sv
preferred label: explicit knowledge @en
preferred label: explicit kunskap @sv

strateginen tieto
type: Concept
source: Tietotermit
broader: liiketoimintatieto
definition: business information that is used to guide an organisation towards overall business activities that are suitable for the organisation’s objectives @en
definition: liiketoimintatieto, joka ohjaa organisaation tavoitteiden kannalta tarkoituksenmukaiseen kokonaisliiketoimintaan
definition: affärskunskap som leder till en ändamålsenlig affärsverksamhet enligt organisationens mål @sv
in scheme: Tietotermit
preferred label: strategic information @en
preferred label: strategisk kunskap @sv

organisatorinen yhteentoimivuus
type: Concept
source: Tietotermit
alternative label: organisatorial interoperability @en
alternative label: organisaatioiden yhteentoimivuus
alternative label: organisaatiotason yhteentoimivuus
alternative label: interoperabilitet på organisatorisk nivå @sv
alternative label: samverkan mellan organisationer @sv
broader: yhteentoimivuus
definition: form of interoperability that enables different organisations to aim for common objectives with the help of practices that support the objectives @en
definition: yhteentoimivuus, joka mahdollistaa organisaatioiden yhteisesti sovittujen päämäärien tavoittelun niitä tukevien käytäntöjen avulla
definition: interoperabilitet som gör det möjligt för organisationer att uppnå gemensamma mål med hjälp av praxis som stöder dem @sv
in scheme: Tietotermit
note: Organisational interoperability is connected especially to the arrangement of knowledge processes in a way that ensures that the data is produced and shared in the manner that most benefits the common objective. The common objective can be a jointly produced service, for example. @en
note: Organisatorinen yhteentoimivuus liittyy erityisesti tietoprosessien järjestämiseen siten, että tietoa tuotetaan ja jaetaan sovittua päämäärää parhaiten edistävällä tavalla. Sovittu päämäärä voi olla esimerkiksi yhteisesti tuotettava palvelu.
note: Organisatorisk interoperabilitet anknyter speciellt till organisering av informationsprocesser på så sätt, att information kan skapas och delas på bästa möjliga sätt med tanke på ett överenskommet mål. Det överenskomna målet kan vara till exempel en samproducerad tjänst. @sv
preferred label: organisational interoperability @en
preferred label: organisatorisk interoperabilitet @sv

semanttinen yhteentoimivuus
type: Concept
source: Tietotermit
alternative label: semanttisen tason yhteentoimivuus
alternative label: interoperabilitet på semantisk nivå @sv
broader: yhteentoimivuus
definition: form of interoperability that enables the transfer and processing of data in a way that retains the meaning of the data so that it remains unchanged and understandable for all parties @en
definition: yhteentoimivuus, joka mahdollistaa tiedon siirtämisen ja käsittelyn tavalla, jossa tiedon merkitys säilyy muuttumattomana ja ymmärrettävänä kaikille osapuolille
definition: interoperabilitet som gör det möjligt att överföra och behandla information så att dess innebörd bevaras oförändrad och begriplig för alla parter @sv
in scheme: Tietotermit
note: Semanctic interoperability can be improved with glossaries and classifications. @en
note: Semanttista yhteentoimivuutta voidaan parantaa sanastoilla ja luokituksilla.
note: Man kan förbättra semantisk interoperabilitet med ordlistor och klassificeringar. @sv
preferred label: semantic interoperability @en
preferred label: semantisk interoperabilitet @sv

arkisto (säilytystila)
type: Concept
source: Tietotermit
alternative label: arkistohuone
alternative label: arkivrum @sv
definition: space that is used to store datasets @en
definition: tila, jossa säilytetään tietoaineistoja
definition: utrymme, där man förvarar informationsmaterial @sv
in scheme: Tietotermit
note: Archives are often used to store records cf. archive (records). @en
note: Usein arkistossa säilytetään asiakirjoja, vrt. arkisto (asiakirjat).
note: I ett arkiv förvarar man ofta handlingar, jmfr. arkiv (handlingar) @sv
preferred label: archive (storage space) @en
preferred label: arkiv (förvaringsutrymme) @sv
related: tietoaineisto
top concept of: Tietotermit

tietoasiantuntija
type: Concept
source: Tietotermit
alternative label: informationsspecialist @sv
definition: person who is especially familiar with the key knowledge and skills of the information sector @en
definition: henkilö, jolla on erityinen perehtyneisyys tietoalan keskeisiin tietoihin ja taitoihin
definition: person med särskild förtrogenhet med informationsbranschen @sv
in scheme: Tietotermit
preferred label: information specialist @en
preferred label: informationsexpert @sv
related: tietoala
top concept of: Tietotermit

inhimillinen pääoma
type: Concept
source: Tietotermit
narrower partitive: tietämys
broader: aineeton pääoma
definition: intellectual capital that is comprised of staff expertise and knowledge @en
definition: henkilöstön osaamisesta ja tietämyksestä koostuva aineeton pääoma
definition: intellektuellt kapital som består av personalens kompetenser och kunskaper @sv
in scheme: Tietotermit
preferred label: human capital @en
preferred label: humankapital @sv

data (alimman jalostusasteen tieto)
type: Concept
source: Tietotermit
broader: tieto
definition: string of characters, message, fact or observation that is not necessarily interpretable but that can be refined into information @en
definition: alimman jalostusasteen tieto, joka ei välttämättä ole tulkittavissa, mutta sitä jalostamalla voidaan saada informaatiota
definition: teckensträng, meddelande, faktum eller observation som nödvändigtvis inte kan tolkas, men som kan förädlas till information @sv
in scheme: Tietotermit
note: Data is often used to refer to strings of characters and images, but e.g. sounds, light, heat and other observable things can also be data. @en
note: Datalla tarkoitetaan usein merkkijonoja ja kuvia, mutta dataa ovat myös esimerkiksi äänet, valo, lämpö ja muut havaittavissa olevat asiat.
note: Med data avses oftast teckensträngar och bilder, men data kan även vara ljud, ljus, värme och andra observerbara saker. @sv
preferred label: data (potential information) @en
preferred label: data (potentiell information) @sv
related: informaatio

metatietosanasto
type: Concept
source: Tietotermit
broader: sanasto
definition: glossary used in the production of metadata whose terms and expressions conform to a specific set of rules or guidelines on the formulation of their descriptions @en
definition: metatietojen tuottamisessa käytettävä sanasto, jonka sisältämät termit ja ilmaukset ovat tiettyjen kuvailusääntöjen tai kuvailuohjeiden mukaisia
definition: ordlista som används för att skapa metadata och som innehåller termer och uttryck som har skapats enligt vissa riktlinjer @sv
in scheme: Tietotermit
preferred label: metadata glossary @en
preferred label: metadataordlista @sv
related: metatieto

verkkolukutaito
type: Concept
source: Tietotermit
broader: lukutaito
definition: media literacy of information that is presented on the internet and on other information networks @en
definition: internetin ja muiden tietoverkkojen avulla esitetyn tiedon medialukutaito
definition: färdighet att läsa information som presenteras i olika medier på internet och i andra datanät @sv
in scheme: Tietotermit
preferred label: network literacy @en
preferred label: webbläskunnighet @sv
related: tietoverkko

terminologinen sanasto
type: Concept
source: JHS 183 Julkisen hallinnon palvelujen tietomalli ja ryhmittely verkkopalveluissa, 2013-02-28
broader: sanasto
definition: glossary that contains information on the concepts and terms used by special fields @en
definition: sanasto, joka sisältää erikoisalojen käsitteisiin ja niiden nimityksiin liittyvää tietoa
definition: ordlista som omfattar uppgifter om och benämningar för begrepp som tillhör olika fackområden @sv
in scheme: Tietotermit
preferred label: terminological glossary @en
preferred label: terminologisk ordlista @sv
related: käsite

omadata (periaate)
type: Concept
source: Tietotermit
definition: principle according to which a person has the right to manage and utilise data (machine-readable information) that pertains to them @en
definition: periaate, jonka mukaan henkilöllä on oikeus hallinnoida ja hyödyntää itseään koskevaa dataa (koneluettava tieto)
definition: princip, enligt vilken personer har rätt att hantera och använda data (maskinläsbara uppgifter) om sig själv @sv
hidden label: mydata (principle) @en
hidden label: mydata (princip) @sv
in scheme: Tietotermit
note: The principle can be applied to the management of personal data and anonymised information in various ways, for example by ensuring the person's consent to the collection of data or by enabling the transfer of the data to third-party services if the person so wishes. @en
note: Periaatetta voidaan soveltaa henkilötietojen ja anonymisoitujen tietojen hallinnointiin eri tavoin, esimerkiksi varmistamalla henkilön suostumus tietojen keräämiseen tai mahdollistamalla tietojen siirtäminen kolmannen osapuolen palvelujen käyttöön henkilön niin halutessa.
note: Principen kan tillämpas inom administration av personuppgifter och anonymiserade uppgifter på olika sätt, till exempel genom att försäkra sig om att personer har gett sitt samtycke till insamling av uppgifter eller genom att göra det möjligt att överföra uppgifter till tredje parts tjänster om personerna i fråga så önskar. @sv
preferred label: MyData (principle) @en
preferred label: MyData (princip) @sv
related: omadata (data)
top concept of: Tietotermit

tietoammattilainen
type: Concept
source: Tietotermit
definition: person who works in the information sector @en
definition: tietoalalla työskentelevä henkilö
definition: person som arbetar inom informationsbranschen @sv
in scheme: Tietotermit
preferred label: information professional @en
preferred label: yrkesarbetare inom informationsbranschen @sv
related: tietoala
top concept of: Tietotermit

informaatiolukutaito
type: Concept
source: Tietotermit
broader: lukutaito
definition: form of literacy required by data acquisition whose essential characteristics include the ability to define the need for information, versatile information retrieval skills and the critical evaluation of information @en
definition: tiedonhankinnassa tarvittava lukutaito, johon sisältyvät olennaisina kyky määritellä tiedontarve, monipuoliset tiedonhakutaidot ja tiedon kriittinen arviointi
definition: läskunnighet som behövs för informationsanskaffning och som omfattar färdigheten att definiera informationsbehovet, mångsidiga kunskaper i informationssökning och en kritisk bedömning av information @sv
in scheme: Tietotermit
preferred label: information literacy @en
preferred label: informationsläskunnighet @sv
related: tiedonhankinta

luottamuksellisuus
type: Concept
source: Laajakaistasanasto (TSK 43, 2012)
definition: characteristic of data that is used to indicate that the data in question can only be accessed by those who have been granted access to it and that it has not been disclosed to others @en
definition: tiedon ominaisuus, joka ilmentää sitä, että tieto on vain sen käyttöön oikeutettujen käytettävissä eikä se paljastu muille
definition: egenskap hos en uppgift som innefattar att den kan användas endast av personer som har rätt till den och att den inte avslöjas till andra @sv
in scheme: Tietotermit
preferred label: confidentiality @en
preferred label: konfidentialitet @sv
related: tietoturvallisuus
top concept of: Tietotermit

kokonaisarkkitehtuuri (rakenne)
type: Concept
source: JHS 179 Kokonaisarkkitehtuurin suunnittelu ja kehittäminen, 2017-02-07
definition: structure of an organisation or other entity as a whole @en
definition: organisaation tai muun kohteena olevan kokonaisuuden rakenne
definition: struktur för en organisation eller annan helhet @sv
in scheme: Tietotermit
preferred label: enterprise architecture (structure) @en
preferred label: övergripande arkitektur (struktur) @sv
related: kokonaisarkkitehtuuri (kuvaus)
top concept of: Tietotermit

tietoperustainen päätöksenteko
type: Concept
source: Tietotermit
definition: decision-making that is based on analysed information @en
definition: päätöksenteko, joka tapahtuu analysoidun tiedon perusteella
definition: beslutsfattande som sker med stöd av analyserad information @sv
in scheme: Tietotermit
preferred label: knowledge-based decision-making @en
preferred label: beslutsfattande utifrån information @sv
related: tiedolla johtaminen
top concept of: Tietotermit

luokka
type: Concept
source: Tietotermit
definition: group of phenomena that possess similar attributes @en
definition: samankaltaisia ominaisuuksia omaavien ilmiöiden ryhmä
definition: grupp av fenomen med liknande egenskaper @sv
in scheme: Tietotermit
preferred label: class @en
preferred label: klass @sv
related: luokitus
top concept of: Tietotermit

kokonaisarkkitehtuuri (kuvaus)
type: Concept
source: Tietotermit
definition: description of the enterprise architecture (structure) that is used in the development of activities @en
definition: kokonaisarkkitehtuurin (rakenne) kuvaus, jota käytetään toiminnan kehittämisessä
definition: beskrivning av en övergripande arkitektur (struktur) som används för att utveckla verksamheten @sv
in scheme: Tietotermit
note: "An enterprise architecture can be assessed from different angles, the most central of which are an organisation's operational structures (business architecture), the information used by the organisation and the structures and relationships of the information (information architecture), the applications and application entities that process the information (application architecture) as well as the organisation's technological infrastructure and central technological choices (technology architecture). For more information on enterprise architecture and its related concepts, see the recommendation ""JHS 179 Enterprise architecture planning and development""." @en
note: Kokonaisarkkitehtuuria tarkastellaan eri näkökulmista, joista keskeisimpiä ovat organisaation toiminnalliset rakenteet (toiminta-arkkitehtuuri), organisaation käyttämät tiedot ja näiden rakenteet ja suhteet (tietoarkkitehtuuri), tietoja käsittelevät sovellukset ja sovelluskokonaisuudet (tietojärjestelmäarkkitehtuuri) sekä organisaation teknologinen infrastruktuuri ja keskeiset teknologiavalinnat (teknologia-arkkitehtuuri). Kokonaisarkkitehtuuria ja siihen liittyviä käsitteitä kuvataan suosituksessa JHS 179 Kokonaisarkkitehtuurin suunnittelu ja kehittäminen.
note: En övergripande arkitektur kan granskas ur olika synvinklar. De mest centrala är organisationens funktionella struktur (verksamhetssstruktur), uppgifter som organisationen använder inklusive deras struktur och förhållanden (informationsarkitektur), program och programhelheter som behandlar uppgifterna (informationssystemarkitektur) samt organisationens tekniska infrastruktur och centrala teknikval (teknikarkitektur). Termen övergripande arkitektur och begrepp i anslutning till termen beskrivs i rekommendationen JHS 179 Planering och utveckling av en övergripande arkitektur. @sv
preferred label: enterprise architecture (description) @en
preferred label: övergripande arkitektur (beskrivning) @sv
related: kokonaisarkkitehtuuri (rakenne)
top concept of: Tietotermit

tietojohtaminen (tutkimusala)
type: Concept
source: Tietotermit
definition: research field that focuses on knowledge management @en
definition: tutkimusala, jonka kohteena on tietojohtaminen
definition: forskningsområde som gäller informationsledning @sv
in scheme: Tietotermit
note: As a field of research, knowledge management provides concepts and models that can be utilised to support information management and knowledge management. @en
note: Tietojohtaminen tutkimusalana tarjoaa käsitteitä ja malleja, joita voidaan hyödyntää tiedonhallinnan ja johtamisen tukena.
note: Som forskningsområde erbjuder informationsledning begrepp och mallar som kan användas som stöd för informationshantering och ledning. @sv
preferred label: knowledge management (research field) @en
preferred label: informationsledning (forskningsområde) @sv
related: tietojohtaminen
top concept of: Tietotermit

verkkosisältö
type: Concept
source: Tietotermit
broader: sisältö (informaatio)
definition: content (information) that is published in a data network @en
definition: tietoverkossa julkaistu sisältö (informaatio)
definition: innehåll (information) som har publicerats i ett datanät @sv
in scheme: Tietotermit
preferred label: online content @en
preferred label: nätverksinnehåll @sv
related: tietoverkko

tietotyöntekijä
type: Concept
source: Tietotermit
definition: employee who performs knowledge work @en
definition: tietotyötä tekevä työntekijä
definition: arbetstagare som arbetar med informationsarbete @sv
in scheme: Tietotermit
preferred label: knowledge worker @en
preferred label: informationsarbetare @sv
related: tietotyö
top concept of: Tietotermit

omadata (data)
type: Concept
source: Tietotermit
broader: data (koneluettava tieto)
definition: data (machine-readable information) pertaining to a person that the person in question can personally manage and utilise in accordance with MyData (principle) @en
definition: henkilöä koskeva data (koneluettava tieto), jota kyseinen henkilö voi itse hallinnoida ja hyödyntää omadatan (periaate) mukaisesti
definition: data (maskinläsbara uppgifter) om en person som personen i fråga har rätt att hantera och använda enligt MyData (princip) @sv
hidden label: mydata (data) @en
in scheme: Tietotermit
preferred label: MyData (data) @en
related: omadata (periaate)

rakenteeton data
type: Concept
source: Tietotermit
alternative label: ei-rakenteinen data
alternative label: ei-rakenteinen tieto
alternative label: rakenteeton tieto
alternative label: rakenteistamaton data
alternative label: rakenteistamaton tieto
alternative label: icke-strukturella data @sv
alternative label: icke-strukturerade data @sv
alternative label: ostrukturella data @sv
broader: data (koneluettava tieto)
definition: data (machine-readable information) that does not have a metadata-defined structure that could be used to parse the data @en
definition: data (koneluettava tieto), jolla ei ole metatietojen avulla määritettyä rakennetta, jonka avulla data voitaisiin jäsentää
definition: data (maskinläsbara uppgifter) som inte har en struktur definierad med hjälp av metadata för analys av ifrågavarande data @sv
in scheme: Tietotermit
preferred label: unstructured data @en
preferred label: ostrukturerade data @sv
related: rakenteistaminen

monilukutaito
type: Concept
source: Tietotermit
narrower partitive: lukutaito
definition: skillset that is comprised of different types of literacies @en
definition: erityyppisistä lukutaidoista koostuva taitojen kokonaisuus
definition: helhet av färdigheter som består av olika typer av läskunnighet @sv
in scheme: Tietotermit
preferred label: multiliteracy @en
preferred label: mångläskunnighet @sv
top concept of: Tietotermit

yleiskäsite
type: Concept
source: Terminologian sanasto (TSK 36, 2006)
broader: käsite
definition: concept that corresponds to two or several objects that possess similar characteristics @en
definition: käsite, joka vastaa kahta tai useampaa tarkoitetta, joilla on yhteisiä ominaisuuksia
definition: begrepp som kan knytas till två eller flera referenter som har gemensamma egenskaper @sv
in scheme: Tietotermit
note: For example: 'motor', 'sea', and 'talent'. @en
note: Esimerkiksi: 'moottori', 'meri' ja 'lahjakkuus'.
note: Exempel: 'motor', 'hav', 'begåvning'. @sv
preferred label: general concept @en
preferred label: allmänbegrepp @sv
related: termi

informaatiotehokkuus
type: Concept
source: Tietotermit
definition: act of saving time and resources by enhancing the knowledge process without compromising its quality or results @en
definition: ajan ja resurssien säästö, joka saadaan aikaan tehostamalla tietoprosessia heikentämättä laatua ja tuloksia
definition: tids- och resursbesparingar som uppnås genom att effektivera informationsprocessen utan att försämra kvaliteten och resultaten @sv
in scheme: Tietotermit
note: For example, a principle that mandates that an organisation's data must be saved in one location can increase the information efficiency of that organisation. @en
note: Esimerkiksi periaate tiedon tallentamisesta vain yhteen paikkaan voi lisätä organisaation informaatiotehokkuutta.
note: Till exempel en princip om lagring av uppgifter på ett och samma ställe kan öka informationseffektiviteten inom en organisation. @sv
preferred label: information efficiency @en
preferred label: informationseffektivitet @sv
related: tietoprosessi
top concept of: Tietotermit

anonymisoitu tieto
type: Concept
source: Tietotermit
broader: tieto
definition: information that, at first, was classified as personal data, but has now been irreversibly edited to the point that the person can no longer be identified @en
definition: alun perin henkilötiedoksi luokiteltu tieto, jota on peruuttamattomasti muokattu siten, ettei henkilö ole enää tunnistettavissa
definition: ursprungligen en personuppgift som har ändrats oåterkalleligt så att personen i fråga inte längre kan identifieras @sv
in scheme: Tietotermit
preferred label: anonymised information @en
preferred label: anonymiserad uppgift @sv
related: henkilötieto

ontologia
type: Concept
source: Tietotermit
broader: sanasto
definition: glossary that is presented in a machine-readable form and defines the hierarchical relationships of the concepts of an application or subject area @en
definition: konepäättelyä tukevassa muodossa esitetty sanasto, jossa määritellään sovellus- tai aihealueen käsitteiden hierarkkiset suhteet
definition: ordlista med hierarkiska förhållanden mellan begrepp för ett visst tillämpnings- eller ämnesområde i en form lämpad för maskintolkning @sv
in scheme: Tietotermit
preferred label: ontology @en
preferred label: ontologi @sv
related: käsite

arkisto (asiakirjat)
type: Concept
source: Tietotermit
definition: entity consisting of archived records that belong together due to their origin or purpose @en
definition: alkuperänsä tai käyttötarkoituksensa takia yhteenkuuluvien, arkistoitujen asiakirjojen kokonaisuus
definition: helhet av arkiverade handlingar som hör ihop enligt ursprung eller syfte @sv
hidden label: arkisto
in scheme: Tietotermit
preferred label: archive (records) @en
preferred label: arkiv (handlingar) @sv
related: arkistointi
top concept of: Tietotermit

tietoteollisuus
type: Concept
source: Tietotermit
definition: business that focuses on the production, processing and dissemination of information @en
definition: tiedon tuottamiseen, käsittelyyn ja välittämiseen liittyvä elinkeinotoiminta
definition: näringsverksamhet i samband med produktion, behandling och förmedling av information @sv
in scheme: Tietotermit
preferred label: information industry @en
preferred label: informationsindustri @sv
related: tieto
top concept of: Tietotermit

tietojärjestelmä
type: Concept
source: Tietotermit
definition: system comprised of data and the people managing the data, data processing devices, data transfer devices, data processing programmes and data processing regulations, the purpose of which is to enhance, facilitate or enable some activity. @en
definition: tiedoista ja tietoja käsittelevistä ihmisistä, tietojenkäsittelylaitteista, tiedonsiirtolaitteista, tietoja käsittelevistä ohjelmista ja tietojen käsittelysäännöistä koostuva järjestelmä, jonka tarkoitus on tehostaa tai helpottaa jotakin toimintaa tai tehdä toiminta mahdolliseksi
definition: system som består av uppgifter, personer som behandlar uppgifterna, vederbörlig maskin- och programvara för behandling och överföring av uppgifterna samt bestämmelser för behandling av uppgifterna och vars syfte är att effektivera eller underlätta en viss aktivitet eller möjliggöra den @sv
in scheme: Tietotermit
note: The concept of an information system is broad in nature, and not all of its parts are relevant for every use case. For example, when the focus is on acquisitions, information systems are usually used to refer to the part of information systems that focus on technology, i.e. hardware and software. Information systems are used to operate information resources. @en
note: Tietojärjestelmän käsite on laaja, eivätkä kaikki sen osa-alueet ole relevantteja kaikissa käyttöyhteyksissä. Esimerkiksi hankinnoista puhuttaessa tietojärjestelmillä viitataan tavallisesti tekniseen, laitteista ja ohjelmista koostuvaan osaan tietojärjestelmiä. Tietojärjestelmällä operoidaan tietovarantoja.
note: Informationssystem är ett brett begrepp, och alla dess delområden är inte relevanta i alla sammanhang. Till exempel i fråga om anskaffningar syftar informationssystem vanligtvis på den tekniska delen av informationssystem som innefattar maskin- och programvara. Informationssystem används för att hantera informationsresurser. @sv
preferred label: information system @en
preferred label: informationssystem @sv
related: yhteentoimivuus
top concept of: Tietotermit

luokitus
type: Concept
source: Tietotermit
definition: act of grouping phenomena into classes based on their similar attributes so that the classes differ from one another @en
definition: ilmiöiden ryhmittely luokkiin niiden samankaltaisten ominaisuuksien perusteella niin, että luokat eroavat toisistaan
definition: gruppering av fenomen enligt deras liknande egenskaper så att klasserna skiljer sig från varandra @sv
in scheme: Tietotermit
preferred label: classification @en
preferred label: klassificering @sv
related: luokka
top concept of: Tietotermit

linkitetty data
type: Concept
source: Tietotermit
alternative label: yhdistetty data
alternative label: kombinerade data @sv
broader: rakenteinen data
definition: structured data that is connected to the data in several datasets with the help of links @en
definition: rakenteinen data, joka on yhdistetty useiden tietoaineistojen sisältämään dataan linkkien avulla
definition: strukturerade data som har kombinerats med data i andra datauppsättningar med hjälp av länkar @sv
in scheme: Tietotermit
note: Linked data can be open data, in which case it is referred to as linked open data. @en
note: Linkitetty data voi olla avointa dataa, jolloin sitä kutsutaan avoimeksi linkitetyksi dataksi.
note: Länkade data kan vara öppna data, och kallas i sådant fall länkade öppna data. @sv
preferred label: linked data @en
preferred label: länkade data @sv
related: tietoaineisto

tietotalous
type: Concept
source: Tietotekniikan termitalkoot, 2016-11-11
definition: economy that is based on information and expert knowledge, where information, skills and education are seen as commercial properties @en
definition: tietoon ja asiantuntijuuteen perustuva talous, jossa tietoja, taitoja ja koulutusta käsitellään kaupallisena omaisuutena
definition: ekonomi baserat på kunskap och expertis där information, färdigheter och utbildning behandlas som kommersiell egendom @sv
in scheme: Tietotermit
preferred label: information economy @en
preferred label: kunskapsekonomi @sv
related: tieto
top concept of: Tietotermit

avoin data
type: Concept
source: Tietotermit
broader: avoin tieto
broader: data (koneluettava tieto)
definition: data (machine-readable information) that can be freely reused by anyone in accordance with its terms of use @en
definition: data (koneluettava tieto), joka on kenen tahansa uudelleen käytettävissä maksutta sen käyttöehtojen mukaisesti
definition: data (maskinläsbara uppgifter) som vem som helst har rätt att återanvända kostnadsfritt enligt tillhörande användarvillkor @sv
in scheme: Tietotermit
note: Open data can be provided by the public sector, companies, other organisations as well as private individuals. The terms of use of any open data can be found in its accompanying licence. The most common licences that comply with public sector recommendations are Creative Commons Attribution 4.0, which mandates that the data be properly attributed , and CC0, which permits anyone to use the data without any special requirements. @en
note: Avointa dataa voi olla julkishallinnolla, yrityksillä, muilla organisaatioilla sekä yksityishenkilöillä. Avoimen datan käyttöehdot ilmenevät siihen liitetystä käyttöluvasta. Usein käytettyjä ja julkishallintoa koskevien suositusten mukaisia avoimen datan käyttölupia ovat Creative Commons Nimeä 4.0, johon sisältyy lähteen nimeämisvaatimus, ja CC0, jolla data on kaikkien käytettävissä ilman erityisiä käyttöehtoja.
note: Öppna data kan innehas av den offentliga förvaltningen, företag, andra organisationer och privatpersoner. Användarvillkoren för öppna data finns i tillhörande licens. Vanliga licenser för öppna data som följer rekommendationerna för den offentliga förvaltningen är Creative Commons Erkännande 4.0, som omfattar krav på erkännande av källan, och CC0, som kan användas för att tillåta alla att använda ifrågavarande data utan skilda användarvillkor. @sv
preferred label: open data @en
preferred label: öppna data @sv
related: käyttöehdot

termi
type: Concept
source: Tietotermit / Terminologian sanasto (TSK 36, 2006)
definition: name of a general concept that is used in one special field or more @en
definition: yhdellä tai useammalla erikoisalalla käytettävä yleiskäsitteen nimitys
definition: benämning för ett allmänbegrepp som tillhör ett eller flera fackområden @sv
in scheme: Tietotermit
note: "For example, the term ""logging"" refers to a general concept of the forestry sector." @en
note: Esimerkiksi hakkuu-termi viittaa metsänhoidon alaan kuuluvaan yleiskäsitteeseen.
note: Exempel: Termen avverkning står för ett allmänbegrepp inom skogsbruk. @sv
preferred label: term @en
related: yleiskäsite
related: sanasto
top concept of: Tietotermit

tietovirta
type: Concept
source: Tietotermit
definition: migration of information from its source to the intended target based on a predefined information process @en
definition: tiedon liikkuminen lähteestä kohteeseen määritetyn tietoprosessin mukaisesti
definition: överföring av information från en källa till ett mål enligt en definierad informationsprocess @sv
in scheme: Tietotermit
note: Organisations contain both internal information flows and information flows that exceed organisational boundaries. @en
note: Organisaatioissa on sekä sisäisiä tietovirtoja että organisaatiorajat ylittäviä tietovirtoja.
note: En organisation har både interna informationsflöden och informationsflöden som överskrider organisationsgränserna. @sv
preferred label: information flow @en
preferred label: informationsflöde @sv
related: tiedon johtaminen
related: tietoprosessi
top concept of: Tietotermit

tarkoite
type: Concept
source: Terminologian sanasto (TSK 36, 2006)
definition: entity that can be proved, conceptualised or imagined and that corresponds to a specific concept @en
definition: olio, joka voidaan osoittaa, käsittää tai kuvitella ja joka vastaa tiettyä käsitettä
definition: entitet som kan påvisas eller uppfattas eller som man kan föreställa sig och som ett begrepp kan knytas till @sv
in scheme: Tietotermit
note: Objects can be concrete (motor, paper), abstract (coordinate, balance) or imaginary (unicorn) in nature. @en
note: Tarkoitteet voivat olla konkreettisia (moottori, paperi), abstrakteja (koordinaatti, tasapaino) tai keksittyjä (yksisarvinen).
note: Referenter kan vara konkreta (motor, papper), abstrakta (koordinat, stabilitet) eller påhittade (enhörning). @sv
preferred label: object @en
preferred label: referent @sv
related: käsitepiirre
related: käsite
top concept of: Tietotermit

tietopolitiikka
type: Concept
source: Tietotermit
definition: commonly agreed-upon principles and policies on the operation methods and procedures that focus on the production, procurement, migration, opening, sharing, use, maintenance and storage of data @en
definition: yhteisesti sovitut periaatteet ja linjaukset tietojen tuottamista, hankintaa, liikkumista, avaamista, jakamista, käyttöä, ylläpitoa ja säilyttämistä koskevista toimintatavoista ja menettelyistä
definition: gemensamt överenskomna verksamhetssätt och förfaranden angående skapande, inhämtande, överföring, granskning, delning, användning, underhåll och förvaring av uppgifter @sv
in scheme: Tietotermit
preferred label: information policy @en
preferred label: informationspolicy @sv
related: tieto
related: tietostrategia
top concept of: Tietotermit

tietotilinpäätös
type: Concept
source: Tietotermit
definition: report that is used to support an organisation's information and knowledge management by describing the state of its data processing and data management practices @en
definition: tietojohtamisen tukena hyödynnettävä raportti, joka kuvaa organisaation tietojenkäsittelyn ja tiedonhallinnan tilaa
definition: rapport som används som stöd för informationsledning och som beskriver informationsbehandlingen och -hanteringen inom en organisation @sv
in scheme: Tietotermit
note: The data balance sheet is used especially to support knowledge management and strengthen customer and stakeholders trust in an organisation's activities. @en
note: Tietotilinpäätös tukee erityisesti tiedolla johtamista sekä vahvistaa asiakkaiden ja sidosryhmien luottamusta organisaation toimintaan.
note: En informationsredovisning stöder särskilt ledning genom information samt stärker förtroendet för en organisation hos kunder och intressentgrupper. @sv
preferred label: data balance sheet @en
preferred label: informationsredovisning @sv
related: tiedonhallinta
related: tietojohtaminen
top concept of: Tietotermit

tietopääoma
type: Concept
source: Tietotermit
narrower partitive: aineeton pääoma
narrower partitive: informaatio
definition: organisation's capital that consists of intellectual capital and recorded information @en
definition: organisaation pääoma, joka koostuu aineettomasta pääomasta ja tallennetusta informaatiosta
definition: en organisations kapital som består av intellektuellt kapital och lagrad information @sv
in scheme: Tietotermit
preferred label: intellectual and information capital @en
preferred label: kunskapskapital @sv
top concept of: Tietotermit

salassa pidettävä tieto
type: Concept
source: Tietotermit
broader: tieto
definition: information that can be accessed and used only with special permission to ensure no damage or harm to any public or private interest @en
definition: tieto, johon pääsy ja jonka käyttö on luvallista vain tietyin ehdoin sen varmistamiseksi, ettei yleiselle tai yksityiselle edulle aiheudu vahinkoa tai haittaa
definition: uppgift som omfattar användarvillkor för att försäkra att ingen skada eller olägenhet uppkommer för ett allmänt eller enskilt intresse @sv
hidden label: salassapidettävä tieto
in scheme: Tietotermit
narrower: suojaustasoluokiteltu tieto
narrower: turvallisuusluokiteltu tieto
preferred label: confidential information @en
preferred label: sekretessbelagd uppgift @sv

tietosuoja
type: Concept
source: Tietotermit
definition: proper handling of data while respecting the rights that apply to them @en
definition: tietojen asianmukainen käsittely niitä koskevia oikeuksia kunnioittaen
definition: korrekt behandling av uppgifter med respekt för gällande rättigheter @sv
in scheme: Tietotermit
note: According to the Charter of Fundamental Rights of the European Union, everyone has the right to the protection of personal data concerning him or her. @en
note: Euroopan unionin perusoikeuskirjan mukaan jokaisella on oikeus henkilötietojensa suojaan.
note: Enligt Europeiska unionens stadga om de grundläggande rättigheterna har var och en rätt till skydd av sina personuppgifter. @sv
preferred label: data protection @en
preferred label: dataskydd @sv
related: käyttöehdot
related: käyttölupa
top concept of: Tietotermit

rekisterinpitäjä
type: Concept
source: Tietotermit
definition: natural person or legal person, public authority, office or other organ who either alone or together with others defines the purposes and methods for processing the personal data that is to be stored in the register @en
definition: luonnollinen henkilö tai oikeushenkilö, viranomainen, virasto tai muu elin, joka yksin tai yhdessä toisten kanssa määrittelee rekisteriin tallennettavien henkilötietojen käsittelyn tarkoitukset ja keinot
definition: fysisk eller juridisk person, myndighet, ämbetsverk eller annat organ som ensam eller tillsammans med andra definierar syftet för och sättet som personuppgifter som lagras i registret behandlas @sv
in scheme: Tietotermit
note: In Finland, the rights and duties of registrars are defined in the Personal Data Act. @en
note: Rekisterinpitäjän oikeuksista ja velvoitteista säädetään henkilötietolaissa.
note: Personuppgiftslagen omfattar bestämmelser om rättigheter och skyldigheter för registeransvariga. @sv
preferred label: registrar @en
preferred label: registeransvarig @sv
related: rekisteri
related: henkilötieto
top concept of: Tietotermit

avoin tieto
type: Concept
source: Tietotermit
broader: tieto
definition: information that can be freely reused by anyone in accordance with its terms of use @en
definition: tieto, joka on kenen tahansa uudelleen käytettävissä maksutta sen käyttöehtojen mukaisesti
definition: information som vem som helst har rätt att återanvända kostnadsfritt enligt tillhörande användarvillkor @sv
in scheme: Tietotermit
narrower: avoin data
note: The terms of use of a piece of open information can include for example a source attribution requirement. @en
note: Avoimen tiedon käyttöehtona voi olla esimerkiksi lähteen mainitseminen.
note: Användarvillkoren för öppen information kan till exempel omfatta att man måste nämna källan. @sv
preferred label: open information @en
preferred label: öppen information @sv
related: käyttöehdot

tietostrategia
type: Concept
source: Tietotermit
definition: information policy plan created to support the information and knowledge management of an organisation @en
definition: tietojohtamista varten laadittava suunnitelma organisaation tietopolitiikasta
definition: plan över en organisations informationspolicy som utarbetas för informationsledningens behov @sv
in scheme: Tietotermit
preferred label: information strategy @en
preferred label: informationsstrategi @sv
related: tietopolitiikka
related: tietojohtaminen
top concept of: Tietotermit

sisältö (informaatio)
type: Concept
source: Tietotermit
broader: informaatio
definition: information that has been produced for a certain target group @en
definition: tiettyä kohderyhmää varten tuotettu informaatio
definition: information som har producerats för en viss målgrupp @sv
hidden label: content @en
hidden label: sisältö
hidden label: innehåll @sv
in scheme: Tietotermit
narrower: verkkosisältö
note: "Especially in the fields of communications and marketing, content is usually used to mean information that is published in the form of text, images or sound, or as a combination of these. This content can be modified for publication on several different channels, such as websites, online magazines or social media. Depending on where it is used, content can be used to indicate other things: for example, the contents of a text can be used to refer to its intended meaning to distinguish it from how it is presented; see also information content." @en
note: "Varsinkin viestinnän ja markkinoinnin alalla sisällöllä tarkoitetaan tavallisesti informaatiota, joka julkaistaan tekstin, kuvan tai äänen muodossa tai näiden yhdistelmänä. Sisältöä voidaan muokata julkaistavaksi useissa eri kanavissa, kuten verkkosivuilla, verkkolehdessä tai sosiaalisessa mediassa. Käyttöyhteydestä riippuen sisällöllä voidaan tarkoittaa muitakin asioita, esimerkiksi tekstin sisällöllä voidaan viitata tarkoitettuun merkitykseen erotukseksi esitysmuodosta; vrt. myös tietosisältö."
note: Med innehåll avses särskilt inom kommunikation och marknadsföring information som publiceras i form av text, bild eller ljud eller en kombination av dessa. Innehåll kan redigeras för publicering via olika kanaler, som webbplatser, webbtidningar eller sociala medier. Beroende på sammanhanget kan innehåll omfatta även andra saker. Till exempel textinnehåll kan syfta på den avsedda innebörden i motsats till formatet. Jmfr. även informationsinnehåll. @sv
preferred label: content (information) @en
preferred label: innehåll (information) @sv
related: sisällönhallinta

asiarekisteri
type: Concept
source: Tietotermit
broader: rekisteri
definition: register of initiated cases, what phase they are in as well as any related records @en
definition: rekisteri vireillepannuista asioista, näiden käsittelyvaiheista ja niihin liittyvistä asiakirjoista
definition: register över anhängiggjorda ärenden samt tillhörande behandlingsskeden och handlingar @sv
in scheme: Tietotermit
narrower: diaari
note: A case register is typically part of a special information system (case processing or case management system) that is used to manage the cases that have been handled by the organisation and any related records in accordance with the organisation's predefined processing rules. @en
note: Asiarekisteri on tavallisesti osa erityistä tietojärjestelmää (asiankäsittely- tai asianhallintajärjestelmä), jonka avulla organisaation käsittelemät asiat ja niihin liittyvät asiakirjat hallitaan ennalta määriteltyjen käsittelysääntöjen mukaisesti.
note: Ett ärenderegister tillhör vanligtvis ett särskilt informationssystem (ärendebehandlings- eller ärendehanteringssystem), som används för att hantera ärenden och tillhörande handlingar inom en organisation enligt på förhand fastslagna bestämmelser. @sv
preferred label: case register @en
preferred label: ärenderegister @sv
related: asiakirja

rakenteistaminen
type: Concept
source: Tietotermit
definition: act of transforming unstructured data into structured data @en
definition: rakenteettoman datan muuttaminen rakenteiseksi dataksi
definition: ändring av ostrukturerade data till strukturerade data @sv
in scheme: Tietotermit
note: When the structuring process is based on common principles, it also helps support semantic interoperability. @en
note: Toteuttamalla rakenteistaminen yhteisten periaatteiden mukaisesti voidaan tukea semanttista yhteentoimivuutta.
note: Man kan stöda semantisk interoperabilitet genom strukturering enligt gemensamma principer. @sv
preferred label: structuring @en
preferred label: strukturering @sv
related: rakenteeton data
related: rakenteinen data
top concept of: Tietotermit

sisällönhallinta
type: Concept
source: Tietotermit
broader partitive: tiedonhallinta
definition: area of information management that focuses on content (information) @en
definition: tiedonhallinnan osa-alue, jonka kohteena on sisältö (informaatio)
definition: delområde inom informationshantering som gäller innehåll (information) @sv
in scheme: Tietotermit
preferred label: content management @en
preferred label: innehållshantering @sv
related: sisältö (informaatio)
top concept of: Tietotermit

eheys
type: Concept
source: Tietotermit
definition: characteristic of data that is used to indicate that the data in question has not been altered without authorisation or unintendedly and that any possible alterations can be verified and traced @en
definition: tiedon ominaisuus, joka ilmentää sitä, että tietoa ei ole muutettu luvatta, ettei se ole tahattomasti muuttunut ja että mahdolliset muutokset voidaan todentaa ja jäljittää
definition: egenskap hos en uppgift som innefattar att den inte har ändrats olovligt eller oavsiktligt och att eventuella ändringar kan verifieras och spåras @sv
in scheme: Tietotermit
note: When a piece of data is altered, it can become defective or contradictory when compared to the original data. The meaning of a piece of data can be changed not only when its format is changed but also when the context where it is used is changed. Data integrity is sometimes used to indicate that certain pieces of data do not contradict each other. @en
note: Muuttunut tieto voi olla puutteellinen tai merkitykseltään ristiriidassa alkuperäisen tiedon kanssa. Muutoksia merkitykseen voi syntyä paitsi tiedon muotoon kohdistuvien muutosten takia, myös tiedon käyttöyhteyden muuttuessa. Tietojen eheydellä tarkoitetaan joskus myös sitä, että tiedot eivät ole keskenään ristiriidassa.
note: En ändrad uppgift kan vara bristfällig eller ha en annan innebörd än den ursprungliga uppgiften. Innebörden kan ändras på grund av ändringar i uppgiftens form eller sammanhang. Dataintegritet omfattar i vissa fall att olika data inte står i strid med varandra. @sv
preferred label: integrity @en
preferred label: integritet @sv
related: tiedon säilytys
related: tietoturvallisuus
top concept of: Tietotermit

tietoverkko
type: Concept
source: Tietotermit
alternative label: data network @en
definition: entity that is formed by computers and the data transmission connections between them @en
definition: tietokoneiden ja niiden välisten tiedonsiirtoyhteyksien muodostama kokonaisuus
definition: helhet som omfattar datorer och dataförbindelser mellan dem @sv
in scheme: Tietotermit
note: An example of an information network is the internet and the intranets of various organisations. @en
note: Tietoverkkoja ovat esimerkiksi internet ja organisaatioiden intranetit.
note: Till exempel internet och organisationers intranät är datanät. @sv
preferred label: information network @en
preferred label: datanät @sv
related: verkkolukutaito
related: verkkosisältö
top concept of: Tietotermit

käsitepiirre
type: Concept
source: Terminologian sanasto (TSK 36, 2006)
definition: abstraction of a property of an object or object group @en
definition: tarkoitteen tai tarkoitejoukon ominaisuuden abstraktio
definition: abstraktion av en egenskap hos en viss referent eller hos en grupp av referenter @sv
in scheme: Tietotermit
note: Characteristics are used to describe concepts. @en
note: Käsitepiirteitä käytetään käsitteiden kuvaamisessa.
note: Kännetecken används för att beskriva begrepp. @sv
preferred label: characteristic @en
preferred label: kännetecken @sv
related: tarkoite
related: käsite
top concept of: Tietotermit

tietovaranto
type: Concept
source: Tietotermit
alternative label: datalager @sv
alternative label: kunskapsresurs @sv
definition: dataset or collection of datasets that contain information that is logically or physically related and that has been formed for a specific purpose @en
definition: tiettyä tarkoitusta varten muodostettu, loogisesti tai fyysisesti yhteenkuuluvien tietojen muodostama tietoaineisto tai tietoaineistojen kokoelma
definition: informationsmaterial som omfattar logiskt eller fysiskt sammanhängande uppgifter och som skapats för ett visst ändamål @sv
in scheme: Tietotermit
narrower: rekisteri
preferred label: information resource @en
preferred label: informationsresurs @sv
related: tietoaineisto
top concept of: Tietotermit

arkistointi
type: Concept
source: Tietotermit / Asiakirjahallinnan sanasto (Arkistolaitos, 2013)
alternative label: filing @en
alternative label: arkivläggning @sv
definition: process of adding records to an archive (records) @en
definition: prosessi, jonka tarkoituksena on liittää asiakirjoja osaksi arkistoa (asiakirjat)
definition: process med syfte att inordna handlingar i ett arkiv (handlingar) @sv
in scheme: Tietotermit
note: Archiving plays a central role in ensuring the usability of an archive, and it enables the record-specific management of materials, especially the screening of materials as well as their provision according to the Finnish Personal Data Act and the Act on the Openness of Government Activities. @en
note: Arkistoinnilla on keskeinen merkitys arkiston käytettävyyden varmistamisessa, ja se mahdollistaa aineiston asiakirjakohtaisen hallinnan, erityisesti aineiston seulonnan sekä julkisuus- ja henkilötietolainsäädännön mukaisen käyttöön antamisen.
note: Arkivering är avgörande för att säkerställa användbarheten av ett arkiv. Arkivering gör det möjligt att hantera individuella handlingar i materialet, speciellt i syfte att gallra arkivet eller göra materialet tillgängligt enligt offentlighets- och personuppgiftslagstiftningen. @sv
preferred label: archiving @en
preferred label: arkivering @sv
related: arkisto (asiakirjat)
related: asiakirja
top concept of: Tietotermit

tietokulttuuri
type: Concept
source: Tietotermit
definition: socially constructed behaviours and values that define how information manifests and the methods for its utilisation and management @en
definition: sosiaalisesti rakentunut käyttäytyminen sekä arvot, jotka määrittävät tiedon ilmenemismuotoja, sen hyödyntämisen tapoja ja tiedonhallinnan tapoja
definition: socialt uppbyggt beteende och värderingar som bestämmer i vilken form information förekommer samt hur information utnyttjas och hanteras @sv
in scheme: Tietotermit
preferred label: information culture @en
preferred label: informationskultur @sv
related: tieto
related: tiedonhallinta
top concept of: Tietotermit

tiedonlouhinta
type: Concept
source: Tietotermit
alternative label: tiedon louhinta
alternative label: tiedon rikastaminen
alternative label: tiedonrikastus
alternative label: datautvinning @sv
broader: tiedonhankinta
definition: data acquisition from a large dataset that contains structured data with methods that can identify the connections between different data @en
definition: tiedonhankinta laajasta, rakenteista dataa sisältävästä tietoaineistosta asioiden välisiä yhteyksiä tunnistavien menetelmien avulla
definition: informationsinsamling från ett större informationsmaterial med hjälp av metoder som identifierar saksamband @sv
in scheme: Tietotermit
note: The data mining process can utilise statistical methods, for example. @en
note: Tiedonlouhintaa voidaan tehdä esimerkiksi tilastollisin menetelmin.
note: Informationsutvinning kan göras till exempel med statistiska metoder. @sv
preferred label: data mining @en
preferred label: informationsutvinning @sv
related: tietoaineisto
related: rakenteinen data

koodisto
type: Concept
source: Tietotermit
narrower partitive: koodi (koodistossa)
definition: collection of codes that are used as metadata @en
definition: metatietoina käytettävien koodien kokoelma
definition: samling koder som används som metadata @sv
in scheme: Tietotermit
preferred label: code set @en
preferred label: koduppsättning @sv
related: metatieto
top concept of: Tietotermit

henkilötieto
type: Concept
source: Tietotermit
broader: tieto
definition: information that is connected to an identified or identifiable natural person @en
definition: tunnistettuun tai tunnistettavissa olevaan luonnolliseen henkilöön liittyvä tieto
definition: uppgift som kan hänföras till en identifierad eller identifierbar fysisk person @sv
in scheme: Tietotermit
note: According to the EU data protection regulation 2016/679, an identifiable natural person is someone who can be identified, directly or indirectly, in particular by reference to an identifier such as a name, an identification number, location data, an online identifier or to one or more factors specific to the physical, physiological, genetic, mental, economic, cultural or social identity of that natural person. @en
note: EU:n tietosuoja-asetuksen (2016/679) mukaan tunnistettavissa olevana pidetään luonnollista henkilöä, joka voidaan suoraan tai epäsuorasti tunnistaa erityisesti tunnistetietojen, kuten nimen, henkilötunnuksen, sijaintitiedon, verkkotunnisteiden taikka yhden tai useamman hänelle tunnusomaisen fyysisen, fysiologisen, geneettisen, psyykkisen, taloudellisen, kulttuurillisen tai sosiaalisen tekijän perusteella.
note: Enligt EU:s dataskyddsförordning (2016/679) är en identifierbar person en fysisk person som direkt eller indirekt kan identifieras särskilt med hänvisning till en identifierare som ett namn, ett identifikationsnummer, en lokaliseringsuppgift eller onlineidentifikatorer eller en eller flera faktorer som är specifika för den fysiska personens fysiska, fysiologiska, genetiska, psykiska, ekonomiska, kulturella eller sociala identitet. @sv
preferred label: personal data @en
preferred label: personuppgift @sv
related: rekisterinpitäjä
related: anonymisoitu tieto

ohjaustermi
type: Concept
source: Tietotermit
broader partitive: asiasanasto
alternative label: viittaustermi
definition: word or group of words in an index term list whose purpose is to guide the user into using a specific index term @en
definition: asiasanastossa esiintyvä sana tai sanaliitto, jonka tarkoitus on ohjata käyttämään tiettyä asiasanaa
definition: ord eller ordgrupp i ett ämnesordregister vars syfte är att leda till användningen av ett visst ämnesord @sv
in scheme: Tietotermit
preferred label: non-descriptor @en
preferred label: hänvisningsord @sv
related: asiasana
top concept of: Tietotermit

viisaus
type: Concept
source: Tietotermit
broader: tieto
definition: knowledge that is based on wide-ranging experience and learning from it and that can be used to evaluate, handle and solve complicated situations while taking any likely consequences and uncertainty factors into account @en
definition: laaja-alaiseen kokemukseen ja siitä oppimiseen perustuva tieto, jonka avulla voidaan arvioida, käsitellä ja ratkaista monimutkaisia tilanteita todennäköiset seuraukset ja epävarmuustekijät huomioiden
definition: kunskap som grundar sig på omfattande erfarenheter och lärdomar och som kan tillämpas för att bedöma, behandla och lösa komplicerade situationer med hänsyn till sannolika konsekvenser och osäkerhetsfaktorer @sv
in scheme: Tietotermit
note: Wisdom is based on a person's ability to internalise, refine and apply knowledge based on what they have experienced and learned. @en
note: Viisaus perustuu ihmisen kykyyn sisäistää, jalostaa ja soveltaa tietoa opitun ja koetun pohjalta.
note: Visdom grundar sig på människans förmåga att anamma, förädla och tillämpa lärdomar och upplevelser. @sv
preferred label: wisdom @en
preferred label: visdom @sv
related: ymmärrys
related: tiedon jalostaminen

tiedolla johtaminen
type: Concept
source: Tietotermit
broader partitive: tietojohtaminen
definition: part of information and knowledge management that aims to enact and facilitate knowledge-based decision-making @en
definition: tietojohtamisen osa-alue, joka tähtää tietoperustaiseen päätöksentekoon ja sen mahdollistamiseen
definition: delområde inom informationsledning med inriktning på beslutsfattande utifrån information @sv
in scheme: Tietotermit
preferred label: knowledge-based management @en
preferred label: ledning genom information @sv
related: tietoperustainen päätöksenteko
top concept of: Tietotermit

asiasana
type: Concept
source: Tietotermit
broader partitive: asiasanasto
alternative label: descriptor @en
alternative label: subject heading @en
definition: word or group of words in an index term list that is used to describe a topic @en
definition: asiasanastossa esiintyvä, aiheen kuvailussa käytettävä sana tai sanaliitto
definition: ord eller ordgrupp i ett ämnesordsregister som beskriver ett ämne @sv
in scheme: Tietotermit
preferred label: index term @en
preferred label: ämnesord @sv
related: ohjaustermi
top concept of: Tietotermit

saatavuus
type: Concept
source: Tietotermit
definition: characteristic of data that is used to indicate that the data in question can be utilised during the desired time and in the necessary manner @en
definition: tiedon ominaisuus, joka ilmentää sitä, että tieto on hyödynnettävissä haluttuna aikana ja vaaditulla tavalla
definition: egenskap hos en uppgift som innefattar att den kan utnyttjas vid önskad tidpunkt och på föreskrivet sätt @sv
in scheme: Tietotermit
note: If the use of or access to the data is subject to authorisation under certain conditions, the availability of the data must be evaluated in relation to the authorised activity. @en
note: Jos tiedon käyttö tai tietoon pääsy on luvallista vain tietyin ehdoin, tiedon saatavuutta arvioidaan suhteessa luvalliseen toimintaan.
note: Om användningen av eller tillgången till en uppgift tillåts endast enligt vissa villkor, bedöms tillgängligheten i förhållande till den tillåtna verksamheten. @sv
preferred label: availability @en
preferred label: tillgänglighet @sv
related: tiedonhallinta
related: tietoturvallisuus
top concept of: Tietotermit

tiedonhaku
type: Concept
source: Tietotermit
broader partitive: tiedonhankinta
alternative label: data retrieval @en
alternative label: tiedon haku
alternative label: datasökning @sv
definition: part of the data acquisition process where the desired information is searched from data sources @en
definition: tiedonhankinnan osa, jossa haluttua tietoa etsitään tietolähteistä
definition: del av informationsinsamling där man söker önskad information från informationskällor @sv
in scheme: Tietotermit
preferred label: information retrieval @en
preferred label: informationssökning @sv
related: asiasanasto
top concept of: Tietotermit

tiedonhankinta
type: Concept
source: Tietotermit
narrower partitive: tiedonhaku
alternative label: tiedon hankinta
alternative label: datainsamling @sv
definition: activity that aims to satisfy one's need for information @en
definition: toiminta, jonka tavoitteena on tyydyttää tiedontarve
definition: aktivitet, vars syfte är att tillgodose ett behov av information @sv
in scheme: Tietotermit
narrower: tiedonlouhinta
note: To ensure a successful data acquisition process, the relevant channels and information sources must be identified and utilised – for example, an expert in the field can act as an information source by participating in an interview or survey. @en
note: Onnistunut tiedonhankinta edellyttää relevanttien kanavien ja tietolähteiden tunnistamista ja hyödyntämistä – esimerkiksi alan asiantuntija voi toimia tietolähteenä haastattelun tai kyselyn välityksellä.
note: En lyckad informationsinsamling förutsätter att man kan identifiera och utnyttja relevanta kanaler och informationskällor – en sakkunnig inom ett område kan till exempel fungera som en informationskälla genom en intervju eller en enkät. @sv
preferred label: data acquisition @en
preferred label: informationsinsamling @sv
related: informaatiolukutaito
top concept of: Tietotermit

aineisto
type: Concept
source: Tietotermit
definition: identifiable entity that consists of objects or stored information @en
definition: yksilöitävissä oleva kokonaisuus, joka muodostuu esineistä tai tallennetuista tiedoista
definition: identifierbar helhet av föremål eller lagrade uppgifter @sv
in scheme: Tietotermit
narrower: tietoaineisto
note: Materials can be classified in different ways according to their intended purpose, content or publication channel, for example. @en
note: Aineistoja voidaan luokitella eri tavoin esimerkiksi käyttötarkoituksen, sisällön tai julkaisukanavan mukaan.
note: Material kan klassificeras på olika sätt, till exempel enligt syfte, innehåll eller publiceringskanal. @sv
preferred label: material @en
related: asiasanasto
related: metatieto
top concept of: Tietotermit

tietoala
type: Concept
source: Tietotermit
definition: sector that focuses on knowledge work services and solutions @en
definition: tietotyöhön liittyviin palveluihin ja ratkaisuihin keskittynyt toimiala
definition: bransch med fokus på tjänster och lösningar baserade på informationsarbete @sv
in scheme: Tietotermit
preferred label: information sector @en
preferred label: informationsbransch @sv
related: tietoasiantuntija
related: tietoammattilainen
related: tietotyö
top concept of: Tietotermit

asiakirjahallinto
type: Concept
source: Tietotermit
alternative label: document management @en
definition: part of management that is responsible for the management of records and the guidance and supervision of knowledge work that is related to any records @en
definition: hallinnon osa-alue, joka vastaa asiakirjahallinnasta ja asiakirjoihin liittyvän tietotyön ohjauksesta ja valvonnasta
definition: delområde inom administration som ansvarar för hantering av handlingar samt styrning och kontroll av informationsarbete i samband med handlingarna @sv
in scheme: Tietotermit
preferred label: records management @en
preferred label: dokumentförvaltning @sv
related: asiakirjahallinta
related: tietotyö
related: asiakirja
top concept of: Tietotermit

koodi (koodistossa)
type: Concept
source: Tietotermit
broader partitive: koodisto
definition: metadata format that conforms to a specific set of rules @en
definition: tiettyjen sääntöjen mukainen metatiedon esitysmuoto
definition: representation av metadata enligt vissa regler @sv
hidden label: code @en
hidden label: koodi
hidden label: kod @sv
in scheme: Tietotermit
narrower: tunnus (koodistossa)
note: The format of a piece of code can be selected based on its intended use. @en
note: Koodin esitysmuoto voidaan valita käyttötarkoituksen mukaan.
note: Representationen av en kod kan väljas enligt ändamål. @sv
preferred label: code (in a code set) @en
preferred label: kod (i en koduppsättning) @sv
related: metatieto
top concept of: Tietotermit

asiakirjahallinta
type: Concept
source: Tietotermit
broader partitive: tiedonhallinta
alternative label: document management @en
definition: area of information management that focuses on records data @en
definition: tiedonhallinnan osa-alue, jonka kohteena on asiakirjatieto
definition: delområde inom informationshantering som gäller dokumentinformation @sv
in scheme: Tietotermit
preferred label: records management @en
preferred label: dokumenthantering @sv
related: asiakirjahallinto
related: asiakirjatieto
top concept of: Tietotermit

tiedon elinkaari
type: Concept
source: Tietotermit
alternative label: information lifecycle @en
definition: phases that a piece of data goes through during its existence, from its creation to its possible disposal @en
definition: tiedon olemassaolon vaiheet tiedon synnystä sen mahdolliseen hävittämiseen asti
definition: informationens olika faser från uppkomst till eventuell makulering @sv
in scheme: Tietotermit
preferred label: data lifecycle @en
preferred label: informationens livscykel @sv
related: tiedon säilytys
related: tiedon hävittäminen
related: tiedonhallinta
top concept of: Tietotermit

tiedon johtaminen
type: Concept
source: Tietotermit
broader partitive: tietojohtaminen
definition: part of information and knowledge management where the prerequisites for the utilisation of information are maintained and developed with the management of information and information flows as well as with the supervision of information quality @en
definition: tietojohtamisen osa-alue, jossa tiedonhallinnalla, tietovirtoja ohjaamalla ja tiedon laatua tarkkailemalla ylläpidetään ja kehitetään tiedon hyödyntämisen edellytyksiä
definition: delområde inom informationsledning med syfte att upprätthålla och utveckla förutsättningar för att utnyttja information genom informationshantering, styrning av informationsflöden och uppföljning av informationens kvalitet @sv
in scheme: Tietotermit
preferred label: information management @en
preferred label: ledning av information @sv
related: tietovirta
related: tiedonhallinta
top concept of: Tietotermit

tietotyö
type: Concept
source: Tietotermit
definition: professional work that is connected to the production, processing or dissemination of information @en
definition: tiedon tuottamiseen, käsittelyyn tai välittämiseen liittyvä ammattityö
definition: yrkesarbete som anknyter till produktion, behandling eller förmedling av information @sv
in scheme: Tietotermit
preferred label: knowledge work @en
preferred label: informationsarbete @sv
related: tietoala
related: asiakirjahallinto
related: tietotyöntekijä
top concept of: Tietotermit

dokumentti
type: Concept
source: Tietotermit
broader partitive: tietoaineisto
definition: dataset or its part that is managed as a unit in information management @en
definition: tietoaineisto tai sen osa, jota tiedonhallinnassa käsitellään yksikkönä
definition: informationsmaterial som inom informationshantering behandlas som en enhet @sv
in scheme: Tietotermit
narrower: asiakirja
preferred label: document @en
preferred label: dokument @sv
related: tiedonhallinta
top concept of: Tietotermit

tietoprosessi
type: Concept
source: Tietotermit
definition: process that aims to produce, manage or share knowledge @en
definition: prosessi, jonka tavoitteena on tiedon tuottaminen, käsittely tai jakaminen
definition: process som syftar till att producera, ordna, förvara, utnyttja eller dela information @sv
in scheme: Tietotermit
preferred label: knowledge process @en
preferred label: informationsprocess @sv
related: tietovirta
related: informaatiotehokkuus
related: tiedonhallinta
top concept of: Tietotermit

liiketoimintatieto
type: Concept
source: Tietotermit
broader: tieto
definition: information that is used to support the decisions that concern the activities and development of an organisation @en
definition: organisaation toimintaa ja kehittämistä koskevien päätösten tukena käytettävä tieto
definition: kunskap som stöder en organisations verksamhets- och utvecklingsbeslut @sv
in scheme: Tietotermit
narrower: operatiivinen tieto
narrower: taktinen tieto
narrower: strateginen tieto
preferred label: business information @en
preferred label: affärskunskap @sv

tiedon hävittäminen
type: Concept
source: Tietotermit
broader partitive: tiedonhallinta
definition: part of data management whose purpose is the removal and destruction of saved data at the final phase of its lifecycle so that it cannot be restored @en
definition: tiedonhallinnan osa-alue, jonka tarkoituksena on tallennetun tiedon poistaminen ja tuhoaminen tiedon elinkaaren viimeisessä vaiheessa niin, ettei sen palauttaminen ole mahdollista
definition: delområde inom informationshantering med syfte att förstöra information i slutet av informationens livslängd på så sätt att informationen inte kan återställas @sv
in scheme: Tietotermit
preferred label: data disposal @en
preferred label: makulering av information @sv
related: tiedon elinkaari
related: tiedon säilytys
top concept of: Tietotermit

käyttölupa
type: Concept
source: Tietotermit
alternative label: right of use @en
alternative label: lisenssi
definition: permission to utilise a target that is protected by intellectual property rights, the right to data protection or some other right in accordance with its terms of use @en
definition: lupa hyödyntää immateriaalioikeuden, oikeuden tietosuojaan tai muun oikeuden suojaamaa kohdetta käyttöehtojen mukaisesti
definition: tillstånd att utnyttja ett objekt som skyddas av immateriell rätt, dataskydd eller annan rätt enligt objektets användarvillkor @sv
in scheme: Tietotermit
preferred label: licence @en
preferred label: licens @sv
related: immateriaalioikeus
related: tietosuoja
related: käyttöehdot
top concept of: Tietotermit

tietoturvallisuus
type: Concept
source: Tietotermit
alternative label: tietoturva
alternative label: datasäkerhet @sv
definition: measures that are used to ensure the availabiity, integrity and confidentiality of data @en
definition: tietojen saatavuuden, eheyden ja luottamuksellisuuden varmistamiseksi toteutettavat toimenpiteet
definition: åtgärder som genomförs för att säkerställa tillgängligheten, integriteten och konfidentialiteten hos vissa uppgifter eller viss information @sv
in scheme: Tietotermit
note: "The term ""information security"" is used to refer to the measures that ensure e.g. operational security, communications security, hardware and software security as well as dataset security. These measures can be administrative, technical or some other type in nature and can include individual actions, such as participation in training and studying, or communal measures, such as creating a culture of information security that is based on the common values of a value network." @en
note: Tietoturvallisuudella tarkoitetaan esimerkiksi toiminnan turvallisuuden, tietoliikenneturvallisuuden, laitteisto- ja ohjelmistoturvallisuuden sekä tietoaineistoturvallisuuden varmistavia toimenpiteitä. Toimenpiteet voivat olla hallinnollisia, teknisiä tai muun tyyppisiä, esimerkiksi käyttäjän toimenpiteitä kuten kouluttautuminen ja opiskelu tai yhteisöjen toimenpiteitä kuten yhteisiin arvoihin perustuvan tietoturvallisuuskulttuurin muodostaminen arvoverkostossa.
note: Med informationssäkerhet avses till exempel åtgärder som säkerställer säkerheten hos en verksamhet, hos datakommunikation, hos maskin- eller programvara eller hos ett informationsmaterial. Åtgärderna kan vara administrativa, tekniska eller av annan typ, till exempel användaråtgärder, som utbildning och studier, eller gruppåtgärder, som skapandet av en datasäkerhetskultur utifrån gemensamma värderingar i ett värdenätverk. @sv
preferred label: information security @en
preferred label: informationssäkerhet @sv
related: luottamuksellisuus
related: eheys
related: saatavuus
top concept of: Tietotermit

tietosisältö
type: Concept
source: Tietotermit
alternative label: datainnehåll @sv
definition: information that is contained in a dataset @en
definition: tietoaineiston sisältämät tiedot
definition: uppgifter i ett informationsmaterial @sv
in scheme: Tietotermit
note: Metadata that is used to describe a dataset is not always considered as constituting a part of its information content. @en
note: Tietoaineistoa kuvaavia metatietoja ei aina tulkita osaksi tietosisältöä.
note: Metadata som beskriver ett informationsmaterial räknas inte alltid som en del av informationsinnehållet. @sv
preferred label: information content @en
preferred label: informationsinnehåll @sv
related: tieto
related: asiakirjatieto
related: tietoaineisto
top concept of: Tietotermit

immateriaalioikeus
type: Concept
source: Tietotermit
alternative label: aineeton oikeus
alternative label: immateriell rättighet @sv
definition: fixed-term right that limits the use and utilisation of e.g. a name, a trademark or the result of an intellectual work @en
definition: määräaikainen oikeus rajoittaa esimerkiksi nimen, tunnusmerkin tai henkisen työn tuloksen käyttöä ja hyödyntämistä
definition: tidsbegränsad rätt som begränsar användningen och utnyttjandet av till exempel namn, varumärken eller resultat av intellektuellt arbete @sv
in scheme: Tietotermit
narrower: tekijänoikeus
narrower: lähioikeus
note: Intellectual property rights include copyrights and similar neighbouring rights as well as various industrial rights, such as patent rights, trademark rights and commercial name rights. @en
note: Immateriaalioikeuksia ovat tekijänoikeudet ja niitä muistuttavat lähioikeudet sekä erilaiset teollisoikeudet, kuten patenttioikeus, tavaramerkkioikeus ja toiminimioikeus.
note: Immateriella rättigheter omfattar upphovsrätt och närstående rättigheter samt diverse industriella rättigheter, som patenträtt, varumärkesrätt och firmarätt. @sv
preferred label: intellectual property right @en
preferred label: immateriell rätt @sv
related: käyttöehdot
related: käyttölupa
top concept of: Tietotermit

ymmärrys
type: Concept
source: Tietotermit
broader: tieto
definition: information that explains the causes and connections between different matters and that can be refined into wisdom @en
definition: asioiden syitä ja yhteyksiä selittävä tieto, josta voidaan jalostaa viisautta
definition: kunskap om orsaker och associationer som kan förädlas till visdom @sv
in scheme: Tietotermit
narrower: yhteinen ymmärrys
preferred label: understanding @en
preferred label: förståelse @sv
related: tiedon jalostaminen
related: tietämys
related: viisaus

aineeton pääoma
type: Concept
source: Tietotermit
broader partitive: tietopääoma
alternative label: immateriellt kapital @sv
definition: organisation's capital that consists of resources that are intellectual in nature but potentially useful and productive @en
definition: organisaation pääoma, joka koostuu luonteeltaan aineettomista, mutta potentiaalisesti hyödyllisistä ja tuottavista resursseista
definition: en organisations kapital som består av immateriella men eventuellt användbara och lönsamma resurser @sv
in scheme: Tietotermit
narrower: inhimillinen pääoma
narrower: suhdepääoma
narrower: rakennepääoma
note: The capital of an organisation consists of tangible resources, purely monetary resources (as well as their derivatives such as receivables) and intellectual capital. In order to be classified as capital, intellectual capital must possess some presumed amount of value at some future phase. @en
note: Organisaation pääoma muodostuu aineellisista resursseista, puhtaasti rahallisista resursseista (sekä näiden johdannaisista kuten saatavista) ja aineettomasta pääomasta. Täyttääkseen pääoman määritelmän aineettomalla pääomalla tulee olla oletettavaa arvoa jossain tulevaisuuden vaiheessa.
note: En organisations kapital består av materiella resurser, ekonomiska resurser (inklusive bland annat fordringar) och intellektuellt kapital. Intellektuellt kapital bör har ett antaget värde någon gång i framtiden för att uppfylla definitionen på kapital. @sv
preferred label: intellectual capital @en
preferred label: intellektuellt kapital @sv
top concept of: Tietotermit

tiedon jalostaminen
type: Concept
source: Tietotermit
definition: activity that utilises different methods to improve the usability of some form of data, i.e. the formation of information, knowledge, understanding or wisdom @en
definition: toiminta, jossa eri menetelmillä pyritään tiedon parempaan hyödynnettävyyteen eli informaation, tietämyksen, ymmärryksen tai viisauden muodostamiseen
definition: aktivitet, där man genom olika metoder försöker förädla data till en bättre användningsgrad, dvs. till information, kunskap, förståelse och visdom @sv
in scheme: Tietotermit
preferred label: data refinement @en
preferred label: förädling av data @sv
related: ymmärrys
related: tietämys
related: informaatio
related: viisaus
top concept of: Tietotermit

tietämys
type: Concept
source: Tietotermit
broader partitive: inhimillinen pääoma
broader: tieto
definition: information that the recipient has interpreted, approved and internalised and that can then be refined into comprehension @en
definition: vastaanottajan tulkintansa tuloksena hyväksymä ja sisäistämä tieto, josta voidaan jalostaa ymmärrystä
definition: information som tolkats, accepterats och anammats av mottagaren och som kan förädlas till förståelse @sv
in scheme: Tietotermit
preferred label: knowledge @en
preferred label: kunskap @sv
related: ymmärrys
related: tiedon jalostaminen
related: informaatio

asiakirjatieto
type: Concept
source: Tietotermit
broader partitive: asiakirja
definition: information that is part of the information content or metadata of a record @en
definition: asiakirjan tietosisältöön tai metatietoihin kuuluva tieto
definition: information om innehållet i eller metadata om en handling @sv
in scheme: Tietotermit
preferred label: records data @en
preferred label: dokumentinformation @sv
related: asiakirjahallinta
related: metatieto
related: tietosisältö
top concept of: Tietotermit

asiakirja
type: Concept
source: Tietotermit
narrower partitive: asiakirjatieto
broader: dokumentti
definition: document that has been made or received in connection with the activities of an organisation or private individual and which is then stored as evidence and information property @en
definition: dokumentti, joka on laadittu tai vastaanotettu jonkin organisaation tai yksityisen henkilön toiminnan yhteydessä tai toimintaa varten ja jota tämän jälkeen säilytetään todisteena ja tieto-omaisuutena
definition: dokument som har upprättats eller mottagits i samband med en organisations eller en enskild persons verksamhet och som sedan förvaras som bevis och som en informationstillgång @sv
in scheme: Tietotermit
note: A record can contain written text, images or sounds. A record must be reproducible. It can be saved digitally or in paper form. The storage of records is often necessitated by legal requirements or business needs. @en
note: Asiakirja voi sisältää kirjoitettua tekstiä, kuvaa tai ääntä. Asiakirjan tulee olla toisinnettavissa. Se voidaan tallentaa sähköisessä tai paperimuodossa. Asiakirjojen säilytyksen taustalla ovat usein lailliset velvoitteet tai liiketoimien tarpeet.
note: En handling kan innehålla skriven text, bild och ljud. En handling bör kunna reproduceras. En handling kan lagras både elektroniskt och i pappersform. Handlingar förvaras oftast på grund av lagliga förpliktelser eller affärsbehov. @sv
preferred label: record @en
preferred label: handling @sv
related: asiakirjahallinto
related: asiarekisteri
related: arkistointi

rakenteinen data
type: Concept
source: Tietotermit
alternative label: rakenteellinen data
alternative label: rakenteellinen tieto
alternative label: rakenteinen tieto
alternative label: strukturella data @sv
broader: data (koneluettava tieto)
definition: data (machine-readable information) that has a metadata-defined structure that can be used to parse the data @en
definition: data (koneluettava tieto), johon on liitetty metatietojen avulla määritetty rakenne, jonka avulla data voidaan jäsentää
definition: data (maskinläsbara uppgifter) som har en struktur definierad med hjälp av metadata för analys av ifrågavarande data @sv
in scheme: Tietotermit
narrower: linkitetty data
note: Data can be produced in a structured form in many ways, for example by following instructions on how information should be entered into an electronic form that contains predefined metadata. Structured data can also be created by structuring unstructured data. @en
note: Dataa voidaan tuottaa rakenteisessa muodossa monin tavoin, esimerkiksi kirjaamalla annettujen ohjeiden mukaisesti tietoja sähköisiin lomakkeisiin, joihin metatietoja on etukäteen määritelty. Rakenteista dataa voidaan tuottaa myös rakenteetonta dataa rakenteistamalla.
note: Data kan skapas i strukturerad form på flera sätt, till exempel genom att registrera uppgifter i elektroniska formulär med förhandsbestämda metadata enligt givna anvisningar. Strukturerade data kan även skapas genom att strukturera ostrukturerade data. @sv
preferred label: structured data @en
preferred label: strukturerade data @sv
related: rakenteistaminen
related: metatieto
related: tiedonlouhinta

asiasanasto
type: Concept
source: Tietotermit
narrower partitive: ohjaustermi
narrower partitive: asiasana
alternative label: keyword list @en
alternative label: list of subject headings @en
alternative label: ämnesordlista @sv
broader: sanasto
definition: glossary that is used in the thematic description and retrieval of data @en
definition: sanasto, jota käytetään aineiston aiheen kuvailussa ja tiedonhaussa
definition: ordlista som används för beskrivning av ett material och för informationssökning @sv
in scheme: Tietotermit
narrower: tesaurus
note: Index term lists are usually controlled glossaries. Open index term lists are called folksonomies. @en
note: Asiasanastot ovat tavallisesti kontrolloituja sanastoja. Avoimia asiasanastoja kutsutaan folksonomioiksi.
note: Ämnesordregister är ofta kontrollerade ordlistor. Öppna ämnesordsregister kallas för folksonomier. @sv
preferred label: index term list @en
preferred label: ämnesordsregister @sv
related: aineisto
related: tiedonhaku

rekisteri
type: Concept
source: Tietotermit
broader: tietovaranto
definition: information resource whose purpose is to contain information that is essential for a specific use on its registered targets in an organised manner @en
definition: tietovaranto, jonka tarkoituksena on sisältää tietyn käyttötarkoituksen kannalta oleelliset tiedot rekisteröinnin kohteista järjestäytyneellä tavalla
definition: informationsresurs som omfattar organiserade uppgifter om registrerade objekt som är väsentliga för ett visst syfte @sv
in scheme: Tietotermit
narrower: lähderekisteri
narrower: asiarekisteri
narrower: erityisrekisteri
narrower: perusrekisteri
note: Typically, a register is created for a single purpose and its maintenance strives for coverage and up-to-dateness. @en
note: Tyypillisesti rekisteri luodaan tiettyä käyttötarkoitusta varten ja sen ylläpidossa pyritään kattavuuteen ja ajantasaisuuteen.
note: Ett register skapas vanligtvis för ett visst syfte, och man försöker upprätthålla det som heltäckande och aktuellt. @sv
preferred label: register @en
related: rekisterinpitäjä

käyttöehdot
type: Concept
source: Tietotermit
alternative label: terms and conditions @en
alternative label: användningsvillkor @sv
definition: terms concerning the utilisation of a target that is protected by intellectual property rights, the right to data protection or some other right @en
definition: ehdot, jotka koskevat immateriaalioikeuden, oikeuden tietosuojaan tai muun oikeuden suojaaman kohteen hyödyntämistä
definition: villkor som gäller utnyttjandet av ett objekt som skyddas av immateriell rätt, dataskydd eller annan rätt. @sv
in scheme: Tietotermit
preferred label: terms of use @en
preferred label: användarvillkor @sv
related: avoin data
related: immateriaalioikeus
related: tietosuoja
related: avoin tieto
related: käyttölupa
top concept of: Tietotermit

informaatio
type: Concept
source: Tietotermit
broader partitive: tietopääoma
broader: tieto
definition: interpretable data that can be refined into knowledge @en
definition: tulkittavissa oleva tieto, josta voidaan jalostaa tietämystä
definition: data, vars innebörd kan tolkas och förädlas till kunskap @sv
in scheme: Tietotermit
narrower: sisältö (informaatio)
preferred label: information @en
related: data (alimman jalostusasteen tieto)
related: tiedon jalostaminen
related: tietämys

yhteentoimivuus
type: Concept
source: Tietotermit
alternative label: tietojärjestelmien yhteentoimivuus
alternative label: interoperabilitet mellan informationssystem @sv
definition: ability of actors, processes and information systems that are connected to an activity to act and communicate together in such a way or scope that they can routinely use and understand each other's data @en
definition: toimintaan liittyvien toimijoiden, prosessien ja tietojärjestelmien kyky toimia ja viestiä keskenään sellaisella tavalla tai siinä laajuudessa, että ne voivat rutiininomaisesti käyttää ja ymmärtää toistensa tietoja
definition: förmågan hos informationssystem, processer och aktörer som berör en verksamhet att fungera och kommunicera sinsemellan på så sätt eller i sådan omfattning att de rutinmässigt kan använda och förstå varandras information @sv
in scheme: Tietotermit
narrower: tekninen yhteentoimivuus
narrower: oikeudellinen yhteentoimivuus
narrower: organisatorinen yhteentoimivuus
narrower: semanttinen yhteentoimivuus
note: Interoperability can be technical, semantic, organisational or legal in nature. @en
note: Yhteentoimivuus voi olla luonteeltaan teknistä, semanttista, organisatorista tai oikeudellista.
note: Interoperabilitet kan vara teknisk, semantisk, organisatorisk eller rättslig. @sv
preferred label: interoperability @en
preferred label: interoperabilitet @sv
related: tietojärjestelmä
top concept of: Tietotermit

tietojohtaminen
type: Concept
source: Tietotermit
narrower partitive: tiedon johtaminen
narrower partitive: tiedolla johtaminen
alternative label: kunskapsledning @sv
definition: management that promotes an organisation's ability to create value with information, knowledge and expertise @en
definition: johtaminen siten, että edistetään organisaation kykyä luoda arvoa tiedolla ja osaamisella
definition: ledning som främjar organisationens förmåga att skapa mervärde genom information och kompetens @sv
in scheme: Tietotermit
note: The goal of knowledge management is not only to utilise the information and knowledge that are contained and achievable within an organisation, but also to ensure that the information and knowledge that will be needed in the future are located or can be achieved within the organisation. Knowledge management can sometimes be used to refer to information management or knowledge-based management. @en
note: Tietojohtamisella pyritään paitsi organisaatiossa olevan ja organisaation saavutettavissa olevan tiedon hyödyntämiseen myös sen varmistamiseen, että organisaatiossa tai sen saavutettavissa on tulevaisuudessa tarvittava tieto. Tietojohtamisella voidaan joskus tarkoittaa tiedon johtamista tai tiedolla johtamista.
note: Utöver att utnyttja information som finns inom och tillgänglig för en organisation strävar man genom informationsledning efter att säkra den information som behövs även i framtiden. I vissa fall kan man använda informationsledning i betydelsen ledning av information eller ledning genom information. @sv
preferred label: knowledge management @en
preferred label: informationsledning @sv
related: tietotilinpäätös
related: tietostrategia
related: tietojohtaminen (tutkimusala)
top concept of: Tietotermit

data (koneluettava tieto)
type: Concept
source: Tietotermit
alternative label: koneluettava tieto
alternative label: maskinläsbara uppgifter @sv
broader: tieto
definition: information that has been formatted to be readable by machines @en
definition: tieto koneellisesti käsiteltävässä muodossa
definition: uppgifter i maskinläsbar form @sv
in scheme: Tietotermit
narrower: avoin data
narrower: omadata (data)
narrower: rakenteeton data
narrower: massadata
narrower: raakadata
narrower: rakenteinen data
note: The usability of data can be improved by e.g. structuring the data or adding any relevant metadata. @en
note: Datan hyödynnettävyyttä voidaan parantaa esimerkiksi rakenteistamalla tai metatietojen avulla.
note: Data kan utnyttjas bättre genom att strukturera dem eller lägga till metadata till dem. @sv
preferred label: data (machine-readable information) @en
preferred label: data (maskinläsbara uppgifter) @sv

lukutaito
type: Concept
source: Tietotermit
broader partitive: monilukutaito
definition: ability to access, interpret, understand, edit, produce and present information as well as evaluate the utility and validity of information @en
definition: taito hankkia, tulkita, ymmärtää, muokata, tuottaa ja esittää tietoa sekä arvioida tiedon hyödyllisyyttä ja paikkansapitävyyttä
definition: färdighet att skaffa, tolka, förstå, bearbeta, producera och presentera information samt att bedöma informationens användbarhet och riktighet @sv
in scheme: Tietotermit
narrower: medialukutaito
narrower: verkkolukutaito
narrower: informaatiolukutaito
narrower: digitaalinen lukutaito
narrower: visuaalinen lukutaito
note: Traditionally, the term literacy is only used to refer to the ability to interpret written text, but from a wider perspective, the definition of literacy covers various different skills that are related to the understanding, evaluation and production of information. @en
note: Perinteisesti lukutaidolla tarkoitetaan vain kykyä tulkita kirjoitettua tekstiä, mutta laajemmin ymmärrettynä lukutaito kattaa määritelmän mukaisesti paljon erilaisia tiedon ymmärtämiseen, arviointiin ja tuottamiseen liittyviä taitoja.
note: Med läskunnighet menar man traditionellt sett endast färdigheten att tolka skriven text, men mer allmänt sett omfattar läskunnighet enligt definitionen flera färdigheter som rör förståelse, bedömning och produktion av information. @sv
preferred label: literacy @en
preferred label: läskunnighet @sv
top concept of: Tietotermit

tiedon säilytys
type: Concept
source: Tietotermit
broader partitive: tiedonhallinta
definition: part of data management whose purpose is to ensure the accuracy and integrity of the data and its origin data during every phase of the data's lifecycle before the planned disposal of the data @en
definition: tiedonhallinnan osa-alue, jonka tarkoituksena on varmistaa tiedon ja tiedon alkuperää koskevien tietojen oikeellisuus ja eheys tiedon elinkaaren kaikissa vaiheissa ennen tiedon suunnitelmallista hävittämistä
definition: delområde inom informationshantering med syfte att försäkra korrektheten och integriteten av viss information och uppgifterna om dess ursprung i alla faser av informationens livscykel före systematisk makulering av informationen @sv
in scheme: Tietotermit
narrower: tiedon määräaikaissäilytys
narrower: tiedon pysyväissäilytys
preferred label: data storage @en
preferred label: förvaring av information @sv
related: tiedon elinkaari
related: eheys
related: tiedon hävittäminen
top concept of: Tietotermit

metatieto
type: Concept
source: Tietotermit
alternative label: metainformation @sv
broader: tieto
definition: information that describes the context, contents or structure of a piece of data and also helps guide and document its utilisation and management @en
definition: tieto, joka kuvaa aineiston kontekstia, sisältöä tai rakennetta sekä ohjaa ja dokumentoi sen käsittelyä ja hallintaa
definition: data (potentiell information) om materialets kontext, innehåll eller struktur som styr och dokumenterar materialets användning och hantering @sv
in scheme: Tietotermit
note: Metadata can be used by both humans and machines. @en
note: Metatiedon käyttäjiä voivat olla sekä ihmiset että koneet.
note: Både människor och maskiner kan använda metadata. @sv
preferred label: metadata @en
related: aineisto
related: metatietosanasto
related: koodi (koodistossa)
related: koodisto
related: asiakirjatieto
related: rakenteinen data

käsite
type: Concept
source: Terminologian sanasto (TSK 36, 2006)
definition: unit of information that consists of a unique combination of characteristics @en
definition: tiedon yksikkö, joka muodostuu käsitepiirteiden ainutkertaisesta yhdistelmästä
definition: kunskapsenhet som skapats genom en unik kombination av kännetecken @sv
in scheme: Tietotermit
narrower: yksilökäsite
narrower: yleiskäsite
note: Concepts are used to parse information. Concepts are not necessarily language-specific, but societal and cultural factors often result in the creation of different conceptual divisions in different languages. Not every concept necessarily has an established linguistic expression that is attached to it. @en
note: Käsitteitä käytetään tiedon jäsentämiseen. Käsitteet eivät välttämättä ole kielisidonnaisia, mutta yhteiskunta- ja kulttuurisidonnaiset tekijät vaikuttavat usein erilaisen käsitejaon syntymiseen eri kielissä. Kaikille käsitteille ei välttämättä ole vakiintunut niitä vastaavaa kielellistä ilmausta.
note: Begrepp används för att strukturera vetande. Begrepp är inte nödvändigtvis bundna till ett visst språk. De påverkas dock av sociala eller kulturbetingade förutsättningar som ofta leder till skilda indelningar i olika språk. Ett begrepp måste inte nödvändigtvis ha något motsvarande språkligt uttryck. @sv
preferred label: concept @en
preferred label: begrepp @sv
related: tarkoite
related: terminologinen sanasto
related: käsitepiirre
related: ontologia
top concept of: Tietotermit

tietoaineisto
type: Concept
source: Tietotermit
narrower partitive: dokumentti
alternative label: data set @en
alternative label: datauppsättning @sv
broader: aineisto
definition: data that contains information that has been stored on some storage medium @en
definition: aineisto, joka sisältää jollekin tietovälineelle tallennettuja tietoja
definition: uppgifter lagrade på ett datamedium, på papper eller på andra medium @sv
in scheme: Tietotermit
note: Datasets can stored both electronically and on paper. The information that a dataset contains is called information content. @en
note: Tietoaineisto voi olla sekä sähköisessä että paperimuodossa. Tietoaineiston sisältämiä tietoja kutsutaan tietosisällöksi.
note: Informationsmaterial kan finnas både i elektronisk form (då är det vanligare att tala om en datauppsättning) och pappersform. Uppgifterna i ett informationsmaterial kallas för informationsinnehåll. @sv
preferred label: dataset @en
preferred label: informationsmaterial @sv
related: arkisto (säilytystila)
related: tieto
related: tietovaranto
related: tiedonlouhinta
related: linkitetty data
related: tietosisältö

sanasto
type: Concept
source: Tietotermit
alternative label: vocabulary @en
definition: entity that contains a list of words or terms that are used in a certain language or environment as well as other pertinent information that is needed for the purposes of the list in question @en
definition: jossakin kielessä tai ympäristössä käytettyjen sanojen tai termien luettelo sekä muiden kyseisen luettelon käyttötarkoituksen kannalta oleellisten tietojen muodostama kokonaisuus
definition: helhet som omfattar en förteckning över godkända ord eller termer i ett visst språk eller sammanhang samt andra uppgifter som är väsentliga för användningen av förteckningen @sv
in scheme: Tietotermit
narrower: metatietosanasto
narrower: terminologinen sanasto
narrower: asiasanasto
narrower: kontrolloitu sanasto
narrower: avoin sanasto
narrower: ontologia
note: A glossary can contain e.g. definitions, examples or descriptions of the interrelationships between its terms. @en
note: Sanastot voivat sisältää esimerkiksi määritelmiä, esimerkkejä tai kuvauksia termien keskinäisistä suhteista.
note: Ordlistor kan till exempel innehålla definitioner, exempel eller beskrivningar av inbördes förhållanden mellan termer. @sv
preferred label: glossary @en
preferred label: ordlista @sv
related: termi
related: tieto
top concept of: Tietotermit

tiedonhallinta
type: Concept
source: Tietotermit
narrower partitive: asiakirjahallinta
narrower partitive: sisällönhallinta
narrower partitive: tiedon säilytys
narrower partitive: tiedon hävittäminen
alternative label: data management @en
alternative label: knowledge management @en
alternative label: datahantering @sv
definition: act of arranging knowledge processes in a way that the availability, discoverability and utilisation of data for different purposes can be ensured for the lifespan of the data @en
definition: tietoprosessien järjestäminen siten, että tietojen saatavuus, löydettävyys ja hyödynnettävyys eri tarkoituksiin pyritään varmistamaan tiedon elinkaaren ajan
definition: ordnande av informationsprocesser på så sätt att man i mån av möjlighet kan säkerställa att viss information behålls tillgänglig och kan hittas och utnyttjas under hela dess livslängd @sv
in scheme: Tietotermit
preferred label: information management @en
preferred label: informationshantering @sv
related: tietotilinpäätös
related: tiedon elinkaari
related: tiedon johtaminen
related: dokumentti
related: tietoprosessi
related: tietokulttuuri
related: saatavuus
top concept of: Tietotermit

tieto
type: Concept
source: Tietotermit
definition: string of characters, message, fact, observation, interpretation or impression @en
definition: merkkijono, viesti, tosiasia, havainto, tulkinta tai käsitys
definition: teckensträng, meddelande, faktum, observation, tolkning eller åsikt @sv
in scheme: Tietotermit
narrower: data (alimman jalostusasteen tieto)
narrower: suojaamaton tieto
narrower: salassa pidettävä tieto
narrower: hiljainen tieto
narrower: avoin tieto
narrower: ymmärrys
narrower: data (koneluettava tieto)
narrower: master data
narrower: tietämys
narrower: informaatio
narrower: metatieto
narrower: julkinen tieto
narrower: suojattu tieto
narrower: liiketoimintatieto
narrower: henkilötieto
narrower: anonymisoitu tieto
narrower: viisaus
narrower: eksplisiittinen tieto
note: There is no one term in English that can be used to describe this concept. When the concept is assessed from the perspective of the value chain, it can be divided into the following different levels: data (potential information), information, knowledge, understanding and wisdom. The appropriate term depends on the context. @en
note: Tiedolla voidaan viitata monenlaisiin asioihin, ja usein eri käyttöyhteyksissä sillä tarkoitetaankin hieman eri asioita. Kun tietoa tarkastellaan arvoketjun näkökulmasta, eritasoisina tiedon tyyppeinä voidaan erotella data (alimman jalostusasteen tieto), informaatio, tietämys, ymmärrys ja viisaus. Tulkittavissa olevaa tietoa, esimerkiksi uutistekstiä tai merkkiääntä, kutsutaan tällöin informaatioksi.
note: En uppgift kan syfta på många olika saker och kan betyda olika saker i olika sammanhang. Innebörden av en uppgift, till exempel ett nyhetsmeddelande eller en signal, kan tolkas och bli information. Den finska termen tieto kan beroende på sammanhanget betyda data (potentiell information), information, kunskap, förståelse eller visdom. @sv
preferred label: knowledge, information and data @en
preferred label: uppgift @sv
related: tietopolitiikka
related: tietokulttuuri
related: tietoteollisuus
related: tietoaineisto
related: tietotalous
related: sanasto
related: tietosisältö
top concept of: Tietotermit

Tietotermit
type: ConceptScheme
creator: Lingsoft Language Services Oy @en
creator: Ministry of Finance @en
creator: Tietojohtaminen ry @en
creator: Valtiovarainministeriö
creator: Finansministeriet @sv
creator: Lingsoft Language Services Ab @sv
description: The concepts of information management constitute a central part of the language that is used in all information-based activities. The Information Terms terminological glossary has been created for the needs of information management and is meant for widespread use. It contains around 140 information terms that are used in information management, including the related definitions and conceptual diagrams. The conceptual diagrams include links to the term pages themselves. The glossary has been translated into Swedish and English. The purpose of the Information Terms glossary is to help clarify information-oriented communications, support information management and encourage interoperability in a rapidly changing information environment. The Ministry of Finance initiated the creation of the glossary project, and it was implemented by Lingsoft Language Services Oy and Tietojohtaminen ry. The glossary has been reviewed by information management experts from both public administration and the private sector. The glossary is maintained in parallel with the Public Administration Recommendations (JHS recommendations). Users are encouraged to submit their development suggestions through Finto’s feedback form or alternatively by email. @en
description: Tiedonhallinnan käsitteet ovat keskeinen osa kielenkäyttöä kaikessa tietoon perustuvassa toiminnassa. Tietotermit on laajaan käyttöön tarkoitettu tiedonhallinnan terminologinen sanasto. Se sisältää noin 140 tiedonhallinnan tietotermiä määritelmineen ja käsitekaavioineen. Käsitekaaviot sisältävät linkkejä varsinaisiin käsitesivuihin. Sanasto sisältää käännökset ruotsiksi ja englanniksi. Tietotermien tarkoitus on selkeyttää viestintää ja tukea tiedonhallintaa ja yhteentoimivuutta nopeasti muuttuvassa tietoympäristössä. Valtiovarainministeriön sanastoprojektin ovat toteuttaneet Lingsoft Language Services Oy ja Tietojohtaminen ry. Sanaston kommentointiin on osallistunut sekä julkisen hallinnon että yksityisen sektorin tiedonhallinnan asiantuntijoita. Sanastoa ylläpidetään rinnan julkisen hallinnon suositusten (JHS) kanssa. Käyttäjiä kannustetaan tekemään kehittämisehdotuksia Finton palautesivun kautta tai sähköpostitse.
description: Begreppen inom informationshantering är centrala för språkbruket i all informationsbaserad verksamhet. Informationstermer är en terminologisk ordlista inom informationshantering avsedd för allmänt bruk. Ordlistan innehåller cirka 140 termer inom informationshantering med definitioner och begreppsdiagram. Begreppsdiagrammen omfattar länkar till respektive definitioner. Ordlistan har översatts till svenska och engelska. Syftet med ordlistan är att förtydliga kommunikation samt stöda informationshantering och interoperabilitet i en informationsmiljö som förändras snabbt. Projektet med ordlistan initierades av Finansministeriet och genomfördes av Lingsoft Language Services Ab och Tietojohtaminen ry. Sakkunniga inom informationshantering från både den offentliga förvaltningen och den privata sektorn har gett sina synpunkter på ordlistan. Ordlistan upprätthålls tillsammans med JHS-rekommendationerna för den offentliga förvaltningen. Användare uppmuntras till att lägga fram utvecklingsförslag via Fintos responsformulär eller med e-post. @sv
language: eng
language: fin
language: swe
license: http://creativecommons.org/licenses/by/4.0/
modified: 2018-10-23T07:35:39+00:00
has top concept: tiedonhankinta
has top concept: arkisto (säilytystila)
has top concept: termi
has top concept: tietoasiantuntija
has top concept: aineisto
has top concept: tietovirta
has top concept: tarkoite
has top concept: immateriaalioikeus
has top concept: tietopolitiikka
has top concept: tietoala
has top concept: omadata (periaate)
has top concept: tieto
has top concept: tietoammattilainen
has top concept: tietotilinpäätös
has top concept: tietopääoma
has top concept: tietosuoja
has top concept: rekisterinpitäjä
has top concept: asiakirjahallinto
has top concept: kyvykkyys
has top concept: koodi (koodistossa)
has top concept: asiakirjahallinta
has top concept: luottamuksellisuus
has top concept: tietostrategia
has top concept: kokonaisarkkitehtuuri (rakenne)
has top concept: käyttöehdot
has top concept: tiedon elinkaari
has top concept: aineeton pääoma
has top concept: rakenteistaminen
has top concept: tiedon johtaminen
has top concept: tietotyö
has top concept: sisällönhallinta
has top concept: dokumentti
has top concept: tiedon jalostaminen
has top concept: eheys
has top concept: tietoperustainen päätöksenteko
has top concept: luokka
has top concept: kokonaisarkkitehtuuri (kuvaus)
has top concept: lukutaito
has top concept: tietojohtaminen (tutkimusala)
has top concept: tiedon säilytys
has top concept: tietoverkko
has top concept: paikkatieto
has top concept: käsitepiirre
has top concept: tietotyöntekijä
has top concept: tietoprosessi
has top concept: tietovaranto
has top concept: arkistointi
has top concept: tietokulttuuri
has top concept: koodisto
has top concept: tilannekuva
has top concept: monilukutaito
has top concept: tiedon hävittäminen
has top concept: asiakirjatieto
has top concept: yhteentoimivuus
has top concept: informaatiotehokkuus
has top concept: tiedonhallinta
has top concept: arkisto (asiakirjat)
has top concept: käyttölupa
has top concept: tietoteollisuus
has top concept: käsite
has top concept: tietojärjestelmä
has top concept: tietoturvallisuus
has top concept: luokitus
has top concept: ohjaustermi